##TITLE=31P_DE-80H_X3
 64 sc D2O
 26.2.2025
##JCAMPDX= 6.0         $$ Bruker NMR JCAMP-DX V2.0
##DATA TYPE= NMR FID
##DATA CLASS= NTUPLES
##ORIGIN= UXNMR, Bruker Analytische Messtechnik GmbH
##OWNER= root
$$ XWIN-NMR		Version 3.5
$$ Fri Jan 16 10:33:23 2026 Russian Standard Time (UT+4h)  Yarkov@DPX200
##.OBSERVE FREQUENCY= 81.013821
##.OBSERVE NUCLEUS= ^31P
##.DELAY= (6, 6)
##.ACQUISITION MODE= SIMULTANEOUS
##.ACQUISITION SCHEME= undefined
##.AVERAGES= 64
##.DIGITISER RES= 17
##SPECTROMETER/DATA SYSTEM= spect
##.PULSE SEQUENCE= zgpg30
##.SOLVENT NAME= D2O
##.SHIFT REFERENCE= (INTERNAL, D2O, 0, 243.863)
##AUDIT TRAIL= $$ (NUMBER, WHEN, WHO, WHERE, WHAT)
$$ ##TITLE= Audit trail, XWIN-NMR		Version 3.5
$$ ##JCAMPDX= 5.01
$$ ##ORIGIN= Bruker BioSpin GmbH
$$ ##OWNER= Yarkov
$$ C:/Bruker/XWIN-NMR/data/yarkov2/nmr/P31/2/audita.txt
$$ ##AUDIT TRAIL=  $$ (NUMBER, WHEN, WHO, WHERE, WHAT)
(   1,<2026-01-16 10:32:47.42 +0400>,<Yarkov>,<DPX200>,
      <created by zg, POWCHK disabled, PULCHK disabled
       configuration hash MD5:
       00 E9 B6 7A A2 85 ED C7 34 08 36 98 17 FE 4E 26
       data hash MD5: 32K
       9A 99 4A A8 E4 74 C8 38 F8 FE F8 D4 E2 6A BC B2>)
$$ ##END=
$$ 
$$ hash MD5
$$ 77 82 63 03 A8 D9 35 2D 03 78 F6 31 00 05 F3 7B
##$RELAX= 
##$RELAX= 
##$RELAX= 
##$RELAX= 
##$RELAX= 
##$RELAX= 
##$RELAX= 
##$RELAX= 
$$ Bruker specific parameters
$$ --------------------------
##$DU= <C:/Bruker/XWIN-NMR>
##$EXPNO= 2
##$NAME= <P31>
##$PROCNO= 1
##$TYPE= <nmr>
##$USER= <yarkov2>
##$AMP= (0..31)
100 100 100 100 100 100 100 100 100 100 100 100 100 100 100 100 100 100 
100 100 100 100 100 100 100 100 100 100 100 100 100 100 
##$AQSEQ= 0
##$AQ_mod= 1
##$AUNM= <au_zg>
##$AUTOPOS= <>
##$BF1= 81.014009
##$BF2= 200.13
##$BF3= 200.13
##$BF4= 200.13
##$BF5= 200.13
##$BF6= 200.13
##$BF7= 200.13
##$BF8= 200.13
##$BYTORDA= 1
##$CFDGTYP= 0
##$CFRGTYP= 5
##$CHEMSTR= <none>
##$CNST= (0..31)
1 1 145 1 1 1 1 1 1 1 1 1 1 1 1 1 1 1 1 1 1 1 1 1 1 1 1 1 1 1 1 1 
##$CPDPRG= <waltz16>
##$CPDPRG1= <>
##$CPDPRG2= <waltz16>
##$CPDPRG3= <>
##$CPDPRG4= <mlev>
##$CPDPRG5= <mlev>
##$CPDPRG6= <mlev>
##$CPDPRG7= <mlev>
##$CPDPRG8= <mlev>
##$CPDPRGB= <>
##$CPDPRGT= <>
##$D= (0..31)
0 1 0 0 0 0 0 0 0 0.06 0 0.03 2e-05 3e-06 0 0 0.0002 0 0 0 0 0 0 0 0 0 
0 0 0 0 0 0 
##$DATE= 1768545166
##$DBL= (0..7)
120 120 120 11 120 120 24 19 
##$DBP= (0..7)
150 150 150 150 150 150 150 150 
##$DBP07= 0
##$DBPNAM0= <>
##$DBPNAM1= <>
##$DBPNAM2= <>
##$DBPNAM3= <>
##$DBPNAM4= <>
##$DBPNAM5= <>
##$DBPNAM6= <>
##$DBPNAM7= <>
##$DBPOAL= (0..7)
0.5 0.5 0.5 0.5 0.5 0.5 0.5 0.5 
##$DBPOFFS= (0..7)
0 0 0 0 0 0 0 0 
##$DE= 6
##$DECBNUC= <off>
##$DECIM= 4
##$DECNUC= <off>
##$DECSTAT= 4
##$DIGMOD= 1
##$DIGTYP= 9
##$DL= (0..7)
0 0 52 120 120 21 21 25 
##$DP= (0..7)
150 150 150 150 150 150 150 150 
##$DP07= 0
##$DPNAME0= <>
##$DPNAME1= <>
##$DPNAME2= <>
##$DPNAME3= <>
##$DPNAME4= <>
##$DPNAME5= <>
##$DPNAME6= <>
##$DPNAME7= <>
##$DPOAL= (0..7)
0.5 0.5 0.5 0.5 0.5 0.5 0.5 0.5 
##$DPOFFS= (0..7)
0 0 0 0 0 0 0 0 
$$ [...]
##$SUBNAM1= <"">
##$SUBNAM2= <"">
##$SUBNAM3= <"">
##$SUBNAM4= <"">
##$SUBNAM5= <"">
##$SUBNAM6= <"">
##$SUBNAM7= <"">
##$SUBNAM8= <"">
##$SUBNAM9= <"">
##$SW= 400.765351723535
##$SWIBOX= (0..15)
0 1 3 0 0 0 0 0 0 0 0 0 0 0 0 0 
##$SW_h= 32467.5324675325
##$TD= 32768
##$TD0= 1
##$TE= 0
##$TE2= 300
##$TE3= 300
##$TEG= 300
##$TL= (0..7)
0 120 53 12 22 120 120 120 
##$TP= (0..7)
150 150 150 150 150 150 150 150 
##$TP07= 0
##$TPNAME0= <>
##$TPNAME1= <>
##$TPNAME2= <>
##$TPNAME3= <>
##$TPNAME4= <>
##$TPNAME5= <>
##$TPNAME6= <>
##$TPNAME7= <>
##$TPOAL= (0..7)
0.5 0.5 0.5 0.5 0.5 0.5 0.5 0.5 
##$TPOFFS= (0..7)
0 0 0 0 0 0 0 0 
##$TUNHIN= 0
##$TUNHOUT= 0
##$TUNXOUT= 0
##$USERA1= <user>
##$USERA2= <user>
##$USERA3= <user>
##$USERA4= <user>
##$USERA5= <user>
##$V9= 5
##$VALIST= <valist>
##$VCLIST= <CCCCCCCCCCCCCCC>
##$VD= 0
##$VDLIST= <DDDDDDDDDDDDDDD>
##$VPLIST= <PPPPPPPPPPPPPPP>
##$VTLIST= <TTTTTTTTTTTTTTT>
##$WBST= 1024
##$WBSW= 4
##$XGAIN= (0..3)
0 0 0 0 
##$XL= 0
##$YL= 0
##$YMAX_a= 1553
##$YMIN_a= -804
##$ZGOPTNS= <>
##$ZL1= 120
##$ZL2= 120
##$ZL3= 120
##$ZL4= 120
##$ABSF1= 60
##$ABSF2= -190
##$ABSG= 5
##$ABSL= 3
##$ALPHA= 0
##$AQORDER= 0
##$ASSFAC= 0
##$ASSFACI= 0
##$ASSFACX= 0
##$ASSWID= 0
##$AUNMP= <proc_1d>
##$AZFE= 0.1
##$AZFW= 0.5
##$BCFW= 1
##$BC_mod= 2
##$BYTORDP= 1
##$COROFFS= 0
##$CY= 9.86611175537109
##$DATMOD= 1
##$DC= 1
##$DFILT= <>
##$DTYPP= 0
##$F1P= 182.462994727601
##$F2P= 168.069089081705
##$FCOR= 0.5
##$FTSIZE= 0
##$FT_mod= 0
##$GAMMA= 1
##$GB= 0
##$INTBC= 1
##$INTSCL= 1
##$ISEN= 30
##$LB= 1.5
##$LEV0= 0
##$LPBIN= 0
##$MAXI= 11.51145
##$MC2= 0
##$MEAN= 0
##$ME_mod= 0
##$MI= 1.244541
##$NCOEF= 0
##$NC_proc= 0
##$NLEV= 6
##$NOISF1= 0
##$NOISF2= 0
##$NSP= 1
##$NTH_PI= 0
##$NZP= 1
##$OFFSET= 243.8632
##$PC= 1.4
##$PHC0= 1691.973
##$PHC1= 24.15952
##$PH_mod= 0
##$PKNL= yes
##$PPARMOD= 0
##$PSCAL= 0
##$PSIGN= 0
##$REVERSE= no
##$SF= 81.0140731611343
##$SI= 65536
##$SIGF1= 0
##$SIGF2= 0
##$SINO= 80
##$SIOLD= 65536
##$SREGLST= <31P.CDCl3>
##$SSB= 0
##$STSI= 0
##$STSR= 0
##$SW_p= 25641.0256410257
##$SYMM= 0
##$S_DEV= 0
##$TDeff= 0
##$TDoff= 0
##$TI= <>
##$TILT= no
##$TM1= 0
##$TM2= 0
##$TOPLEV= 0
##$USERP1= <user>
##$USERP2= <user>
##$USERP3= <user>
##$USERP4= <user>
##$USERP5= <user>
##$WDW= 1
##$XDIM= 64
##$YMAX_p= 0
##$YMIN_p= 0
$$ End of Bruker specific parameters
$$ ---------------------------------
##NTUPLES= NMR FID
##VAR_NAME=  TIME,          FID/REAL,        FID/IMAG
##SYMBOL=    X,             R,               I
##VAR_TYPE=  INDEPENDENT,   DEPENDENT,       DEPENDENT
##VAR_FORM=  AFFN,          ASDF,            ASDF
##VAR_DIM=   16384,         16384,           16384
##UNITS=     SECONDS,       ARBITRARY UNITS, ARBITRARY UNITS
##FACTOR=    3.08e-05,      1,               1
##FIRST=     0,             0,               0
##LAST=      0.5045964,     0,               0
##MIN=       0,             -804,            0
##MAX=       0.5045964,     1553,            0
$$ Real data points
##PAGE= N=1
##DATA TABLE= (X++(R..R)), XYDATA
$$ plain form
0 0 0 0 0 0 0 0 0 0 0 0 0 0 0 0 0 0 0 0 0 0 0 0 0 0 0 0 0 0 0 0 0 0 0 0 0 0 0 0 0 0 0 0 0 0 0 0 0 0 0 0 0 0 0 -1 3 -6 7 -7 10 -15
60 -15 16 -18 24 -34 47 -98 1553 868 483 378 80 -143 -389 -586 -755 -797 -804 -775 -646 -440 -254 -72 186 416
84 416 535 680 718 718 709 532 352 182 -26 -212 -390 -590 -653 -738 -730 -634 -523 -375 -138 0 206 422 538 672
108 672 650 649 609 498 327 200 -13 -173 -394 -558 -565 -627 -619 -602 -486 -369 -183 27 144 348 419 594 538 582 505
133 505 415 243 108 -27 -219 -343 -468 -560 -573 -537 -437 -357 -227 -90 24 193 287 470 509 536 508 474 393 225
157 225 92 -40 -202 -337 -429 -514 -482 -483 -444 -353 -194 -69 63 176 287 365 442 439 427 365 325 171 39 -132 -243
182 -243 -319 -418 -444 -455 -397 -342 -245 -174 -18 73 189 291 313 412 352 340 286 233 110 47 -102 -203 -300 -375 -386 -365 -379
209 -379 -304 -237 -135 -47 90 168 229 367 349 335 318 265 197 101 -13 -98 -163 -251 -305 -330 -318 -320 -236 -191 -119 34 111 186
$$ packed form
0@%%%%%%%%%%%%%%%%%%%%%%%%%%%%%%%%%%%%%%%%%%%%%%%%%%%%%jMrJ3j4J7k5
60a5L1l4M2n8Q1j45J651o85l85j05k98k23k46j97j69m2pK9J29K06J86J82K58K30
84D16J19J45L8%rj77j80j70k08j86j78k00o3q5QR6J11J48K37J38K06K16J16J34
108F72k2jm0j11j71j27k13j60k21j64po2QJ7J16J17J86K10J17K04P1J75n6M4p7
133E05r0j72j35j35j92j24j25r2j3L6J00Q0J30J37J14J69R4J83L9K7k8l4q1j68
157B25j33j32j62j35r2q5L2jL9R1J59J25J32J13J11P8P7lj2o2m0j54j32j71j11
182b43p6r9k6j1N8N5R7P1J56R1J16J02K2R9o0j2n4n3j23o3j49j01r7p5j1K1j4
209c79P5O7J02Q8J37P8O1J38j8j4j7n3o8r6j14q5o5q8n4k5J2kQ4M5P2J53P7P5
$$ plain form
237 186 228 329 292 348 227 241 141 75 -60 -78 -214 -241 -257 -245 -291 -237 -251 -97 -12 56 130 196 260 288 329 271 262 211
265 211 135 65 -11 -94 -165 -199 -239 -269 -203 -269 -153 -136 -24 0 109 201 201 196 237 183 176 171 53 45 -55 -98 -172 -199 -215 -232
295 -232 -182 -146 -123 -31 -4 77 134 214 212 205 251 191 200 141 48 44 -96 -107 -127 -156 -205 -154 -153 -162 -101 -35 31 38 127 173 118 196 214
328 214 152 112 148 74 2 -48 -112 -142 -175 -139 -144 -125 -123 -72 -16 86 92 139 162 156 194 201 189 163 114 37 3 -38 -81 -111 -130 -169
360 -169 -118 -116 -101 -25 -34 31 47 76 99 117 140 136 143 94 26 -2 -11 -26 -110 -101 -103 -152 -143 -101 -83 -77 42 10 66 89 115 146 141 96 126
395 126 67 41 -45 -12 -41 -99 -77 -109 -132 -83 -108 -33 -44 -5 36 45 85 106 166 90 100 35 81 26 6 -61 -11 -116 -113 -121 -83
426 -83 -61 -37 -47 -46 30 65 94 90 77 85 90 121 98 56 15 4 -32 -61 -51 -74 -98 -31 -40 -70 -73 -23 -20 -4 77 67 86 48 79 85 32
461 32 34 32 -24 -64 -75 -98 -61 -100 -52 -45 -73 12 -4 66 30 67 77 97 73 80 20 65 34 -17 -43 6 -46 -40 -71 -87 -63 -51 -22
$$ packed form
237A86M2J01l7N6j21J4j00o6j35j8j36k7j6J2m6N4j4J54Q5O8P4O6O4K8M1n8rn1
265B11p6p0p6q3p1l4m0l0O6o6J16J7J12K4J09R2%nM1n4pnj18qj00m3p4k7j6j7
295b32N0L6K3R2K7Q1N7Q0kpM6o0Rn9r3mj40j1k0k9m9N1JrO1O6O6PQ9M6n5P8J8
328B14o2m0L6p4p2n0o4l0l3L6nJ9KN1N6J02OM7K3oL8Pj2k6m9p7l4m1m3l0j9l9
360a69N1KJ5P6rO5J6K9K3J8K3mPm9o8k8rj5q4Rkm9RM2J8OJ19l2N6K3K6L1nm5L0
395A26n9k6q6L3k9n8K2l2k3M9k5P5j1L9M1RM0K1O0p6J0o5M6n5k0o7N0j05LqL8
426h3K2K4j0JP6L5K9mj3QNL1k3m2m1j1l6k9J0k3k4O7rl0lN0LJ6Q1j0J9l8L1On3
461C2Kkn6m0j1k3L7l9M8Pk8Q5j6P0l6L7J0K0k4Po0M5l1n1k6M9n2Ol1j6K4J2K9
$$ plain form
494 -22 -38 49 1 -21 44 44 50 60 74 61 21 -10 42 -22 -47 -46 -13 -57 -82 -44 -31 -39 -21 -27 -40 0 -12 43 41 50 40 -9 36 29 -2
529 -2 -32 -76 -33 -4 2 -40 -48 -48 -26 -23 -46 -7 -14 -17 71 7 26 35 42 59 6 -35 -23 -13 -56 -31 -23 -16 -64 -99 -20 -29 7 -6 11 48 -1
566 -1 69 -23 5 13 -23 0 -63 -34 -35 -33 -19 -9 -11 -28 1 28 -19 20 32 35 47 35 -28 16 29 -4 -2 -32 -18 -26 20 -5 16 1 1
601 1 7 30 28 -9 -20 32 -9 21 12 20 25 -2 -14 38 -17 -19 16 28 -7 23 -26 3 -2 -42 9 53 42 45 48 26 -10 -10 0 17 17 -18 -15
638 -15 18 29 -39 25 -27 -13 9 -38 18 55 46 -11 -4 2 20 -5 21 -12 -7 -2 -4 -9 -1 -11 43 -11 50 33 17 15 32 46 28 -13 55
673 55 1 30 14 15 22 -13 -34 -2 43 25 43 -13 22 14 -22 -2 18 -12 28 40 56 9 58 18 6 48 2 -19 -31 -7 39 -33
705 -33 23 -15 13 24 50 38 7 25 30 33 30 -1 -10 22 26 12 18 32 -24 4 -1 22 -13 16 39 -6 30 -43 20 -35 29 -4 9 15 -22
740 -22 8 8 -22 9 -17 7 9 25 23 52 40 35 -22 -10 8 58 7 31 30 3 13 8 -29 -21 -30 -6 -9 6 18 -29 -53 -6 6 34 31 -28
$$ packed form
494b2j6Q7m8k2O5%OJ0J4j3m0l1N2o4k5JL3m4k5L8J3qJ8oj3M0j2N5kRj0m9M5pl1
529bl0m4M3K9Om2q%K2Lk3L9plQ8o4J9RPJ7n3m1J2J0m3K5QPm8l5P9rL6j3J7L7m9
566aP0r2K8Ql6K3o3K9jKJ4J0kj7K9K7m7L9J2LJ2j2o3M4J3l3Kl0J4qM6k5K1j5%
601AOK3kl7j1N2m1L0rQNk7j2N2n5kL5J2l5L0m9K9nm0N1M4j1LLk2l6%J0J7%l5L
638a5L3J1o8O4n2J4K2m7N6L7rn7POJ8k5K6l3NNknQj0N4n4O1j7j6kJ7J4j8m1O8
673E5n4K9j6JPl5k1L2M5j8J8n6L5ql6K0K0l0M0J2J6m7M9m0j2M2m6k1j2K4M6p2
705c3N6l8K8J1K6j2l1J8NLll1rL2Mj4OJ4n6K8nK3l5K9K3m5L6p3O3n5O4l3J3Ol7
740b2L0%l0L1k6K4KJ6kK9j2nn7J2J8N0n1K4jk7J0nl7QrK4lJ5J2m7k4M7J2K8ln9
$$ plain form
776 -28 51 6 -12 -7 17 -16 23 10 -31 1 -10 9 -19 0 -19 5 -1 33 42 10 48 47 29 18 -30 44 -13 8 -18 -45 -33 -19 -10
809 -10 -48 -5 -14 -12 41 -51 25 0 -1 28 5 -12 4 -15 -16 14 17 -33 -23 -50 -31 -51 -37 24 -17 5 -10 24 -9 -18 35 -33 48 -46
843 -46 2 -27 15 -3 -6 -13 7 -36 -42 -15 -13 1 -18 -2 4 -11 -72 28 47 59 31 41 -28 15 -3 -26 28 -12 4 16 -28 -15 -33
876 -33 0 -14 15 14 9 9 20 11 52 13 -6 -38 -17 0 -11 16 -28 12 -33 -13 5 -26 -36 -36 -18 -54 50 -38 9 24 -16 26 5
909 5 -14 7 11 4 -39 -31 -32 -25 -29 4 -38 -1 37 -54 26 5 18 -2 -40 27 16 -7 -44 -34 0 0 -6 -43 -26 -44 -20 -22 -11 35 -18 -4
945 -4 8 -7 -23 14 -17 -7 6 -40 11 -30 -25 10 -5 -28 -5 14 14 -37 33 -8 -41 -60 -9 -21 16 -9 5 11 25 -15 32 -7 29
978 29 0 2 15 -49 -16 -37 -29 7 -9 6 6 11 4 7 -9 3 -10 10 2 -14 6 -4 22 16 -22 3 -15 16 27 -15 48 -9 45 12 5
1013 5 0 7 20 13 50 -5 9 38 10 22 -16 -2 26 -40 69 -8 -15 -18 28 10 25 8 14 32 -28 -11 31 52 12 25 -3 -45 7
$$ packed form
776b8P9m5j8NK4l3L9j3m1L2j1J9k8J9j9K4oL4Rl2L8jj8j1m8P4n7K1k6k7J2J4R
809a0l8M3rKN3r2P6k5jK9k3j7J6j9jL0Ln0J0k7J9k0J4O1m1K2j5L4l3rN3o8Q1r4
843d6M8k9M2j8lpK0m3oK7KJ4j9J6Oj5o1J00J9J2k8J0o9M3j8k3N4m0J6J2m4J3j8
876c3L3j4K9jn%J1rM1l9j9l2K1J7j1K7m4M0m5K0J8l1j0%J8l6J04q8M7J5m0M2k1
909Ej9K1Mpm3QjPmL3m2L7L8r1Q0k1J3k0l8O7j1k3l7J0L4%ol7J7j8K4kJ1M6n3J4
945dJ2j5j6L7l1J0J3m6N1m1NL5j5k3K3J9%n1P0m1l3j9N1j2L7k5J4OJ4m0M7l9L6
978B9k9KJ3o4L3k1QL6j6J5%NpLj6J2j3K0qj6K0j0K6ol8K5j8L1J1m2O3n7N4l3p
1013EnPJ3pL7n5J4K9k8J2l8J4K8o6J09p7plM6j8J5j7OJ8o0J7M2K1m0J3k8m2N2
$$ plain form
1046 7 -22 3 1 -26 -13 30 -25 26 -26 35 10 21 -21 41 5 39 16 -16 55 32 -2 -3 21 21 41 19 -20 -12 7 26 7 -11 7
1079 7 22 22 31 -9 -16 -5 28 -4 22 17 1 -8 -16 7 -24 5 49 -12 18 -25 6 19 18 49 -7 34 5 -19 19 -17 67 -45 -13 18
1113 18 -20 -36 5 53 -24 13 -1 -22 40 0 23 22 30 40 22 16 -37 49 12 10 23 -4 30 11 58 29 27 10 27 -15 -22 28 56
1146 56 3 -31 25 19 -18 -8 41 17 15 -24 27 -21 -1 13 1 69 -13 37 -54 57 -37 -2 -33 19 27 -1 -19 25 19 -16 15 -24
1178 -24 -37 29 18 -13 -21 28 -11 15 1 17 39 43 -27 31 -8 -10 23 5 -9 25 -14 -8 -2 -12 -33 -11 2 -1 3 -9 36 -2 2 18
1212 18 15 -33 18 18 17 -19 13 37 -21 -12 -20 -31 12 -2 -50 15 29 16 -6 4 -20 3 -2 28 -12 -1 27 52 -16 14 23 12 24 25
1246 25 -34 20 -15 -19 -24 -49 24 31 22 -10 28 -27 7 11 7 4 1 -40 24 -15 -43 14 -23 21 -63 3 47 3 -19 14 48 15 22 -9 29
1281 29 33 -9 33 7 0 -37 0 -32 -31 0 -29 13 -10 25 -5 41 -6 10 16 -9 1 2 2 -16 13 32 -38 -25 -24 15 15 -5 39 -18
$$ packed form
1046Gk9K5kk7J3M3n5N1n2O1k5J1m2O2l6L4k3l2P1k3l4jK4%K0k2l9QJ9J9j9j8J8
1079GJ5%Rm0pJ1L3l2K6nj6rqK3l1K9M4o1L0m3L1J3jL1n6M1k9k4L8l6Q4j12L2L1
1113A8l8j6M1M8p7L7j4k1O2m0K3jQJ0j8on3Q6l7kJ3k7L4j9M7k9kj7J7m2pN0K8
1146E6n3l4N6ol7J0M9k4kl9N1m8K0J4j2O8q2N0r1J11r4L5l1N2Qk8j8M4ol5L1l9
1178b4j3O6j1l1qM9l9K6j4J6K2Mp0N8l9kL3j8j4L4l9OOj0k1K2J3lMj2M5l8MJ6
1212A8lm8N1%jl6L2K4n8Rqj1M3j4m8O5J4j3k2J0k4K3nL0m0J1K8K5o8L0Rj1J2J
1246B5n9N4l5mnk5P3Prl2L8n5L4Mmllm1O4l9k8N7l7M4q4O6M4m4k2L3L4l3Pl1L8
1281B9Mm2M2k6pl7L7l2JL1k9M2k3L5l0M6m7J6Ok5J0J%j8K9J9p0J3JL9%k0M4n7
$$ plain form
1315 -18 54 -19 0 22 9 -13 -2 16 21 20 -4 -3 -7 -14 -4 -1 20 28 -20 -5 39 29 32 -1 -21 10 22 24 13 55 -17 42 -3 54 -15
1350 -15 -23 31 42 -6 -44 15 11 3 -4 -14 -2 -16 18 8 -2 42 -36 -15 -26 -6 22 59 -15 3 23 18 42 -21 -16 6 7 33 0 28
1384 28 24 10 41 -11 0 38 14 -14 23 57 -27 19 -40 34 -5 23 24 14 23 -56 -19 -7 0 15 18 36 -14 -12 8 -31 10 -41 10
1417 10 21 -20 -43 -18 -6 58 13 4 10 52 9 -10 17 -48 24 1 -4 -44 -6 28 -28 20 -20 36 -14 -1 15 53 -15 30 11 13
1449 13 41 27 22 27 20 -5 -28 32 21 -10 7 1 -5 -19 -5 4 -4 46 -18 0 52 41 -37 15 39 -2 14 -12 13 70 -28 25 13 11
1483 11 -5 16 44 -26 47 0 25 -14 -15 37 -11 -27 34 -18 -17 -37 2 7 22 -7 -8 2 73 16 17 17 26 28 -12 -39 52 -19 -3 2 7
1518 7 2 7 24 34 -29 9 0 -18 15 -3 -13 13 -6 -45 -8 -2 7 6 -12 33 25 -3 2 5 -1 6 27 -1 13 10 -10 15 -8 -25 10 10 -15
1555 -15 -8 13 8 2 -16 0 -10 9 11 37 -5 4 15 -15 27 23 -17 -22 -6 4 15 0 -36 -43 20 -57 51 19 21 -9 2 32 -37 10
$$ packed form
1315a8P2p3J9K2j3k2J1J8Njk4JmpJ0LK1Qm8J5M4j0Ll3k0L1J2Kj1M2p2N9m5N7o9
1350a5qN4J1m8l8N9mqpj0J2j4L4j0j0M4p8K1j1K0K8L7p4J8K0nK4o3NK2JK6l3K8
1384B8mj4L1n2J1L8k4k8L7L4q4M6n9P4l9K8Jj0Rp9L7J2PJ5LJ8n0KK0l9M1n1N1
1417A0J1m1k3K5J2O4m5rOM2m3j9K7o5P2k3nm0L8L4n6M8m0N6n0J3J6L8o8M5j9K
1449A3K8j4nNpk5k3O0j1l1J7ooj4J4RqN0o4J8N2j1p8N2K4m1J6k6K5N7r8N3j2k
1483A1j6K1K8p0P3m7K5l9jN2m8j6O1n2Jk0L9NJ5k9jJ0P1n7J%RKm0k7R1p1J6NN
1518GnNJ7J0o3L8rj8L3j8j0K6j9l9L7ORjj8M5qk8NLoPK1k8J4lk0K5k3j7L5%k5
1555a5PK1noj8J6j0J9KK6m2RJ1l0M2mm0nJ6J0J1j5l6pO3p7J08l2Kl0J1L0o9M7
$$ plain form
1589 10 -13 -28 8 -22 -22 28 -9 1 -5 -14 -1 26 6 -38 7 -19 56 -25 14 -3 3 24 38 14 -6 21 -2 11 -31 16 54 -9
1621 -9 27 -19 19 -44 -56 -33 -24 2 -15 6 -6 -6 -34 14 -25 -28 -39 8 17 -41 6 2 4 5 -15 -24 35 1 -20 -32 20 -26 -5 58 1
1656 1 0 -24 3 -26 -22 -9 -6 41 -2 24 -34 10 7 4 -17 -44 18 -9 -3 -31 11 3 -3 19 15 -14 -64 -58 -30 -28 -39 7 10 14 12 -8 -32 -53
1694 -53 22 -19 39 -9 10 -33 10 4 -24 27 -24 -28 -6 -38 3 -27 12 5 -27 20 -4 56 -47 5 -8 28 26 -19 -8 -40 -26 -30
1726 -30 13 -20 -22 -6 2 11 34 -36 -37 -13 10 -13 -17 2 13 15 0 -30 -7 84 33 55 21 10 29 -29 18 -33 6 -16 -39 16 -6
1759 -6 34 -20 -35 24 58 -11 3 -4 -61 23 10 23 43 37 21 16 6 -22 21 0 5 48 9 -14 5 38 -40 22 17 0 -3 -1 16 -8
1793 -8 -32 -4 46 -21 12 23 -10 19 28 26 -22 -21 -34 6 36 -18 40 -11 -11 -50 26 4 -3 26 6 38 -16 -17 10 11 49 27 28 -15 27
1828 27 -8 -32 34 -12 18 5 51 -27 -1 38 -35 -12 3 10 6 -20 43 -21 18 -9 -10 16 8 19 46 9 39 40 -12 19 18 12 1 -4
$$ packed form
1589A0k3j5L6l0%N0l7J0orJ3K7k0m4M5k6P5q1L9j7OK1J4k4k0K7k3J3m2M7L8o3
1621iL6m6L8o3j2K3RK6j7K1j2%k8M8l9lj1M7Rn8M7mKJk0rN9l4k1j2N2m6K1O3n7
1656Ajk4K7k9MJ3LM7m3K6n8M4llk1k7O2k7Ok8M2qoK2mk9n0OK8Kj1M6LMkk0k4k1
1694e3P5m1N8m8J9m3M3ok8N1n1mK2l2M1l0L9pl2M7k4O0j03N2j3L6km5J1l2J4m
1726c0M3l3kJ6QRK3p0jK4K3k3mJ9J1Kj5l0K3R1n1K2l4j1J9n8M7n1L9k2k3N5k2
1759fM0n4j5N9L4o9J4pn7Q4j3J3K0oj6nj0k8M3k1NM3l9k3J9L3p8O2nj7lKJ7k4
1793hk4K8N0o7L3J1l3K9Rkm8Jj3M0L0n4N8n1%l9P6k2pK9k0L2n4jK7JL8k2Jm3M2
1828B7l5k4O6m6L0j3M6p8K6L9p3K3J5Pmk6O3o4L9k7jK6qJ1K7l7L0Jn2L1joj1n
$$ plain form
1862 -4 9 21 -10 -11 2 14 -15 -9 36 5 24 19 16 -2 -5 14 0 -38 -48 -13 5 16 39 -13 -2 58 42 57 40 -6 -13 -16 38 -17
1896 -17 -2 39 58 11 23 6 -22 23 -5 16 -14 31 7 -11 -2 4 49 -5 14 -14 26 11 -37 15 -15 -16 21 40 14 -7 41 15
1928 15 18 23 36 0 9 -8 3 24 -12 -7 37 -41 -12 -52 -10 10 18 -19 -26 5 -17 6 2 11 20 17 -3 23 -24 18 27 -29 -3 -11 -25 -16 29
1965 29 -12 -48 -2 -19 32 2 35 3 14 27 -22 14 -22 7 -12 1 11 4 -36 -17 -29 -33 -31 11 7 -9 13 16 12 -26 1 7 -23 -11
1999 -11 31 -17 4 23 -35 -3 -45 -4 -19 15 -1 6 19 -17 9 -9 24 4 11 3 -26 2 47 -39 -6 -38 2 16 -16 20 -20 13
2031 13 -1 10 26 -39 -11 -37 8 -20 34 12 54 34 34 45 25 6 -33 -8 -34 10 -7 0 12 26 18 -12 12 4 -15 -2 -55 -32
2063 -32 38 -59 31 -30 -33 6 -3 30 -9 19 -2 -50 -16 -20 7 -61 17 -2 -33 1 -37 -51 -24 16 -30 -6 -15 24 -4 -6 26 26 38
2096 38 -23 -1 -6 9 40 -73 -13 -43 18 -36 -19 -2 -28 49 -10 -2 -4 -16 14 -33 -15 -49 2 -7 44 -6 64 30 5 -5 5 7
$$ packed form
1862dJ3J2l1jJ3J2k9OM5l1J9nlj8lJ9j4l8j0L5J8J1K3n2J1O0j6J5j7m6plN4n5
1896a7J5M1J9m7J2j7k8M5k8K1l0M5k4j8ROM5n4J9k8M0j5m8N2l0jL7J9k6k1M8k6
1928A5LNJ3l6Rj7J1K1l6NM4p8K9m0M2K0Ql7pL1k2K3mRRlk0K6m7M2Rn6K6qj4RM5
1965B9m1l6M6j7N1l0L3l2J1J3m9L6l6K9j9J3J0pm0J9j2mKM2mj6K2Lml8K7Ol0J2
1999a1M2m8K1J9n8L2m2M1j5L4j6PJ3l6K6j8L3k0Pqk9K8M5q6L3l2M0J4l2L6m0L3
2031A3j4J1J6o5K8k6M5k8N4k2M2k0%J1k0j9l9K5k6M4j7PJ2J4ql0K4qj9J3n3K3
2063c2P0r7R0o1lL9rL3l9K8k1m8L4mK7o8P8j9l1L4l8j4K7M0m6K4rL9k8kL2%J2
2096C8o1K2nJ5L1j13O0l0O1n4J7J7k6P7n9Qkj2L0m7J8l4N1rN1n0P0l4k5j0J0K
$$ plain form
2128 7 -15 34 -8 -9 -11 -19 9 21 -30 31 9 6 5 -25 12 -38 22 -37 22 14 -3 -23 8 15 -6 32 -12 -20 19 8 3 13 -17 11 0
2163 0 -5 -22 7 -9 -36 9 -10 15 -1 -26 46 -34 -15 4 17 2 35 31 -10 17 11 -6 11 8 3 3 32 7 -32 11 -4 41 29 -10
2197 -10 -9 -2 9 -26 -17 16 30 -39 34 7 10 27 -21 60 0 18 16 13 -48 -1 28 -33 10 12 -17 26 32 -32 19 -10 24 -31 58 49 1
2232 1 15 35 35 -1 -10 11 27 -31 -30 11 -8 26 28 16 5 -14 47 9 -6 25 -27 -1 -23 30 -21 2 47 -15 6 29 -33 -16 -18
2265 -18 6 -11 -1 13 28 13 -6 26 1 25 -23 51 23 31 18 -13 -32 -23 -10 -1 14 42 8 19 21 -2 -20 -1 -1 3 61 -23 -33
2298 -33 -3 -4 -17 -6 -4 -19 34 20 -5 7 -34 13 -40 26 -31 -2 29 -32 -13 34 20 -17 -48 16 -29 -15 -18 25 -19 2 26 -32
2330 -32 17 24 34 36 14 16 30 -23 -14 15 22 -26 16 -9 -17 23 -19 -25 14 -36 5 -1 18 -21 30 19 23 -41 -2 -9 -35 51 -4 17 29
2365 29 47 -27 9 -34 30 -17 -15 6 -11 26 -14 -40 -9 10 -42 -14 -1 60 3 44 -43 -24 7 2 -48 -8 15 12 -36 -31 -9 -13 1
$$ packed form
2128Gk2M9m2jkqK8J2n1O1k2ljl0L7n0O0n9N9qj7k0L1Pk1L8m4qL9j1nJ0l0K8j1
2163@nj7K9j6k7M5j9K5j6k5P2q0J9J9J3j5L3mm1K7oj7J7ln%K9k5l9M3j5M5j2l9
2197a0JPJ1l5RL3J4o9P3k7LJ7m8Q1o0J8klo1M7K9o1M3Kk9M3Oo4N1k9L4n5Q9rm8
2232AJ4K0%l6rK1J6n8JM1j9L4Kj2j1j9O1l8j5L1n2K6k2N3n1K3M5o2K1K3o2J7k
2265a8K4j7J0J4J5j5j9L2k5K4m8P4k8Qj3l1j9RJ3RJ5K8l4J1Kk3j8J9%MN8q4j0
2298c3L0jj3J1Kj5N3j4k5J2m1M7n3O6n7K9L1o1J9M7j4l7l1O4m5J4lM3m4K1K4n8
2330c2M9PJ0Kk2KJ4n3RK9Pm8M2k5qM0m2oL9n0M1oJ9l9N1j1Mo4L9pk6Q6n5K1J2
2365B9J8p4L6m3O4m7KK1j7L7m0k6L1J9n2K8J3O1n7M1q7J9L1nn0M0K3lm8NK2mJ4
$$ plain form
2398 1 -25 -12 -37 -11 14 25 13 -38 -16 -42 4 -37 -43 5 1 -58 -37 9 -23 -35 -3 -31 -4 -27 10 -9 -30 26 -24 13 -17 -24
2430 -24 -34 3 -30 -37 -9 1 30 -3 -11 -21 12 -21 -9 35 -8 12 12 -24 43 0 27 -47 -24 18 -28 27 -46 8 -21 -7 5 -38
2462 -38 -2 -15 13 -16 -39 20 -31 32 7 9 27 35 17 9 1 26 -21 -13 13 23 16 23 10 0 0 -12 53 -48 -23 -10 -48 43 34 6
2496 6 -41 19 3 -31 23 10 -8 -25 42 -2 -27 17 -24 28 -44 -14 -35 -27 26 -23 -7 -24 -14 24 -29 -24 -25 27 5 29 5 -44
2528 -44 9 15 8 -21 6 -16 38 9 -18 -6 -24 7 -17 26 21 -29 2 -18 73 -1 -30 -21 31 26 -16 5 -33 35 35 21 -44 -20 24
2561 24 18 -44 45 8 35 -23 22 24 22 12 23 -13 -20 -18 24 45 12 19 14 20 -36 -38 -16 -8 3 42 14 11 10 55 10 43 -3 36 -26 39
2597 39 8 6 6 0 30 -4 92 12 22 20 -18 20 22 17 -3 18 14 -6 11 8 80 10 15 30 -15 33 24 45 -12 25 -11 18 12 -3 15 13
2633 13 21 -1 17 -8 -11 13 -8 3 26 23 30 32 27 -38 25 -50 7 28 3 32 -14 8 3 19 7 -21 -6 -14 -16 -15 -17 23 36 0 -1 1 -4
$$ packed form
2398Ak6J3k5K6K5J1j2n1K2k6M6m1oM8mn9K1M6l2j2L2k8K7k3L7j9k1N6n0L7l0p
2430b4j0L7l3pK8J0K9l3qj0L3l3J2M4m3K0%l6O7m3K7p4K3M2m6N5p3N4k9J4J2m3
2462c8L6j3K8k9k3N9n1O3k5KJ8Qj8qqK5m7QK6J0pPj3j0%j2O5j01K5J3l8R1rk8
2496Fm7O0j6l4N4j3j8j7O7m4k5M4m1N2p2L0k1QN3m9J6j7J0L8n3NjN2k2K4k4m9
2528d4N3Opk9K7k2N4k9k7J2j8L1k4M3nn0L1k0R1p4k9RN2nm2K1l8O8%j4o5K4M4
2561B4oo2Q9l7K7n8M5Kkj0J1l6pKM2K1l3PnOn6kK2QJ1L9k8ljM5m5L3m6L9o2O5
2597C9l1k%oL0l4R6q0J0kl8L8Knk0K1mk0J7lP2p0NJ5m5M8rK1n7L7l6K9oj5J8k
2633A3Qk2J8k5lK4k1J1K3lPKno5O3p5N7K1k5K9m6K2nJ6j2k8J5qkJkM0J3l6jKn
$$ plain form
2670 -4 3 13 -4 -8 -7 -30 57 37 9 4 9 -21 12 26 -4 -26 -17 17 -52 14 -16 -26 21 22 -21 5 -3 -10 18 37 6 4 -10 -22 47 -13
2706 -13 -6 18 26 -9 -1 -7 0 6 -3 -59 -10 -15 44 9 -16 -6 -23 5 -34 -25 -24 13 57 -22 -3 3 44 -29 7 -7 10 23 6 10 -19 5
2742 5 33 28 16 -32 2 2 -15 -12 -45 -29 -28 0 -4 3 30 -27 25 -6 -42 -6 -4 7 -32 -47 23 -3 -7 15 20 -12 -6 -38 26 -6 4 20
2778 20 -16 23 -71 36 -21 -4 6 -16 10 -20 -30 -46 -25 -31 3 25 -30 -2 -2 2 -20 -44 21 -17 -8 26 24 14 0 -15 -18 27 -6
2811 -6 -6 -16 -12 23 14 26 -40 3 9 -23 -11 2 -22 25 10 6 -22 -20 13 -8 -10 -15 -20 -25 -13 -24 16 -3 -52 -36 -11 26 -23 -14 -15 -32 -49
2848 -49 -29 -12 13 16 2 29 21 58 -66 -6 -9 -11 3 -4 21 -26 0 -13 -3 -19 20 6 -4 -18 -13 -6 -24 -24 -24 -20 9 -27 -3 -29 -10
2883 -10 -23 -16 41 25 -5 -35 20 21 14 0 2 -9 6 -6 -4 -7 -8 -11 34 4 32 5 -41 16 -87 11 37 46 -4 -35 13 -15 -2 -11 -20
2918 -20 -33 -1 14 -25 -7 -14 46 0 30 -26 -14 65 -18 -5 19 -26 2 -51 -13 -5 -22 0 -53 7 -34 -1 -16 49 41 8 -11 1
$$ packed form
2670dPJ0j7mJk3Q7k0k8nNl0L3J4l0k2RL4o9O6l0j0M7Jm3K6qpK8J9l1kj4j2O9o0
2706a3PK4Ql5QoPOrn6M9nN9l5k5J0j7K8l9RJL7M4p9J9OM1p3L6j4J7J3j7Mk9K4
2742EK8nj2m8L4%j7Ll3J6JK8mPK7n7N2l1l6L6KJ1l9j5P0k6mK2Nl2Ol2O4l2J0J6
2778B0l6L9r4J07n7J7J0k2K6l0j0j6K1oL4K2n5K8%Mk2k4O5l8RL4kj0j4j5lM5l3
2811f%j0ML5rJ2o6M3Ol2J2J3k4M7j5mk8KL3k1knnnJ2j1M0j9m9J6K5L7m9Rjj7j7
2848d9K0J7K5Lj4K7qL7j24O0lkJ4pK5m7K6j3J0j6L9j4j0j4NPj8%%MK9l6K4k6J9
2883a0j3PN7j6l0l0N5Jpj4Kj1J5j2KljlM5l0K8k7m6N7j03R8K6Rn0l1M8k8J3rr
2918b0j3L2J5l9J8pO0m6L0n6J2P9q3J3K4m5K8n3L8Qj7K2n3O0m1L3j5O5ql3j9J2
$$ plain form
2950 1 -3 27 -13 0 -49 -5 5 -5 14 1 47 29 22 16 30 -8 20 10 -58 45 17 -7 57 5 10 -11 24 -7 -10 -7 -15 57 -31 48
2984 48 35 5 24 -11 6 -13 32 -2 -17 27 -7 26 -22 11 -2 13 6 28 25 -19 4 -25 20 8 36 -18 -15 42 -6 -16 -24 13
3016 13 28 23 21 12 32 9 -9 36 16 -6 35 60 4 -38 4 6 20 3 20 19 37 19 25 9 12 24 15 43 0 15 -8 32 -4 53
3050 53 -30 -21 -1 -49 11 -7 -7 4 -17 10 28 8 25 20 8 -17 -7 -3 86 36 -17 1 -62 20 -33 39 8 27 -9 -8 14 -22 36
3083 36 -14 21 23 21 43 -40 8 8 23 -6 1 16 -34 14 -15 26 -31 -5 30 14 -12 -2 -1 -46 -7 20 -10 7 -8 54 24 30 -31
3116 -31 -6 28 7 -6 11 30 -23 -6 11 -28 9 -35 -50 19 -13 62 14 6 -4 -1 16 -14 -12 -16 -29 43 -4 -28 6 12 20 -32 3
3149 3 -15 25 -13 -34 42 -21 -12 11 -34 -18 74 26 11 31 -13 -14 -34 -11 -22 -40 -35 -22 -1 -15 5 4 32 6 -23 20 14 -25 -45
3182 -45 3 22 -5 36 -14 -5 17 13 22 9 -2 1 4 -11 -22 7 20 -5 11 -9 -28 -49 -22 -19 -20 28 -15 11 0 -16 -34 -43 -3 -10 7
$$ packed form
2950AmL0m0J3m9M4J0j0J9j3M6j8poJ4l8K8j0o8J03k8k4O4n2Nk1L5l1lLqP2q8P9
2984D8j3l0J9l5J7j9M5l4j5M4l4L3m8L3j3J5pK2lm4K3k9M5j2K8n4LN7m8j0qL7
3016A3J5nkrK0k3j8M5k0k2M1K5n6m2M2KJ4j7J7jJ8j8Oj6LJ2rK8m3J5k3M0l6N7
3050E3q3RK0m8O0j8%J1k1K7J8k0J7nj2k5J0MQ9n0n3J8o3Q2n3P2l1J9l6JK2l6N8
3083C6n0L5KkK2q3M8%J5k9PJ5n0M8k9M1n7K6L5j6k6J0Jm5L9K7l0J7j5O2l0Oo1
3116c1K5L4k1j3J7J9n3J7J7l9L7m4j5O9l2P5m8qj0LJ7l0Kmj3P2m7k4L4OQn2L5
3149Cj8M0l8k1P6o3RK3m5J6R2m8j5K0m4jk0K3j1j8NJ3K1j4K0jK8k6k9M3ol9k0
3182d5M8J9k7M1n0RK2mRj3j1LLj5j1K9J3k5J6k0j9k1K7LjM8m3K6j1j6j8rM0pJ7
$$ plain form
3217 7 5 -1 -6 -7 -14 30 -9 -22 -57 0 1 7 -27 -19 -17 -4 -27 21 1 -24 8 -22 47 -12 19 -3 8 9 -3 -32 13 -34 -11 -6 28 28 -21
3254 -21 -46 13 25 -1 8 -26 41 20 38 -22 -15 -11 38 40 10 -18 14 12 -14 2 6 12 12 -18 -8 11 -3 22 5 -23 30 -33 15 19 16
3289 16 15 -7 16 -28 24 -20 -29 5 10 4 4 45 23 29 22 -3 -51 31 29 29 -43 -8 3 -8 17 21 -3 23 -15 2 24 -5 32 -10 -24
3324 -24 11 -13 26 -33 11 -25 -10 40 -13 16 45 9 35 -23 -14 27 -2 32 20 -3 23 29 33 56 -18 4 26 -51 27 8 -7 -2
3356 -2 8 41 -5 51 7 44 48 19 18 -35 -11 -19 -11 47 11 -10 16 6 -55 -17 6 34 -31 -5 11 18 -17 36 46 4 5 22 58 -4
3390 -4 20 10 -3 20 -33 2 18 6 -34 -8 9 56 11 56 36 7 10 5 14 -8 4 38 4 -5 22 3 -39 -61 -15 -13 -31 37 22
3423 22 19 -11 8 15 -1 -1 47 37 15 54 -15 6 -28 -25 -1 -42 9 3 -15 23 8 11 -14 -2 -17 -3 7 -56 21 7 -24 13 0
3456 0 -1 -6 -11 -33 35 27 0 -12 -20 15 -24 -7 7 -19 -27 26 -21 -50 14 -4 3 15 47 -16 20 30 -5 -5 -41 0 2 56 35 -35 1
$$ packed form
3217GkonjpM4l9j3l5N7JOl4QKJ3k3M8k0k5L2l0O9n9L1k2J1Jj2k9M5m7K3NL4%m9
3254b1k5N9J2k6Rl4O7k1J8o0PMM9Kl0k8L2kk6J6MO%l0J0J9j4K5j7k8N3o3M8Ml
3289A6jk2K3m4N2m4rL4No%M1k2Opk5m8Q2k%p2L5J1j1K5Mk4K6l8J7K2k9L7m2j4
3324b4L5k4L9n9M4l6J5N0n3K9K9l6K6n8RM1k9L4j2k3K6OMK3p4K2K2p7P8j9j5N
3356bJ0L3m6N6m4L7Mk9jn3K4qQN8l6k1K6j0o1L8K3K8o5K6J6Pl5N3J0m2JJ7L6o2
3390dK4j0j3K3n3L5J6j2m0K6J7M7m5M5k0k9LnRk2J2L4l4rK7j9m2k2M6Kj8O8j5
3423B2ll0J9Pj6%M8j0k2L9o9K1l4LK4m1N1oj8L8j5Lk5J2j5J4J0o3P7j4l1L7j3
3456@jnnk2O8qk7j2qL5l9J7J4k6qN3m7k9O4j8PJ2L2o3L6J0l5%l6M1KN4k1p0L6
$$ plain form
3491 1 9 -16 -51 -15 8 -45 -25 4 -23 -31 -14 5 -39 -17 -5 9 -7 8 1 1 20 5 -25 -27 15 -19 38 -7 -6 -7 47 -20 -31 6
3525 6 9 58 12 -5 1 -20 34 -54 1 -23 -20 -28 23 13 2 9 -7 17 -11 -8 32 0 43 -5 11 -10 12 18 -7 21 43 23 4 12 12
3560 12 13 10 29 -10 8 -4 5 10 -6 -3 3 21 -22 -19 20 -13 -40 -49 -7 -5 -25 15 -43 3 14 -2 -7 0 7 -17 -6 -12 78 10 -45 -6 -17
3597 -17 -6 7 31 -33 1 30 -14 -12 -40 -38 40 -20 -4 -58 21 -12 5 -8 -16 -25 11 -22 -19 18 0 21 -4 2 5 -18 46 29 29 -4
3631 -4 -11 -50 50 46 7 5 -5 -7 11 52 4 -16 8 9 22 41 16 3 -2 -43 9 9 2 27 9 -14 17 40 35 27 4 3 -3 7 18 47
3667 47 8 26 8 56 16 -5 -8 13 -44 -14 -27 -31 -2 -21 18 0 -8 -1 -62 -6 -38 -6 -13 -26 25 -36 4 -13 17 11 -27 0 -19
3700 -19 36 0 37 -15 14 13 -4 52 -12 10 18 -54 32 2 32 -2 -21 -44 -16 -2 -41 59 23 21 8 42 -14 43 -9 -21 39
3731 39 14 -4 10 -3 -18 27 13 -36 -1 -26 -29 8 -21 31 -25 -19 -27 2 -33 53 34 -15 52 62 20 -21 -32 42 -1 19 11 3 16
$$ packed form
3491AQk5l5L6K3n3K0K9k7qJ7J9m4K2J2J4j6J5p%J9j5l0kM2l4N7m5JjN4o7j1L7
3525FLM9m6j7Ok1N4q8N5k4LqN1j0j1Pj6K4k8LM0l2M3m8J6k1K2Ok5K8K2k0j9Q%
3560A2JlJ9l9J8j2RNj6LOJ8m3LL9l3k7rM2Kk0M0n8M6J1j6nPPk4J1oR0o8n5L9j1
3597a7J1J3K4o4L4K9m4Kk8KP8o0J6n4P9l3J7j3qrL6l3LL7j8K1k5OLk3O4j7%l3
3631dpl9J00ml9kj0kJ8M1m8k0K4JJ3J9k5j3nm1N2%pK5j8k3L1K3nqk3joJ0J1K9
3667D7l9J8j8M8m0k1lK1n7L0j3mK9j9L9j8qPo1N6l2L2pj3N1o1M0j7L0ol8K7j9
3700a9N5l6L7n2K9jj7N6o4K2Qp2Q6l0L0l4j9k3K8J4l9J00l6kj3L4n6N7n2j2O0
3731C9k5j8J4j3j5M5j4m9L5k5lL7k9N2n6OqK9l5Q6j9m9O7J0m2m1j1P4m3K0qqJ3
$$ plain form
3764 16 51 13 2 24 -20 8 27 33 18 42 71 25 -21 -19 17 27 -22 15 61 4 9 -34 3 23 11 13 -24 -23 28 -10 19 -2 46
3797 46 -9 -8 48 31 -5 6 17 -5 -28 -36 -21 11 -37 -47 -11 21 -12 -13 10 -12 10 -9 20 -22 -7 43 2 -3 -27 7 12 40 8
3830 8 19 25 28 27 31 -37 20 -7 30 16 -11 -12 -33 10 3 44 -1 40 53 -23 -40 30 6 21 -28 2 37 36 19 -25 39 -1 28 12
3864 12 6 -24 -26 -8 -3 39 20 -44 -53 13 21 37 10 -5 19 9 8 -23 -21 56 -18 2 -28 -32 1 -15 67 4 3 -19 18 7 -26 -9 -52
3899 -52 22 54 12 35 -6 -16 12 -30 15 -8 25 -5 26 -11 3 -6 17 21 17 -1 -7 23 -20 2 -6 -5 23 -2 6 -5 -10 -1 -50 -9 -9
3934 -9 -34 62 23 -73 14 -16 19 48 -4 -49 -5 41 -3 27 -42 50 -25 26 33 -14 3 6 -2 18 -9 -32 17 -65 -21 35 -32 -18
3966 -18 -26 19 -2 20 -18 -2 18 22 24 -4 -19 -11 -26 -9 19 15 7 -9 15 -26 19 13 -23 1 -20 4 -2 -29 17 -25 -5 24 16 0 -9
4001 -9 39 -15 21 4 21 2 -22 18 -14 -39 13 32 -15 12 -9 18 23 46 -7 13 0 -21 -10 13 -42 2 -30 15 -20 -23 -20 9
$$ packed form
3764A6L5l8j1K2m4K8J9Oj5K4K9m6m6KL6J0m9L7M6n7Nm3L7K0j2Kl7JN1l8K9k1M8
3797D6n5JN6j7l6J1J1k2k3qJ5L2m8j0L6L2l3jK3k2K2j9K9m2J5N0m1nk4L4NK8l2
3830HJ1OLjMo8N7k7L7j4k7jk1M3pM1m5M1J3p6j7P0k4J5m9L0L5jj7m4O4m0K9j6
3864A2ol0kJ8NM2j9o4rO6QJ6k7j5K4j0jl1KP7p4K0l0mL3j6Q2o3jk2L7j1l3J7m3
3899e2P4L2m2K3m1j0K8m2M5k3L3l0L1l7J4rK3Mmj8oL0m3K2qJK8k5Qj1nRm9M1%
3934ik5R6l9r6Q7l0L5K9n2m5M4M6m4L0o9R2p5N1Pm7J7LqK0k7k3M9q2M4N6o7J4
3966a8qM5k1K2l8J6K0MKk8j5Qj5J7K8mqj6K4m1M5ol6K4k1K4ok7M6m2K0K9qj6r
4001iM8n4L6j7J7j9k4M0l2k5N2J9m7K7k1K7NK3n3K0j3k1J1K3n5M4l2M5l5lLK9
$$ plain form
4033 9 -40 -14 0 -37 3 4 20 -44 15 -30 7 -54 -7 32 -6 -41 -25 1 -12 -31 23 -18 -33 19 -16 -39 3 24 -37 -13 -13 -5
4065 -5 -31 16 -20 -15 -4 -35 23 -7 -6 4 19 35 -8 18 -8 8 15 27 14 0 10 -35 19 4 -6 27 -34 -21 21 31 18 6
4097 6 -7 13 -15 -4 33 1 -38 18 28 49 -25 47 -20 -40 15 -1 60 35 15 2 -13 2 -7 -10 12 6 29 5 45 29 -14 2
4129 2 -24 30 -35 31 -1 -32 45 -29 -31 -33 33 43 11 34 -12 25 12 22 -22 23 12 33 55 0 6 0 6 -16 -12 -5 21 -12 23 -33
4163 -33 33 12 23 -17 -16 -50 17 -1 -54 14 18 -16 -37 -12 25 -17 -7 9 -1 11 -9 -7 6 38 16 6 -27 -2 20 52 23 -16
4195 -16 28 32 29 15 -7 4 -22 -12 36 -14 -21 -27 -21 -12 -19 -10 -15 -4 -6 7 -17 -28 -17 -6 -3 -33 -20 12 -19 -19 -20 -22 -30 -13 19 -30 35 -7
4233 -7 19 25 -21 -2 4 40 -12 14 -18 -32 6 -67 24 13 7 -25 12 -18 12 34 -6 10 -24 -46 15 5 -12 0 21 -12 13 34
4265 34 -13 46 -28 -3 15 29 37 -39 23 31 7 -13 9 36 -8 -39 -34 20 -4 1 -6 -18 -1 10 29 4 1 18 9 -12 -11 2 -29 -21 -25
$$ packed form
4033Im9K6J4l7M0JJ6o4N9m5L7o1M7L9l8l5J6K6j3j9N4m1j5N2l5k3M2K1o1K4%Q
4065ek6M7l6NJ1l1N8l0JJ0J5J6m3K6k6J6PJ2j3j4J0m5N4j5j0L3o1J3M2J0j3j2
4097Fj3K0k8J1L7l2l9N6J0K1p4P2o7k0N5j6O1k5k0j3j5J5rlK2oK3k4M0j6m3J6
4129Bk6N4o5O6l2l1P7p4kkO6J0l2K3m6L7j3J0m4M5j1K1K2n5OoOk2MPK6l3L5n6
4163c3O6k1J1m0Jl4O7j8n3O8Ml4k1K5L7m2J0J6j0J2k0KJ3L2k2j0l3K5K2L2k9l9
4195a6M4Mlj4k2J1k6J0M8n0poORpRnJ1kJ3k4j1J1J1Ll0J3L2l1%jkqJ7L2m9O5m2
4233gK6Om6J9OL6n2K6l2j4L8p3R1j1ol2L7l0L0K2m0J6l4k2O1j0j7J2K1l3K5K1
4265C4m7N9p4K5J8J4Qp6O2Qk4k0K2K7m4l1NN4k4Npj2J7J1J9k5lJ7rk1JJ3l1Qm
$$ plain form
4300 -25 12 -3 12 1 49 -5 -45 -11 -33 23 -14 18 -52 -5 -29 -19 35 -51 19 -14 24 -16 13 19 -37 11 -9 2 -39 -17 -4
4331 -4 -13 24 -9 -19 17 -23 10 50 24 1 18 10 -14 -29 -7 -44 -1 33 -11 -13 -44 -23 19 18 -9 36 -15 -33 -22 -2 -39 -19 -43
4364 -43 32 -27 -28 20 0 29 -45 -1 5 -27 -5 -44 16 -3 -43 25 24 -56 -15 -18 -8 -9 8 -16 14 64 5 3 18 28 8 -28 48
4397 48 -14 1 -13 51 13 -9 -33 0 20 -41 -10 23 5 23 27 36 -31 1 -31 7 -22 -28 15 -5 20 -10 29 -7 -28 0 -40 -2
4429 -2 -18 -1 -5 7 47 34 22 11 42 2 43 47 15 -11 -30 2 -42 -13 22 0 45 9 4 11 8 -15 -6 -1 6 27 27 -22 14 7 -51 -16
4465 -16 38 16 -19 26 -47 64 -21 -15 -2 -23 32 -19 11 14 3 -20 43 22 14 -9 -14 41 -3 5 9 38 -12 -11 32 22 -1 8 13 5 28
4500 28 -23 7 4 -2 30 -33 44 17 28 5 -1 -26 -16 34 -9 -26 -1 21 -15 12 18 42 6 -38 16 -9 17 -17 -39 -28 -22 3 -4
4533 -4 5 53 -15 31 10 2 60 3 -12 54 32 26 62 -5 17 -13 25 7 16 1 -13 8 34 6 43 -16 -34 5 23 0 3 16 27
$$ packed form
4300b5L7j5J5j1M8n4m0L4k2N6l7L2p0M7k4J0N4q6P0l3L8m0K9On6M8k0J1m1K2J3
4331drL7l3j0L6m0L3M0k6k3J7qk4j5K2l7M3L4m4kl1K1M2jk7M5n1j8J1K0l7K0k4
4364d3P5n9jM8k0K9p4M4Ol2K2l9O0j9m0O8jq0M1lJ0jJ7k4L0N0n9kJ5J0k0l6P6
4397D8o2J5j4O4l8k2k4L3K0o1L1L3j8J8MRo7L2l2L8k9oM3k0K5l0L9l6k1K8m0L8
4429bj6J7mJ2M0j3j2j1L1m0M1Ml2k6j9L2m4K9L5k2M5l6nPlk3RNPK1%m9L6pn8L5
4465a6N4k2l5M5p3J11q5OJ3k1N5n1L0Lj1k3O3k1qk3nN5m4QMK9n0JM3j0k3RNqK3
4500B8n1L0loL2o3P7k7J1k3ok5J0N0m3j7K5K2l6K7OK4l6m4N4k5K6l4k2J1OK5p
4533dRM8o8M6k1qN8n7j5O6k2oL6o7K2l0L8j8Rj5j4K1K6k8L7n9j8L9J8k3LJ3J1
$$ plain form
4566 27 33 25 25 0 20 -3 -32 7 55 21 -23 -2 -15 25 -14 14 1 16 39 -36 -40 0 24 13 5 5 12 34 36 -26 15 34 -11 -23
4600 -23 25 2 -16 -10 -26 7 6 -12 18 -6 -47 -21 -9 -16 29 9 -30 -19 -1 -9 23 -31 -7 12 -4 11 -8 19 15 3 -15 -21 17
4633 17 7 -27 -3 -38 21 -4 1 -23 20 31 33 7 18 25 -7 -22 5 -22 14 30 -3 9 -46 -7 6 -14 4 -3 -23 19 -2 42
4665 42 -1 8 -72 -40 -53 9 10 11 -20 -30 12 -11 28 -7 -31 -7 -30 -10 -68 17 10 -58 -15 9 -22 30 4 2 12 -48 7 31 -6
4698 -6 -12 19 -3 16 14 12 -9 55 9 35 -27 12 -13 -35 4 4 -5 71 -42 4 5 -17 -35 -48 15 8 5 -11 8 -36 -38 24 45 15 23
4733 23 -27 -24 -9 -8 -4 10 -37 -5 -7 -11 37 -9 -53 -47 -24 4 -12 -21 -34 -41 -1 -35 -24 -8 9 -12 18 11 -22 -33 -2 -3 -35 39 14
4768 14 30 1 2 -3 -20 29 10 -1 -11 -38 -52 -21 11 5 -4 -10 6 12 -33 -1 -29 1 8 45 21 -39 -7 -24 6 31 15 32 20 -64
4802 -64 -45 36 43 22 18 -27 33 -11 6 -20 0 -19 3 -15 10 -18 0 -38 6 17 -25 3 21 17 -13 12 -8 18 -14 -12 27 -6
$$ packed form
4566B7Oq%k5K0k3k9L9M8l4m4K1j3M0l9K8j3J5K3p5mM0K4j1q%PK2Ko2M1J9m5j2
4600b3M8k3j8Oj6L3jj8L0k4m1K6J2pM5k0l9J1J8qL2n4K4J9j6J5j9K7mj2j8oL8
4633A7j0l4K4l5N9k5Nk4M3J1Kk6J1Pl2j5K7k7L6J6l3J2n5L9J3k0J8pk0M2k1M4
4665D2m3Rq0L2j3O2JJl1j0M2k3L9l5k4K4k3K0n8Q5po8M3K4l1N2k6kJ0o0N5K4l7
4698foL1k2J9kkk1O4m6K6o2L9k5k2L9%rP6j13M6Jk2j8j3O3plj6J9m4kO2K1l0Q
4733B3n0LJ5JMJ4m7L2kmM8m6m4OK3K8j6rj3pM0l4J1J6J7k1L0pl3j1L1jl2P4k5
4768A4J6k9Jnj7M9j9j1j0k7j4L1L2oroJ6Om5L2k8L0PL7k4o0L2j7L0K5j6J7j2q4
4802f4J9Q1Pk1mm5O0m4J7k6K0j9K2j8K5k8J8l8M4J1m2K8J8ml0K5k0K6l2KL9l3
$$ plain form
4834 -6 -22 6 3 -47 17 -19 6 -7 21 36 -38 -25 46 -11 -1 -1 16 48 -23 11 -1 -23 17 -20 -1 22 32 -2 28 62 15 -22
4866 -22 50 21 12 6 34 12 -11 -9 2 3 7 15 -4 30 -10 14 10 43 40 -3 27 -5 22 1 -33 -17 -12 14 46 -10 22 1 10 65 39
4901 39 -20 43 3 11 24 33 18 5 -38 -9 -2 -28 24 22 -12 17 -16 17 13 4 66 -1 -7 55 0 15 -3 39 0 23 5 18 34 36
4935 36 -4 37 25 9 1 55 -31 -15 3 3 46 8 -1 20 -11 41 -6 -6 14 -27 -19 -5 17 2 -14 -33 27 38 9 34 -44 -3 -11
4968 -11 36 14 38 40 -17 36 -31 19 16 29 -6 -30 41 24 23 -4 -16 17 -24 9 -32 0 -5 28 5 1 38 8 3 -6 -43 -17 19 4
5002 4 0 25 -19 0 -3 -20 7 -4 35 -11 -7 -18 7 13 49 10 0 -6 15 2 -4 35 18 -56 7 -23 -2 -1 16 7 -19 8 -25 -5 27
5037 27 0 7 41 -7 19 5 -9 7 -41 10 -16 -6 18 -15 -19 -11 0 -21 -57 -64 32 30 -7 14 -29 17 -73 16 19 11 23 -1 19 -1
5071 -1 -17 -36 32 18 5 26 4 -9 19 15 10 -30 1 9 -43 31 -36 -18 -11 -7 24 -29 -17 22 37 5 9 -7 3 -4 -14 -24 -34 -8
$$ packed form
4834fj6K8ln0O4l6K5j3K8J5p4J3P1n7J0%J7L2p1L4j2k2M0l7J9K3J0l4L0L4m7l7
4866b2P2k9roK8k2k3KJ1JMQj9L4m0K4mL3lm3L0l2K7k1l4J6NK6L2n6L2k1RN5k6
4901C9n9O3m0QJ3Rj5j3m3K9Pk6N2kl4K9l3L3mrO2o7oO2n5J5j8M2l9K3j8J3J6K
4935C6m0M1j2j6qN4q6J6J8%M3l8rK1l1N2m7%K0m1QJ4K2j5j6j9O0J1k9K5p8M1q
4968a1M7k2K4Kn7N3o7N0lJ3l5k4P1j7jk7j2L3m1L3m1L2nL3k3mL7l0nrl7K6L6j5
5002DmK5m4J9lj7K7j1L9m6Mj1K5OL6l9j0oK1j3oL9j7p4O3l0K1JJ7rk6K7l3K0L2
5037B7k7PL4m8K6j4j4J6m8N1k6J0K4l3mQJ1k1l6pR6kl7K1m3M6r0Q9LqJ2k4K0k0
5071aj6j9O8j4j3K1k2j3K8mnm0L1Qn2P4o7J8PML1n3J2L9J5l2Mj6J0pj0j0j0K6
$$ plain form
5105 -8 32 12 31 17 -15 7 -17 -20 4 19 21 0 -5 -29 44 8 39 7 16 -11 -42 -15 -31 14 -13 -5 -18 29 -9 -16 6 7 -57 -30
5139 -30 3 -25 9 -13 -17 -3 48 -30 39 -12 5 -3 26 26 24 30 14 18 8 6 -51 -34 -13 -18 -16 -25 19 18 11 16 -17 14 4 40 -2 57 11
5176 11 15 12 3 1 18 -20 -44 -1 13 -49 21 11 -35 -32 28 15 -3 5 10 -4 16 72 12 9 -28 20 -18 33 -16 -18 27 -12 -5 13 8 52
5212 52 28 36 32 -20 -2 10 19 -16 -33 -9 0 16 -14 -27 15 -7 -36 14 -52 8 -2 -25 16 -44 8 7 2 15 2 -10 0 38 20
5245 20 -2 6 -2 57 17 11 20 8 1 -31 48 39 28 18 42 2 -12 -11 31 15 6 15 58 40 29 23 53 -17 35 13 7 -3 11 -7 0 25
5281 25 9 22 9 -15 33 15 24 -6 13 45 -29 9 -20 -7 40 10 16 6 -58 10 -26 13 -40 31 -13 34 -17 -12 7 -28 25 -13
5313 -13 21 -10 -9 4 -7 0 25 -41 13 -1 17 -8 52 4 5 10 -12 11 15 43 13 11 2 -69 21 -15 16 54 -16 1 -13 2 -17 14
5347 14 15 4 -22 -13 -2 16 -12 37 13 0 -11 -25 17 15 -14 -32 30 9 30 -59 8 9 -3 41 1 20 -12 -29 21 -12 0 -40
$$ packed form
5105hM0k0J9j4l2K2k4lK4J5Kk1nk4P3l6L1l2Rk7l1K7j6M5k7Qj3M7l8pK2Jo4K7
5139c0L3k8L4k2mJ4N1p8O9n1J7qK9%kOj6Mj0kn7J7K1nKrM4jpNl3L1j0L6m2N9m6
5176A1MlrkJ7l8k4M3J4o2P0j0m6LO0j3j8QNj4K0N6o0ll7M8l8N1m9kM5l9PJ8nM4
5212E2k4Qmn2J8J2Rl5j7K4RJ6l0j3M2k2k9N0o6O0j0k3M1o0N2jnJ3j3j2J0L8j8
5245B0k2QqN9m0oRj2pl2P9rj1j0K4m0j4JM2j6rRM3j8j1oL0p0N2k2oj0J4j8PK5
5281B5j6J3j3k4M8j8Rl0J9L2p4L8k9J3M7l0Oj0o4O8l6L9n3P1m4M7n1NJ9l5N3l8
5313a3L4l1JJ3j1PK5o6N4j4J8k5O0m8JNk2K3MK8l0krp1R0l6L1L8p0J7j4J5j9L1
5347A4Jj1k6RJ1J8k8M9k4j3j1j4M2kk9j8O2k1K1q9O7Jj2M4m0J9l2j7N0l3J2m0
$$ plain form
5379 -40 -6 10 13 27 -8 -7 10 -19 22 -28 9 24 -17 -9 7 -8 -37 46 2 22 -2 12 6 23 1 21 16 45 -43 -22 9 -5 7
5412 7 -12 30 -9 19 -5 46 -26 3 -10 46 -23 -49 11 -7 -28 -9 -37 -15 -52 -18 19 -25 -8 4 41 -24 29 1 -9 -15 41
5443 41 -2 -6 -21 35 1 33 22 14 18 26 -12 6 -12 19 -56 -13 -43 -4 18 -5 -9 -3 6 -11 -48 -35 -34 -21 0 1 -8 -12 -53 -52 -3 -35
5479 -35 -15 0 -13 -40 0 -3 -8 67 -5 11 -18 9 -15 6 -7 9 14 20 6 -71 5 -2 -60 20 6 50 -8 34 20 -47 37 -30 1
5512 1 9 -1 -14 -12 33 -21 31 -9 24 19 -5 17 -14 -2 -26 -26 16 12 -7 -18 -24 -21 -20 5 1 15 26 2 -84 7 3 13 -31 -43 -30 1
5548 1 19 -18 0 -2 -21 -14 2 26 3 28 -13 -11 -21 12 9 19 -14 30 -15 -31 26 -62 40 -15 18 -30 -13 34 -18 10 -22 -38
5580 -38 28 -32 -16 3 32 -17 0 -25 3 7 -2 49 -22 -5 20 0 3 8 20 -18 25 -18 -10 18 -13 17 -13 9 -10 11 -11 9 21
5613 21 -16 -26 13 8 -4 -3 18 -11 22 31 -11 7 2 -10 7 7 35 26 -10 -14 -25 -14 -4 41 -23 -20 -16 -2 16 13 38 32 40 6 17 -24
$$ packed form
5379d0L4J6LJ4l5JJ7k9M1n0L7J5m1QJ6j5k9Q3m4K0k4J4oJ7k2K0nK9q8K1L1j4J2
5412Gj9M2l9K8k4N1p2K9j3N6o9k6O0j8k1J9k8K2l7L4L7m4J7J2L7o5N3k8j0oN6
5443D1m3mj5N6l4L2j1qMQl8J8j8L1p5M3l0L9K2k3mORj7l7J3JJ3K1Jrmm1JM9l2
5479c5K0J5j3k7M0lnP5p2J6k9K7k4K1j3J6NOj4p7P6pn8Q0j4M4n8M2j4o7Q4o7L1
5512AQj0j3KM5n4N2m0L3nk4K2l1J2k4%M2mj9j1oLJK5mJ4J1k4q6R1mJ0m4j2J3L1
5548AJ8l7J8kj9PJ6K4k3K5m1Kj0L3lJ0l3M4m5j6N7q8J02n5L3m8J7M7n2K8l2j6
5580c8O6o0J6J9K9m9J7k5K8MrN1p1J7K5k0LNJ2l8M3m3QK8l1L0l0K2j9K1k2K0J2
5613B1l7j0L9nj2JK1k9L3Rm2J8nj2J7%K8rl6mj1J1J0M5o4LMJ4J8lK5oQl4J1m1
$$ plain form
5649 -24 -5 38 2 15 20 30 20 -4 -12 6 10 17 -10 3 6 19 -1 13 18 18 45 -30 15 40 20 3 12 32 -17 -12 -5 5 8 -4 -14 28
5685 28 -29 -32 7 -14 -21 -9 -15 11 3 41 13 2 -16 -12 29 -6 5 16 -20 22 -3 26 12 -4 -19 5 36 -12 27 10 38 16 -22
5718 -22 8 31 26 -39 35 -17 0 -6 -25 -19 -21 -8 -4 5 53 -28 8 3 33 0 15 36 -3 4 -15 22 -16 -5 -40 -1 -25 -19 -29 25 23
5753 23 -1 7 3 30 -26 11 -12 48 21 8 -9 -15 -10 -47 48 -4 23 17 -13 8 1 9 -36 15 -49 28 52 -30 -2 -28 12 1 5 22
5787 22 -7 -1 -25 12 2 -15 22 -8 10 -8 32 11 -15 -10 -36 44 -9 18 -3 -16 -16 -53 -4 0 -12 -18 -2 -13 4 35 -37 6 -23
5820 -23 28 -1 -16 -14 -11 0 0 10 -8 31 -9 33 -16 -10 42 -15 -13 4 1 9 12 12 -22 11 -6 8 -8 -22 5 -37 60 11 27 27 -14
5855 -14 -18 -26 15 2 -43 -21 19 12 18 21 6 32 -40 42 -22 29 35 6 -33 16 10 -26 -13 -25 -1 31 -43 22 5 31 13 -3 -7 -58
5889 -58 11 -20 -18 20 -16 -35 18 21 -7 -10 -1 -3 6 -16 51 -19 16 -27 -56 14 -23 -23 -12 24 13 -11 5 1 9 9 1 2 27 -13 5 -24
$$ packed form
5649b4J9M3l6J3NJ0j0k4qJ8MPk7J3LJ3k0J4N%K7p5M5K5k0j7RK0m9NPJ0Lj2j0M2
5685B8n7lL9k1pJ2oK6qL8k8j1j8MM1l5J1J1l6M2k5K9j4j6j5K4L1m8L9j7K8k2l8
5718b2L0K3no5P4n2J7oj9OkJ3MRM8q1L6nL0l3J5K1l9Pj9L7l8J1l5L9k4Oj0N4k
5753B3k4QmK7n6L7k3O0k7j3j7oNl7R5n2K7ol0K1pQm5N1o4P7K4q2K8k6M0j1MJ7
5787B2k9Ok4L7j0j7L7l0J8j8M0k1k6Nk6Q0n3K7k1j3%l7M9Mj2oJ6j1J7L1p2M3k9
5820b3N1k9j5KLJ1%J0j8L9m0M2m9ON2n7KJ7lQL%l4L3j7J4j6j4K7m2R7m9J6%m1
5855a4mqM1j3m5K2M0pOLj5K6p2Q2o4N1Ok9l9M9ol6J3j2K4L2p4O5j7K6j8j6mn1
5889e8O9l1KL8l6j9N3Lk8lRkRk2O7p0L5m3k9P0l7%J1L6j1k4J6mQ%qJK5m0J8k9
$$ plain form
5925 -24 33 -20 6 36 -44 5 -13 1 -21 -26 -31 -14 19 8 6 -35 7 17 0 1 -27 -1 -15 1 -10 -21 -23 29 41 -1 21 5 -23
5958 -23 -29 -13 52 -9 -4 -18 -8 -7 6 36 -23 -8 -55 -7 -10 -7 6 -14 -2 18 7 30 -44 16 -49 40 1 18 -15 34 20 29 45
5991 45 11 27 -32 4 -6 4 -12 -10 1 32 -30 50 -8 20 -2 -1 3 -23 24 32 31 16 17 -3 15 21 -4 17 21 -1 3 16 61 48 5
6026 5 40 -2 13 -38 -3 31 27 -8 -17 -20 13 -23 -2 5 -4 -68 -5 -4 37 16 -7 14 -39 13 24 -9 7 -23 28 2 5 1 17 40 25
6061 25 30 22 11 -16 2 27 -18 -4 41 -25 26 60 8 -20 19 -22 54 12 53 32 38 -6 -19 -39 -21 12 -28 -6 29 -49 33 -2
6093 -2 -51 -21 -9 28 42 37 4 -18 13 -16 -9 5 -33 20 42 15 -27 30 21 36 -6 6 1 -49 -5 35 16 -15 39 -12 -19 37 41 -20
6127 -20 25 -34 8 -63 5 -26 -8 45 -30 -21 -32 9 -30 5 25 2 35 6 16 -7 31 -19 -67 63 -10 25 -45 8 -13 16
6157 16 19 23 -17 24 -2 -30 2 6 0 25 -16 5 23 -9 -25 7 -40 -35 41 29 -32 30 5 -10 -17 -6 -3 25 -6 -15 -10 -6 8 16 -7 1
$$ packed form
5925b4N7n3K6L0q0M9j8J4k2nnJ7L3j1km1M2J0j7Jk8K6j4J6j1j1kN2J2m2K2j6k8
5958b3oJ6O5o1Nj4J0JJ3L0n9J5m7M8lLJ3k0J2K0j1K3p4O0o5Q9l9J7l3M9j4RJ6
5991D5l4J6n9L6j0J0j6KJ1L1o2Q0n8K8k2JMk6M7Qjj5Jk0J8Ok5K1Mk2MJ3M5j3m3
6026EL5m2J5n1L5L4ml5rlL3l6K1Pro4O3JM1k1k3K1n3N2J1l3J6l0N1k6LmJ6K3j5
6061B5Nqj1k7J8K5m5J4M5o6N1L4n2k8L9m1P6m2M1k1Om4j3k0J8L3m0K2L5p8Q2l5
6093bm9L0J2L7J4nl3k2L1k9PJ4l8N3K2k7m2N7rJ5m2J2nn0M4M0j9l1N4n1pN6Mo1
6127b0M5n9M2p1O8l1J8N3p5Rj1M1l9L5K0k3L3k9J0k3L8n0m8J30p3L5p0N3k1K9
6157A6LMm0M1k6k8L2MoK5m1K1J8l2j6L2m7NP6j2o1O2k5j5pJ1LK8l1rNMJ4Qk3Q
$$ plain form
6193 1 -34 32 16 -22 -7 -13 -20 5 -28 -17 20 -1 -28 -13 26 -20 -19 -4 18 -10 8 13 -24 25 5 13 17 -13 -31 16 11 4 43 -23 6
6228 6 -21 -51 16 7 16 -20 24 -14 -31 -18 -49 38 -14 43 -16 -75 -20 -11 26 27 2 14 29 11 45 -31 23 -4 -9 -20 -6 20 4
6261 4 -9 4 6 17 -8 -28 23 -9 11 60 -4 -13 29 -22 28 -10 3 -17 9 10 38 -20 -7 -21 9 -18 -6 -30 17 7 26 -12
6293 -12 6 62 13 7 -17 -22 -15 -17 -22 2 14 -34 -3 4 -2 15 -9 37 -11 -17 -48 46 19 4 31 5 29 -28 15 10 -2 17 -59 51
6327 51 -21 -9 1 -26 59 2 50 12 -19 -31 -20 -10 -1 12 -26 6 11 -20 -19 7 -14 1 44 26 -53 -38 2 -20 2 13 -12 12
6359 12 18 -27 22 -1 -5 31 2 27 22 -10 -19 12 13 6 1 11 -28 8 23 36 -29 -8 14 18 35 -22 13 8 13 -4 -34 10 -13 -13 -18 10
6395 10 13 -1 33 11 24 -21 -11 35 19 -8 -15 54 -50 -43 18 38 1 4 5 41 39 -17 13 13 -27 26 5 39 44 -10 29 6 27 33
6429 33 -20 14 -21 38 -8 58 -15 13 9 -11 10 22 14 -13 36 -18 12 10 -15 4 36 33 33 -1 11 9 2 -11 -20 28 26 -54 12 -33 23
$$ packed form
6193Al5O6j6l8J5opK5l3J1L7k1k7J5L9m6JJ5K2k8J8Nl7M9k0QMl0j8M7npL9o6K9
6228Fk7l0O7rRl6M4l8j7J3l1Q7n2N7n9n9N5RL7Jk5J2J5j8L4p6N4k7nj1J4K6j6
6261Dj3J3KJ1k5k0N1l2K0M9o4rM2n1N0l8J3k0K6JK8n8J3j4L0k7J2k4M7j0J9l8
6293a2J8N6m9ok4nPknK4J2m8L1PoJ7k4M6m8ol1R4k7j5K7k6K4n7M3nj2J9p6J10
6327E1p2J2J0k7Q5n7M8l8l1j2J1J0RJ3l8L2Nl1JK6k1J5M3j8p9J5M0k2K2J1k5K4
6359A2Om5M9k3mL6k9K5nl2rL1JpnJ0l9L6J5J3o5K1K2MJ7n7L5nNj7l0M4k3%nK8
6395A0Lj4L4k2J3m5J0M6j6k7pO9j04PO1K0l7LJL6kn6L0%m0N3k1L4Nn4L9k3K1O
6429C3n3L4l5N9m6O6p3K8mk0K1J2qk7M9n4L0kk5J9L2l%l4J2kpj3rM8kq0O6m5N6
$$ plain form
6464 23 25 11 33 -34 -19 -16 -15 29 23 45 -12 0 1 40 24 41 40 5 -24 5 2 51 35 -14 60 45 44 6 -8 -27 27 2 -8 68
6498 68 -2 -28 -9 -22 11 21 -30 -7 -16 -3 -23 9 10 -3 8 9 29 -43 3 15 39 7 0 1 -41 61 9 -8 7 3 32 -12 7
6531 7 10 -47 -14 14 1 -5 -8 5 -41 -5 -3 -12 -29 -18 -22 6 7 -40 33 5 23 8 -13 24 -27 32 2 7 -14 -9 33 -21 21 19 -54 -49
6567 -49 12 24 25 19 21 -54 71 -15 2 37 9 -1 -38 15 7 -18 0 7 9 -43 -4 -20 7 -41 -6 -14 -44 5 -8 12 -25 4 1 -8
6601 -8 -19 -24 41 0 -17 37 4 45 -32 12 -33 14 33 -16 -1 -37 -25 -5 -25 -11 -17 -31 11 -7 -11 -4 -31 10 9 1 -22 -10 2 -13
6635 -13 -4 29 -4 -33 -10 -11 -5 -9 -37 17 -19 30 -13 17 -36 15 48 -19 -15 -35 14 16 3 -26 25 36 -63 1 -17 -33 -20 -40 -18
6668 -18 13 37 2 15 -9 -31 -2 -29 -34 -23 -15 17 12 8 -6 44 -22 38 32 -17 2 1 40 -5 53 -12 -39 -2 13 30 -24 7 25
6701 25 18 -33 -4 -20 -11 36 1 -8 6 17 32 -7 -32 -2 -19 46 5 7 -16 11 23 -2 -7 -18 -24 15 6 -3 -41 22 -2 -34 -7 12
$$ packed form
6464B3Kj4K2o7J5LJM4oK2n7J2JL9j6J7jl5k9K9lM9j6m9P4j5jl8j4j9N4k5j0P6
6498F8p0k6J9j3L3J0n1K3rJ3k0L2Jj3J1JK0p2M6J2K4l2pJm2J02n2j7J5mK9m4J9
6531GLn7L3K8j3olJ3m6L6Krj7J1mK8Jm7P3k8J8j5k1L7n1N9l0Nk1NM2n4M2kp3N
6567d9O1J2JoKp5J25q6J7L5k8j0l7N3qk5J8PKn2L9j6K7m8L5ql0M9j3K0l7K9lr
6601hj1nO5m1j7N4l3M1p7M4m5M7J9m9J5l6J2K0k0J4oj4M2j8mPk7M1jqk3J2J2j5
6635a3RL3l3k9K3jOmk8N4l6M9m3L0n3N1L3o7Mk0M9Kj3k9N1J1r9O4j8j6J3k0K2
6668a8L1K4l5J3k4k2K9k7nJ1QL2nmj4N0o6O0om9J9jL9m5N8o5k7L7J5J7n4L1J8
6701B5pn1K9j6RM7l5rJ4J1J5l9k5L0j7O5m1Kk3K7J2k5nj1oL9rrl8O3k4l2K7J9
$$ plain form
6735 12 15 -13 -4 -11 18 -18 31 31 0 1 -8 17 44 18 -2 -44 28 -17 15 -17 -42 28 -5 -29 -6 30 50 19 21 -38 -17 0 21 28
6769 28 -7 -1 -6 66 20 2 8 -16 22 3 1 -6 11 7 -22 9 11 13 -14 38 36 11 49 -8 3 -4 3 19 -19 -4 20 44 32 41 -8 -14 -17
6806 -17 2 -21 8 22 -11 65 -21 13 -24 23 0 24 34 36 2 -18 -1 13 -4 -18 11 32 4 5 -47 1 5 14 -1 -26 -21 3 -2
6839 -2 17 5 24 26 40 27 20 2 -4 22 -44 -2 -11 -26 27 24 -51 21 18 -36 -1 36 16 7 -19 2 -16 9 -27 -11 48 -8 1 -36 -1
6874 -1 -3 -3 36 -1 -16 -5 -26 12 -15 0 4 28 8 62 21 -19 12 -7 -1 19 49 43 -25 49 -3 -32 22 -1 41 -26 5 -21 -7
6907 -7 -1 13 -6 -20 -12 -8 13 -28 13 42 25 47 31 -27 39 1 20 34 28 -17 4 20 12 46 -53 -26 -17 -12 4 -41 9 7 -11 -14 -21 32
6943 32 -36 50 -38 9 54 -21 -62 -25 11 -10 57 -18 -29 -22 -21 -21 22 52 -43 -2 -19 -9 31 -49 -35 -27 0 2 -13 5 8 -6 20
6976 20 -16 55 -26 -23 -5 -34 13 -39 -22 -8 3 -55 -1 22 14 -7 -27 -25 -3 -35 -46 -34 -5 -11 5 -25 1 11 -14 18 -36 0
$$ packed form
6735A2Lk8RpK9l6M9%l1JrK5K7k6k0m2P2m5L2l2k5P0l3k4K3L6K0l1Kn9K1J7K1P
6769B8l5OnP2m6j8Ok4L8j9kpJ7mk9L1KKk7N2kk5L8n7J1pPJ6l8J5K4K4j2Rm9ol
6806a7J9k3K9J4l3P6q6L4l7M7k3K4J0Kl4k0J7J4j7j4K9K1k8Jn2M8MRj5k5NK4n
6839bJ9j2J9KJ4j3pj8oK6o6M2rj5N3lp5P2ln4L5L7k0rk6K1j8K5l6J6N9n6Rl7L5
6874ak%L9l7j5J1k1L8k7J5MK4k0N4m1m0L1j9OK0L0oo8P4n2k9N4k3M2o7L1k6J4
6907gOJ4j9j4QMK1m1M1K9j7K2j6n8O6l8J9J4om5K1J6qL4r9K7RNJ6m5N0kj8lpN3
6943C2o8Q6q8M7M5p5m1L7L6k1O7p5j1PJ%M3L0r5M1j7J0M0q0J4QK7Kj5J8Lj4K6
6976B0l6P1q1LJ8k9M7n2J7J4J1n8N4K3qk1k0KK2l2j1J2K9oJ6l0K6J0k5L2n4L6
$$ plain form
7008 0 -18 -17 22 -42 36 12 5 11 -17 17 -10 8 -42 -26 17 37 -5 -17 -26 -33 -52 1 4 8 21 -10 -2 -35 -55 24 -2 35 15 -16 -33
7043 -33 11 39 2 -33 10 -38 -26 -1 -2 -8 7 -17 -24 28 -28 -49 0 8 9 -9 4 11 -25 -60 25 35 8 12 -13 18 1 -65 -34 -50
7077 -50 -13 0 15 55 -2 -8 37 -11 28 14 33 -41 -10 -6 12 -4 -15 14 36 -17 -2 -46 8 28 31 46 7 -18 38 0 -38 -20
7109 -20 -42 11 10 -23 4 14 -32 3 16 27 -8 -10 5 9 27 -19 -6 -21 -9 -9 -22 -3 -14 5 -24 38 6 -9 16 0 21 -46
7141 -46 3 9 11 -1 6 31 -48 -6 56 17 -31 5 9 13 -14 0 -16 29 -32 -6 -9 19 -27 0 3 16 6 10 4 7 -5 31 -2 42 -21
7176 -21 25 36 -5 23 -10 11 -16 -8 11 34 11 33 0 -17 35 -1 -5 -18 -13 -6 -1 -1 -2 4 49 -18 35 -48 2 19 29 41 -45 -1
7210 -1 -5 -33 -20 -2 -29 20 -3 43 12 30 -4 60 15 54 44 21 13 -4 -6 -15 1 35 0 4 -28 28 -18 16 -13 2 1 -5 54 6
7244 6 -1 -4 -5 -37 14 28 -29 -20 -28 16 -8 -14 16 1 8 19 1 -32 35 52 -26 -2 -16 -25 6 -4 -2 -16 21 -29 33 6 -2 -11 4 2 -8
$$ packed form
7008@j8JL9o4P8k4pOk8L4k7J8n0J6M3K0m2j2rpj9N3LMJ3l1Ql3k0P9k6L7k0l1j7
7043c3M4K8l7l5M3m8J2K5joJ5k4pN2n6k1M9QJj8J3Pl6l5Q5J0k7Mk5L1j7o6L1j6
7077e0L7J3J5M0n7oM5m8L9j4J9p4L1MJ8j6j1K9K2n3J5m4N4K0LJ5l9k5N6l8l8J8
7109b0k2N3jl3K7J0m6L5J3J1l5kJ5MJ8m6J3j5J2%j3J9j1J9k9O2l2j5K5j6K1o7
7141d6M9OKj2PK5p9M2O2l9m8L6MMk7J4j6M5o1K6lK8m6K7LJ3j0MoLj2L6l3M4o3
7176b1M6J1m1K8l3K1k7QJ9K3k3K2l3j7N2l6mj3NPN%jOM5o7N3q3N0J7J0J2q6M4
7210amk8J3J8k7M9k3M6l1J8l4O4m5L9j0k3qj7krJ6L4l5Ml2N6m6L4k9J5joN9m8
7244Fpljl2N1J4n7RqM4k4oL0j5PJ1j8l3O7J7p8K4j4rL1j0Kj4L7n0O2k7qrJ5kj0
$$ plain form
7281 -8 -27 -6 -13 -16 -28 -20 -12 3 -41 3 15 16 -2 -31 -26 -28 18 -41 -10 -55 12 -34 17 1 6 16 -22 2 -2 27 -17 1 5 -13 27 -23
7317 -23 -18 4 -12 1 -43 -34 10 69 -9 -49 26 7 44 -11 9 53 -45 -24 -5 -1 -11 -4 21 -48 30 9 -29 -46 -9 2 -8 -32
7349 -32 23 17 -29 -3 -1 -37 -15 -29 -27 -9 6 -9 -7 -19 -6 -19 5 0 17 -21 -14 0 -13 -36 -14 -36 -44 -15 1 -13 9 8 -13 -22 -9
7384 -9 -13 4 9 -49 -2 -12 23 46 -3 -1 15 -4 -1 -19 -61 -7 28 6 37 -33 26 17 39 -6 -20 19 -37 -14 -34 21 17 2 22 -22
7418 -22 19 6 -25 -33 -20 -11 -4 19 -10 -32 1 -24 -16 -6 36 -1 -41 -22 11 -18 13 -20 6 -27 -25 5 -29 21 6 21 -7 5 -14
7451 -14 -55 14 -17 15 -1 -4 4 -25 43 -22 -18 18 -3 -5 5 4 -36 -1 -17 3 -1 -59 0 -59 -7 -10 58 -13 -26 1 12 18 -32 7
7485 7 -54 -31 -22 37 6 -48 14 9 58 5 14 4 -25 7 2 -38 19 -18 -11 16 11 6 -5 30 -14 2 1 15 2 28 5 -32 45 -2 21
7520 21 -12 17 -45 21 -25 -16 7 -20 -4 24 24 -10 54 15 -3 30 6 41 37 -7 22 -9 -14 33 37 20 -32 -22 71 -17 15 6 6 -21
$$ packed form
7281hj9K1plj2QQJ5m4M4J2Jj8k9NkM6n9L1m5O7m6N1j6NJ0l8K4mK9m4J8Mj8M0n0
7317b3NK2j6J3m4RM4N9p8m0P5j9L7n5K0M4r8K1J9Mj0PK5o9P8k1l8j7L7J1j0k4
7349c2N5om6K6Kl6K2j4KJ8J5j5Kj2J3j3K4nJ7l8PJ4j3k3K2k2qK9J6j4K2jk1rJ3
7384imJ7Nn8M7j0L5K3m9KJ6j9Lj8m2N4L5k2L1p0N9rK2m5j4L9n6K3k0N5mj5K0m4
7418b2M1j3l1qJ3RPK3k9k2L3k5QJ0M2l7m0J9L3k9L1l3K6l3KL0l4N0j5J5k8J2j9
7451a4m1O9l1L2j6lQk9O8o5ML6k1kJ0jm0L5j6K0mn8N9n9N2lO8p1j3K7J1On0L9
7485Go1K3RN9l1n4O2nM9n3Rj0k9L2nm0N7l7PK7nnj1L5m4J6jJ4j3K6k3l7P7m7K3
7520B1l3K9o2O6m6RK3k7J6K8%l4O4l9j8L3k4L5mm4K9l1nM7Mj7n2J0R3q8L2r%k7
$$ plain form
7554 -21 35 6 -9 -6 4 -10 30 7 20 12 42 -8 17 -16 -57 20 6 66 -7 62 38 -14 8 -13 15 12 1 48 -1 17 20 51
7586 51 -20 -3 3 -52 21 -27 6 4 -12 1 -19 6 9 72 -28 -20 -1 -52 45 1 48 14 -1 -21 9 24 16 18 20 25 22 12 20 -15 0
7621 0 -7 -31 -7 -1 8 0 -9 32 -7 -7 -21 11 45 3 -26 -38 18 -9 -17 23 -42 18 -64 27 -7 32 22 19 -2 10 -52 -12 22 -7 7
7656 7 -16 2 3 -33 23 16 -17 14 -14 44 -30 -25 19 29 10 -38 53 -6 13 10 -5 15 -40 -6 -18 7 22 24 -6 -36 -16 21 -25
7689 -25 -8 1 30 -6 18 13 -18 -6 5 -29 19 13 -23 -20 -27 -16 38 17 21 -5 6 -37 22 1 -3 -10 -4 -38 0 -16 -21 -5 -40 10 -11
7724 -11 -28 -34 29 -7 -37 10 -28 -11 -51 17 -24 3 -10 -32 -22 -27 -19 6 -22 -10 18 -8 -27 -26 -19 8 35 -18 -6 -11 -27 19 -25
7757 -25 28 -16 3 -14 -13 0 -42 7 -58 -8 -20 26 -20 36 24 -37 -12 -9 -32 -6 -47 34 1 26 -36 35 12 -19 -45 -39 52 -25
7789 -25 2 -18 -8 -25 -4 29 21 2 -40 8 16 17 -10 -27 24 -44 9 27 -18 29 3 -1 8 53 -18 -11 24 3 18 18 -12 -31 42 -8
$$ packed form
7554b1N6k9j5LJ0j4M0k3J3qL0n0K5l3m1P7j4O0p3O9k4n2K2k1K8lj1M7m9J8LL1
7586E1p1J7On5P3m8L3kj6J3k0K5LO3j00QJ9n1R7m4M7l4j5k0L0J5qKKNlj0Ql5J5
7621@pk4K4ORqrM1l9%j4L2L4m2k9j2N6k7qM0o5O0q2R1l4L9j0lk1J2o2M0L4k9J4
7656Gk3J8Jl6N6pl3L1k8N8p4NM4J0j9m8R1n9J9lj5K0n5L4j2K5J5Kl0l0K0L7m6
7689b5J7RK9l6K4nl1J2J1l4M8ol6LpJ1N4k1Mk6J1m3N9k1mpOl4L8j6nJ6l5N0k1
7724a1j7oO3l6l0M7l8J7m0O8m1K7j3k2J0nQK5k8J2K8k6j9JPK7K7n3J2nj6M6m4
7757b5N3m4J9j7JJ3m2M9o5N0j2M6m6N6j2o1K5Lk3K6m1Q1l3K5o2P1k3l1k6OR1p7
7789b5K7k0J0j7K1L3qj9m2M8QJk7j7N1o8N3J8m5M7k6mRM5p1PL5k1J5%l0j9P3n0
$$ plain form
7823 -8 0 -29 21 24 41 -5 20 15 0 -33 30 -14 -15 19 47 -38 -3 -31 -11 30 -17 4 12 8 1 -25 23 -24 35 -36 -8 3 10 11 -10
7858 -10 35 -27 4 -15 66 17 -22 -31 -47 -38 -23 -13 27 50 -45 -14 8 0 27 -12 59 14 28 23 8 -21 17 7 4 40 0 -18 -14
7891 -14 7 22 24 -22 18 12 14 32 -3 72 -8 46 20 -32 2 -12 32 -3 -23 30 -28 11 14 -12 1 0 41 8 43 -5 -2 1 -2 30
7925 30 -10 32 -10 40 -24 -19 -18 -13 36 -20 44 13 20 16 -25 27 -8 35 -4 0 10 -53 54 -38 12 13 29 27 -13 10 11 36 -14 -15 -15
7960 -15 12 16 2 -30 11 53 -3 -13 -7 7 5 19 11 7 17 -1 14 -13 -19 30 16 27 -11 -18 3 13 -23 36 76 9 -12 19 -25 31
7994 31 -22 -9 18 26 -20 60 -22 21 3 27 15 21 28 -22 -17 -9 -5 -1 10 -38 -39 35 25 -48 20 -30 44 -2 4 -34 25 31 6 23 21 33
8030 33 -26 21 -7 3 29 3 -14 -1 -8 11 -10 2 -5 28 -21 0 21 -8 36 -1 12 -10 -1 -9 24 -35 -27 8 -11 12 24 5 25
8063 25 -3 -45 -24 1 -9 -28 -15 31 20 -25 18 18 17 6 -4 -9 32 -11 15 -39 13 -2 -13 -14 -23 28 -30 -18 -34 17 -2 13 -3
$$ packed form
7823hQk9N0LJ7m6K5nj5l3O3m4jL4K8q5L5k8K0M1m7K1Qmpk6M8m7N9p1K8J1PJk1
7858a0M5o2L1j9Q1m9l9rj6RJ5J0M0K3r5L1K2qK7l9P1m5J4nj5k9L8j0lL6m0j8M
7891a4K1J5Km6M0oKJ8l5P5q0N4k6n2L4j4M4l5k0N3n8L9Lk6J3jM1l3L5m8LLlL2
7925C0m0M2m2N0o4NJNM9n6O4l1Pmm1N2l5M3l9MJ0o3J07r2N0JJ6km0K3JK5n0j%
7960a5K7Mj4l2M1M2n6j0OJ4kJ4qmJ0j8J5k7oM9j4J1l8pK1J0l6N9M0o7k1L1m4N6
7994C1n3J3K7Qm6Q0q2M3j8K4j2OPn0NQMMJ1m8jP4j0p3O8n0P4m6Ol8N9Ok5J7kJ2
8030C3n9M7k8J0K6k6j7J3pJ9k1J2pL3m9K1K1k9M4l7J3k2RqL3n9QL5j9K3J2j9K0
8063B5k8m2K1K5j0j9J3M6j1m5M3%jj1j0nM1m3K6n4N2j5j1jrN1n8J2j6N1j9J5j6
$$ plain form
8096 -3 -24 -49 -18 -4 -11 -13 -37 11 12 -11 -16 -7 2 -33 -11 -45 18 -10 -7 -9 35 -39 -32 3 -13 -1 -18 36 25 2 21 -15 32 -34 -2
8131 -2 22 26 33 -11 14 -8 -33 -48 18 -21 -38 -18 -2 26 15 -41 -20 7 24 14 -29 16 -8 2 -30 18 -32 -12 -65 9 25 -14
8163 -14 32 -17 -4 -18 -1 4 -19 -19 -31 -38 12 -32 7 -36 4 7 2 73 19 5 8 -25 -66 -12 3 -43 -15 -28 -15 3 -15 -5 34
8196 34 27 -1 -5 1 -2 15 -27 9 -45 24 -8 -31 23 -44 -2 -1 8 -8 -17 25 -18 11 -15 -5 -24 -23 4 -22 20 -11 -14 5 -70 -2 14
8231 14 14 20 22 -3 30 9 -15 -41 -35 1 -15 -15 28 -14 -27 -20 -53 -22 15 51 -9 10 58 48 28 48 25 -3 23 -9 -19 25 22 -29
8265 -29 16 27 34 34 25 -13 23 -2 16 22 35 18 15 -12 -15 -7 -7 1 33 9 20 15 -16 -2 -19 40 30 6 -12 39 17 -4 13 -8 -1 26
8301 26 33 33 -23 43 -38 -29 33 -3 7 9 31 0 9 -6 19 20 -2 42 -17 -11 37 -6 20 8 39 21 28 -10 -26 -13 -12 -24 24 -15 -29
8336 -29 -17 37 7 -8 3 40 31 -36 31 9 -8 33 13 30 26 -1 13 -4 -17 -51 58 -20 5 24 13 56 33 -3 30 9 0
$$ packed form
8096ck1k5L1J4pkk4M8Jk3nRRl5K2l4O3k8LkM4p4PL5j6J2j7N4j1k3J9l6M7o6L2
8131bK4MPm4K5k2k5j5O6l9j7K0J6K8j1n6K1K7J7j0m3M5k4J0l2M8n0K0n3P4J6l9
8163a4M6m9J3j4J7Nk3%j2pN0m4L9m3M0LnP1n4j4Ll3m1N4J5m6K8j3J3J8j8J0L9
8196C4pk8mOlJ7m2L6n4O9l2k3N4o7M2JRj6rM2m3K9k6J0j9JK7k6M2l1lJ9p5O8J6
8231A4%OKk5L3k1k4k6OL6j6%M3m2j3Pl3L1L7L6o0J9M8j0k0K0k3k8K6l2j0M4ln1
8265b9M5J1P%rl8L6k5J8OJ3j7lk7lQ%QL2k4J1nl1J4j7N9j0k4j8N1k2k1J7k1PK7
8301B6P%n6O6q1RO2l6J0KK2l1Rj5K5Jk2M4n9OM8m3K6j2L1j8Pl8j6J3Jj2M8l9j4
8336b9J2N4l0j5J1L7ro7O7k2j7M1k0J7mk7J4j7j3l4J09p8K5J9j1M3k3l6L3k1r
$$ plain form
8367 0 4 -7 -41 3 30 11 -8 34 46 -11 10 -19 -38 21 15 8 43 23 -10 -11 -11 14 -11 7 -11 28 -29 -5 -6 0 59 28 18 33
8401 33 0 -1 -21 -40 8 -16 17 -24 -1 35 3 -43 -46 4 38 -4 20 28 -1 -18 0 -11 20 -4 0 -12 35 9 47 -5 -18 19
8433 19 -55 -28 -5 -44 16 2 0 7 7 16 41 -9 9 -32 -44 28 -33 43 5 -16 11 -29 63 3 -5 -19 11 5 0 39 3 19 -52 23
8467 23 11 18 10 -3 -10 0 -22 3 29 20 -22 9 -28 36 29 -8 41 -28 48 -36 40 -13 -5 7 13 11 -23 -5 3 -58 17 -35 -10 0 8
8502 8 14 -17 1 -26 47 -42 44 39 40 14 15 -34 23 53 -24 -7 -15 -28 -14 29 -20 4 25 11 40 -3 -3 -22 24 4 -13 -17 18 -1
8536 -1 8 30 -53 -18 36 -43 13 0 -13 13 -7 36 -42 -30 35 -25 -53 -32 -18 -22 -18 63 46 -20 -25 12 -24 59 29 20 -46 16 -6
8569 -6 -39 -13 -38 13 2 0 -3 -14 -14 4 29 10 5 5 45 22 -30 60 6 3 -25 8 77 16 6 -44 18 3 -1 52 -12 7 -16 -3
8603 -3 -27 -13 4 -19 -30 -8 -4 5 29 -30 -3 -19 -19 35 -13 11 11 43 27 -25 19 -14 -16 18 22 -20 18 18 -7 16 9 35 4 -5 46
$$ packed form
8367@Mj1l4M4K7j9j9M2J2n7K1k9j9N9opL5k0l3j%K5k5J8j8L9n7K4jON9l1j0J5
8401C3l3jk0j9M8k4L3m1K3L6l2m6lN0L4m2K4Qk9j7J8j1L1k4Mj2M7k6L8n2j3L7
8433A9p4K7K3l9O0j4kP%RK5n0J8m1j2P2o1P6l8k1K7m0R2o0qj4L0onL9l6J6p1P5
8467B3j2Pqj3pJ0k2K5K6rm2L1l7O4pl7M9o9P6q4P6n3QJ2Okl4J8Qo1P5n2K5J0Q
8502HOl1J8k7P3q9Q6nJk6Jm9N7L0p7J7qj3J4M3m9K4K1j4K9m3%j9M6k0j7mL5j9
8536aRK2q3L5N4p9N6j3j3K6k0M3p8J2O5o0k8K1J4mMQ1j7o6nL7l6Q3l0ro6O2k2
8569fl3K6k5N1j1klj1%J8K5j9n%M0k3n2R0n4lk8L3O9o1j0n0O2j5mN3o4J9k3J3
8603ck4J4J7k3j1K2MRK4n9K7j6%N4m8K4%L2j6n2M4l3kL4Mm2L8%k5K3pK6l1rN1
$$ plain form
8638 46 15 33 7 53 15 -24 -3 55 4 -22 26 31 51 -2 6 -35 4 -10 7 -11 -19 0 1 -13 -1 2 -13 2 24 -9 35 30 -4
8671 -4 20 35 -6 7 39 15 -16 36 22 -11 10 20 48 31 59 25 18 1 -14 -14 16 70 5 42 -23 -9 -40 2 0 11 37 -18
8703 -18 33 -4 11 -6 32 11 25 22 -11 -35 -18 33 -10 6 -12 13 2 28 -23 11 32 0 42 28 34 -9 -2 39 -1 27 2 13
8735 13 29 23 22 12 12 -34 5 13 4 47 1 20 24 -10 -20 13 10 19 21 41 10 5 8 8 22 17 -51 2 15 25 19 -7 32 -31 31 -10 14
8772 14 32 2 16 19 26 8 -26 23 -26 18 10 8 -26 22 -12 -3 -16 -27 51 5 -48 -48 7 20 -19 -4 56 17 -13 -9 14 52 -16 -13
8806 -13 25 17 12 -49 -13 13 23 -35 12 -1 1 2 -28 37 9 26 24 -17 18 27 58 -14 11 -11 -24 54 -28 4 -51 -2 11 -24 48
8839 48 14 8 -33 -34 2 24 -13 -29 5 -14 28 -19 44 -21 13 -2 -23 -2 11 23 -8 -17 9 24 14 12 -56 -23 5 17 -16 -15 -16
8872 -16 4 -47 -12 21 6 -6 41 -13 3 -23 -27 0 19 -43 0 -1 23 -4 34 -24 27 17 -2 21 3 -15 -41 -12 1 32 -25
$$ packed form
8638D6l1J8k6M6l8l9K1N8n1k6M8NK0n3Qm1L9j4J7j8qJ9Jj4J2Lj5J5K2l3M4nl4
8671dK4J5m1J3L2k4l1N2j4l3K1J0K8j7K8l4pj7j5%L0N4o5L7o5J4l1M2kJ1K6n5
8703a8N1l7J5j7L8k1J4ll3k4J7N1m3J6j8K5j1K6n1L4K1l2M2j4Om3PM1m0K8k5J1
8735A3J6ojj0%m6L9QrM3m6J9Ml4j0L3lRKK0l1nL%J4no8N3J3J0ok6L9o3O2m1K4
8772A4J8l0J4LPj8l4M9m9M4qkl4M8l4Rj3j1P8m6n3%N5J3l9J5O0l9l0MK3L8o8L
8806a3L8qno1L6K6J0n8M7j3KJl0O5k8J7km1L5RL1p2K5k2j3P8q2L2n5M9J3l5P2
8839D8l4om1jL6K2l7j6L4j9M2m7O3o5L4j5k1K1J3J2l1rK6J5j0ko8L3K8J2l3Jj
8872a6K0n1L5L3j5j2M7n4J6k6mK7J9o2M3jK4k7L8n8N1j0j9K3j8j8k6K9J3L1n7
$$ plain form
8903 -25 -39 2 -8 -11 -7 44 48 -14 -18 7 -12 18 32 54 26 -9 -35 -37 -53 22 -57 -2 -19 12 12 -15 33 -10 -4 -29 -9 -5 -41 20
8937 20 -48 30 36 -17 19 12 -32 -10 7 -16 -19 -3 -26 30 27 -31 43 -22 -25 -11 -40 -13 19 31 -18 4 12 8 17 -16 -27 -17 5 11 -29
8972 -29 4 -26 -20 -3 1 -22 25 6 10 -22 -32 14 -6 -3 -10 -36 -1 -4 -34 6 38 7 4 13 -7 4 -2 -6 46 -13 -27 -36 -8 4 -37 28
9008 28 15 16 -30 42 -5 -14 29 -27 13 -7 -23 -2 13 62 17 29 -17 0 2 23 36 -8 -8 -33 -30 -19 -3 -8 23 1 6 19 -15 16
9042 16 26 1 27 18 36 4 39 39 -9 11 -36 0 30 20 25 -16 12 -14 -2 12 -8 -29 70 23 13 -38 9 4 14 -27 12 7 -30
9075 -30 -6 -13 -17 2 8 13 -10 -2 -20 38 -3 -5 12 -5 -10 9 25 1 -3 -5 27 11 15 -13 13 27 57 -51 114 8 18 3 1 -4 8
9110 8 -15 -28 -2 -11 -14 45 14 4 -33 2 46 37 9 -32 53 43 -13 -16 2 -12 -1 45 1 50 -4 -5 18 38 -2 8 -21 17 -42
9143 -42 46 -9 21 36 31 -1 -13 30 36 21 -26 28 0 26 24 -25 -18 31 -46 -8 -27 35 -28 -19 2 -12 51 56 -12 -4 -20 -8 32 -26
$$ packed form
8903b5j4M1j0lMN1Mo2mK5j9L0J4K2k8l5k6kj6P5p9N5j7L1%k7M8m3Ok5K0Ml6O1
8937B0o8P8On3L6pm4K2J7k3lJ6k3N6ln8P4o5lJ4k9K7L2J2m9K2QmRl3j1J0K2Om0
8972b9L3l0OJ7Mk3M7j9Ml2j0M6k0Lpk6L5ll0M0L2l1lRk0J1omN2n9j4rK8J2m1O5
9008B8j3Jm6P2m7rM3n6M0k0j6K1J5M9m5J2m6J7KK1J3m4%k5LJ1J6nL1k2NJ3l4L1
9042A6J0k5K6rJ8l2L5%m8K0m7L6L0j0Nm1K8k6J2J4k0k1R9m7j0n1M7nJ0m1L9nl7
9075c0K4pmJ9ONk3Qj8N8m1kJ7j7nJ9J6k4mkL2j6Mk8K6J4L0j08J65j06J0j5knJ2
9110Hk3j3K6rlN9l1j0l7L5M4rk8m1Q5j0n6lJ8j4J1M6m4M9n4jK3K0m0J0k9L8n9
9143d2Q8n5L0J5nl2j2M3Oj5m7N4k8K6km9PM9p7L8j9O2o3RK1j4O3No8Qj6J2M0n8
$$ plain form
9177 -26 2 4 -28 3 25 -11 -14 27 -28 -26 -45 25 -16 10 -8 29 4 -38 28 14 39 11 59 -9 0 -51 1 38 -13 -2 5 8 -10
9210 -10 -23 6 5 11 41 -1 -2 -2 54 -2 12 -32 11 6 -57 48 -19 36 -14 -13 -6 -26 15 -11 23 1 -14 18 14 43 22 -21 -30 16
9244 16 12 15 11 13 -4 13 2 -23 -25 -29 -22 -13 -8 -28 26 -17 -22 -31 -32 -34 -23 46 1 -19 -40 -16 -2 -5 -31 -36 26 -6 -38 -41 -49 12 -43 -53 32
9283 32 -46 21 -25 -58 -9 14 12 24 104 -30 54 -30 11 -42 -28 -26 -26 -5 -36 -27 68 -21 -23 14 -16 -16 7 25 -26 1 -57 19 18
9316 18 34 4 -28 -18 -22 -14 -14 -9 -38 -4 -57 -4 8 -60 -18 -33 -11 -2 26 16 2 -19 40 19 -6 -53 -34 -24 -29 -11 -1 58 19
9349 19 13 -1 -19 18 -14 26 -27 -11 12 2 -10 -7 -50 2 -13 20 9 20 -15 -1 -45 -38 44 -4 3 25 -14 -50 -15 -9 -18 30 -1
9382 -1 47 -6 3 -2 13 10 15 21 12 29 -15 -16 8 -59 -30 16 -23 16 -18 7 19 -5 36 -3 10 6 11 -8 51 21 75 11 -21 16 -14
9417 -14 50 35 15 -6 1 -4 -28 -19 -8 36 -21 -33 0 -17 33 11 34 27 27 25 21 -14 3 -28 -47 7 -1 26 19 53 -16 14 45 14 56
$$ packed form
9177b6K8Kl2L1K2l6lM1n5Kj9P0m1K6j8L7k5m2O6j4K5k8M8o8Rn1N2L7n1J1PLj8
9210a0j3K9jOL0m2j%N6n6J4m4M3no3J05o7N5n0JPk0M1k6L4k2j5L2mK9k1m3rM6
9244A6mLmKj7J7j1k5kmPRNk0N4m3nrjkJ1O9m5k0k1K4J4lk6nO2l2l2lqO1n5j0Q5
9283C2p8O7m6l3M9K3kJ2Q0j34Q4q4M1n3J4K%K1l1RR5q9kL7l0%K3J8n1K7n8P6j
9316A8J6l0l2J0mQ%Nk9L4n3N3J2o8M2j5K2RK8j0j4k1N9k1k5m7J9J0nJ8J0N9l9
9349A9oj4j8L7l2M0n3J6K3j0j2Lm3N2j5L3j1J1l5J4m4PQ2m8PK2l9l6L5OrM8l1
9382aM8n3RnJ5lNOrJ7m4jK4o7K9M6l9L9l4K5J2k4M1l9J3mNj9N9l0N4o4l2L7l0
9417a4O4j5k0k1Pnk4RJ1M4n7j2L3j7N0k2K3p%kml5J7l1j9N4qK7pL4o9L0L1l1M2
$$ plain form
9452 56 -47 32 10 38 12 -4 -5 -22 43 -14 -15 21 30 19 0 -58 -28 46 27 -19 24 16 33 17 27 2 -30 39 7 52 17 -32
9484 -32 -16 1 17 -52 0 6 40 -35 4 49 22 -49 -16 2 -18 -16 0 -14 -4 -25 1 3 39 -31 -8 -52 -1 19 4 -15 28 -40
9516 -40 12 16 35 -2 3 25 -12 20 -7 -7 6 21 -25 29 -34 -7 -3 9 -5 23 -16 -8 36 19 17 -33 17 -26 -34 28 10 -13 -24 9
9550 9 8 -26 -1 -16 3 -48 6 29 21 15 16 21 -5 14 -15 -9 31 -3 18 -2 15 25 1 -15 -20 14 -14 -8 -55 23 12 -24 34 1 25
9585 25 13 -12 -39 13 -49 -45 14 -61 25 -33 -61 16 3 45 -45 -5 -2 48 -18 1 -10 8 -31 -21 34 -2 -21 1 -6 -4 -43 3
9617 3 2 -1 -24 -25 -34 4 21 -10 33 3 -36 2 41 -7 8 -29 -40 10 -3 -28 -7 7 -23 -7 -4 -6 -6 -47 -5 -33 9 -1 -3 -9 -34
9652 -34 11 -5 -55 19 -20 16 -10 -31 8 -10 -29 31 25 -35 1 -32 -34 19 -73 -4 17 4 26 7 33 -22 -2 -27 -30 9 -29 1
9684 1 8 36 -9 20 -10 -33 13 3 -52 24 -17 -46 -5 -23 -24 -34 13 -22 -23 -22 -3 20 -37 17 -12 -44 -4 -62 36 24 13 3 7
$$ packed form
9452E6j03P9k2K8k6j6jj7O5n7jL6Rj1j9n8L0P4j9m6M3qJ7j6J0k5l2O9l2M5l5m9
9484c2J6J7J6o9N2OL4p5L9M5k7p1L3J8k0KJ6j4J0k1K6KL6p0K3m4N1K0j5j9M3o8
9516d0N2MJ9l7NK2l7L2k7%J3J5m6N4o3K7MJ2j4K8l9QM4j7kn0N0m3qO2j8k3j1L3
9550Ijl4K5j5J9n1N4K3qoJNk6J9k9OM0l4K1k0J7J0k4j6nL4k8Om7P8j1l6N8l3K4
9585B5j2k5k7N2o2MN9p5Q6n8k8P7j3M2r0M0LN0o6J9j1J8l9J0N5l6j9K2pKl9M6
9617Cjlk3jrL8J7l1M3l0l9L8L9m8J5l7j1N0j3k5K1J4l0J6Lk%m1M2k8M2j0kok5
9652c4M5j6n0P4l9L6k6k1L9j8j9O0oo0L6l3kN3r2O9K1j3K2j9K6n5K0k5lL9l8L0
9684APK8m5K9l0k3M6j0n5P6m1k9M1j8jj0M7l5jJJ9K3n7N4k9l2M0n8R8j2j1j0M
$$ plain form
9717 7 -4 21 -9 -30 -5 0 -1 -72 -14 -4 21 -3 -5 18 14 18 -1 22 7 -35 37 13 11 11 -4 34 -32 37 -17 -26 44 31 -2 -6 30
9752 30 -18 -29 20 15 24 -28 -30 -29 22 9 -15 -11 -40 26 -47 -35 -3 31 21 0 -1 1 -9 7 -47 6 22 -12 2 -1 -29 -7 40 37 -17
9787 -17 3 -7 36 -28 -24 17 -30 -62 -32 24 8 35 11 3 22 10 13 -47 38 31 25 44 -1 25 1 -20 0 -11 -25 -13 17 7 -15
9820 -15 39 18 10 -2 28 1 4 32 12 0 -17 -1 26 0 45 9 16 -32 -8 -30 8 -4 -19 3 6 -1 -5 -4 -38 48 22 13 25 30 16
9855 16 -8 3 3 -18 10 -13 11 5 31 27 -34 -14 9 -1 -8 -27 -15 13 -19 27 -11 23 -7 19 14 10 28 42 34 15 29 6 -18 -3
9889 -3 -27 -36 11 27 33 31 32 14 40 7 31 45 -4 15 -6 34 10 -27 15 -53 -12 -36 43 -47 -11 7 -46 -10 16 -4 -20 23 -44
9922 -44 6 -22 -30 -1 -16 -24 -20 -24 -15 -6 3 -30 6 -3 6 -8 5 -40 24 6 19 -14 -18 22 -24 19 -56 13 26 -20 -5 14 -27 19 -13
9957 -13 -8 -7 40 1 0 10 -17 7 15 -34 -26 -10 11 -3 -7 -24 -59 11 -5 -51 46 -21 5 17 -29 7 -19 -22 -18 60 -49 -18 39 2
$$ packed form
9717Gj1K5l0k1K5Njp1N8J0K5k4kK3mMj9K3j5m2P2k4k%j5L8o6O9n4rP0j3l3mL6
9752C0m8j1M9nRn2kJN1j3k4Mk9O6p3J2L2L4j0k1jKj0J6n4N3J6l4J4lk8K2M7ln4
9787a7K0j0M3o4MM1m7l2L0N6j6K7k4qJ9j2Lo0Q5poJ9m5K6k4k1K0j1j4J2L0j0k2
9820a5N4k1qj2L0k7LK8k0j2j7J6K7k6M5l6Pm8K4k2L8j2j5K2LpmJl4Q6k6rJ2Nj4
9855A6k4J1%k1K8k3K4oK6mo1K0K3j0pj9J2K8l2M6l8L4l0K6nmJ8J4qj9J4k3k4J5
9889ck4rM7J6OkJj8K6l3K4J4m9J9k1M0k4l7M2o8M1k4P9r0L6J8n3L6K6k0j6M3o7
9922d4N0k8qK9j5qMmRRRl3L6rRj4J3m5O4j8J3l3mM0m6M3p5O9J3m6J5J9m1M6l2
9957a3NJM7l9jJ0k7K4Qm9QJ6K1j4mj7l5P0j6m6R7o7K6J2m6L6k6lMP8j09L1N7l7
$$ plain form
9991 2 -9 -46 -19 -38 -24 33 8 -31 -40 -6 -19 -21 -17 -38 4 -23 -1 0 -4 3 44 27 -13 -14 0 -34 39 -38 -23 -23 4 -48 -19 -10 -35
10026 -35 9 -2 5 -37 -10 -15 22 -13 33 33 38 -26 17 22 -17 33 4 -16 -9 -1 8 -34 -30 11 66 -1 -13 -26 -19 11 -29 -2 26 1 16
10061 16 3 -5 50 -45 -49 1 -24 -16 1 -4 -16 -15 -30 5 -13 -12 42 5 9 28 -4 17 -3 -44 5 -14 7 -13 -17 45 26 4 -21 26
10095 26 3 -3 39 6 8 -53 20 -36 -43 -24 -50 13 -4 36 2 6 -9 -15 25 -4 30 47 -6 33 32 54 -11 12 -44 -10 -16 -12 -12 -46
10129 -46 23 37 19 -7 35 -13 30 2 -5 28 28 4 -3 -21 0 8 26 -4 17 8 10 -21 -5 -76 -15 41 -26 14 52 3 -49 41 -27
10162 -27 15 -2 -20 24 -17 23 26 22 8 -11 14 -2 30 -16 29 0 -4 6 9 29 -10 21 15 5 31 -12 22 -9 -8 32 -9 48 -10
10195 -10 27 39 18 -15 41 15 -26 18 26 -9 9 2 21 -12 30 -16 14 27 -9 14 4 18 10 -14 -11 24 21 -17 16 11 6 7 -32 35
10229 35 0 16 -28 52 2 48 -28 -9 -47 -3 4 10 2 -31 -7 7 -26 -47 -23 -29 -43 11 -64 -14 -26 -2 -17 -19 28 -21 15 -53
$$ packed form
9991Bj1l7K7j9J4N7k5l9rL4j3kMk1M2k7K2JmPM1j7m0jJ4l4P3p7J5%K7n2K9Rk5
10026c5M4j1Pm2K7nL7l5M6%No4M3Nl9N0k9k0PQRm2MM1N5o7j2j3PL0m0K7K8k5J5
10061A6j3qN5r5mN0k5QJ7nj2Jj5L5j8JN4l7MJ9l2K1k0m1M9j9K1k0mO2j9k2k5M7
10095B6k3oM2l3Ko1P3n6pJ9k6O3j7M0l4Mj5oM0k9L4J7n3L9jK2o5K3n6L4oM%l4
10129d6O9J4j8k6M2m8M3k8pL3%k4pj8K1QJ8l0K1rKl1J6p1O1N6o7M0L8m9n2R0o8
10162b7M2j7j8M4m1M0Lmj4j9K5j6L2m6M5k9mJ0LK0l9L1oj0K6m3L4l1JM0m1N7n8
10195a0L7J2k1l3N6k6m1M4Ql5J8pJ9l3M2m6L0J3l6K3j0J4qk4LL5ll8L3nnJl9O7
10229C5l5J6m4Q0n0M6p6J9l8M4POql3K4J4l3k1K4oj4N4p5N0j2K4j5kM7m9L6o8
$$ plain form
10261 -53 8 -34 11 0 10 11 -33 56 52 -3 14 -1 -1 -12 13 -53 22 -8 -17 -12 -26 -12 2 38 3 -38 25 -43 -16 11 -13 -68
10293 -68 21 1 32 8 19 17 13 21 -11 -45 48 -5 31 -17 4 16 -9 17 -39 -13 5 -16 -16 -4 24 -20 37 -17 5 -27 1 -29
10325 -29 -27 -31 -7 -25 21 -7 -2 2 -35 0 2 28 -4 22 -4 -15 19 5 16 -34 -11 -26 -4 30 -27 1 48 -32 22 -3 10 15 -2
10358 -2 -11 21 -6 -32 -12 -39 9 3 32 -26 -1 -2 20 -1 42 1 -19 -13 51 -15 -10 -13 2 -16 24 7 -47 9 47 10 32 -10 -10 -8
10392 -8 3 35 14 6 -31 28 22 -52 -14 -26 13 -25 -9 -8 2 -11 -60 -10 1 10 -10 -2 -20 21 -29 -4 22 -25 -1 4 -38 -43 -27 -6
10426 -6 18 14 -11 -6 2 -20 11 1 8 -50 -28 19 -19 -30 -43 -35 4 -16 -35 -12 10 3 0 -15 22 -17 -37 -34 59 -27 -1 -19 -27 3 -42
10461 -42 -24 -10 3 -15 11 0 2 26 0 -17 5 -21 -42 13 -25 -17 -21 -1 37 25 0 46 9 1 -25 -15 -34 5 14 -18 59 27
10493 27 -16 -11 13 -50 20 18 23 -19 24 -48 18 -52 5 17 -9 40 -17 -6 -32 7 52 -25 12 -10 5 -7 -3 19 -35 -9 -22 18
$$ packed form
10261e3O1m2M5j1J0Jm4Q9mn5J7j5%j1K5o6P5l0rNj4J4J4L6l5m1O3o8K7K7k4n5
10293f8Q9k0L1k4J1kmQl2l4R3n3L6m8K1J2k5K6n6K6J8k1%J2K8m4N7n4K2l2K8l0
10325b9KmK4j8M6k8NMl7L5KK6l2K6k6j1L4j4J1n0K3j5K2L4n7K8M7q0N4k5J3Nj7
10358brL2k7k6K0k7M8oK9n8K5jK2k1M3m1k0OO4o6NlJ5j8M0j7n4N6L8l7K2m2%K
10392hJ1L2k1ql7N9op4L8j2L9l8J6JJ0j3m9N0J1Rk0Qj8M1n0K5K6m7K4Nm2nJ6K1
10426fK4mk5NQk2L1j0Pn8K2M7l8j1j3QL9k0j9K3K2plj5L7l9k0LR3q6K6j8qL0m5
10461d2J8J4J3j8K6j1KK4k6j7K2k6k1N5l8QmK0L8j2k5M6l7qk6J0j9L9Rl2P7l2
10493B7m3NK4o3P0kNm2M3p2O6p0N7J2k6M9n7J1k6L9M5p7L7k2J5j2MK2n4K6j3M0
$$ plain form
10525 18 -28 33 -19 9 -13 10 10 -23 -11 -9 16 -12 -22 35 2 15 14 -28 21 -37 1 -36 13 29 23 -16 -27 -9 5 -4 -27 17
10557 17 -10 1 10 -4 10 37 -37 2 -15 -17 -14 -6 -4 -29 17 -29 44 18 -43 6 -9 -17 7 11 29 21 43 -9 7 17 18 19 -19 0 -23
10592 -23 10 3 19 16 32 21 -26 -19 -11 17 -4 -10 -13 -36 -9 13 -23 12 12 29 -25 -24 -49 -23 30 -29 -31 -8 -4 11 -16 -7 17 -1 -20
10627 -20 6 17 -10 18 -3 -48 -21 -53 40 -28 50 -5 3 -50 -6 -19 2 42 -18 31 10 -23 -2 -4 15 0 46 -41 23 19 -13
10658 -13 17 24 -19 4 -17 39 -17 43 -38 -17 -20 -2 -26 0 54 29 -11 6 17 -17 -16 -9 -7 -55 34 -9 18 14 18 28 16 -16 -14 -25
10692 -25 -18 1 -23 -52 52 -24 -8 -10 5 4 -10 -5 -4 -22 7 14 4 6 57 -30 24 17 -53 29 -4 -3 45 -12 15 -3 29 -8 31 -28
10726 -28 -32 20 -24 2 -27 -3 -28 27 -8 15 21 8 1 -41 15 -54 -33 -11 -2 -12 -6 -10 63 16 -16 29 2 -37 -39 -22 18 -2 -14
10759 -14 31 -36 17 12 -13 19 24 15 19 -67 -4 -4 22 2 11 0 -43 -19 -37 -8 -26 9 3 -32 28 9 -3 -5 7 14 -56 19 -21 -33
$$ packed form
10525A8m6O1n2K8k2K3%l3J2KK5k8j0N7l3J3jm2M9n8L8l7M9J6ol9j1J8J4rk3M4
10557A7k7J1Rj4J4K7p4L9j7kLQKk5M6m6P3k6o1M9j5qK4MJ8qK2n2J6J0JJl8J9k3
10592b3L3pJ6lJ6j1m7PQK8k1olk3K7K2l6L5%J7n4Jk5K6N3n9kK3MJ5k7RK4j8j9
10627b0K6J1k7K8k1m5K7l2R3o8P8n5Qn3M4j3K1M0o0M9k1l3K1kJ9j5M6q7O4ml2
10658a3L0Pm3K3k1N6n6O0q1K1lJ8k4K6N4k5m0J7J1l4JPKm8Q9m3K7mMJ0j2l2Kj1
10692b5PJ9k4k9J04p6J6kJ5jj4NJj8K9Pj0KN1q7N4pp0Q2l3JM8n7K7j8L2l7L9n9
10726b8mN2m4K6k9K4k5N5l5K3Oj3pm2N6o9K1K2Rj0OmP3m7l2M5k7l9kJ7M0k0j2
10759a4M5o7N3nk5L2NrMq6O3%K6k0Rj1m3K4j8K9j8L5ol5O0j9j2kJ2Pp0P5m0j2
$$ plain form
10793 -33 -46 -23 -34 -30 -6 -19 -6 -24 -18 -3 -13 13 -33 20 18 9 -58 -19 20 -15 14 -71 -63 -26 -4 21 -14 7 -33 -7 14 -46
10825 -46 -1 1 36 15 -14 -48 -7 11 -23 23 -95 -13 -38 -12 50 2 2 0 23 -16 -8 19 -40 -7 -55 -2 34 41 8 -39 -44 -51 7
10858 7 -7 -22 -48 -20 16 -4 6 -18 18 -4 -22 0 -9 1 -20 -1 -10 -13 34 6 -7 -32 -13 15 -7 14 36 -18 -14 28 -8 20
10890 20 9 3 8 -14 -38 19 10 55 -2 -23 44 6 -37 53 1 5 -35 -17 -5 17 -46 21 10 -76 -41 -17 -10 -13 -14 -39 -21 27 -1
10923 -1 18 -13 -63 -4 5 11 -53 33 -3 -4 31 40 12 17 18 32 -2 20 -69 -2 30 15 -27 15 17 -10 -2 8 -6 -10 17 23 -1 -7 8 27
10959 27 -5 17 21 -13 -11 -2 16 -2 4 -36 -12 7 47 -3 7 -30 2 -15 40 -1 17 4 -36 12 -3 -41 6 -43 0 18 19 -11
10991 -11 10 23 33 8 -28 17 6 -1 21 0 24 14 11 12 -9 -38 -9 35 -45 43 14 13 20 22 19 -15 62 -40 10 27 -17 19 2
11024 2 7 42 4 5 33 18 23 4 34 19 26 31 10 -6 -4 -20 -5 5 -5 -21 9 -24 -21 -21 15 18 -5 10 19 25 -12 -23 66 41 -37 27
$$ packed form
10793c3j3K3j1MK4j3J3j8OJ5j0K6m6N3kro7L9L9l5K9q5QL7K2K5l5K1m0K6K1o0
10825d6M5KL5k1k9l4M1J8l4M6j18Q2k5K6O2m8%kK3l9QK7n9L3m8N3L6Pl3m7npN8
10858Gj4j5k6K8L6k0J0k4L6k2j8K2rJ0k1J9rlM7k8j3k5J9K8k2K1K2n4MM2l6K8
10890B0j1oNk2k4N7rM5n7k1O7l8m3R0n2Mm0J8J2K2o3O7j1q6L5K4Pljk5J8M8k8
10923aJ9l1n0N9ROo4Q6l6jL5Rk8NJJ4l4K2q9O7L2j5m2M2Kk7QJ0j4mK7Ok4oJ5J9
10959B7l2K2Ml4KRJ8j8Om0K4J9M0n0J0l7L2j7N5m1J8j3m0M8j5l8M7m9M3J8Jl0
10991a1K1J3J0k5l6M5j1pK2k1K4j0lJk1k9K9M4q0Q8k9jPKll4P7j02N0J7m4L6j7
11024BNL5l8JK8j5Nj9L0j5PNk1j6Kj6J5J0j0j6L0l3L%L6Lk3J5ROl7j1Q9k5p8O4
$$ plain form
11060 27 1 4 12 43 0 28 -5 -1 -18 20 16 -5 45 21 46 18 -1 -2 -1 4 0 19 -1 11 -28 -9 44 -5 31 26 3 5 -12 30 1
11095 1 53 8 -15 -4 19 -5 -3 38 0 21 -6 -30 25 24 -9 -11 39 44 -9 33 -4 3 19 -21 -20 10 14 -9 -11 -22 -3 5 17 -30 53
11130 53 5 16 7 5 -7 4 18 -6 -7 -12 -21 37 1 -12 30 12 9 42 -15 -24 30 -13 34 17 -33 -29 -25 34 23 -4 -18 -18 -7 -4 10
11165 10 -40 -15 5 -8 5 9 -29 -47 4 27 -11 23 3 24 -21 -6 -51 18 -55 -3 -4 17 37 -17 -9 -15 12 20 -7 11 1 8 -12
11198 -12 -5 -6 17 -23 9 -17 -21 18 -13 45 -32 -17 30 -34 -13 -22 1 -18 -3 12 0 34 25 -5 -6 14 14 13 12 25 -9 -14 24 27 10
11233 10 -15 39 34 -17 24 -19 -24 29 -23 8 -25 -19 -9 5 8 -18 30 11 -5 -8 37 -2 -22 -52 -20 22 12 0 23 -11 -48 -11
11265 -11 3 1 -26 24 6 -50 -2 3 -21 13 -55 0 26 -25 9 -14 15 -20 6 15 16 -13 -14 -28 -2 26 3 56 2 7 30 -11 26
11298 26 71 13 52 61 5 29 11 34 32 32 -6 41 33 -4 6 25 3 32 24 27 1 -2 -43 21 13 24 -36 28 46 16 43 61 20 40
$$ packed form
11060B7k6LQL1m3K8l3Mj7L8mk1N0k4K5k8j9jJNmJ9k0J2l9J9N3m9L6nk3Kj7M2k9
11095AN2m5k3J1K3k4KM1l8K1k7k4N5jl3kN0Nn3M2l7PJ6m0JL0Mk3kj1J9QJ2m7Q3
11130E3m8J1rkj2J1J4k4jnrN8l6j3M2j8lL3n7rN4m3M7j7n0MMN9j1k7j4%J1LJ4
11165A0n0K5K0j3J3Ml8j8N1K3l8L4k0K1m5J5m5O9p3N2jK1K0n4QoK7Qk7J8j0Pk0
11198a2PjK3m0L2k6mL9l1N8p7J5M7o4K1rK3j9J5J5j2L4rl0jK0%jjJ3l4nL8Lj7
11233A0k5N4nn1M1m3nN3n2L1l3OJ0J4Lk6M8j9j6lM5l9k0l0L2M2j0j2K3l4l7L7
11265a1J4kk7N0j8n6M8Nk4L4o8N5K6n1L4k3K9l5K6RJk9jj4K6K8k3N3n4NK3m1L7
11298B6M5n8L9Rn6K4j8K3k%l8M7ql7J0J9k2K9qLk6lm1O4qJ1o0O4J8l0K7J8m1K0
$$ plain form
11332 40 -2 26 -23 45 -2 15 36 22 22 27 32 24 15 -23 9 22 -9 -4 -34 12 -6 -41 16 17 23 -7 13 -5 23 -50 1 28 -9 20
11366 20 11 7 10 -23 11 -13 -2 -15 29 2 13 25 -10 7 -32 -17 -35 -22 3 -28 49 3 76 3 -2 -1 -19 -15 34 -14 18 -6 1
11399 1 41 18 -27 -9 3 2 24 -18 -15 14 -2 -7 41 23 5 -28 2 20 -23 -45 11 29 21 32 -8 23 -16 -17 1 -24 -41 -9 -3
11432 -3 -10 -2 30 11 -3 -14 32 -49 -35 32 11 0 11 24 11 -8 2 -8 35 -22 1 -34 5 -15 29 -9 -34 -10 -19 11 0 -1
11464 -1 -35 -16 51 -9 18 12 24 6 -12 0 21 -10 2 -32 20 -22 16 2 -34 45 -35 21 -11 -3 -13 66 8 18 28 3 -35
11495 -35 -31 2 1 -22 13 13 18 3 1 1 -23 -27 15 8 1 -19 21 18 13 -6 -22 -20 20 27 -65 26 -5 -11 25 -43 29 -20 31 14 0 -1 17
11532 17 -7 -39 -39 25 -35 -7 31 12 -80 1 -35 6 19 -49 -30 9 39 -19 18 26 -80 -1 -1 -25 20 0 -7 -35 5 40 -18
11563 -18 8 -24 26 0 9 -43 19 -8 0 3 10 -31 1 24 -2 -36 -16 2 -13 -2 -27 -3 0 -13 -24 28 9 4 -19 41 11 4 -4 -8
$$ packed form
11332D0m2K8m9O8m7J7K1j4%NNqrl8L2J3l1Nl0M6j8l5N7JOl0K0j8K8p3N1K7l7K9
11366B0rmLl3L4k4J1j3M4k7J1J2l5J7l9J5j8J3K5l1P7m6P3p3nJj8MM9m8L2k4P
11399AM0k3m5J8J2jK2m2LK9j6nM8j8j8l3L0J8m3k2N6J8qJ1m0L1l9jJ8k5j7L2O
11432cpQL2j9j4j1M6q1J4O7k1j1J1J3j3j9J0j0M3n7K3l5L9k0M4l8k5K4rL0j1j
11464al4J9O7o0K7oJ2j8j8J2K1l1J2l4N2m2L8j4l6P9q0N6l2Qj0P9n8J0J0k5l8
11495c5ML3jk3L5%Nj5k%k4mM2ppk0M0lnj9j6KM0Pr2R1l1oL6o8P2m9N1j7j4jJ8
11532A7k4l2%O4o0K8L8j9r2Q1l6M1J3o8J9L9L0n8L7Qj06P9%k4M5k0pk8M0L5n8
11563a8K6l2N0k6Rn2O2k7QLPm1L2K3k6l4K0J8j5J1k5K4Lj3j1N2j9nk3O0l0pqm
$$ plain form
11597 -8 -12 -24 -54 38 -12 22 4 -32 -14 -1 24 -7 -9 -1 -20 11 -34 3 32 -13 -15 -9 -35 34 19 -11 10 -6 -15 8 20 26 27 14
11631 14 1 6 18 11 26 40 14 15 5 -28 -64 46 -7 -39 10 10 7 14 25 11 1 19 5 -12 -8 3 -15 35 -22 -29 8 -40 -4
11664 -4 -16 -31 -19 -27 -22 1 -4 -23 10 -10 -16 7 -11 23 7 -12 1 -27 22 26 34 16 -19 17 27 12 -6 -8 38 -56 17 -37 -14 1
11698 1 6 8 -4 -37 33 6 -9 -4 6 -31 16 2 -13 18 9 -27 -16 18 15 15 -54 -40 33 -19 16 11 -27 4 9 21 -16 36 -19 -16 -6
11733 -6 14 -8 -7 5 -43 57 -10 7 33 -27 -12 -18 -14 18 -17 -23 15 36 30 -8 -14 16 57 -16 -8 -16 -5 -2 10 -20 -17 -7 4 1 3 27
11769 27 -19 13 -19 43 -16 -3 35 -12 -16 -6 35 -39 5 43 29 7 12 14 15 43 15 -28 27 22 10 -12 15 5 10 -16 -8 -2 2 53
11803 53 -7 43 -10 -45 -1 -33 20 -36 10 10 -25 11 -7 20 -6 14 -7 -67 7 -22 22 -18 12 -7 -27 51 7 -24 -33 5 -32
11834 -32 35 9 -3 22 -5 -11 12 -6 -11 -3 41 13 11 46 -69 -13 -19 -11 -10 -56 -36 -1 -23 -10 -14 -3 -30 15 -38 -16 21 -21 33
$$ packed form
11597hmj2l0R2n0L4j8l6J8J3K5l1kQj9L1m5L7K9m5kOk6O9j5l0K1j6rK3J2OJj3
11631A4j3NJ2pJ5J4k6Jj0l3l6J10n3l2M9%lPJ1j4j0J8j4j7MJ1j8N0n7pL7m8L6
11664dj2j5J2qNK3nj9L3k0oK3j8L4j6j9J3k8M9MQj8l5L6J0j5j8kM6r4P3n4K3J5
11698ANKj2l3P0k7j5NJ0l7M7j4j5L1rl6J1L4l%o9J4P3n2L5nl8L1NJ2l7N2n5LJ0
11733fK0k2JJ2m8J00o7J7K6o0J5oML2l5oL8K1ol8oL0M1p3QqJ1LJ2l0LJ0J1lKK4
11769B7m6L2l2O2n9J3L8m7mJ0M1p4M4L8j4k2NKJK8k8m3N5nj2k2K7j0Nk6QOMN1
11803E3o0N0n3l5M4l2N3n6M6%l5L6j8K7k6K0k1o0P4k9M4m0L0j9k0P8m4l1rL8l7
11834c2O7k6j2K5k7oK3j8nQM4k8kL5j15N6oQJm6K0L5k2J3mJ1k7M5n3K2L7m2N4
$$ plain form
11867 33 -26 -28 -38 -13 -3 -36 2 -25 7 -61 -10 -16 -23 6 17 -3 -17 5 -7 17 5 -6 14 -43 -9 -27 -57 -6 -47 -31 -11
11898 -11 -6 -17 -13 20 -42 -30 -35 23 19 2 38 -24 51 -17 12 -10 16 8 10 11 7 -10 -11 16 1 -36 -19 -45 -14 1 -33 3 5 -43 -66
11933 -66 -2 -7 -19 -16 -10 -2 5 -38 -1 -15 -51 -10 -22 -23 -14 -26 1 0 -44 -11 24 -3 5 -37 3 2 39 -9 -13 0 10 8 9 -30 18 3
11969 3 12 -25 12 29 -19 18 30 35 -43 0 -60 -62 27 -19 -49 15 16 -58 -2 70 45 54 -4 2 19 7 -19 -49 1 4 -18 -56 -28 11
12003 11 -44 21 -13 -27 1 18 29 -40 36 -41 -10 21 -11 17 -10 43 10 -35 10 -25 -19 -18 7 -27 4 0 27 -19 -28 0 -24 42
12035 42 7 4 -18 -33 -16 -47 -8 12 37 1 -6 11 21 5 -3 0 -42 -11 -25 0 49 52 7 28 -28 -9 57 -29 12 7 -32 1 10
12068 10 19 -7 16 20 10 -18 -31 3 6 5 -31 15 -35 20 8 25 34 -23 34 10 19 19 -9 52 2 3 -31 -42 11 24 7 -26 63 -5
12102 -5 5 -5 -7 5 -41 50 1 -3 -12 -23 -7 22 6 24 22 29 8 -17 33 -12 -8 -19 -29 7 -1 -16 21 -21 7 72 14 -2 20 11
$$ packed form
11867C3n9kj0K5J0l3L8k7L2o8N1opK9J1k0j4K2j2K4j2j1K0n7L4j8l0N1m1J6K0
11898a1Nj1ML3o2J2nN8mj7L6o2P5o8K9k2K6qKJmj7jK7j5l7J7k6L1J5l4L6Km8k3
11933f6O4nj2LOQPm3L7j4l6M1j2jRj2K7jm4L3L5k7Qm2M0jL7m8mJ3J0kJl9M8j5
11969CRl7L7J7m8L7J2Np8M3o0kQ9m6l0O4Jp4N6P2k5Rn8OJ7j2k6l0N0Lk2l8K8L9
12003A1n5O5l4j4K8J7J1o9P6p7L1L1l2K8k7N3l3m5M5l5OJK5l4L1mK7m6rK8k4O6
12035D2l5lk2j5J7l1L9K0K5l6pJ7J0j6qLm2L1j4K5M9Lm5K1n6J9O6q6M1nl9L3R
12068A0Rk6K3Mj0k8j3L4Ljl6M6n0N5j2J7Rn7N7k4R%k8O1n0Jl4j1N3J3j7l3Q9o8
12102eJ0j0kJ2m6R1m9mrj1J6K9j6J8kPk1k5N0m5Mj1j0L6qj5L7m2K8O5n8j6K2r
$$ plain form
12136 11 -25 -5 11 1 -3 43 45 -2 17 9 21 -11 49 8 17 -22 -13 -25 -49 -35 0 -20 -17 -12 -20 10 -6 4 -1 -10 -4 -1 10 -29 -14 -2
12172 -2 -31 37 6 18 4 0 7 -33 -11 -18 30 43 -2 7 0 66 2 33 1 30 13 -9 31 -42 -2 27 29 23 -24 17 11 -13 -11 -20 -30
12207 -30 27 54 50 -20 -42 8 -50 3 -23 -33 35 -20 7 -18 24 12 15 -14 -2 -18 12 40 -12 -61 1 -1 -20 11 -8 17 4
12238 4 -31 -8 -8 17 6 -7 -6 4 0 46 14 1 4 12 -63 19 5 -25 21 -20 21 -40 9 -15 -32 -8 -2 -40 -21 29 4 -23 -18 62
12272 62 3 20 -28 -37 -23 -48 -6 -5 9 -19 -21 50 28 -31 11 -12 -67 -7 36 -4 35 -18 -22 -30 31 13 6 33 8 50 10 13 12 -14
12306 -14 -27 23 33 -29 -30 12 29 -29 -2 8 10 34 -45 -2 -38 -5 17 0 21 -41 39 -13 -33 9 -26 -32 -22 -9 -29 1 24
12337 24 -10 22 -44 -19 5 33 36 5 57 -46 17 -51 49 -29 -25 -24 -23 -9 -31 -49 -10 -23 -16 7 34 -32 13 31 14 -3 -29
12368 -29 -8 -9 0 -15 22 -30 -12 20 11 12 35 -1 29 5 41 18 58 7 13 4 -36 -15 14 13 -30 12 -22 6 -7 -33 16 14 15 -25
$$ packed form
12136A1l6K0J6j0mM6Km7J9qJ2l2O0m1Rl9Rj2k4J4L5k0LNqL0j6J0nrOLJ1l9J5J2
12172bk9O8l1J2j4mPm0K2pM8J3m5RpO6o4L1l2K9j7k2M0p3M0K9Kom7M1ok4Krj0
12207c0N7K7mp0k2N0n8N3k6j0O8n5K7k5M2j2Lk9J2j6L0K8n2m9O2kj9L1j9K5j3
12238Dl5K3%K5j1j3JJ0mM6l2j3LQp5Q2j4l0M6m1M1o1M9k4j7K4Ol8J9N0k5k7NQ0
12272F2n9J7m8rJ4k5M2JJ4k8kP1k2n9M2k3n5O0M3m0L9n3mqO1j8pK7k5M2m0Ljk6
12306a4j3N0J0o2jM2J7n8K7J0KK4p9M3l6L3K2j7K1o2Q0n2k0M2l5oJ0J3k0L0K3
12337B4l4L2o6K5K4K8Ll1N2j03O3o8J00p8MJJJ4k2j8L9j3PK3K7o6M5J8j7j7k6
12368b9K1jRj5L7n2J8L2rJK3l6L0k4L6k3M0n1Orm0K1K9jm3M2l4K8j3k6M9kJm0
$$ plain form
12402 -25 -29 6 9 5 25 -16 56 19 -27 7 -67 -39 54 -15 12 43 -9 -37 -8 21 29 -16 -48 4 -8 -15 -26 -18 0 15 5 -40 39
12435 39 -9 -16 -15 -19 21 -24 23 -15 11 -7 13 29 -27 -7 20 -32 -2 -2 -10 7 19 4 32 24 16 9 -15 16 -4 -23 47 7 -18 10
12469 10 -2 -6 -8 -16 24 1 -7 -19 -17 25 -17 -15 -17 -9 4 -12 1 23 6 21 -14 33 15 6 12 12 27 -4 2 8 -11 13 4 -1 -43 -25 -7
12506 -7 -26 -13 -46 35 10 23 16 -64 -59 -44 -20 10 -3 5 4 37 12 24 -14 21 0 -2 -32 -31 21 -34 13 10 -23 -6 -5 -9 22 34 24
12541 24 30 -26 -27 24 -5 19 -6 -35 -1 29 6 49 2 14 29 -1 -27 -57 1 17 19 -9 33 37 2 -12 36 6 -1 -46 -16 -24 24
12574 24 18 3 -14 -10 44 -9 51 23 -4 -47 -4 -6 8 20 0 3 4 36 40 9 -14 -12 -2 32 12 -9 -16 27 -6 4 -35 24 16 -13
12608 -13 17 -17 24 46 9 20 1 23 11 21 -15 -51 -7 -62 3 -8 7 24 -21 4 -9 -4 17 -18 8 -1 -21 44 59 -6 -25
12639 -25 -21 13 -10 45 -1 10 42 -43 19 28 1 39 29 16 -2 -28 -13 31 -14 -23 -16 2 -8 -12 7 41 -20 -20 -12 -6 27 -41 -12 -4
$$ packed form
12402b5mL5LmK0m1P2l7m6L4p4K8R3o9K7L1n2k8K9K9Qm5l2N2j2pj1QJ8J5j0m5P9
12435C9m8pJmM0m5M7l8K6j8K0J6n6K0K7n2L0%qJ7J2j5K8qqpk4L1k0j9P0m0k5K8
12469A0j2mkqM0k3qj2KM2m2KkQJ3j6J3K2j7J5l5M7j8rO%J5l1OOj9K4rnm2J8J8
12506gj9J3l3Q1k5J3pq0NJ5K4L0j3QjL3k5J2l8L5k1kl0JN2n5M7ll3J7JmL1J2j0
12541B4On6jN1k9K4k5k9L4L0k3M3m7J2J5l0k6l0N8J6Kk8M2Ml5j4M8l0pm5L0qM8
12574B4oj5j7MN4n3O0k8k7m3M3kJ4J2k0LJL2Ml1k3KJ0L4k0k1pM3l3J0l9N9qk9
12608a3L0l4M1K2l7J1j9K2j2J0l6l6M4n5O5j1J5J7m5K5j3NK1l5K6rk0O5J5o5j9
12639b5ML4k3N5m6J1L2q5O2Rk7L8j0j3j8k6J5M4m5rPJ8j0mJ9L4o1%QOL3o8K9Q
$$ plain form
12673 -4 16 23 -13 -32 -24 -25 -23 1 15 0 -32 1 -39 -6 18 -26 -32 0 -25 8 17 13 21 -46 -10 42 1 28 13 33 0 67 31 9
12707 9 5 30 11 -21 18 -36 -44 1 -30 2 -32 -20 21 7 6 -17 2 8 23 -34 -10 -17 -51 24 -23 37 -7 -34 45 -13 9 -45 29
12740 29 -47 -30 -25 38 1 -19 38 2 15 17 -7 9 -2 22 48 -2 -18 -19 -1 16 -41 14 1 0 20 -13 36 -5 -9 -22 35 -43
12772 -43 31 -4 -2 11 20 -22 -11 67 -27 -29 4 40 12 -38 6 3 1 -29 -26 25 14 40 31 -53 18 -35 16 -17 39 40 -24 12 -19 -19
12806 -19 -7 17 -15 -19 -3 21 1 -32 4 49 14 43 -33 -26 31 27 -12 12 -8 12 -2 -25 22 -4 -26 3 4 -18 9 2 19 -19
12838 -19 -6 47 9 -12 1 -41 -6 8 26 26 6 -5 18 -26 4 37 -17 38 -12 3 31 0 -46 21 -28 -37 4 44 -24 -1 -2
12869 -2 21 -12 22 -1 45 27 -10 34 -1 11 -21 -36 -26 40 -1 25 17 -6 13 32 58 15 -18 38 -16 -22 -33 23 67 -17 59
12900 59 11 -16 5 -33 9 5 4 7 -8 11 -9 4 -38 -28 29 7 16 5 4 3 -37 3 -10 10 15 35 13 14 12 -16 -2 20 -15 -3
$$ packed form
12673dK0Pl6j9QjKK4J4j5l2L3m0L3K4m4oL2k5L3RmQo7L6N2m1K7j5K0l3O7l6k2
12707ImK5j9l2L9n4qM5l1L2l4J2M1j4jk3J9OJ5n7K4pl4P5m7O0m4k7P9n8K2n4P4
12740B9p6J7NO3l7k0N7l6J3Kk4J6j1K4K6n0j6jJ8J7n7N5j3jK0l3M9m1mj3N7p8
12772d3P4l5KJ3Rm2J1P8r4kL3L6k8n0M4lkl0LN1j1K6rq4P1n3N1l3N6Jo4L6l1%
12806a9J2K4l2mJ6K4k0l3L6M5l5K9p6PN7ml9K4k0K0j4k3M7k6k2K9Jk2K7pJ7l8
12838a9J3N3l8k1J3m2L5J4J8%k0j1K3m4L0L3n4N5n0J5K8l1m6O7m9rM1M0o8K3j
12869bK3l3L4k3M6j8l7M4l5J2l2j5J0O6m1K6qk3J9J9K6m3l3N6n4oj1N6M4q4P6
12900E9m8k7K1l8M2mjLj5J9k0J3m2J0N7k2Rj1jjm0M0j3K0NK0k2Jkk8J4K2l5J2
$$ plain form
12934 -3 -23 48 41 17 19 9 -11 -14 39 -4 27 24 32 -45 -13 -12 3 -14 12 5 -31 -38 13 -13 -31 -10 15 5 -13 6 2 -23 -28 9 26
12969 26 10 25 24 11 14 -12 4 -20 16 -8 67 1 -3 22 38 7 -63 30 -51 5 -7 37 -8 -24 30 -58 -1 13 -4 1 -22 5
13001 5 9 -27 -16 -20 -2 -17 -4 11 44 28 -21 -4 8 46 -17 5 15 -6 21 2 3 -14 -14 11 2 22 40 10 16 -27 27 -45 9
13034 9 10 -2 79 7 27 -8 29 9 -41 -4 19 4 -35 33 4 -1 5 -41 18 -8 6 6 24 -42 17 9 17 -24 42 23 -55 -4 -13 -20
13068 -20 27 -33 19 30 -2 -6 -27 -15 -35 32 -31 -4 56 -13 24 4 -17 -13 -14 13 0 -52 -7 33 19 11 -12 21 7 -2 -28 -19 -8
13101 -8 -24 11 4 16 3 -11 -10 -23 -3 12 61 -25 -8 8 -16 19 -24 18 -13 -4 -37 -22 -12 24 1 -21 -2 -24 -74 -16 -5 -17
13133 -17 12 -15 -5 24 12 6 21 -49 -12 -37 13 -15 8 5 -17 2 -49 12 -4 12 15 -11 23 -13 24 29 7 -13 21 13 -30 -14
13165 -14 1 -23 5 -13 41 -29 -23 -6 -27 -7 12 -23 14 -14 -42 0 8 13 0 -58 -2 26 -46 14 4 -17 19 -51 -10 -37 34
$$ packed form
12934ck0P1pk4Kj0k0lN3m3L1lQp7L2JJ5j7K6pl6pN1k6j8K1K5j0j8J9mk5nL7J7
12969B6j6J5jj3Lk6J6k4L6k4P5o6mK5J6l1p0R3q1N6j2M4m5j6N4q8N7J4j7Nk3K7
13001EMl6J1mJ8j5J3J5L3j6m9J7J2L8o3K2J0k1K7j9Jj7%K5rK0J8l0Om3N4p2N4
13034IJj2Q1p2K0l5L7k0n0L7K3j5l9O8k9nOm6N9k6J4%J8o6N9qQm1O6j9p8N1rp
13068b0M7o0N2J1l2mk1J2k0O7o3K7O0o9L7k0k1MjK7j3n2M5M0j4qk3L3j4rk6RJ1
13101hj6L5pJ2j3j4Jj3K0J5M9q6J7J6k4L5m3M2l1Rl3J5J0L6k3k2J9k2n0N8J1j2
13133a7K9k7J0K9j2oJ5p0L7k5N0k8K3lk2J9n1O1j6J6Lk6L4l6L7Nk2k0L4qm3J6
13165a4J5k4K8j8N4p0OJ7k1K0J9l5L7k8k8M2QNj3n8N6K8p2O0j0k1L6p0M1k7P1
$$ plain form
13196 34 11 -4 -6 -70 -11 -10 25 -7 -29 -47 14 -17 13 35 -2 7 25 -31 62 -17 3 22 10 -13 0 -2 21 -9 7 -14 58 -9
13228 -9 -3 28 35 48 -31 0 -14 -34 -32 -1 44 23 -11 -23 12 18 8 0 38 14 16 -5 13 4 -6 14 37 -30 32 4 23 2 -13 1
13262 1 28 22 30 5 19 18 -29 -56 7 -27 -17 14 26 27 -26 32 9 28 8 24 -27 -12 5 43 -13 40 6 49 -37 -35 7 -3 -6
13295 -6 -35 44 44 12 13 18 -16 -11 -8 18 -7 20 17 14 -2 -10 13 13 -2 12 19 -29 52 -12 11 60 2 23 29 23 16 21 -6 47 44 -6 -17 -18
13333 -18 -30 10 -24 43 18 18 -16 -8 42 -19 25 -24 9 15 -35 17 35 1 20 30 -5 -25 -20 22 -5 5 6 11 -45 38 17 -6 0
13366 0 20 13 -25 8 -17 -4 -43 13 28 19 -24 -37 -36 -41 53 -8 -19 -36 -38 2 8 -6 13 -8 -24 -36 -44 -24 -11 -41 -17 -1 28 -68
13400 -68 -22 -2 -41 -35 -1 3 22 5 -45 10 -5 -47 28 -23 13 5 -32 -19 -24 0 -7 19 -23 1 4 -9 -15 11 20 -34 -15 -7 21 -27
13434 -27 17 20 -34 41 -35 2 -3 4 5 -2 1 -29 1 -6 -17 20 -10 9 -20 -31 5 3 -69 13 14 -23 14 -23 -11 42 -30 9 2 4 22
$$ packed form
13196C4k3j5ko4N9JL5l2k2j8O1l1L0K2l7RJ8n6R3p9K0J9j2k3J3kK3l0J6k1P2o7
13228iOL1PJ3p9L1j4k0KL1M5k1l4j2L5Oj0qL8k4Kk1J8rj0K0K3o7O2k8J9k1j5J4
13262AK7oQk5J4jm7k7O3l4J0L1J2Jn3N8k3J9k0J6n1J5J7L8n6N3l4M3q6KM2j0l
13295fk9P9%l2JNl4NLK6k5K7llj6qK3%j5J4Pm8Q1o4K3M9n8K1OopNk7N3ln0j1j
13333a8j2M0l4O7k5%l4QN0o1M4m9L3On0N2J8l4J9J0l5k0NM2k7J0JNn6Q3k1k3O
13366@K0pl8L3k5J3l9N6J5rm3j3JnR4o1j1j7kM0Oj4J9k1j6j2qK0J3l0K4J6K9r6
13400f8M6K0l9OL4MJ9j7n0N5j5m2P5n1L6ql7J3nK4pK6m2K4Lj3oK6Rn4J9QK8m8
13434b7M4Ln4P5p6L7nPJpLl0L0pj1L7l0J9k9j1L6kp2Q2Jl7L7l7J2N3p2L9pKJ8
$$ plain form
13469 22 -26 2 -37 -4 -46 -14 56 -43 -14 -26 24 -24 2 -54 -52 37 1 2 -4 -14 8 -5 -42 -42 -41 -27 -23 46 -14 7 12 -19 -1
13502 -1 -7 -39 -9 -15 -16 -4 -27 -38 -25 -28 -1 5 -67 -11 10 -20 -9 33 32 7 -6 -36 -8 -9 53 -23 -49 -6 23 -28 -24 28 -5 -11 15
13537 15 -10 63 9 46 4 4 17 -31 -15 4 -10 7 11 1 18 -7 -1 10 4 28 8 -6 2 -23 -1 5 15 13 19 60 12 -13 15 -7
13571 -7 6 6 37 5 4 -14 29 33 -28 -37 -29 -22 73 6 23 23 13 46 -32 4 -17 -10 21 14 31 18 43 -12 19 -22 -31 9 -10 -6 -11 29
13607 29 55 -19 20 -21 29 23 24 18 -9 -18 -16 16 15 9 18 12 42 7 12 -40 7 -3 9 29 -14 51 46 39 37 31 16 70 26 3 -2 7 -21 -9
13645 -9 34 4 -12 2 17 -28 20 -12 5 42 38 -32 -24 28 3 0 21 2 20 18 21 30 3 20 -6 19 -12 43 -6 -16 25 48 40 8
13679 8 -47 21 -4 37 -22 27 -31 19 -1 -4 17 -16 -45 42 50 -38 6 4 -8 36 21 -17 -5 2 15 5 17 -34 11 -13 -6 -3 29
13712 29 -7 8 -21 21 -19 40 -34 14 2 8 16 -18 62 -48 -14 -38 -53 -19 15 -8 -13 12 30 24 13 -32 33 -20 31 5 12 23
$$ packed form
13469B2m8K8l9L3m2L2P0r9K9j2N0m8K6n6KQ9l6Joj0K2j3l7%JJ4MO9o0K1Nl1J8
13502aol2L0ojJ2k3j1J3lK7Op2N6K1l0J1M2jk5j3l0K8jO2p6k6M3K9n1MN2l3oK6
13537A5k5P3n4L7m2%J3m8J6J9j4J7Mj0J7k5OJ1oK4k0j4Qk5K2OJ0kOM1m8k5K8k2
13571gJ3%L1l2jj8M3Mo1rQPR5o7J7%j0L3p8L6k1PL1pJ7j3K5n5L1m1rM0j9MnM0
13607B9K6p4L9m1N0oJok7rKL2joRoL0l5Nn2M7j0J2K0m3O5npkoj5N4m4k3nRk8J2
13645iM3l0j6J4J5m5M8l2J7L7mp0QN2k5lK1j9J8kLRk7J7k6K5l1N5m9j0M1K3ql2
13679Hn5O8k5M1n9M9n8N0k0lK1l3k9Q7Qq8M4kj2M4j5l8J2PJ3j0J2n1M5k4PLL2
13712B9l6J5k9M2m0N9p4M8j2OQl4Q0j10L4k4j5L4L4k3nK5J8oj1m5O5n3N1k6PJ1
$$ plain form
13744 23 90 32 -14 -17 14 9 4 39 35 -18 25 12 7 15 -1 5 -7 8 -23 -20 7 75 27 13 -5 -7 -30 38 -41 11 -46 -15 58 29
13778 29 23 -10 36 -34 -26 -50 35 -15 18 -12 -25 24 -11 17 38 -30 2 -4 -6 22 -81 -17 -43 13 -20 9 -8 0 6 -29 55 14
13810 14 -8 -15 5 8 -18 -3 -44 38 0 -4 8 -36 -9 -23 -26 -8 -14 42 -23 32 31 -33 -23 -53 23 23 14 -9 -14 -26 -16 -23 -10 -30 -25
13845 -25 -40 -2 -25 10 -17 32 16 -14 4 -19 10 -56 -31 26 -51 12 -7 3 -7 -30 1 3 26 -11 -14 -15 22 19 6 38 -22 35
13877 35 -27 4 9 -45 17 -27 -55 40 3 20 -48 20 -51 -55 22 20 55 1 36 15 -2 -28 -59 -44 23 -9 14 10 -25 -16 11 -40
13909 -40 -37 -20 -4 -28 -4 9 -16 12 -12 5 0 7 -1 4 19 11 -21 -36 -30 -5 4 26 -11 -1 -3 14 -28 31 -25 -9 -12 -29 -30 1 -19
13944 -19 -31 -8 29 9 19 -17 12 10 1 13 37 28 0 17 -17 30 -19 -6 -14 6 -19 17 2 9 32 -7 24 5 14 -13 -24 -18 -21 51
13978 51 7 -26 14 13 -7 -16 57 -41 -26 7 16 -1 51 -24 -22 25 14 6 -31 24 10 8 -14 -25 4 6 24 -12 -32 21 1 13 12 25
$$ packed form
13744B3O7n8m6lL1nnL5mn3M3j3nQj6Oj2J5l1LK7O8m8j4j8kk3O8p9N2n7L1P3k9
13778B9ol3M6p0Qk4Q5n0L3l0j3M9l5K8K1o8L2okK8j03O4k6N6l3K9j7QOl5Q4m1
13810A4k2pK0Lk6J5m1Q2l8mJ2m4K7j4lJ8oN6o5N5jo4J0l0P6%rk3nj2J0pJ3k0N
13845b5j5L8k3L5k7M9j6l0J8k3K9o6K5N7p7O3j9J0j0k3L1KK3l7ljL7lj3L2o0N7
13877C5o2L1Nn4O2m4k8R5l7J7o8O8p1mP7kL5n4L5k1j7k6l1J5O7l2K3ml5RK7n1
13909d0LJ7J6k4K4J3k5K8k4J7nPqNJ5ql2j5OK5RK2l7J0kJ7m2N9n6J6lj7jL1k0
13944a9j2K3L7k0J0l6K9krJ2K4rk8J7l4M7m9J3qK0k5L6j5PK3l9L1j9Rk7j1OlP2
13978E1m4l3M0jk0rP3r8J5L3Rj7N2p5KM7j1ql7N5j4kk2j1K9KJ8l6k0N3k0J2jJ3
$$ plain form
14012 25 19 35 -28 40 -25 -2 53 -24 24 26 -4 11 -36 8 6 45 0 19 28 -10 22 -20 72 32 26 -9 -10 12 2 6 6 46 11 -7
14046 -7 35 0 13 -7 10 37 -8 18 -33 65 14 22 -5 -10 7 -28 5 -43 39 -8 3 22 34 53 -47 34 4 69 5 -3 21
14077 21 0 -15 42 21 1 -12 -1 20 28 4 -43 20 4 -9 36 2 9 -19 14 31 46 6 47 -23 17 13 4 31 -2 -30 -12 -21
14109 -21 11 -6 45 -6 -2 21 -46 -45 -38 -10 7 -8 -18 -33 -13 2 3 -12 -43 34 -45 0 -10 8 -4 -17 13 -21 8 -15 4 19
14141 19 -4 8 9 -12 -12 18 44 18 0 -28 38 30 -24 2 12 31 -9 -20 3 -19 41 34 -6 -29 -25 31 12 27 -14 50 7 -12
14173 -12 30 36 -32 24 12 18 -69 -45 29 24 20 -11 -12 -4 39 13 -3 -45 -19 23 45 -19 -3 22 -22 3 -32 25 -42 -7 -15 -51 1
14206 1 23 -20 -29 -23 -31 -30 5 -1 -37 -2 28 -22 10 -1 -2 33 -46 14 -45 37 -17 12 -74 29 17 21 -11 -12 17 12 47 -25 -20 -20 20
14241 20 9 3 49 -2 42 -34 -10 6 -3 -13 -19 -3 -47 35 -15 -10 13 -16 11 -38 -25 -42 -54 13 -34 -39 0 -9 -12 8 -2 26 -2
$$ packed form
14012B5oJ6o3O8o5K3N5p7M8Kl0J5m7M4kL9m5J9Rl8L2m2R2m0ol5jK2j0M%M0l5j8
14046gM2l5J3k0J7K7m5K6n1R8n1Qk7nJ7l5L3m8Q2m7J1J9J2J9j00Q1l0O5o4qK4
14077B1k1j5N7k1k0j3J1K1Qk4m7O3j6j3M5l4Pk8L3J7J5m0M1p0M0mrK7l3k8J8r
14109b1L2j7N1n1MK3o7JPK8J7j5j0j5K0J5Jj5l1P7p9M5j0J8j2j3L0l4K9k3J9J5
14141A9k3J2Jk1%L0K6k6j8k8O6qn4K6J0J9m0j1K3k2O0pm0k3MN6j9J5m1O4m3j9
14173a2M2Oo8N6j2Oq7K4P4nml1jQM3k6j6m2K6M2K2o4J6K5m4K5l5N7o7L5ql6N2
14206AK2m3rOqJL5ol6L5L0n0L2j1jL5p9O0n9Q2n4K9q6J03j2Ml2jK9nL5p2N%M0
14241B0j1oM6n1M4p6K4J6rj0oJ6m4Q2n0NK3k9K7m9J3j7j2O7m7nL9rlK0j0K8k8
$$ plain form
14274 -2 -21 -8 -30 -22 -35 32 -10 -9 28 17 16 8 57 -9 32 -34 35 21 -26 -11 -21 24 -34 -15 4 -7 -35 -15 1 -3 -11 -7 -7 -11 -32
14309 -32 4 2 52 23 34 -30 11 38 23 36 49 -10 40 7 15 -22 26 -34 15 -19 20 49 15 22 27 29 -24 14 10 6 -9 -16 45 19
14343 19 26 45 -11 22 -12 31 5 13 13 -14 -15 -23 29 -23 20 -20 15 31 -24 0 -11 -10 48 22 -24 19 -23 9 -44 -17 -5 -7 -17
14376 -17 15 23 -24 41 -3 10 -21 -20 23 11 -36 16 18 -38 -18 31 -41 29 28 -5 37 -18 8 29 -13 -15 -7 0 -31 -1 -24 24 -7
14409 -7 -1 52 -16 26 37 -10 12 37 2 -5 -2 -8 31 -14 -25 27 -25 14 -6 9 -12 -2 27 -24 3 5 -41 -11 48 25 -43 36 -41
14442 -41 30 -15 -10 11 -29 -24 18 5 -5 17 37 0 9 -32 5 -17 17 44 18 -14 -27 -36 12 -32 -17 -11 35 2 -20 35 -16 -14 23
14475 23 4 -22 -14 -19 -48 -4 -1 9 -20 -62 40 -14 27 -6 22 -5 -54 -11 6 5 -18 5 15 13 25 -27 13 -30 -22 -11 -52 42
14507 42 25 10 -44 16 -16 -9 27 -28 2 21 -21 5 1 -29 -12 -4 48 6 -29 28 -27 -21 27 -6 -22 16 -27 22 -18 26 -8 -14
$$ packed form
14274bj9J3k2Qj3O7m2JL7j1jqM9o6M1o6O9j4m7J5j0M5n8J9J9j1k8K0J6mqM%mk1
14309c2L6kN0k9J1o4M1K7j5J3J3n9N0l3Ql7M8o0M9l4L9K9l4PNKn3L8mmj5pO1k6
14343A9PJ9n6L3l4M3k6Q%k7jqN2n2M3m0L5J6n5K4j1JN8k6m6M3m2L2n3K7J2kj0
14376a7L2Qm7O5m4J3l1JM3j2m7N2Kn6K0M9p2P0jl3M2n5K6K1m2kQPl1L0k3M8l1
14409gON3o8M2J1m7K2K5l5pLoL9m5j1N2n2L9k0J5k1J0K9n1K7Km6L0N9k3o8P9p7
14442d1P1m5NK1m0NM2j3j0K2K0l7Rm1L7k2L4K7k6l2j3rM8m4J5OM6l3k2N5n1KL7
14475B3j9k6Qnk9M4LJ0k9m2J02n4M1l3K8k7m9M3J7jk3K3J0kJ2n2M0m3QJ1m1R4
14507D2j7j5n4O0l2PL6n5L0J9m2K6ml0J7QN2m2l5N7n5OM8l3j6L8m3M9m0M4l4o
$$ plain form
14539 -14 14 -3 3 3 16 -27 -56 -4 -15 13 -15 9 12 -23 -6 16 -1 -21 -23 -9 -20 41 14 2 56 16 4 -29 -22 11 22 1
14571 1 21 10 -21 16 9 -5 -27 -33 -13 7 -25 21 7 -5 -7 -9 5 -9 3 -7 14 12 -12 12 -27 -49 6 23 17 25 4 -9 -63 -2
14605 -2 -39 -25 20 -72 -34 18 28 36 -13 5 -2 0 -38 -39 4 20 9 -29 13 -29 -19 8 -38 -15 -53 11 -3 -15 -16 8 35 -38 2
14638 2 -19 0 -22 -57 1 -27 43 -40 -37 -7 0 38 34 43 9 29 -3 -16 -64 -42 -13 17 -6 59 1 12 -29 -16 16 -4 6 6 10
14671 10 40 2 -6 -36 21 7 -31 20 -30 4 -7 -3 8 17 14 26 17 -29 14 -1 7 20 29 8 -17 30 3 7 -42 17 -21 -3 13 13
14705 13 24 -7 20 2 48 -23 -10 -10 31 -7 2 -20 21 -19 -17 -16 26 -1 18 22 40 -44 -7 8 -20 40 17 16 -20 42 15 -15 35
14738 35 8 7 -6 16 2 21 0 -6 50 13 29 26 -23 6 0 -15 -15 -13 -33 -12 3 -16 -2 -28 29 -22 18 15 -14 18 -15 35 -25
14771 -25 3 -6 21 -28 -28 53 6 17 13 -19 58 2 43 10 0 10 -19 23 -16 28 -10 49 37 -22 -4 -29 -19 6 -18 -27 7 10
$$ packed form
14539a4K8j7O%J3m3k9N2j1K8k8K4Ll5J7K2j7k0kJ4j1O1k7j2N4m0j2l3PL3J1k1
14571AK0j1l1L7pj4k2oK0K0l2M6j4j2kkJ4j4J2j0K1kk4K4l9k2N5J7oQk1j3n4O1
14605bl7J4M5r2L8N2J0Qm9J8pKl8jM3J6j1l8M2m2J0K7m6K3l8O4j4j2jK4K7p3M0
14638Bk1J9k2l5N8k8P0q3LL0PL8mRl4K0l2j3m8K2K9L0k3O5n8J1m1J3L2k0J0%M
14671A0L0l8ql0N7j4l8N1n0L4j1MJ1RlJ2rm6M3j5QJ3Rk1k5M7k7Mm9N9l8J8J6%
14705A3J1l1K7j8M6p1J3%M1l8Rk2M1m0KJM2k7J9MJ8q4L7J5k8O0k3jl6O2k7l0N0
14738C5k7jj3K2j4J9k1oN6l7J6lm9K9oj5%Kk0K1J5j9J4k6N7n1M0lk9L2l3N0o0
14771b5K8rK7m9%Q1m7J1ml2P7n6M1l3j0J0k9M2l9M4l8N9j2n9J8k5J0K5k4rL4L
$$ plain form
14803 10 -6 -3 -17 33 -22 -12 -13 -5 47 9 26 42 -24 26 24 10 33 0 30 19 -10 -9 0 -4 43 -63 31 -9 -24 -5 -39 16 26
14836 26 -22 -15 19 -35 3 -14 39 23 27 14 -27 -21 -22 4 7 2 2 -9 47 -25 -12 -7 28 20 -16 8 2 35 -2 -6 21 -37 27 -34 38
14871 38 17 -11 -15 2 -11 -9 -21 16 -35 -32 23 5 -30 43 -28 -4 -11 17 -11 -53 45 -4 10 6 30 19 -21 4 -16 52 10 20
14903 20 -27 -19 20 -28 17 26 5 -12 -20 5 6 7 29 39 27 -51 -40 31 37 -2 -13 -7 -5 -14 -20 -40 69 -22 -16 -28 -33 28 18 1 5 -19
14939 -19 7 -3 -12 5 -2 1 -17 -12 -18 -11 -9 1 -2 -17 -32 -36 17 -21 10 -34 5 -2 -6 -23 -6 -13 -41 5 22 21 18 -10 3 -34 52 -13 36
14976 36 -25 -40 -20 -53 13 -13 14 -6 -9 -12 -3 1 17 -23 -13 7 22 -29 24 17 -3 4 -41 -35 -19 17 -2 -4 -3 -17 31 -20 8 -40
15010 -40 3 -14 -10 -15 -10 -31 -3 16 23 10 -20 55 -40 31 -23 -6 -9 -49 6 -7 25 5 2 17 -21 22 -26 23 8 -23 2 -31 17
15043 17 9 26 -42 -21 26 -48 34 -43 13 16 0 -6 30 20 -29 21 -28 12 -12 -6 -35 -48 2 -40 13 -32 8 -17 28 19 -11 27
$$ packed form
14803A0j6Lj4N0n5J0jQN2l8J7J6o6N0kj4K3l3L0j1k9JRmM7j06R4m0j5J9l4N5J0
14836B6m8PL4n4L8j7N3j6Mj3m1OjK6Ln%j1N6p2J3NL5ql6K4oL3l7mK7n8O4o1P2
14871C8k1k8mJ7j3Kj2L7n1LN5j8l5P3p1K4pK8k8m2R8m9J4mK4j1m0K5k0O8m2J0
14903B0m7QL9m8M5Rk1j7qK5JJK2J0j2p8J1P1Ol9j1OKrok0J09r1Oj2nO1j0j7Mk4
14939a9K6j0rJ7pLj8NoPKJ0lj5j5mN3l8L1m4L9pmj7J7pk8M6J7jlk8J3l7Q6o5M9
14976C6o1j5K0l3O6k6K7k0llRMJ6m0J0K0J5n1N3pk0Pm5OJ6L6j9kJj4M8n1K8m8
15010d0M3j7MnNk1K8J9Pj3l0P5r5P1n4J7lm0N5j3L2k0lJ5l8M3m8M9j5l1K5l3M8
15043A7qJ7o8K1M7p4Q2p7N6Lj6oL6j0m9N0m9M0k4Ok9j3N0m2N3m5M0k5M5rl0L8
$$ plain form
15075 27 -26 -36 27 -18 50 35 -24 44 10 -23 -26 -17 -19 -40 13 22 -28 -31 -31 -17 45 -7 -11 -25 8 23 44 -34 10 -31 20 -33 30
15108 30 27 37 50 -13 33 11 7 -1 25 18 -9 -25 6 12 22 11 -11 2 26 -10 24 17 38 26 -28 9 -37 4 22 -35 37 -14 43
15141 43 -15 -19 30 21 42 -30 -3 42 14 44 43 4 -11 27 -5 56 9 1 66 26 60 -9 8 17 19 51 -23 22 8 35 2 15 16
15174 16 59 24 -5 -2 22 -4 13 35 -6 -32 40 -10 -9 -3 16 -14 -15 -7 49 -4 19 -4 23 17 -28 26 -36 16 -3 -41 -13 16 16
15207 16 -50 2 50 -43 41 -15 1 12 0 4 -16 -12 44 10 5 25 -8 -49 6 2 17 -6 24 18 57 76 -19 35 -48 -5 1 14 9
15240 9 -1 23 1 7 -52 -11 19 23 5 -14 -10 19 -3 -6 -15 36 18 20 -21 9 24 -10 18 5 23 7 43 31 22 -11 11 16 45 -1
15274 -1 12 33 19 42 -27 30 -16 41 -3 4 5 -29 17 -12 -28 -33 8 -10 9 -10 3 -14 -24 -10 -5 14 46 40 -19 18 -3 20 -6
15307 -6 10 -15 -41 2 -19 62 -48 25 -16 17 38 8 36 -4 0 -12 -19 2 -31 25 15 -2 -47 13 -28 -67 20 -51 -16 -47 9
$$ packed form
15075B7n3j0O3m5O8j5n9O8l4l3lRkk1N3Rn0l%J4O2n2mj4L3J5K1p8M4m1N1n3O3
15108C0lJ0J3o3M6k2mqK6pk7j6L1OJ0j1k2J3K4l6L4pK1j2n4L7m6M1J8n7P2n1N7
15141D3n8mM9rK1p2K7M5k8L0jl9j5L8l2O1m7qO5m0L4o9J7RKL2p4M5j4K7l3J3J
15174A6M3l5k9LK4k6J7K2m1k6P2n0JOJ9l0jQN6n3K3k3K7om5N4o2N2j9l8K8K9%
15207A6o6N2M8r3Q4n6J6J1j2Mk0MN6l4nK0l3m1N5mJ5k3L0oL9J9r5N4q3M3OJ3n
15240Ij0K4k2On9M1L0Mj8j9MK9k2lrN1j8Km1L0J5l4K8j3J8j6L6j2rl3K2NK9m6
15274aJ3K1j4K3o9N7m6N7m4PJl4M6k9j6nM1j8J9j9J3j7j0J4NJ9L2on9L7k1K3k6
15307fJ6k5k6M3k1Q1j10P3m1L3K1l0K8m0Mj2pK1l3N6j0j7m5O0m1l9Q7p1L5l1N6
$$ plain form
15338 9 -14 -13 -48 62 -32 1 3 9 -37 28 -1 -8 -53 -20 -4 -12 -13 -20 25 -18 31 -6 33 17 -28 -3 -14 -14 6 -21 9 -10 -14 -5 -34
15373 -34 5 -37 -32 -10 -12 -41 -9 -10 -15 -5 -19 -5 3 9 23 0 4 20 -4 26 1 27 -25 -7 19 -19 48 -41 15 22 13 -13 3 44
15407 44 2 -3 -5 -6 -23 9 -24 -14 3 -8 20 -17 44 -4 -35 36 -5 26 3 -5 -15 -3 -13 5 26 -13 -9 0 -10 14 -12 7 23
15440 23 -18 -55 -21 3 -15 21 28 -7 2 -7 4 -26 -9 6 -16 -3 -8 -56 -14 -52 15 15 33 -57 25 -24 0 25 12 9 -31 -32 16
15473 16 -18 28 -54 -9 -11 -63 3 5 -11 -21 -11 45 10 9 -24 -12 -43 55 18 16 4 7 -19 -25 -16 8 19 -15 -38 29 -40 17 2
15506 2 -44 -28 -41 -24 -36 -23 -19 9 41 6 33 -21 -7 -11 17 -9 -17 0 -9 16 -31 19 1 4 -26 32 19 -41 -13 10 -11 20 -4
15539 -4 -9 31 11 20 20 -3 -5 29 13 -21 32 66 -26 33 -2 -20 23 -34 -2 -38 8 -22 -4 -11 2 -26 21 22 17 -39 -60 10 -13 37
15573 37 26 16 9 -53 -19 -12 10 8 -1 17 12 -18 37 2 3 42 44 -22 2 46 -10 -11 19 46 -9 12 14 10 10 14 38 -5 57 -41 -11 -21
$$ packed form
15338Ik3Jl5J10r4L3KOm6O5k9pm5L3J6qjpM5m3M9l7L9j6m5K5j1%K0k7L0j9mRk9
15373c4L9m2NK2kk9L2jnJ0j4J4QOJ4k3MJ6k4L0k5K6n2J8K6l8O7q9N6Prk6J6M1
15407D4m2nkjj7L2l3J0J7j1K8l7O1m8l1P1m1L1k3qj0J2j0J8K1l9MRj0K4k6J9J6
15440B3m1l7L4K4j8L6Pl5RrJ1l0J7J5k2J3nm8M2l8O7%J8r0Q2m9K4K5j3lm0jM8
15473A6l4M6q2M5kn2O6Kj6j0J0N6l5jl3J2l1R8l7kj2Lk6oRK4J1l4k3O7o9N7j5
15506Bm6J6j3J7j2J3MK8L2l5K7n4J4mK8k6qJ7rK5m7N0j8Ll0N8j3o0K8K3k1L1k4
15539dnM0k0R%k3kL4j6l4N3L4r2N9l5j8M3n7L2l6M6l0J8pJ3k8M7Jnn6k1P0k3N0
15573C7j1j0po2L4PK2krJ8nl0N5l5JL9Ko6K4M4n6jL0K7n5K1Km%MK4m3O2r8L0j0
$$ plain form
15609 -21 2 -5 13 4 -29 -5 9 39 41 22 36 15 12 32 11 -42 -1 3 6 -5 -55 49 -24 -19 10 8 29 -9 -32 -25 -5 3 34 -39
15643 -39 7 9 59 11 4 46 12 21 -35 21 -19 -10 2 9 7 -38 21 7 -20 -20 9 -27 -6 -14 -19 35 12 -3 -22 19 4 12 17 32 -24
15678 -24 18 -2 6 13 -28 -13 -51 -13 -26 -21 -18 4 15 8 48 -27 19 17 -17 7 -68 17 -34 17 -11 -8 4 -1 -31 0 -5 9 -1 -10 -19
15713 -19 -18 -12 18 -17 -37 7 -36 -25 4 32 6 31 -17 22 1 19 -6 -29 -22 34 -2 20 -21 -4 26 -10 -2 -18 -31 78 -50
15744 -50 24 -2 -2 -1 -7 56 16 -24 -35 -9 15 21 -9 -36 2 -13 54 42 6 -3 -16 38 -43 -21 36 -30 4 -34 19 -8 -8 37 -44
15777 -44 -9 46 3 32 8 -34 -4 -1 13 43 -21 -18 -36 -11 -2 8 -25 -38 -6 -24 23 -21 24 13 28 19 10 -12 1 9 -25 13 -16
15810 -16 -36 -9 -32 -16 12 -8 3 11 33 -9 9 -21 23 -15 1 -15 9 -43 -18 -24 15 9 -8 16 0 -24 -16 11 6 -12 -15 8 0
15843 0 -11 -6 30 -26 -5 -17 -14 7 7 23 -35 -5 18 -6 -9 0 37 -31 -2 7 10 -23 -8 33 -4 15 32 -35 51 4 30 10 44 -18
$$ packed form
15609b1K3pJ8rl3K4J4L0Kj9J4k1lK0k1n3M1MLj1n0J04p3NK9kK1l8k3PK0QL1p3
15643c9M6KN0m8pM2l4Rn6N6m0RJ2Pkm5N9j4k7%K9l6K1qnN4k3j5j9M1j5QNJ5n6
15678b4M2k0QPm1J5l8L8j3NLK2J1pM0p5M6kl4K4p5Q5n1N1k8LJ2nl0L1nJ4j0rr
15713a9JOL0l5k0M4m3J1K9K8k6K5m8L9k1J8k5k3PN6l6K2m1J7L0l6Qj6j3J09j28
15744e0P4k6%JoO3m0m0j1K6K4Ol0k7L8j5O7j2l6rj3N4q1K2N7o6L4l8N3k7%M5q1
15777d4L5N5m3K9k4m2L0LJ4L0o4Lj8K5RJ0l3j3L2j8M7m4M5j1J5rrk2J3Ql4L8k9
15810a6k0K7k3J6K8k0J1QK2m2J8l0M4l8J6j6K4n2K5oL9oj7K4j6k4QK7nj8lK3q
15843@j1NL6n6K1j2LK1%J6n8L0K3k4lRL7o8K9RLl3J5M1l7J9J7o7Q6m7K6k0L4o2
$$ plain form
15877 -18 12 -47 -10 61 -13 7 2 -16 -6 15 0 33 -21 41 -11 -4 -14 -2 -1 -25 4 -22 -19 -39 20 -13 26 27 -34 47 -20 48
15909 48 12 -28 14 -6 5 10 39 52 -42 7 -4 16 -11 -33 5 -25 18 -4 0 -6 -3 1 22 12 8 35 11 7 26 10 -10 -12 -9 23
15943 23 -28 39 0 58 -4 24 29 -12 34 31 -40 -5 -4 -8 -19 -8 -38 32 8 27 -16 -7 6 6 52 9 -20 15 28 -11 -17 43 20
15976 20 -3 1 20 -1 -40 1 9 -53 62 -13 -11 -19 -28 8 -7 -53 14 2 35 14 19 -2 17 -35 45 1 -9 47 17 29 -25 0
16008 0 41 -34 -28 6 1 19 -16 15 0 9 -13 23 14 -11 -15 6 -3 -25 -31 31 23 -1 -7 19 -22 -8 -36 -3 -10 8 54 27 25 -22 -39 -7
16044 -7 15 41 -28 13 -11 -15 -24 20 -56 6 5 -28 41 -28 -4 -9 14 -20 7 -8 -5 19 -10 32 25 12 11 10 -29 -8 -27 27 8 -24
16078 -24 12 -3 41 -32 2 -27 -15 -13 -10 -42 -18 -37 19 24 10 -34 -7 5 15 10 3 64 -7 58 1 7 -50 -15 47 25 10 -43 5
16111 5 0 7 6 -21 12 -7 -30 25 -53 -9 -43 22 3 -32 37 -27 -4 -63 13 56 -2 27 -8 -1 -43 48 -25 -2 -32 -52 23 -11
$$ packed form
15877a8L0n9L7P1p4K0nj8J0K1j5L3n4O2n2Pj0J2Jk4K9k6Lk0N9l3L9Jo1Q1o7O8
15909D8l6m0M2k0J1NK9J3r4M9j1K0k7k2L8l0M3k2MoLMK1j0mK7k4mJ9j6k0kLL2
15943B3n1O7l9N8o2K8Nm1M6lp1L5Jmj1J1l0P0k4J9m3RJ3%M6m3k9L5J3l9oO0k3
15976B0k3MJ9k1l9M1Qo2J15p5KqrL6j5m6O7j2L3k1Nk1J9n2Q0m4j0N6l0J2n4K5
16008@M1p5OL4nJ8l5L1j5Rk2L6rk5mK1rk2oO2qk4oK6m1J4k8L3pJ8M6k7km7j7L2
16044gK2K6o9M1k4mrM4p6O2jl3O9o9K4nK3l4K7j5LK4k9M2pj3jjl9K1j9N4j9l2
16078b4L6j5M4p3L4k9J2KLl2K4j9N6Nj4m4K7J2J0npO1p1O5n7On7L5O2k2j5n3M8
16111EnPjk7L3j9k3N5p8M4l4O5j9l5O9o4K3n9P6M3n8K9l5Pm2R1p3K3l0k0P5l4
$$ plain form
16143 -11 7 -60 -10 53 4 29 10 57 -31 20 -10 -16 14 -40 15 -20 14 5 -18 -43 -11 29 -20 11 -9 -42 19 -1 -6 -14 2 27
16175 27 -7 28 -3 -20 14 14 20 16 18 -4 13 16 -2 -14 5 -6 21 -25 3 3 -17 -2 -12 -29 -18 4 2 8 -22 7 -18 -11 10 -25
16209 -25 -33 -23 24 -64 14 9 54 26 -5 23 -3 -25 34 6 30 -8 20 -3 26 -26 -20 11 15 9 23 12 27 8 -4 -40 -22 -1
16241 -1 33 55 5 5 19 40 32 1 27 -40 10 -24 19 27 42 28 -17 11 -6 -3 15 20 24 3 12 -31 -44 -5 -3 -8 21 14 3 12 34 59
16277 59 7 19 10 73 3 -6 -9 -14 -7 -15 -15 -2 -33 14 -3 17 43 12 31 -21 13 -10 -20 6 -7 -54 21 25 65 36 -6 16 -20 -10
16311 -10 -4 37 1 12 47 -12 3 -1 8 -11 26 22 -10 7 2 19 -9 46 15 19 24 9 30 7 4 34 38 21 9 -16 19 24 1 -25 -37
16346 -37 -4 0 -4 39 -3 -19 28 -3 7 -9 45 30 45 -9 8 16 6 11 30 -8 13 5 38 6 -3 -31 -22 -16 49 1 -3 4 11 32 15
16381 15 17 -22
$$ packed form
16143a1J8o7N0O3m9K5j9M7q8N1l0oL0n4N5l5L4rk3k5L2M0m9L1k0l3O1k0nqJ6K5
16175B7l4L5l1j7L4%OmKk2J7Lj8j2J9j1K7m6K8%k0J5j0j7J1K2kOl0K9k5PK1l5
16209b5qJ0M7q8P8nM5k8l1K8k6k2N9k8K4l8K8k3K9n2OL1MoJ4j1J5j9j2l6J8K1
16241aL4K2n0%J4K1ql1K6o7N0l4M3QJ5j4m5K8j7LJ8NMk1Rm3j3L9KnK9pj1RK2K5
16277E9n2J2rO3p0rlnPq%J3l1M7j7K0K6l1J9n2L4k3j0K6j3m7P5MM0k9m2K2l6J0
16311a0OM1l6J1L5n9J5mRj9L7ml2J7nJ7k8N5l1MNj5K1k3lL0Mj7j2k5L5Nk3k6j2
16346c7L3MmM3m2j6M7l1J0j6N4j5J5n4J7Qj0NJ9l8K1qL3l2rk8ROO5m8mPPK1j7
16381A5Kl9
16383b2
$$ Imaginary data points
##PAGE= N=2
##DATA TABLE= (X++(I..I)), XYDATA
$$ plain form
0 0 0 0 0 0 0 0 0 0 0 0 0 0 0 0 0 0 0 0 0 0 0 0 0 0 0 0 0 0 0 0 0 0 0 0 0 0 0 0 0 0 0 0 0 0 0 0 0 0 0 0 0 0 0 -1 1 -2 3 -5 6 -8 10
61 10 -12 9 -12 25 -33 1085 597 708 815 925 882 780 645 390 160 -48 -294 -470 -645 -756 -759 -740 -635 -469
85 -469 -353 -124 75 297 523 598 721 694 693 619 478 285 110 -77 -315 -470 -613 -726 -689 -703 -596 -474 -276
108 -276 -51 97 280 436 601 648 679 670 539 468 259 87 -140 -214 -447 -520 -563 -633 -567 -467 -410 -193 -58 117
132 117 307 377 506 540 582 551 435 306 212 23 -140 -248 -394 -489 -533 -559 -526 -462 -322 -170 21 112 281 399
156 399 435 519 513 443 382 298 146 7 -88 -269 -367 -453 -501 -502 -436 -313 -250 -129 -14 127 261 313 437 438 460 399 308
183 308 211 127 36 -134 -266 -337 -358 -409 -453 -367 -303 -218 -80 21 147 216 352 374 439 392 329 274 146 96 -85 -137
209 -137 -203 -325 -298 -384 -342 -347 -278 -134 -95 38 107 225 274 352 335 322 301 218 201 69 -10 -117 -210 -260 -320 -334 -301 -285
$$ packed form
0@%%%%%%%%%%%%%%%%%%%%%%%%%%%%%%%%%%%%%%%%%%%%%%%%%%%%%jKlNqJ1j4J8
61A0k2K1k1L7n8J118m88J11J07J10m3j02j35k55k30k08k46j76j75j11lJ9J05J66
85d69J16K29J99K22K26P5J23k7jp4j41j93j75j87k38j55j43j13L7j4J07J22J98
108b76K25J48J83J56J65M7L1rj31p1k09j72k27p4k33p3m3p0O6J00N7K17J35J75
132A17J90P0J29L4M2l1j16j29r4j89j63j08j46r5m4k6L3O4J40J52J91R1J69J18
156C99L6Q4op0o1q4j52j39r5j81r8q6m8jO6J23O3J21J15J41J34N2J24JK2o1r1
183C08r7q4r1j70j32p1k1n1m4Q6O4Q5J38J01J26O9J36K2O5m7o3n5j28n0j81n2
209a37o6j22K7q6M2nO9J44L9J33O9J18M9P8j7j3k1q3j7j32p9j07r3n0o0j4L3J6
$$ plain form
237 -285 -200 -134 -18 106 144 164 267 321 248 290 265 189 102 -28 -51 -151 -159 -229 -352 -255 -296 -247 -172 -102 4 53 168
264 168 199 266 322 301 251 207 179 75 31 -69 -131 -204 -240 -220 -226 -186 -133 -117 -9 9 55 149 217 234 240 230 187 188 89 70
294 70 -51 -90 -182 -204 -246 -234 -197 -180 -116 -94 -54 -6 76 111 190 233 219 211 185 129 112 8 12 -66 -139 -181 -177 -181 -172 -157 -103 -91
326 -91 -5 36 102 156 182 179 169 175 133 98 70 12 -68 -63 -127 -159 -133 -186 -166 -86 -109 -41 -22 44 100 107 115 101 242 151 136 150 85
359 85 -11 -67 -102 -121 -113 -120 -134 -105 -111 -102 21 -21 48 64 138 110 174 117 130 76 99 10 -36 -104 -85 -56 -137 -103 -106 -110 -39 -29 22
392 22 38 48 135 48 151 167 131 140 80 87 -7 -14 -66 -75 -49 -129 -69 -90 -41 -12 -94 3 -10 55 76 74 107 120 103 90 -18 42
424 42 -10 25 -40 -70 -141 -75 -86 -102 -70 -47 -21 -20 39 24 71 68 88 88 75 95 64 29 7 -41 4 -61 -72 -64 -81 -53 -57 -65 -21 -2
458 -2 7 34 81 54 85 70 46 45 15 -12 -28 -48 -38 -21 -65 -77 -60 -90 -17 -35 -37 28 28 47 56 62 52 52 74 15 43 16 -22 -14 -63
$$ packed form
237b85Q5O6J16J24L8K0J03N4p3M2k5p6q7j30k3j00qp0j23R7m1M9P5P0J06M9J15
264A68L1O7N6k1n0m4k8j04m4j00o2p3l6K0oM0N3J6J08J8M6R4O8J7Oj0m3Jr9j9
294G0j21l9r2k2m2J2L7J7O4K2M0M8Q2L5P9M3j4qk6n6j7j04Mp8p3m2MmRJ5N4J2
326i1Q6M1O6N4K6lj0Om2l5k8n8q0No4l2K6n3K0Q0k3O8J9O6N6PQj4J41r1j5J4o5
359H5r6n6l5j9Qpj4K9oRJ23m2O9J6P4k8O4n7J3n4K3q9m6o8J9K9q1L4lmP1J0N1
392B2J6J0Q7q7J03J6l6Ro0Pr4pn2rK6q0O0k1M9K9q2R7j3O5K1kL3J3j7j3j08O0
424D2n2L5o5l0p1O6j1j6L2K3K6JN9j5M7lK0%j3K0l1l5k2m8M5o5j1Qj7K8mqM4J9
458bRK7M7k7L1j5k4jl0k7j6k0J0J7m4j2J7l0P3j8kO5%J9ROj0%K2n9K8k7l8Qm9
$$ plain form
493 -63 -49 -80 -38 -69 -42 -27 -5 22 28 49 7 45 52 59 30 65 59 23 48 -24 37 -52 -50 -49 -36 -43 -42 -24 46 -22 -6 -10 -22 65 -30
528 -30 26 34 53 4 -25 -25 -23 -41 -52 -17 -94 -81 -50 -44 -58 -30 -19 0 35 5 -21 67 8 46 28 -30 12 -39 -8 2 8 -35 -23
561 -23 -27 -26 -8 -47 -10 -29 37 34 25 42 6 20 19 -14 -35 -19 -32 5 -50 -25 31 -10 -23 -36 -35 -11 26 4 -1 29 13 35 8 65
595 65 37 26 -8 8 25 -4 1 3 -27 -32 -51 -1 12 6 -33 7 -37 -33 -11 -72 5 -16 12 30 1 -14 -16 67 -21 -1 -1 -44 -24 29
629 29 -21 4 -18 -27 -17 9 35 14 13 6 -25 -45 43 -25 14 -27 11 10 4 -15 -16 -24 -24 -4 16 -12 64 -1 48 6 12 -17 -1 16 -52
664 -52 12 24 17 11 -42 16 -13 53 9 36 41 4 29 -14 31 -3 3 -2 51 -29 39 -25 -21 -8 -16 -38 29 3 -13 13 -23 55 -25 12
698 12 -1 -18 22 -37 22 12 21 -7 5 -4 15 23 0 10 -18 10 -16 -6 34 -9 29 -7 -5 62 -9 40 29 16 2 -38 -21 -24 35
731 35 -34 14 12 41 7 -21 38 -27 54 -5 -8 27 3 30 -34 27 -28 4 46 -18 14 -3 35 18 12 44 16 59 30 22 59 19 59
$$ packed form
493f3J4l1M2l1K7J5K2K7OK1m2L8PPk9L5ol6K5p2O1q9KJJ3pJJ8P0o8J6mj2Q7r5
528c0N6QJ9m9k9%Kj8j1L5p7J3L1Oj4K8J1J9L5l0k6Q8n9L8j8n8M2n1L1J0Om3J2
561b3mJJ8l9L7j9O6lrJ7l6J4jl3k1J6j3L7n5K5N6m1j3j3JK4L7k2nL0j6K2k7N7
595F5k8j1l4J6J7k9NKl0nj9N0J3ol9M0m4MK2o1P7k1K8J8k9j5kQ3q8K0%m3K0N3
629B9n0K5k2rJ0K6K6k1jpl1k0Q8o8L9m1L8joj9jq%K0K0k8P6o5M9m2Ok9J6J7o8
664e2O4J2pon3N8k9O6m4K7Nl7K5m3M5l4OnN3q0O8o4MJ3qk2O7k6j6K6l6P8q0L7
698A2j3j7M0n9N9j0Rk8J2rJ9Qk3J0k8K8k6J0M0m3L8l6KO7p1M9j1j3j4m0J7lN9
731C5o9M8kK9l4k8N9o5Q1n9lL5k4K7o4O1n5L2M2o4L2j7L8j7oL2k8M3k9qL7m0M0
$$ [...]
16383B2
##END NTUPLES=NMR FID
##END=
