##TITLE=31P_DE-80H_X3
 64 sc D2O
 26.2.2025
##JCAMPDX= 6.0         $$ Bruker NMR JCAMP-DX V2.0
##DATA TYPE= NMR SPECTRUM
##DATA CLASS= NTUPLES
##ORIGIN= UXNMR, Bruker Analytische Messtechnik GmbH
##OWNER= root
$$ XWIN-NMR		Version 3.5
$$ Fri Sep 19 15:08:06 2025 Russian Standard Time (UT+4h)  Yarkov@DPX200
##.OBSERVE FREQUENCY= 81.013821
##.OBSERVE NUCLEUS= ^31P
##.ACQUISITION MODE= SIMULTANEOUS
##.ACQUISITION SCHEME= undefined
##.AVERAGES= 64
##.DIGITISER RES= 17
##SPECTROMETER/DATA SYSTEM= spect
##.PULSE SEQUENCE= zgpg30
##.SOLVENT NAME= D2O
##.SHIFT REFERENCE= (INTERNAL, D2O, 0, 198.062)
##AUDIT TRAIL= $$ (NUMBER, WHEN, WHO, WHERE, WHAT)
$$ ##TITLE= Audit trail, XWIN-NMR		Version 3.5
$$ ##JCAMPDX= 5.01
$$ ##ORIGIN= Bruker BioSpin GmbH
$$ ##OWNER= Yarkov
$$ C:/Bruker/XWIN-NMR/data/yarkov2/nmr/P31/2/pdata/1/auditp.txt
$$ ##AUDIT TRAIL=  $$ (NUMBER, WHEN, WHO, WHERE, WHAT)
(   1,<2025-09-19 15:07:10.82 +0400>,<Yarkov>,<DPX200>,
      <created by zg, POWCHK disabled, PULCHK disabled
       configuration hash MD5:
       00 E9 B6 7A A2 85 ED C7 34 08 36 98 17 FE 4E 26
       data hash MD5: 32K
       61 7C 23 3E 94 D7 58 F2 76 43 A4 55 0B 69 4F 10>)
(   2,<2025-09-19 15:07:28.32 +0400>,<Yarkov>,<DPX200>,
      <Start of raw data processing
       efp BC_mod = 2 LB = 1.5 FT_mod = 6 PKNL = 1 PHC0 = 1675.573 PHC1 = 24.15952 SI = 64K 
       data hash MD5: 64K
       E1 F4 E9 8E 64 76 25 2B 35 D9 80 25 84 DF DE 19>)
(   3,<2025-09-19 15:07:42.90 +0400>,<Yarkov>,<DPX200>,
      <pk PHC0 = 16.39999 PHC1 = 0 
       data hash MD5: 64K
       60 B3 16 BC 5F 99 13 12 B3 B3 39 67 AE DB FE 45>)
$$ ##END=
$$ 
$$ hash MD5
$$ D4 1B BD 9F 54 1F CA 49 02 94 3A A9 61 67 98 36
##$RELAX= 
##$RELAX= 
##$RELAX= 
##$RELAX= 
##$RELAX= 
##$RELAX= 
##$RELAX= 
##$RELAX= 
$$ Bruker specific parameters
$$ --------------------------
##$DU= <C:/Bruker/XWIN-NMR>
##$EXPNO= 2
##$NAME= <P31>
##$PROCNO= 1
##$TYPE= <nmr>
##$USER= <yarkov2>
##$AMP= (0..31)
100 100 100 100 100 100 100 100 100 100 100 100 100 100 100 100 100 100 
100 100 100 100 100 100 100 100 100 100 100 100 100 100 
##$AQSEQ= 0
##$AQ_mod= 1
##$AUNM= <au_zg>
##$AUTOPOS= <>
##$BF1= 81.014009
##$BF2= 200.13
##$BF3= 200.13
##$BF4= 200.13
##$BF5= 200.13
##$BF6= 200.13
##$BF7= 200.13
##$BF8= 200.13
##$BYTORDA= 1
##$CFDGTYP= 0
##$CFRGTYP= 5
##$CHEMSTR= <none>
##$CNST= (0..31)
1 1 145 1 1 1 1 1 1 1 1 1 1 1 1 1 1 1 1 1 1 1 1 1 1 1 1 1 1 1 1 1 
##$CPDPRG= <waltz16>
##$CPDPRG1= <>
##$CPDPRG2= <waltz16>
##$CPDPRG3= <>
##$CPDPRG4= <mlev>
##$CPDPRG5= <mlev>
##$CPDPRG6= <mlev>
##$CPDPRG7= <mlev>
##$CPDPRG8= <mlev>
##$CPDPRGB= <>
##$CPDPRGT= <>
##$D= (0..31)
0 1 0 0 0 0 0 0 0 0.06 0 0.03 2e-05 3e-06 0 0 0.0002 0 0 0 0 0 0 0 0 0 
0 0 0 0 0 0 
##$DATE= 1758280030
##$DBL= (0..7)
120 120 120 11 120 120 24 19 
##$DBP= (0..7)
150 150 150 150 150 150 150 150 
##$DBP07= 0
##$DBPNAM0= <>
##$DBPNAM1= <>
##$DBPNAM2= <>
##$DBPNAM3= <>
##$DBPNAM4= <>
##$DBPNAM5= <>
##$DBPNAM6= <>
##$DBPNAM7= <>
##$DBPOAL= (0..7)
0.5 0.5 0.5 0.5 0.5 0.5 0.5 0.5 
$$ [...]
##$SUBNAM2= <"">
##$SUBNAM3= <"">
##$SUBNAM4= <"">
##$SUBNAM5= <"">
##$SUBNAM6= <"">
##$SUBNAM7= <"">
##$SUBNAM8= <"">
##$SUBNAM9= <"">
##$SW= 400.765351723535
##$SWIBOX= (0..15)
0 1 3 0 0 0 0 0 0 0 0 0 0 0 0 0 
##$SW_h= 32467.5324675325
##$TD= 32768
##$TD0= 1
##$TE= 0
##$TE2= 300
##$TE3= 300
##$TEG= 300
##$TL= (0..7)
0 120 53 12 22 120 120 120 
##$TP= (0..7)
150 150 150 150 150 150 150 150 
##$TP07= 0
##$TPNAME0= <>
##$TPNAME1= <>
##$TPNAME2= <>
##$TPNAME3= <>
##$TPNAME4= <>
##$TPNAME5= <>
##$TPNAME6= <>
##$TPNAME7= <>
##$TPOAL= (0..7)
0.5 0.5 0.5 0.5 0.5 0.5 0.5 0.5 
##$TPOFFS= (0..7)
0 0 0 0 0 0 0 0 
##$TUNHIN= 0
##$TUNHOUT= 0
##$TUNXOUT= 0
##$USERA1= <user>
##$USERA2= <user>
##$USERA3= <user>
##$USERA4= <user>
##$USERA5= <user>
##$V9= 5
##$VALIST= <valist>
##$VCLIST= <CCCCCCCCCCCCCCC>
##$VD= 0
##$VDLIST= <DDDDDDDDDDDDDDD>
##$VPLIST= <PPPPPPPPPPPPPPP>
##$VTLIST= <TTTTTTTTTTTTTTT>
##$WBST= 1024
##$WBSW= 4
##$XGAIN= (0..3)
0 0 0 0 
##$XL= 0
##$YL= 0
##$YMAX_a= 650
##$YMIN_a= -911
##$ZGOPTNS= <>
##$ZL1= 120
##$ZL2= 120
##$ZL3= 120
##$ZL4= 120
##$ABSF1= 0
##$ABSF2= 0
##$ABSG= 0
##$ABSL= 0
##$ALPHA= 0
##$AQORDER= 0
##$ASSFAC= 0
##$ASSFACI= 0
##$ASSFACX= 0
##$ASSWID= 0
##$AUNMP= <proc_1d>
##$AZFE= 0.1
##$AZFW= 0.5
##$BCFW= 0
##$BC_mod= 2
##$BYTORDP= 0
##$COROFFS= 0
##$CY= -3
##$DATMOD= 1
##$DC= 0
##$DFILT= <>
##$DTYPP= 0
##$F1P= 0
##$F2P= 0
##$FCOR= 1
##$FTSIZE= 65536
##$FT_mod= 6
##$GAMMA= 0
##$GB= 0
##$INTBC= 1
##$INTSCL= 9.790993e-09
##$ISEN= 30
##$LB= 1.5
##$LEV0= 0
##$LPBIN= 0
##$MAXI= 10000
##$MC2= 0
##$MEAN= 0
##$ME_mod= 0
##$MI= 50
##$NCOEF= 0
##$NC_proc= -9
##$NLEV= 6
##$NOISF1= 182.463
##$NOISF2= 159.3651
##$NSP= 0
##$NTH_PI= 0
##$NZP= 0
##$OFFSET= 198.0616
##$PC= 4
##$PHC0= 1691.973
##$PHC1= 24.15952
##$PH_mod= 1
##$PKNL= yes
##$PPARMOD= 0
##$PSCAL= 0
##$PSIGN= 0
##$REVERSE= no
##$SF= 81.0140089999434
##$SI= 65536
##$SIGF1= 159.3651
##$SIGF2= -187.1042
##$SINO= 113.3802
##$SIOLD= 16384
##$SREGLST= <1H.CDCl3>
##$SSB= 0
##$STSI= 65536
##$STSR= 0
##$SW_p= 32467.5324675325
##$SYMM= 0
##$S_DEV= 0
##$TDeff= 32768
##$TDoff= 0
##$TI= <>
##$TILT= no
##$TM1= 0
##$TM2= 0
##$TOPLEV= 0
##$USERP1= <user>
##$USERP2= <user>
##$USERP3= <user>
##$USERP4= <user>
##$USERP5= <user>
##$WDW= 1
##$XDIM= 65536
##$YMAX_p= 363892770
##$YMIN_p= -10887920
$$ End of Bruker specific parameters
$$ ---------------------------------
##NTUPLES= NMR SPECTRUM
##VAR_NAME=  FREQUENCY,     SPECTRUM/REAL,   SPECTRUM/IMAG
##SYMBOL=    X,             R,               I
##VAR_TYPE=  INDEPENDENT,   DEPENDENT,       DEPENDENT
##VAR_FORM=  AFFN,          ASDF,            ASDF
##VAR_DIM=   65536,         65536,           65536
##UNITS=     HZ,            ARBITRARY UNITS, ARBITRARY UNITS
##FACTOR=    0.49542278885378, 1,            1
##FIRST=     16045.7642231865, 0,            0
##LAST=      -16421.768244346, 0,            0
##MIN=       -16421.768244346, -10887920,    0
##MAX=       16045.7642231865, 363892770,    0
$$ Real data points
##PAGE= N=1
##DATA TABLE= (X++(R..R)), XYDATA
$$ [...]
39259g096m2226j30112j08699o5088q5871q0390O1788K10011J23014j44785k31742
39248e01196J5931K70391J82310j02109j96700r0167r6278k40710j78192J69937
39238g66783L69182J22844k27370k10729O4411J33951q6575k42791j41225K0590
39228i64495M7144P846K9173R6853J43836J41169P4003j4876n482J01853Q8937
39217b54039j41859k92897p3413K74714K91670L7801j4872J85714J61304k45160
39207g1037n34594l52720n5081p4543k19152q9616J98208K58614J24374J20187
39197f95360K19250R5108k41795l89010j75180J05538J66620P3080J9008O2029
39187g60712J66548K66724K31504j2183k95280l56803j78574L6728J81384K90819
$$ plain form
39259 -7096 -49322 -179434 -288133 -353221 -439092 -519482 -457694 -247683 -124669 -269454 -501196
39248 -501196 -485265 -214874 -32564 -134673 -331373 -421540 -517818 -758528 -936720 -766783
39238 -766783 -397601 -274757 -502127 -712856 -648445 -514494 -601069 -843860 -985085 -964495
39228 -964495 -917351 -909505 -880332 -783479 -639643 -498474 -424471 -439347 -444829 -342976 -254039
39217 -254039 -395898 -688795 -762208 -487494 -195824 -158023 -172895 12819 174123 -71037
39207 -71037 -605631 -958351 -1013432 -1087975 -1307127 -1396743 -1198535 -939921 -815547 -695360
39197 -695360 -476110 -381002 -622797 -1011807 -1186987 -1081449 -914829 -841749 -822741 -760712
39187 -760712 -594164 -327440 -95936 -108119 -403399 -760202 -938776 -902048 -720664 -429845
39177d29845L21248J71360p4148k03515j89608j73454j53976j1437J56021Q5250
39167e02104j90844k98967p1249K04240K42897J48434J26475J10111n3567k56432
39157e41006k58992n2764J41937J73741Q9011K5912Q9646K48169K89355K9000
39147B34009l70301m90236j84942J93253K56685O3699o7112l5812M402k7825n0723
39136d74903j5950J5996q072q3738j84549k42685j65968K1510J56018J61019J64971
39125f56351K58870K98806J42102o8982r7152K7657Q9695M6841L6507P1557J6231
39114A65781j34591k24236k11242k17475k50531j44951J21000K98360K08693J5284
39104c73908k3189P6477R2928l9614j38396m0885J77878L08292K54027J16152
$$ plain form
39177 -429845 -108597 62763 -11385 -214900 -404508 -577962 -731938 -743375 -587354 -502104
39167 -502104 -692948 -991915 -1063164 -858924 -616027 -467593 -341118 -231007 -284574 -541006
39157 -541006 -799998 -852762 -710825 -537084 -448073 -422161 -332515 -84346 205009 234009
39147 234009 -136292 -626528 -811470 -618217 -361532 -297833 -364945 -400757 -396355 -424180 -474903
39136 -474903 -490853 -474857 -482929 -566667 -751216 -993901 -1159869 -1138359 -982341 -821322 -656351
39125 -656351 -397481 -98675 43427 -25555 -122707 -95050 -5355 41486 77993 149550 165781
39114 165781 31190 -193046 -404288 -621763 -872294 -1017245 -896245 -597885 -389192 -373908
39104 -373908 -397097 -320620 -227692 -267306 -405702 -446587 -268709 39583 293610 409762
39094D09762M2458M8831L8941k5054p1108o5993r7285k15718k98544k03535J2525
39083d24720J74865K29867K37239J73694m6388l45842m86651l59227j11003P1198
39073h86968J58590K02403K10010J80762J43522Q9006k0165j21708q0262Q7133
39063c7677J66519L1124j72510k43379j95623j63522j58816j01983j3157K0782
39053h68242K8863J14658K37006K20294K6547j45372j13517N3058J48541R5131
39043b03033j3059q8284j54651k50206l03539j86144J06688L82604M18996K08571
39033h2057j3074k2378J42184K39155J21530r5100j92824j21532l3192n6262j27611
39022b41161j05132J3352Q2358J5735r5654j12314k1171P0587O9099k4996j28594
$$ plain form
39094 409762 452220 501051 539992 514938 443830 377837 280552 64834 -233710 -437245 -424720
39083 -424720 -249855 -19988 217251 390945 344557 -1285 -487936 -847163 -958166 -886968
39073 -886968 -728378 -525975 -315965 -135203 8319 97325 77160 -44548 -124810 -37677
39063 -37677 128842 159966 -12544 -255923 -451546 -615068 -773884 -875867 -889024 -868242
39053 -868242 -839379 -724721 -487715 -267421 -240874 -386246 -499763 -446705 -298164 -203033
39043 -203033 -216092 -304376 -459027 -709233 -1012772 -1198916 -1092228 -709624 -290628 -82057
39033 -82057 -95131 -117509 24675 263830 385360 290260 97436 -24096 -57288 -113550 -241161
39022 -241161 -346293 -332941 -250583 -234848 -330502 -442816 -463987 -393400 -324301 -349297 -477891
39011d77891j34921j1031J31405J31413j3701j21574o4539O4450J11089P3200
39001c12100L1464k1846j12906j31921L5827K59378K71354M4436j57965j54023
38991b48302n6493l5076o7643n1783j707J4114K1649Q6214J74325J83598P4298
38980I3194r5384k25269k35027j31934k6472j553J2684J11736K04536J23843n9552
38969b29198q5424P9452J51443k1290j98310j26587O9268J21881M1585K3462Q6249
38958h7469R2808K7868j8661o2425j53828j78807j3920J83392J46172o5743j16660
38947b47273R5105K85280K12758j2879j54772j50315p9011j5323j3658r2559j68437
38936c41084j36898l6830J8510N1776J58025K56940J71255m0315j25035n3401
$$ plain form
39011 -477891 -612812 -623843 -492438 -361025 -374726 -496300 -560839 -496389 -385300 -312100
39001 -312100 -280636 -302482 -415388 -547309 -511482 -252104 19250 63686 -94279 -248302
38991 -248302 -304795 -339871 -407514 -459297 -461004 -446890 -425241 -339027 -164702 18896 93194
38980 93194 -2190 -227459 -462486 -594420 -620892 -622445 -609761 -498025 -293489 -169646 -229198
38969 -229198 -314622 -235170 -83727 -105017 -303327 -429914 -360646 -238765 -197180 -173718 -87469
38958 -87469 5339 33207 14546 -47879 -201707 -380514 -394434 -211042 -64870 -130613 -247273
38947 -247273 -152168 133112 345870 332991 178219 27904 -51107 -66430 -80088 -172647 -341084
38936 -341084 -477982 -514812 -496302 -444526 -286501 -29561 141694 101379 -23656 -77057
38926g7057p0009k41272l03385j15300Q5073R1353O0270J59661K01666k1464k91615
38915e22079k60213j4243P6916k5925j2233K09062L53681K40698M3960n1759j08736
38904g0871j95600j85018P214K05454K04777N6986n8320j08578j66158k02031
38894e12145j22086M0460J39855J12210L0140k3580l2088p727K5239J7108n6986
38883c89600j38076j44848q4148k8051R604Q5785K00638K45519J37429m5642j37399
38872b88789q3134l102l4093j52601k00529p5967J39835K56597J64216n1539j82027
38861e11133j07266O2099J04691k8318j34307l8431J39367J41955n0950j97080
38851f19373j49122l2097L064l50M6701R1396O3421L9587R9826J42225M5639q5206
$$ plain form
38926 -77057 -147066 -388338 -691723 -807023 -721950 -630597 -570327 -410666 -209000 -230464 -522079
38915 -522079 -782292 -796535 -719619 -745544 -757777 -548715 -195034 45664 89624 37865 -70871
38904 -70871 -266471 -451489 -444275 -238821 -34044 22942 -35378 -143956 -310114 -512145
38894 -512145 -634231 -593771 -453916 -341706 -311566 -335146 -367234 -374961 -349722 -332614 -389600
38883 -389600 -527676 -672524 -756672 -784723 -775119 -689334 -488696 -243177 -105748 -151390 -288789
38872 -288789 -371923 -375025 -409118 -561719 -762248 -838215 -698380 -441783 -277567 -329106 -511133
38861 -511133 -618399 -556300 -451609 -479927 -614234 -652665 -513298 -371343 -422293 -619373
38851 -619373 -768495 -800592 -797528 -797878 -751177 -659781 -596360 -556773 -456947 -314722 -269083 -354289
38839c54289o3315O6570J02143K5714P672P5965O3938o6981j31828m3373L6643
38828b81141M022J4360J82068K99343J21212k07738l02687p0351J77644J69345
38818A06077l733r5184n3726k1802p8003j34567r4202o56K7087l5042r0556p3383
38806e47690m1599o4563q9881k6090Q5006J12263M6758K2231Q8561J12699j4568
38795c16873j94418k44823j24662N8144J87361K04061J11083J186M631J19249
38785a95061J75713O9290p1287p4765O384j1244j42502k16019j41642j2513P6325
38774e37321J36374J71448J24116J1434l3570M3470J01854K48j84013k58638j80279
38763f04877q0778n4257n2811j4079K3816l634o8412p5733J7966J60853K59105
$$ plain form
38839 -354289 -417604 -351034 -248891 -223177 -215505 -139540 -75602 -142583 -274411 -317784 -281141
38828 -281141 -277119 -262759 -80691 218652 339864 132126 -170561 -240912 -63268 106077
38818 106077 102344 7160 -46566 -68368 -146371 -280938 -375140 -375796 -348709 -383751 -474307 -547690
38806 -547690 -589289 -653852 -743733 -769823 -684817 -572554 -525796 -503565 -415004 -302305 -316873
38795 -316873 -511291 -756114 -880776 -822632 -635271 -431210 -320127 -318941 -314310 -195061
38785 -195061 -19348 49942 -21345 -96110 -89726 -100970 -243472 -459491 -601133 -613646 -537321
38774 -537321 -400947 -229499 -105383 -93949 -127519 -84049 17805 18053 -165960 -424598 -604877
38763 -604877 -685655 -739912 -792723 -806802 -782986 -786620 -855032 -930765 -912799 -751946 -492841
38752d92841K35747P0083j54131k57347j18875J46018K56989Q6177j71329k38796
38742f38305j02226J8429n17n8818m6733K402M8964J57673L37667M16305K54179
38731C89020J490n5893J17663K54459J34448j58515l71071l56537j73733J460
38721b17209K3343j01540k15923j78557j7663J29540J80533J29222k4186k25855
38711e18295l03653j34500J30569K04706N2414p0629j8063M4777m1141j44513
38701g98328p8622O6128P6718j6926o429J23046J68480O2032k5974l35k467j37524
38689e70201k53996j61073Q5885K84095L50313L23988K09598R768j49625j34961
38679f209k8207l6799j70776k13745o5293R5254R3807K3331N7934J48537J14226
$$ plain form
38752 -492841 -257094 -187011 -341142 -598489 -717364 -571346 -314357 -228180 -399509 -638305
38742 -638305 -740531 -722102 -722619 -781437 -828170 -825768 -776804 -619131 -281464 134841 389020
38731 389020 390510 334617 452280 706739 841187 682672 311601 -44936 -218669 -217209
38721 -217209 -193866 -295406 -511329 -689886 -707549 -578009 -397476 -268254 -292440 -518295
38711 -518295 -821948 -956448 -825879 -621173 -568759 -639388 -657451 -612674 -653815 -798328
38701 -798328 -876950 -810822 -734104 -751030 -757459 -634413 -465933 -403901 -429875 -430210 -432677 -570201
38689 -570201 -824197 -985270 -899385 -615290 -264977 59011 268609 278377 128752 -6209
38679 -6209 -34416 -71215 -241991 -455736 -521029 -425775 -331968 -308637 -250703 -102166 12060
38668A2060l5104r2388K5341J47181R6906q2016k24372k45281j65675l9844N4856
38657e48336M1647n0172p4401M3971J77005J59367L2630p568J06476K18784J66166
38646B65569j3364j42476j12479J8359J01051M4605q7637j30421k936J68205J75728
38635B84204j4072k10246k31194j15711l9209p2770j15856o5891L1586N3346k2683
38624e18496q2751l5340N8631P1183q520n8728l748P9705Q6343M0715M7433J19739
38612b03834J53028P3699o2251j44600j32830p7215m3969m1818k0004N8028J44100
38601b97666J44412M2481o7949j05837j00247j11535j17585o1192L6211J06031
38591e32876J45601J92469K07766J13712m2598r5031K4205J81474K17187J32446
$$ plain form
38668 12060 -23044 -115432 -90091 57090 153996 71980 -152392 -397673 -563348 -603192 -548336
38657 -548336 -506689 -556861 -631262 -587291 -410286 -250919 -218289 -225857 -119381 99403 265569
38646 265569 252205 109729 -2750 15609 116660 161265 73628 -56793 -59729 108476 284204
38635 284204 270132 59886 -171308 -287019 -326228 -398998 -514854 -580745 -549159 -495813 -518496
38624 -518496 -601247 -636587 -577956 -506773 -515293 -574021 -577769 -498064 -411721 -371006 -323573 -203834
38612 -203834 -50806 22893 -39358 -183958 -316788 -394003 -437972 -479790 -499794 -441766 -297666
38601 -297666 -153254 -110773 -178722 -284559 -384806 -496341 -613926 -675118 -638907 -532876
38591 -532876 -387275 -194806 12960 126672 84074 -10957 13248 194722 411909 544355
38581E44355K9377n2402j42346k25943k29459j30853k2771k6705j50832k54919
38571f62498j86236L8145K24836K18121P7071k5428l6341n0275j16503j46487
38561f65595n8870Q1790J39999O8403n8266j26719p0630Q0411K05727J89332M0231
38550a74187j10590j39927k9401J44908K60119K08206l397k17850k76891j90392
38540e29402p6243K0616J11967J15141p0162l10811l01630J8115L17283K92439
38530d12687N8327o5326r421L0980m5966j22529q8928P095P8008J12545J26241
38519c31661J07205N5434J804l2487l8189Q380J03119J65819J19298O502n3674
38508A11550k0456L6170M7921J6382k6215n5455o0168o4856j21549k19524k46404
$$ plain form
38581 544355 573732 521330 378984 153041 -76418 -207271 -230042 -256747 -407579 -662498
38571 -662498 -848734 -810589 -585753 -367632 -290561 -315989 -352330 -402605 -519108 -665595
38561 -665595 -724465 -642675 -502676 -434273 -492539 -619258 -689888 -609477 -403750 -214418 -174187
38550 -174187 -284777 -424704 -454105 -309197 -49078 159128 155731 -62119 -339010 -529402
38540 -529402 -605645 -585029 -473062 -357921 -428083 -738894 -1040524 -1022409 -705126 -412687
38530 -412687 -354360 -419686 -429107 -398127 -444093 -566622 -655550 -648455 -570447 -457902 -331661
38519 -331661 -224456 -169022 -167218 -199705 -237894 -229514 -126395 39424 158722 165224 111550
38508 111550 91094 127264 175185 191567 165352 109897 49729 -15127 -136676 -356200 -602604
38497f02604j21757P0102J77992J81449J78158J94758J45909N851j04176o8804
38487E6878N6862J11429K7008r8199j36677r8308j05276j93438k25201q8257R0467
38476f02712R0856o2722j20445n645M8326j14451k87023k09995L0668J77762K17641
38465h37740L08442L94224K50532q8883l00706k37874j12120r8764o1793J40772
38455f43910L26524K18317j27816l62486k70431J4495K13123J94299M9915m5785
38445d33755j6651P1011J28046J44180J29765M9754p7878j11741K2433J47780
38435E2944N0698j73578k39291j13909n0035j37383j47486N1149K31236J60250
38425c15405l4087q6673P624O2213K3599o331K3270Q2555J52160J78996N2815
$$ plain form
38497 -602604 -724361 -654259 -476267 -294818 -116660 78098 224007 229858 125682 56878
38487 56878 113740 225169 252177 153978 17301 -81007 -186283 -379721 -604922 -693179 -602712
38476 -602712 -511856 -574578 -695023 -700668 -652342 -766793 -1053816 -1263811 -1233143 -1055381 -837740
38465 -837740 -529298 -135074 115458 26575 -274131 -512005 -624125 -722889 -784682 -643910
38455 -643910 -317386 -99069 -226885 -589371 -859802 -845307 -632184 -437885 -387970 -433755
38445 -433755 -450406 -379395 -251349 -107169 22596 72350 -5528 -117269 -94836 52944
38435 52944 103642 -69936 -309227 -423136 -473171 -610554 -758040 -706891 -475655 -315405
38425 -315405 -349492 -436165 -428541 -366328 -342729 -349060 -325790 -243235 -91075 87921 140736
38414A40736k01818l38844j94320M4800R1922l6099j12310r3437j29020k21312
38404a049702j82123L7402K39958K76778K28909K11140J87953R0126l2037q0820
38394g2416m6689K34r089r6439k01387j98497m1896J25602J26413k586n5971L9782
38382d32939J27072N9216j00025j87251j42367l0886N8746Q1093N0111K5466M4639
38371d47125O8385M2129j2601l8090l9112n2693n4803n326M5696K4031j7758M1183
38359d46084J80552K36546J33165k0609r8741r7412o9268l6931j4507j4259n269
38348b52817L5836L2588j01069k72179k74727q4970P7948N7624l6951l2451N9435
38337g91733J25559J57691K16889K70550K24088Q2984m8645j16409j47927j42995
$$ plain form
38414 140736 -61082 -399926 -594246 -549446 -457524 -493623 -605933 -699370 -828390 -1049702
38404 -1049702 -1231825 -1194423 -954465 -677687 -448778 -237638 -49685 40441 8404 -72416
38394 -72416 -119105 -118871 -127960 -224399 -425786 -624283 -666179 -540577 -414164 -416750 -472721 -432939
38382 -432939 -305867 -246651 -346676 -533927 -676294 -707180 -648434 -567341 -517230 -491764 -447125
38371 -447125 -378740 -336611 -349212 -387302 -426414 -479107 -533910 -539236 -493540 -469509 -487267 -446084
38359 -446084 -265532 -28986 104179 83570 -15171 -112583 -181851 -218782 -233289 -247548 -252817
38348 -252817 -216981 -184393 -285462 -557641 -832368 -917338 -839390 -781766 -818717 -851168 -791733
38337 -791733 -666174 -508483 -291594 -21044 203044 286028 237383 120974 -26953 -169948
38327a69948n0340J10253J95561Q7122j35967k51004j49065J9816L7396p6604
38317c82780q3817J11282K84020K02910j9850r4951J0891N8254o0764j69110j24591
38306b68506m7924r4584j89195j58180k887J25816J50965J25270J06893R0986
38296a61346M2745o4702k08181k82563j92916j2674O3368j7047p1812N6391K72549
38285e76188L74890L18134J96645N8008j04707k26019k02786o2086L7325J488
38275a85296r4296j31477j05763j02202j40912j19703L7608K11912J91309j0872
38265d49692r5579J15110L50186K22072j83201l73516j44737J36540R0502j48646
38255d80961k01806m039J90287K13222J17029j2797j30927j66087q9555j3859
$$ plain form
38327 -169948 -220288 -110035 85526 172648 36681 -214323 -363388 -343572 -306176 -382780
38317 -382780 -466597 -355315 -71295 131615 111765 16814 27705 85959 25195 -143915 -268506
38306 -268506 -316430 -411014 -600209 -758389 -761276 -635460 -484495 -359225 -252332 -161346
38296 -161346 -118601 -183303 -391484 -674047 -866963 -879637 -816269 -833316 -905128 -848737 -576188
38285 -576188 -201298 116836 313481 371489 266782 40763 -162023 -224109 -186784 -185296
38275 -185296 -279592 -411069 -516832 -619034 -759946 -879649 -842041 -630129 -438820 -449692
38265 -449692 -545271 -430161 -79975 142097 -41104 -414620 -559357 -422817 -332315 -480961
38255 -480961 -682767 -686806 -496519 -283297 -166268 -179065 -309992 -476079 -565634 -579493
38245e79493n3674j41513j36425l9221N9681J48907K32559K06429J2209j76669
38235d67210j56133o657K9240q1699j65824j57297j33519p1194J30906L73423
38225g05964M00381J79056l1018n3230J5718N4330Q7558J15133L1913j46288k07713
38214b60124m7731J42313J33165n6211k48892l25016k42239j7324J98729K01027
38204e22303L652j36140o9624O0359R7116R8506J29329O9470j42114k80858j32215
38193h24822J35225J85838R974r6088K460J26208J12672L5538K2376N9902P4047
38182a56670N8857L9042L324n6451j05332j09465p8979m8826m3295n1712k4947
38171e74454O5253J53944J44386N8990K0889N2228L4342o7644j14610l9519K611
$$ plain form
38245 -579493 -633167 -774680 -911105 -950326 -890645 -741738 -509179 -302750 -290541 -467210
38235 -467210 -623343 -630000 -600760 -682459 -848283 -1005580 -1139099 -1210293 -1079387 -705964
38225 -705964 -305583 -126527 -157545 -210775 -195057 -140727 -53169 61964 93877 -52411 -260124
38214 -260124 -307855 -165542 -32377 -88588 -337480 -662496 -904735 -922059 -723330 -522303
38204 -522303 -518651 -654791 -724415 -664056 -566940 -468434 -339105 -269635 -411749 -692607 -824822
38193 -824822 -689597 -503759 -493785 -589873 -587413 -461205 -348533 -312995 -290619 -230717 -156670
38182 -156670 -97813 -58771 -55447 -111898 -217230 -326695 -405674 -454500 -497795 -549507 -574454
38171 -574454 -509201 -355257 -210871 -151881 -130992 -78764 -44422 -112066 -226676 -266195 -263584
38160b63584r9881j75927k4440K31434L05521J71866M8665J4972n7113j88842
38150c7329k13973p2629P4972J11441J06646J14097N6992o8306j00365K1556R3720
38139H6822o3764l00954l23219r5519J30972J61271N9600K054N0789J17603R5851
38128g8494q407q2556m8373L8328P5657N5917K9526k1234j33560k15768j26068
38117e15032Q1625J78147P9051m3568m6810j4746m9281o1744M4803J41591M3847
38106a62117j73474k44565o6046J90774L01692J86360p8356l03083k89123l7412
38096f75350J82567J25857j03050j87127l0146J42412J24123l1278j60315j96908
38086h09215j46282j1263J46474J92577Q2752m4517l8941O4909J14321M6916n6361
$$ plain form
38160 -263584 -363465 -539392 -563832 -332398 -26877 144989 193654 208626 151513 -37329
38150 -37329 -251302 -323931 -248959 -137518 -30872 83225 140217 71911 -28454 -6898 86822
38139 86822 23058 -277896 -601115 -696634 -565662 -404391 -344791 -342737 -291948 -174345 -78494
38128 -78494 -86901 -169457 -217830 -179502 -103845 -47928 -18402 -39636 -173196 -388964 -515032
38117 -515032 -433407 -255260 -176209 -219777 -266587 -281333 -330614 -392358 -347555 -205964 -162117
38106 -162117 -335591 -580156 -646202 -455428 -153736 32624 -45732 -348815 -637938 -675350
38096 -675350 -492783 -366926 -469976 -657103 -687249 -544837 -420714 -451992 -612307 -809215
38086 -809215 -955497 -966760 -820286 -627709 -544957 -589474 -628415 -563506 -449185 -402269 -458630
38075d58630r0974k8570P7637J36048R5155J1877p851L4978J8035j04321j87342
38064e03958r0168Q9288J23531k0570j26993l5958J41643K00671J16831J9011
38054h6672l9385j17167j98418j43448R1212L12218L00613R7325o1242o2250j9479
38043G3307m8368r9716q4664k9268l185M677L1411M4772J2992r803J2234o342
38031a01953j20640j85236l8723J87181J86969p0166k64276j82285o326R006o8604
38020f55053l641J99816L04519K01179K3383r9366j86014k58584k45731j16778
38010h36270L2830J21235J87759K69594K84663J59722p564n9424j3099l5498j75351
37999g1403k68276j73486J1116P8519p891q9022m7583N6625J19478J42340J70286
$$ plain form
38075 -458630 -549604 -578174 -500537 -364489 -269334 -257457 -265308 -230330 -212295 -316616 -503958
38064 -503958 -594126 -504838 -381307 -401877 -528870 -564828 -423185 -222514 -105683 -86672
38054 -86672 -126057 -243224 -441642 -585090 -493878 -181660 118953 216278 155036 92786 73307
38043 73307 24939 -74777 -159441 -188709 -191894 -187217 -155806 -111034 -98042 -107845 -95611 -101953
38031 -101953 -222593 -407829 -446552 -259371 -72402 -142568 -406844 -589129 -595455 -586449 -655053
38020 -655053 -658694 -458878 -154359 46820 70203 -29163 -215177 -473761 -719492 -836270
38010 -836270 -803440 -682205 -494446 -224852 59811 219533 211969 152545 139446 103948 -71403
37999 -71403 -339679 -513165 -502049 -423530 -431421 -520443 -568026 -511401 -391923 -249583 -79297
37988g9297J67605O9993p2708j21384k7723R6176J13966J1827j10288j48403q5294
37977a85530m804k694n2588j7998J31557K01241J4783k77394l39811j09921J12502
37966e30657J02690K800L6926J48641J34116j2523j22931j35929j27873j14862
37956f19602m5271L4197J5998o4862n9494N2177J29942R8943K8840k7231q8576
37945e44939j19265l9741Q9906R1871o0211j78135j38333m2438j1847k326O4850
37934h90608J45739J67528J46637J10578L4507n4686o0920J359k0649j56387k08735
37923g85637n4330J40251J74784J06526Q6654Q4895J7041j3553J14448K48643
37913A19722J50461r7492j92050q6125k9410j11054j08811R7904K72115J53723
$$ plain form
37988 -79297 88308 158301 85593 -35791 -63514 32662 146628 158455 48167 -100236 -185530
37977 -185530 -190334 -193028 -245616 -263614 -132057 69184 83967 -193427 -533238 -643159 -530657
37966 -530657 -427967 -425167 -388241 -239600 -105484 -118007 -240938 -376867 -504740 -619602
37956 -619602 -664873 -630676 -614678 -679540 -739034 -686857 -556915 -457972 -429132 -456363 -544939
37945 -544939 -664204 -703945 -614039 -522168 -582379 -760514 -898847 -941285 -953132 -955458 -890608
37934 -890608 -744869 -577341 -430704 -320126 -285619 -340305 -401225 -399866 -420515 -576902 -785637
37923 -785637 -839967 -699716 -524932 -418406 -331752 -246857 -229816 -243369 -128921 119722
37913 119722 270183 172691 -19359 -105484 -134894 -245948 -354759 -256855 15260 168983
37903A68983j71078m14933m41492l09795j05205J01595K14831J90595J16017J04600
37893e45882J44366J28080N175j53404k22663j36918L2474J23847O4060l1392
37883e92257j9893N5748M4886n9204j12149n4706K5345P9685J50409J99588J05689
37872a76859r2366j64967k3362J20483P2691n2459m5038N7562O0526n7183j25659
37861d26631n7373N3290R5764N9978j0700o8936p4130l7449k6918o3994q1485
37850f38584n2347n6420j19227j07612O6922K52344K47445J04909L7412P7169
37840a87989N7036p9914j83481j47538n2359P771N3926R6791N3358r5910k02033
37829f80342j30495M1411J30422Q3330o199o5379j05643j31634r5525K8931J84968
$$ plain form
37903 168983 -2095 -417028 -858520 -1168315 -1273520 -1171925 -957094 -766499 -650482 -545882
37893 -545882 -401516 -273436 -268261 -421665 -644328 -781246 -748772 -624925 -560865 -592257
37883 -592257 -612150 -556402 -511516 -570720 -682869 -737575 -712230 -632545 -482136 -282548 -176859
37872 -176859 -269225 -434192 -457554 -337071 -264380 -316839 -361877 -304315 -243789 -300972 -426631
37861 -426631 -484004 -430714 -334950 -274972 -285672 -354608 -428738 -466187 -493105 -557099 -638584
37850 -638584 -690931 -747351 -866578 -974190 -907268 -654924 -407479 -302570 -265158 -187989
37840 -187989 -130953 -210867 -394348 -541886 -594245 -586474 -532548 -435757 -382399 -478309 -680342
37829 -680342 -810837 -769426 -639004 -555674 -561873 -627252 -732895 -864529 -960054 -931123 -746155
37818g46155K70809K18126M4086j39559j90824p5113O0981L3299j29809j74169
37808h28328N1768L32707L15746n707k43987j35765J01482J12170p2490j25501
37798d97905M7536J89130J13559n2841j33504j28220o8357Q5866K56526K16939
37788B8729o1795k70447j79534K9939Q8629N2914R8606J20612q2823l66369l85843
37777i27382j33465O4566O9920O4824J39900J44924M0461K6110J71416K44105
37767i4621Q3201j33541j80313j00428m4833q030P3071J23919L0148j75698l52423
37756g79548l72221j52587K58305N76054M95536J06814j54000q2661M7106l5042
37746i2244j92000j89192r2665m8118N1497K96908M01375O8408m22494m91674
$$ plain form
37818 -746155 -475346 -257220 -213134 -352693 -543517 -618630 -557649 -524350 -654159 -828328
37808 -828328 -776560 -443853 -128107 -133814 -377801 -513566 -412084 -299914 -372404 -497905
37798 -497905 -450369 -261239 -147680 -200521 -334025 -462245 -530602 -444736 -188210 28729
37788 28729 -33066 -303513 -483047 -453108 -364479 -311565 -212959 -92347 -175170 -541539 -927382
37777 -927382 -1060847 -996281 -926361 -861537 -721637 -576713 -536252 -510142 -338726 -94621
37767 -94621 -11420 -144961 -325274 -425702 -470535 -478565 -405494 -281575 -251427 -427125 -779548
37756 -779548 -1151769 -1304356 -1046051 -469997 25539 132353 -21647 -104308 -57202 -92244
37746 -92244 -284244 -473436 -566101 -614219 -562722 -265814 135561 203969 -218525 -710199
37736g10199q6168K49338J73129m8387o6160N6691J00434Q1871J10434J14996
37726b4021P181p6212J2510J17867j1368k78573l19788l8294K32194J91783l3679
37715b20400j21861j3809N9257m8325j95024j72639Q878J53776J36028K7926j6631
37704d02824O0281J69699J68819J0803j76606j99142k4336J52309J42298M124
37694i4575o6686l5704m9452j59569k19765j21292M0024J28296J50816J63874
37684b64033J31759J9657p6640m1747Q3798J60644J25226J1880j20394j88350
37674a58200j11008N4263J11869r127j14839k8256J13285N1678j86999l17649
37664e94983j97991J8255J41226J59726J53809J46993J01632k1476k04713l25790
$$ plain form
37736 -710199 -796367 -547029 -373900 -422287 -488447 -431756 -331322 -249451 -139017 -24021
37726 -24021 -16840 -93052 -80542 37325 25957 -252616 -572404 -610698 -378504 -186721 -220400
37715 -220400 -342261 -356070 -296813 -345138 -540162 -712801 -703923 -550147 -414119 -386193 -402824
37704 -402824 -342543 -172844 -4025 6778 -169828 -368970 -393306 -240997 -98699 -94575
37694 -94575 -161261 -196965 -246417 -405986 -625751 -747043 -707019 -578723 -427907 -264033
37684 -264033 -132274 -112617 -189257 -231004 -147206 13438 138664 150544 30150 -158200
37674 -158200 -269208 -214945 -103076 -112203 -227042 -255298 -142013 -90335 -277334 -594983
37664 -594983 -792974 -774719 -633493 -473767 -319958 -172965 -71333 -92809 -297522 -623312
37654f23312k45000k0141R6559Q599m4330J38213L38787K23434j04352k23809
37644d55352k9343J48054Q2891o5333j02945o7196j4332J07425K18875R3500k24952
37633c08708l34835n4927K38212J55947j17461j53351M8930J40926K5709o0796
37623d20354j5962j377q2253j03999l707O8950L7379K8833J08807J33102K430
37612b48151j41310j26644o085M8467q957q6692j06861o2897J1730N5322K0337
37601f51741l9934k921J46723K55895J94337L5947m1707O559N5363O76r4094q3576
37589b18473O2255J99723J72198n402j77523k44039k32108j64033K717K15712
37579c88973K52764j3787l53756l93017q9612K05748K09555L3389m1738N0510
$$ plain form
37654 -623312 -868312 -888453 -791894 -783295 -827625 -689412 -350625 -127191 -231543 -455352
37644 -455352 -484695 -336641 -253750 -319083 -422028 -489224 -503556 -396131 -177256 -83756 -308708
37633 -308708 -643543 -698470 -460258 -304311 -421772 -575123 -526193 -385267 -359558 -420354
37623 -420354 -436316 -437693 -519946 -623945 -627652 -558702 -521323 -492490 -383683 -250581 -248151
37612 -248151 -389461 -516105 -522190 -473723 -482680 -569372 -676233 -739130 -727400 -672078 -651741
37601 -651741 -691675 -694596 -547873 -291978 -97641 -61694 -103401 -96842 -41479 -40803 -134897 -218473
37589 -218473 -156218 43505 215703 210301 32778 -211261 -443369 -607402 -604685 -388973
37579 -388973 -136209 -149996 -503752 -896769 -986381 -780633 -571078 -537689 -579427 -528917
37569e28917J52463J49547P6773n124q6749j45833j25296l0130K9883k9926j27427
37558f70736r0971R7303K21466Q6026j97996l24497k01860p2862j29276j92438
37548a475841J1154L71769M82105K06136j20135j57479Q390P5210k7020j18967
37538g44678j00559n9496o3981m7440N2009J72141K04591J11999n9535k10478
37528g45427k19610l9338K06340L02143J71086l3416j06680r090J37605K07421
37518a28966J60091K5068j17980j61748o3509P3777R0137l3597j37823r0120L8143
37507c46527P6348j2242j04266j10325p8502p2376n8731M956N7819K2170m3857
37496f65533n605J40508K40098J91502P4589J2707K785k7681o2812j3841J25785
$$ plain form
37569 -528917 -376454 -226907 -150134 -155258 -242007 -387840 -513136 -543266 -513383 -543309 -670736
37558 -670736 -761707 -664404 -442938 -356912 -554908 -879405 -1081265 -1154127 -1283403 -1475841
37548 -1475841 -1464687 -1092918 -610813 -404677 -524812 -682291 -673901 -598691 -625711 -744678
37538 -744678 -845237 -904733 -968714 -1016154 -964145 -792004 -587413 -475414 -534949 -745427
37528 -745427 -965037 -1004375 -798035 -495892 -324806 -358222 -464902 -473992 -336387 -128966
37518 -128966 31125 56193 -61787 -223535 -287044 -213267 -123130 -156727 -294550 -384670 -346527
37507 -346527 -270179 -282421 -386687 -497012 -575514 -647890 -706621 -701665 -643846 -621676 -665533
37496 -665533 -671138 -530630 -290532 -99030 -24441 -11734 -8949 -36630 -99442 -113283 12502
37485A2502K49707K79011K40575J71820L9966j70338l54342l75544k40353q8717
37475b35713n264N9877J49749J89177R9516n1632j24706r1835l7107l891K8426
37464b3403K4537r1131k55532k63067m1733J94113K04287M9580j647J43405K79088
37453B18497J89455p0635k51038j97036l651J03498J2980j56613k03125r1101
37443d48769J2791k4299j25733j34952l2670P4794J12790P4463l0700j39170j16298
37432g77753P1122K32221J84200M6191P1060K15427J65031j63879m47904m10380
37422h14664j83418l7728O643O9935J17701N4420k3712M6443K01080K47933J90102
37411a25265J76262J83138N5854j47269j81428l4106J4433j46249k57709j21913
$$ plain form
37485 12502 262209 541220 781795 953615 993581 823243 468901 93357 -146996 -235713
37475 -235713 -240977 -181100 -31351 157826 257342 205710 81004 -10831 -47938 -51829 -23403
37464 -23403 1134 -89997 -345529 -608596 -650329 -456216 -251929 -202349 -203996 -60591 218497
37453 218497 407952 337317 86279 -110757 -114408 -10910 2070 -154543 -357668 -448769
37443 -448769 -435978 -460277 -586010 -720962 -753632 -678838 -566048 -491585 -522285 -661455 -777753
37432 -777753 -706631 -474410 -290210 -244019 -172959 42468 207499 43620 -404284 -814664
37422 -814664 -998082 -1035810 -1029167 -959232 -841531 -787111 -810823 -764380 -563300 -315367 -125265
37411 -125265 50997 234135 289989 142720 -38708 -72814 -58381 -204630 -462339 -584252
37401e84252P2377P9267j1101J1058P8400k892j44385p9324J68487K69509P9946
37390f2910j58276j94520p9535J9421P6601J22503R1425n5304j77885j18432N3512
37379d83400J17545r102j92229k70062k07263o5423Q1247J83731K30546K35841
37369c78569J99910J12286J2629j3486N3083J12041N8958q7406k12249k11385
37359c54188n3843J74475K65335O1052k95183m32252j99322J02515J08151j21946
37349g45206k28315q1334R2724J05019M3503N2461J13795J54718J76872J64192
37339a51571L6871j79394k95250k01872l7426K1140J93K1410P8341Q6776O1482
37328e59300P4782J10277J11526J05632J25295Q6090q2887k52490k34823p0074
$$ plain form
37401 -584252 -511875 -432608 -443709 -432651 -354251 -357143 -501528 -580852 -412365 -142856 -62910
37390 -62910 -221186 -415706 -495241 -475820 -399219 -276716 -185291 -240595 -418480 -536912 -483400
37379 -483400 -365855 -374957 -567186 -837248 -1044511 -1109934 -1028687 -844956 -614410 -378569
37369 -378569 -178659 -66373 -53744 -67230 -14147 97894 156852 69446 -142803 -354188
37359 -354188 -408031 -233556 31779 92831 -202352 -634604 -833926 -731411 -623260 -745206
37349 -745206 -973521 -1054855 -962131 -857112 -813609 -761148 -647353 -492635 -315763 -151571
37339 -151571 -114700 -294094 -589344 -791216 -828642 -807502 -807309 -785899 -707558 -620782 -559300
37328 -559300 -484518 -374241 -262715 -157083 -31788 54302 -28585 -281075 -515898 -585972
37318e85972L4272K8952O0338J66779J82204K7166j20617q1921O1174J07931K1947
37307i7747q2247j41314j67138j27595K2246J97268K27509P8065r9595j75063
37297c65611j78799j73937j11534O6057K55908K85116J56239M6759L5731n575
37287A0354j65340k91817k01576J7215J08150J1777p7535k5967P2822R7136P4906
37276c69875P4308P7428O4646Q6361J46916J44736L0480j00335j69007k24439
37266b38781k82602k22772j228J84879J40542l8058j13111m0878M2191P2760Q3978
37255d13080N2743n3573j33834p1584N5141R1770O7652J06097J45250K6198j75618
37244c02838k06985l7679Q7510M1579k3293J8820P0664K8949l3360k2679K4319
$$ plain form
37318 -585972 -551700 -522748 -462410 -295631 -113427 -86261 -206878 -288799 -227625 -119694 -97747
37307 -97747 -179994 -321308 -488446 -616041 -593795 -396527 -169018 -90953 -190548 -365611
37297 -365611 -544410 -718347 -829881 -763824 -507916 -222800 -66561 -19802 15929 10354
37287 10354 -154986 -446803 -648379 -631164 -523014 -511237 -588772 -614739 -541917 -444781 -369875
37276 -369875 -295567 -218139 -153493 -67132 79784 224520 255000 154665 -14342 -238781
37266 -238781 -521383 -744155 -745383 -560504 -419962 -458020 -571131 -612009 -569818 -497058 -413080
37255 -413080 -360337 -413910 -547744 -619328 -564187 -472417 -404765 -298668 -153418 -127220 -302838
37244 -302838 -509823 -547502 -459992 -418413 -441706 -422886 -352222 -323273 -356633 -379312 -354993
37233c54993M9700P5042J13659J21397P9219k012j41744k96105k72409L1463L68301
37222b28482M04894J91764N4490P6879P2915L4046J55829M00285M99989M44515
37212B107124M81420O12269O51203P90129J392985K202864K712899L471648N635380
37203B0057921Q472256Q772762M365752k511609p119011p322067n209596l648953
37195A5857455l111408k567016j794925j386147j343626j094098o06690m16433
37187C537112o17293o98646m10805r1768m0846j29704j59533j56803j77405j60508
37177H93801r9305r4549j49040j24919K4913J56928J21675p3542k95984l87182
37167b7204k72851p0111r435j43026k36385q3459J87304K89367J62506o75m3163
$$ plain form
37233 -354993 -305293 -230251 -116592 4805 84024 82012 -59732 -355837 -628246 -596783 -228482
37222 -228482 176412 368176 422666 499545 572460 606506 762335 1162620 1662609 2107124
37212 2107124 2588544 3200813 3852016 4642145 6035130 8237994 10950893 14422541 20057921
37203 20057921 28530177 37302939 41668691 39157082 32038071 24716004 19506408 15857455
37195 15857455 12746047 10179031 8384106 6997959 5654333 4560235 3953545 3537112
37187 3537112 2919819 2221173 1810368 1718600 1677754 1548050 1388517 1231714 1054309 893801
37177 893801 794496 699947 550907 425988 450901 607829 729504 655962 359978 -27204
37167 -27204 -300055 -370166 -379601 -522627 -759012 -842471 -655167 -365800 -203294 -203969 -247132
37156b47132J5108P8918P3093k8153j57305j89228r8459J087K7018O459o2012
37145e80606k17658l27561j42571K70169M47274J43723k44433k09795J41562K96814
37135d23082J05296j08214j24973o8648m5061K5740J37628J36329L3225L9679
37125b92081J77362J88339k8429k09955j28470Q6833K07038K18920J95805J08964
37115E24326k1613k7429J24178J69801o0737k97283j86746J49294K68295N7244
37105F99330j30078k4043J94717K07589j813j92049k07665j09834k4537J139o376
37094D06380p548J7310N4708O1477M924q3738j13332k3699J25827K04625J68699
37083H15633J10577J02438O6831r0460k78020l06632j70606o5415q5867r2355
$$ plain form
37156 -247132 -232024 -153106 -80013 -108166 -265471 -454699 -553158 -552071 -525053 -518594 -580606
37145 -580606 -798264 -1125825 -1268396 -998227 -550953 -407230 -651663 -861458 -719896 -423082
37135 -423082 -317786 -426000 -550973 -619621 -664682 -638942 -501314 -364985 -331760 -292081
37125 -292081 -114719 73620 45191 -164764 -293234 -206401 637 219557 415362 524326
37115 524326 502713 475284 599462 769263 708526 411243 224497 373791 642086 699330
37105 699330 569252 545209 739926 947515 945702 753653 545988 436154 411617 412756 406380
37094 406380 398832 416142 470850 532327 537251 453513 340181 316482 442309 646934 815633
37083 815633 926210 1028648 1095479 1005019 726999 420367 249761 184346 98479 6124
37073F124K6308J32926M7517j49084k14440r4065K2793m65p2926n1640M8523J11782
37061a86647J00455P2930N8277J3796p5825j34424q8363J1050L7331l4872q9221
37050c15513m4709J5532k3084j20134j46659q5586j9129N0577J83913K99789K06091
37039A088q5553k80790j81786K0256J5018j82580k68405p9920K04910L05877J34409
37028c97476j60116l27737k08780J08717L35306K77485N7527o0656o083P4915
37018c06898P3891K2553m0614j12819j20518L0701K47417K84624Q0227j25906
37008C2658j24571k2328m0201j68614k17930j25973o513P3660J54960K04939Q7189
36997a52724j94618l80484k34464J28263L44753K32444j3777r8220R537R2374
$$ plain form
37073 6124 32432 165358 212875 63791 -150649 -244714 -221921 -222386 -295312 -346952 -298429 -186647
37061 -186647 -86192 -13262 45015 58811 -17014 -151438 -239801 -228751 -191420 -226292 -315513
37050 -315513 -360222 -344690 -367774 -487908 -634567 -720153 -739282 -688705 -504792 -205003 1088
37039 1088 -84465 -365255 -547041 -526785 -511767 -694347 -962752 -1042672 -837762 -531885 -397476
37028 -397476 -557592 -885329 -1094109 -985392 -650086 -372601 -315074 -375730 -381813 -306898
37018 -306898 -233007 -210454 -251068 -363887 -484405 -453704 -206287 78337 158564 32658
37008 32658 -91913 -114241 -154442 -323056 -540986 -666959 -673472 -599812 -444852 -239913 -152724
36997 -152724 -347342 -727826 -962290 -834027 -489274 -256830 -270607 -368827 -359290 -266916
36987b66916K0555p7670k5037J43118K32117J44463k8660j47349j47351l8847
36977a91577J01431J33120k5880k51888l13249j57658K3650O9584M1004N2594
36967e18869O7070J764p7460m4974O8482J16747N4729m1202j29614k13767k22076
36956i39170o6458J66871K61850J48457j6706q3007o9807n7282o7828j10675j92284
36945a026039k22454p3058J91362L13143J79391o242k1613O9435P9456J1836l017
36934e07800K2435l1479j39324j54633p6072n6108j15968p8029J39003L48319
36924f49656L30722J06863j30683k47495k27589r9064P9759K03566J90528P0930
36914c72119l6062k7813R9831K37807K41308Q3453q4010j07991n0181r8868k65158
$$ plain form
36987 -266916 -246361 -324031 -349068 -205950 26167 170630 141970 -5379 -152730 -191577
36977 -191577 -90146 42974 17094 -234794 -548043 -705701 -682051 -612467 -571463 -518869
36967 -518869 -451799 -450035 -527495 -572469 -503987 -387240 -332511 -373713 -503327 -717094 -939170
36956 -939170 -1005628 -838757 -576907 -428450 -445156 -528163 -597970 -655252 -723080 -833755 -1026039
36945 -1026039 -1248493 -1321551 -1130189 -817046 -637655 -643897 -665510 -596075 -516619 -504783 -507800
36934 -507800 -485365 -516844 -656168 -810801 -886873 -942981 -1058949 -1136978 -997975 -649656
36924 -649656 -318934 -212071 -342754 -590249 -817838 -916902 -837143 -633577 -443049 -372119
36914 -372119 -408181 -435994 -336163 -98356 142952 226405 142395 34404 -15777 -114645 -379803
36903c79803l37363j98339j3337K1970k7723K5532J63825J84985L2117j05581
36893f33717o9208O0205J11612N1115m7518j52216k49958k40363l1618K48298
36883i53368L19038J13269p8916K0411K76219L17704O8916j49066r0766R2168
36873f4391J35569M7195N71J0327l3288j02519p0729K6771K9543n4927n3240N1971
36861g7147O5835q1323j93394j20568J2025K8445l7724n7340j3400N2023J40284
36850b82284J99853R5241j56695k82666r1808K15603L04293J63072O2886J25567
36840C53062K02393J82552J67673K61591L76831L77283L28785M91298J020812
36831C762280J669690J845703J125548k28338j403802j793480j499803j024423
$$ plain form
36903 -379803 -717166 -915505 -928842 -906872 -934595 -909063 -745238 -560253 -528136 -633717
36893 -633717 -702925 -642720 -531108 -479993 -527511 -679727 -929685 -1170048 -1201666 -953368
36883 -953368 -634330 -521061 -599977 -579566 -303347 14357 83273 -65793 -156559 -64391
36873 -64391 71178 118373 118944 129271 95983 -6536 -77265 -50494 -20951 -75878 -129118 -77147
36861 -77147 -11312 -92635 -286029 -406597 -394572 -366127 -403851 -461191 -474591 -422568 -282284
36850 -282284 -82431 12810 -143885 -426551 -518359 -302756 1537 164609 227495 353062
36840 353062 555455 738007 905680 1167271 1544102 1921385 2250170 2741468 3762280
36831 3762280 5431970 7277673 8403221 8174883 6771081 4977601 3477798 2453375
36823B453375o73424m50499l24288k90603k48778r9464N9669O8847j1053m76O4085
36812E47391r503j85966k05842k8098N4316j27998l31666k56296K5585K03026
36802c15051J50297K1083k039J03021K19513K04905J9746k03839k79714j82424
36792b64502o3263l1466k7244M5088J58705J96615Q3724j31963k84845k18792
36782e37943J5220J65082R4748j3969N3810J92291J60453P082k4214M8076k1852
36771A38784k07480j85576Q9717K37690O1671j26065m9890P4315k9259j84990
36761a81083j07130M9797m1736k78157k88903p6443J5497p2440k6071K57065M58086
36750b91518L41526Q0386q0663j49086j93974j34517O0372J93863R7432r1927
$$ plain form
36823 2453375 1779951 1329452 1005164 714561 465783 366319 425988 494835 483782 483306 547391
36812 547391 537888 351922 146080 117982 172298 44300 -287366 -543662 -518077 -315051
36802 -315051 -164754 -143671 -145710 -42689 176824 381729 401475 197636 -82078 -264502
36792 -264502 -327765 -359231 -386475 -341387 -182682 13933 97657 -34306 -319151 -537943
36782 -537943 -522723 -357641 -262893 -276862 -223052 -30761 129692 136774 112560 160636 138784
36771 138784 -68696 -254272 -164555 73135 134806 8741 -41149 33166 3907 -181083
36761 -181083 -288213 -238416 -280152 -558309 -847212 -923655 -908158 -980598 -1006669 -749604 -291518
36750 -291518 50008 130394 49731 -99355 -293329 -427846 -367474 -173611 -76179 -168106
36740a68106j26939j6000R817j51114l26552k96910o1340J68464K08843R3102
36730f66735j2348m4223q3418j44572r4644J13415K94804K89791K12766K29633
36720I4469K35969M3704k19435k43743l5686Q4009P632j5368J37228K12415J4283
36709C15477k38417k40732m3933R0585Q7729M9880N467p1887j02971r845R4825
36698f3822N1328q0998j18151n1258k6873o6853m1529P5381J42620P8491k8150
36687a29814p4710n5317J9962J57671K82415K55185O2171j34281j99279j68291
36677A5712j22203m3508R7812K08068J54095m3140k05422j93742m2654J01234
36667g3748J19691K170j58421k30525j46241K8229J38704Q8073n9029j32284l1574
$$ plain form
36740 -168106 -295045 -311045 -301228 -452342 -778894 -1075804 -1137144 -968680 -759837 -666735
36730 -666735 -679083 -723306 -806724 -951296 -1045940 -932525 -637721 -347930 -135164 94469
36720 94469 330438 374142 154707 -89036 -124722 -40713 -33081 -48449 88779 301194 315477
36709 315477 77060 -163672 -207605 -117020 -29291 20589 26056 -45831 -148802 -158647 -63822
36698 -63822 -12494 -93492 -211643 -262901 -289774 -356627 -398156 -322775 -180155 -101664 -129814
36687 -129814 -204524 -259841 -239879 -82208 200207 455392 517563 383282 184003 15712
36677 15712 -106491 -149999 -52187 155881 309976 266836 61414 -132328 -174982 -73748
36667 -73748 45943 48113 -110308 -340833 -487074 -458845 -320141 -232068 -291097 -423381 -454955
36656d54955J57777K47541J52157j6843r0595m8472k0330q2575j42423q9257J2557
36645c75418P113r2076q0082J34632L45924L11171J03751J3632J21114J86687
36635F76448K5903k06374k42212p0009Q7931Q4226l1910j57590k42899k63211
36625c39697k17445j58866j26510o5531P3309J88519J28712o8795j96951j53205
36615i36460l6506O0245J73938L08548L26417J46030p3594j12873P619O6503l8634
36604a08767j60113j17804O3111J92483J41729k0523j11229l3493J13407J42229
36594A01030l803j83517k32943j55544p8329n5937j3764J00124K01564J78586
36584a42533N8143k9200l4837l5350p0553o3125K2583O1864m7708j70714r5780
$$ plain form
36656 -454955 -297178 -49637 102520 85677 -4918 -53390 -73720 -156295 -298718 -387975 -375418
36645 -375418 -368305 -460381 -540463 -405831 -59907 251264 355015 368647 489761 676448
36635 676448 702351 495977 253765 183756 271687 355913 324003 166413 -76486 -339697
36625 -339697 -557142 -716008 -842518 -908049 -834740 -646221 -517509 -586304 -783255 -936460
36615 -936460 -972966 -912721 -738783 -430235 -103818 42212 -31382 -144255 -136636 -70133 -108767
36604 -108767 -268880 -386684 -323573 -131090 10639 -9884 -121113 -154606 -41199 101030
36594 101030 97227 -86290 -319233 -474777 -553106 -609043 -622807 -522683 -321119 -142533
36584 -142533 -84390 -113590 -148427 -183777 -254330 -317455 -294872 -233008 -280716 -451430 -547210
36573e47210J18011J83827R753j58049j11583L0287O7611M3943J04522J89456
36563f9432J29460m2183j29557q0778j7638J1693P2975J46177J19000K44p0668
36552F9293m8969k1245r295M8563J07921M3520j02483j36287k7072L6180l2448
36541g2322q5716k2041N6790P2017J00951J63027J29785r896n8736M7691Q2182
36530D03732q7283k31601j39425O851m6081j58405l8235K22274K75569J02393
36520C09789L9768K22456L97612L68958K71309K85450L80674M79846O32807Q92490
36510D281159J227462J647239K158683K472527K054120P37099q81970j933646
36502A1762673k097042j747525j388011j177113r97340p44373m54347k59142k71054
$$ plain form
36573 -547210 -429199 -245372 -235619 -393668 -505251 -474964 -407353 -363410 -258888 -69432
36563 -69432 60028 17845 -111712 -192490 -210128 -198435 -125460 20717 139717 139961 69293
36552 69293 20324 -921 -10216 38347 146268 189788 87305 -48982 -76054 -39874 -72322
36541 -72322 -158038 -180079 -123289 -51272 49679 212706 342491 332595 273859 321550 403732
36530 403732 316449 84848 -54577 -47726 -93807 -252212 -290447 -68173 207396 309789
36520 309789 349557 572013 969625 1338583 1609892 1895342 2276016 2755862 3388669 4281159
36510 4281159 5508621 7155860 9314543 11787070 13841190 14578289 13696319 11762673
36502 11762673 9665631 7918106 6530095 5352982 4355642 3611269 3156922 2897780 2626726
36493B626726m41483n33538l40735M5733K94690K05721o9226k33078j85246o5706
36483A303858k0462n0469r7452j59654k52942l20013k65895q4026J07515J76594
36473C37054J03422j7580r1193j11285j17771r0737L2411K02116K24257L038k47768
36462B25964k08312J38027M79706N80750M97095L35609O5658k74442m44125l20713
36452A075217j48211j84642k83530j60662P9717R7100r1260j30472M8723J08871
36442D10851q3828k05458m5973R9432p5870l52929l22046k1030J53575N7587l6799
36431d22488J17398L99209M76968J89328k55558m54144k47875N6269P3950j20689
36421a87632j50522J1605m607k67270l22834N0576L78073K03987j54114j05696
$$ plain form
36493 2626726 2185243 1651705 1310970 1356703 1651393 1857114 1787888 1554810 1369564 1303858
36483 1303858 1283396 1232927 1135475 975821 722879 402866 136971 52945 160460 337054
36473 337054 440476 422896 331703 220418 102647 11910 44321 246437 470694 473732 225964
36462 225964 17652 155679 635385 1216135 1713230 2048839 2114497 1840055 1395930 1075217
36452 1075217 927006 742364 458834 298172 377889 474989 383729 253257 301980 410851
36442 410851 327023 121565 75592 175024 99154 -253775 -575821 -596851 -443276 -385689 -422488
36431 -422488 -305090 94119 571087 760415 504857 50713 -197162 -140893 -66943 -187632
36421 -187632 -338154 -326549 -331156 -598426 -921260 -870684 -492611 -288624 -442738 -548434
36411e48434K75488M23035J98572O833M7173O6021p8912j65906p7834m7106k13392
36400a14462l19735j06788K61497M14022K46407j4869j20170l7059O4408J3690
36390B86941j47356k04382p8967L8446p300p5137J5711J42155P7829r9847j35929
36379a87836l9161m0587j56579j57930J8560J71435J83213J54718J49764J01048
36369A96645J6975O701N6733M0553k5208O126J26831J65567P5639k4245r6690
36358E45627k09041l15370k84017j41432l7560M275N5460P2462l156l4377J06191
36347b40938K38890J44148p971P9649K67526J81085j05588j48485J10432K48646
36337G67394R3768k6463R5876K17466J21028n1810j38185j99257k56915j83028
$$ plain form
36411 -548434 -272946 150089 348661 355494 402667 468688 389776 223870 146036 98930 -114462
36400 -114462 -434197 -540985 -279488 134534 380941 366072 245902 208843 273251 286941
36390 286941 139585 -64797 -143764 -105318 -112618 -187755 -172044 -29889 47940 -51907 -187836
36379 -187836 -226997 -267584 -424163 -582093 -563533 -392098 -208885 -54167 95597 196645
36369 196645 213620 220321 277054 317607 292399 298525 425356 590923 666562 642317 545627
36358 545627 336586 21216 -262801 -404233 -441793 -437518 -382058 -309596 -312752 -347129 -240938
36347 -240938 -2048 142100 134129 213778 481304 662389 556801 408316 518748 767394
36337 767394 861162 834699 930575 1148041 1269069 1217259 1079074 879817 622902 439874
36327D39874K697R6656O8463Q0542J18915K4911j07365m3969R6708L010k01965
36316E78477r8697K65952M14229K50879J35754J28907n2050k82241j15348K83914
36306A509776K48816j80651j92115L90203P28656M01828R8261L55355O89506O10714
36296D660349M75841O52865Q13740P42383Q86614J450216J919916K081372K380733
36287A6064029K712183K224015J043621O35523J546382K502319K805359L670328
36279C3203759N835695Q057240R731821J2625775J7924509K4512652L2882176
36272A44773627M6347486O2474605O6635224M3661828j945815m4964943o2964390
36265B54017622n6251448m1245051l0127083k3310936j7714043j3425898j1149946
$$ plain form
36327 439874 442571 539227 607690 688232 807147 832058 724693 680724 777432 780442 578477
36316 578477 479780 745732 1159961 1410840 1546594 1675501 1623451 1341210 1225862 1509776
36306 1509776 1758592 1577941 1385826 1776029 2504685 2906513 3004774 3360129 4049635 4660349
36296 4660349 5136190 5789055 6602795 7345178 8231792 9682008 11601924 13683296 16064029
36287 16064029 18776212 21000227 22043848 22679371 24225753 26728072 29533431 33203759
36279 33203759 39039454 47096694 56828515 69454290 87378799 111891451 144773627
36272 144773627 191121113 253595718 320230942 363892770 361946955 316982012 254017622
36265 254017622 197766174 156521123 126394040 103083104 85369061 71943163 60793217
36258F0793217r379386o924612m918189m375228m244360l405620k522319k497855
36250B2525648k773261k446253j758116j364933j206346j002094r33592j080007
36242I961046j020951o12265l53834m86396n41513k47153m7231k50324m66000
36233E935379l65936k44255l45225l61119q8151R1063j26995m19315m13351k59830
36223C402265k11503j62518q989L5793j30901k27485q1492O3053K7732N661J00514
36212B812130P0916j58877k49922m4670R2049j10596l49471k68964l0977K6867
36202A788485p2952j20309r6307o3433J3166Q1177l3038k69885l22868j56110
36192G47926r3274k05776j33976K30943M46862K38888k8102J0446J33294L4606
$$ plain form
36258 60793217 51413831 44489219 39571030 35195802 30951442 27545822 25023503 22525648
36250 22525648 19752387 17306134 15548018 14183085 12976739 11974645 11041053 9961046
36242 9961046 8940095 8327830 7973996 7487600 6946087 6698934 6651703 6401379 5935379
36233 5935379 5569443 5325188 4979963 4618844 4530693 4621756 4494761 4075446 3662095 3402265
36223 3402265 3190762 3028244 3019255 3055048 2924147 2696662 2615170 2678223 2705955 2711616 2812130
36212 2812130 2883046 2724169 2474247 2429577 2521626 2411030 2061559 1792595 1761618 1788485
36202 1788485 1715533 1595224 1498917 1435484 1448650 1529827 1496789 1226904 904036 747926
36192 747926 654652 448876 314900 545843 992705 1231593 1203491 1213937 1347231 1381837
36182A381837r5610O47J02151n8772k24973o1789J79053O0133k65247l13531r2879
36171F11020k3582j72310j94887O790J55248J35497J34129J92830J07946j32298
36161H20383k38319p6771J10814Q4279p2505j31001k0956J39913J88297N5580
36151H59714j43600k05636r9528j2411l6209j1163J50017K22188J2953k64938
36141D71387k83790r6244P44l6643o666J13044J25601r884j01600n4351P736j5336
36129A13998p1046r6501q9907l8060N3610R3057L1624j0935O5861J34756L9378
36118B25835j06212p0978J25292K58030K37370J42028l564k02588l07928j77507
36108A19778L3192L9507j34101j89126j9819J62661J92199J39120J01879P9497
$$ plain form
36182 1381837 1286227 1286874 1389025 1330253 1105280 1043491 1222544 1282677 1017430 703899 611020
36171 611020 587438 415128 220241 227031 382279 517776 651905 844735 952681 820383
36161 820383 582064 505293 616107 700386 627881 496880 475924 615837 804134 859714
36151 859714 716114 510478 410950 398539 362330 351167 501184 723372 736325 471387
36141 471387 187597 91353 92097 55454 48788 161832 287433 277549 175949 121598 129334 113998
36129 113998 42952 -53549 -143456 -181516 -127906 -34849 -3225 -14160 51701 186457 225835
36118 225835 119623 48645 173937 431967 669337 811365 807801 605213 297285 119778
36108 119778 152970 192477 58376 -130750 -150569 12092 204291 343411 445290 524787
36098E24787R0374J62432J79875K420k41554k62168m6542R9219Q523j34048j28446
36087B54872k5959N9691J51852K75610L35061K71107J71086J03565P426j47641
36077A456670k49265k02991p6827O47k5772j50188l17259l89252k55010r243J27582
36066i0908R0447J0213k6994n9015p3395J0206J31121R9492r7857k27174j44408
36055c78272J0844P0687P7531J24796J44569K5813j76185k94752k43891p7091
36045g15951O3816K9776j84695l60195k76004j6483J37644J20384J32916K58443
36035h10349L24402K42785J80395K33686K23088J6524j96142j86089l1007N8035
36025E5328O5293Q5881Q7730J0534m7553M889L6283j00875k68409k19026J6817
$$ plain form
36098 524787 615161 777593 957468 959888 718334 456166 409624 508843 517366 383318 254872
36087 254872 228913 288604 440456 716066 1051127 1322234 1493320 1596885 1604311 1456670
36077 1456670 1207405 1004414 927587 928234 902462 752274 435015 45763 -209247 -218490 -90908
36066 -90908 -461 9752 -17242 -76257 -149652 -139446 -8325 91167 -6690 -233864 -378272
36055 -378272 -367428 -296741 -219210 -94414 50155 75968 -100217 -394969 -638860 -715951
36045 -715951 -652135 -622359 -807054 -1167249 -1443253 -1459736 -1322092 -1201708 -1068792 -810349
36035 -810349 -485947 -243162 -62767 170919 394007 410531 214389 28300 -2707 55328
36025 55328 120621 206502 294232 304766 257213 262102 298385 197510 -70899 -289925 -273108
36014b73108J84961J75904Q5497k0866j38251j68239j1044K02691K28678O1291
36004C27514o4460k5786O0861P2977J9900o6096j65515j90910p9304M1044J102
35993f8673j08845n4635J27571J46209o2149j98796p7780Q7934O3226l8927o185
35982a91050J00910J06346N4391Q3909J12710k4660k10636j60598J06683K47215
35972B25220R7367j00807r2175L8927P4048O435k6655k0322q9718k35682l12687
35961d36049k31711o0228Q6520J47850J13143K2056j9900P1176K24045K54174
35951A71076Q3276j51279k55706j96112j01224q2052j06691n8061J10844K94868
35941b91061L28746J77121j448l3873M9816O3607p2774k30758k70643k25314j96420
$$ plain form
36014 -273108 -88147 87757 173254 152388 14137 -154102 -165146 37545 266223 327514
36004 327514 263054 237268 298129 371106 391006 324910 159395 -31515 -110819 -69775 -68673
35993 -68673 -177518 -232153 -104582 41627 -20522 -219318 -297098 -209164 -145938 -184865 -191050
35982 -191050 -90140 16206 70597 154506 267216 242556 31920 -128678 -21995 225220
35972 225220 322587 221780 129605 168532 242580 249015 222360 202038 112320 -123362 -436049
35961 -436049 -667760 -727988 -641468 -493618 -380475 -358419 -378319 -307143 -83098 171076
35951 171076 254352 103073 -152633 -348745 -449969 -532021 -638712 -696773 -585929 -291061
35941 -291061 37685 214806 213358 179485 229301 292908 220134 -10624 -281267 -506581 -703001
35930g03001j60885j5092K23370L91270L72037K17955O1199j9393k3083J0099
35920C54476L0215J5491n805o104j6878p7260j39898j12874l368O7953K3228q0401
35908D8775j48210j58282j27841m8503O9210J40114Q4871m3771r0697K7201K21473
35897b5660L29443K82558J47676J4866j02158k18172k76265j91964j1468Q1777
35887C0633r897j52449j54422j9471R5419J19628J13875R7410R220j24104j54221
35876a48379l0382Q3392J9850j60076k58145j90178l9417Q6614J41078J09801
35866c85842J1475o4627r509J76270L44875L34205J41584n7870r7386j8667k0798
35855C53710j76332k94297j73103Q5670J84704L5688j30751j03534L5752P0192
$$ plain form
35930 -703001 -863886 -878978 -655608 -264338 107699 325654 386853 367460 344377 354476
35920 354476 384691 400182 394377 388273 371395 294135 154237 41363 37995 105948 129176 48775
35908 48775 -99435 -257717 -385558 -434061 -364851 -224737 -139866 -183637 -274334 -247133 -25660
35897 -25660 303783 586341 734017 748883 646725 428553 152288 -39676 -51144 30633
35887 30633 20736 -131713 -286135 -305606 -210187 -90559 23316 120726 129946 5842 -148379
35876 -148379 -178761 -95369 -75519 -235595 -493740 -683918 -723335 -636721 -495643 -385842
35866 -385842 -374367 -438994 -448503 -272233 72642 406847 548431 490561 393175 374508 353710
35855 353710 177378 -116919 -290022 -204352 -19648 16040 -114711 -218245 -182493 -112301
35845a12301n7221k13607k50384j21865R2932K27491J71515J5266n6468l1246
35835c35888o5910j79986j74973L1288K19125J87310M7415j3789n8933k11269
35825e55610l17326j44884J76907K83319J21572J2514J27241K55431J96568N5010
35815B10742r123l8117r9830r8037L0985J35187P6874k5894q086N1244q965j14194
35803A02786p9960K9878k2477k28072k91658q2615J43950J12853r1859j87409
35793e94583r1821L0506N5067L7784O0298Q9456N8642l361j4096K4506J5669q5588
35781d17521j79138j32373L5796J56667J18549O069k4131L8453N6836l2103r7165
35770d70061R625K08935K46314J8266k53743k70051k7722J75068J22446o2486
$$ plain form
35845 -112301 -169522 -383129 -633513 -755378 -662446 -434955 -263440 -248174 -304642 -335888
35835 -335888 -401798 -581784 -756757 -725469 -506344 -319034 -271619 -285408 -344341 -555610
35825 -555610 -872936 -1017820 -840913 -557594 -436022 -423508 -296267 -40836 155732 210742
35815 210742 201619 163502 63672 -34365 -3380 131807 208681 182787 174701 225945 216980 102786
35803 102786 22826 52704 30227 -197845 -489503 -572118 -428168 -315315 -407174 -594583
35793 -594583 -686404 -655898 -600831 -563047 -502749 -413293 -354651 -358012 -372108 -347602 -331933 -417521
35781 -417521 -596659 -729032 -693236 -536569 -418020 -411951 -436082 -397629 -340793 -372896 -470061
35770 -470061 -460436 -251501 -5187 13079 -240664 -510715 -538437 -363369 -240923 -303409
35760c03409j21286j0625Q7656N5114k6347m5728l0467p2529j76019k53115k23493
35749a120248p1918J41976K94922K84040J45414K7941N172r600r6412j66290q2328
35738f47331J05920J90180Q0128o5874m5858J20960K11626P1121j89402l02344
35728d70874j47748R7901J63983P030j58750j55789m8290P176l420J4545P7295
35717f16941J18219J33124J78961K33955K05947R5071O529k5437p9399j69377
35707H0652j84073q2478J672l5673r2707k9123R8877J29825M5576l5645o1744
35696a64841p9404j01815j05261j25989j91755j88399P133K69842L27042J44407
35686b09040k3058k5990p488p7419p4201J32441L22680J95443j69539l98624l08208
$$ plain form
35760 -303409 -424695 -435320 -347664 -292550 -318897 -364625 -395092 -467621 -643640 -896755 -1120248
35749 -1120248 -1192166 -1050190 -755268 -471228 -325814 -297873 -292701 -302301 -398713 -565003 -647331
35738 -647331 -541411 -351231 -271103 -336977 -382835 -261875 -50249 20872 -168530 -470874
35728 -470874 -618622 -520721 -356738 -349708 -508458 -664247 -712537 -705361 -708781 -694236 -616941
35717 -616941 -498722 -365598 -186637 47318 253265 348336 354865 329428 250029 80652
35707 80652 -103421 -185899 -184227 -219900 -312607 -341730 -242853 -113028 -67452 -103097 -164841
35696 -164841 -244245 -346060 -451321 -577310 -769065 -957464 -950331 -680489 -353447 -209040
35686 -209040 -232098 -258088 -265576 -342995 -417196 -284755 37925 233368 63829 -334795 -643003
35675f43003m8779J83594L17767L09345J39525n9599j12177o0437r6028k18695
35665b88487k28954r8483m0949j15654q6115J50040L05829J40401j18395j15566
35655d96333O5822N8748j78526l06612j52706N8578R9178M2912M6135Q2467O1786
35644f18551K6307O1403J34697J60339J31795Q6958K5324n3578j03657q8724j6766
35633b54453J06589K54778K99004J10740k00649l30058j57724P4448R3205n4340
35623e8460j33984o9045L5691J07009J35796O9984j13579k69429k21784k8782
35613e46583Q4284M3717k4719o1397j43072k40721j68054J00610K89154J83844
35603d82937l3795l9981J61407K70060J46011j9548l2530K5991l0422j89699k61381
$$ plain form
35675 -643003 -691782 -508188 -190421 118924 258449 198850 86673 26236 -69792 -288487
35665 -288487 -517441 -615924 -656873 -772527 -858642 -708602 -402773 -262372 -380767 -496333
35655 -496333 -430511 -371763 -550289 -856901 -1009607 -951029 -851851 -808939 -762804 -680337 -618551
35644 -618551 -592244 -530841 -396144 -235805 -104010 -17052 8272 -45306 -148963 -237687 -254453
35633 -254453 -147864 106914 405918 516658 316009 -14049 -171773 -97325 -4120 -58460
35623 -58460 -192444 -261489 -225798 -118789 17007 86991 -26588 -296017 -517801 -546583
35613 -546583 -462299 -418582 -443301 -504698 -647770 -888491 -1056545 -955935 -666781 -482937
35603 -482937 -516732 -556713 -395306 -125246 20765 1217 -31313 -5322 -35744 -225443 -486824
35592d86824j48134L8593J46040J63279J80051K17543J93261O9224n6509q4754
35582B31770p7095j55434k66558k22174j4622J03735k1020j86091j23718R3961
35572f37246J94221J49004J64315K43717J27832k24608m44046k59722P2214J34328
35562d79991n8144j53635k8398J04160J17185J40681K31147J89945j14039m56507
35552e07596m97697k03776J37336K65884J83068N3686j3513m5731r6656j17702
35542h42697j8128J41134J51645m3940j92491n0044K38144L12830J09208p7988
35532b72327m9948N4410M6729l9475q4983p5851l6026L8703P7399k8651j89081
35521e59101j58653O1433J48680l8575j87484j6494K48612K20447n2445k14708
$$ plain form
35592 -486824 -634958 -596365 -450325 -287046 -106995 110548 303809 373033 316524 231770
35582 231770 154675 -759 -267317 -489491 -504113 -400378 -421398 -607489 -731207 -637246
35572 -637246 -443025 -294021 -129706 114011 241843 17235 -426811 -686533 -614319 -479991
35562 -479991 -538135 -691770 -720168 -616008 -498823 -358142 -126995 62950 -51089 -507596
35552 -507596 -1005293 -1209069 -1071733 -805849 -622781 -569095 -582608 -628339 -724995 -842697
35542 -842697 -860825 -719691 -568046 -611986 -804477 -854521 -616377 -303547 -194339 -272327
35532 -272327 -322275 -267865 -221136 -260611 -345594 -421445 -457471 -418768 -341369 -370020 -559101
35521 -559101 -717754 -656321 -507641 -546216 -733700 -750194 -501582 -281135 -333580 -548288
35511e48288j71422j20979j15156m602J90848K48014J18623M469N279L408n2165
35500d41971n7816j2105n2444j58732j27307O3869J70067P8817p169O8846J67652
35489c08293J41813R3841J34034J30600n1559k61138k65246j00514J3189n536
35479d78809p3980j35554j73327j22916L4345J58076J00606q0160j97449j64508
35469a133676l4800R9811J39648J1333k04677k84896j23915J20894K52552K62774
35459h94952K16405Q5803j19283k22889j10490M2373J0282j15125n8859J98960
35449i67775L85737L27298J35279j3825p4465p1456k4163K3192K8457K5006N3452
35438a73263M5616q1317k41333k51346q1179J14736K05054J78376N8126j14020
$$ plain form
35511 -548288 -719710 -840689 -955845 -960447 -769599 -521585 -402962 -398493 -393214 -389806 -441971
35500 -441971 -499787 -511892 -564336 -723068 -850375 -786506 -616439 -537622 -544791 -475945 -308293
35489 -308293 -166480 -72639 61395 191995 140436 -120702 -385948 -486462 -473273 -478809
35479 -478809 -552789 -688343 -861670 -984586 -950241 -792165 -691559 -771719 -969168 -1133676
35469 -1133676 -1168476 -1068665 -929017 -917684 -1122361 -1407257 -1531172 -1410278 -1157726 -894952
35459 -894952 -678547 -592744 -712027 -934916 -1045406 -1003033 -992751 -1107876 -1166735 -967775
35449 -967775 -582038 -254740 -119461 -133286 -207751 -279207 -303370 -280178 -251721 -226715 -173263
35438 -173263 -127647 -208964 -450297 -701643 -782822 -668086 -463032 -284656 -226530 -340550
35428c40550k19000j53645O757Q6900M8001n326l2816q6895j35209o4936R5593
35417h01126J64148Q5462L2123J21490K08386J08932r4998j50702J4513J93842
35407a17930J70450k0179j56915j16811q661Q867l5709Q464J32730J29291r1415
35396i7818l12640k88505q3929M2461R236l1876L0684J32241J68769J13476o007
35385c23908j21008j32333k6130O5962M7545K2416J19210K37207J76130l5075
35375C0016j63689j02429M0412J52864J99487J20509j01294k85621k27313k6880
35365c63938K0728j23918k00767q5593N1243Q7558J17716J72725J10602o4674
35355b78318j06427O7596J95528J14405N0131J88510K81457M8397k85418k80299
$$ plain form
35428 -340550 -559550 -713195 -706438 -619538 -571537 -576863 -609679 -696574 -831783 -896719 -801126
35417 -801126 -636978 -551516 -519393 -397903 -189517 -80585 -175583 -326285 -311772 -117930
35407 -117930 52520 32341 -124574 -241385 -250046 -241179 -276888 -268424 -135694 -6403 -97818
35396 -97818 -410458 -698963 -782892 -740431 -731195 -763071 -732387 -600146 -431377 -317901 -323908
35385 -323908 -444916 -577249 -603379 -537417 -489872 -467456 -348246 -111039 65091 30016
35375 30016 -133673 -236102 -195690 -42826 156661 277170 175876 -109745 -337058 -363938
35365 -363938 -343210 -467128 -667895 -753488 -702245 -614687 -496971 -324246 -213644 -278318
35355 -278318 -384745 -317149 -121621 -7216 42915 231425 512882 561279 275861 -4438
35345d438L9772K32963J02559r5965j24596o4991o4905q8549n0177J9021N7139
35334d2167P4168Q5223O1582J454n2686q8774j19179j11772m4154q72p1485j68762
35322d77424j15311P9512K01327J30737M084M435J16881J76090Q0580j04394k12882
35311a16365j27531Q4783J96014N4821k08945l15565j69123N1441J43910R4432
35301c12128m421j09215k00222j99670n1156J50590K33496J64430Q7383J07159
35291a33754J37499N3014q8707j22347m5230k9515j23310j42694J5541J49863
35281c29640M7487j56524j80835m6147k714p1741l2890J20114J27522l1869k3415
35270e80652K44495L36472n3229n24094m96218o4123J75674K2463j21614M8330
$$ plain form
35345 -4438 35334 268297 370856 274891 150295 85304 20399 -68150 -118327 -99306 -42167
35334 -42167 32001 117224 178806 180260 127574 38800 -80379 -192151 -236305 -237177 -308662 -477424
35322 -477424 -592735 -513223 -311896 -181159 -177075 -172640 -55759 120331 200911 96517 -116365
35311 -116365 -243896 -159113 36901 91722 -117223 -432788 -601911 -550470 -406560 -312128
35301 -312128 -316549 -425764 -625986 -825656 -876812 -726222 -492726 -328296 -240913 -133754
35291 -133754 3745 56759 -31948 -154295 -199525 -229040 -352350 -495044 -479503 -329640
35281 -329640 -282153 -438677 -619512 -665659 -668373 -740114 -773004 -652890 -525368 -557237 -580652
35270 -580652 -336157 315 -52914 -577008 -1073226 -1137349 -961675 -939212 -1060826 -1012496
35260a012496L10649L21804Q3042j75592l15095l19737j99070j3287J19090J38924
35250a061768R5415N4386N3803J31695K66944L21821J97903J4281m3618q550n4235
35239c1923j65344j35079Q5203K74760K42588L9603j74673k88104k26116J1714
35229c67371K60688L24192K26571J45728J03709k8696k09491k05330K9795K36946
35219E16741K19631P1030o5890j89253k68397j76215M2797J15867n5534k04821
35209E956j22466M426o9117k23913j99870l4173N1056L9194O5760R9931J6747
35198c66469r8401n0828J09349J54649P0039N5429J43508J36214l8461k01062
35188h6033k14623j42420n4928O1210J36504K8644k04752k97055j51829R113L812
$$ plain form
35260 -1012496 -701847 -380043 -297001 -472593 -787688 -1107425 -1306495 -1319782 -1200692 -1061768
35250 -1061768 -966353 -911967 -858164 -726469 -459525 -137704 60199 74480 30862 22312 -31923
35239 -31923 -197267 -332346 -247143 27617 270205 309808 135135 -152969 -379085 -367371
35229 -367371 -106683 217509 444080 589808 693517 664821 455330 250000 279795 516741
35219 516741 736372 807402 741512 552259 283862 107647 150444 266311 210777 5956
35209 5956 -116510 -112084 -181201 -405114 -604984 -639157 -588101 -548907 -483147 -383216 -366469
35198 -366469 -464870 -515698 -406349 -251700 -181661 -126232 17276 153490 115029 -86033
35188 -86033 -300656 -443076 -498004 -436794 -300290 -271646 -476398 -773453 -925282 -916169 -912357
35177i12357m9480O813Q8676O7105M1610J56144K89251K14429j2698j18425l8337
35166b67269P482r6965j81071j05620j5378q5899j97983j07165J50380K81434
35156f18054J68757L2022O7349J42747K6627k23639l23948j62331Q0443K15225
35146e94802K43597K22737J34553r5m8356M0682R7186m2121k60832l04411j36492
35135f48354M3580J13096J42767J79695J31622m1933k00155k08647j26107p1699
35125f86135k0039J08477K32769J87987R815o0766P6279K05343J00392j24731
35115B9391j69026j114P2313j34120l69123k73945R6438L26931K05515j8899l6394
35104b72033Q5262N9408j48977k64953j17778J12950J63373L9260m5662j202M5824
$$ plain form
35177 -912357 -961837 -955024 -866348 -799243 -757633 -601489 -312238 -97809 -110507 -228932 -267269
35166 -267269 -259787 -356752 -537823 -643443 -658821 -744720 -942703 -1049868 -899488 -618054
35156 -618054 -449297 -417275 -349926 -207179 -180552 -404191 -728139 -890470 -810027 -594802
35146 -594802 -351205 -128468 6085 5990 -42366 -1684 95502 53381 -207451 -511862 -648354
35135 -648354 -604774 -491678 -348911 -169216 -37594 -79527 -279682 -488329 -614436 -686135
35125 -686135 -706174 -597697 -364928 -176941 -167126 -227892 -151613 53730 154122 29391
35115 29391 -139635 -140749 -68436 -202556 -571679 -845624 -749186 -422255 -216740 -235639 -272033
35104 -272033 -186771 -127363 -276340 -541293 -659071 -546121 -382748 -343488 -389150 -390352 -344528
35093c44528q435p9088n1313J6582j0750j06444j07863J5459J02761P3720O9572
35082d30327J86200K43002M5299k35996k38902M9053K27641M3832k58485l03972
35072f72655p9668J38765J93892J50915Q5255q206j08565j44437r2537K112Q9981
35061d45148J24412O2298n0721p0870N4413J67506J05184n7961j31325j00350
35051c42562r9360j33763n7929J46507K86394K27880P8013j073j8031p6449j72774
35040a63147j97009r6983N3032J43410J36031P7462K9836Q58m2330r3572r4798
35029b47210k9299L6190N0618N0016P0375P6535O1797J14617K59127L27792J65523
35018I36081j04673k12606j05065J5654K315r2625j87688k69517k81933j37109
$$ plain form
35093 -344528 -352963 -432051 -483364 -466782 -477532 -583976 -691839 -676380 -573619 -499899 -430327
35082 -430327 -244127 -1125 44174 -191822 -430724 -381671 -154030 -110198 -368683 -672655
35072 -672655 -752323 -613558 -419666 -268751 -183496 -191702 -300267 -444704 -537241 -535129 -445148
35061 -445148 -320736 -258438 -309159 -380029 -325616 -158110 -52926 -110887 -242212 -342562
35051 -342562 -441922 -575685 -633614 -487107 -200713 27167 105180 104107 86076 9627 -163147
35040 -163147 -360156 -457139 -404107 -260697 -124666 -47204 -17368 -16510 -58840 -152412 -247210
35029 -247210 -276509 -240319 -189701 -139685 -69310 7225 69022 183639 442766 770558 936081
35018 936081 831408 618802 513737 529391 531706 439081 251393 -18124 -300057 -437166
35008d37166R0643J86648J00056K8075R3527J49251N4291n6075R743J53863J14079
34997D86935j25398k89546j95276J5339Q7752l1050j70403j57074J0770J89154
34987a78797K44423J69692N0260n5738j56648k54220k93599k15349l1856J55489
34977e66343K09424P7347r9992q5136J54004L33302K03821o9161j12209J03097
34967A48154K06654r003k76116k60457k7868J18158P5991j9415p2075r5007q2349
34956b93333k3514Q823l8492p4416p033P8043O4572K5987Q0226J26752l641k05436
34944b61462k11229l1659M2720p9246j42590Q643J59941R0182o3807n5555N6735
34933d87327K6122j65901k87226k15793p7945q299K3313Q6699J49519J43982Q0375
$$ plain form
35008 -437166 -346523 -159875 -59819 -31744 61783 211034 265325 209250 218993 372856 486935
34997 486935 361537 71991 -123285 -107946 -20194 -51244 -221647 -378721 -367951 -178797
34987 -178797 65626 235318 285578 229840 73192 -181028 -474627 -689976 -721832 -566343
34977 -566343 -356919 -279572 -379564 -464700 -310696 22606 226427 157266 45057 148154
34967 148154 354808 345805 69689 -190768 -218636 -100478 -24487 -43902 -115977 -210984 -293333
34956 -293333 -316847 -308024 -346516 -420932 -427965 -349922 -285350 -259363 -179137 -52385 -56026 -261462
34944 -261462 -472691 -504350 -461630 -540876 -683466 -674823 -514882 -424700 -488507 -544062 -487327
34933 -487327 -461205 -627106 -914332 -1130125 -1208070 -1216369 -1193056 -1106357 -956838 -812856 -732481
34922g32481K0033j2371l5425n6285m5921K7697J38821J87775R8820m6478n5962
34911e11777J20807K63063J27746k04183l83925k26399O1537J67007O0426l8734
34901e64432j1541K5826m4815j39359r8540P2491K08070J96015R2524K4152M6079
34890a93530J06274J04451o790j41722j40177K7422J65000P3953j60547k56986
34880d22652j15309O7195J03145M3597k002p1304j95207k12214R182K63625K14782
34869c17162j10817l24688k15098j134O0105M4954J42682K79265K36465M3919
34859a61509l0066J17629K69015K04461m03j08229l7721P7230R8060L5749j5186
34848D49030j4996l344j9159n1677p9132j10471j53372j70584j22681m7752l7314
$$ plain form
34922 -732481 -712448 -724819 -760244 -816529 -862450 -834753 -695932 -508157 -409337 -455815 -511777
34911 -511777 -390970 -127907 -161 -204344 -588269 -814668 -753131 -586124 -525698 -564432
34901 -564432 -575973 -550147 -594962 -734321 -832861 -760370 -552300 -356285 -263761 -239609 -193530
34890 -193530 -87256 17195 10405 -131317 -271494 -244072 -79072 -5119 -165666 -422652
34880 -422652 -537961 -470766 -367621 -324024 -326026 -397330 -592537 -804751 -795569 -531944 -317162
34869 -317162 -427979 -752667 -967765 -968899 -908794 -863840 -721158 -441893 -205428 -161509
34859 -161509 -191575 -73946 195069 399530 399127 290898 253177 330407 428467 464216 449030
34848 449030 434034 430690 411531 359854 280722 170251 16879 -153705 -276386 -324138 -361452
34837c61452j12198j70851r8319R4503K68856K91564J63297J5185l2249k414j1101
34826D4821p5654p2545M5116J02345o5857l06354k93817K345K32430J37317j12239
34815c62092j96960q4857J5032K639l7575m1322k5808K2606J21743J72502O1732
34804c52360j18738j57286l8336L3826m1604j30076j12629n0173l825R3413K51923
34793f25865L08657J63264k9853q3306m7505o7754j03207j7395J38272J73611
34783a91081N8516m5592m0647J9901Q5834J52280J50130M410j79521j98512n7481
34772b41763J6398q1020j85450j45388l8562N851J0858M3858P1375O0708P6177
34761d06958J33853J08199o3827k25834k13742r5606l0045j3958L9849R4364O8850
$$ plain form
34837 -361452 -473650 -644501 -742820 -648317 -379461 -87897 75400 90585 58336 55922 44821
34826 44821 -30833 -103378 -58262 44083 -21774 -328128 -621945 -619600 -387170 -249853 -362092
34815 -362092 -559052 -643909 -628877 -626238 -663813 -705135 -730943 -708337 -586594 -414092 -352360
34804 -352360 -471098 -628384 -666720 -632894 -674498 -804574 -917203 -967376 -971201 -877788 -625865
34793 -625865 -317208 -153944 -183797 -267103 -314608 -382362 -485569 -502964 -364692 -191081
34783 -191081 -132565 -178157 -218804 -198903 -113069 39211 189341 193751 14230 -184282 -241763
34772 -241763 -225365 -306385 -491835 -637223 -675785 -669934 -659076 -615218 -543843 -483135 -406958
34761 -406958 -273105 -164906 -228733 -454567 -668309 -763915 -793960 -807918 -768069 -673705 -604855
34750f04855K7961P2128J27562P2976j1154K5622R7769K118j96047k14539n503
34739f05962J68219J63179J33631J79353J50382k7005j39727l5514P7873n0694
34729A3735l05960l99942l11405k24498j49984N0182L03982L43490J28951m3339
34719e94788K9948J68488J03182j22512k37427j28234N0296J29480J28788J55999
34709c16780K13187J97392O5747r3033j78303j93354j84057j31292m099J27234
34699d97358J63346J42058J78065K31567J26953j38337l03583j87294M9295J36862
34689i8426N3739l0429m5878n1610n2747k360N1973K0055n2888m4639K3677J5530
34677b14003p4713j02024k3102K8276k3018o4236P246J05695Q7452m4960j72091
$$ plain form
34750 -604855 -576894 -504766 -377204 -304228 -315382 -289760 -191991 -189873 -385920 -600459 -605962
34739 -605962 -437743 -274564 -140933 38420 188802 161797 22070 -13444 64429 13735
34729 13735 -292225 -692167 -1003572 -1228070 -1378054 -1327872 -1023890 -680400 -551449 -594788
34719 -594788 -564840 -396352 -293170 -415682 -653109 -781343 -731047 -601567 -472779 -316780
34709 -316780 -103593 93799 159546 66513 -111790 -305144 -489201 -620493 -624592 -497358
34699 -497358 -334012 -191954 -13889 217678 344631 206294 -97289 -284583 -235288 -98426
34689 -98426 -44687 -75116 -120994 -172604 -225351 -227711 -175738 -155683 -208571 -253210 -229533 -214003
34677 -214003 -288716 -390740 -413842 -385566 -408584 -472820 -465574 -359879 -272427 -317387 -489478
34666d89478k13991j64955l3297J54343L07669L12660J43665q5762k08215j57670
34656d35031l2707K7803J4728K1398O0519M2296l0465j2289J42789K54014J72825
34645B25880J4270m8415o6184j63710k47294j50333K4508L5163o9748o114K37861
34634b14116L21592R0465j50643q8899J49987K29013O5537j55568k85807l15578
34624c54017k61056j25651N8838K40646L52152K98944O7699j59374j80617p1116
34614a33552p3644j82423j40159Q3886J76413k51j43407j2374J59288Q1295q5313
34603b70241m3878Q0140k1689k21390j09884K79806M35790J24724k79978l64932
34593c91532j71129N0354K19421L42245L30228J48621m5016j12401j27274j94127
$$ plain form
34666 -489478 -703469 -868424 -901721 -747378 -439709 -127049 16616 -69146 -277361 -435031
34656 -435031 -467738 -439935 -425207 -403809 -343290 -300994 -331459 -343748 -200959 53055 225880
34645 225880 240150 191735 125551 -38159 -285453 -435786 -411278 -376115 -445863 -451977 -214116
34634 -214116 107476 197941 47298 -41601 108386 337399 402936 247368 -38439 -354017
34624 -354017 -615073 -740724 -681886 -441240 -89088 209856 277555 118181 -62436 -133552
34614 -133552 -207196 -389619 -529778 -445892 -269479 -269730 -413137 -425511 -266223 -184928 -270241
34603 -270241 -314119 -233979 -255668 -477058 -586942 -307136 128654 253378 -26600 -391532
34593 -391532 -562661 -512307 -292886 49359 379587 528208 483192 370791 243517 49390
34583D9390k40035j60834k8865K6280L1423R3064J95232K30460J64819L9738j18774
34572B81898k63950k77793j07551R4172J18141k5828j21114m3732Q1266P3912
34562a90579n2462j27614o2566N2532J01578R4188R2165O4187n0773j66401j18174
34551c63919N3414R2335r0612k30902r3815J37675J25406r7460j84956k2775J26434
34540e49175O6193o8499r8931o8246o4130k2412J06716J96308J40708N1541O3386
34529b46541R1568o893j48919j28190O1571K13778J95096P3170k9345o4621m8838
34518c8164l4447p9711j61359j63772m3447O8088L9606n7105o1807J7207K5199
34507d89712q4910j82612j51967j7225J37803K52990K73370J58644n1142k48669
$$ plain form
34583 49390 -190645 -351479 -380344 -354064 -322641 -229577 -34345 196115 360934 400672 281898
34572 281898 17948 -259845 -367396 -273224 -155083 -180911 -302025 -345757 -264491 -190579
34562 -190579 -243041 -370655 -433221 -380689 -279111 -184923 -92758 -28571 -79344 -245745 -363919
34551 -363919 -310505 -218170 -308782 -539684 -633499 -495824 -370418 -467878 -652834 -675609 -549175
34540 -549175 -482982 -551481 -650412 -718658 -782788 -805200 -698484 -502176 -361468 -309927 -246541
34529 -246541 -154973 -161866 -310785 -438975 -377404 -163626 31470 104640 75295 10674 -38164
34518 -38164 -72611 -152322 -313681 -477453 -520900 -452812 -413206 -470311 -532118 -514911 -489712
34507 -489712 -574622 -757234 -909201 -926426 -788623 -535633 -262263 -103619 -154761 -403430
34497d03430l48285l11556j28463J28769K75392J78605m4487j26283K8243K35771
34487e15724K82664J60541O076q1353q7514l5330K4757K6984l4117p2708j4832
34476c40556R2638J28240L6779j14957k10776j82914n4400P9070J16133L7973
34466d12770n8365m4390R6006K24194J89141J4429j08865m5895J17973J92137
34456A63595J11065l2897j46075k05553j87579o5950Q6656J31797N4682r183J423
34445i8019k6875j58293k42882j33110O0409J20058M1940K600N9894J01693P4033
34434a98552M3543J8675p6087k01083j86921l839J43736J05269J632J7664J16433
34423b19530J24468P401j11358j57598j68803j63311r8673J3568P6797M8521J9849
$$ plain form
34497 -403430 -751715 -1063271 -1191734 -1062965 -787573 -608968 -653455 -779738 -751495 -515724
34487 -515724 -233060 -72519 -66443 -147796 -235310 -270640 -245883 -218899 -253016 -325724 -340556
34476 -340556 -247918 -119678 -82899 -197856 -408632 -591546 -645946 -566876 -450743 -412770
34466 -412770 -471135 -515525 -419519 -195325 -6184 8245 -100620 -146515 -28542 163595
34456 163595 274660 241763 95688 -109865 -297444 -363394 -276738 -144941 -90259 -99442 -98019
34445 -98019 -124894 -283187 -526069 -659179 -598770 -478712 -436772 -434172 -374278 -272585 -198552
34434 -198552 -155009 -136334 -212421 -413504 -600425 -604264 -460528 -355259 -353627 -335963 -219530
34423 -219530 -95062 -87661 -199019 -356617 -525420 -688731 -787404 -773836 -697039 -648518 -628669
34412f28669Q1580J67042J23462o2906k09078j60818o103M6977k1938k0319J26122
34401e64648K00429O294k86552l36123j03058J20880J53455J15874J23576P1210
34391d98663j14860k55147j75744j2846o439j10474p8475J27168K87868K83467
34381e54145K29921K21728J83265O4411k9575k2844o569n7905p4532N0762K07295
34370B11812J98888L6608p5183k8052O9933P9314M443o2665q0303p7675q4841
34359A92279r1910o7034L93O7749O1504m4636j82984k46937j85228l2736J19136
34348d10404J64166M9442j45203k42572j52718J3020Q6474N7201L7919N2854J4729
34337d75092p1572n8266J02539K15639R0603j62045k53361r3144J25651K13695
$$ plain form
34412 -628669 -547089 -380047 -256585 -319491 -528569 -689387 -695490 -648513 -670451 -690770 -564648
34401 -564648 -364219 -357925 -644477 -980600 -1083658 -962778 -809323 -693449 -569873 -498663
34391 -498663 -613523 -868670 -1044414 -1057260 -1063699 -1174173 -1252648 -1125480 -837612 -554145
34381 -554145 -324224 -102496 80769 145180 115605 92761 86192 28287 -46245 4517 211812
34370 211812 410700 447308 372125 344073 414006 493320 497763 435098 354795 277120 192279
34359 192279 100369 33335 33728 101477 162981 118345 -64639 -311576 -496804 -529540 -410404
34348 -410404 -246238 -196796 -341999 -584571 -737289 -724269 -637795 -580594 -542675 -489821 -475092
34337 -475092 -546664 -604930 -502391 -286752 -196149 -358194 -611555 -704699 -579048 -365353
34327c65353J81430J12500J8885p8528o8293J03227K79263K43628L221k11837
34317B18143k32791j18816k0401Q153P532J2422J8514J51q1267k30481l46199
34306g65040k81689m7409J34587R4138l3526K3691K69762L97813K16823o7327
34296e8177j49953o4947r1798k73122l04681m233L43941L29495j1820k15712J1899
34285d89108M27430N68788K88572j53576m26176m06494j80143P5487J85816Q3874
34275b5530j17864k25271j65851l4860O9768J53606K21718J95638N0698n8068
34265F3984K6330J96622J81545o4470k65627k07325l5446j7468j41883j70509
34255d34247k5985J12902J18944Q8124J17424J14209k1912j72999j45445L6735
$$ plain form
34327 -365353 -183923 -71423 -52538 -131066 -199359 -96132 183131 426759 429980 218143
34317 218143 -14648 -133464 -153865 -145712 -138180 -125758 -107244 -107093 -188360 -418841 -765040
34306 -765040 -1046729 -1094138 -959551 -865413 -898939 -875248 -605486 -207673 9150 -58177
34296 -58177 -208130 -273077 -364875 -637997 -942678 -946911 -602970 -273475 -285295 -501007 -489108
34285 -489108 -61678 507110 795682 642106 215930 -190564 -370707 -295220 -109404 -25530
34275 -25530 -143394 -368665 -534516 -569376 -499608 -346002 -124284 71354 122052 63984
34265 63984 90314 286936 468481 404011 138384 -68941 -104387 -121855 -263738 -434247
34255 -434247 -460232 -347330 -228386 -140262 -22838 91371 69459 -103540 -248985 -212250
34245b12250J63495J35139N6659L1285K4361j9670o4633o5370n7721p4970n5687
34234a39362N5340J62678J06930r3225k05638o4884J85362K42109K5511k11198
34224F3623k11539m5498J7717r5635j75521n4452J56481K47022J79127N7411n5379
34213H3357j48761j79728j34795j11527j80578k30026j24956L6660M4580p3892
34203a019666p2475J19644K76638K27847Q7921J5611k7290j10835j33978L484
34193f33099J73393J81402N5418k9810k7854j6204M820Q4343J39008L4849j51512
34182a85246j80211P427J95256K00807R0337M716n5500j47470k15935j56314J928
34171d40205R8847L6157j03095j48094l1612J33045J84979J10841M2477M9227
$$ plain form
34245 -212250 -48755 86384 143043 174328 198689 179019 114386 49016 -8705 -83675 -139362
34234 -139362 -84022 78656 185586 92361 -113277 -178161 7201 249310 274821 63623
34224 63623 -147916 -193414 -175697 -271332 -446853 -501305 -344824 -97802 81325 138736 83357
34213 83357 -65404 -245132 -379927 -491454 -672032 -902058 -1027014 -990354 -945774 -1019666
34203 -1019666 -1092141 -972497 -695859 -468012 -380091 -364480 -391770 -502605 -636583 -633099
34193 -633099 -459706 -278304 -222886 -252696 -280550 -296754 -291934 -207591 -68583 -33734 -185246
34182 -185246 -365457 -358030 -162774 38033 128370 133086 77586 -69884 -285819 -442133 -440205
34171 -440205 -341358 -305201 -408296 -556390 -588002 -454957 -269978 -159137 -116660 -67433
34161f7433M4731k8985n5904O6368J96853J22109q6553j35240M0556J40919o0274
34150A77147l55397l74574q8287J75819J75489J5843o0630Q678Q9094P0960p40
34139a66598k9769k1778n8184j34483j24976L9698K38005K85309J46876o1643
34129A12457k31608l10611k46397l1194K03918K81213J80650L5561o7308j38930
34119b12249j49216l1341J34703J46781k1581j38721n2244P3480K2240j29567
34109c57715j44342M663J23330J17086R7469J53110K09268J74702Q0130k671o9530
34098C85500j36256j65591j23471o0856o3768j35380j85113j44481n5599j3833
34088f98848l6068l7332L3076Q3608j5510k35665l84725l13514n5790K41848M36210
$$ plain form
34161 -67433 -22702 -51687 -107591 -41223 155630 277739 191186 55946 96502 237421 177147
34150 177147 -178250 -552824 -641111 -465292 -289803 -273960 -334590 -325912 -236818 -165858 -166598
34139 -166598 -196367 -218145 -276329 -410812 -535788 -496090 -258085 27224 174100 112457
34129 112457 -119151 -429762 -676159 -707353 -503435 -222222 -41572 -6011 -73319 -212249
34119 -212249 -361465 -392806 -258103 -111322 -132903 -271624 -323868 -250388 -228148 -357715
34109 -357715 -502057 -497394 -374064 -256978 -159509 -6399 202869 377571 457701 455030 385500
34098 385500 249244 83653 -39818 -100674 -164442 -299822 -484935 -629416 -685015 -698848
34088 -698848 -734916 -772248 -739172 -655564 -671074 -906739 -1291464 -1604978 -1660768 -1418920 -982710
34077i82710M23740J93327r1698j84844l2379J30680P0168j37771k16034n5936
34067h83457J66976K42951J63497O9564N7087R3140Q7680L575j07502j68059j55013
34056d29561r8293k7818K5391N435r7076j60601m5764J83567K90339J69954j3319
34045a97746p0836k3677J2514K9107O8641R3534O9412O9675J31854J22919o0238
34034B45159k63603k75448j63555j50164k10430j07278J61840K81023Q3332j79771
34024e78895j94252J1798J90261K20117J51625M1599p4088j34597j29083j38004
34014f33519j84579j55222Q08J19370M6645q6005k6832K06628L28392J87602l2820
34003b29532q7302K0318R4696K5031r6100j04035M2390K04943K13781P1869m5074
$$ plain form
34077 -982710 -558970 -365643 -457341 -642185 -674564 -543884 -473716 -611487 -827521 -883457
34067 -883457 -716481 -473530 -310033 -240469 -183382 -90242 -2562 1013 -106489 -274548 -429561
34056 -429561 -527854 -555672 -530281 -524846 -621922 -782523 -828287 -644720 -354381 -184427 -197746
34045 -197746 -268582 -292259 -279745 -250638 -181997 -88463 -19051 50624 182478 305397 245159
34034 245159 -18444 -293892 -457447 -607611 -818041 -925319 -763479 -482456 -399124 -578895
34024 -578895 -773147 -761349 -571088 -350971 -199346 -157747 -231835 -366432 -495515 -633519
34014 -633519 -818098 -973320 -972512 -853142 -806497 -892502 -919334 -712706 -384314 -196712 -229532
34003 -229532 -316834 -296516 -201820 -176789 -272889 -376924 -334534 -129591 84190 156059 110985
33992A10985k5766L0337q787q0389l2643R9965J23006j3788j39826j40864j14990
33981a92760j56570j72795o3261P1932Q6720L7601P4431J61068J28625k7426j37469
33970a89904j51883k02127l11662k94558p0883J32954Q5736j02533j43986K1126
33960a227720J95975K46369K32282K26584J97793J13156J5873m2435m9742r065
33950a00930M2582K1026q4184j25614R747J71830J15028j22721k48432j51707
33940d73375n0615j05830j53867j785K26300K65873J01180m6856m5772L3516Q1982
33929a69249N9930l5806j67186k34031j73495n6894P355K3447O5249J36348J74652
33918c69680J51680Q0171k1792r6242n2716R9695K08629J57912N739j34170k29963
$$ plain form
33992 110985 85219 115556 106769 26380 -6263 93702 216708 202920 63094 -77770 -192760
33981 -192760 -349330 -522125 -585386 -513454 -426734 -389133 -314702 -153634 -25009 -52435 -189904
33970 -189904 -341787 -543914 -855576 -1150134 -1221017 -1088063 -1002327 -1104860 -1248846 -1227720
33960 -1227720 -1031745 -785376 -553094 -326510 -128717 -15561 312 -42123 -91865 -100930
33950 -100930 -58348 -37322 -121506 -247120 -237373 -65543 49485 -73236 -321668 -473375
33940 -473375 -523990 -629820 -783687 -785472 -559172 -293299 -192119 -238975 -284747 -251231 -169249
33929 -169249 -109319 -145125 -312311 -546342 -719837 -776731 -769376 -745929 -680680 -544332 -369680
33918 -369680 -218000 -137829 -159621 -255863 -308579 -208884 -255 157657 163396 29226 -200737
33907b00737k58192j47373O5723J73809O3885r0142p7598M7256J12361J25752
33897a85256J85654K28646J43991L3627O4668J45343N6868j52923k32876j48077
33887A39665r8027j29918r1433J0021k4163j84376j90839M7649K53254K05206
33877f2961L2632p7140j55103k45981k14502J5859K57562L07522K12167J07930
33867A77985l42j23784j59442o8716K214l4942l6826J13161K61669K07721M461
33856C43159j59434k28128k43797j97425r6284l4486l4416K3019J63715K11191
33846b52886P4554o9850o8577l3647q7023j06240K5786J50726R4190j8725J989
33835b89703O9104J6178p0567m8198l6779j76034k57963j8095L55429M36974J82858
$$ plain form
33907 -200737 -458929 -606302 -540579 -366770 -302885 -393027 -470625 -423369 -311008 -185256
33897 -185256 398 229044 373035 406662 471330 616673 673541 520618 287742 139665
33887 139665 41638 -88280 -179713 -169692 -193855 -378231 -569070 -521421 -268167 -62961
33877 -62961 -30329 -107469 -262572 -508553 -723055 -707196 -449634 -142112 70055 177985
33867 177985 177643 53859 -105583 -174299 -172085 -207027 -243853 -130692 130977 338698 343159
33856 343159 183725 -44403 -288200 -485625 -581909 -616395 -650811 -627792 -464077 -252886
33846 -252886 -178332 -248182 -316759 -350406 -437429 -543669 -517883 -367157 -272967 -291692 -289703
33835 -289703 -220599 -204421 -274988 -323186 -359965 -535999 -793962 -812057 -456628 -19654 163204
33824A63204q7040k26245l30689l50095j23850K00398K64101N5946p3805j938
33814e10013K0464j19306j99391r8091J3116M4272J27160K41620J45168j49881
33804d84882k74741q9488P5423Q584j3058K31779M36085K53451r7122j77629j9611
33793a51209P03k03051l64050l24937j66853M2808K68571L44203J46300j11408
33783e18923q8659J97692M00177L24928R7031j28954l12252l75664k24791K7449
33773f01966J25093K3255o0985q865L4197n8385j72892j45204k287J12987J34875
33762f20177Q6388l090r7885j42470j15392n1019J4881O2475N4487k6880j06278
33751i44960p3449P1926K18015K81896K58947J44895o0389k51909k63774q3014
$$ plain form
33824 163204 76164 -150081 -480770 -830865 -954715 -754317 -490216 -434270 -508075 -510013
33814 -510013 -489549 -608855 -808246 -906337 -893221 -848949 -721789 -480169 -335001 -484882
33804 -484882 -759623 -849111 -773688 -765104 -778162 -546383 -110298 143153 46031 -131598 -151209
33793 -151209 -150506 -353557 -717607 -1042544 -1209397 -1166589 -898018 -553815 -407515 -518923
33783 -518923 -607582 -409890 -9713 315215 412246 283292 -28960 -404624 -629415 -601966
33773 -601966 -476873 -453618 -514603 -523468 -489271 -547656 -720548 -865752 -868039 -755052 -620177
33762 -620177 -533789 -536879 -634764 -777234 -892626 -943645 -928764 -866289 -811802 -838682 -944960
33751 -944960 -1018409 -946483 -728468 -446572 -187625 -42730 -103119 -355028 -618802 -701816
33741g01816Q8784P5382m6550n5515J16087K87624K46883l313k53935l16472j91400
33730g54241j1057J17583J62826J20366J7172n1744m543R0610P2094q3030j97296
33719e21260j25290N8615J83106J91232J35544N3517l6094p6146l1642K4619p937
33708a51736j07006j42457l7615J43411K60651K16391L7714j30984j59816p9282
33698a50729l8423j02338j71608j32211L64J23104J49030M2821j50215k84567
33688g14772k31701m5545R6581J24260J09521Q4221J5463k8712O7649K01994J19480
33677b01561j55038k56738j9227K33367J66557p7904j66608r1468n8465o4311
33667f91396L2630J55136J09550l1910k0931J37789J98546R4172N812J6681J8399
$$ plain form
33741 -701816 -613032 -537650 -584200 -639715 -523628 -236004 10879 7566 -246369 -562841 -754241
33730 -754241 -765298 -647715 -484889 -364523 -347351 -399095 -403638 -313028 -240934 -323964 -521260
33719 -521260 -646550 -587935 -404829 -213597 -78053 -24536 -60630 -136776 -168418 -143799 -151736
33708 -151736 -258742 -401199 -438814 -295403 -34752 181639 219353 88369 -71447 -150729
33698 -150729 -189152 -291490 -463098 -595309 -594945 -471841 -322811 -279990 -430205 -714772
33688 -714772 -946473 -992018 -895437 -771177 -661656 -577435 -561972 -590684 -523035 -321041 -201561
33677 -201561 -356599 -613337 -632564 -399197 -232640 -310544 -477152 -568620 -627085 -691396
33667 -691396 -658766 -503630 -394080 -425990 -446921 -309132 -110586 -16414 -10602 6079 24478
33656B4478k9717n2953p3774j69484k29093p7504J62360J82509j6736j14870Q28
33645c93956Q1820j5567r7493j0918J00627R0713L9617J9302o2621k06659k12957
33634f68092k2309J22999N6280n9546n3860k5713p3154n0212J32120K42858P8345
33623c20284j68239k05161r5267p6585j22574m5879J01591J08617L546J4896J64054
33612f41285K23914R4243o0672q1739n55P3481Q3352L6047L160O4396J60224J21931
33600G6497m6763j10743J8932R3438n6164j80221j9162K03829J27439j08668p9601
33589h1187J78393K01869j09612l07561j27980J16068R3540n4096n7992L2414
33579a16144N7626P8825J77252J89130k6705k64248k37892j4290J27168J25965
$$ plain form
33656 24478 -5239 -58192 -131966 -301450 -530543 -608047 -445687 -263178 -279914 -394784 -393956
33645 -393956 -312136 -327703 -425196 -436114 -335487 -244774 -205157 -185855 -248476 -455135 -668092
33634 -668092 -690401 -567402 -511122 -570668 -624528 -650241 -723395 -773607 -641487 -398629 -320284
33623 -320284 -488523 -693684 -788951 -865536 -988110 -1033989 -932398 -823781 -820235 -805339 -641285
33612 -641285 -417371 -323128 -383800 -465539 -466094 -392613 -309261 -273214 -270054 -205658 -45434 76497
33600 76497 29734 -81009 -62077 31361 -24803 -205024 -224186 -20357 107082 -1586 -81187
33589 -81187 97206 299075 189463 -118098 -246078 -130010 -36470 -90566 -148558 -116144
33579 -116144 -58518 20307 197559 386689 359984 95736 -142156 -156446 -29278 96687
33569I6687J26857J45944O7554p9506j37123r5808r9069j68847j65300m1436P7453
33558b72594J02882Q1352M9099k9900j35448j69822j21245r3621j12690n9967
33548g61954J12263K46481J88164K6118k1396Q8174J72123Q0157j16847k38376
33538b25093k14835j31521q8562q7261o7427j1453K7193n207q6196j23402m3109
33527a056873J20019K31368J82949J9089r1653k4960J76931L49971L43373J26277
33517C76491j67062k96529j27831J72144K67263N6109j78145j37359R7790K15990
33507B78861J16686k1874p0175r0439j29785j13310k0485L9109J9982K3206Q4968
33496A16744P1916q5282k30188k03477p3942J1673O1715J41558J76568O5133j03087
$$ plain form
33569 96687 223544 369488 437042 357536 220413 124605 25536 -143311 -308611 -350047 -272594
33558 -272594 -169712 -88360 -39261 -69161 -204609 -374431 -495676 -589297 -701987 -761954
33548 -761954 -649691 -403210 -215046 -188928 -210324 -122150 49973 130130 13283 -225093
33538 -225093 -439928 -571449 -660011 -747272 -814699 -826152 -798959 -804166 -890362 -1013764 -1056873
33527 -1056873 -936854 -705486 -522537 -503448 -595101 -620061 -443130 -93159 250214 376491
33517 376491 209429 -87100 -214931 -42787 224476 280585 102440 -34919 62871 278861
33507 278861 395547 373673 303498 213059 83274 -30036 -50521 -11412 8570 31776 116744
33496 116744 188660 103378 -126810 -330287 -404229 -392556 -330841 -189283 -12715 52418 -50669
33485e0669j51205o9756L0156J40675L02700L84030J88177j96980m22595l23056
33475a68523j06931j1054Q081Q7980J62618P0114j41916k38672j17106O4308J06711
33464b84390N991q1585l9181R2391J64944O6290j61574l28411k49782N9509L46428
33453d09370L32838J5296k88958k76348j6937J36076Q470j83661j70211n512O9426
33442g88891K3651M7157J95036K82352J89890M3053k0429o0290j67086k53675
33432e09232j93226m9037K1623J6439N2183J26655J12855r105r5049m8182O1742
33421e12334J37204J76098J95810J57230M6978n9635j04539j38825k18522k74666
33411e95201j97167j6868J06088Q1631j0089m0737J2904P4202Q0102M7367M0573
$$ plain form
33485 -50669 -201874 -271630 -241474 -100799 201901 585931 774108 577128 154533 -168523
33475 -168523 -275454 -286508 -278427 -190447 -27829 42285 -99631 -338303 -455409 -391101 -284390
33464 -284390 -278399 -359984 -399165 -306774 -141830 -75540 -237114 -565525 -815307 -755798 -409370
33453 -409370 -76532 -61236 -350194 -626542 -643479 -507403 -498933 -682594 -852805 -858317 -788891
33442 -788891 -765240 -718083 -523047 -240695 -50805 -7752 -28181 -88471 -255557 -509232
33432 -509232 -702458 -751495 -729872 -713433 -661250 -534595 -421740 -430845 -525894 -574076 -512334
33421 -512334 -375130 -199032 -3222 154008 200986 141351 36812 -102013 -320535 -595201
33411 -595201 -792368 -809236 -703148 -621517 -631606 -672343 -659439 -585237 -505135 -457768 -417195
33400d17195R6508J74164J81183P6051n5169o9609N8188J77048J28802m8235j61467
33389A40269j14875k8166n3034j50162j54351k8438P7833M7956m4608p2023m3825
33378d23424n1992r0292o8517Q641K1762o9659j38212o1492J08942K29409K40957
33367b93877J79134P0574p2797j84879j78251n5445Q5495J61429J61190J03647
33357b3780J2283o9565j09854j35632j81851k05730j42991l8460J234m531P7162
33346h21715K38628K64819N1906j56583n6927K63682L93254J28533k59150l65323
33336c18876j07875K50637M17246K99177N836k61077l49163k67917j49046p0596
33326e51654J4858J38279K02616J10776p0073j91619k20937k25070k00381q0615
$$ plain form
33400 -417195 -320687 -146523 34660 110711 55542 -14067 44121 221169 349971 301736 140269
33389 140269 25394 -2772 -55806 -205968 -360319 -388757 -310924 -262968 -307576 -379599 -423424
33378 -423424 -475416 -565708 -634225 -625584 -603822 -673481 -811693 -873185 -764243 -534834 -293877
33367 -293877 -114743 -44169 -116966 -301845 -480096 -535541 -450046 -288617 -127427 -23780
33357 -23780 -11497 -81062 -190916 -326548 -508399 -714129 -857120 -895580 -894346 -898877 -821715
33346 -821715 -583087 -318268 -266362 -422945 -479872 -216190 177064 305597 46447 -318876
33336 -318876 -426751 -176114 241132 540309 546145 285068 -64095 -332012 -481058 -551654
33326 -551654 -536796 -398517 -195901 -85125 -155198 -346817 -567754 -792824 -993205 -1073820
33316a073820Q1202J16002j2082j12447k5977J47261K05994J36596Q7534J11519
33306c38218J09279L0406l5978j3899N4774J12084J55040J35945n3682l69810
33296b14059n22430k90952J33586L31557J67526q7711j67400j11215p1294m0870
33286h73262N6142J67233J96463J77348J76344J29571j7926j15443j2513J09067
33276f976o3402m29950m99664p9927L95292M40627J35588j06842j41476j15889
33266d72619o9603Q2363K24340J11658j86355k89720o5574J57058R3278q9682
33256e04856r7224K5681M1520m9653m3918R2430J76694J13693o17p4352j00761
33245d21363n0265R8471K12986J23515q1154j14317P9375K01283L9464j94050
$$ plain form
33316 -1073820 -992618 -876616 -888698 -1001145 -1027122 -879861 -673867 -537271 -449737 -338218
33306 -338218 -228939 -198533 -234511 -248410 -193636 -81552 73488 209433 155751 -214059
33296 -214059 -736489 -1027441 -893855 -562298 -394772 -482483 -649883 -761098 -832392 -873262
33286 -873262 -817120 -649887 -453424 -276076 -99732 29839 11913 -103530 -116043 -6976
33276 -6976 -70378 -500328 -999992 -1079919 -684627 -244000 -108412 -215254 -356730 -472619
33266 -472619 -542222 -459859 -235519 -123861 -310216 -599936 -665510 -508452 -415174 -504856
33256 -504856 -602080 -576399 -534879 -584532 -628450 -536020 -359326 -245633 -246250 -320602 -421363
33245 -421363 -471628 -373157 -160171 -36656 -117810 -232127 -152752 48531 87995 -106055
$$ [...]
##END NTUPLES=NMR SPECTRUM
##END=
