##TITLE=31P_DE-80H_X3
 64 sc D2O
 26.2.2025
##JCAMPDX= 6.0         $$ Bruker NMR JCAMP-DX V2.0
##DATA TYPE= NMR SPECTRUM
##DATA CLASS= XYDATA
##ORIGIN= UXNMR, Bruker Analytische Messtechnik GmbH
##OWNER= root
$$ XWIN-NMR		Version 3.5
$$ Tue Sep 16 11:42:23 2025 Russian Standard Time (UT+4h)  Yarkov@DPX200
##.OBSERVE FREQUENCY= 81.013821
##.OBSERVE NUCLEUS= ^31P
##.ACQUISITION MODE= SIMULTANEOUS
##.ACQUISITION SCHEME= undefined
##.AVERAGES= 64
##.DIGITISER RES= 17
##SPECTROMETER/DATA SYSTEM= spect
##.PULSE SEQUENCE= zgpg30
##.SOLVENT NAME= D2O
##.SHIFT REFERENCE= (INTERNAL, D2O, 0, 198.062)
##AUDIT TRAIL= $$ (NUMBER, WHEN, WHO, WHERE, WHAT)
$$ ##TITLE= Audit trail, XWIN-NMR		Version 3.5
$$ ##JCAMPDX= 5.01
$$ ##ORIGIN= Bruker BioSpin GmbH
$$ ##OWNER= Yarkov
$$ C:/Bruker/XWIN-NMR/data/yarkov2/nmr/P31/2/pdata/1/auditp.txt
$$ ##AUDIT TRAIL=  $$ (NUMBER, WHEN, WHO, WHERE, WHAT)
(   1,<2025-09-16 11:41:26.06 +0400>,<Yarkov>,<DPX200>,
      <created by zg, POWCHK disabled, PULCHK disabled
       configuration hash MD5:
       00 E9 B6 7A A2 85 ED C7 34 08 36 98 17 FE 4E 26
       data hash MD5: 32K
       4B 66 91 28 A4 38 6B 12 F2 7F B8 3A 7A B7 DC E5>)
(   2,<2025-09-16 11:41:55.32 +0400>,<Yarkov>,<DPX200>,
      <Start of raw data processing
       efp BC_mod = 2 LB = 1.5 FT_mod = 6 PKNL = 1 PHC0 = 1675.573 PHC1 = 24.15952 SI = 64K 
       data hash MD5: 64K
       2E 51 2D D7 CC 5A 83 95 3E C0 92 B6 EA 93 C5 46>)
$$ ##END=
$$ 
$$ hash MD5
$$ 97 14 E4 CD 29 20 78 74 30 E3 FD 8B 18 AD 5A 31
##$RELAX= 
##$RELAX= 
##$RELAX= 
##$RELAX= 
##$RELAX= 
##$RELAX= 
##$RELAX= 
##$RELAX= 
$$ Bruker specific parameters
$$ --------------------------
##$DU= <C:/Bruker/XWIN-NMR>
##$EXPNO= 2
##$NAME= <P31>
##$PROCNO= 1
##$TYPE= <nmr>
##$USER= <yarkov2>
##$AMP= (0..31)
100 100 100 100 100 100 100 100 100 100 100 100 100 100 100 100 100 100 
100 100 100 100 100 100 100 100 100 100 100 100 100 100 
##$AQSEQ= 0
##$AQ_mod= 1
##$AUNM= <au_zg>
##$AUTOPOS= <>
##$BF1= 81.014009
##$BF2= 200.13
##$BF3= 200.13
##$BF4= 200.13
##$BF5= 200.13
##$BF6= 200.13
##$BF7= 200.13
##$BF8= 200.13
##$BYTORDA= 1
##$CFDGTYP= 0
##$CFRGTYP= 5
##$CHEMSTR= <none>
##$CNST= (0..31)
1 1 145 1 1 1 1 1 1 1 1 1 1 1 1 1 1 1 1 1 1 1 1 1 1 1 1 1 1 1 1 1 
##$CPDPRG= <waltz16>
##$CPDPRG1= <>
##$CPDPRG2= <waltz16>
##$CPDPRG3= <>
##$CPDPRG4= <mlev>
##$CPDPRG5= <mlev>
##$CPDPRG6= <mlev>
##$CPDPRG7= <mlev>
##$CPDPRG8= <mlev>
##$CPDPRGB= <>
##$CPDPRGT= <>
##$D= (0..31)
0 1 0 0 0 0 0 0 0 0.06 0 0.03 2e-05 3e-06 0 0 0.0002 0 0 0 0 0 0 0 0 0 
0 0 0 0 0 0 
##$DATE= 1758008485
##$DBL= (0..7)
120 120 120 11 120 120 24 19 
##$DBP= (0..7)
150 150 150 150 150 150 150 150 
##$DBP07= 0
##$DBPNAM0= <>
##$DBPNAM1= <>
##$DBPNAM2= <>
##$DBPNAM3= <>
##$DBPNAM4= <>
##$DBPNAM5= <>
##$DBPNAM6= <>
##$DBPNAM7= <>
##$DBPOAL= (0..7)
0.5 0.5 0.5 0.5 0.5 0.5 0.5 0.5 
##$DBPOFFS= (0..7)
0 0 0 0 0 0 0 0 
##$DE= 6
##$DECBNUC= <off>
##$DECIM= 4
##$DECNUC= <off>
##$DECSTAT= 4
##$DIGMOD= 1
##$DIGTYP= 9
##$DL= (0..7)
0 0 52 120 120 21 21 25 
$$ [...]
##$SPNAM4= <gauss>
##$SPNAM5= <gauss>
##$SPNAM6= <Gaus1.1000>
##$SPNAM7= <Gaus1.1000>
##$SPNAM8= <gauss>
##$SPNAM9= <gauss>
##$SPOAL= (0..31)
0.5 0.5 0.5 0.5 0.5 0.5 0.5 0.5 0.5 0.5 0.5 0.5 0.5 0.5 0.5 0.5 0.5 0.5 
0.5 0.5 0.5 0.5 0.5 0.5 0.5 0.5 0.5 0.5 0.5 0.5 0.5 0.5 
##$SPOFFS= (0..31)
0 0 0 0 0 0 0 0 0 0 0 0 0 0 0 0 0 0 0 0 0 0 0 0 0 0 0 0 0 0 0 0 
##$SUBNAM0= <"">
##$SUBNAM1= <"">
##$SUBNAM2= <"">
##$SUBNAM3= <"">
##$SUBNAM4= <"">
##$SUBNAM5= <"">
##$SUBNAM6= <"">
##$SUBNAM7= <"">
##$SUBNAM8= <"">
##$SUBNAM9= <"">
##$SW= 400.765351723535
##$SWIBOX= (0..15)
0 1 3 0 0 0 0 0 0 0 0 0 0 0 0 0 
##$SW_h= 32467.5324675325
##$TD= 32768
##$TD0= 1
##$TE= 0
##$TE2= 300
##$TE3= 300
##$TEG= 300
##$TL= (0..7)
0 120 53 12 22 120 120 120 
##$TP= (0..7)
150 150 150 150 150 150 150 150 
##$TP07= 0
##$TPNAME0= <>
##$TPNAME1= <>
##$TPNAME2= <>
##$TPNAME3= <>
##$TPNAME4= <>
##$TPNAME5= <>
##$TPNAME6= <>
##$TPNAME7= <>
##$TPOAL= (0..7)
0.5 0.5 0.5 0.5 0.5 0.5 0.5 0.5 
##$TPOFFS= (0..7)
0 0 0 0 0 0 0 0 
##$TUNHIN= 0
##$TUNHOUT= 0
##$TUNXOUT= 0
##$USERA1= <user>
##$USERA2= <user>
##$USERA3= <user>
##$USERA4= <user>
##$USERA5= <user>
##$V9= 5
##$VALIST= <valist>
##$VCLIST= <CCCCCCCCCCCCCCC>
##$VD= 0
##$VDLIST= <DDDDDDDDDDDDDDD>
##$VPLIST= <PPPPPPPPPPPPPPP>
##$VTLIST= <TTTTTTTTTTTTTTT>
##$WBST= 1024
##$WBSW= 4
##$XGAIN= (0..3)
0 0 0 0 
##$XL= 0
##$YL= 0
##$YMAX_a= 1149
##$YMIN_a= -255
##$ZGOPTNS= <>
##$ZL1= 120
##$ZL2= 120
##$ZL3= 120
##$ZL4= 120
##$ABSF1= 0
##$ABSF2= 0
##$ABSG= 0
##$ABSL= 0
##$ALPHA= 0
##$AQORDER= 0
##$ASSFAC= 0
##$ASSFACI= 0
##$ASSFACX= 0
##$ASSWID= 0
##$AUNMP= <proc_1d>
##$AZFE= 0.1
##$AZFW= 0.5
##$BCFW= 0
##$BC_mod= 2
##$BYTORDP= 0
##$COROFFS= 0
##$CY= -3
##$DATMOD= 1
##$DC= 0
##$DFILT= <>
##$DTYPP= 0
##$F1P= 0
##$F2P= 0
##$FCOR= 1
##$FTSIZE= 65536
##$FT_mod= 6
##$GAMMA= 0
##$GB= 0
##$INTBC= 1
##$INTSCL= 9.790993e-09
##$ISEN= 30
##$LB= 1.5
##$LEV0= 0
##$LPBIN= 0
##$MAXI= 10000
##$MC2= 0
##$MEAN= 0
##$ME_mod= 0
##$MI= 50
##$NCOEF= 0
##$NC_proc= -14
##$NLEV= 6
##$NOISF1= 182.463
##$NOISF2= 159.3651
##$NSP= 0
##$NTH_PI= 0
##$NZP= 0
##$OFFSET= 198.0616
##$PC= 4
##$PHC0= 1675.573
##$PHC1= 24.15952
##$PH_mod= 1
##$PKNL= yes
##$PPARMOD= 0
##$PSCAL= 0
##$PSIGN= 0
##$REVERSE= no
##$SF= 81.0140089999434
##$SI= 65536
##$SIGF1= 159.3651
##$SIGF2= -187.1042
##$SINO= 113.3802
##$SIOLD= 16384
##$SREGLST= <1H.CDCl3>
##$SSB= 0
##$STSI= 65536
##$STSR= 0
##$SW_p= 32467.5324675325
##$SYMM= 0
##$S_DEV= 0
##$TDeff= 32768
##$TDoff= 0
##$TI= <>
##$TILT= no
##$TM1= 0
##$TM2= 0
##$TOPLEV= 0
##$USERP1= <user>
##$USERP2= <user>
##$USERP3= <user>
##$USERP4= <user>
##$USERP5= <user>
##$WDW= 1
##$XDIM= 65536
##$YMAX_p= 285573634
##$YMIN_p= -315407785
$$ End of Bruker specific parameters
$$ ---------------------------------
##XUNITS= HZ
##YUNITS= ARBITRARY UNITS
##XFACTOR= 0.49542278885378
##YFACTOR= 1
##DELTAX= -0.49542278885378
##NPOINTS= 65536
##FIRSTX= 16045.7642231865
##FIRSTY= 0
##LASTX= -16421.768244346
##MAXY= 285573634
##MINY= -315407785
##XYDATA= (X++(Y..Y))
$$ [...]
7307G012456q465696m389080m832829q219865o502233N30407M651572K681246
7299a7534022P56935L222446N815297L499235j674404m744925m701020k998212
7291a8358670M20150N138230P698167N696697K121581J149647J525863r81619
7283D410046n594815o589843k171246J980034P74012k718005j964174K994137
7275h879854N283100J130321m629782n195641o28892L182151K532914n68380k148287
7266i922350l53519L990059P840708P004336J20517p932440j0155443n918772
7258a5326904j667950j868390l627692k819593q59084r63939j359196J975653
7250b6517095P610508R722186O636617K823831J554473O19361k682093o402497
$$ plain form
7307 7012456 -1453240 -5842320 -10675149 -18895014 -25397247 -24866840 -20215268 -17534022
7299 -17534022 -16777087 -13554641 -7739344 -4240109 -5914513 -10659438 -15360458 -18358670
7291 -18358670 -17938520 -12800290 -5102123 594574 2716155 3865802 5391665 4410046
7283 4410046 -1184769 -7774612 -9945858 -7965824 -7191812 -9909817 -11873991 -8879854
7275 -8879854 -3596754 -2466433 -7096215 -12291856 -12920748 -9738597 -7205683 -7774063 -9922350
7266 -9922350 -10275869 -6285810 1554898 8559234 8679751 747311 -9408132 -15326904
7258 -15326904 -16994854 -18863244 -22490936 -25310529 -26169613 -27133552 -28492748 -26517095
7250 -26517095 -18906587 -9184401 -2547784 276047 1830520 2449881 -232212 -6634709
7242f634709o678120l257831K31112N62181j916031l777373j894927K859820N788708
7233a4717170L632194j189289l589610k130750K15942P90829k45048j549082j641528
7224b0423512J039284N637733P232032K121030n424170o760534k1848P382217
7216i217768Q769249N458408J991626l91090k034061j463831J733647L958476
7208H804656J944927k190483l884303k017227J207582L896013M997223L794203
7200A6552591J732885J751881K939433q7124q565955j4952269j2460289n081827
7192a8170674j127163l11734L908696J0868517J1831437M127661l368145k926621
7184D831974J613555K440351l62554j033388J697948L420345J544417j675388
$$ plain form
7242 -6634709 -13312829 -16570660 -16339548 -15777367 -17693398 -21470771 -23365698 -20505878 -14717170
7233 -14717170 -11084976 -12274265 -15863875 -17994625 -17778683 -16987854 -17232902 -18781984 -20423512
7224 -20423512 -19384228 -13746495 -6514463 -4393433 -9817603 -16578137 -16599985 -9217768
7216 -9217768 -448519 5009889 7001515 6610425 4576364 3112533 4846180 8804656
7208 8804656 10749583 8559100 4674797 2657570 3865152 7761165 12758388 16552591
7200 16552591 18285476 20037357 22976790 22889666 14323711 -628558 -13088847 -18170674
7192 -18170674 -19297837 -19609571 -15700875 -4832358 6999079 11126740 7758595 4831974
7184 4831974 6445529 8885880 8523326 7489938 9187886 12608231 14152648 12477260
7176A2477260l508439l730087k785472n37436K131485L063150J471344p73933
7168G807872j653092j597538k221953l137580k002407J589140M187682K620427
7160E592551j065237k013557J87708Q14405k157093m275181j769615K089428K454448
7151a42143O60963M89783K28447l660792p157192k649896P278279J0203435J296477
7142F547361q878089r381803l667095k135993o189652q304907m519721J595148
7134c4934751O133280Q605507Q481795M437428j626409m609940k122891K414836
7126a3221145L720271K17791m347796m191936K162500Q424549O761921j385987
7118a859832n788758j535561L556829J022158n002206m917839N54091K247736
$$ plain form
7176 12477260 8968821 5238734 2453262 1915826 4047311 7110461 8581805 7807872
7168 7807872 6154780 4557242 2335289 -802291 -2804698 -1215558 2972124 5592551
7160 5592551 4527314 2513757 2701465 3515870 1358777 -2916404 -4686019 -2596591 -142143
7151 -142143 518820 1008603 1237050 -2423742 -9580934 -12230830 -4952551 5250884 6547361
7142 6547361 -2330728 -11712531 -15379626 -17515619 -23705271 -32010178 -36529899 -34934751
7134 -34934751 -28801471 -20195964 -11714169 -7276741 -8903150 -13513090 -15635981 -13221145
7126 -13221145 -9500874 -9283083 -13630879 -17822815 -15660315 -7235766 -473845 -1859832
7118 -1859832 -7648590 -9184151 -5627322 -4605164 -9607370 -14525209 -13971118 -11723382
7110a1723382j679124l160744J575875N959642M467587O62768n63766m82209j114252
7101f057605J37072M475530O846444L471785j444510k962956l561481o657129
7093e752850p765147j623723O047434M968704l242737o585328j292676K812471
7085a2433852r57173n343269j873689M690371M047856l163236o912162l510962
7077b5456116L95481M09581J531061Q446460J5534937J3310277K151249o874542
7069I448388n568614J666096M191277j325471p422875o101178P84251M236249
7061i1877o3861o649151q145360m422559n13058J788270M837498Q213498P236381
7052B189781Q88001m203059k271947K852625L204090j421245l686574n09879K470109
$$ plain form
7110 -11723382 -13402506 -16563250 -14987375 -9027733 -4560146 -3897378 -4461144 -4943353 -6057605
7101 -6057605 -5920533 -1445003 5401441 8873226 7428716 4465760 904279 -5752850
7093 -5752850 -13517997 -15141720 -9094286 -4125582 -7368319 -13953647 -15246323 -12433852
7085 -12433852 -13391025 -18734294 -20607983 -15917612 -11869756 -15032992 -21945154 -25456116
7077 -25456116 -25060635 -24651054 -23119993 -14673533 861404 14171681 16322930 9448388
7069 9448388 3879774 5545870 9737147 8411676 988801 -5112377 -4328126 -91877
7061 -91877 -155738 -6804889 -14950249 -19372808 -19885866 -18097596 -13260098 -5046600 2189781
7052 2189781 3077782 -1125277 -3397224 -544599 2659491 1238246 -2448328 -2958207 -488098
7043d88098L00532l771602m183346j588456m58192j381268j164744J062317K919107
7034h753750L233754K917802J806890q66202k838732m30001N144484P422431K661128
7025A0297804n127976r140356p137993k024818K414726M161975L176055J159688
7017b220895K92472R68827J533750O77484j060442k233522j572548J283230M121182
7008A789538K470967m834212j1231916q616164J404596P925508M437243l355662
7000a0010102o560804m458984k013509p22940J461219L635743K363780j579338
6992a7884935k785779J142431N672676M780109j944924q575528q327132m55885
6984b8378967P605047P323701l94806n466149j975877L676012K850341k177205
$$ plain form
7043 -488098 -187566 -3959168 -8142514 -9730970 -10189162 -11570430 -12735174 -11672857 -8753750
7034 -8753750 -5519996 -2602194 -795304 -1661506 -4500238 -4930239 214245 7636676 10297804
7025 10297804 5169828 -3970528 -11108521 -13133339 -10718613 -6556638 -3380583 -2220895
7017 -2220895 -1928423 -959596 574154 1251638 191196 -2042326 -3614874 -2331644 1789538
7008 1789538 4260505 -573707 -11805623 -20421787 -19017191 -11091683 -6654440 -10010102
7000 -10010102 -16570906 -21029890 -23043399 -23766339 -22305120 -18669377 -16305597 -17884935
6992 -17884935 -20670714 -19528283 -13855607 -9075498 -11020422 -19595950 -27923082 -28378967
6984 -28378967 -20773920 -13450219 -13845025 -19311174 -21287051 -17611039 -14760698 -16937903
6976a6937903k840367J371190K854932o15459k552052L41746K702096Q15201m13777
6967a5274393L556295Q264745P408702L115609J836685L906080M389399J758767
6959A8961889j162375l371188o341351r181811r026708o244446m084599k968588
6951b3419177l6490N059269Q516304P709505M425111J623392J08321o16593r96553
6942B373089j851001l829452n904628o430020n601677m657037l248791m67474
6934b9616991K194986K442866J451583K563243N428709N720812J790398k520760
6926a0545154l510236k339645j890824k221225j904771j305216j542293j860101
6918b7119465o04347K236128N265277P277877P261915M417397k62926l934573
$$ plain form
6976 -16937903 -19778270 -18407080 -15552148 -16167607 -18719659 -18377913 -15675817 -14860616 -15274393
6967 -15274393 -11718098 -3453353 3955349 7070958 8907643 12813723 17203122 18961889
6959 18961889 17799514 14428326 8086975 -1094836 -10121544 -16365990 -20450589 -23419177
6951 -23419177 -23455667 -18396398 -9880094 -2170589 2254522 3877914 3986235 3369642 2373089
6942 2373089 522088 -3307364 -9211992 -15642012 -21243689 -25900726 -29149517 -29616991
6934 -29616991 -27422005 -24979139 -23527556 -20964313 -15535604 -9814792 -8024394 -10545154
6926 -10545154 -14055390 -16395035 -18285859 -20507084 -22411855 -23717071 -25259364 -27119465
6918 -27119465 -27723812 -25487684 -20222407 -12944530 -5682615 -1265218 -1528144 -5462717
6910e462717m873922m041071k637853l08792K691057M043395K478796L75283O64390
6901g071434K740891M035782M100700M158862L762284J193077l155614o725902
6893C038646q126880q029150o806110l899118R4266L088789M100179M411291N271378
6884f856709N640149L168398k772635r211956j1202810o659569M08592L770013
6876b3716527K689098K463020N521281O491331N76300o939832o466957J947042
6868a7435244P978384N225151j173117l617906j973839k94861N55570J659638
6860i076224J894871Q71825K392795Q403596J2182483N310867r108535j7912389
6852e040711j4027641m445947M80707m55772j517952K58317K901864M391086M593806
$$ plain form
6910 -5462717 -10336639 -14377710 -17015563 -17324355 -14633298 -10589903 -8111107 -7735824 -7071434
6901 -7071434 -4330543 -294761 3805939 7964801 11727085 12920162 9764548 3038646
6893 3038646 -5088234 -13117384 -19923494 -23822612 -23728346 -20639557 -16539378 -12128087 -6856709
6884 -6856709 -1216560 1951838 -820797 -10032753 -21235563 -27895132 -27486540 -23716527
6876 -23716527 -21027429 -18564409 -13043128 -6551797 -5975497 -12915329 -19382286 -17435244
6868 -17435244 -9456860 -4231709 -5404826 -9022732 -10996571 -11291432 -10735862 -9076224
6860 -9076224 -7181353 -6309528 -3916733 4486863 16669346 21980213 12871678 -5040711
6852 -5040711 -19068352 -23514299 -23033592 -23489364 -25007316 -24748999 -21847135 -17456049 -12862243
6843a2862243L302095M47099j986533j573517R74629K489523J616146M8029n23772
6834h068544m27994o92080j563420k625900l009422j755901N52478J380165l93267
6825a6603885j713156Q57349N109711N098392k68090n025082m451827j126776
6817a8123364M91357J286708M390858P902561O877898J587059k318873k202777
6809a08573j160683j237822p0249L082925L849836l93337m894918m018128J70277
6800d780672J535970n41119j585020n19826q97607l649865n315762m681662m824549
6791b5260112o462309n460176j72599M392463L939937J568499K296012N110814
6783b0047471N915563M901226M881056M855968J906188j918803j479117K900019
$$ plain form
6843 -12862243 -9560148 -9113049 -11099582 -12673099 -11698470 -9208947 -7592801 -7544772 -8068544
6834 -8068544 -8496538 -9188618 -10752038 -13377938 -16387360 -18143261 -17590783 -16210618 -16603885
6825 -16603885 -18317041 -17459692 -12349981 -7251589 -7519679 -12544761 -16996588 -18123364
6817 -18123364 -17632007 -16345299 -11954441 -4051880 2826018 4413077 2094204 -108573
6809 -108573 -1269256 -2507078 -2577327 505598 4355434 3962097 -932821 -4950949 -4780672
6800 -4780672 -3244702 -3785821 -5370841 -5890667 -6788274 -10438139 -15753901 -20435563 -25260112
6791 -25260112 -31722421 -37182597 -37355196 -32962733 -29022796 -27454297 -25158285 -20047471
6783 -20047471 -14131908 -9230682 -4349626 506342 2412530 493727 -985390 1914629
6775A914629N370515L586692J206106J58100k591548p777636r964315n379262
6767a3476719J552312M472635L783089L851959M962000L918969N55512k244969
6759G374788l892511n844145o635653l098905K957586N216802J883429j085979
6751c124588J164134M817598L025561l724834p884004m886201J377576M154859
6743e079899J900050j205364j355746N29176R60051j048063k666709j176313K288826
6734f853991M122707K544071r93767m255567o320694p087526o325382l878983
6726b9049132L0151M712098Q261034P664680J935606m912116o909855l250804
6718b1518338L01311j117051n090771n655382j472098L190119M855090M490184
$$ plain form
6775 1914629 7285144 10871836 12077942 12236042 9644494 1866858 -8097457 -13476719
6767 -13476719 -11924407 -7451772 -3668683 183276 5145276 9064245 9619757 7374788
6759 7374788 3482277 -2361868 -8997521 -12096426 -9138840 -3922038 -2038609 -3124588
6751 -3124588 -1960454 2857144 5882705 2157871 -5726133 -10612334 -9234758 -5079899
6743 -5079899 -3179849 -4385213 -5740959 -5211783 -4251732 -5299795 -7966504 -9142817 -6853991
6734 -6853991 -2731284 -187213 -1180980 -5436547 -11757241 -18844767 -25170149 -29049132
6726 -29049132 -29018981 -24306883 -16045849 -8381169 -6445563 -11357679 -18267534 -21518338
6718 -21518338 -21217027 -22334078 -27424849 -33080231 -34552329 -31362210 -26507120 -22016936
6710b2016936M239386L900729K435936P10486M22538J256373J096251r47653k962229
6701a1865119k079066K271946O930674P404243K879634j499931L65235P477783
6693A1885399J1353230N958442m140766r130075o301311k443409l331874n976612
6685b126976m464805M47939K611986j77575l247379k038977J988123M043579J940217
6676a023868k214711m550221k779009J428781L270619J35437m108598l411320
6668a3252890J611154L566432j178447o572282n163850J512522N760166M512548
6660i204647J867156J745806L262621L796799K368625q16242m626907o203666
6652g810455l232273K401706O291966P006838O590097N751523K819284k001200
$$ plain form
6710 -22016936 -17777550 -13876821 -11440885 -10730399 -10307861 -9051488 -7955237 -8902890 -11865119
6701 -11865119 -13944185 -11672239 -4741565 2662678 5542312 4042381 4407616 11885399
6693 11885399 23238629 29197071 25056305 15926230 9624919 7181510 3849636 -2126976
6685 -2126976 -6591781 -6143842 -3531856 -3709431 -6956810 -8995787 -7007664 -2964085 -1023868
6676 -1023868 -3238579 -7788800 -10567809 -9139028 -5868409 -5732972 -9841570 -13252890
6668 -13252890 -11641736 -8075304 -9253751 -15826033 -20989883 -19477361 -13717195 -9204647
6660 -9204647 -7337491 -5591685 -2329064 1467735 3836360 3020118 -1606789 -7810455
6652 -7810455 -11042728 -8641022 -2349056 4657782 11247879 16999402 19818686 17817486
6644A7817486n827599p608961q939800r286250n691976P97770M258242K729110
6636a1751978K085273O333687R640827M763575m635976q119334l131576K418076
6628b397426K209147j360020l535690l862926l571534j815535J687802M042099
6620h604083K861985R4831q41986K06177Q16959j50301j525246j490113J004005
6611g627772M874132O153675J350371o796084j0083176m387858M086541O053477
6603f376694J104494k280118J247309O795093O499029L03326m443656k879138
6595c0355J930937M152642K407294m57623k583426m582466o248620n506209j946794
6586a2864620J517899K565982K546891L005621J471122n128756j3559729j5407548
$$ plain form
6644 17817486 11989887 4380926 -4558874 -13845124 -19537100 -18739330 -14481088 -11751978
6636 -11751978 -9666705 -3333018 6307809 11071384 6435408 -1683926 -4815502 -2397426
6628 -2397426 -188279 -1548299 -5083989 -8946915 -12518449 -14333984 -12646182 -8604083
6620 -8604083 -5742098 -5647267 -6489253 -6283076 -5466117 -5616418 -7141664 -8631777 -7627772
6611 -7627772 -2753640 3400035 4750406 -2045678 -12128854 -16516712 -12430171 -6376694
6603 -6376694 -5272200 -7552318 -6305009 490084 6989113 7292439 2848783 -30355
6595 -30355 1900582 6053224 8460518 8002895 5419469 837003 -5411617 -10917826 -12864620
6586 -12864620 -11346721 -8780739 -6233848 -3228227 -1757105 -6885861 -20445590 -35853138
6578c5853138o684665O599387J4305787J1945200L534911l428882m390639n03307
6570a4475346L309685L160910m78671m303784o051002n435140k277311L411288
6562b3139371R178974J0853341O924274M21706m568770o502694n736848k716330
6554a5285718J295570L258834N72012n538765r914990p556805J302489R995844
6546b1871529J1137814N059216L60239L339054R380094R395247K731712k973895
6538A6557952m263486n796326r616031r424028j353330O821940N435365k636415
6530d274359o055241j178550M683985N628819L988653L148004J380773l391364
6522C930720q256032r010124n879717k140097N80791K783613M546416M848398
$$ plain form
6578 -35853138 -42537803 -35938416 -21632629 -9687429 -6152518 -9581400 -13972039 -14475346
6570 -14475346 -11165661 -8004751 -8483422 -12787206 -18838208 -24273348 -26550659 -23139371
6562 -23139371 -13960397 -3107056 3817218 4238924 -329846 -6832540 -12569388 -15285718
6554 -15285718 -13990148 -10731314 -10159302 -15698067 -25613057 -33169862 -31867373 -21871529
6546 -21871529 -10733715 -5674499 -5314260 -1975206 7404888 16800135 19531847 16557952
6538 16557952 12294466 6498140 -3117891 -12541919 -13895249 -7073309 -1637944 -4274359
6530 -4274359 -10329600 -11508150 -6824165 -1195346 2793307 5941311 7322084 3930720
6522 3930720 -4325312 -13335436 -19215153 -21355250 -20774459 -17990846 -13444430 -8596032
6514h596032K885549p22751l448287k351073K146390N222832L258788q31783j685472
6505d121839M24337P88637j106196p90028K314106K503709k513418o322128l229886
6496a2052706K509006L087717j194753l423745q99745K245953K512959J067060
6488f148254l9047p36435j278639j517329k145691l358619k814478J171869N161420
6479a1705203M196310k85908j785751J124854K297632j635680m589194O9179Q233719
6470d080042R489581J538231o360175n701428O75396L519954m26635n266496m768431
6461a1380045l31810J992229L9541k515898k505508j589525k370132l540703k361798
6452b4563649K34935J320410J545013L984077P387055O330537M1921m454943j788592
$$ plain form
6514 -8596032 -5710483 -6433234 -9881521 -12232594 -10086204 -4863372 -1604584 -2436367 -4121839
6505 -4121839 -3697502 -2908865 -4015061 -4805089 -2490983 12726 -2500692 -8822820 -12052706
6496 -12052706 -9543700 -6455983 -7650736 -11074481 -11974226 -9728273 -7215314 -6148254
6488 -6148254 -6187301 -6923736 -8202375 -9719704 -11865395 -15224014 -18038492 -16866623 -11705203
6479 -11705203 -7508893 -7794801 -9580552 -8455698 -6158066 -7793746 -12382940 -12313761 -4080042
6470 -4080042 5409539 6947770 587595 -5113833 -4438437 -918483 -1345118 -6611614 -11380045
6461 -11380045 -11711855 -9719626 -9680085 -12195983 -14701491 -16291016 -18661148 -22201851 -24563649
6452 -24563649 -24328714 -23008304 -21463291 -17479214 -10092159 -3761622 -3719701 -8174644 -9963236
6443i963236L613494L827777j259512m810436l558405j021882Q1465K168827O854326
6434d067582R703442N362016m325480j1273453r757157j639022O436086Q965824
6426e95326N228186p19360l374770p22742L673081M398670M6059n568508p812764
6417e447474n489226o04042M270635P250444P138566M219731R26730j38652O20337
6408A2747049K43462k306008m105855k691181o25759k070642n428314m243889
6400h481137K938726Q435963N076441l473492p328519l475777J697375K607779
6392b002641P99738l90899j257548k519300j920636J541745M015679K276458m91778
6383E0818K31172K253001J56082m697474m987993J130435O414045M776195o80327
$$ plain form
6443 -9963236 -6349742 -2521965 -3781477 -8591913 -12150318 -13172200 -13090735 -10921908 -4067582
6434 -4067582 5635860 10997876 6672396 -4601057 -14358214 -15997236 -9561150 -595326
6426 -595326 4632860 3913500 538730 -184012 3489069 7887739 7933798 2365290 -5447474
6417 -5447474 -10936700 -11540742 -7270107 -19663 7118903 11338634 12265364 12126712 12747049
6408 12747049 12990511 10684503 6578648 3887467 3261708 1191066 -4237248 -8481137
6400 -8481137 -5542411 2893552 7969993 4496501 -2832018 -6307795 -4610420 -2002641
6392 -2002641 -1202903 -1593802 -2851350 -5370650 -7291286 -5749541 -1733862 542596 50818
6383 50818 281990 2534991 2691073 -2006401 -6994394 -5863959 550086 5326281 4645954
6374D645954l295272j824608K68840J001029R42553J80355j766917l924061m763251
6365h535378m472208m188221l970911l334912k456563j194323J314573M324435
6357b2513508N003550K491063l6184J6713P84896J07508M79118M831558R563426
6348G28140Q018557N54610n020865m041304l84438M40136j653753l682449m287841
6339i329207l073255N04304M183705K889010m169153r851549p373946M51471N445347
6330b0323273N265371M176626L805629O48079n628729q483960l330016M878756
6322a8991517Q053065N781584M056634M832220L290796l422388j0321486j0707880
6314a7428972m844418J086477K825151J330960p87167k450790l358801l087707
$$ plain form
6374 4645954 1350682 -473926 -205086 795943 1738496 1918851 151934 -3772127 -8535378
6365 -8535378 -13007586 -17195807 -21166718 -24501630 -26958193 -28152516 -26837943 -22513508
6357 -22513508 -17509958 -15018895 -15055079 -15038366 -14253470 -14145962 -13666844 -8835286 728140
6348 728140 8746697 9301307 4280442 239138 -145300 294836 -1358917 -5041366 -9329207
6339 -9329207 -12402462 -11898158 -7714453 -4825443 -8994596 -18846145 -26220091 -25768620 -20323273
6330 -20323273 -15057902 -10881276 -7075647 -6427568 -12056297 -20540257 -23870273 -18991517
6322 -18991517 -10938452 -5156868 -1100234 3731986 7022782 3600394 -6721092 -17428972
6314 -17428972 -22273390 -21186913 -18361762 -17030802 -17817969 -20268759 -23627560 -26715267
6306b6715267k072718j429190q61903J366505N402699Q509150P911520L519290
6298d369914k789680q620991j1161719q608325l007200J096591K654149N427563
6290b9379526J0697106J2821877O999785j772784m176315L27708L185520k3443
6282a320072l726664k341553J018542N94827k635440l420737p11790J936057K383684
6273h223146J321066p68401l278639l429839M77725M524336L060155k835723n918507
6264a5070973k623818K579755M199265K290708l19498k733165m259648j940059
6256a7877433N069086J0774258P805764k261920r226293o568628Q81180M352488
6248g051498K435061N39049J341619J693666m77506k021513l45233J211205j485174
$$ plain form
6306 -26715267 -28787985 -30217175 -31079078 -29712573 -24309874 -15800724 -7889204 -4369914
6298 -4369914 -7159594 -15780585 -26942304 -35550629 -38557829 -37461238 -34807089 -29379526
6290 -29379526 -18682420 -5860543 1139242 -633542 -4809857 -4482149 -1296629 -1320072
6282 -1320072 -5046736 -7388289 -6369747 -5774920 -8410360 -11831097 -12542887 -10606830 -8223146
6273 -8223146 -6902080 -7670481 -10949120 -14378959 -13901234 -9376898 -6316743 -9152466 -15070973
6264 -15070973 -17694791 -15115036 -10915771 -8625063 -8944561 -11677726 -15937374 -17877433
6256 -17877433 -12808347 -2034089 5771675 3509755 -5716538 -12285166 -11403986 -7051498
6248 -7051498 -4616437 -4077388 -2735769 -1042103 -1519609 -3541122 -3886355 -2675150 -4160324
6239d160324n635458m603025K065497P404108O632624K742836M61447n43628k968825
6230A395252n987484o411296m012985j772584j342406j313221J3240K379938M349551
6221a2701995M953057M368891L341772J605532k462274q802258j2963098r863867
6213c2524240q90644O436969P269416M271257K191987J953584K448564L494109
6205e348998L749126M98029m565223m606971K182852P291658L607296k973111
6197a65342k685452J803937j73276q399236j0515135j716470O932044N260843
6189i658087j628878l271760L27269J775921m18478j096065J552149L509412K083955
6180f824562p26334k364290k612251j903174n1970K784044N526863O322263L165942
$$ plain form
6239 -4160324 -9795782 -14398807 -12333310 -4929202 1703422 4446258 4907705 4364077 1395252
6230 1395252 -4592232 -11003528 -15016513 -16789097 -18131503 -19444724 -19431484 -17051546 -12701995
6221 -12701995 -7748938 -3380047 -38275 1567257 -895017 -9697275 -22660373 -32524240
6213 -32524240 -33414884 -26977915 -19708499 -15437242 -13245255 -11291671 -8843107 -5348998
6205 -5348998 -1599872 -1101843 -5667066 -10274037 -8091185 -799527 2807769 -165342
6197 -165342 -2850794 -1046857 -1220133 -9619369 -20134504 -21850974 -14918930 -9658087
6189 -9658087 -11286965 -14558725 -14231456 -12455535 -12874013 -13970078 -12417929 -8908517 -6824562
6180 -6824562 -7550896 -9915186 -12527437 -14430611 -14482581 -11698537 -6171674 150589 3316531
6171C316531l313447p668082m527331L102918N724617l627o394131o263668k792363
6162a8818583j988272j714556L102995Q703620O376338l037045q647682m868882
6154b0892067J597795K919093N02585j54661R16519p60737o080971r799544n882780
6145c7634768N634487J6536638J6615730M937692o734620o543816K599737P084916
6137B495996J372953n420731m233076J106578J607944k799781m865725k246533
6129a2982375P1742j086569k715920j631840P94425K115562K828354M130206M423499
6120d052916J197765m534920q201650o522346j195619L099967M066580L946677
6112a2196462N538253P380770N434086m01893m646553l016485J582635K774909
$$ plain form
6171 3316531 3084 -7664998 -12192329 -9089411 -3364794 -3368421 -9762552 -16026220 -18818583
6162 -18818583 -20806855 -22521411 -19418416 -10714796 -4338458 -7375503 -16023185 -20892067
6154 -20892067 -19294272 -16375179 -15872594 -16027255 -15110736 -15871473 -21952444 -31751988 -37634768
6145 -37634768 -32000281 -15463643 1152087 6089779 -644841 -7188657 -4588920 2495996
6137 2495996 3868949 -1551782 -5784858 -4678280 -3070336 -5870117 -10735842 -12982375
6129 -12982375 -12910633 -13997202 -16713122 -18344962 -17550537 -15434975 -12606621 -8476415 -4052916
6120 -4052916 -2855151 -7390071 -15591721 -22114067 -23309686 -20209719 -16143139 -12196462
6112 -12196462 -6658209 722561 6156647 5754754 1108201 -1908284 -325649 2449260
6104B449260q60588m457003l991384j495609j580872m845892p174828n331535
6096b7288451j209658O47875j101649k985117j392574K773822N680386N736462
6088a9138904M906058N020858N309166M372290K450486M86872j283352k442841
6080c19367j728561J116483M110906N219591M604900L291560J159411j762547
6072A5692376l551718k689511j238682k666363o531466q271421m937652J284266
6064a2910171O083542P341553N545505K163629r44567k264309k263746k891107
6056a39671m331889m189040j422333J197736J110616L87885K505111N879513N182216
6047F180144m80040n274133m522003j036449n27984l527784n619974m079983m54765
$$ plain form
6104 2449260 1588672 -2868331 -6859715 -8355324 -9936196 -14782088 -21956916 -27288451
6096 -27288451 -28498109 -27850234 -28951883 -31937000 -33329574 -30555752 -24875366 -19138904
6088 -19138904 -14232846 -9211988 -3902822 469468 2919954 3406826 2123474 -319367
6080 -319367 -2047928 -931445 3179461 8399052 13003952 16295512 17454923 15692376
6072 15692376 12140658 9451147 8212465 5546102 -985364 -9256785 -14194437 -12910171
6064 -12910171 -6826629 514924 6060429 8224058 7279491 5015182 2751436 -139671
6056 -139671 -4471560 -8660600 -10082933 -8885197 -7774581 -7386696 -4881585 997928 6180144
6047 6180144 5700104 425971 -4096032 -5132481 -5660465 -9188249 -14808223 -18888206 -19342971
6038a9342971K823161M803280M978677L190349J148330J167065K530170J710467
6030C008528k641233p155973p591526l666361J036546K798185Q33888k087080
6022a5465026j919513K245924O226797N197175k34285m931894n815270m225672
6014a8921764j940497Q17784K654907J126178k504718l167526R26034N420305
6006a5589297O452255N183524K806826k794607j0536919j2599385m684896N091087
5998b6671412O220826J213820J158806P697579J0539106M190306l578964m151108
5990c381041j85259M76549l218538n889962m431291j150715R0789k090910m971093
5981b4751471l429858L752642R724716O885021j561318m477085J206452N738347
$$ plain form
6038 -19342971 -16519810 -11716530 -6737853 -3547504 -2399174 -1232109 1298061 3008528
6030 3008528 367295 -6788678 -14380204 -18046565 -17010019 -14211834 -13377946 -15465026
6022 -15465026 -17384539 -15138615 -8911818 -3714643 -3948928 -8880822 -14696092 -18921764
6014 -18921764 -20862261 -20044477 -17389570 -16263392 -18768110 -21935636 -21009602 -15589297
6006 -15589297 -9137042 -3953518 -1146692 -3941299 -14478218 -27077603 -31762499 -26671412
5998 -26671412 -20450586 -19236766 -18077960 -10380381 158725 4349031 770067 -3381041
5990 -3381041 -3566300 -3089751 -6308289 -12198251 -16629542 -17780257 -17689468 -19780378 -24751471
5981 -24751471 -28181329 -24428687 -14703971 -7818950 -9380268 -13857353 -12650901 -6912554
5973f912554J656047m964661m852690L23911K638529J205968J272152L358235
5965f275063L041189K22285o02858O64438q16030n223071o249865j444914L076738
5956a3607151K110454o55375R29489N515387O267161O86275o493719r777603q513552
5947b3538634n509672k813301m23071J913439L391433L184474J826375M72721
5939b1496236o11120j437934j042036Q11388J503490j128742l553120K22380Q817459
5930a7914471J2808085P186207j242531l711294j331695p53292k706146k828464
5922a0493601p90456O6048M88506L813905P407532M999318j770380l814897J208691
5913A114666M834104J745878j613773J599492O718960M802945l676844j0194079
$$ plain form
5973 -6912554 -5256507 -10221168 -15073858 -14749947 -12111418 -10905450 -9633298 -6275063
5965 -6275063 -3233874 -3011589 -3614447 -2950009 -3766039 -8989110 -15238975 -16683889 -13607151
5956 -13607151 -11496697 -12152072 -11222583 -5707196 559965 1246240 -5247479 -15025082 -23538634
5947 -23538634 -29048306 -31861607 -32284678 -30371239 -26979806 -23795332 -21968957 -21496236
5939 -21496236 -22107356 -23545290 -24587326 -23775938 -22272448 -23401190 -26954310 -26731930 -17914471
5930 -17914471 -5106386 2079821 837290 -2874004 -4205699 -4958991 -7665137 -10493601
5922 -10493601 -11284057 -11218009 -10729503 -6915598 491934 5491252 3720872 -94025 1114666
5913 1114666 5948770 7694648 6080875 7680367 14399327 19202272 15525428 5331349
5905E331349r784970m539586J653553N431902L471602l801633r503605p288105
5897a9029493J3725M254506L191914J804379L101358M329957L310624K411385
5889C388355L839110N592599M691392J077679l674635q360809j0974390q799954
5881a3220653k289837L468203L763560o06690m959525n918340l336593J162028
5873b1937847N267803O662592M848520J987062M59592J81064l12527j047598q03033
5864d694372M17908J190925Q52544r0345j624024l848438m636709r16769N903477
5855g445803Q790652K755288p847152j3339089r633251j785324L156821L096780
5847b2251078K39987k357156k002128K184413O984945P540219L942801J500202
$$ plain form
5905 5331349 -4453621 -8993207 -7339654 -1907752 1563850 -2237783 -11741388 -19029493
5897 -19029493 -19015768 -14761262 -11569348 -9764969 -6663611 -2333654 976970 3388355
5889 3388355 7227465 12820064 17511456 18589135 14914500 6553691 -4420699 -13220653
5881 -13220653 -15510490 -12042287 -8278727 -8885417 -13844942 -19763282 -23099875 -21937847
5873 -21937847 -16670044 -10007452 -5158932 -3171870 -2712278 -2531214 -2843741 -3891339 -4694372
5864 -4694372 -4276464 -3085539 -2232995 -2323340 -3947364 -7795802 -12432511 -13349280 -7445803
5855 -7445803 1344849 4100137 -3747015 -17086104 -26719355 -28504679 -25347858 -22251078
5847 -22251078 -22011091 -24368247 -26370375 -24185962 -17201017 -9660798 -5717997 -4217795
5839d217795K276514J587848l057589n254132J096140R978453R688094k14980
5831A1882553p677046n017922J749101L566036M38882k085697k529250l455418
5823c128761n221263n272186k368478K008761N413244N728628K645983r27786
5815a121858j680912q18799k096311m206937j300550O271080Q853638O73898r815311
5806e242062j0216893r44344O323808M847923p20920l916349m666428n820811
5798b0356076p207397o221523j542345N240704J0097288R319577M153295Q99969
5790e616508K916993M788759l95526r638541j2537753n368498L995246O962967
5782a4892861L975588N77135q44140j230777n18773K144538N264136N700990K455995
$$ plain form
5839 -4217795 -1941281 -353433 -3411022 -8665154 -7569014 2409439 12097533 11882553
5831 11882553 4205507 -812415 936686 4502722 4941604 2855907 326657 -3128761
5823 -3128761 -8350024 -13622210 -15990688 -13981927 -8568683 -2840055 -194072 -1121858
5815 -1121858 -2802770 -3621569 -5717880 -9924817 -11225367 -4954287 3899351 4573249 -5242062
5806 -5242062 -15458955 -16403299 -10079491 -5231568 -5952488 -9868837 -14535265 -20356076
5798 -20356076 -27563473 -33784996 -35327341 -30086637 -19989349 -10669772 -6516477 -5616508
5790 -5616508 -2699515 2089244 1693718 -7944823 -20482576 -25851074 -21855828 -14892861
5782 -14892861 -10917273 -10340138 -11184278 -12415055 -12933828 -10789290 -5525154 175836 2631831
5773B631831k075152m539514l641625j174057n5809p73797p68929J406084L206411
5764e784557J923854o05529r68575k47673k091169n369529m656276J062376N868596
5755a0868482N079233Q69683k502461m064440l999425j353902K348674K026862
5747a2464258l607310p635244l533002M712291P338003K183605l112742k476034
5739a8594691J164587J861779o81962j897632O00387M101280M616813J599019
5731g230420j693740j885768J002055L930777M372982K598718M23380r80053j299752
5722g61821l47699J607382L262667L076869O87848k619286m575788l489384j93855
5713c353067J933858M65411k753736l676331j414812Q51287P61070r3503R11453
$$ plain form
5773 2631831 556679 -3982835 -7624460 -8798517 -8854326 -9628123 -10397052 -8990968 -5784557
5764 -5784557 -3860703 -4466232 -5434807 -5682480 -7773649 -13143178 -17799454 -16737078 -10868482
5755 -10868482 -5789249 -4919566 -7422027 -11486467 -15485892 -16839794 -14491120 -12464258
5747 -12464258 -16071568 -23706812 -27239814 -22527523 -15189520 -13005915 -16118657 -18594691
5739 -18594691 -17430104 -15568325 -16250287 -18147919 -17547532 -13446252 -8829439 -7230420
5731 -7230420 -8924160 -10809928 -9807873 -5877096 -1504114 1094604 1517984 537931 -761821
5722 -761821 -1109520 497862 3760529 6837398 7525246 4905960 330172 -3159212 -3353067
5713 -3353067 -1419209 -953798 -3707534 -7383865 -8798677 -7947390 -7186320 -7279823 -6368370
5704f368370L692298O092045O344905L641846j704985p112233q635882m889899
5696h940275J057637M757519M088367k90574n633220p577316l327618L792807
5688a2072673O245181J317296m699348m515739O53142L517089Q10060l426165
5680a2171157m192617j263167K041070L104805K164402J487972K576869L841753
5672b410070K345358j632303m218462l426608j923738k126369k067855L32551
5664a5127496K211069k21984m937883o628506m427984j655292Q98546N167345
5656b4722185R540717R186377L959901l33990p79659j344887m832015o744351
5648a6070092k190646N320422P732263K932232l640614o640373n527375k286468
$$ plain form
5704 -6368370 -2676072 3415973 9760878 13402724 11697739 4585506 -4050376 -8940275
5696 -8940275 -7882638 -3125119 963248 672674 -4960546 -12537862 -15865480 -12072673
5688 -12072673 -5827492 -4510196 -9209544 -13725283 -13072141 -9555052 -8744992 -12171157
5680 -12171157 -16363774 -17626941 -15585871 -12481066 -10316664 -8828692 -6251823 -2410070
5672 -2410070 -64712 -1697015 -5915477 -9342085 -11265823 -13392192 -15460047 -15127496
5664 -15127496 -12916427 -13138411 -18076294 -24704800 -29132784 -30788076 -29889530 -24722185
5656 -24722185 -15181468 -5995091 -2035190 -2369180 -3148839 -4493726 -9325741 -16070092
5648 -16070092 -18260738 -12940316 -5208053 -2275821 -5916435 -12556808 -18084183 -20370651
5640b0370651J129680K599601P07908k881241m172845j088753M268557P940336
5632a1867408P579354L741055q42528l229117k795997j822371k419154l263970
5624a4920136j167776M014305Q143478P558553L501210J39035q09665j172334
5616E286670k056097j369983K343280N528818K739422n522811j1522855q788903
5608a3362459M95039Q785946J1525446R203419L492255l752672q255760n861987
5600B269227P95869L006300l285165j1000506j0313344j175604P139134P960872
5592d603217L841009Q16506P74669J816598K745361L647591L474085N16187m506106
5583H522683q246560q281907n244489j086018K767791M672050K582371l040223
$$ plain form
5640 -20370651 -19240971 -16641370 -15933462 -18814703 -22987548 -24076301 -19807744 -11867408
5632 -11867408 -4288054 -546999 -1389527 -4618644 -7414641 -9237012 -11656166 -14920136
5624 -14920136 -16087912 -12073607 -3930129 3628424 7129634 7268669 6459004 5286670
5616 5286670 3230573 1860590 4203870 9732688 12472110 6949299 -4573556 -13362459
5608 -13362459 -12867420 -4081474 7443972 16647391 20139646 16386974 8131214 2269227
5600 2269227 3065096 6071396 2786231 -8214275 -18527619 -19703223 -12564089 -4603217
5592 -4603217 -762208 54298 828967 2645565 5390926 9038517 12512602 13028789 8522683
5583 8522683 276123 -8005784 -13250273 -14336291 -11568500 -6896450 -4314079 -7354302
5575g354302p540642o228799o7205N323778O374252M608649K815683J618670J126006
5566F76090K431767M941355N112177J049174l848816n202351l648498k702284
5558a191386k360904L11748M709441N976335J971657l227403m664811k338789
5550h14112M4178j31881k250146l484165j406033K870262M680887J350401l294210
5541b434819l536829J1922J594555n63059k160073q33318J81636j044194q85033
5532i669212L118106O773824N453937J328139p98000r01756j513882j800325q6647
5523A904184P62551k668012p053260o139236p66763K043913j17721k152982j15710
5514a4303036L729148N931127O064845M277639J32756m308612n494589m240810
$$ plain form
5575 -7354302 -14894944 -21123743 -21190948 -15867170 -9492918 -4884269 -2068586 -449916 676090
5566 676090 3107857 8049212 13161389 14210563 10361747 5159396 1510898 -1191386
5558 -1191386 -3552290 -3240542 1468899 7445234 9416891 6189488 1524677 -814112
5550 -814112 -769934 -901815 -3151961 -6636126 -8042159 -5171897 -491010 859391 -2434819
5541 -2434819 -5971648 -5959726 -4365171 -4928230 -7088303 -7921621 -7739985 -8784179 -9669212
5532 -9669212 -6551106 222718 5676655 7004794 6206794 5305038 3791156 1990831 1904184
5523 1904184 2666735 -1277 -7054537 -13193773 -13960536 -11916623 -12034344 -14187326 -14303036
5514 -14303036 -10573888 -4642761 1422084 5699723 5832479 1523867 -3970722 -8211532
5506h211532n211531q609224q283045j153585P087524R628898P041484L919248
5498c791763J589305q73951k199033j068501p6600k071964m502898k944133J006897
5489a4932641J219752l551377p365701n690077j507689j4466n45898K209442R658220
5480b0520435J5636064J3196868L386161n768931r085785r119612r076417n709124
5472b7061211M488287J4825889J3367890k10995j1497782r274202R43904O892943
5464g525277O060560M478482M457441L017219Q4290q66845R4109n69143k648823
5455F582013k209419R31574K586913J459133K74661p11336m127499q450753q036206
5446a1700919k064003L501014M788974L811668J647989l840826j0339415r818172
$$ plain form
5506 -8211532 -13423063 -22032287 -30315332 -31468917 -24381393 -14752495 -7711011 -3791763
5498 -3791763 -2202458 -3076409 -5275442 -6343943 -6420543 -8492507 -12995405 -15939538 -14932641
5489 -14932641 -13712889 -17264266 -24629967 -30320044 -31827733 -31842199 -32388097 -30178655 -20520435
5480 -20520435 -4884371 8312497 11698658 5929727 -3156058 -12275670 -21352087 -27061211
5472 -27061211 -22572924 -7747035 5620855 5409860 -6087922 -15362124 -14418220 -7525277
5464 -7525277 -1464717 3013765 7471206 10488425 10572715 9705870 9799979 9230836 6582013
5455 6582013 4372594 5304168 7891081 9350214 9624875 8913539 4786040 -3664713 -11700919
5446 -11700919 -13764922 -10263908 -5474934 -1663266 -15277 -3856103 -14195518 -24013690
5438b4013690p9018R863131J1475512P010286K748138n28696l565052k657584
5430B53027L695044Q290105M728725j714259k531969l80534l578788r841727q797515
5421i877891o7636M649297k15426o132949m851186J94083K318420J958007K142937
5412i882344J465673j525546l191987p63468J838587M98753j621492L78102M404177
5403h399545M948313J996699k65386q23001j413442j320410O15026Q88340m357196
5394h130602j0900658j0008892j037371O642425O158142J386898l2221L233182
5386a2689097O594794O251396J961427m341065r323762r176539k942345N220780
5378a8444411R150425O459531M67712l544449l406751j320044m58396j095403
$$ plain form
5438 -24013690 -24092708 -14229577 -2754065 4256221 7004359 6475663 2910611 253027
5430 253027 3948071 12238176 16966901 15252642 12720673 12340139 8761351 -1080376 -9877891
5421 -9877891 -9945527 -5296230 -5511656 -11644605 -16495791 -16301708 -13983288 -12025281 -9882344
5412 -9882344 -8416671 -9942217 -13134204 -13897672 -12059085 -11560332 -13181824 -12803722 -8399545
5403 -8399545 -3451232 -1454533 -1719919 -2542920 -3956362 -5276772 -4661746 -3773406 -8130602
5394 -8130602 -19031260 -29040152 -30077523 -23435098 -17276956 -15890058 -15922279 -12689097
5386 -12689097 -6094303 157093 2118520 -2222545 -11546307 -20722846 -23665191 -18444411
5378 -18444411 -9293986 -2834455 -2366743 -5911192 -9317943 -10637987 -11096383 -12191786
5370a2191786r62315J005267L089928L367146J864659p40434m264038p224762
5362a6056335o341849n73694N855294P404602L553134j091964k233134O56421
5354h827525N124822P492346M938444j251011n294408k880675K786699M022233
5346F110925k016004r723298j1280602m457145N905057J2171080R759207R96816
5338G466036o436453o546418p63200M268490L903758o57864m482399l371727K282093
5329d337684O738234M364327k483956m790492P62002N417999J00321j0381125
5321d610374j2997765m602439M800246P256549N649977M459760J373379n739257
5313d409924j0830136o770668L291314R039947N932749p31581l772746j259946
$$ plain form
5370 -12191786 -13154101 -12148834 -9058906 -5691760 -3827101 -4567535 -8831573 -16056335
5362 -16056335 -22398184 -22971878 -17116584 -9711982 -6158848 -7250812 -9483946 -8827525
5354 -8827525 -3702703 3789643 8728087 7477076 2182668 -698007 2088692 6110925
5346 6110925 4094921 -5628377 -16908979 -21366124 -15461067 -3289987 6469220 7466036
5338 7466036 1029583 -5516835 -6280035 -2011545 1892213 1234349 -3248050 -6619777 -4337684
5329 -4337684 2400550 6764877 4280921 -509571 252431 5670430 5770751 -4610374
5321 -4610374 -17608139 -22210578 -17410332 -10153783 -4503806 -44046 1329333 -4409924
5313 -4409924 -15240060 -22010728 -18719414 -9679467 -3746718 -4478299 -8251045 -9510991
5305i510991L927118P555713O855269K627013j478813l166309l551913l842152
5297e85065k939755p02067j23020k629902m329101j455152L027949L455019J45234
5288f135860j676959m67353L79891l38352J05544J919036J383209j599202j294142
5279g724188M078138O399642j578267j3169402j3923053r39018J1708060R988309
5271e159779l125571j2320488q358779L319991J1330627J0504101M102838k030185
5263a737245m444441k881265P58302L607029L254629r18412o964706j0559424
5255a9885533p537770J418188R270007R012115J931456l969748m434448l135981
5247a7331714l438686j933528M683912J1164366R708010K098472k318001m90411
$$ plain form
5305 -9510991 -5583873 1971840 8827109 11454122 9975309 6809000 3257087 -585065
5297 -585065 -3524820 -4226887 -4349907 -6979809 -11308910 -12764062 -9736113 -6281094 -6135860
5288 -6135860 -7812819 -8280172 -7900281 -8238633 -8133089 -6214053 -4830844 -6430046 -7724188
5279 -7724188 -3646050 2753592 1175325 -11994077 -25917130 -26856148 -15148088 -5159779
5271 -5159779 -8285350 -20605838 -28964617 -25644626 -14313999 -3809898 292940 -1737245
5263 -1737245 -6181686 -9062951 -8304649 -4697620 -1442991 -2361403 -9326109 -19885533
5255 -19885533 -27423303 -26005115 -16735108 -7722993 -5791537 -9761285 -14195733 -17331714
5247 -17331714 -20770400 -22703928 -18020016 -6855650 2852360 4950832 2632831 2142420
5239B142420Q22764k870108o282843l178783L442455N580745J190899m166938
5231c319389m983558j292388K759591L388515N57265k316562k770983k542556
5223a0520065m078006n378951k712908K409508M566946K767417J250927J434144
5215a0260988K76560j835763J72451O300308Q904065M533805m0230M73090P72664
5206I295962m525460r394556n802678J546335J771132m491695o227480K48217
5198a7580223O525379O073617K373375N33619q6357j269490j237603J455078M398442
5189A185837M706516K275205j547676m844693m733982n46353L044363J026315
5181E65532m429998o644071l521430J694049O906236J1288870J0740792K187280
$$ plain form
5239 2142420 2965184 95076 -6187767 -9366550 -5924095 -343350 847549 -3319389
5231 -3319389 -8302947 -9595335 -6835744 -3447229 -2889964 -5206526 -7977509 -10520065
5223 -10520065 -14598071 -19977022 -22689930 -20280422 -15713476 -12946059 -11695132 -10260988
5215 -10260988 -9984428 -11820191 -11647740 -5347432 3556633 8090438 8050208 8523298 9295962
5206 9295962 4770502 -4624054 -10426732 -8880397 -7109265 -11600960 -17828440 -17580223
5198 -17580223 -11054844 -4981227 -2607852 -2074233 -2160590 -3430080 -4667683 -3212605 1185837
5189 1185837 5892353 8167558 6619882 1775189 -2958793 -3505146 -460783 565532
5181 565532 -3864466 -10508537 -14029967 -12335918 -5429682 5859188 16599980 18787260
5173A8787260p897802q916540j315032L147227j612771q286672q588454l946426
5165a8629210N94854M370336P570839P299251K900484r01844r71216P9272L83863
5156B696629K299626N305999L612497l743609q540348n382637o9737Q72102M33241
5147b516237K493891J764531o504330j3861451q868523M167886J0102728M926614
5139h294891k61566K168413O286946M349228j581500m565655k300378K532977
5131a666426O525907P254584M476607R19293j375492m600806j0473349j3945452
5123a2885134q645229K132426P811341M604883o46722k032494j577071j947996
5115a3185996o05734L922702O865245M167430l94225p53811K538644M145075J740917
$$ plain form
5173 18787260 10889458 1972918 657886 3805113 2192342 -6094330 -14682784 -18629210
5165 -18629210 -18034356 -13664020 -6093181 1206070 4106554 3204710 2233494 2312766 2696629
5156 2696629 4996255 10302254 13914751 10171142 1630794 -3751843 -3821580 -2949478 -2516237
5147 -2516237 -22346 1742185 -4762145 -18623596 -27492119 -23324233 -13221505 -8294891
5139 -8294891 -8556457 -6388044 -101098 4248130 2666630 -1899025 -4199403 -1666426
5131 -1666426 4859481 12114065 16590672 17509965 16134473 11533667 1060318 -12885134
5123 -12885134 -21530363 -19397937 -11586596 -6981713 -7628435 -9660929 -11238000 -13185996
5115 -13185996 -13791730 -9869028 -3003783 1163647 769422 15611 2554255 6699330 8440247
5106H440247k535527n795018n635517o97150N863030O680439j023970r601995
5098d305461r516992j881418L574947K116570j131006o82218J724701K115642
5090g985235J453477L189290O827124Q637575P186599L991152k45570n746746
5082A7307666j0433145j1157458q632457o512863m692232P65673Q524425R573471
5074e256920j41134j0099073o975033O425229J3794192P297885l026519n055779
5066c037152m27482J518002j569780m337363l534015q51708J982334M368730M261168
5057a627266J86437m791505n966917l085164P19395M422549Q371730R571118M244018
5048A2044395m600348q564671m827182m24480k549486q540754r508686k177894
$$ plain form
5106 8440247 5904720 109702 -5525815 -6222965 -359935 6320504 5296534 -4305461
5098 -4305461 -13822453 -15703871 -12128924 -10012354 -11143360 -11825578 -10100877 -7985235
5090 -7985235 -6531758 -3342468 3484656 12122231 19308830 23299982 23054412 17307666
5082 17307666 6874521 -4282937 -12915394 -19428257 -24120489 -23354816 -14830391 -5256920
5074 -5256920 -5398054 -15497127 -22472160 -16046931 -2252739 5045146 2018627 -3037152
5066 -3037152 -3464634 -1946632 -3516412 -7853775 -11387790 -12239498 -10257164 -5888434 -1627266
5057 -1627266 -1440829 -6232334 -12199251 -15284415 -14565020 -10142471 -1770741 7800377 12044395
5048 12044395 7444047 -1120624 -5947806 -6372286 -8921772 -17462526 -26971212 -29149106
5040b9149106O685981Q357038K547053k469442m45514M709360M463985k152823
5032g453468p111337m910196K99054K097214Q85504R56114K804402L818487L603027
5023e011199L390689K673999J205138J480541M300458N250762J335396k503513
5015A2122271m02384M159093L245670k669749n730229l624101k074266l828768
5007A197537m452864j306560J576926P29464j545945k271306k027762j463342
4999i563852N28593K660002J206475l298687n202621k244082J011873J125003
4991a3777296R31516L074657M448916J828381j971795k600769q86909k44014p30329
4982i927642m57622j81524j628456l005549q72119L954888O220545K712537l370176
$$ plain form
5040 -29149106 -22463125 -14106087 -11559034 -14028476 -14473990 -9764630 -5300645 -7453468
5032 -7453468 -14564805 -19475001 -19175947 -17078733 -16193229 -15237115 -12432713 -8614226 -5011199
5023 -5011199 -1620510 1053489 2258627 3739168 8039626 13290388 14625784 12122271
5015 12122271 11719887 15878980 19124650 16454901 10724672 7100571 5026305 1197537
5007 1197537 -3255327 -4561887 -2984961 -2255497 -3801442 -6072748 -8100510 -9563852
4999 -9563852 -9035259 -6375257 -5168782 -8467469 -13670090 -15914172 -14902299 -13777296
4991 -13777296 -12845780 -9771123 -5322207 -3493826 -5465621 -8066390 -8953299 -9197313 -9927642
4982 -9927642 -10385264 -10566788 -12195244 -15200793 -16072912 -12118024 -5897479 -3184942 -6555118
4973f555118n828032k671075J453469J328203j387349m03409M909812O933785
4965b219714J034495o065818n258017J733513N493187K537930j993805l492543
4957h230772j944988J757626N845221N562455q10680n739772j465509O646521
4949A620102O545340j820388o434378k295474K302866Q49575k688543l842286
4941e763186m275230m259107j66321O060557O496090P97686j780339J484745J878142
4932D73037l772466n583225J779532Q084594M444970j640708J57515N952544O804416
4923A6700209M826982O743993R563613N986637k168366p850452j0331483j2201889
4915A1269244j0927413l866199M000091O824694O490544O428679M451556k23683
$$ plain form
4973 -6555118 -12383150 -15054225 -13600756 -12272553 -13659902 -14063311 -9153499 -2219714
4965 -2219714 -1185219 -7251037 -12509054 -10775541 -5282354 -2744424 -4738229 -8230772
4957 -8230772 -10175760 -8418134 -2572913 2989542 2178862 -3560910 -5026419 1620102
4949 1620102 8165442 6345054 -89324 -2384798 -81932 767643 -1920900 -5763186
4941 -5763186 -10038416 -14297523 -14463844 -8403287 -1907197 -1109511 -2889850 -1405105 473037
4932 473037 -3299429 -8882654 -7103122 981472 5426442 3785734 3943249 9895793 16700209
4923 16700209 21527191 28271184 37834797 43821434 41653068 33802616 23471133 11269244
4915 11269244 341831 -3524368 475723 7300417 13790961 20219640 24671196 24447513
4907B4447513j813630J614852K475546k866353o278206k808561l93984m012101
4899A0365076m741641K836730P972972K919093j790845K479505M966842k793309
4891B2214423o952306M178147J4902462P794441m289774j477083O862621K752425
4883D5985356k796684Q119608J9363227P395050q585293L648923K5089897J5218461
4875A13438545n090701J8390155N7674164J2323545j27838449k23388561j58409869
4868c12901171k506614Q4179303N8161250J1548581J2726739L0498401K1631430
4861i6662081K326282J416762Q233834M024554k55094R220605J8668822J1909071
4853d1117245q02777l524077j192700m078259o347084j87388O397684M055520
$$ plain form
4907 24447513 22633883 24248735 26724281 23857928 17579722 14771161 14377177 10365076
4899 10365076 5623435 8460165 16433137 19352230 17561385 20040890 25007732 22214423
4891 22214423 15262117 19440264 34342726 42137167 37847393 36370310 43232931 45985356
4883 45985356 43188672 51308280 70671507 78066557 69481264 73130187 98220084 113438545
4875 113438545 108347844 126737999 184412163 196735708 68897259 -154491302 -312901171
4868 -312901171 -315407785 -231228482 -173067232 -161518651 -148791912 -118293511 -96662081
4861 -96662081 -94335799 -92919037 -84685203 -80660649 -80915743 -71695138 -53026316 -41117245
4853 -41117245 -41920022 -45444099 -46636799 -50715058 -57062142 -57249530 -50851846 -46796326
4845d6796326j059758n40343R29202k188131l184816L555738R486429N973622
4837c3824383o01051q08522K013242M54401k744205j315976K469224L185431J872548
4828b9299291J407989K94569j668709n80471K441353R8744o834414o769982L470953
4819c7439259J0463791N066594k339197L49630O940229N232099j681114k576799
4811a5984026J472290L74495o213371q894559m772427p3328K102313M623230P431712
4802a9933671O329130J112643l187630l411274q08934K195290L129310K56558
4794a4318578l715389l263521Q59618J021028m083781m682337M214130J1761301
4786a2207529O492212n494613r538173l402238L092893M546712L637472K015181
$$ plain form
4845 -46796326 -47856084 -48396427 -47467225 -49655356 -52840172 -49284434 -39798005 -33824383
4837 -33824383 -34425434 -35233956 -33220714 -32766313 -35510518 -36826494 -34357270 -31171839 -29299291
4828 -29299291 -27891302 -27596733 -29265442 -29845913 -27404560 -27305816 -34140230 -40910212 -37439259
4819 -37439259 -26975468 -21908874 -24248071 -23898441 -16958212 -11726113 -13407227 -15984026
4811 -15984026 -14511736 -14137241 -20350612 -29245171 -34017598 -34090926 -31988613 -27365383 -19933671
4802 -19933671 -13604541 -12491898 -15679528 -19090802 -19899736 -17704446 -14575136 -14318578
4794 -14318578 -18033967 -21297488 -20437870 -19416842 -23500623 -28182960 -23968830 -12207529
4786 -12207529 -5715317 -11209930 -20748103 -24150341 -21057448 -16510736 -12873264 -10858083
4778a0858083m03273j74545M106326M654488m807195j5069483j2165330P17532
4770c3999563P498590M221260K895110Q686617J0942329K851549n781005m448446
4762g133559J870901K564534k097722m592077l344357k390505k390064p73723
4754a8286572J841219K439758R55008m22446j200206j682464q15565J154571R82294
4745a5034403k529376m987658k441893J932008K176130j506359l309162l04078
4737b6004791M445467P141383P376426O302657M172935J255435r54131j153319
4729B582062o9062L05335p90721j912058j342913M59190J325925K66694j466338
4720f41886k569283l154620l155681j454322J704323L507671K019599r67456k827274
$$ plain form
4778 -10858083 -11261356 -11435901 -7329575 -2675087 -7482282 -22551765 -34717095 -33999563
4770 -33999563 -26500973 -22279713 -19384603 -10697986 244343 3095892 -2685113 -7133559
4762 -7133559 -5262658 -2698124 -4795846 -9387923 -12732280 -15122785 -17512849 -18286572
4754 -18286572 -16445353 -14005595 -13050587 -13473033 -14673239 -16355703 -17171268 -16016697 -15034403
4745 -15034403 -17563779 -22551437 -24993330 -23061322 -20885192 -22391551 -25700713 -26004791
4737 -26004791 -21559324 -14417941 -7041515 -738858 3434077 4689512 3735381 2582062
4729 2582062 2513000 2818335 2027614 115556 -1227357 -768167 557758 824452 -641886
4720 -641886 -3211169 -6365789 -9521470 -10975792 -9271469 -5763798 -3744199 -4711655 -7538929
4711g538929l816822n108867n257140k314200J963668L923087L201179K426386
4703a2521638K368217J108515k050800n069950n668519l144737J459441M960985
4695a8558486L708464j664959n494959m128380o41288J165052L210730P804842
4687a4598984J0095665M120035n910823r526173m683041O10075J808504L164011
4679a4920731P246746Q922537M468724j373607l068375k597422m424482p399704
4671a3146314p381553l989834J88760L767655N895498N006991J990522Q69359
4663f798916K782684L471428N35273j530006J606230O292776N860032L26376m516846
4654H029031n593166m869367m609459m882407m967048l860732n20090L968436
$$ plain form
4711 -7538929 -11355751 -16464618 -21721758 -24035958 -22072290 -18149203 -14948024 -12521638
4703 -12521638 -10153421 -9044906 -11095706 -16165656 -21834175 -24978912 -23519471 -18558486
4695 -18558486 -14850022 -16514981 -22009940 -26138320 -26779608 -25614556 -22403826 -14598984
4687 -14598984 -4503319 -383284 -6294107 -15820280 -20503321 -19893246 -18084742 -14920731
4679 -14920731 -7673985 1248552 5717276 4343669 1275294 -1322128 -5746610 -13146314
4671 -13146314 -20527867 -24517701 -24328941 -20561286 -14665788 -9658797 -7668275 -6798916
4663 -6798916 -4016232 -544804 -9531 -1539537 66693 6359469 12219501 12545877 8029031
4654 8029031 2435865 -2433502 -7042961 -11925368 -16892416 -20753148 -21273238 -17304802
4646a7304802O450956N969427M969861M290344J331238l850238n879094k012943
4638f035251K247233J088726k587225k464176Q65639K085387N01248n47367j439204
4629f284990n337014j0400525j0683575n008292J655994N710596P724632Q203411
4621a4419763O908329N809467O213824M081690m200776j2489912j0669240j57979
4613a8924360O502319L607629p49661M10478K058439j863117o116455k533975
4605a7608703N590421P806521J964238m140892n242313m027020l699029k729726
4597b2086503P50638M649353N705317L610151N44398j592900k517914l129739
4589a4067199l944438l833736j549247J435921K142195O72279J46509J088515
$$ plain form
4646 -17304802 -10853846 -4884419 85442 4375786 5707024 1856786 -4022308 -6035251
4638 -6035251 -3788018 -2699292 -5286517 -7750693 -6885054 -4799667 -4298419 -4845786 -6284990
4629 -6284990 -11622004 -22022529 -32706104 -37714396 -36058402 -30347806 -22623174 -14419763
4621 -14419763 -7511434 -1701967 4511857 8593547 4392771 -8097141 -18766381 -18924360
4613 -18924360 -12422041 -8814412 -9564073 -9153595 -7095156 -8958273 -15074728 -17608703
4605 -17608703 -12018282 -4211761 -2247523 -6388415 -11630728 -15657748 -19356777 -22086503
4597 -22086503 -21335865 -16686512 -10981195 -7371044 -6826646 -8419546 -10937460 -14067199
4589 -14067199 -18011637 -21845373 -23394620 -21958699 -19816504 -19144225 -18997716 -17909201
4581a7909201M63887j745937p32207M626966P491048L120763k386710j257924
4573h329315K669128j59240q200352r425464J96573R819443R113578J186222n022616
4564h152043p060473p176947n004940J54458M226483L330791J005720L143303
4556a5533648P773834P522689J564954k547852j65800M120854M007153Q925k900738
4547C850371k476258n10178Q87536J306790J170108O44086q31580l988334p547494
4538g494953p470838j406015O119006O975582m05355p815470p031347J20243N048589
4529a3360558L703877K15975l13540J733494K660910R83291j544086k957480k944858
4520a1822975j976381l50455J282681J516395m63493l233935m140950k570523
$$ plain form
4581 -17909201 -17445314 -19191251 -19923458 -15296492 -7805444 -4684681 -7071391 -8329315
4573 -8329315 -5660187 -5819427 -14019779 -23445243 -23248670 -13429227 -4315649 -3129427 -8152043
4564 -8152043 -15212516 -22389463 -27394403 -27239945 -23013462 -19682671 -18676951 -15533648
4556 -15533648 -7759814 -237125 1327829 -1220023 -1385823 2735031 6742184 6751109 3850371
4547 3850371 1374113 863935 1751471 3058261 4228369 4872455 4040875 52541 -7494953
4538 -7494953 -14965791 -16371806 -10252800 -3277218 -3682573 -11498043 -18529390 -18409147 -13360558
4529 -13360558 -9656681 -9440706 -9754246 -8020752 -5359842 -4376551 -5920637 -8878117 -11822975
4520 -11822975 -13799356 -14149811 -12867130 -11350735 -11814228 -15048163 -19189113 -21759636
4512b1759636r70763j404210k394792j344222R36244J329639o2102M73133L776967
4503b1419742N163620J293073l820579m062580k14588J434347j337018l850991
4495b6814458k053783J958423L958815L353312K274730J544234L40269j435998
4487a6874456k559263j656894J772954O405224R035544P506725L890852K110227
4479I630913K110169P4049m475565o381073k555870K139085J045765n067659r478247
4470a2958433q198927k759895L739990Q293388P255256m9848p329711p081755
4462a9089935r10159K188026r33706l178043Q95664O122461N388505J288730J343273
4453f885184N082766M715135j974821p919181p707092m726592l844377l374028
$$ plain form
4512 -21759636 -22730399 -24134609 -26529401 -27873623 -26937379 -25607740 -25669842 -25196709 -21419742
4503 -21419742 -16256122 -14963049 -18783628 -22846208 -23060796 -21626449 -22963467 -26814458
4495 -26814458 -28868241 -26909818 -22951003 -19597691 -17322961 -15778727 -15438458 -16874456
4487 -16874456 -19433719 -21090613 -19317659 -12912435 -3876891 3629834 7520686 9630913
4479 9630913 11741082 11815131 7339566 958493 -1597377 541708 1587473 -3480186 -12958433
4470 -12958433 -21157360 -23917255 -20177265 -11883877 -4628621 -4678469 -12008180 -19089935
4462 -19089935 -20000094 -17812068 -18745774 -21923817 -21028153 -14905692 -9517187 -8228457 -6885184
4453 -6885184 -1802418 2912717 937896 -6981285 -14688377 -19414969 -23259346 -26633374
4445b6633374K51168M393077L648854n79679j050111M200111Q204942N348906
4437b216106q0332m34145L730518M959689Q22249k363452L14001M602223L884548
4428A3219193p47060l208345k594367l518439o668546o673277j664752K074832
4420i780761m28183m413481k650915K796442L576421j767344n480746k401177
4412b0549744L032011M427968K297925J068976J506699J186345R6445M43903J386638
4403e102834j081188p523658j1887315p767669L252018J1929060J0640801J357320
4395f183465o459446n587271K195162Q906127Q435703J301272o775755r449336
4387a3617009m524997L555720P168995L816828n19768N86081M653829M077908
$$ plain form
4445 -26633374 -26382206 -21989129 -18340275 -18919954 -19970065 -15769954 -7565012 -2216106
4437 -2216106 -2296438 -2730583 999935 5959624 6781873 4418421 4732422 9334645 13219193
4428 13219193 12472133 9263788 6669421 3150982 -3517564 -10190841 -11855593 -9780761
4420 -9780761 -10208944 -14622425 -17273340 -14476898 -10900477 -12667821 -18148567 -20549744
4412 -20549744 -17517733 -13089765 -10791840 -9722864 -8216165 -7029820 -6933375 -6489472 -5102834
4403 -5102834 -6184022 -13707680 -25594995 -33362664 -30110646 -18181586 -7540785 -6183465
4395 -6183465 -12642911 -18230182 -16035020 -7128893 1306810 2608082 -4167673 -13617009
4387 -13617009 -18142006 -14586286 -7417291 -3600463 -4120231 -3534150 1119679 5197587
4379E197587j754853m999886j367326L521413L365691K91261n70139j22094k160450
4370A401204n082267m192894r0170K442052K469219K732625K633837q26829n449979
4361c963202n524054j827240j154618m035890k559846N532791J0250934L664997
4353C83872p128017r865925m152794N76309J86447p53717R94794L131515L879843
4344a2747673M402297M114984L27277n975289r579913p594838k073055L898894
4336b5227316P830951O545934j79372n192247j040591P922478R332787P56490
4328G49114n929725k478609L364012Q78172o791585q895144m419667j820153l960252
4319b9303837m535961P9704N183663O030831L853140J210028j566629k616307
$$ plain form
4379 5197587 3442734 -1557152 -2924478 596935 3962626 4253887 3683748 3561654 1401204
4370 1401204 -3681063 -7873957 -7964127 -5522075 -3052856 -320231 2313606 1486777 -3963202
4361 -3963202 -9487256 -11314496 -12469114 -16505004 -19064850 -13532059 -3281125 383872
4353 383872 -6744145 -16610070 -20762864 -20186555 -20000108 -20753825 -19759031 -16627516 -12747673
4344 -12747673 -8345376 -4230392 -3903115 -9878404 -19458317 -27053155 -29126210 -25227316
4336 -25227316 -17396365 -10850431 -11029803 -16222050 -17262641 -9340163 -7376 749114
4328 749114 -5180611 -7659220 -4295208 -3417036 -10208621 -19103765 -23523432 -25343585 -29303837
4319 -29303837 -33839798 -33760094 -28576431 -22545600 -18692460 -17482432 -19049061 -21665368
4311b1665368J762958R810999J2796153N699760n139235r947335p405295l607951
4303a7695314k179569j208382J154846L437209L770390K429088O71170n60349
4295a0180911n13548P55032J553056J07791l011438n376930n376408l351473p76412
4286b6171241N85194k34834j801438r39401L380764P920564Q560984M748050p48151
4277d699509m826846n312760j703729K878648L123071j683706m845801o51732
4269a7722364O628254P805508J709547l413809j808417L042636N246236L831382
4261E318973N65554l726741p068704n767136j91092L369717J108891k186658l57865
4252h935061M597495N832147J586720l877376p056483p414906m824965l33780
$$ plain form
4311 -21665368 -19902410 -10091411 2704742 8404502 3265267 -6682068 -14087363 -17695314
4303 -17695314 -19874883 -21083265 -19928419 -16491210 -12720820 -10291732 -9620562 -10180911
4295 -10180911 -10694459 -9939427 -8386371 -8278580 -11290018 -16666948 -22043356 -25394829 -26171241
4286 -26171241 -25586047 -25820881 -27622319 -28561720 -25180956 -17260392 -8699408 -3951358 -4699509
4277 -4699509 -9526355 -14839115 -16542844 -13664196 -10541125 -12224831 -17070632 -17722364
4269 -17722364 -11094110 -3288602 -1579055 -4992864 -6801281 -3758645 1487591 5318973
4261 5318973 5884527 2157786 -4910918 -10678054 -10869146 -7499429 -6390538 -8577196 -8935061
4252 -8935061 -4337566 1494581 3081301 -796075 -7852558 -15267464 -20092429 -20426209
4244b0426209K285354J132706K28122L248580O034128K683711l254998k852186
4236a0920792L617870O231795R96693m252679l025220K97717m62163k823680j112113
4227a1452572L577993N728731L563560p69232n268162p392449l741834M201566
4219a1552399Q355538L891544l170426m266682k89878J503523p11955k265806
4211h506541j006041K8126j203694k870184k838976o62239L471305P851189Q638044
4202B900989M137978j828683m375210l131294k18954L521168O169720L433131
4194A0608845m589179j0048236p359364j896639j359861l557612j627132L420728
4186a6408450N655724N489320O554813N197677l577878j2199513p825762O270164
$$ plain form
4244 -20426209 -18140855 -17008149 -16780027 -13531447 -7497319 -4813608 -8068606 -10920792
4236 -10920792 -7302922 -1071127 -74434 -4327113 -7352333 -7054616 -7516779 -10340459 -11452572
4227 -11452572 -7874579 -2145848 1417712 648480 -4619682 -12012131 -15753965 -11552399
4219 -11552399 -3196861 694683 -2475743 -6742425 -7032303 -5528780 -6240735 -8506541
4211 -8506541 -9512582 -9484456 -10688150 -13558334 -16397310 -17059549 -13588244 -5737055 2900989
4202 2900989 7038967 5210284 835074 -2296220 -2515174 1005994 7175714 10608845
4194 10608845 6019666 -4028570 -11387934 -13284573 -14644434 -18202046 -19829178 -16408450
4186 -16408450 -10752726 -5263406 1291407 6489084 2911206 -9288307 -17114069 -10843905
4178a0843905J2310633L779163n617400l637978M098294O222675J714637l803519
4170D222600p599005q502832m946490q5193j47809l525454j675042N548819P873474
4161h836932K386705q36290K863860L925994l373106r342503n612688J266807
4153a7558153L661031M969802O959059K622120n631006j528234J5076258J8934713
4145B7505590M106453R434710O0414598J07616673P6495610k5115224j03922201
4138A56536209r7316929m3241379j2373951j6437749j9576232o936784L240363
4131c6106452J266248r94897L081498N609949L418790L199982N561251L203485
4123a1760146l356635n004600l16797K429924N60027O8608K230885R72642m348368
$$ plain form
4178 -10843905 1466728 5245891 -371509 -4009487 88807 6311482 8026119 4222600
4170 4222600 -3376405 -11879237 -16825727 -16910920 -17058729 -20584183 -22259225 -16710406 -8836932
4161 -8836932 -6450227 -7286517 -4422657 -496663 -3869769 -13212272 -18824960 -17558153
4153 -17558153 -13897122 -8927320 -1968261 653859 -4977147 -6505381 8570877 27505590
4145 27505590 31612043 41046753 101461351 209078024 285573634 260458410 156536209
4138 156536209 59219280 15977901 3603950 -12833799 -32410031 -39346815 -36106452
4131 -36106452 -34840204 -35835101 -32753603 -27143654 -23724864 -20524882 -14963631 -11760146
4123 -11760146 -15116781 -20121381 -20438178 -18008254 -17448227 -17379619 -15148734 -14176092 -18524460
4114a8524460o470878l319972j646575m205622m407346J801102Q386983Q782979
4106a9603789N279751L605058M016332K888847o25324l638903l365874O3312L417698
4097g962892L059914p52623l797258l798392l226400l657104k142811K358836
4089a9918730M342175Q5485m331299j581034M313292L531558l800920p679752
4081b5039225l482227K731739M938951M012222K341090L3272j507462J39473K558674
4072a3273493K10663o001482q126471k619626M340474N789319K303848j125314
4064a8502082j170283K818950Q641919J0813065N772694j815803m096208j434226
4056A028026j262942n123086o050209r43556M159309M810838M574519N883569
$$ plain form
4114 -18524460 -24995338 -28315310 -29961885 -34167507 -38574853 -36773751 -28386768 -19603789
4106 -19603789 -14324038 -10718980 -6702648 -3813801 -4439125 -8078028 -11443902 -11380590 -7962892
4097 -7962892 -4902978 -5655601 -9452859 -13251251 -16477651 -20134755 -22277566 -19918730
4089 -19918730 -15576555 -15491070 -19822369 -21403403 -17090111 -13558553 -17359473 -25039225
4081 -25039225 -28521452 -25789713 -20850762 -16838540 -14497450 -14464178 -15971640 -15832167 -13273493
4072 -13273493 -13062830 -19064312 -27190783 -29810409 -25469935 -19680616 -17376768 -18502082
4064 -18502082 -19672365 -16853415 -8211496 2601569 8374263 6558460 2462252 1028026
4056 1028026 -234916 -5358002 -11408211 -12351767 -8192458 -3381620 1192899 7076468
4048G076468M101420k822044p853161n976882l500596o956386j0264031m361871
4040c0557083N968164Q028792J357618j774593L310195O427484R1503p477349
4032a4625269n068239L869336O274591j478449r297197q200074j205174L382077
4024b6348398L282921K024514J255152o72443l426621l851183j503881l3624r21504
4015c0195067o46013K680564M616007J245582l215510k029960L448756N979787
4007a8115854M061247L513789O794490Q457871L985427k994395n692943k136497
3999b126865M131385P579769L984583n180929j1200708o833187K780468N161868
3991a703616k041279p265304k152812O645564Q586173L738740j412040n278380
$$ plain form
4048 7076468 11177888 8355844 502683 -5474199 -8974795 -15931181 -26195212 -30557083
4040 -30557083 -24588919 -16560127 -15202509 -16977102 -13666907 -7239423 -7147920 -14625269
4032 -14625269 -19693508 -15824172 -9549581 -11028030 -20325227 -28525301 -29730475 -26348398
4024 -26348398 -23065477 -21040963 -19785811 -20458254 -23884875 -27736058 -29239939 -29273563 -30195067
4015 -30195067 -30841080 -28160516 -23544509 -22298927 -25514437 -27544397 -24095641 -18115854
4007 -18115854 -14054607 -10540818 -3746328 4711543 8696970 5702575 9632 -2126865
3999 -2126865 2004520 9584289 13568872 8387943 -2812765 -9645952 -6865484 -1703616
3991 -1703616 -3744895 -11010199 -13163011 -6517447 2068726 5807466 4395426 -882954
3983h82954r007915q827522j308615O920458N548817m209840j0629779p985698
3975c0383048k696657j391190j772636J022468O067266R233850R300906P281344
3967c337697L186770k589017o900948o364779j471743L848054O289962N723649
3959a615749M178360L013027J361077k016182n645935o272154l575603j133047
3951a1706206r87336n12751K471063M688781J679001n031669r303410p631235
3943b6333762j476224N697059R754834O754842k127850q144951l589491P385746
3935a2079797J2447814O110607m415914r279582o333266K15978O015934Q333405
3927A015179N686546n68649o165674p813314o003785l155015q95238J46536P8002
$$ plain form
3983 -882954 -9890869 -18718391 -20027006 -13106548 -7557731 -11767571 -22397350 -30383048
3975 -30383048 -33079705 -34470895 -36243531 -35221063 -29153797 -19919947 -10619041 -3337697
3967 -3337697 -150927 -2739944 -9640892 -16005671 -17477414 -13629360 -7339398 -1615749
3959 -1615749 2562611 5575638 6936715 4920533 -725402 -6997556 -10573159 -11706206
3951 -11706206 -12693542 -13206293 -10735230 -6046449 -4367448 -9399117 -18702527 -26333762
3943 -26333762 -27809986 -22112927 -12358093 -5603251 -7731101 -15876052 -19465543 -12079797
3935 -12079797 368017 6478624 2062710 -7216872 -13550138 -13334160 -7318226 1015179
3927 1015179 6701725 6133076 -32598 -7845912 -13849697 -17004712 -17899950 -17753414 -17675412
3918a7675412J51007J598157L545848L777394J700172j067562k721321k260630
3910a2952347N08602L884273M542365J371925k490330l955678l990486m220199
3902a7301875k755376J879132N657675L871165j210848l825118l544698l395844
3894b0625787j787953M260926R407688N078294m810126n874338N069946J2940241
3886C658891N897468p533030j2317227q147249n029496m824255r69196O315775
3878b2948319Q019190P35546p388306p834566j393763N561385Q489051O650996
3870a0108786K658537J056903L106590L450755k846777j0994822j1165352k726679
3862b7569631L931389J882378l447688l607964J199755N021321N758470N530457
$$ plain form
3918 -17675412 -17524405 -15926248 -12380400 -8603006 -6902834 -7970396 -10691717 -12952347
3910 -12952347 -12443745 -8559472 -4017107 -2645182 -5135512 -9091190 -13081676 -17301875
3902 -17301875 -20057251 -18178119 -12520444 -8649279 -9860127 -13685245 -17229943 -20625787
3894 -20625787 -22413740 -18152814 -8745126 -3666832 -8476958 -14351296 -9281350 3658891
3886 3658891 9556359 2023329 -10293898 -18441147 -23470643 -28294898 -29264094 -22948319
3878 -22948319 -14929129 -14193583 -21581889 -29416455 -30810218 -25248833 -16759782 -10108786
3870 -10108786 -7450249 -6393346 -3286756 163999 -2682778 -13677600 -24842952 -27569631
3862 -27569631 -23638242 -21755864 -25203552 -28811516 -27611761 -22590440 -16831970 -11301513
3854a1301513M179611q78299q189581j1070087n319012M496384R238949N445048
3846a3398500o66252p52862N269507R307291O059785O9098j231713J693709J870116
3837H220179l190249p909557p330507m094476l703764o372758p236011l090633
3829c4707776L900432Q693494P970985K835361k156845l167996m79220K911031
3821a4200534N084140N622453L404211k381998q804747j0642822o666413j275359
3813b9861069J559393K641180L972097M449632K267295j012590k322878j501987
3805a9808927o78208l45493Q65542K964959L899411K339255m90742j905830q737
3796a3168770M358958P328814N232957r13362n925050o355390l515257L30787
$$ plain form
3854 -11301513 -7121902 -8000201 -16189782 -27259869 -32578881 -28082497 -18843548 -13398500
3846 -13398500 -14064752 -14817614 -9548107 -240816 5818969 5888067 4656354 6350063 8220179
3837 8220179 5029930 -2879627 -10210134 -14304610 -18008374 -24381132 -31617143 -34707776
3829 -34707776 -30807344 -22113850 -14142865 -11307504 -13464349 -16632345 -17111565 -14200534
3821 -14200534 -9116394 -3493941 -89730 -2471728 -11276475 -21919297 -28585710 -29861069
3813 -29861069 -28301676 -25660496 -21688399 -17238767 -14971472 -15984062 -18306940 -19808927
3805 -19808927 -20487135 -20832628 -19967086 -17002127 -13102716 -10763461 -11254203 -13160033 -13168770
3796 -13168770 -8809812 -1480998 3751959 2838597 -3086453 -9441843 -12957100 -12626313
3788a2626313M939360Q811571P430169l83751p681031p126159j565301J16768
3780h084687l113578k998761L912552R381995N599109k787483n765824k444172
3772f300849l61568k625633m433038k914564k127875m896691o343601j019377
3764c1023196P576197J0741553O252301M83808j298622j238403l321004o087793
3756a7915159n105338m55091K974020K600962J303833K075300L224094J684867
3748i612512j518024k773435j439095L2373Q29719K099388K304434k149612r309145
3739b1535909j0340786p61921J1055149J3046756M908651k712693l600496k235191
3731a2176440l179352l126955J415122N868531M455788M00996Q00662M255208
$$ plain form
3788 -12626313 -7686953 1124618 8554787 8171036 490005 -6636154 -8201455 -8084687
3780 -8084687 -11198265 -14197026 -10284474 -902479 4696630 1909147 -3856677 -6300849
3772 -6300849 -6662417 -9288050 -13721088 -16635652 -18763527 -23660218 -30003819 -31023196
3764 -31023196 -23446999 -12705446 -6453145 -5969337 -7267959 -8506362 -11827366 -17915159
3756 -17915159 -23020497 -23475588 -20501568 -17900606 -16596773 -14521473 -11297379 -9612512
3748 -9612512 -11130536 -13903971 -15343066 -15310693 -14480974 -12381586 -10077152 -12226764 -21535909
3739 -21535909 -31876695 -32638616 -21583467 -8536711 -3628060 -6340753 -9941249 -12176440
3731 -12176440 -15355792 -18482747 -17067625 -11199094 -6743306 -6342310 -5541648 -1286440
3723a286440K987773l333453n714832M7300O332045N119055j026359m927798n395787
3714g198496n193614l714258K84500K306957k393837q477710n264594P204048
3706b2447004J5924349J1879931J416540l804466j551929K007762K883082J966940
3698H275205R423l652232q139070j1372966j2540546j1012767n184744L671532
3690c9946165R437723Q255950M744584M900837N818091Q67491o776071o649190
3682a9346750J742529N856700q78109p954625l845556N871936P354526n07783
3674a1707132o239777m274695o72653K02869K552557Q755911J2288273P357352
3666H262705j412458n567507m299738l088077m316327n361480m146200j298111
$$ plain form
3723 -1286440 1701333 -1632120 -7346952 -7299652 -967607 4151448 3125089 -1802709 -7198496
3714 -7198496 -12392110 -16106368 -15821868 -13514911 -15908748 -24386458 -29651052 -22447004
3706 -22447004 -6522655 5357276 6773816 2969350 1417421 3425183 6308265 8275205
3698 8275205 8284628 4632396 -3506674 -14879640 -27420186 -38432953 -43617697 -39946165
3690 -39946165 -30508442 -22252492 -17507908 -12607071 -6788980 -5921489 -12697560 -19346750
3682 -19346750 -17604221 -11747521 -12625630 -20580255 -24425811 -18553875 -11199349 -11707132
3674 -11707132 -17946909 -22221604 -22894257 -22691388 -20138831 -11382920 905353 8262705
3666 8262705 6850247 1282740 -3016998 -6105075 -10421402 -15782882 -19929082 -21227193
3658b1227193K207616N152035M674575r65028q302865j0932904o389331J495700
3650c4287395P006506P374707L879349M30762O30371M112851O221961L258818
3642a372070k586478n641591l468629J090415M073501M043076J640038j745334
3634c967072l954788k816238J559813O025669O909898L132341l213139q646888
3626d970404j0339918p226241n35487O049592P948963L776846j778628k051391
3618i126668L000392N580358N85716o236576o092879l13557J943476j722370l894802
3609a6276910o71285J647994k003973o028859l123789M234461Q979425J0281047
3601b961889J0826311Q486309L03925q840566j1441270q764026p368547o816219
$$ plain form
3658 -21227193 -19019577 -13867542 -9192967 -10157995 -18460860 -29393764 -35783095 -34287395
3650 -34287395 -27280889 -19906182 -16026833 -15596071 -14965700 -10852849 -4630888 -1372070
3642 -1372070 -3958548 -9600139 -13068768 -11978353 -7904852 -3861776 -2221738 -3967072
3634 -3967072 -7921860 -10738098 -9178285 -3152616 3757282 6889623 3676484 -4970404
3626 -4970404 -15310322 -22536563 -23072050 -17022458 -9073495 -5296649 -7075277 -9126668
3618 -9126668 -6126276 -545918 39798 -6196778 -12289657 -12603214 -10659738 -12382108 -16276910
3609 -16276910 -16948195 -15300201 -17304174 -23333033 -26456822 -22222361 -13242936 -2961889
3601 -2961889 7864422 16350731 16654656 7814090 -3627180 -12391206 -19759753 -26575972
3593b6575972j868069M668816L980218l027104n002724J615503O213342J326072
3585a8669918n270204l526050L461781O078843K986634k6691p34537j006932k91236
3576a6998310L081018O365407N426461J585850p41921j443830l791280p629461
3568a4146066r139199o593746j873840K589582M637238K261352l209907o005201
3560c1479787k269515M445671P863700O669389L730662Q16082j447909j494210
3552a3165917N50615J264437m41482j26241M309238O403697K34287q465172r320415
3543a8756953k619971K301903K401606L635138P717707P552195m57350r172412
3535g398137j1014489p879548n264419l059038J395725N890667N851574J785262
$$ plain form
3593 -26575972 -28444041 -23775225 -19795007 -22822111 -27824835 -26209332 -19995990 -18669918
3585 -18669918 -23940122 -27466172 -24004391 -17925548 -14938914 -14965605 -15700142 -16707074 -16998310
3576 -16998310 -13917292 -7551885 -2125424 -539574 -1281495 -2725325 -6516605 -14146066
3568 -14146066 -23285265 -29879011 -31752851 -29163269 -24526031 -22264679 -25474586 -31479787
3560 -31479787 -33749302 -29303631 -21439931 -14770542 -11039880 -10223798 -11671707 -13165917
3552 -13165917 -12615302 -11350865 -11792347 -11918588 -7609350 -1205653 -971366 -9436538 -18756953
3543 -18756953 -21376924 -19075021 -16673415 -13038277 -5320570 2231625 1774275 -7398137
3535 -7398137 -18412626 -26292174 -31556593 -34615631 -33219906 -27329239 -21477665 -19692403
3527a9692403j628584k673298l822284o017311o051613j157021O065810R298384
3519b5678320N162604k779447p812662p465737m993967l286394r30181L536940
3511d4247164P205927O452742K343673j509727l878024m661727k012428M031851
3503c6274877Q139170O125274K071217K144786M163141J717709l440725l250303
3495a8604608K640595N381980J309895k465008k70843L820079M348171K549438
3487a290301J137424j037130l785846k636324L005344N826092J219063m491390
3479b053068l386299K103092L856352P8247m437143o297108n259578j457696L153483
3470a3699718M112138P37861j024273K340428N064360J161796m705118l844872
$$ plain form
3527 -19692403 -21320987 -23994285 -27816569 -33833880 -39885493 -41042514 -34976704 -25678320
3519 -25678320 -20515716 -23295163 -31107825 -38573562 -43567529 -46853923 -47784104 -44247164
3511 -44247164 -37041237 -30588495 -28244822 -29754549 -33632573 -38294300 -40306728 -36274877
3503 -36274877 -28135707 -22010433 -19939216 -17794430 -13631289 -11913580 -15354305 -18604608
3495 -18604608 -15964013 -10582033 -9272138 -11737146 -12007989 -8187910 -3839739 -1290301
3487 -1290301 -152877 -1190007 -4975853 -7612177 -4606833 1219259 2438322 -2053068
3479 -2053068 -5439367 -3336275 520077 598324 -3838819 -10135927 -15395505 -16853201 -13699718
3470 -13699718 -9587580 -8849719 -9873992 -7533564 -2469204 -1307408 -6012526 -9857398
3462i857398K756088O319392L455919j239190m072146n219529l975025N53249
3454a1278640M515540L065069j379334k370986j40487m85665l429990k788012
3446a4292505J889151L216243j181606l638399Q19498N522493K546655m841459
3438i959929p562710l779695P85084K521963K923626L406516L381339L201381
3430e082425L842456L404600j328529q682349j1588833n840056L619713P714183
3422a3941240L793364j818442k470832O61461J708942q20371k692314j456665
3414a7036097J51865K80900J999503P305757J1699629J0113956M837413J516464
3406B0869390J8418l749523q652371q961003m339248j267573k683096l594544
$$ plain form
3462 -9857398 -7101310 -781918 2674001 1434811 -2637335 -7856864 -11831889 -11278640
3454 -11278640 -6763100 -3698031 -5077365 -7448351 -7588838 -8074503 -11504493 -14292505
3446 -14292505 -12403354 -9187111 -10368717 -14007116 -13187618 -7665125 -5118470 -9959929
3438 -9959929 -17522639 -21302334 -20517250 -17995287 -15071661 -11665145 -8283806 -5082425
3430 -5082425 -1239969 2164631 836102 -7846247 -19435080 -25275136 -21655423 -13941240
3422 -13941240 -10147876 -11966318 -14437150 -13775689 -12066747 -12887118 -15579432 -17036097
3414 -17036097 -16884232 -16603332 -14603829 -7298072 4401557 14515513 19352926 20869390
3406 20869390 20887808 17138285 8485914 -475089 -4814337 -6081910 -8765006 -12359550
3398a2359550k23655L150550J274797l027928k526226L947094R410884O890317
3390F536283k774001j1233490j0339589o55430Q204773P853855O74133m270287
3382f003753l423122j443695k014379k764843j390970l37191j648261k470507
3374b1496721o5029L005045L191595J697746J252451O59479k144385m400075j875740
3365b0175634L534729N487981K263680j336550j895608j930362m313218o392759
3357b4757741l472841L685616Q634366O866256J013468l081773l682670l734047
3349a8529366m567752l161660J979949N795936K274188o304940j0946465p048570
3341d0508680Q89253O618353R108093R871050Q132382K800640l412206n947877
$$ plain form
3398 -12359550 -12583205 -9432655 -8157858 -11185786 -13712012 -9764918 -354034 6536283
3390 6536283 3762282 -7471208 -17810797 -18466227 -10261454 -2407599 -1733466 -6003753
3382 -6003753 -9426875 -10870570 -12884949 -15649792 -17040762 -17377953 -19026214 -21496721
3374 -21496721 -21561750 -18556705 -15365110 -13667364 -12414913 -11755434 -13899819 -18299894 -20175634
3365 -20175634 -16640905 -11152924 -8889244 -10225794 -12121402 -14051764 -18364982 -24757741
3357 -24757741 -28230582 -24544966 -15910600 -9044344 -8030876 -11112649 -14795319 -18529366
3349 -18529366 -23097118 -26258778 -24278829 -18482893 -16208705 -22513645 -33460110 -40508680
3341 -40508680 -39619427 -33001074 -23892981 -14021931 -5889549 -3088909 -6501115 -12448992
3333a2448992l792028m73454q1817l344687o767981n516448J094034P281899O801782
3324a7247692J000555k939768j825137M42150M58334Q7576J105776R87820j876215
3315a9806601l822260j619491J712038J974886Q97189K443462N183529M629096
3307h408152J077234j169360j085916j233549j534562Q68228N111887N944039
3299d30151J209486m536539n710506j797403L275668N148206K117268l071888
3291c795859m775269o21507M725979N307945J952919J55337J209295J399536j10805
3282E447571N16861L878622M285800j592157q336689q778466l707103K40634j67589
3273h212516k454842l826522m013063k934360K19488M606174P374517O839528
$$ plain form
3333 -12448992 -16241020 -16714474 -16796291 -20140978 -26908959 -32425407 -31331373 -24049474 -17247692
3324 -17247692 -16247137 -19186905 -21012042 -20569892 -20111558 -20023982 -18918206 -17930386 -19806601
3315 -19806601 -23628861 -25248352 -23536314 -21561428 -20664239 -18220777 -13037248 -8408152
3307 -8408152 -7330918 -8500278 -9586194 -10819743 -12354305 -11486077 -6374190 -430151
3299 -430151 779335 -3757204 -9467710 -11265113 -7989445 -2841239 -723971 -3795859
3291 -3795859 -8571128 -9192635 -4466656 841289 2794208 2949545 4158840 5558376 5447571
3282 5447571 5964432 9843054 14128854 12536697 4200008 -4578458 -8285561 -8044927 -8212516
3273 -8212516 -10667358 -14493880 -18506943 -21441303 -21221815 -16615641 -9241124 -2401596
3265b401596M088267P30122l011982o967928r511916r032841o143413k911466
3257c5162753j80067K778278N696914O224978K886359j863393l555586p05473
3249b3880743L786200O361521O059113L657911o1819l800766n417574m093628
3241a7389785j731909n92072n49812j54756P92798J391861J264045L48994j706962
3232a8327598m032137l703361R27195O617940P675615K479114m248376o264850
3224a8876458j901425M760432P945167N394763r529l847232m773492m302308k964324
3215a8574406J58190L765904M186414P80274k109098j258608P95466M94824p74143
3206a2535183J76177J961330O48783l296430n330911l627612p58105J324737L245809
$$ plain form
3265 -2401596 1686671 2416793 -595189 -7563117 -17075033 -26107874 -32251287 -35162753
3257 -35162753 -35342820 -32564542 -26867628 -20642650 -17756291 -19619684 -23175270 -23880743
3249 -23880743 -20094543 -13733022 -7673909 -4015998 -4077817 -7878583 -13296157 -17389785
3241 -17389785 -19121694 -19713766 -20263578 -20418334 -19625536 -18233675 -16969630 -16620636 -18327598
3232 -18327598 -22359735 -26063096 -25135901 -18517961 -10842346 -8363232 -12611608 -18876458
3224 -18876458 -20777883 -16017451 -8072284 -2677521 -2687050 -6534282 -11307774 -15610082 -18574406
3215 -18574406 -18416216 -14650312 -10463898 -9683624 -11792722 -13051330 -12255864 -11761040 -12535183
3206 -12535183 -12359006 -10397676 -9748893 -13045323 -18376234 -22003846 -22761951 -21437214 -18191405
3197a8191405M566038K677256k991683q720214j0053001o041750L08321M397539
3189c4048899L602793J96915o98698K193160M310679K507125L54741J555383K126871
3180a7899930l594472j1517954j1110903m85858J0045898J1542487O426901K187701
3172a4406130J559415K659485L798817M203947L236867J528933K97720j124829
3164A754225l445110l598457J508061P492139O079866k438892q292257o319942
3156g260367k519615k579977k868412Q92785M177416J208062m212890m372308
3148a7535306J78948K774024J612438J05182j093454l736942n360016j626867
3140b4681993N218073Q170199N676543K640151J340714q44662l984230l870481
$$ plain form
3197 -18191405 -13625367 -10948111 -13939794 -22660008 -32713009 -38754759 -38446438 -34048899
3189 -34048899 -30446106 -30249191 -30947889 -28754729 -24444050 -21936925 -21582184 -20026801 -17899930
3180 -17899930 -21494402 -33012356 -44123259 -44609117 -34563219 -23020732 -16593831 -14406130
3172 -14406130 -12846715 -10187230 -6388413 -2184466 1052401 2581334 2879054 1754225
3164 1754225 -1690885 -5289342 -3781281 3710858 9790724 7351832 -940425 -7260367
3156 -7260367 -9779982 -12359959 -15228371 -14335586 -10158170 -8950108 -13162998 -17535306
3148 -17535306 -17356358 -14582334 -12969896 -12864714 -13958168 -17695110 -23055126 -24681993
3140 -24681993 -19463920 -11293721 -5617178 -2977027 -1636313 -2480975 -6465205 -10335686
3132a0335686J29291K638176O33776j788272k82620L146281L798023O97951l387669
3123d750749n193047k499560L984885Q877334O392110j800494p129050m639259
3115f757830J161169L317462R71312k228800m216883m923235l556118P4665L061094
3106a3097164K146557j620337l934270k561516N97694K322035J199792j447330
3098a6394539k371091R44829O978144J0488607P713641N88266n399933o684645
3090d136721l769655R16043N305821P891526P315819L022129l369919p913833
3082E261210p157195k148856J741874P88418k546565l418513j615089j057799
3074a0152515k759372k995624K20774L371164K822144L31666k53340R89947J186040
$$ plain form
3132 -10335686 -10206395 -7568219 -6934443 -8722715 -9005335 -5859054 -2061031 -1363080 -4750749
3123 -4750749 -9943796 -12443356 -8458471 418863 6810973 5010479 -2118571 -6757830
3115 -6757830 -5596661 -2279199 -1307887 -3536687 -7753570 -12676805 -16232923 -16158258 -13097164
3106 -13097164 -10950607 -12570944 -16505214 -19066730 -18469036 -16147001 -14947209 -16394539
3098 -16394539 -18765630 -17820801 -10842657 -354050 7359591 7947857 2547924 -4136721
3090 -4136721 -7906376 -6990333 -1684512 6207014 13522833 16544962 13175043 5261210
3082 5261210 -1895985 -4044841 -2302967 -1514549 -4061114 -7479627 -9094716 -10152515
3074 -10152515 -12911887 -15907511 -15686737 -12315573 -9493429 -9161763 -9415103 -8425156 -7239116
3065g239116k20667j619468l198255o163172q281262n243625K054731O227349
3057b3683485K647405l343727l057320L269712O378744J177178n495446m309652
3049b6416591L138308O577662J791885l887174k948535J814625L051172N04043
3041a6374605K10287L933328O393673L728633j146509l617535l232103k012420
3033a2117251n19322J577106L382670L674008K454733L18156k060599l155409
3025f445908j689417Q19603J370402m0561o25449k44000k179936o573297p946670
3016b3555233k779585M596073P853035O794004N004816L017399k96817k363008
3008a729316l0202L331749J526490l694077l846055K449117N589230m14391p458580
$$ plain form
3065 -7239116 -7459783 -9079251 -12277506 -18440678 -26721940 -31965565 -29910834 -23683485
3057 -23683485 -21036080 -24379807 -27437127 -24167415 -17788671 -16611493 -22106939 -26416591
3049 -26416591 -23278283 -16700621 -14908736 -18795910 -21744445 -19929820 -16878648 -16374605
3041 -16374605 -16164318 -12230990 -5837317 -2108684 -3255193 -6872728 -10104831 -12117251
3033 -12117251 -12636573 -11059467 -7676797 -4002789 -1548056 -1229900 -3290499 -6445908
3025 -6445908 -8135325 -7315722 -5945320 -5985881 -6611330 -6855330 -9035266 -15608563 -23555233
3016 -23555233 -26334818 -21738745 -13885710 -7091706 -2086890 930509 633692 -1729316
3008 -1729316 -1759518 1572231 3098721 -595356 -4441411 -1992294 3596936 3182545 -4276035
2999d276035n045668L364176N604023j76157l032962K536985O928609M56018j0206213
2990c847224j0565660M41184Q804681N774467p13808J67042N483947M234207m861608
2981D917228j1153202p482949Q97963N384542M915390L468005J968097j402758
2973A512316n295815n361291m76612N031999O230433K447762l041492o501375
2965e454075o594187m863812l572663k932645j399424J167204K650625J980976
2957a9018001J057458J599239K147731O15891j752489j733952J303270M440077
2949a1340776M339565o9060o672921j0359816o355816L844518J1756967J0510344
2941d346995K923679k317244j161146K966815N492010N019391J652591l835136
$$ plain form
2999 -4276035 -9321703 -5957527 -353504 -529661 -3562623 -1025638 5902971 6358989 -3847224
2990 -3847224 -14412884 -13971700 -5167019 607448 -106360 60682 5544629 9778836 4917228
2981 4917228 -6235974 -13718923 -12820960 -7436418 -2521028 946977 2915074 1512316
2973 1512316 -3783499 -9144790 -9621402 -4589403 1641030 4088792 1047300 -5454075
2965 -5454075 -12048262 -16912074 -20484737 -23417382 -24816806 -23649602 -20998977 -19018001
2957 -19018001 -17960543 -16361304 -14213573 -13597682 -15350171 -17084123 -15780853 -11340776
2949 -11340776 -7001211 -7070271 -13743192 -24103008 -30458824 -26614306 -14857339 -4346995
2941 -4346995 -1423316 -3740560 -4901706 -1934891 3557119 8576510 10229101 6393965
2933F393965q211653p788155l697004j193674k385645l791246k611720q39985
2925b4125117p95151j073470j38765Q5866j978425l598276j801142J291788J615185
2916c0517507l91819q49426J565299M854444P604213R417284Q543875L610673
2908C837036k661503n646005m604701k596853j226393K75479J285611J17870j668737
2899a2888196m57769L150798M589322L106526L425355P196745Q839084M010657
2891B0972522k926360n120565k979531j974386l490933l980318j904697K25924
2883a178344N34404l56846k107204m858595o588963m607792p4549K988261L475945
2874a2773683L845549M629329K997998j863041o252999o773434m168121p55820
$$ plain form
2933 6393965 -1817688 -9605843 -13302847 -14496521 -16882166 -20673412 -23285132 -24125117
2925 -24125117 -24920268 -25993738 -26132503 -26046637 -28025062 -31623338 -33424480 -32132692 -30517507
2916 -30517507 -30909326 -31758752 -30193453 -25339009 -17734796 -8317512 226363 3837036
2908 3837036 1175533 -4470472 -9075173 -11672026 -12898419 -12622940 -11337329 -11219459 -12888196
2899 -12888196 -13345965 -10195167 -5605845 -2499319 926036 8122781 16961865 20972522
2891 20972522 18046162 12925597 9946066 7971680 4480747 500429 -1404268 -1178344
2883 -1178344 -643940 -1000786 -3107990 -7966585 -14555548 -19163340 -19237889 -16249628 -12773683
2874 -12773683 -8928134 -4298805 -1300807 -3163848 -9416847 -16190281 -20358402 -21114222
2866b1114222K435216M322197L282005J64517j511557m44306O22786j49074o79993
2857a3072431O89044J781831O01096r21423o06210J12374l03403J28431K635498
2848h955193L535950k16417m447252k913071L115752O787841N604304K809620
2840E321534R1522l657001o402611l794865K452345M465107o29816n971896m899247
2831a3024928J35358K595312R15170j803847l291592l138939j264337J217394
2823a7660409K138977J668103K404190M211436L199960j764815o331469p309680
2815a9443707o792622o351972l391760K000591L385355k055242o141368q86799
2807c9677524Q116908R603972M097705J851787N077247N025821j806275p062965
$$ plain form
2866 -21114222 -18679006 -14356809 -11074804 -10910287 -12421844 -12866150 -12243364 -12392438 -13072431
2857 -13072431 -12383387 -10601556 -10000460 -10921883 -11528093 -11415719 -11719122 -11590691 -8955193
2848 -8955193 -5419243 -5635660 -10082912 -12995983 -9880231 -3092390 2511914 5321534
2840 5321534 5413056 1756055 -4646556 -8441421 -5989076 -1523969 -2153785 -8125681 -13024928
2831 -13024928 -12889570 -10294258 -9379088 -11182935 -14474527 -17613466 -18877803 -17660409
2823 -17660409 -15521432 -13853329 -11449139 -7237703 -4037743 -5802558 -12134027 -19443707
2815 -19443707 -26236329 -32588301 -35980061 -33979470 -30594115 -32649357 -38790725 -39677524
2807 -39677524 -31560616 -21956644 -17858939 -16007152 -10929905 -5904084 -7710359 -14773324
2799a4773324m460351M26980L88073k274317j818542P91271J249746N9079J22467
2790b0288918M35725r67423j419254K166439O499817O287717L062783K597133
2782a625981N156967N619156K602190J21277k52528j644923m700383n028537q61461
2773f14223K578298N29323l829455m071242K2135K501577j90989m779569n678102
2764a3532247j220860N395843R567915Q719287L446246l345778q205542q856525
2756h031661n289212L38242N252788P856932P839111N046906l07562o166760r303425
2747b764641q613488o258546m434161k739590j97392K119310K684919K130663
2739a8072926J785288R84605j426640l977518l893410j007521K175101L732456
$$ plain form
2799 -14773324 -19233675 -18806695 -18418622 -20692939 -22511481 -21720210 -20470464 -20411385 -20288918
2790 -20288918 -19853193 -20820616 -22239870 -20073431 -13573614 -7285897 -4223114 -1625981
2782 -1625981 3530986 9150142 11752332 11873609 11621081 9976158 5275775 247238 -614223
2773 -614223 1964075 2493398 -1336057 -5407299 -5385164 -2883587 -3074576 -7854145 -13532247
2764 -13532247 -14753107 -9357264 210651 8929938 12376184 9030406 824864 -8031661
2756 -8031661 -13320873 -12982631 -7729843 127089 7966200 13013106 12705544 6538784 -2764641
2747 -2764641 -11378129 -17636675 -22070836 -24810426 -25007818 -22888508 -20203589 -18072926
2739 -18072926 -16287638 -15303033 -16729673 -20707191 -24600601 -25608122 -23433021 -19700565
2731a9700565L435058J722346m8916M5964J191387o61237o121833q266326j278819
2722b9682941Q962189J0825331L212178k855701p47192K881311J57780n452242
2714a2699287n626429j10128M617516N563529M509650J902767k933172o889284
2706a1664838n427258M12722N012510N548857L162735j728908q945877j4220767
2698b7850824j2299814m789166J339393L428901M838253O562096M785129j059983
2690b5046015n116757l528985J07257J504307K229772N203109Q602168Q860648
2682g184496N797458Q97934n225472r788298p375993K130726R671462P357836
2674c718843o89786m387071j672086R41364J29706j02226L154363O352817N236506
$$ plain form
2731 -19700565 -16265507 -14543161 -14592077 -14546113 -13354726 -14015963 -20137796 -28404122 -29682941
2722 -29682941 -20720752 -9895421 -6683243 -9538944 -10286136 -7404825 -7247045 -12699287
2714 -12699287 -18325716 -18435844 -13818328 -8254799 -3745149 -1842382 -4775554 -11664838
2706 -11664838 -17092096 -16679374 -11666864 -6118007 -2955272 -4684180 -13630057 -27850824
2698 -27850824 -40150638 -44939804 -43600411 -40171510 -35333257 -28771161 -23986032 -25046015
2690 -25046015 -30162772 -33691757 -33584500 -32080193 -29850421 -24647312 -16045144 -7184496
2682 -7184496 -1387038 -489104 -5714576 -15502874 -22878867 -20748141 -11076679 -3718843
2674 -3718843 -4408629 -8795700 -10467786 -9526422 -9396716 -9498942 -6344579 8238 5244744
2665E244744R75486k264165k664282j542654j065544k484244m925365n626117
2657a4352141l191830o1596Q41175J088037M636535J0609977J2409391O026609
2649A8006157l630929p561840l037586L156064K853362l156268n657738N64732
2641A535954Q194418O429055l202945q009980k370604M411815L095715j911538
2633H171890j955137Q96219q14646n299878m898125j030032k314569q361272r229002
2624b4834552k818204Q05878l551074p777742m927138j32736M80122R15016O126825
2615c5713605J0890451Q262690K278696J647947N684902O497596J726411l830985
2607b555897o461867n617706r97210N004470N793634n84377n325840m22023P855744
$$ plain form
2665 5244744 6220230 3956065 1291783 -250871 -1316415 -3800659 -8726024 -14352141
2657 -14352141 -17543971 -17605567 -16764392 -15676355 -11039820 -429843 11979548 18006157
2649 18006157 14375228 6813388 3775802 6931866 9785228 6628960 971222 1535954
2641 1535954 9730372 16159427 12956482 4946502 2575898 6987713 10083428 8171890
2633 8171890 6216753 7112972 6298326 998448 -3899677 -4929709 -7244278 -15605550 -24834552
2624 -24834552 -27652756 -26846878 -30397952 -38175694 -43102832 -43235568 -42755446 -41840430 -35713605
2615 -35713605 -24823154 -16560464 -14281768 -12633821 -6948919 -451323 1275088 -2555897
2607 -2555897 -9017764 -14635470 -15632680 -10628210 -4834576 -5418953 -10744793 -11166816 -3311072
2598c311072P297510j658632p230753m757582j778249l780194o291703m099931
2590b5610606J122741N625094P983511O224486j331618r666964r756738j198436
2582b6608530N448174K790873m099432o652952m059058n74822K249590M888922
2574b6617235N826627L546300l60651l630625n752300n632101j291026N336834
2566b8574177Q245249N480592K651392M445484P353840N525471m8499l296929
2558A782423j445374K751438N323249M301017L67085l318855l872862k508556
2550C379565k664013l774785j658594L640938O260025L239949j169683l042792
2542D210610m147350n792254m327857J481705N076679J191922m970413n247607
$$ plain form
2598 -3311072 3986438 2327806 -4902947 -9660529 -11438778 -15218972 -21510675 -25610606
2590 -25610606 -24487865 -18862771 -10879260 -4654774 -5986392 -15653356 -25410094 -26608530
2582 -26608530 -21160356 -18369483 -22468915 -29121867 -33180925 -33755747 -31506157 -26617235
2574 -26617235 -20790608 -17244308 -17604959 -21235584 -26987884 -32619985 -33911011 -28574177
2566 -28574177 -20328928 -14848336 -12196944 -7751460 -397620 5127851 5079352 1782423
2558 1782423 337049 3088487 8411736 12712753 13079838 9760983 5888121 3379565
2550 3379565 715552 -3059233 -4717827 -1076889 5183136 8423085 7253402 4210610
2542 4210610 63260 -5728994 -10056851 -8575146 -3498467 -2306545 -7276958 -12524565
2534a2524565o80910J882263J456184K262471M002132K203120k461384m083049
2526g943738j388500J12715k772183o392541o508356l399957P97615M867122P234666
2517a5393157O264140K951235j13801k403691m512296m728681j227180L421272
2509a5742159N180567M935106O116167P088644L080447m298382p340376l717306
2501d697292k01789k025716n298139m051736O38408L159464J286657k304568l971012
2492a7465723k003922K116823M135597J577839j786239k01662N073111O597829
2484a956347J830288k928150k297077P18291R32571r61264j434878p69364j425434
2475h291364k935858l166372k300365j756591j538724j674147l079318m022658
$$ plain form
2534 -12524565 -13205475 -11323212 -9867028 -7604557 -3602425 -1399305 -3860689 -7943738
2526 -7943738 -9332238 -9219523 -11991706 -18384247 -24892603 -28292560 -27494945 -22627823 -15393157
2517 -15393157 -9129017 -6177782 -6291583 -8695274 -13207570 -17936251 -19163431 -15742159
2509 -15742159 -10561592 -5626486 489681 7578325 10658772 6360390 -979986 -4697292
2501 -4697292 -4899081 -6924797 -12222936 -16274672 -15636264 -12476800 -11190143 -13494711 -17465723
2492 -17465723 -19469645 -17352822 -13217225 -11639386 -13425625 -13627287 -8554176 -1956347
2484 -1956347 -126059 -3054209 -5351286 -4632995 -3700424 -4661688 -6096566 -6865930 -8291364
2475 -8291364 -11227222 -14393594 -16693959 -18450550 -19989274 -21663421 -24742739 -28765397
2467b8765397j6864Q679983J3937121R548967M90630l686413j823043q90062m524119
2458g049197q664838q470555l808636K532536P457464Q334582N257818K118761
2450b292065J703376J268883k514114o554528n546489j435351r47519m085229
$$ plain form
2467 -28765397 -28782261 -20102278 -6165157 3383810 3874440 188027 -1635016 -2525078 -7049197
2458 -7049197 -15714035 -24184590 -27993226 -25460690 -18003226 -9668644 -4410826 -2292065
2450 -2292065 -588689 680194 -1833920 -8388448 -13934937 -15370288 -16317807 -20403036
$$ [...]
##END=
