##TITLE=31P_DE-80H_X3
 64 sc D2O
 26.2.2025
##JCAMPDX= 6.0         $$ Bruker NMR JCAMP-DX V2.0
##DATA TYPE= NMR SPECTRUM
##DATA CLASS= NTUPLES
##ORIGIN= UXNMR, Bruker Analytische Messtechnik GmbH
##OWNER= root
$$ XWIN-NMR		Version 3.5
$$ Tue Sep 16 11:03:06 2025 Russian Standard Time (UT+4h)  Yarkov@DPX200
##.OBSERVE FREQUENCY= 81.013821
##.OBSERVE NUCLEUS= ^31P
##.ACQUISITION MODE= SIMULTANEOUS
##.ACQUISITION SCHEME= undefined
##.AVERAGES= 64
##.DIGITISER RES= 17
##SPECTROMETER/DATA SYSTEM= spect
##.PULSE SEQUENCE= zgpg30
##.SOLVENT NAME= D2O
##.SHIFT REFERENCE= (INTERNAL, D2O, 0, 198.062)
##AUDIT TRAIL= $$ (NUMBER, WHEN, WHO, WHERE, WHAT)
$$ ##TITLE= Audit trail, XWIN-NMR		Version 3.5
$$ ##JCAMPDX= 5.01
$$ ##ORIGIN= Bruker BioSpin GmbH
$$ ##OWNER= Yarkov
$$ C:/Bruker/XWIN-NMR/data/yarkov2/nmr/P31/2/pdata/1/auditp.txt
$$ ##AUDIT TRAIL=  $$ (NUMBER, WHEN, WHO, WHERE, WHAT)
(   1,<2025-09-16 11:01:54.34 +0400>,<Yarkov>,<DPX200>,
      <created by zg, POWCHK disabled, PULCHK disabled
       configuration hash MD5:
       00 E9 B6 7A A2 85 ED C7 34 08 36 98 17 FE 4E 26
       data hash MD5: 32K
       33 28 AC FA 27 5D 5A 92 24 96 E3 B2 9E 5E 29 A8>)
(   2,<2025-09-16 11:02:00.85 +0400>,<Yarkov>,<DPX200>,
      <Start of raw data processing
       efp BC_mod = 2 LB = 1.5 FT_mod = 6 PKNL = 1 PHC0 = 1678.243 PHC1 = 49.15953 SI = 64K 
       data hash MD5: 64K
       E7 93 61 F5 37 4B BD C7 96 42 6D EB 36 FB 5C F9>)
(   3,<2025-09-16 11:02:42.51 +0400>,<Yarkov>,<DPX200>,
      <pk PHC0 = -103.0272 PHC1 = 10.4 
       data hash MD5: 64K
       83 B0 5A 82 4F 96 58 B5 C8 E0 06 1F 64 5F 28 33>)
$$ ##END=
$$ 
$$ hash MD5
$$ 2F 4F 8D DC 72 34 D0 EF AA 51 9D 82 70 2F AA 31
##$RELAX= 
##$RELAX= 
##$RELAX= 
##$RELAX= 
##$RELAX= 
##$RELAX= 
##$RELAX= 
##$RELAX= 
$$ Bruker specific parameters
$$ --------------------------
##$DU= <C:/Bruker/XWIN-NMR>
##$EXPNO= 2
##$NAME= <P31>
##$PROCNO= 1
##$TYPE= <nmr>
##$USER= <yarkov2>
##$AMP= (0..31)
100 100 100 100 100 100 100 100 100 100 100 100 100 100 100 100 100 100 
100 100 100 100 100 100 100 100 100 100 100 100 100 100 
##$AQSEQ= 0
##$AQ_mod= 1
##$AUNM= <au_zg>
##$AUTOPOS= <>
##$BF1= 81.014009
##$BF2= 200.13
##$BF3= 200.13
##$BF4= 200.13
##$BF5= 200.13
##$BF6= 200.13
##$BF7= 200.13
##$BF8= 200.13
##$BYTORDA= 1
##$CFDGTYP= 0
##$CFRGTYP= 5
##$CHEMSTR= <none>
##$CNST= (0..31)
1 1 145 1 1 1 1 1 1 1 1 1 1 1 1 1 1 1 1 1 1 1 1 1 1 1 1 1 1 1 1 1 
##$CPDPRG= <waltz16>
##$CPDPRG1= <>
##$CPDPRG2= <waltz16>
##$CPDPRG3= <>
##$CPDPRG4= <mlev>
##$CPDPRG5= <mlev>
##$CPDPRG6= <mlev>
##$CPDPRG7= <mlev>
##$CPDPRG8= <mlev>
##$CPDPRGB= <>
##$CPDPRGT= <>
##$D= (0..31)
0 1 0 0 0 0 0 0 0 0.06 0 0.03 2e-05 3e-06 0 0 0.0002 0 0 0 0 0 0 0 0 0 
0 0 0 0 0 0 
##$DATE= 1758006113
##$DBL= (0..7)
120 120 120 11 120 120 24 19 
##$DBP= (0..7)
150 150 150 150 150 150 150 150 
##$DBP07= 0
##$DBPNAM0= <>
##$DBPNAM1= <>
##$DBPNAM2= <>
##$DBPNAM3= <>
##$DBPNAM4= <>
##$DBPNAM5= <>
##$DBPNAM6= <>
##$DBPNAM7= <>
##$DBPOAL= (0..7)
$$ [...]
##$SUBNAM2= <"">
##$SUBNAM3= <"">
##$SUBNAM4= <"">
##$SUBNAM5= <"">
##$SUBNAM6= <"">
##$SUBNAM7= <"">
##$SUBNAM8= <"">
##$SUBNAM9= <"">
##$SW= 400.765351723535
##$SWIBOX= (0..15)
0 1 3 0 0 0 0 0 0 0 0 0 0 0 0 0 
##$SW_h= 32467.5324675325
##$TD= 32768
##$TD0= 1
##$TE= 0
##$TE2= 300
##$TE3= 300
##$TEG= 300
##$TL= (0..7)
0 120 53 12 22 120 120 120 
##$TP= (0..7)
150 150 150 150 150 150 150 150 
##$TP07= 0
##$TPNAME0= <>
##$TPNAME1= <>
##$TPNAME2= <>
##$TPNAME3= <>
##$TPNAME4= <>
##$TPNAME5= <>
##$TPNAME6= <>
##$TPNAME7= <>
##$TPOAL= (0..7)
0.5 0.5 0.5 0.5 0.5 0.5 0.5 0.5 
##$TPOFFS= (0..7)
0 0 0 0 0 0 0 0 
##$TUNHIN= 0
##$TUNHOUT= 0
##$TUNXOUT= 0
##$USERA1= <user>
##$USERA2= <user>
##$USERA3= <user>
##$USERA4= <user>
##$USERA5= <user>
##$V9= 5
##$VALIST= <valist>
##$VCLIST= <CCCCCCCCCCCCCCC>
##$VD= 0
##$VDLIST= <DDDDDDDDDDDDDDD>
##$VPLIST= <PPPPPPPPPPPPPPP>
##$VTLIST= <TTTTTTTTTTTTTTT>
##$WBST= 1024
##$WBSW= 4
##$XGAIN= (0..3)
0 0 0 0 
##$XL= 0
##$YL= 0
##$YMAX_a= 1368
##$YMIN_a= -958
##$ZGOPTNS= <>
##$ZL1= 120
##$ZL2= 120
##$ZL3= 120
##$ZL4= 120
##$ABSF1= 0
##$ABSF2= 0
##$ABSG= 0
##$ABSL= 0
##$ALPHA= 0
##$AQORDER= 0
##$ASSFAC= 0
##$ASSFACI= 0
##$ASSFACX= 0
##$ASSWID= 0
##$AUNMP= <proc_1d>
##$AZFE= 0.1
##$AZFW= 0.5
##$BCFW= 0
##$BC_mod= 2
##$BYTORDP= 0
##$COROFFS= 0
##$CY= -3
##$DATMOD= 1
##$DC= 0
##$DFILT= <>
##$DTYPP= 0
##$F1P= 0
##$F2P= 0
##$FCOR= 1
##$FTSIZE= 65536
##$FT_mod= 6
##$GAMMA= 0
##$GB= 0
##$INTBC= 1
##$INTSCL= 9.790993e-09
##$ISEN= 30
##$LB= 1.5
##$LEV0= 0
##$LPBIN= 0
##$MAXI= 10000
##$MC2= 0
##$MEAN= 0
##$ME_mod= 0
##$MI= 50
##$NCOEF= 0
##$NC_proc= -14
##$NLEV= 6
##$NOISF1= 182.463
##$NOISF2= 159.3651
##$NSP= 0
##$NTH_PI= 0
##$NZP= 0
##$OFFSET= 198.0616
##$PC= 4
##$PHC0= 1575.216
##$PHC1= 59.55953
##$PH_mod= 1
##$PKNL= yes
##$PPARMOD= 0
##$PSCAL= 0
##$PSIGN= 0
##$REVERSE= no
##$SF= 81.0140089999434
##$SI= 65536
##$SIGF1= 159.3651
##$SIGF2= -187.1042
##$SINO= 113.3802
##$SIOLD= 16384
##$SREGLST= <1H.CDCl3>
##$SSB= 0
##$STSI= 65536
##$STSR= 0
##$SW_p= 32467.5324675325
##$SYMM= 0
##$S_DEV= 0
##$TDeff= 32768
##$TDoff= 0
##$TI= <>
##$TILT= no
##$TM1= 0
##$TM2= 0
##$TOPLEV= 0
##$USERP1= <user>
##$USERP2= <user>
##$USERP3= <user>
##$USERP4= <user>
##$USERP5= <user>
##$WDW= 1
##$XDIM= 65536
##$YMAX_p= 429260385
##$YMIN_p= -365733387
$$ End of Bruker specific parameters
$$ ---------------------------------
##NTUPLES= NMR SPECTRUM
##VAR_NAME=  FREQUENCY,     SPECTRUM/REAL,   SPECTRUM/IMAG
##SYMBOL=    X,             R,               I
##VAR_TYPE=  INDEPENDENT,   DEPENDENT,       DEPENDENT
##VAR_FORM=  AFFN,          ASDF,            ASDF
##VAR_DIM=   65536,         65536,           65536
##UNITS=     HZ,            ARBITRARY UNITS, ARBITRARY UNITS
##FACTOR=    0.49542278885378, 1,            1
##FIRST=     16045.7642231865, 0,            0
##LAST=      -16421.768244346, 0,            0
##MIN=       -16421.768244346, -365733387,   0
##MAX=       16045.7642231865, 429260385,    0
$$ Real data points
##PAGE= N=1
##DATA TABLE= (X++(R..R)), XYDATA
$$ [...]
$$ plain form
7366 7692924 -3594539 -9257628 -5900159 920706 5186563 9091869 17233440 26087874
7358 26087874 27281450 19950922 12039593 9111373 9157459 9492897 11224606 14008632 13175570
7349 13175570 6715899 336280 586485 6042526 9871888 9084300 7101824 8327328
7341 8327328 13545846 20007272 23599205 21752402 15954472 10110956 5315713 -1047201
7333 -1047201 -9234808 -14097866 -11920084 -6970740 -5961748 -8117430 -6954511 -1251466
7325 -1251466 2562093 323260 -3798607 -4078251 -927218 2054759 4599114 8591495
7317 8591495 12995023 14872839 14228511 13259949 11314829 5313560 -3951634 -10120426 -8056114
7308 -8056114 251655 8634230 13596282 15963365 17127580 16573735 13516468 9171235
$$ packed form
7366G692924j1287463n663089L357469O820865M265857L905306Q141571Q854434
7358B6087874J193576p330528p911329k928220M6086L35438J731709K784026q33062
7349A3175570o459671o379619K50205N456041L829362p87588j982476J225504
7341H327328N218518O461426L591933j846803n797930n843516m795243o362914
7333a047201q187607m863058K177782M949344J008992k155682J162919N703045
7325a251466L813559k238833m121867k79644L151033K981977K544355L992381
7317H591495M403528J877816o44328r68562j945120o001269r265194o168792K064312
7308h056114Q307769Q382575M962052K367083J164215n53845l057267m345233
$$ plain form
7300 9171235 6335941 7006672 10496156 13555095 12726256 7665774 2452013 2568632 9504201
7291 9504201 18540610 22897894 20355214 15047876 12446515 13643395 15548147 15644427 14437189
7282 14437189 13032595 10523013 5290257 -2206807 -9455031 -14077563 -14735287 -10720519
7274 -10720519 -2754237 5762823 10418443 9787667 6678214 4685250 4654775 5344779 6117049
7265 6117049 7229056 8131568 7514145 5404133 3715105 3936431 5303447 6234926 6939390
7256 6939390 9282229 13831924 18050134 18479764 14847904 11111914 11397608 14907626 16119859
7247 16119859 11036956 2453317 -2688032 -1384707 1671678 -387593 -8332101 -15698699
7239 -15698699 -15919448 -9353517 -2826305 -2933976 -10168073 -19024829 -23281901 -21185761
$$ packed form
7300I171235k835294O70731L489484L058939q28839n060482n213761J16619O935569
7291I504201R036409M357284k542680n307338k601361J196880J904752R6280j207238
7282A4437189j404594k509582n232756p497064p248224m622532o57724M014768
7274a0720519P966282Q517060M655620o30776l109453j992964l0475O90004P72270
7265F117049J112007R02512o17423k110012j689028K21326J367016R31479P04464
7256F939390K342839M549695M218210M29630l631860l735990K85694L510018J212233
7247A6119859n082903q583639n141349J303325L056385k059271p944508p366598
7239a5698699k20749O565931O527212j07671p234097q856756m257072K096140
$$ plain form
7231 -21185761 -15790042 -10884695 -7726332 -6002872 -6039430 -7783361 -8512069 -4925466 1551258
7222 1551258 4690105 990981 -5057891 -6457712 -3042011 -1474341 -6035141 -13466535
7214 -13466535 -18287273 -19598334 -20057473 -20717467 -20163656 -17571124 -13661760 -9096529 -4299419
7205 -4299419 -321186 2590700 6692300 13963434 21637722 23933195 19145912 11717193
7197 11717193 5792881 362949 -6451688 -11762743 -11275456 -6715694 -4680683 -7764778
7189 -7764778 -11667730 -12697260 -13497023 -17924700 -23560305 -23998532 -17627145 -9946904 -6666357
7180 -6666357 -7589941 -8319384 -5634952 98306 6339978 11061200 14778423 19999704 27445292
7171 27445292 33257648 32336143 24786214 16434291 12023522 10726849 9893058 9820572 11577912
$$ packed form
7231b1185761N395719M905347L158363J723460l6558j743931p28708L586603O476724
7222A551258L138847l699124o048872j399821L415701J567670m560800p431394
7214a3466535m820738j311061m59139o59994N53811K592532L909364M565231M797110
7205d299419L978233K911886M101600P271134P674288K295473m787283p428719
7197A1717193n924312n429932o814637n311055M87287M559762K035011l084095
7189g764778l902952j029530p99763m427677n635605m38227O371387P680241L280547
7180f666357r23584p29443K684432N733258O241672M721222L717223N221281P445588
7171B7445292N812356r21505p549929q351923m410769j296673q33791p2486J757340
$$ plain form
7162 11577912 12703422 9705871 4139384 1643338 4212487 7303390 6177107 1948764
7154 1948764 -703946 673821 5164820 11112244 17017202 20658994 20140452 16334823
7146 16334823 12681911 11704080 12128760 9885553 2357977 -7932016 -14514280 -13145803
7138 -13145803 -6440384 -564853 2314851 5434503 10775868 14696851 12703489 5950908
7130 5950908 -193283 -2470067 -1541699 1157363 4841642 8166042 10037368 11751634
7122 11751634 15279906 19180794 19231181 13630966 4718326 -4854879 -14097740 -20685577
7114 -20685577 -20080341 -10926844 863995 6873421 4533291 -1401510 -5055325 -4949553
7106 -4949553 -3518824 -3113769 -3287026 -1550965 3470438 9996742 14870295 16935039 17158040
$$ packed form
7162A1577912J125510k997551n566487k496046K569149L090903j126283m228343
7154A948764k652710J377767M490999N947424N904958L641792n18542l805629
7146A6334823l652912r77831M24680k243207p527576j0289993o582264J368477
7138a3145803O705419N875531K879704L119652N341365L920983j993362o752581
7130E950908o144191k276784R28368K699062L684279L324400J871326J714266
7122A1751634L528272L900888N0387n600215q912640r573205r242861o587837
7114b0685577O05236R153497J1790839O009426k340130n934801l653815J05772
7106d949553J430729M05055j73257J736061N021403O526304M873553K064744K23001
$$ plain form
7097 17158040 15695918 11359379 4779023 -472379 -1640590 202359 2496367 4462266
7089 4462266 5973694 5211555 357032 -7314379 -14335978 -18057383 -16897342 -9769618
7081 -9769618 1333339 9802910 10013230 4404736 774365 2037209 3070241 -934758
7073 -934758 -7458857 -10664644 -8821442 -4391860 551509 5153478 7741001 6976693 4486990
7064 4486990 2849734 1190836 -3596018 -10679958 -14000393 -9191070 499302 7571296
7056 7571296 8492647 6612179 7427481 12751317 19686352 24022098 24011386 21245885 18167194
7047 18167194 14920216 9443518 1281037 -5778313 -6899047 -2275270 2182932 1725985
7039 1725985 -1371772 -1229428 3350835 7330889 6561602 2919096 426716 -674507 -2799534
$$ packed form
7097A7158040j462122m336539o580356n251402j168211J842949K294008J965899
7089D462266J511428p62139m854523p671411p021599l721405J160041P127724
7081i769618J1102957Q469571K10320n608494l630371J262844J033032m004999
7073i34758o524099l205787J843202M429582M943369M601969K587523p64308k489703
7064D486990j637256j658898m786854p083940l320435M809323R690372P071994
7056G571296R21351j880468Q15302N323836O935035M335746j0712k765501l078691
7047A8167194l246978n476698q162481p059350j120734M623777M458202m56947
7039A725985l097757J42344M580263L980054p69287l642506k492380j101223k125027
$$ plain form
7030 -2799534 -6042937 -8323721 -9731634 -12524501 -16287863 -16998266 -12468501 -5650454
7022 -5650454 -626311 2203109 4938661 8239872 10523297 9559018 3674681 -6323631
7014 -6323631 -15094787 -15976263 -9068032 -3059470 -5127008 -11422413 -12259366 -5076626 3208573
7005 3208573 6244107 4756232 2131033 -668783 -3214520 -3499004 -1256072 119955
6997 119955 -1478690 -2868622 -163895 5031873 7987606 7720516 7451152 9118938 11364017
6988 11364017 12693260 13081151 12347374 10200263 8041052 7476289 6837721 2929427 -2819633
6979 -2819633 -3999159 2574371 11440649 14518425 10558357 5090837 2077026 -151487
6971 -151487 -3722355 -5872784 -2323313 4934535 7060140 -2235748 -18230342 -28878011
$$ packed form
7030b799534l243403k280784j407913k792867l763362p10403M529765O818047
7022e650454N024143K829420K735552L301211K283425r64279n884337r998312
7014f323631q771156q81476O908231O008562k067538o295405q36953P182740Q285199
7005C208573L035534j487875k625199k799816k545737k84484K242932J376027
6997A19955j598645j389932K704727N195768K955733k67090k69364J667786K245079
6988A1364017J329243L87891p33777k147111k159211n64763o38568l908294n749060
6979b819633j179526O573530Q866278L077776l960068n467520l013811k228513
6971a51487l570868k150429L549471P257848K125605r295888j5994594j0647669
$$ plain form
6963 -28878011 -27150677 -17403485 -8789428 -5197037 -3963296 -2128065 21122 1223006
6955 1223006 1272698 -20539 -2813774 -4997913 -2894891 3938887 10850210 13150911 11445129
6946 11445129 9966804 11112109 13835895 16335088 17746003 17388175 14584053 9919837
6938 9919837 5610626 4026785 5835450 9122234 10394367 7749735 3552321 2506501
6930 2506501 6276997 11515795 14025960 12920163 9452830 4226681 -2022421 -6694674
6922 -6694674 -7280782 -4217778 328711 5241429 9752321 11778893 10210905 7592724
6914 7592724 6995653 7228163 5051100 1292467 18347 1643464 2168222 536413 1433215
6905 1433215 7918714 15520740 17287632 11963304 4026482 -1935890 -3773521 -929588
$$ packed form
6963b8878011J727334R747192Q614057L592391J233741J835231K149187J201884
6955A223006M9692j293237k793235k184139K103022O833778O911323K300701j705782
6946A1445129j478325J145305K723786K499193J410915l57828k804122m664216
6938I919837m309211j583841J808665L286784J272133k644632m197414j045820
6930B506501L770496N238798K510165j105797l467333n226149o249102m672253
6922f694674n86108L063004M546489M912718M510892K026572j567988k618181
6914G592724n97071K32510k177063l758633j274120J625117N24758j631809Q96802
6905A433215O485499P602026J766892n324328p936822n962372j837631K843933
$$ plain form
6897 -929588 5295732 11435712 14335439 13410078 9362008 2716679 -4643486 -8966510 -8235151
6888 -8235151 -4492911 -480813 3741020 8486432 11609348 11280111 9249433 7937224
6880 7937224 6615136 4066917 2261023 2882850 2967369 -452388 -3708247 -1290188 4070671
6871 4070671 3899534 -3139070 -8879732 -8018135 -4851948 -4177564 -3053933 2789256 10195521
6862 10195521 12807317 10331596 7477593 6346829 5724757 5968976 8675014 12197165
6854 12197165 12702324 9738142 6671178 5710444 6153391 7290475 9370773 11531521 11886730
6845 11886730 10028938 7443626 6028883 7819678 14141056 22484282 26809858 24489426
6837 24489426 20241250 18885375 17424141 10421106 618490 -3691534 -1075638 1597669
$$ packed form
6897i29588O225320O139980K899727r25361m048070o645329p360165m323024P31359
6888h235151L742240M012098M221833M745412L122916l29237k030678j312209
6880G937224j322088k548219j805894O21827Q4519l419757l255859K418059N360859
6871D070671j71137p038604n740662Q61597L166187O74384J123631N843189P406265
6862A0195521K611796k475721k854003j130764o22072K44219K706038L522151
6854A2197165N05159k964182l066964r60734M42947J137084K080298K160748L55209
6845A1886730j857792k585312j414743J790795O321378Q343226M325576k320432
6837B4489426m248176j355875j461234p003035r802616m310024K615896K673307
$$ plain form
6829 1597669 646543 -234019 867749 99849 -2940276 -1216191 8015747 15378856 11736449
6820 11736449 2496037 11070 5599760 9592521 7808291 7004529 12055021 17467865
6812 17467865 16516734 11984086 11757428 17324215 22225236 20940930 15293603 11531015
6804 11531015 13216303 18168575 22208982 24664771 28000926 31845257 31219388 23565881
6796 23565881 14087176 9342512 7911260 3390698 -4438041 -8342837 -4248058 3643178
6788 3643178 10365607 16325905 22537216 25630634 22547306 16211557 11826030 10519594
6780 10519594 10671652 12127950 14338652 13286944 5922001 -3883438 -9141185 -8849658
6772 -8849658 -8472966 -11579118 -15632423 -16582554 -13616182 -8461369 -3260923 -129567 -268610
$$ packed form
6829A597669r51126q80562J101768p67900l040125J724085R231938P363109l642407
6820A1736449r240412k484967N588690L992761j784230q03762N050492N412844
6812A7467865r51131m532648k26658N566787M901021j284306n647327l762588
6804A1531015J685288M952272M040407K455789L336155L844331o25869p653507
6796B3565881r478705m744664j431252m520562p828739l904796M094779P891236
6788C643178O722429N960298O211311L093418l083328o335749m385527j306436
6780A0519594J52058J456298K210702j051708p364943r805439n257747K91527
6772h849658L76692l106152m053305r50131K966372N154813N200446L131356j39043
$$ plain form
6763 -268610 -2651315 -5193043 -7017556 -7899722 -6682571 -2993045 447423 459339 -2147408
6754 -2147408 -3865649 -3653569 -3466443 -4148001 -4477053 -4129523 -3841286 -2711391 589981
6745 589981 3724476 2253917 -3723378 -8669779 -8585457 -4893208 -118181 5757732 12300393
6736 12300393 16152814 15018561 11663947 11059849 14941191 20688562 23911918 21570145
6728 21570145 15043475 10360568 12053688 16707871 16950602 11935993 7952916 7654937
6720 7654937 6323500 2093719 1590717 8986747 16422612 14007707 4801592 335521
6712 335521 3538767 5804930 1024779 -6420733 -9537338 -7217669 -2208550 3524147
6704 3524147 8440908 10823511 10996738 10882122 10166460 6534733 416329 -4741000 -7887250
$$ packed form
6763b68610k382705k541728j824513q82166J217151L689526L440468J1916k606747
6754b147408j718241K12080J87126o81558l29052L47530K88237J129895L301372
6745E89981L134495j470559n977295m946401Q4322L692249M775027N875913O542661
6736A2300393L852421j134253l354614o04098L881342N747371L223356k341773
6728B1570145o526670m682907J693120M654183K42731n014609l983077k97979
6720G654937j331437m229781n03002P396030P435865k414905r206115m466071
6712C35521L203246K266163m780151p445512l116605K319669N009119N732697
6704C524147M916761K382603J73227j14616p15662l631727o118404n157329l146250
$$ plain form
6695 -7887250 -11596246 -16588723 -19641351 -18936504 -17334932 -17960601 -19912989 -20437112 -18357335
6686 -18357335 -13750100 -7190143 -616897 3957433 7211307 10664746 12358138 9372285
6678 9372285 4863062 6078256 13493251 18676581 16198625 10989387 9450163 9978185
6670 9978185 8594856 8098242 13245897 20155758 19372944 9184580 -1248842 -2956470
6662 -2956470 3739517 11568542 13319061 6427247 -5102456 -12888764 -11679196 -4699481
6654 -4699481 1060044 3295049 4531753 6137834 7695066 11136077 19004447 28016211
6646 28016211 30601465 24862812 17750302 15778224 17203499 16655822 13733788 12866210
6638 12866210 16482658 21933170 24833508 23179738 18066254 11754938 5780117 1061074
$$ packed form
6695g887250l708996m992477l052628P04847J601572o25669j952388n24123K079777
6686a8357335M607235O559957O573246M574330L253874L453439J693392k985853
6678I372285m509223J215194P414995N183330k477956n209238j539224N28022
6670I978185j383329m96614N147655O909861p82814j0188364j0433422j707628
6662b956470O695987P829025J750519o891814j1529703p786308J209568O979715
6654d699481N759525K235005J236704J606081J557232L441011P868370R011764
6646B8016211K585254n738653p112510j972078J425275n47677k922034q67578
6638A2866210L616448N450512K900338j653770n113484o311316n974821m719043
$$ plain form
6630 1061074 -844065 1389737 5895406 7974169 5569051 2289574 2412447 5123633
6622 5123633 6847142 6613456 4878788 -152208 -9051324 -15918132 -13962659 -6375023
6614 -6375023 -4280820 -12354702 -23094525 -27290571 -23675538 -16105560 -8422236 -5437822
6606 -5437822 -11484149 -22746876 -27488491 -20075040 -9478015 -7376896 -12662353 -15066528
6598 -15066528 -10263673 -3247770 965585 2012177 681343 -1938080 -2445771 976784
6590 976784 3512012 -384144 -6979297 -7416090 -1749064 671895 -3396318 -5559298 -216486
6581 -216486 5245903 2454249 -3121682 805981 15142259 27828393 29620285 23247111
6573 23247111 16365913 12863858 13133762 16617010 20651937 21027548 16901075 12262188
$$ packed form
6630A061074j905139K233802M505669K078763k405118l279477J22873K711186
6622E123633J723509k33686j734668n030996q899116o866808J955473P587636
6614f375023K094203q073882j0739823m196046L615033P569978P683324K984414
6606e437822o046327j1262727m741615P413451J0597025K101119n285457k404175
6598a5066528M802855P015903M213355J046592j330834k619423n07691L422555
6590I76784K535228l896156o595153m36793N667026K420959m068213k162980N342812
6581b16486N462389k791654n575931L927663J4336278J2686134J791892o373174
6573B3247111o881198l502055K69904L483248M034927L75611m126473m638887
$$ plain form
6565 12262188 10246195 9244383 7324813 7043032 11580711 17969858 18923202 11606314
6557 11606314 975534 -6370257 -8646385 -8119506 -6863483 -5573212 -4923817 -5565107
6549 -5565107 -7123830 -8963842 -11662375 -16002246 -20448498 -21509339 -17626113 -11638062
6541 -11638062 -8078026 -8202305 -8759701 -6094603 -743300 3109235 2868125 937581 1599721
6532 1599721 5123550 7018245 3715465 -2766490 -7070816 -6271241 -2184422 1154025
6524 1154025 1154664 -1405556 -3198460 -1911364 663715 904819 -946078 -700534 2637224
6515 2637224 4223311 1734794 1683924 10571133 22722996 25839213 18373870 11750885
6507 11750885 12883067 14255893 6936873 -4941810 -10669466 -8023965 -3055593 1261900
$$ packed form
6565A2262188k015993j001812j919570k81781M537679O389147R53344p316888
6557A1606314j0630780p345791k276128N26879J256023J290271O49395o41290
6549e565107j558723j840012k698533m339871m446252j060841L883226N988051
6541a1638062L560036j24279n57396K665098N351303L852535k41110j930544O62140
6532A599721L523829J894695l302780o481955m304326P99575M086819L338447
6524A154025O39k560220j792904J287096K575079K41104j850897K45544L337758
6515B637224J586087k488517n0870Q887209J2151863L116217p465343o622985
6507A1750885J132182J372826p319020j1878683n727656K645501M968372M317493
$$ plain form
6499 1261900 6750682 12137219 12820874 9148157 6909772 7941441 7111508 800125 -7708799
6490 -7708799 -13764398 -16871179 -18070815 -16814294 -13470746 -10700174 -9359981 -6887575
6482 -6887575 -2613562 -789378 -4815114 -11520851 -14766168 -12603383 -7972556 -4237240
6474 -4237240 -2559589 -1972042 -110096 4331100 8748751 8945975 5305885 2891864 3762268
6465 3762268 3698570 -704896 -6391617 -9108179 -9957920 -12034331 -14369031 -14525481 -13926001
6456 -13926001 -14901505 -15364219 -12587460 -9583925 -10641584 -12600261 -8746654 -606262
6448 -606262 3023904 -351717 -3447500 -1877897 -1138262 -5820425 -9764035 -4353522 8271423
6439 8271423 17681489 18146460 12909323 7554250 5196506 7213574 12988358 18621941
$$ packed form
6499A261900N488782N386537O83655l672717k238385J031669q29933o311383q508924
6490g708799o055599l106781j199636J256521L343548K770572J340193K472406
6482f887575M274013J824184m025736o705737l245317K162785M630827L735316
6474d237240J677651N87547J861946M441196M417651J97224l640090k414021Q70404
6465C762268o3698m403466n686721k716562q49741k076411k334700j56450N99480
6456a3926001r75504m62714K776759L003535j057659j958677L853607Q140392
6448f06262L630166l375621l095783J569603P39635m682163l943610N410513J2624945
6439H271423R410066M64971n237137n355073k357744K017068N774784N633583
$$ plain form
6431 18621941 20155275 18339686 17060076 17654329 18023029 16271007 11655717 3455496
6423 3455496 -6505058 -11456452 -5702417 6556600 14125876 12009532 6473288 5080611
6415 5080611 7304793 8374550 7182898 5269509 1652660 -5173991 -11578585 -11103860
6407 -11103860 -3141375 5043823 6355940 1200757 -4056220 -3598290 3513821 13219558
6399 13219558 19657618 19952701 16296514 12303455 8337471 3007496 -1626507 -856560
6391 -856560 5213155 9185966 4752205 -4947337 -11167840 -10428861 -7345620 -6648993 -6876842
6382 -6876842 -4147939 1039157 4327179 3645286 1330171 -212596 -1799330 -4722599
6374 -4722599 -7067476 -5626257 -668848 4128641 6757785 9125527 13217932 17582265
$$ packed form
6431A8621941J533334j815589j279610N94253L68700j752022m615290q200221
6423C455496r960554m951394N754035J2259017P569276k116344n536244j392677
6415E080611K224182J069757j191652j913389l616849o826651o404594M74725
6407a1103860P962485Q185198J312117n155183n256977M57930P112111R705737
6399A3219558O438060K95083l656187l993059l965984n329975m634003P69947
6391h56560O069715L972811m433761r699542o220503P38979L083241O96627k27849
6382f876842K728903N187096L288022o81893k315115j542767j586734k923269
6374d722599k344877J441219M957409M797489K629144K367742M092405M364333
$$ plain form
6366 17582265 19441164 18263235 15125828 10558447 5912369 5104481 10784273 18890068
6358 18890068 21204078 14588344 4437494 -2472717 -5397685 -7815046 -11038622 -12735083
6350 -12735083 -10651659 -5431058 -140354 1816548 -677406 -4939285 -6894496 -5655354
6342 -5655354 -3772255 -2446483 213319 4512221 6634451 4228123 1486668 4256535
6334 4256535 11822257 17785286 17875733 12915828 5492260 -1686383 -5227396 -4100903 -2936688
6325 -2936688 -6967309 -13587611 -14570533 -7245680 2651922 10456887 17806448 25468154
6317 25468154 28230459 22536571 13987735 10969768 14227820 18468510 21049878 22670336
6309 22670336 21795470 15522742 5544042 -2806777 -7350947 -9490279 -8572932 -2543970
$$ packed form
6366A7582265J858899j177929l137407m567381m646078q07888N679792Q105795
6358A8890068K314010o615734j0150850o910211k924968k417361l223576j696461
6350a2735083K083424N220601N290704J956902k493954m261879j955211J239142
6342e655354J883099J325772K659802M298902K122230k406328k741455K769867
6334D256535P565722N963029R0447m959905p423568p178643l541013J126493J164215
6325b936688m030621o620302r82922P324853R897602P804965P349561P661706
6317B5468154K762305n693888q548836l017967L258052M240690K581368J620458
6309B2670336q74866o272728r978700q350819m544170k139332R17347O028962
$$ plain form
6301 -2543970 5258867 7203846 1704035 -3948186 -4440089 -4044461 -8522371 -14587406 -14122226
6292 -14122226 -6330776 1015643 2118093 -675681 -1977745 131288 4425656 9614028
6284 9614028 14444637 16667020 14256333 7345565 -1731284 -9593419 -13052830 -10923726
6276 -10923726 -5319453 95003 3491414 5060336 4049258 -1104060 -8107744 -9908796
6268 -9908796 -2608570 7377969 9181434 1049227 -6838798 -5526949 978087 1498044
6260 1498044 -7182770 -16518715 -17872241 -12909187 -9540986 -10658211 -11145222 -5966041
6252 -5966041 2331400 6472165 3579645 -1484407 -2913979 -1488399 -2234960 -6017547
6244 -6017547 -8305115 -6956307 -5424982 -5041041 -99470 13002896 26181689 27967821
$$ packed form
6301b543970P802837J944979n499811n652221m91903L95628m477910o065035M65180
6292a4122226P791450P346419J102450k793774j302064K109033M294368N188372
6284I614028M830609K222383k410687o910768r076849p862135l459411K129104
6276a0923726N604273N414456L396411J568922j011078n153318p003684j801052
6268i908796P300226R986539J803465q132207p888025J311849O505036N19957
6260A498044q680814r335945j353526M963054L368201j117225m87011N179181
6252e966041Q297441M140765k892520n064052j429572J425580p46561l782587
6244f017547k287568J348808J531325L83941M941571J3102366J3178793J786132
$$ plain form
6236 27967821 19629156 13475217 14839771 16213172 12050340 8224145 10293011 12377662
6228 12377662 7427485 1245265 4742161 16305494 23530114 20781366 13874585 7783271
6220 7783271 1359034 -4085660 -2573518 5754292 11409388 8721542 4229230 6064626
6212 6064626 12075244 14904120 12785202 8678924 4078234 435138 1584535 7282686
6204 7282686 9038078 874165 -9518722 -9926019 -1610254 2225277 -4221321 -12247265
6196 -12247265 -13304001 -10722958 -11500319 -14095002 -11647758 -3376520 3864213 4296344
6188 4296344 -837943 -5678295 -5572108 -975576 3262196 3446595 1777531 3111830 7294869
6179 7294869 8933761 5713899 1888143 948002 -223716 -5857060 -14082620 -20121622
$$ packed form
6236B7967821q338665o153939J364554J373401m162832l826195K068866K084651
6228A2377662m950177o182220L496896J1563333P224620k748748o906781o091314
6220G783271o424237n444694J512142Q327810N655096k687846m492312J835396
6212F064626O010618K828876k118918m106278m600690l643096J149397N698151
6204G282686J755392q163913j0392887m07297Q315765L835531o446598q025944
6196a2247265j056736K581043p77361k594683K447244Q271238P240733M32131
6188D296344n134287m840352J06187M596532M237772J84399j669064J334299M183039
6179G294869J638892l219862l825756r40141j171718n633344q225560o039002
$$ plain form
6171 -20121622 -23453751 -26298412 -27407657 -23741883 -17336763 -13935637 -14291152 -13033219
6163 -13033219 -7769022 -3340683 -4009693 -6459208 -4801148 850923 5129132 4573794
6155 4573794 205841 -5303529 -9134397 -8231636 -1857603 5945330 9928702 9698247 9055114
6146 9055114 9541436 8600610 4917181 1495506 1289387 2913149 3390887 2968918 4355236
6137 4355236 8478717 13521513 17337408 18740163 17241993 13652192 10327918 8812473
6129 8812473 7743903 5056883 1622117 318268 1657467 2875939 2023908 1009112
6121 1009112 3547636 11022898 20739778 27605994 27998175 23230256 18749151 18487412 20662730
6112 20662730 20797515 17703905 13747206 10100976 5739939 1685518 2013762 8220434
$$ packed form
6171b0121622l332129k844661j109245L665774O405120L401126l55515J257933
6163a3033219N264197M428339o69010k449515J658060N652071M278209n55338
6155D573794m367953n509370l830868R02761O374033P802933L983372k30455o43133
6146I055114M86322r40826l683429l421675k06119J623762M77738m21969J386318
6137D355236M123481N042796L815895J402755j498170l589801l324274j515445
6129H812473j068570k687020l434766j303849J339199J218472q52031j014796
6121A009112K538524P475262R716880O866216L92181m767919m481105k61739K175318
6112B0662730J34785l093610l956699l646230m361037m054421L28244O206672
$$ plain form
6104 8220434 15318920 16290314 9202808 -1616085 -9947890 -11909910 -7764062 -1379854
6096 -1379854 3241311 5893265 9070844 12668634 13033091 8985644 5279641 6863544
6088 6863544 12187752 15698163 15100394 12523537 9902184 7053099 3746397 431841
6080 431841 -2629537 -4457337 -3086289 727716 1754863 -3220060 -8931353 -7379458
6072 -7379458 777238 7161195 8313097 9826916 15486983 20021403 17698469 11748390
6064 11748390 8391669 6040560 -1401276 -12550458 -18359990 -14649944 -7531343 -3963667
6056 -3963667 -3003430 -149306 4304673 6161298 4133010 1046544 -1088788 -3293034
6048 -3293034 -6484371 -9176682 -9468344 -7475766 -4748744 -2558622 -1572932 -1945746 -2705434
$$ packed form
6104H220434P098486R71394p087506j0818893q331805j962020M145848O384208
6096a379854M621165K651954L177579L597790L64457m047447l706003J583903
6088F863544N324208L510411n97769k576857k621353k849085l306702l314556
6080D31841l061378j827800J371048L814005J027147m974923n711293J551895
6072g379458Q156696O383957J151902J513819N660067M534420k322934n950079
6064A1748390l356721k351109p441836j1149182n809532L710046P118601L567676
6056c963667R60237K854124M453979J856625k028288l086466k135332k204246
6048c293034l191337k692311k91662J992578K727022K190122R85690l72814p59688
$$ plain form
6039 -2705434 -2236545 -812308 -1743367 -7947911 -17376620 -23925171 -23751605 -19076892 -14559660
6030 -14559660 -11422898 -7032676 542339 9647542 16644473 18777032 15571495 9142885
6022 9142885 3279750 564083 34613 -1006672 -3140666 -4802718 -5881709 -8288547
6014 -8288547 -12050263 -14099380 -12938019 -11464376 -12164032 -12077234 -6678212 2693027 9986017
6005 9986017 12785127 14450155 16739215 15607391 8021292 -728334 -1722519 6419258
5997 6419258 15421397 16945231 11036790 4108294 1480309 3747175 8507009 13270429
5989 13270429 16972327 19921808 22360191 23194964 21406055 18852065 19406733 23823559
5981 23823559 27502501 25818651 20365360 17073031 18892716 23481706 27741942 30711213
$$ packed form
6039b705434M68889J424237r31059o204544r428709o548551J73566M674713M517232
6030a4559660L136762M390222P575015R105203O996931K132559l205537o428610
6022I142885n863135k715667n29470j041285k133994j662052j078991k406838
6014h288547l761716k049117J161361J473643o99656Q6798N399022R371239P292990
6005I986017K799110J665028K289060j131824p586099q749626r94185Q141777
5997F419258R002139J523834n908441o928496k627985K266866M759834M763420
5989A3270429L701898K949481K438383Q34773j788909k553990N54668M416826
5981B3823559L678942j683850n453291l292329J819685M588990M260236K969271
$$ plain form
5973 30711213 31166470 26650411 17570705 9301630 7006058 10066265 14169351 16848374
5965 16848374 17878127 16258987 11153422 5133798 2114122 1605980 -1115180 -8178230
5957 -8178230 -15925577 -19808956 -19241324 -15994664 -10950519 -4832327 215544 2484203
5949 2484203 2905767 3524953 4906102 6380986 7360631 7157656 5368671 3759243 5414681
5940 5414681 10183466 13611088 13005847 11887600 14801559 19967172 21729005 19002610
5932 19002610 15762466 12940360 5906764 -7288909 -19988494 -23680423 -18380115 -12123664
5924 -12123664 -10998486 -13357647 -14065305 -11187183 -7040745 -4577680 -4520883 -5461492 -5467611
5915 -5467611 -3548483 -320312 2390131 2801528 310601 -4489661 -10683183 -17445291
$$ packed form
5973C0711213M55257m516059r079706q269075k295572L060207M103086K679023
5965A6848374J029753j619140n105565o019624l019676n08142k721160p063050
5957h178230p747347l883379N67632L246660N044145O118192N047871K268659
5949B484203M21564O19186J381149J474884R79645k02975j788985j609428J655438
5940E414681M768785L427622o05241j118247K913959N165613J761833k726395
5932A9002610l240144k822106p033596j3195673j2699585l691929N300308O256451
5924a2123664J125178k359161p07658K878122M146438K463065N6797r40609o119
5915e467611J919128L228171K710443M11397k490927m800262o193522o762108
$$ plain form
5907 -17445291 -23349318 -25950710 -23294236 -16140805 -7691286 -473473 5611973 11391523
5899 11391523 15722652 16285273 12582404 6508660 150784 -5094238 -7134658 -3531143
5891 -3531143 5035253 13198087 15198814 10773269 5341349 4320376 8453429 14580677
5883 14580677 19094931 19733839 15680696 8071473 272968 -4193046 -4834859 -4429299 -5487805
5874 -5487805 -7267372 -6944432 -3014291 3275663 9225982 12501026 12209767 9212071 5084851
5865 5084851 293814 -5539751 -10734515 -11052685 -4859301 2530599 3554222 -2401923
5857 -2401923 -8418721 -9487018 -7999834 -7517952 -5845028 930367 10541269 16512243
5849 16512243 16978202 15818679 14785731 10426229 953188 -8909112 -13482930 -12989207
$$ packed form
5907a7445291n904027k601392K656474P153431Q449519P217813O085446N779550
5899A1391523M331129N62621l702869o073744o357876n245022k040420L603515
5891c531143Q566396Q162834K000727m425545n431920j020973M133053O127248
5883A4580677M514254O38908m053143p609223p798505m466014o41813M05560j058506
5874e487805j779567L22940L930141O289954N950319L275044k91259k997696m127220
5865E084851m791037n833565n194764l18170O193384P389900J023623n956145
5857b401923o016798j068297J487184M81882J672924O775395R610902N970974
5849A6512243M65959j159523j032948m359502r473041r862300m573818M93723
$$ plain form
5841 -12989207 -11096271 -8520547 -3589559 2565396 6481724 7917474 10103512 13403137
5833 13403137 13426298 8091902 2645300 3495869 9278254 12624335 9988748 5020085 1950835
5824 1950835 735000 547199 2967577 7755017 9437460 3670918 -4924629 -7070576
5816 -7070576 -599254 7533223 11321696 11996246 12706744 12962748 11885952 12119994 15805530
5807 15805530 19813075 19528724 15236611 10727137 7567071 4772415 2413344 1478577
5799 1478577 1573709 2484636 6246499 13575349 20141174 21030202 17260586 13101446 9113636
5790 9113636 3865492 499747 3712197 10476125 12132030 6993320 2618361 3298522
5782 3298522 3954984 316761 -3502211 -3339986 -3031687 -6822444 -10522355 -8960259 -6867782
$$ packed form
5841a2989207J892936K575724M930988O154955L916328J435750K186038L299625
5833A3403137K3161n334396n446602Q50569N782385L346081k635587m968663l069250
5824A950835j215835j87801K420378M787440J682443n766542q595547k145947
5816g070576O471322Q132477L788473O74550P10498K56004j076796K34042L685536
5807A5805530M007545k84351m292113m509474l160066k794656k359071r34767
5799A478577R5132R10927L761863P328850O565825Q89028l769616m159140l987810
5790I113636n248144l365745L212450O763928J655905n138710m374959O80161
5782C298522O56462l638223l818972J62225L08299l790757l699911J562096K092477
$$ plain form
5773 -6867782 -12154769 -21496298 -23450131 -15393624 -7096676 -6069004 -8901437 -10317903
5765 -10317903 -12168703 -18035871 -25051086 -27235041 -23674745 -18383649 -14141115 -10593006
5757 -10593006 -7073811 -3770517 -604413 2575396 4890988 4905853 1905400 -3445250
5749 -3445250 -8408686 -8442448 -1021548 9905610 16189541 13955801 7496574 2991382
5741 2991382 924071 -2572141 -8693618 -13817282 -14487002 -12135089 -11722247 -16261903 -23237030
5732 -23237030 -26806549 -23886114 -17479663 -13202234 -13363327 -15837758 -17633500 -17286603
5724 -17286603 -14598730 -10980301 -9688216 -12396440 -15505197 -13483290 -6229599 870411
5716 870411 4806567 8083625 12580518 15773757 16171964 17240290 21256040 23634215 19267230
$$ packed form
5773f867782n286987r341529j953833Q056507Q296948J027672k832433j416466
5765a0317903j850800n867168p015215k183955L560296N291096M242534L548109
5757a0593006L519195L303294L166104L179809K315592J4865l000453n350650
5749c445250m963436l3762P420900J0927158O283931k233740o459227m505192
5741B991382k067311l496212o121477n123664o69720K351913M12842m539656o975127
5732b3237030l569519K920435O406451M277429j61093k474431j795742L46897
5724a7286603K687873L618429J292085k708224l108757K021907P253691P100010
5716H70411L936156L277058M496893L193239L98207J068326M015750K378175m366985
$$ plain form
5707 19267230 11622620 9104006 13551034 18310816 17461672 11432948 3211169 -5465179
5699 -5465179 -12615594 -15386709 -13258865 -9041258 -5340595 -2557727 -794087 -453469
5691 -453469 -274951 1714441 4313738 3833751 -2650 -2458423 147314 6037110 11348140
5682 11348140 14442690 14891330 11968117 6995622 3721616 3061857 781100 -5673439
5674 -5673439 -11281348 -9654753 -3083358 -321540 -4679198 -10381306 -12131361 -12647866
5666 -12647866 -17300637 -25039339 -29003708 -24934482 -15645554 -7220943 -3104222 -2427280
5658 -2427280 -2618493 -2459875 -2440063 -2580312 -1149228 3151723 8098552 8968060 3571934
5649 3571934 -4855543 -10801089 -11744017 -9319392 -5928861 -1739867 4506136 12555637
$$ packed form
5707A9267230p644610k518614M447028M759782q49144o028724q221779q676348
5699e465179p150415k771115K127844M217607L700663K782868J763640L40618
5691d53469J78518J989392K599297m79987l836401k455773K605737N889796N311030
5682A1348140L094550M48640k923213m972495l274006o59759k280757o454539
5674e673439n607909J626595O571395K761818m357658n702108j750055n16505
5666a2647866m652771p738702l964369M069226R288928Q424611M116721O76942
5658b427280j91213J58618J9812j40249J431084M300951M946829Q69508n396126
5649C571934q427477n945546r42928K424625L390531M188994O246003Q049501
$$ plain form
5641 12555637 19407982 21290660 16845163 8408748 312054 -4063538 -4013225 -1155574
5633 -1155574 2149282 4269045 4778579 4073262 3003584 2691471 3499754 3465944 -880906
5624 -880906 -10316109 -20231243 -24445966 -21698421 -16125093 -11407867 -7535733 -3979287
5616 -3979287 -2248426 -3080111 -4220054 -3761860 -3033283 -3348125 -2948986 -943866 -1187953
5607 -1187953 -6986234 -13990734 -14525131 -8332281 -2815082 -2377983 -3912532 -3891138 -3149030
5598 -3149030 -2289230 892139 5645502 6151751 113469 -5778618 -4574692 1117155 3967899
5589 3967899 2585332 685352 -884575 -3476382 -4234885 1031284 9072168 11894763
5581 11894763 9116418 9073587 15309605 20448130 17786777 11486562 9339281 11303363
$$ packed form
5641A2555637O852345J882678m445497q436415q096694m375592N0313K857651
5633a155574L304856K119763N09534p05317j069678l12113Q08283l3810m346850
5624h80906r435203r915134m214723K747545N573328M717226L872134L556446
5616c979287J730861q31685j139943M58194P28577l14842L99139K005120k44087
5607a187953n798281p004500n34397O192850N517199M37099j534549K1394P42108
5598c149030Q59800L181369M753363N06249o038282n892087J203926N691847K850744
5589C967899j382567j899980j569927k591807p58503N266169Q040884K822595
5581A1894763k778345m2831O236018N138525k661353o300215k147281J964082
$$ plain form
5573 11303363 12061842 10724756 10508320 11019780 8254037 1969258 -3352772 -5650409 -7685172
5564 -7685172 -10589198 -10137063 -2856007 7244919 11980659 8353201 1768324 -637233
5556 -637233 2025435 4752211 4379169 4137365 8352040 14686733 16226653 11661129 8221482
5547 8221482 11677017 18026542 19954023 18220935 20206325 28125112 35348937 35648447
5539 35648447 30429788 24444972 19186229 14055197 10587264 11287085 15589005 19943466
5531 19943466 21187743 18203649 11887223 5405302 2632790 3908920 4860158 1941783
5523 1941783 -2332614 -2589148 2124882 7447699 9431463 7920160 4697176 2029034
5515 2029034 3138717 9641083 16935254 16548875 6396090 -4419853 -5219469 3493693
$$ packed form
5573A1303363P58479j337086k16436N11460k765743o284779n322030k297637k034763
5564g685172k904026M52135P281056J0100926M735740l627458o584877k405557
5556f37233K662668K726776l73042k41804M214675O334693J539920m565524l439647
5547H221482L455535O349525J927481j733088J985390P918787P223825K99510
5539C5648447n218659n984816n258743n131032l467933O99821M301920M354461
5531A9943466J244277k984094o316426o481921k772512J276130R51238k918375
5523A941783m274397k56534M714030N322817J983764j511303l222984k668142
5515B029034J109683O502366P294171l86379j0152785j0815943p99616Q713162
$$ plain form
5507 3493693 11149261 10288637 3997760 -518434 -985290 224363 2003044 5674115 11073275
5498 11073275 15540870 17842787 20245386 24848149 29570013 30103986 25577878 20353623
5490 20353623 19499411 23528016 28557309 31085217 31205039 30773221 29902118 26995739 21948596
5481 21948596 17223291 14752997 13230591 10002163 4818805 71169 -2237220 -2090113
5473 -2090113 -432284 1396088 1195885 -2614947 -8084490 -10455111 -7308318 -1224465
5465 -1224465 4265544 9259612 15275817 20005479 18323680 9197329 -1598734 -7209210
5457 -7209210 -6017645 -1027969 4498539 8503967 9349915 7018199 4554789 5104303 7280628
5448 7280628 6579366 2171484 -1045095 966048 5865428 8973140 10130155 12204083
$$ packed form
5507C493693P655568q60624o290877m516194m66856J209653J778681L671071N399160
5498A1073275M467595K301917K402599M602763M721864N33973m526108n224255
5490B0353623q54212M028605N029293K527908J19822m31818q71103k906379n047143
5481B1948596m725305k470294j522406l228428n183358m747636k308389J47107
5473b090113J657829J828372k00203l810832n469543k370621L146793O083853
5465a224465N490009M994068O016205M729662j681799r126351j0796063n610476
5457g209210J191565M989676N526508M005428Q45948k331716k463410N49514K176325
5448G280628p01262m407882l216579K011143M899380L107712J157015K073928
$$ plain form
5440 12204083 14327117 12278385 6300462 2910437 6025449 10644187 9390508 2343955
5432 2343955 -4037522 -5693767 -3947014 -1004537 2438345 5293260 6727113 9177249
5424 9177249 15645888 22754172 21992734 10929295 -1363829 -4148964 2828954 10984263
5416 10984263 13838187 11558709 6485444 -16217 -5539929 -6206413 -695013 7416544
5408 7416544 12961044 13619674 10340294 4883618 -1587549 -7769768 -11280946 -9844940
5400 -9844940 -4321409 558993 920647 -937649 724717 6079352 7622097 140870
5392 140870 -10715422 -14497482 -8744614 -864554 1921789 -627737 -5440179 -11355863
5384 -11355863 -18197263 -23986059 -26215825 -24862363 -22303101 -20394564 -18090221 -12075759
$$ packed form
5440A2204083K123034k048732n977923l390025L115012M618738j253679p046553
5432B343955o381477j656245J746753K942477L442882K854915J433853K450136
5424I177249O468639P108284p61438j1063439j2293124k785135O977918Q155309
5416A0984263K853924k279478n073265o501661n523712o66484N511400Q111557
5408G416544N544500O58630l279380n456676o471167o182219l511178J436006
5400i844940N523531M880402L61654j858296J662366N354635J542745p481227
5392A40870j0856292l782060N752868P880060K786343k549526m812442n915684
5384a1355863o841400n788796k229766J353462K559262J908537K304343O014462
$$ plain form
5376 -12075759 -870363 11225180 16704790 13363924 7573106 5971691 6924844 5109080
5368 5109080 1898115 3930757 11627308 16960321 14889149 10196755 9449650 11978657
5360 11978657 13167447 11943315 10320337 9219315 9078747 11058004 13316248 10040444
5352 10040444 -434035 -9993800 -9726745 -2459677 384453 -6417433 -16812378 -23142136
5344 -23142136 -24107444 -21722694 -16873635 -11156554 -8231073 -9306495 -10272554 -6861659
5336 -6861659 -614578 3346641 2802082 -421121 -4686405 -10395365 -16981921 -20751171
5328 -20751171 -17906120 -9404878 -1148546 1676437 -207135 -1936705 -1122272 -563040
5320 -563040 -3715150 -9752418 -14718334 -15617295 -11485120 -2653758 8075048 15188592
$$ packed form
5376a2075759J1205396J2095543N479610l340866n790818j601415R53153j815764
5368E109080l210965K032642P696551N333013k071172m692394p47105K529007
5360A1978657J188790j224132j622978j101022j40568J979257K258244l275804
5352A0040444j0474479r559765K67055P267068K844130o801886j0394945o329758
5344b3142136r65308K384750M849059N717081K925481j075422r66059L410895
5336f861659O247081L961219n44559l223203m265284n708960o586556l769250
5328b0751171K845051Q501242Q256332K824983j883572j729570Q14433N59232
5320e63040l152110o037268m965916q98961M132175Q831362J0728806P113544
$$ plain form
5312 15188592 15141873 10946939 9031767 11809881 16189811 18700515 18427655 15129543 8740989
5303 8740989 1692393 -2105922 -2089915 -1786947 -3691943 -6761311 -10001334 -14231449 -18055227
5294 -18055227 -16515868 -7664372 2692059 7267120 6404447 6477544 10275381 13610651
5286 13610651 11797949 5526730 -997577 -4924778 -6279701 -6541499 -7198682 -8805005
5278 -8805005 -10579616 -11274838 -10403989 -8193246 -5153935 -2761274 -3397622 -7678774 -12621708
5269 -12621708 -14833179 -15031680 -16502559 -18964219 -17457713 -8840091 3458277 13184753
5261 13184753 17366843 16374601 10585636 1035323 -7680502 -9805360 -4890988 1341247
5253 1341247 3929662 3609132 3379485 3519814 2984745 3148614 6038100 9972124 11219715
$$ packed form
5312A5188592m6719m194934j915172K778114M379930K510704k72860l298112o388554
5303H740989p048596l798315J6007L02968j904996l069368l240023m230115l823778
5294a8055227J539359Q851496J0356431M575061q62673P3097L797837L335270
5286A3610651j812702o271219o524307l927201j354923k61798o57183j606323
5278h805005j774611o95222Q70849K210743L039311K392661o36348m281152m942934
5269a2621708k211471j98501j470879k461660J506506Q617622J2298368R726476
5261A3184753M182090r92242n788965r550313q715825k124858M914372O232235
5253A341247K588415l20530k29647J40329n35069J63869K889486L934024J247591
$$ plain form
5244 11219715 9871619 9717272 11530093 11167364 6670153 2972186 5563574 12238647
5236 12238647 15728660 13263780 9074890 7665757 8776853 9562989 8052945 3478009
5228 3478009 -3443929 -9253914 -9908107 -5748540 -1550898 -341825 -560824 -1062861 -4423051
5219 -4423051 -11386355 -15983962 -12251721 -4112965 -1844261 -8107684 -13907831 -11017920
5211 -11017920 -2923110 873382 -2528592 -7858133 -10621347 -11733431 -12953508 -12854521
5203 -12854521 -9635275 -4950546 -2521385 -4145585 -8098244 -10147359 -5973740 4907891
5195 4907891 16783758 22217978 20608329 19330935 23873811 29981219 29717434 23083670
5187 23083670 18051394 19304993 22780289 23160241 21474421 21447874 21998731 18504396 10453584
$$ packed form
5244A1219715j348096j54347J812821l62729m497211l697967K591388O675073
5236A2238647L490013k464880m188890j409133J111096P86136j510044m574936
5228C478009o921938n809985o54193M159567M197642J209073k18999n02037l360190
5219d423051o963304m597607L732241Q138756K268704o263423n800147K889911
5211a1017920Q094810L796492l401974n329541k763214j112084j220077R8987
5203a2854521L219246M684729K429161j624200l952659k049115M173619J0881631
5195D907891J1875867N434220j609649j277394M542876O107408k63785o633764
5187B3083670n032276J253599L475296L79952j685820k6547N50857l494335q050812
$$ plain form
5178 10453584 3186506 1162831 2764270 3483105 2162887 1570975 3079997 3291444 -2128826
5169 -2128826 -12044109 -19939401 -21326924 -18590795 -16620179 -16421885 -16584456 -18555109 -24608053
5160 -24608053 -30913658 -29353646 -18543393 -7268535 -3317523 -3799611 -1124835 5557496
5152 5557496 10551097 10524587 7281889 2876584 -2428594 -7367980 -9582907 -9037663 -8280162
5143 -8280162 -9082660 -11048469 -12358750 -9529426 790938 15693823 24663710 20330330
5135 20330330 8812541 2766015 5204511 7743199 4931960 1648833 3629490 8547781
5127 8547781 11090361 11018633 11421898 13451558 16969775 22209090 26744315 25098628 15951504
5118 15951504 6018656 1979203 1754974 -1310983 -8445411 -14781795 -16619992 -14352001
$$ packed form
5178A0453584p267078k023675J601439P18835j320218n91912J509022K11447n420270
5169b128826r915283p895292j387523K736129J970616J98294j62571j970653o052944
5160b4608053o305605J560012J0810253J1274858L951012m82088K674776O682331
5152E557496M993601k6510l242698m405305n305178m939386k214927N45244P57501
5143h280162q02498j965809j310281K829324J0320364J4902885Q969887m333380
5135B0330330j1517789o046526K438496K538688k811239l283127J980657M918291
5127H547781K542580p1728M03265K029660L518217N239315M535225j645687r147124
5118A5951504r932848m039453k24229l065957p134428o336384j838197K267991
$$ plain form
5110 -14352001 -9652898 -4479053 -1776608 -2770719 -4268393 -2498016 1324225 3100371
5102 3100371 2497207 3300377 7484625 12778641 16237803 17097182 16065992 14430593 13610400
5093 13610400 13392281 11368977 6202902 201797 -3301501 -3245631 215194 6595317 11991622
5084 11991622 9670214 -1046006 -10432870 -9694305 -3627766 -3893439 -11452991 -15248044
5076 -15248044 -8963006 601958 4897923 4688057 5111331 6902131 8124264 9209000
5068 9209000 10879303 11564516 11675820 15606399 24075983 29373072 24909607 15573978 11077795
5059 11077795 11968014 10786597 5873749 4729749 12019531 22129217 26846098 24441838
5051 24441838 17980011 10112781 3373513 883902 2199595 1817631 -3883916 -11030652
$$ packed form
5110a4352001M699103N173845K702445r94111j497674J770377L822241J776146
5102C100371o03164Q03170M184248N294016L459162Q59379j031190j635399q20193
5093A3610400k18119k023304n166075o001105l503298N5870L460825O380123N396305
5084A1991622k321408j0716220r386864P38565O066539k65673p559552l795053
5076a5248044O285038R564964M295965k09866M23274J790800J222133J084736
5068I209000J670303O85213J11304L930579Q469584N297089m463465r335629m496183
5059A1077795Q90219j181417m912848j144000P289782J0109686M716881k404260
5051B4441838o461827p867230o739268k489611J315693l81964n701547p146736
$$ plain form
5043 -11030652 -13759854 -12608013 -12509513 -14435252 -14580318 -11185823 -6653709 -2533364 2219612
5034 2219612 6715748 7198715 3312601 814270 4337225 10621974 12792106 9057717
5026 9057717 3399203 -430371 -1409108 881169 6232931 11793407 14365633 15338973 19410040
5017 19410040 27245514 33087027 31594654 24210195 16541233 11650971 8308886 4429597
5009 4429597 -129101 -3829410 -5146991 -4209974 -3126252 -3748360 -4709397 -1937613 7067623
5000 7067623 20146685 31836672 36998778 33538138 23333722 10950339 348926 -7284635
4992 -7284635 -12059075 -13283189 -10661837 -6050537 -1432690 3493040 8861992 11822944
4984 11822944 10495620 9066884 13157629 20485834 22481840 16089594 7656085 3409774
$$ packed form
5043a1030652k729202J151841R8500j925739j45066L394495M532114M120345M752976
5034B219612M496136M82967l886114k498331L522955O284749K170132l734389
5026I057717n658514l829574r78737K290277N351762N560476K572226R73340M071067
5017A9410040P835474N841513j492373p384459p668962m890262l342085l879289
5009D429597m558698l700309j317581R37017J083722o22108r61037K771784R005236
5000G067623J3079062J1689987N162106l460640j0204416j2383383j0601413p633561
4992g284635m774440j224114K621352M611300M617847M925730N368952K960952
4984A1822944j327324j428736M090745P328205J996006o392246q433509m246311
$$ plain form
4976 3409774 2536037 2370499 3994092 8570067 13359092 15605973 16061668 15181342 10651531
4967 10651531 2432229 -4675400 -7452782 -8379690 -9734978 -9494872 -7427403 -8557821
4959 -8557821 -14836117 -20038455 -19713016 -19314249 -24122350 -27714037 -20894579 -7169821
4951 -7169821 2021128 4190889 6267105 10313085 11227038 8839142 10280196 17889750
4943 17889750 24822654 25608462 22617558 19575822 16592032 14017733 13894841 15337033
4935 15337033 15010658 13372856 13661074 14388154 10740996 3995765 987710 3191259 5187430
4926 5187430 5201590 7494009 12141148 12584993 7004776 2664017 4393164 7162221 4908211
4917 4908211 -582031 -3982567 -3130325 1767470 8901152 12475229 7069129 -3337556
$$ packed form
4976C409774q73737j65538J623593M575975M789025K246881M55695q80326m529811
4967A0651531q219302p107629k777382r26908j355288K40106K067469j130418
4959h557821o278296n202338L25439L98767m808101l591687O819458J3724758
4951g169821R190949K169761K076216M045980R13953k387896J441054P609554
4943A7889750O932904P85808k990904l041736k983790k574299j22892J442192
4935A5337033l26375j637802K88218P27080l647158o745231l008055K203549J996171
4926E187430J4160K292419M647139M43845n580217m340759J729147K769057k254010
4917D908211n490242l400536Q52242M897795P133682L574077n406100j0406685
$$ plain form
4909 -3337556 -8503898 -5844351 -2602216 -2827515 -2428936 643637 2342462 1724814 3114208
4900 3114208 5938190 4181618 -664346 1155830 11450959 20266917 22210892 22171100
4892 22171100 20792650 11251716 -3448693 -8142766 1532788 12142815 16550780 24223509
4884 24223509 37602950 42001697 32939399 28807837 39522577 48942941 47950126 54495577
4876 54495577 75954506 88799243 93702952 149617634 289676586 427886657 429260385
4869 429260385 278031513 104309075 24681168 23550983 23066967 3226702 -3390583
4862 -3390583 9305506 13518559 2196946 -3776179 1549551 2150777 -5521029 -7515529
4854 -7515529 -2398820 -4550495 -15672924 -21082823 -16706906 -14219612 -16820507 -14216474
$$ packed form
4909c337556n166342K659547L242135k25299L98579L072573J698825o17648J389394
4900C114208K823982j756572m845964J820176J0295129Q815958J943975l9792
4892B2171100j378450r540934j4700409m694073R675554J0610027M407965P672729
4884B4223509J3379441M398747r062298m131562J0714740R420364r92815O545451
4876E4495577K1458929J2844737M903709N5914682J40058952J38210071J373728
4869D29260385j51228872j73722438p9627907j130185m84016j9840265o617285
4862c390583J2696089M213053j1321613n973125N325730O01226p671806j994500
4854g515529N116709k151675j1122429n409899M375917K487294k600895K604033
$$ plain form
4846 -14216474 -5189744 -2015292 -7357570 -7961655 2558247 13698876 17059059 17670933
4838 17670933 19691982 17276097 7409159 -2377034 -6539094 -9352774 -13983790 -15926494
4830 -15926494 -13488801 -12934015 -16652441 -17375437 -10902299 -4132642 -3490681 -5094249 -3623638
4821 -3623638 -1960516 -4301020 -7286919 -5603660 -355626 4693205 9740874 15968311
4813 15968311 20957490 22230648 20860940 17710899 11294814 2980144 -1492541 314061
4805 314061 3835188 5046899 5718437 7402402 6786964 1933602 -2786289 -3267136 -1930453
4796 -1930453 -2167944 -1551439 3547335 10398712 12681469 8449020 1305974 -3875615 -3669896
4787 -3669896 1866550 7253941 6020235 -346486 -3241800 148459 1487968 -5882312
$$ packed form
4846a4216474R026730L174452n342278o04085J0519902J1140629L360183O11874
4838A7670933K021049k415885r866938r786193m162060k813680m631016j942704
4830a5926494K437693N54786l718426p22996O473138O769657O41961j603568J470611
4821c623638J663122k340504k985899J683259N248034N048831N047669O227437
4813A5968311M989179J273158j369708l150041o416085q314670m472685J806602
4805C14061L521127J211711O71538J683965o15438m853362m719891m80847J336683
4796a930453k37491O16505N098774O851377K282757m232449p143046n181589K05719
4787c669896N536446N387391j233706o366721k895314L390259J339509p370280
$$ plain form
4779 -5882312 -15158242 -14764829 -4794611 3398341 2508349 -2838632 -3458585 4349561 16257864
4770 16257864 23726573 21067731 11820324 6496801 10718022 17928186 18113378 11417485
4762 11417485 7441546 11748285 18988122 20832988 16148569 10601053 8728648 9418401
4754 9418401 9038157 6930102 5900321 7086502 6930504 2142443 -3792305 -3642433 3498475
4745 3498475 9838823 8577072 1846487 -3778200 -6024718 -7511591 -10149669 -12838645
4737 -12838645 -13683726 -11789608 -7713024 -3873744 -3092913 -5146372 -6441219 -4569641
4729 -4569641 -1309548 289759 -196612 -914959 -41856 3137364 7301771 8957412 6163101
4720 6163101 2457808 3119498 7165520 7913240 2434597 -4956895 -9975115 -12791445 -13065828
$$ packed form
4779e882312r275930L93413R970218Q192952q89992n346981o19953P808146J1908303
4770A6257864P468709k658842r247407n323523M221221P210164J85192o695893
4762A1417485l975939M306739P239837J844866m684419n547516j872405O89753
4754I418401l80244k108055j029781J186181j55998m788061n934748J49872P140908
4745C498475O340348j261751o730585n624687k246518j486873k638078k688976
4737a2838645q45081J894118M076584L839280P80831k053459j294847J871578
4729d569641L260093J599307m86371p18347Q73103L179220M164407J655641k794311
4720F163101l705293O61690M046022P47720n478643p391492n018220k816330k74383
$$ plain form
4711 -13065828 -8018526 344071 3328992 -3133899 -11301630 -12177082 -7630399 -4851066
4703 -4851066 -4309243 -2109290 42811 -2412116 -6203291 -2795899 8014056 16394128
4695 16394128 15971966 10987683 7841681 6758860 4774155 1136741 -3239195 -7275900
4687 -7275900 -8698768 -5608763 -366338 2200670 1174286 -225988 -897125 -2953016
4679 -2953016 -6002693 -6265162 -2900631 306393 1202894 1781558 3002869 3077546 2740237
4670 2740237 5675150 10909454 11494884 4704532 -2670677 -3793159 -721835 1233877
4662 1233877 2363213 5392410 8207627 6899901 2888327 257485 -1251663 -3848698
4654 -3848698 -5050628 -1123558 4707867 5998492 4552507 9117637 21141150 30617012
$$ packed form
4711a3065828N047302Q362597K984921o462891q167731q75452M546683K779333
4703d851066N41823K199953K152101k454927l791175L407392J0809955Q380072
4695A6394128m22162m984283l146002j082821j984705l637414m375936m036705
4687g275900j422868L090005N242425K567008j026384j400274o71137k055891
4679b953016l049677k62469L364531L207024Q96501N78664J221311P4677l37309
4670B740237K934913N234304N85430o790352p375209j122482L071324J955712
4662A233877J129336L029197K815217j307726m011574k630842j509148k597035
4654c848698j201930L927070N831425J290625j445985M565130J2023513R475862
$$ plain form
4646 30617012 29598145 22143167 16094560 11830768 5579984 -1262216 -3795654 -2073952
4638 -2073952 -688531 -709860 1400475 6473189 10316255 10349437 9351972 9996429 9766272
4629 9766272 4580225 -5122048 -14646969 -19398511 -17110775 -8666580 594710 3399351
4621 3399351 -1667046 -6881078 -4104447 4680241 10064050 7226904 -146832 -7535681
4613 -7535681 -14544421 -20479600 -21484251 -16220571 -9968204 -8724929 -12417366 -17640530
4605 -17640530 -23400311 -29304849 -31152258 -24384464 -11125801 920666 6057396 3645215
4597 3645215 -4170791 -12770280 -15008209 -7300236 4251378 9420631 5576805 -1658926
4589 -1658926 -8735426 -17452442 -26659910 -29122396 -20969895 -7909120 2597028 9725099
$$ packed form
4646C0617012j018867p454978o048607m263792o250784o842200k533438J721702
4638b073952J385421k1329K110335N072714L843066L3182r97465O44457k30157
4629I766272n186047r702273r524921m751542K287736Q444195R261290K804641
4621C399351n066397n214032K776631Q784688N383809k837146p373736p388849
4613g535681p008740n935179j004651N263680O252367J243275l692437n223164
4605a7640530n759781n904538j847409O767794J3258663J2046467N136730k412181
4597C645215p816006q599489k237929P707973J1551614N169253l843826p235731
4589a658926p076500q717016r207468k462486Q152501J3060775J0506148P128071
$$ plain form
4581 9725099 15087042 16154261 10836996 4545681 4976880 11531209 16429389 15181328
4573 15181328 9887572 3245024 -4060662 -9819636 -10481144 -6223545 -988853 3179625
4565 3179625 6844844 8165025 3865924 -3072567 -3931822 3521493 9598316 5121499
4557 5121499 -5597281 -11084529 -8781244 -6869400 -10774063 -15794131 -15223771 -9413812
4549 -9413812 -3164431 1286512 4421693 5667658 4068155 1463800 1066331 3177822
4541 3177822 5387434 6595550 7550814 7411271 3566534 -3799680 -10161166 -11681395 -9311616
4532 -9311616 -5722470 -780267 6534112 13418825 14863682 10213956 4360165 1210333
4524 1210333 -765671 -4565703 -9041670 -10242944 -7030884 -2448156 231464 480408
$$ packed form
4581I725099N361943J067219n317265o291315M31199O554329M898180j248061
4573A5181328n293756o642548p305686n758974o61508M257599N234692M168478
4565C179625L665219J320181m299101o938491q59255P453315O076823m476817
4557E121499j0718780n487248K303285J911844l904663n020068N70360N809959
4549i413812O249381M450943L135181J245965j599503k604355l97469K111491
4541C177822K209612J208116R55264j39543l844737p366214o361486j520229K369779
4532i311616L589146M942203P314379O884713J444857m649726n853791l149832
4524A210333j976004l800032m475967j201274L212060M582728K679620K48944
$$ plain form
4516 480408 -513146 -1677478 -2223544 -1679417 -749782 -1073938 -3210446 -5607473 -6431152
4507 -6431152 -5864637 -5687652 -6793825 -7852679 -6373794 -693293 8594093 18253354 23850767
4498 23850767 23248023 19292757 17564993 20185967 23090956 21349242 16238772 14001551
4490 14001551 17132494 20274367 17078306 8836567 3009032 4019294 8816468 11775718
4482 11775718 10900976 7983403 5158070 3357599 2847093 3298239 3662913 3155371 2055710
4473 2055710 826808 -818823 -2933256 -4097401 -2658649 739673 3063712 1852478
4465 1852478 -2230766 -6044259 -6714602 -3649780 1376157 5398926 6003447 3253067 436506
4456 436506 1758197 7976361 14871264 17585747 16187298 14787551 14789921 11773356 1061231
$$ packed form
4516D80408r93554j164332n46066N44127R29635l24156k136508k397027q23679
4507f431152N66515J76985j106173j058854J478885N680501R287386R659261N597413
4498B3850767o02744l955266j727764K620974K904989j741714n110470k237221
4490A4001551L130943L141873l196061q241739n827535J010262M797174K959250
4482A1775718q74742k917573k825333j800471n10506M51146L64674n07542j099661
4473B055710j228902j645631k114433j164145J438752L398322K324039j211234
4465A852478m083244l813493o70343L064822N025937M022769O04521k750380k816561
4456D36506J321691O218164O894903K714483j398449j399747K370l016565j0712125
$$ plain form
4447 1061231 -15415728 -30203267 -37235724 -35531199 -27333817 -15938257 -5506094 131328
4439 131328 177150 -2702040 -5146191 -5439477 -3694369 -1616381 -1765352 -4758999 -7224958
4430 -7224958 -4999920 1466731 7617516 11016025 13744303 17402693 19279568 16117798
4422 16117798 9255728 3116940 87433 -488827 563824 3302423 7167677 10636626
4414 10636626 12372682 11333580 6357905 -2483038 -12200660 -18229455 -18070965 -13197175
4406 -13197175 -7511510 -4204542 -3481453 -2911318 -519716 2539011 3490605 1924109 434187
4397 434187 1100400 3424617 5961849 7188123 4311723 -4656874 -15572668 -19247499
4389 -19247499 -11946007 -1650480 1067271 -3745231 -6999179 -4194874 -628043 -1637884
$$ packed form
4447A061231j6476959j4787539p032457J704525Q197382J1395560J0432163N637422
4439A31328M5822k879190k444151k93286J745108K077988j48971k993647k465959
4430g224958K225038O466651O150785L398509K728278L658390J876875l161770
4422A6117798o862070o138788l029507n76260J052651K738599L865254L468949
4414A0636626J736056j039102m975675q840943r717622o028795J58490M873790
4406a3197175N685665L306968P23089N70135K391602L058727R51594j566496j489922
4397D34187O66213K324217K537232J226274k876400q968597j0915794l674831
4389a9247499P301492J0295527K717751m812502l253948K804305L566831j009841
$$ plain form
4381 -1637884 -4239020 -2586324 2589149 5331585 3522547 1550343 3494056 7529227
4373 7529227 8945306 6375148 2616452 221340 -1059815 -1878980 -753236 3874793
4365 3874793 10096673 13817886 13813596 12881772 12948242 11671845 6074539 -2309333 -8605517
4356 -8605517 -10124843 -8411409 -6355323 -5658781 -7073198 -10696601 -15105189 -17594685
4348 -17594685 -16373322 -12362156 -8643509 -7908329 -9701693 -10235200 -6282878 507470
4340 507470 5013793 4870086 2963608 2692948 3528551 3117276 950504 -2523740 -7485369
4331 -7485369 -12175366 -11732190 -4204849 4180374 4921701 -2183091 -8966530 -8955740 -2813520
4322 -2813520 5938775 15029392 22067727 24277565 22251885 20631124 22914174 28027520
$$ packed form
4381a637884k601136J652696N175473K742436j809038j972204J943713M035171
4373G529227J416079k570158l758696k395112j281155q19165J125744M628029
4365C874793O221880L721213m290r31824O6470j276397n597306q383872o296184
4356h605517j519326J713434K056086O96542j414417l623403m408588k489496
4348a7594685J221363M011166L718647P35180j793364n33507L952322O790348
4340E07470M506323j43707j906478k70660Q35603m11275k166772l474244m961629
4331g485369m689997M43176P527341Q385223P41327p104792o783439J0790O142220
4322b813520Q752295R090617P038335K209838k025680j620761K283050N113346
$$ plain form
4314 28027520 32936461 35523084 34010270 27249212 17196311 7946369 1018305 -5044501
4306 -5044501 -9343999 -7396006 2079486 12712165 16194781 10533257 526846 -7722241
4298 -7722241 -10802293 -8777111 -4245364 343497 4722667 8468174 8249050 2196656
4290 2196656 -3598864 194056 13264387 24537884 26981911 26000159 28143524 29313125
4282 29313125 22351966 10665131 4356024 5488383 6861865 4634176 2752621 3759044
4274 3759044 3811287 -271568 -5811077 -9390174 -11630983 -13476999 -12463164 -6672181 752022
4265 752022 4676087 3786045 882058 -1130485 -1700571 -2161730 -3835404 -5820992 -4996166
4256 -4996166 130950 6318597 8835126 7248888 5182223 4844828 4966042 3742489 538332
$$ packed form
4314B8027520M908941K586623j512814o761058j0052901r249942o928064o062806
4306e044501m299498J947993R475492J0632679L482616n661524j0006411q249087
4298g722241l080052K025182M531747M588861M379170L745507k19124o052394
4290B196656n795520L792920J3070331J1273497K444027r81752K143365J169601
4282B9313125o961159j1686835o309107J132359J373482k227689j881555J006423
4274C759044N2243m082855n539509l579097k240809j846016J013835N790983P424203
4265G52022L924065q90042k903987k012543n70086m61159j673674j985588Q24826
4256d996166N127116O187647K516529j586238k066665l37395J21214j223553l204157
$$ plain form
4247 538332 -4816636 -10820029 -13168990 -9229640 -3174630 -1787928 -5433811 -8831838
4239 -8831838 -10770574 -15756647 -24012089 -27578027 -21189525 -11078580 -6915084 -8932875
4231 -8932875 -9335756 -4322130 1364312 1677774 -3592715 -9839141 -13025546 -12964142 -11997479
4222 -11997479 -10836611 -7007930 493013 6550662 4719056 -2947422 -6431116 -391790
4214 -391790 8842374 12050239 8013484 1741305 -3445100 -6797071 -6615202 -1733321 5011534
4205 5011534 9444978 11120740 12324597 13777786 14559271 14282040 12476995 8484708 4630520
4196 4630520 5510803 10450462 11368302 3317758 -7330796 -11497914 -9993792 -9983437 -12343342
4187 -12343342 -11664948 -7485402 -6028883 -9625696 -12480910 -9490454 -3322157 -354996
$$ packed form
4247E38332n354968o003393k348961L939350O055010J386702l645883l398027
4239h831838j938736m986073q255442l565938O388502J0110945M163496k017791
4231h932875m02881N013626N686442L13462n270489o246426l186405O1404R66663
4222a1997479J160868L828681P500943O057649j831606p666478l483694O039326
4214c91790R234164L207865m036755o272179n186405l351971J81869M881881O744855
4205E011534M433444J675762J203857J453189P81485k77231j805045l992287l854188
4196D630520Q80283M939659R17840q050544j0648554m167118J504122J0355k359905
4187a2343342O78394M179546J456519l596813k855214K990456O168297K967161
$$ plain form
4179 -354996 -3719883 -11394300 -17630286 -16583690 -8266752 297301 3477820 3677937 4991035
4170 4991035 4966462 58035 -5290954 -4673386 -1438892 -3502407 -8934525 -8832788 -3163959
4161 -3163959 -682803 -3400158 -4964464 -4899422 -9349412 -16164196 -15760670 -9898692 -11931249
4152 -11931249 -23781896 -31778405 -31690156 -36663080 -51123270 -60225053 -58484846 -63971057
4144 -63971057 -86582630 -110310892 -132118382 -186231534 -286357557 -365733387 -332906345
4137 -332906345 -189304414 -39237135 30582895 34967847 34552749 45157496 42182668
4130 42182668 22417012 11767787 20197967 29231483 26063947 19951078 19959304 20372798
4122 20372798 15046441 8329903 5059025 2955205 -51532 -1511720 -592167 558721
$$ packed form
4179c54996l364887p674417o235986J046596Q316938Q564053L180519K00117J313098
4170D991035k4573m908427n348989O17568L234494k063515n432118J01737N668829
4161c163959K481156k717355j564306O5042m449990o814784M03526N861978k032557
4152a1931249j1850647p996509Q8249m972924j4460190r101783J740207n486211
4144f3971057k2611573k3728262k1807490n4113152j00126023p9375830L2827042
4137c32906345J43601931J50067279O9820030M384952m15098J0604747k974828
4130D2182668j9765656j0649225Q430180R033516l167536o112869Q226M13494
4122B0372798n326357o716538l270878k103820l006737j460188R19553J150888
$$ plain form
4114 558721 2869939 9019203 16055177 18475146 18099417 21274324 27074726 28695907 26047890
4105 26047890 25708649 27959277 25690817 18069825 13614232 16360392 19895988 19430667
4097 19430667 19484473 24057076 28298412 26528906 21327672 18169815 16816703 14099546
4089 14099546 10532268 8579655 8090957 8075547 9495165 12237216 12878186 9539403 5858474
4080 5858474 6175496 9206061 10025763 6603899 1633781 -946413 229588 2461786 1290225
4071 1290225 -3853744 -7560956 -5251018 -121849 1749566 1371846 4813435 11812818
4063 11812818 14855211 11116379 6995991 7816602 10796744 11966204 12524615 13757226
4055 13757226 12715595 8274151 5143024 6396248 8146574 7361438 8475811 15159530
$$ packed form
4114E58721K311218O149264P035974K419969l75729L174907N800402J621181k648017
4105B6047890l39241K250628k268460p620992m455593K746160L535596m65321
4097A9430667N3806M572603M241336j769506n201234l157857j353112k717157
4089A4099546l567278j952613m88698j5410J419618K742051O40970l338783l680929
4080E858474L17022L030565Q19702l421864m970118k580194J176001K232198j171561
4071A290225n143969l707212K309938N129169J871415l77720L441589O999383
4063A1812818L042393l738832m120388Q20611K980142J169460N58411J232611
4055A3757226j041631m441444l131127J253224J750326p85136J114373O683719
$$ plain form
4047 15159530 21396087 19191164 10931990 5481061 5072793 4797112 2965204 2804703 4139500
4038 4139500 2005949 -5046805 -12243924 -15764158 -16554242 -15362049 -10001961 -426126
4030 -426126 8208962 10963880 8647005 5229532 2249313 -1228046 -4529953 -4681538 -707119
4021 -707119 3347698 2057537 -4602423 -10669194 -11898100 -11080555 -12336577 -13209248 -8248929
4012 -8248929 1457109 9861924 16431599 25824057 35871755 36744329 26467895 16368817
4004 16368817 14044596 11563419 425081 -11672504 -12290672 -5132364 -3853012 -8908533
3996 -8908533 -7466458 3476028 10665653 5629821 -2303391 -1031223 7607270 13934829
3988 13934829 14302298 10836875 4347889 -4338980 -10565770 -10373050 -5907211 -1618053
$$ packed form
4047A5159530O236557k204923q259174n450929m08268k75681j831908j60501J334797
4038D139500k133551p052754p197119l520234p90084J192193N360088R575835
4030d26126Q635088K754918k316875l417473k980219l477359l301907j51585L974419
4021g07119M054817j290161o659960o066771j228906Q17545j256022q72671M960319
4012h248929R706038Q404815O569675R392458J0047698Q72574j0276434j0099078
4004A6368817k324221k481177j1138338j2097585o18168P158308J279352n055521
3996h908533J442075J0942486P189625n035832p933212J272168Q638493O327559
3988A3934829L67469l465423o488986q686869o226790J92720M465839M289158
$$ plain form
3980 -1618053 1350797 3203159 2729738 936679 2389069 7598208 8687687 -1122072
3972 -1122072 -17025004 -27610796 -27759082 -21111097 -12593295 -5128286 -2397642 -7890002
3964 -7890002 -19830482 -31248867 -36059996 -32577418 -21981113 -7211069 6696649 15132035
3956 15132035 18068135 19444636 21652490 22483432 18383225 9527637 631674 -3526023
3948 -3526023 -3280417 -3684244 -7765375 -11730942 -9818835 -2935234 1946348 1461876 43604
3939 43604 2447755 6612227 7136162 2453156 -4743004 -11416127 -15378167 -15115015 -11627126
3930 -11627126 -8481744 -7537025 -6889106 -5134603 -4336871 -5819480 -6496516 -3215383 2195144
3921 2195144 6200508 9032835 12537473 15265410 14678746 12131211 10497164 8630133
$$ packed form
3980a618053K968850J852362m73421j793059J452390N209139J089479r809759
3972a122072j5902932j0585792j48286O647985Q517802P465009K730644n492360
3964g890002j1940480j1418385m811129L482578J0596305J4770044J3907718Q435386
3956A5132035K936100J376501K207854Q30942m100207q855588q895963m157697
3948c526023K45606m03827m081131l965567J912107O883601M881582m84472j418272
3939D3604K404151M164472N23935m683006p196160o673123l962040K63152L487889
3930a1627126L145382R44719O47919J754503P97732j482609o77036L281133N410527
3921B195144M005364K832327L504638K727937n86664k547535j634047j867031
$$ plain form
3913 8630133 3715710 -2242142 -4487499 -3711914 -5710594 -11800383 -15723637 -12607086
3905 -12607086 -5987626 -2532325 -3371927 -4430298 -3263174 -1832846 -2726582 -5262756
3897 -5262756 -6466286 -5126876 -3460351 -3612517 -3386528 1680162 11197195 18308168 17661863
3888 17661863 11973830 7217791 4122558 -782530 -7574547 -12205933 -13170905 -13313776
3880 -13313776 -14029612 -12804314 -8398890 -4020719 -2813023 -3670256 -3992054 -3478447 -2517698
3871 -2517698 425952 6488767 12914464 14775671 9802130 -25807 -10756095 -18895093
3863 -18895093 -22656171 -22520241 -20182670 -16082746 -8932460 1219708 10576386 14089486
3855 14089486 10431997 3310091 -2529833 -5854726 -8841797 -12730515 -14959439 -11941812
$$ packed form
3913H630133m914423n957852k245357P75585j998680o089789l923254L116551
3905a2607086O619460L455301q39602j058371J167124J430328q93736k536174
3897e262756j203530J339410J666525j52166K25989N066690R517033P110973o46305
3888A7661863n688033m756039l095233m905088o792017m631386r64972j42871
3880a3313776p15836J225298M405424M378171J207696q57233l21798N13607R60749
3871b517698K943650O062815O425697J861207m973541r827937j0730288q138998
3863a8895093l761078J35930K337571M099924P150286J0152168R356678L513100
3855A4089486l657489p121906n839924l324893k987071l888718k228924L017627
$$ plain form
3847 -11941812 -4069401 4121368 9059981 11177837 12087846 11548858 9237830 7106574
3839 7106574 7141675 8293081 8169065 6271754 3136638 -1620812 -7209979 -9826286 -7051693
3830 -7051693 -2404108 -850251 -1176195 1710603 7593228 10425629 7824541 4842533
3822 4842533 6087522 9465534 10495780 8196272 3865326 -1669348 -6662696 -8339117
3814 -8339117 -6894980 -5444440 -3538380 3766551 16568001 25869513 24579292 17671905
3806 17671905 14248053 13944725 10290833 4645447 5532856 13306240 16651526 8833858
3798 8833858 -1656595 -3101809 3740362 9445069 10322615 10320833 11201954 10024042 6646332
3789 6646332 5371250 6751235 4813899 -3815362 -13722717 -18087542 -17400721 -15498963
$$ packed form
3847a1941812P872411Q190769M938613K117856R10009n38988k311028k131256
3839G106574L5101J151406j24016j897311l135116m757450n589167k616307K774593
3830g051693M647585J553857l25944K886798N882625K832401k601088k982008
3822D842533J244989L378012J030246k299508m330946n534674m993348j676421
3814h339117J444137J450540J906060P304931J2801450R301512j290221o907387
3806A7671905l423852l03328l653892n645386Q87409P773384L345286p817668
3798H833858j0490453j445214O842171N704707Q77546j782Q81121j177912l377710
3789F646332j275082J379985j937336q629261r907355m364825O86821J901758
$$ plain form
3781 -15498963 -11286451 -1832755 8384844 9911210 1246833 -7952884 -9487413 -6126849
3773 -6126849 -4548165 -4704631 -2500882 825526 -286599 -5953853 -8917117 -3947675
3765 -3947675 5705196 13231541 15815423 15115345 13328933 11563285 10507732 10273660 9755213
3756 9755213 7193574 1515139 -6365227 -12801497 -13146405 -6254515 3277814 9362895
3748 9362895 10233182 7974997 3946435 -1451018 -5275318 -3573678 2304771 5620821
3740 5620821 2871408 -1487531 -2031952 -573065 -3071488 -10198324 -15518480 -13334933
3732 -13334933 -5182650 2523621 5500346 4974432 4510782 4732665 2882800 -1660017 -3787164
3723 -3787164 2076809 13802192 22745744 23976851 21388463 20811183 21897504 20020522
$$ packed form
3781a5498963M212512R453696J0217599J526366q664377r199717j534529L360564
3773f126849J578684j56466K203749L326408j112125n667254k963264M969442
3765c947675R652871P526345K583882p00078j786412j765648j055553k34072n18447
3756I755213k561639n678435p880366o436270l44908O891890R532329O085081
3748I362895Q70287k258185m028562n397453l824300J701640N878449L316050
3740E620821k749413m358939n44421J458887k498423p126836n320156K183547
3732a3334933Q152283P706271K976725n25914m63650K21883j849865m542817k127147
3723c787164N863973J1725383Q943552J231107k588388n77280J086321j876982
$$ plain form
3715 20020522 13497003 5226242 -1453276 -5285076 -6259340 -5141443 -3654084 -2961849
3707 -2961849 -2008295 1134516 6512420 12042393 15588739 16421690 15259299 13578107 12249367
3698 12249367 10704070 8503615 7314306 9163684 12836886 14816911 14143042 13129201
3690 13129201 12609880 10249370 4930531 -1016813 -5583991 -8878764 -9341673 -3500130
3682 -3500130 7151290 14491267 13882231 10990363 12541061 15048234 10735838 1440065
3674 1440065 -2872317 1180745 6442922 7151235 5937562 6076895 5087869 878214 -2477637
3665 -2477637 -1036475 1898978 1266981 -645106 2785756 12111694 20684286 23655218
3657 23655218 22548304 20170512 16153956 9755792 3228597 -655018 -2331241 -4035663
$$ packed form
3715B0020522o523519q270761o679518l831800r74264J117897J487359O92235
3707b961849R53554L142811N377904N529973L546346Q32951j162391j681192j328740
3698A2249367j545297k200455j189309J849378L673202J980025o73869j013841
3690A3129201n19321k360510n318839n947344m567178l294773m62909N841543
3682c500130J0651420P339977o09036k891868J550698K507173m312396r295773
3674A440065m312382M053062N262177P08313j213673J39333r89026m209655l355851
3665b477637J441162K935453o31997j912087L430862R325938Q572592K970932
3657B3655218j106914k377792m016556o398164o527195l883615j676223j704422
$$ plain form
3649 -4035663 -6099233 -7320572 -8154889 -10458259 -13811318 -15069616 -12822580 -9674339
3641 -9674339 -8133658 -6811958 -3775796 -1343071 -2776504 -5178448 -1648684 8330698
3633 8330698 16692133 17885333 16464267 18929898 23147972 22721070 18614664 18097869 22424405
3624 22424405 23630915 15978336 4367995 -2121842 -706563 4566940 9284059 11719381
3616 11719381 11346640 8088157 3077586 -1789520 -5270557 -7186658 -8009808 -8518541 -9344589
3607 -9344589 -10717603 -12818539 -15386610 -16273293 -12280852 -3377116 5618087 9953168
3599 9953168 9870371 8129864 5303258 1574841 503714 4944244 10423678 9339915 1984719
3590 1984719 -3351933 -2236969 1033404 2257550 3325899 5815115 6034042 1762161
$$ packed form
3649d035663k063570j221339q34317k303370l353059j258298K247036L148241
3641i674339J540681J321700L036162K432725j433433k401944L529764R979382
3633H330698Q361435J193200j421066K465631M218074m26902m106406n16795M326536
3624B2424405J206510p652579j1610341o489837J415279N273503M717119K435322
3616A1719381l72741l258483n010571m867106l481037j916101q23150n08733q26048
3607i344589j373014k100936k568071q86683L992441Q903736Q995203M335081
3599I953168q2797j740507k826606l728417j071127M440530N479434j083763p355196
3590A984719n336652J114964L270373J224146J068349K489216K18927m271881
$$ plain form
3582 1762161 -2430509 -2722542 -3194856 -8319768 -13291702 -10520894 -2679477 -6786 -5646887
3573 -5646887 -12603769 -15589684 -16990240 -19079042 -18938882 -15292099 -13251028 -16596238
3565 -16596238 -20335952 -17138128 -8275844 -2389689 -4686868 -12252453 -19400098 -23064613
3557 -23064613 -22600656 -18360576 -12070638 -6314780 -2495883 -606130 -818113 -3037198
3549 -3037198 -4838476 -2862211 2504783 6397123 5189047 854019 -2344643 -3370671
3541 -3370671 -3870586 -3915319 -2123041 401143 173265 -3801507 -8358457 -10233798 -8897503
3532 -8897503 -4722855 1952126 8457953 10414587 7226444 3590368 2952456 3159531 1750066
3523 1750066 1259698 4483237 8125058 7066658 2382500 -1012887 -2439427 -4365416
$$ packed form
3582A762161m192670k92033m72314n124912m971934K770808P841417K672691n640101
3573e646887o956882k985915j400556k088802J40160L646783K041071l345210
3565a6596238l739714L197824Q862284N886155k297179p565585p147645l664515
3557b3064613M63957M240080O289938N755858L818897J889753k11983k219085
3549c037198j801278J976265N366994L892340j208076m335028l198662j026028
3541c370671m99915m4733J792278K524184k27878l974772m556950j875341J336295
3532h897503M174648O674981O505827J956634l188143l636076o37912K07075j409465
3523A750066m90368L223539L641821j058400m684158l395387j426540j925989
$$ plain form
3515 -4365416 -5158110 -955310 5804828 8316294 6629463 8169426 15046275 19735558
3507 19735558 16834781 10618791 6498107 3391111 225879 1629064 9439804 15579037
3499 15579037 12388982 4906559 3516898 8294844 10424767 6703915 2459143 563772
3491 563772 -2675108 -9228391 -15180655 -17204451 -16716115 -15485603 -12784116 -8832401 -5947916
3482 -5947916 -4435968 -1992214 1274701 1857857 -1349578 -4462254 -3769774 -279039 2199638
3473 2199638 807303 -4694943 -10935268 -12130790 -6028987 2101184 5587896 5096999
3465 5096999 5905586 7969766 6004717 -517249 -5465124 -5801478 -5368460 -6156171 -3746645
3456 -3746645 3992527 10737800 10249482 5848380 5023441 8131537 8565309 2383676 -6878048
$$ packed form
3515d365416p92694M202800O760138K511466j686831J539963O876849M689283
3507A9735558k900777o215990m120684l106996l165232J403185P810740O139233
3499A5579037l190055p482423j389661M777946K129923l720852m244772j895371
3491E63772l238880o553283n952264k023796M88336J230512K701487L951715K884485
3482e947916J511948K443754L266915N83156l207435l112676O92480L490735K478677
3473B199638j392335n502246o240325j195522O101803Q130171L486712m90897
3465E096999Q08587K064180j965049o521966m947875l36354M33018p87711K409526
3456c746645P739172O745273m88318m401102q24939L108096M33772o181633r261724
$$ plain form
3447 -6878048 -11913372 -7491641 5175339 17750744 21600441 17414910 14115256 16232412
3439 16232412 18067112 13955422 7844076 6517631 8503247 7224317 1873184 -2389277
3431 -2389277 -3009122 -1686114 1078384 6080388 10884045 11882034 10416725 10462649 10895909
3422 10895909 7135207 253787 -3478346 -3185726 -5200873 -11607305 -15225309 -10945778
3414 -10945778 -5178012 -7391402 -16795795 -24352496 -25363528 -23143584 -20957574 -16925108
3406 -16925108 -8645950 1604790 8944425 11077937 9649933 7593935 6406937 5475981
3398 5475981 3254199 -847681 -5582001 -8968372 -10057016 -9215535 -6901198 -2992464
3390 -2992464 2067427 5965935 5959160 2729218 1493344 6593647 14867105 17598473 10709850
$$ packed form
3447f878048n035324M421731J2666980J2575405L849697m185531l299654K117156
3439A6232412J834700m111690o111346j326445J985616j278930n351133m262461
3431b389277o19845J323008K764498N002004M803657R97989j465309M5924M33260
3422A0895909l760702o881420l732133K92620k015147o406432l618004M279531
3414a0945778N767766k213390r404393p556701j011032K219944K186010M032466
3406a6925108Q279158J0250740P339635K133512j428004k055998j186998r30956
3398E475981k221782m101880m734320l386371j088644Q41481K314337L908734
3390b992464N059891L898508o775l229942j235874N100303Q273458K731368o888623
$$ plain form
3381 10709850 86801 -5934879 -6727296 -7960532 -11729708 -13540448 -9986107 -4607381
3373 -4607381 -3241200 -6175873 -7876470 -3679682 5052828 12286879 13227361 9142748
3365 9142748 5875127 6795399 8639225 6430247 1026917 -1870564 239381 3897338
3357 3897338 5542730 5570971 4827552 1657964 -4335249 -9219979 -9357931 -6648494 -5320411
3348 -5320411 -5481657 -3933525 -12059 3660864 5649165 6831997 7224787 5795365 3938656
3339 3938656 5107302 9693425 13718369 14121570 12130202 9673022 6015726 901362
3331 901362 -1942024 1348671 8569140 13094315 11787508 7935790 5853010 5924755 6428842
3322 6428842 7252334 9155629 11008665 10613062 7830204 4570882 1764659 -1381631 -4645633
$$ packed form
3381A0709850j0623049o021680p92417j233236l769176j810740L554341N378726
3373d607381J366181k934673j700597M196788Q732510P234051R40482m084613
3365I142748l267621R20272J843826k208978n403330k897481K109945L657957
3357C897338J645392K8241p43419l169588n993213m884730j37952K709437J328083
3348e320411j61246J548132L921466L672923J988301J182832L92790j429422j856709
3339C938656J168646M586123M024944M03201j991368k457180l657296n114364
3331I01362k843386L290695P220469M525175j306807l851718k082780P1745N04087
3322F428842Q23492J903295J853036l95603k782858l259322k806223l146290l264002
$$ plain form
3313 -4645633 -5511718 -2014595 4308748 9526215 10723891 7681763 2319695 -2318974
3305 -2318974 -3440545 -550714 3755993 5933913 4476162 549096 -3607720 -6339561
3297 -6339561 -7617559 -9300554 -13323665 -18697622 -21783108 -20870513 -18406474 -16263047
3289 -16263047 -11179384 590736 14885492 21347002 15129252 2638700 -6403175 -8529222
3281 -8529222 -5760350 -175692 5894901 7570254 1475602 -8605286 -15225991 -16357763
3273 -16357763 -16380293 -17991978 -18333124 -14549845 -8530010 -3793053 -1337296 -736724 -1731381
3264 -1731381 -2291012 1080253 7735673 10982925 6044330 -2506490 -5802326 -1567516
3256 -1567516 4566035 7363862 6636221 4098122 974641 -523204 1583037 4717450
$$ packed form
3313d645633q66085L497123O323343N217467J197676l042128n362068m638669
3305b318974j121571K889831M306707K177920j457751l927066m156816k731841
3297f339561j277998j682995m023111n373957l085486R12595K464039K143427
3289a6263047N083663J1770120J4294756O461510o217750j2490552r041875k126047
3281h529222K768872N584658O070593J675353o094652j0080888o620705j131772
3273a6357763k2530j611685l41146L783279O019835M736957K455757O00572r94657
3264a731381n59631L371265O655420L247252m938595q550820l295836M234810
3256a567516O133551K797827p27641k538099l123481j497845K106241L134413
$$ plain form
3248 4717450 3244410 -3550229 -9282939 -9045857 -6123684 -6614214 -10907175 -14924999 -17109258
3239 -17109258 -18923848 -19709132 -16506602 -9370727 -2117252 3556019 10692813 21618844
3231 21618844 32745830 37570034 33599146 24299848 14965004 8472096 4944130 3731176
3223 3731176 4280399 5277249 4843579 3373152 5047356 13254254 24078331 28290745 22079562
3214 22079562 12273362 7531411 7625958 6223707 1759195 -809022 1308923 4520689
3206 4520689 4676669 2135549 -606247 -2070857 -1107917 2868096 7554548 9624380 9837791
3197 9837791 11777201 14827508 14275417 9876458 7444266 9045407 9015940 4242252 896555
3188 896555 4516510 10221429 10773012 8402869 9208001 10736587 6306467 -1330230 -2940103
$$ packed form
3248D717450j473040o794639n732710K37082K922173m90530m292961m017824k184259
3239a7109258j814590p85284L202530P135875P253475N673271P136794J0926031
3231B1618844J1126986M824204l970888r299298r334844o492908l527966j212954
3223C731176N49223R96850m33670j470427J674204Q206898J0824077M212414o211183
3214B2079562r806200m741951R4547j402251m464512k568217K117945L211766
3206D520689J55980k541120k741796j464610R62940L976013M686452K069832K13411
3197I837791J939410L050307n52091m398959k432192J601141k9467m773688l345697
3188H96555L619955N704919N51583k370143Q05132J528586m430120p636697j609873
$$ plain form
3179 -2940103 1132712 399672 -8354797 -15087110 -11988676 -4082863 1154060 4737250
3171 4737250 9684138 12481243 9882359 7576852 12541576 21083467 23634190 18603787
3163 18603787 12861814 10403467 9023197 7323029 6642208 5634077 739461 -6414918
3155 -6414918 -8987671 -4531663 1293887 3204664 3200422 5837728 10953651 14739875 15148324
3146 15148324 13003958 9688038 6199092 3100410 -54555 -3522500 -4883000 -756015
3138 -756015 7341998 12155791 8818467 1694099 -461247 4633707 10081319 8369695
3130 8369695 194879 -6434929 -4774730 4024859 12700333 15701073 14611315 15338728
3122 15338728 20494302 25922464 25183869 16483843 4522451 -3971094 -6128407 -4865470
$$ packed form
3179b940103M072815p33040q754469o732313L098434P905813N236923L583190
3171D737250M946888K797105k598884k305507M964724Q541891K550723n030403
3163A8603787n741973k458347j380270j700168o80821j008131m894616p154379
3155f414918k572753M456008N825550J910777m242K637306N115923L786224M08449
3146A5148324k144366l315920l488946l098682l154965l467945j360500M126985
3138g56015Q098013M813793l337324p124368k155346N094954N447612j711624
3130H369695q174816o629808J660199Q799589Q675474L000740j089758P27413
3122A5338728N155574N428162p38595q700026j1961392q493545k157313J262937
$$ plain form
3114 -4865470 -5334739 -9427659 -14055836 -14947829 -11029238 -4176870 3823561 11809504 17514041
3105 17514041 18442726 15386235 12743518 13855256 17350440 19273562 17706430 14202478
3097 14202478 11496262 10680259 10050522 6370638 -1842889 -12038637 -19641067 -22341831
3089 -22341831 -21021718 -16773286 -9628997 -886125 6281361 10382893 13424160 17030558
3081 17030558 19087114 17122288 13086911 11031667 11028663 9495351 5506934 2435842 2088319
3072 2088319 1274957 -3245374 -9411694 -12552707 -11496875 -8861905 -6524331 -4099006
3064 -4099006 -1449689 553269 2162004 4868429 8609910 11159966 11186713 9854485 8528945
3055 8528945 7064825 5436095 4695410 4734112 3414815 9573 -2716216 -2453472 -1307613
$$ packed form
3114d865470m69269m092920m628177q91993L918591O852368Q000431P985943N704537
3105A7514041R28685l056491k642717J111738L495184J923122j567132l503952
3097A4202478k706216q16003o29737l679884q213527j0195748p602430k700764
3089b2341831J320113M248432P144289Q742872P167486M101532L041267L606398
3081A7030558K056556j964826m035377k055244l004j533312l988417l071092l47523
3072B088319q13362m520331o166320l141013J055832K634970K337574K425325
3064d099006K649317K002958J608735K706425L741481K550056K6747j332228j325540
3055H528945j464120j628730p40685L8702j319297l405242k725789K62744J145859
$$ plain form
3046 -1307613 -2558551 -5282248 -6349615 -6669276 -10389404 -17597118 -22988604 -23374712 -21618042
3037 -21618042 -20564011 -17845908 -10854428 -3271563 -1562097 -6746937 -14275690 -20905861
3029 -20905861 -27043924 -32569282 -34895351 -32064258 -24523718 -13432556 -441116 10531942
3021 10531942 15013426 12733698 7845548 3520874 -683612 -5229718 -8031919 -7530583
3013 -7530583 -5437645 -4133228 -3597954 -2923324 -2376809 -1518728 2331181 10491838 19221679
3004 19221679 22910054 20451132 15759705 12330739 9855481 6206631 475987 -6257084
2996 -6257084 -11468886 -12559691 -9490616 -5970976 -5950177 -8615109 -8883397 -3531766 5031428
2987 5031428 12059357 15655903 16959310 16554410 13514245 8424858 4833187 5573802 8745830
$$ packed form
3046a307613j250938k723697j067367l19661l720128p207714n391486l86108J756670
3037b1618042J054031K718103O991480P582865J709466n184840p528753o630171
3029b0905861o138063n525358k326069K831093P540540J1091162J2991440J0973058
3021A0531942M481484k279728m888150m324674m204486m546106k802201N01336
3013g530583K092938J304417N35274O74630N46515Q58081L849909Q160657Q729841
3004A9221679L688375k458922m691427l428966k475258l648850n730644o733071
2996f257084n211802j090805L069075L519640K0799k664932k68288N351631Q563194
2987E031428P027929L596546J303407m04900l040165n089387l591671P40615L172028
$$ plain form
2978 8745830 10005483 8924756 9865572 14768118 18152607 13158339 1183735 -9019681
2970 -9019681 -12031828 -11043255 -11265319 -12687124 -12081351 -8420400 -2911914 3374767 8577562
2961 8577562 9869833 8173223 9764115 17901996 25502505 22700459 10421286 -626338
2953 -626338 -4144627 -3539424 -2073004 2959250 11823249 16494807 10670272 336873
2945 336873 -3491699 785470 5908259 8171999 10455709 13239848 11736814 4508635
2937 4508635 -2493988 -4371800 -4035916 -6308111 -10009026 -10849891 -8900838 -8047971 -9692243
2928 -9692243 -11334336 -10541903 -6938067 -1281916 4224987 5831009 1896590 -3946659
2920 -3946659 -6444080 -4889458 -2546456 -914458 1295886 3633311 3121441 -446973
$$ packed form
2978H745830J259653j080727R40816M902546L384489m994268j1974604j0203416
2970i019681l012147R88573k22064j421805O05773L660951N508486O286681N202795
2961H577562J292271j696610J590892Q137881P600509k802046j2279173j1047624
2953f26338l518289O05203J466420N032254Q863999M671558n824535j0333399
2945C36873l828572M277169N122789K263740K283710K784139j503034p228179
2937D508635p002623j877812L35884k272195l700915q40865J949053Q52867j644272
2928i692243j642093P92433L603836N656151N506903J606022l934419n843249
2920c946659k497421J554622K343002J631998K210344K337425n11870l568414
$$ plain form
2912 -446973 -2338479 1537308 9412435 16145551 18797367 17822499 14900412 11978236 10796151
2903 10796151 10741048 8248228 1069385 -7175618 -9303708 -2195468 9244355 16375267
2895 16375267 14471687 6228850 -1251215 -2555584 2100057 7893785 9845862 6700249
2887 6700249 1509292 -1127163 739836 4351734 5417392 3834572 4002969 7796147
2879 7796147 10393729 7221129 2695238 5778202 16828022 25663438 24737117 17633626
2871 17633626 11010025 5043764 -1927577 -5045263 1828373 14687223 22008420 19264912
2863 19264912 13402847 11425121 11484437 8349864 2062127 -3115154 -5087969 -5621433 -7362144
2854 -7362144 -11397378 -16434393 -19490917 -19169568 -18223275 -20033067 -22704508 -20622643 -12375998
$$ packed form
2912d46973j891506L875787P875127O733116K651816r74868k922087k922176j182085
2903A0796151n5103k492820p178843q245003k128090P108240J1439823P130912
2895A6375267j903580q242837p480065j304369M655641N793728J952077l145613
2887F700249n190957k636455J866999L611898J065658j582820J68397L793178
2879G796147K597582l172600m525891L082964J1049820Q835416r26321p103491
2871A7633626o623601n966261o971341l117686O873636J2858850P321197k743508
2863A9264912n862065j977726N9316l134573o287737n177281j972815n33464j740711
2854g362144m035234n037015l056524L21349R46293j809792k671441K081865Q246645
$$ plain form
2845 -12375998 -2826570 3460246 5904733 4017798 -3729287 -14055283 -18400573 -13642295
2837 -13642295 -8256643 -11622703 -21140223 -26863213 -25923190 -24394979 -26020926 -27381146
2829 -27381146 -25237700 -21131315 -16257202 -8499592 1656954 7855432 5552591 -673968
2821 -673968 -2705626 460692 2892682 1584504 499027 3446091 7622353 7534882 2704056
2812 2704056 -2521521 -5936859 -9849132 -15264724 -17880280 -13549697 -5427085 -872360
2804 -872360 -1574453 -1716635 2693831 7456893 6220785 -780707 -8122804 -12947811 -16684540
2795 -16684540 -19808359 -19442272 -13409468 -4169335 2486741 1952935 -5399872 -13815211
2787 -13815211 -16727120 -13354946 -9436541 -9877515 -12933675 -14237569 -13924347 -15438120
$$ packed form
2845a2375998R549428O286816K444487j886935p747085j0325996m345290M758278
2837a3642295N385652l366060r517520n722990R40023J528211j625947j360220
2829b7381146K143446M106385M874113P757610J0156546O198478k302841o226559
2821f73968k031658L166318K431990j308178j085477K947064M176262q7471m830826
2812B704056n225577l415338l912273n415592k615556M330583Q122612M554725
2804h72360p02093j42182M410466M763062j236108p001492p342097m825007l736729
2795a6684540l123819L66087O032804R240133O656076n33806p352807q415339
2787a3815211k911909L372174L918405m40974l056160j303894L13222j513773
$$ plain form
2779 -15438120 -18772407 -20009477 -17634278 -14482801 -12324265 -8822612 -1873213 6362091
2771 6362091 12039274 13988083 13547111 11797198 8798352 4721336 669608 -1329724
2763 -1329724 418638 4830906 7633575 5375613 -646676 -6405465 -10113619 -12664460
2755 -12664460 -14283543 -14263602 -13548327 -13811030 -13960019 -11344586 -6594157 -3139346 -1298378
2746 -1298378 2826635 11155489 20173747 25237526 24960381 20187236 12460682 5045837
2738 5045837 1628856 2082479 2874244 2947461 5046564 9569837 11904896 8681386 2524967
2729 2524967 -2271733 -4779821 -5348868 -3044094 1218504 3249081 1321761 -654720
2721 -654720 208549 301104 -4388345 -10846002 -13432108 -12085682 -9963056 -6352333 719505
$$ packed form
2779a5438120l334287j237070K375199L151477K158536L501653O949399Q235304
2771F362091N677183J948809m40972j749913k998846m077016m051728j999332
2763a329724J748362M412268K802669k257962o022289n758789l708154k550841
2755a2664460j619083J9941P15275k62703j48989K615433M750429L454811J840968
2746a298378M125013Q328854R018258N063779k77145m773145p726554p414845
2738E045837l416981M53623P91765P3217K099103M523273K335059l223510o156419
2729B524967m796700k508088n69047K304774M262598K030577j927320j976481
2721f54720Q63269R2555m689449o457657k586106J346426K122626L610723P071838
$$ plain form
2712 719505 7206589 6491896 -515291 -6276685 -7688880 -8881489 -12263322 -14379802 -12896047
2703 -12896047 -10953187 -11486953 -12841572 -13261805 -14702277 -18619167 -22309500 -23122317 -22599930
2694 -22599930 -22746857 -21618636 -16859803 -11051389 -8892508 -10203779 -10022346 -5883000
2686 -5883000 -1724188 -3267161 -10979753 -18694964 -19107063 -10586721 1396312 9495854
2678 9495854 10442852 5796238 -1019941 -6400405 -7053755 -2319332 3910477 6227248 3034302
2669 3034302 -2914323 -8578328 -12648481 -14121242 -12048585 -6927661 60751 8701791
2661 8701791 17973011 23813760 22570960 16177333 9886394 5365743 547374 -4300105
2653 -4300105 -6253344 -6081669 -8553523 -14333383 -17500365 -14167114 -8335036 -5733462
$$ packed form
2712G19505O487084p14693p007187n761394j412195j192609l381833k116480J483755
2703a2896047J942860n33766j354619m20233j440472l916890l690333q12817N22387
2694b2599930j46927J128221M758833N808414K158881j311271J81433M139346
2686e883000M158812j542973p712592p715211m12099Q520342J1983033Q099542
2678I495854R46998m646614o816179n380464o53350M734423O229809K316771l192946
2669C034302n948625n664005m070153j472761K072657N120924O988412Q641040
2661H701791R271220N840749j242800o393627o290939m520651m818369m847479
2653d300105j953239J71675k471854n779860l166982L333251N832078K601574
$$ plain form
2645 -5733462 -6560498 -7974383 -9246462 -10333080 -9458618 -6585972 -5694261 -8992125 -12010416
2636 -12010416 -9182974 -1745207 4354033 5957520 3887498 -586096 -5625745 -7454153
2628 -7454153 -4074264 1310921 4951699 8368113 14695651 21708133 24332862 22317225
2620 22317225 19038928 13886631 3008543 -11935984 -22633352 -23508155 -16822064 -7073586
2612 -7073586 3827204 13653302 18164080 16348120 13206589 13162911 13634145 9205341 202006
2603 202006 -7042438 -7988467 -4602881 -1652828 -579081 1331426 6241829 12129013 15336319
2594 15336319 15734402 16327948 17365053 14984241 8236861 3346572 6296712 13838581
2586 13838581 17332351 14098664 9368095 7797026 9162227 12584778 18475900 24572198
$$ packed form
2645e733462q27036j413885j272079j086618Q74462K872646Q91711l297864l018291
2636a2010416K827442P437767O099240J603487k070022m473594n039649j828408
2628g454153L379889N385185L640778L416414O327538P012482K624729k015637
2620B2317225l278297n152297j0878088j4944527j0697368q74803O686091R748478
2612g073586J0900790R826098M510778j815960l141531m3678M71234m428804r003335
2603B02006p244444r46029L385586K950053J073747J910507M910403N887184L207306
2594A5336319L98083N93546J037105k380812o747380m890289K950140P541869
2586A3838581L493770l233687m730569j571069J365201L422551N891122O096298
$$ plain form
2578 24572198 25841880 21001823 14721983 11258862 10130759 9695450 9968448 9622286 5520616
2569 5520616 -1448776 -4924054 -1394130 4066739 4270596 -1569577 -9373448 -15955917
2561 -15955917 -18885995 -15056568 -5330273 2585414 2392402 -1545779 418510 9633652
2553 9633652 17460636 17323819 12154812 8225251 6912827 5375371 1813138 -2842231
2545 -2842231 -6645669 -8181104 -7532097 -6595684 -7438076 -10137678 -13119433 -14906367 -14207684
2536 -14207684 -9579490 -1235863 7712106 13952448 16729492 15897632 9784116 -950736
2528 -950736 -9249261 -7230286 3691268 13162921 13562617 7157388 749703 -1884888
2520 -1884888 -236986 5202246 11692867 14215497 10802017 5923304 5210556 8476111
$$ packed form
2578B4572198J269682m840057o279840l463121j128103m35309K72998l46162m101670
2569E520616o969392l475278L529924N460869K03857n840173p803871o582469
2561a5955917k930078L829427R726295P915687j93012l938181J964289R215142
2553I633652P826984j36817n169007l929561j312424j537456l562233m655369
2545b842231l803438j535435O49007R36413q42392k699602k981755j786934O98683
2536a4207684M628194Q343627Q947969O240342K777044q31860o113516j0734852
2528i50736q298525K018975J0921554R471653L99696o405229o407685k634591
2520a884888J647902N439232O490621K522630l413480m878713p12748L265555
$$ plain form
2512 8476111 10993695 9983066 6572427 2767073 -21103 -365844 1650194 2716735
2504 2716735 -343982 -5496924 -7457276 -5373298 -4717291 -9661445 -16718670 -18675924
2496 -18675924 -12868939 -2907523 6237733 11771192 12545464 8670962 2658004 -1472751
2488 -1472751 -1649194 874810 4062894 7198224 9658858 9854665 7306186 4279093 3128090
2479 3128090 2851850 405080 -5052277 -11116459 -14849528 -14699364 -10522312 -4061939 1175398
2470 1175398 3207335 4378091 7967220 12386607 12452701 6745283 -267036 -4252399 -4936397
2461 -4936397 -2890460 2407976 8700626 10340519 5693186 807073 979534 2780257
2453 2780257 318741 -4080590 -2804147 5142572 12703746 15180724 15021273 15378047 15620356
$$ packed form
2512H476111K517584j010629l410639l805354k788176l44741K016038J066541
2504B716735l060717n152942j960352K083978O56007m944154p057225j957254
2496a8675924N806985R961416R145256N533459P74272l874502o012958m130755
2488a472751j76443K524004L188084L135330K460634J95807k548479l027093j151003
2479C128090k76240k446770n457357o064182l733069J50164M177052O460373N237337
2470A175398K031937J170756L589129M419387O6094n707418p012319l985363o83998
2461d936397K045937N298436O292650J639893m647333m886113J72461J800723
2453B780257k461516m399331J276443P946719P561174K476978j59451L56774K42309
$$ plain form
2444 15620356 15005194 14631989 13418393 7808660 -1813773 -9703632 -12640065 -14097853
2436 -14097853 -17318052 -19444357 -16710517 -10845209 -5699428 -1563654 2322717 3514085
2428 3514085 204216 -3850291 -4261833 -3482175 -7165015 -14866866 -20886641 -23248963 -24830039
2419 -24830039 -25600205 -21266104 -11504477 -2794465 198145 649276 3374627 7300488
2411 7300488 8501326 7225142 7007090 8599374 9072519 6226019 694184 -5584811 -10163795
2402 -10163795 -10216286 -4977187 2132775 6541726 7844905 9846394 15159745 21923091
2394 21923091 26223365 25816368 20961882 13427067 5450061 -1709950 -8802187 -16838076
2386 -16838076 -23954420 -26019648 -21746796 -15682930 -14012202 -17658893 -21193864 -18944608
$$ packed form
2444A5620356o15162l73205j213596n609733r622433p889859k936433j457788
2436a4097853l220199k126305K733840N865308N145781M135774L886371J191368
2428C514085l309869m054507m11542P79658l682840p701851o019775k362322j581076
2419b4830039p70166M334101R761627Q710012K992610M51131K725351L925861
2411G300488J200838j276184k18052J592284M73145k846500n531835o278995m578984
2402a0163795n2491N239099P109962M408951J303179K001489N313351O763346
2394B1923091M300274m06997m854486p534815p977006p160011p092237q035889
2386a6838076p116344k065228M272852O063866J670728l646691l534971K249256
$$ plain form
2378 -18944608 -11316795 -4674687 -5169681 -12631851 -20622704 -23046804 -20369445 -17748376
2370 -17748376 -17044443 -13814298 -4439942 6605331 10911873 6515122 -634459 -5602429
2362 -5602429 -9216088 -12067187 -10080781 -1137382 8224501 9399957 3273945 -1195584
2354 -1195584 507580 3719391 3126003 -330248 -3363899 -5388725 -6005361 -2224209 6934889
$$ packed form
2378a8944608P627813O642108m94994p462170p990853k424100K677359K621069
2370a7748376P03933L230145R374356J1045273M306542m396751p149581m967970
2362e602429l613659k851099J986406Q943399R361883J175456o126012m469529
2354a195584J703164L211811n93388l456251l033651k024826o16636L781152R159098
$$ [...]
##END NTUPLES=NMR SPECTRUM
##END=
