##TITLE=31P_DE-80H_X3
 64 sc D2O
 26.2.2025
##JCAMPDX= 6.0         $$ Bruker NMR JCAMP-DX V2.0
##DATA TYPE= NMR SPECTRUM
##DATA CLASS= NTUPLES
##ORIGIN= UXNMR, Bruker Analytische Messtechnik GmbH
##OWNER= root
$$ XWIN-NMR		Version 3.5
$$ Tue Sep 16 11:22:37 2025 Russian Standard Time (UT+4h)  Yarkov@DPX200
##.OBSERVE FREQUENCY= 81.013821
##.OBSERVE NUCLEUS= ^31P
##.ACQUISITION MODE= SIMULTANEOUS
##.ACQUISITION SCHEME= undefined
##.AVERAGES= 64
##.DIGITISER RES= 17
##SPECTROMETER/DATA SYSTEM= spect
##.PULSE SEQUENCE= zgpg30
##.SOLVENT NAME= D2O
##.SHIFT REFERENCE= (INTERNAL, D2O, 0, 198.062)
##AUDIT TRAIL= $$ (NUMBER, WHEN, WHO, WHERE, WHAT)
$$ ##TITLE= Audit trail, XWIN-NMR		Version 3.5
$$ ##JCAMPDX= 5.01
$$ ##ORIGIN= Bruker BioSpin GmbH
$$ ##OWNER= Yarkov
$$ C:/Bruker/XWIN-NMR/data/yarkov2/nmr/P31/2/pdata/1/auditp.txt
$$ ##AUDIT TRAIL=  $$ (NUMBER, WHEN, WHO, WHERE, WHAT)
(   1,<2025-09-16 11:20:43.32 +0400>,<Yarkov>,<DPX200>,
      <created by zg, POWCHK disabled, PULCHK disabled
       configuration hash MD5:
       00 E9 B6 7A A2 85 ED C7 34 08 36 98 17 FE 4E 26
       data hash MD5: 32K
       C6 2F FD 12 60 8E 28 C6 D4 7B 6D 20 EC DE 55 D7>)
(   2,<2025-09-16 11:21:49.89 +0400>,<Yarkov>,<DPX200>,
      <Start of raw data processing
       efp BC_mod = 2 LB = 1.5 FT_mod = 6 PKNL = 1 PHC0 = 1575.216 PHC1 = 59.55953 SI = 64K 
       data hash MD5: 64K
       40 B0 77 D6 A9 C7 87 34 67 D9 63 59 8B 81 EB F5>)
(   3,<2025-09-16 11:22:10.78 +0400>,<Yarkov>,<DPX200>,
      <pk PHC0 = 103.5575 PHC1 = -35.40001 
       data hash MD5: 64K
       BB 9C E9 C2 01 B9 BF 35 95 52 4B 34 4F 8E F1 81>)
$$ ##END=
$$ 
$$ hash MD5
$$ AC DA E4 E8 EB BF 75 59 14 71 56 4D 80 2C EE 5A
##$RELAX= 
##$RELAX= 
##$RELAX= 
##$RELAX= 
##$RELAX= 
##$RELAX= 
##$RELAX= 
##$RELAX= 
$$ Bruker specific parameters
$$ --------------------------
##$DU= <C:/Bruker/XWIN-NMR>
##$EXPNO= 2
##$NAME= <P31>
##$PROCNO= 1
##$TYPE= <nmr>
##$USER= <yarkov2>
##$AMP= (0..31)
100 100 100 100 100 100 100 100 100 100 100 100 100 100 100 100 100 100 
100 100 100 100 100 100 100 100 100 100 100 100 100 100 
##$AQSEQ= 0
##$AQ_mod= 1
##$AUNM= <au_zg>
##$AUTOPOS= <>
##$BF1= 81.014009
##$BF2= 200.13
##$BF3= 200.13
##$BF4= 200.13
##$BF5= 200.13
##$BF6= 200.13
##$BF7= 200.13
##$BF8= 200.13
##$BYTORDA= 1
##$CFDGTYP= 0
##$CFRGTYP= 5
##$CHEMSTR= <none>
##$CNST= (0..31)
1 1 145 1 1 1 1 1 1 1 1 1 1 1 1 1 1 1 1 1 1 1 1 1 1 1 1 1 1 1 1 1 
##$CPDPRG= <waltz16>
##$CPDPRG1= <>
##$CPDPRG2= <waltz16>
##$CPDPRG3= <>
##$CPDPRG4= <mlev>
##$CPDPRG5= <mlev>
##$CPDPRG6= <mlev>
##$CPDPRG7= <mlev>
##$CPDPRG8= <mlev>
##$CPDPRGB= <>
##$CPDPRGT= <>
##$D= (0..31)
0 1 0 0 0 0 0 0 0 0.06 0 0.03 2e-05 3e-06 0 0 0.0002 0 0 0 0 0 0 0 0 0 
0 0 0 0 0 0 
##$DATE= 1758007242
##$DBL= (0..7)
120 120 120 11 120 120 24 19 
##$DBP= (0..7)
150 150 150 150 150 150 150 150 
##$DBP07= 0
##$DBPNAM0= <>
##$DBPNAM1= <>
##$DBPNAM2= <>
##$DBPNAM3= <>
##$DBPNAM4= <>
##$DBPNAM5= <>
##$DBPNAM6= <>
##$DBPNAM7= <>
##$DBPOAL= (0..7)
$$ [...]
##$SUBNAM2= <"">
##$SUBNAM3= <"">
##$SUBNAM4= <"">
##$SUBNAM5= <"">
##$SUBNAM6= <"">
##$SUBNAM7= <"">
##$SUBNAM8= <"">
##$SUBNAM9= <"">
##$SW= 400.765351723535
##$SWIBOX= (0..15)
0 1 3 0 0 0 0 0 0 0 0 0 0 0 0 0 
##$SW_h= 32467.5324675325
##$TD= 32768
##$TD0= 1
##$TE= 0
##$TE2= 300
##$TE3= 300
##$TEG= 300
##$TL= (0..7)
0 120 53 12 22 120 120 120 
##$TP= (0..7)
150 150 150 150 150 150 150 150 
##$TP07= 0
##$TPNAME0= <>
##$TPNAME1= <>
##$TPNAME2= <>
##$TPNAME3= <>
##$TPNAME4= <>
##$TPNAME5= <>
##$TPNAME6= <>
##$TPNAME7= <>
##$TPOAL= (0..7)
0.5 0.5 0.5 0.5 0.5 0.5 0.5 0.5 
##$TPOFFS= (0..7)
0 0 0 0 0 0 0 0 
##$TUNHIN= 0
##$TUNHOUT= 0
##$TUNXOUT= 0
##$USERA1= <user>
##$USERA2= <user>
##$USERA3= <user>
##$USERA4= <user>
##$USERA5= <user>
##$V9= 5
##$VALIST= <valist>
##$VCLIST= <CCCCCCCCCCCCCCC>
##$VD= 0
##$VDLIST= <DDDDDDDDDDDDDDD>
##$VPLIST= <PPPPPPPPPPPPPPP>
##$VTLIST= <TTTTTTTTTTTTTTT>
##$WBST= 1024
##$WBSW= 4
##$XGAIN= (0..3)
0 0 0 0 
##$XL= 0
##$YL= 0
##$YMAX_a= 1497
##$YMIN_a= -1533
##$ZGOPTNS= <>
##$ZL1= 120
##$ZL2= 120
##$ZL3= 120
##$ZL4= 120
##$ABSF1= 0
##$ABSF2= 0
##$ABSG= 0
##$ABSL= 0
##$ALPHA= 0
##$AQORDER= 0
##$ASSFAC= 0
##$ASSFACI= 0
##$ASSFACX= 0
##$ASSWID= 0
##$AUNMP= <proc_1d>
##$AZFE= 0.1
##$AZFW= 0.5
##$BCFW= 0
##$BC_mod= 2
##$BYTORDP= 0
##$COROFFS= 0
##$CY= -3
##$DATMOD= 1
##$DC= 0
##$DFILT= <>
##$DTYPP= 0
##$F1P= 0
##$F2P= 0
##$FCOR= 1
##$FTSIZE= 65536
##$FT_mod= 6
##$GAMMA= 0
##$GB= 0
##$INTBC= 1
##$INTSCL= 9.790993e-09
##$ISEN= 30
##$LB= 1.5
##$LEV0= 0
##$LPBIN= 0
##$MAXI= 10000
##$MC2= 0
##$MEAN= 0
##$ME_mod= 0
##$MI= 50
##$NCOEF= 0
##$NC_proc= -8
##$NLEV= 6
##$NOISF1= 182.463
##$NOISF2= 159.3651
##$NSP= 0
##$NTH_PI= 0
##$NZP= 0
##$OFFSET= 198.0616
##$PC= 4
##$PHC0= 1678.773
##$PHC1= 24.15952
##$PH_mod= 1
##$PKNL= yes
##$PPARMOD= 0
##$PSCAL= 0
##$PSIGN= 0
##$REVERSE= no
##$SF= 81.0140089999434
##$SI= 65536
##$SIGF1= 159.3651
##$SIGF2= -187.1042
##$SINO= 113.3802
##$SIOLD= 16384
##$SREGLST= <1H.CDCl3>
##$SSB= 0
##$STSI= 65536
##$STSR= 0
##$SW_p= 32467.5324675325
##$SYMM= 0
##$S_DEV= 0
##$TDeff= 32768
##$TDoff= 0
##$TI= <>
##$TILT= no
##$TM1= 0
##$TM2= 0
##$TOPLEV= 0
##$USERP1= <user>
##$USERP2= <user>
##$USERP3= <user>
##$USERP4= <user>
##$USERP5= <user>
##$WDW= 1
##$XDIM= 65536
##$YMAX_p= 309685150
##$YMIN_p= -7036413
$$ End of Bruker specific parameters
$$ ---------------------------------
##NTUPLES= NMR SPECTRUM
##VAR_NAME=  FREQUENCY,     SPECTRUM/REAL,   SPECTRUM/IMAG
##SYMBOL=    X,             R,               I
##VAR_TYPE=  INDEPENDENT,   DEPENDENT,       DEPENDENT
##VAR_FORM=  AFFN,          ASDF,            ASDF
##VAR_DIM=   65536,         65536,           65536
##UNITS=     HZ,            ARBITRARY UNITS, ARBITRARY UNITS
##FACTOR=    0.49542278885378, 1,            1
##FIRST=     16045.7642231865, 0,            0
##LAST=      -16421.768244346, 0,            0
##MIN=       -16421.768244346, -7036413,     0
##MAX=       16045.7642231865, 309685150,    0
$$ Real data points
##PAGE= N=1
##DATA TABLE= (X++(R..R)), XYDATA
$$ [...]
43573 -93474 -119990 -246741 -343067 -298202 -165548 -58408 435 36289 16100 -96608 -231472
43562 -231472 -281464 -262081 -278885 -341129 -339512 -240056 -172367 -249145 -389163 -416269 -286226
43551 -286226 -121604 -37205 -15397 29169 121221 198989 196901 125563 62363 68858 130229 185294
43539 185294 201812 198791 204176 224988 259449 300972 322452 294768 232854 183439 152689 95102
43527 95102 1719 -55361 -19618 47129 25280 -112403 -271609 -354963 -352102 -305410 -247147
43516 -247147 -198685 -183739 -197490 -185237 -94542 53626 173730 197323 128326 21962 -64815
43505 -64815 -96662 -64677 3058 46181 21254 -42545 -60052 18758 147224 229434 218102
43494 218102 145247 66886 6528 -45873 -105459 -172116 -224778 -235698 -203546 -163667 -145348
43483 -145348 -132340 -96421 -55817 -54513 -86722 -93188 -41123 38982 102398 121408 60856 -102901
43471 -102901 -306134 -413024 -360734 -236338 -160825 -154491 -171825 -199955 -239018 -242047 -177616
43460 -177616 -118478 -161431 -277458 -348196 -340088 -325297 -326693 -274930 -158653 -91801 -157201
43449 -157201 -275936 -312433 -239984 -126651 -19267 75547 139501 154889 147419 155907 181975
43438 181975 216508 276495 357998 393311 324186 186989 57638 -53308 -169500 -243618 -190116
43427 -190116 -30405 92984 83497 -129 -43139 -26966 -31206 -113414 -233025 -292157 -231435
43416 -231435 -84608 57815 136637 161211 157964 121869 48533 -24931 -61034 -77165 -107639
43405 -107639 -138180 -139535 -136829 -166023 -184567 -127036 -46598 -81940 -250986 -392337 -372569
43394 -372569 -250245 -155825 -105519 -45267 -6332 -73032 -213224 -279093 -206151 -104275 -100761
43383 -100761 -172832 -198501 -122399 -6340 59660 37772 -61036 -207477 -357607 -451932 -445464
43372 -445464 -349377 -229902 -151785 -128066 -137266 -171439 -227645 -255533 -174464 21322 216735
43361 216735 282501 204495 68055 -54509 -146269 -201316 -210119 -191718 -182828 -187895 -186561 -185855
43349 -185855 -207204 -225929 -195399 -137089 -123949 -153566 -130455 -19909 72109 43797 -56770
43338 -56770 -119075 -134679 -163007 -180836 -101480 59976 169607 150046 63896 -14013 -98982
43327 -98982 -211328 -287179 -264107 -195115 -187577 -261370 -342375 -372016 -355312 -319038 -284049 -265060
43315 -265060 -247481 -188173 -89130 -30095 -57008 -79917 18687 196658 291043 249342 197198
43304 197198 238580 309749 300766 216475 122578 16048 -134226 -268408 -281400 -175812 -63068
43293 -63068 -8182 31861 103126 182546 242470 304510 378564 408793 339995 206572 106616
43282 106616 100236 161140 213901 200930 131204 75504 90535 141341 136304 53669 -14083 23606
43270 23606 135504 213718 213001 188709 203474 253605 302465 338934 368497 371945 315429 204489
43258 204489 96934 43625 33385 19103 -15523 -52478 -99156 -194103 -322721 -382067 -293094
43247 -293094 -117442 11917 62129 116088 210944 261631 193896 72347 22700 74537 148895
43236 148895 164929 92718 -66274 -273799 -442807 -501694 -471585 -428348 -400625 -364206 -319591
43225 -319591 -295682 -275208 -200335 -74922 12898 2655 -67808 -136218 -193463 -242246 -243074 -165894
43213 -165894 -49343 57664 172536 319107 422741 369019 179171 31266 57480 187255
43203 187255 255823 222330 195234 248279 303326 246216 104730 32987 119877 278665 354291
43192 354291 291564 154612 18503 -92090 -164642 -170218 -102274 -3583 74524 116246 129791
43181 129791 123122 110464 110452 112309 73566 -19769 -118689 -169215 -179020 -190169 -211142 -220947 -221825
43168 -221825 -235215 -250574 -228593 -160060 -79621 -17524 19915 18084 -46750 -156511 -242591
43157 -242591 -256026 -217463 -177073 -157676 -163162 -208802 -300801 -399246 -439988 -396919 -301999 -202574
43145 -202574 -114793 -25322 64670 107281 44907 -100910 -207010 -168202 -33604 39415 -20754
43134 -20754 -121333 -148355 -108006 -65086 -17752 65878 131719 82810 -61916 -165663 -157868
43123 -157868 -119153 -136443 -166575 -118007 -1845 85790 98519 76210 58496 32880 -21028
43112 -21028 -82989 -104458 -52357 54789 143087 139535 52670 -32013 -59445 -65948 -100734 -143053
43100 -143053 -155921 -166100 -203454 -203289 -83359 94055 163296 81200 -9910 5723 60454
43089 60454 41280 -17161 2537 101447 161098 127181 79066 95744 146899 158581 122029 90061
43077 90061 101400 145252 181359 173317 117670 54007 36061 89872 206772 358522 492952
43066 492952 536690 451666 288501 140976 47350 -18045 -58257 -25988 91271 217004 262459
43055 262459 220915 142598 51468 -55146 -143056 -147993 -64829 18745 13808 -65301 -121403 -94721
43043 -94721 -31186 -17586 -72370 -131506 -136860 -99675 -61253 -29124 10481 42890 40449 22479
43031 22479 44865 115753 169317 151336 96148 84166 140952 207598 204878 110947 -18635 -103625
43019 -103625 -122865 -138892 -214183 -317058 -363425 -352086 -382827 -504554 -618693 -600800 -465362
43008 -465362 -327874 -239536 -157113 -64338 -13890 -24842 -38069 -24393 -52422 -173335 -297028
42997 -297028 -274433 -83742 141252 261106 241816 123866 -35388 -162207 -181167 -84095
42987 -84095 47351 126116 141100 127658 98266 50416 11930 16046 42276 41245 15168 12191
42975 12191 36873 36006 -6857 -35206 -14637 8355 -227 20568 129518 252775 258297 144951
42963 144951 47375 40647 46649 -27464 -153212 -243906 -280164 -301971 -327591 -350435 -378833 -411369
42951 -411369 -400674 -307393 -171307 -68690 -15408 27523 65932 56967 -14530 -98053 -125906
42940 -125906 -67398 53670 155256 134046 -31005 -221256 -290179 -230402 -161863 -156310 -159777
42929 -159777 -108894 -32363 13976 39851 84158 139127 176265 205820 241183 236447 138301 -9423
42917 -9423 -88255 -45194 45524 78570 31877 -34195 -55438 -16028 55064 113454 128911 99348
42905 99348 43654 -8100 -17190 39934 123100 131601 8114 -165753 -236328 -156925 -44596
42894 -44596 -23938 -67959 -57156 37131 116508 109371 71869 87002 133278 134291 100682 123535
42882 123535 223569 302201 276829 182778 87907 -18436 -171528 -321175 -373626 -320545 -234785
42871 -234785 -153475 -65135 -6172 -46672 -149941 -170435 -59724 32865 -40768 -214868 -310480
42860 -310480 -283623 -236055 -209995 -128847 30015 142152 92325 -64207 -180328 -203971 -204685
42849 -204685 -238241 -263010 -203795 -52432 118585 227331 252075 228571 186301 109628 -20863
42838 -20863 -170867 -274344 -305603 -289359 -244921 -173638 -108303 -110635 -185996 -252447 -241139
42827 -241139 -190089 -186272 -239160 -268690 -214719 -110786 -38853 -39078 -73835 -68723 9645 112697
42815 112697 163851 159084 177575 267305 359693 344580 204471 23299 -117528 -191548 -189782
42804 -189782 -108380 9165 82908 82736 58328 55235 46861 -14496 -118298 -209417 -254109 -254967
42792 -254967 -224780 -183467 -158812 -150107 -110733 -12100 88454 94668 -10911 -138522 -190429
42781 -190429 -157719 -111103 -123435 -209111 -315774 -366380 -324832 -223402 -117987 -32289 34631
42770 34631 72749 76322 79000 119852 174585 171664 82673 -49892 -173600 -256430 -258107 -153532
42758 -153532 -6928 65825 52494 71733 181725 261945 194226 78592 113725 294291 397974
42747 397974 297591 126347 65954 110738 146515 152110 182699 214379 157167 18653 -75870
42736 -75870 -57167 -4179 -17043 -80717 -117295 -114187 -122143 -150730 -143922 -71841 9754 23757
42724 23757 -33410 -93601 -99676 -53919 11758 74396 112961 98306 25745 -59358 -105005 -111965
42712 -111965 -113456 -107020 -57651 29640 98097 117871 122082 138785 144113 121952 112541 144082
42700 144082 163671 107577 7039 -53247 -59055 -63926 -75441 -44542 17081 12142 -100506 -221463
42688 -221463 -234976 -158613 -96412 -85232 -69646 -13275 44629 54040 15265 -44188 -107842 -160032
42676 -160032 -170446 -120639 -36071 27512 29651 -24225 -89328 -119759 -113477 -119091 -181987 -281710
42664 -281710 -341641 -308708 -206343 -97555 -15129 48962 98427 113752 87734 48925 25560
42653 25560 6624 -29533 -62219 -49785 -7263 -9332 -87316 -170126 -178080 -143074 -166814 -266754
42641 -266754 -340123 -306602 -221025 -191351 -223994 -216843 -102854 54119 129701 78730 -21438
42630 -21438 -64670 -34283 -9947 -55435 -128452 -137571 -77910 -54185 -144644 -288922 -357877 -307310
42618 -307310 -207125 -129793 -75117 -21455 9405 -13297 -59903 -60958 372 59002 49900 -9174
42606 -9174 -46866 -36747 -26931 -59912 -99150 -73596 18206 96292 103457 78013 90442 140259
42594 140259 166382 147855 133838 157569 175924 136424 67225 42289 69046 72931 6283 -84215
42582 -84215 -131367 -142228 -168776 -212568 -219603 -165029 -85846 -20712 31385 76666 100949 103500
42570 103500 110697 126145 113185 64038 35544 60076 65981 -34542 -199875 -287938 -236561
42559 -236561 -137424 -107917 -154958 -198221 -176546 -96707 -16621 -8344 -97637 -212079 -230915
42548 -230915 -121132 13188 54242 8549 -20179 34112 142333 239697 288941 282736 228286
42537 228286 148897 78763 34010 -13344 -120711 -311208 -512626 -589415 -475985 -264152
42527 -264152 -112295 -81194 -117997 -183493 -295633 -427476 -473083 -382830 -250633 -188251 -180385
42516 -180385 -149493 -101033 -98258 -132825 -132601 -82623 -36685 -17633 -4842 -13735 -80423 -161560
42504 -161560 -161410 -81229 -32126 -63277 -87482 -32773 39123 48279 42519 122690 273433 374976
42492 374976 366782 309615 282078 287064 276692 220120 125924 22306 -72481 -164454 -258473 -318009
42480 -318009 -286958 -173393 -72341 -64474 -118217 -136779 -85125 -22914 -15654 -58209 -99825
42469 -99825 -116771 -136350 -187603 -242053 -232248 -147812 -78718 -109012 -186657 -178751 -62435 34647
42457 34647 23604 -14277 37363 145322 186332 143156 120710 178908 262633 307837 313893 287147
42445 287147 211727 117760 89103 144841 185871 127177 25396 -1835 56471 100132 63514
42434 63514 -13116 -60050 -54922 -3926 94742 233367 375244 483663 547257 554062 470447
42423 470447 284864 58790 -108280 -170334 -163359 -140856 -115749 -79449 -42192 -22229 -14201
42412 -14201 -1408 9690 -3717 -46855 -108010 -183265 -266897 -325842 -326922 -289771 -266542 -262008
42400 -262008 -223892 -129080 -28487 20080 15631 -19520 -83901 -162855 -200674 -168305 -122927
42389 -122927 -131591 -159649 -111121 26103 151294 180478 141109 112600 122474 133593 104924
42378 104924 39508 -14349 -5341 58004 92752 22074 -131008 -263130 -301218 -258447 -187177
42367 -187177 -125919 -99223 -119417 -166382 -198101 -194650 -164607 -111055 -36050 19207 -4295 -102255
42355 -102255 -195420 -220355 -187965 -136060 -79115 -31247 -19609 -33295 -11111 69386 134912
42344 134912 106425 14746 -32570 17944 118327 187988 184861 121685 53065 34123 57745
42333 57745 53361 -16960 -92006 -87267 -4861 90694 174979 264881 333723 315211 205537 86612
42321 86612 26456 19269 37844 71481 87852 37786 -59050 -108536 -76460 -53384 -111574 -169473
42309 -169473 -105751 36862 91632 8750 -74358 -39952 52417 86764 69379 80706 112071
42298 112071 79336 -12885 -46323 37190 135552 120253 3350 -97125 -115659 -94611 -105102
42287 -105102 -176279 -291295 -394692 -410209 -311146 -175634 -114997 -141844 -170575 -157888 -163693
42276 -163693 -233714 -299234 -269518 -177443 -142231 -197323 -242337 -189119 -88260 -64316 -158470
42265 -158470 -280948 -315063 -240370 -145483 -129501 -199680 -269548 -252375 -144661 -20958 30424
42254 30424 -36756 -198133 -360740 -422832 -365363 -264003 -184415 -104393 11555 104504 77930
42243 77930 -46250 -129327 -102618 -61549 -117841 -234771 -288775 -242401 -164681 -107087 -57125
42232 -57125 -15847 -25776 -90013 -139586 -128160 -101015 -113841 -128634 -64409 63651 132700 61940
42220 61940 -79470 -152850 -109428 -25993 9908 1985 9786 43433 40930 -42698 -160617 -218109
42208 -218109 -178450 -97989 -60129 -99732 -191222 -279152 -308642 -255269 -150825 -65823 -43465
42197 -43465 -56587 -43751 23860 126572 227219 288709 275012 177750 47555 -39714 -66651
42186 -66651 -96351 -190335 -327312 -426334 -430755 -343828 -202778 -58745 23301 -6069 -125821
42175 -125821 -242050 -266650 -192549 -78777 23267 102474 153370 148867 74975 -25348 -80307
42164 -80307 -65714 -22849 10368 48237 106694 138814 79008 -55809 -171869 -220110 -252193
42153 -252193 -320848 -378621 -336621 -199326 -76769 -57266 -112269 -141759 -87500 13948 82770
42142 82770 93449 109350 198278 324142 374430 306465 198833 121172 31648 -121384 -265992
42131 -265992 -288506 -213663 -177576 -225686 -263781 -226878 -167160 -130420 -70391 42808 136720
42120 136720 145080 112786 103130 83577 3623 -89492 -125218 -134471 -176403 -196510 -101852 53660
42108 53660 114779 55465 10655 52245 82958 9880 -108176 -165149 -154140 -126589 -94331
42097 -94331 -59571 -66046 -126796 -162668 -108348 -27829 -21811 -61555 -33159 68073 115845 51341
42085 51341 -13754 38507 147964 155395 36874 -45743 38255 195746 212438 28386 -180353
42074 -180353 -229618 -154023 -121238 -172560 -178656 -63255 64706 75089 9875 4623 76968
42063 76968 114728 57986 -21683 -42028 -16474 -502 1207 26330 90942 170554 224931 225592
42051 225592 181720 145009 157649 191018 174880 94798 14145 -16323 -18677 -27182 -17740 51177
42039 51177 156920 227275 229026 199402 190549 215527 248804 254523 218017 170271 167587 219768
42027 219768 258273 216470 123539 62160 42555 -5428 -100698 -157842 -114601 -35436 -10769
42016 -10769 -13301 42098 129299 125772 3078 -121102 -161360 -177322 -235531 -265318 -165836 11959
42004 11959 120816 124394 118228 146124 132190 36860 -38834 14802 153054 226440 153278 -20189
41992 -20189 -195521 -293441 -276411 -171694 -73506 -68327 -143227 -197442 -152343 -29423 83358
41981 83358 123716 105133 81626 74199 52844 2195 -29621 3850 51630 6724 -144712 -288505
41969 -288505 -329910 -306160 -299029 -299880 -243886 -144045 -98817 -160013 -260598 -292467 -212334 -59520
41957 -59520 89680 167461 146351 52237 -58104 -137124 -164154 -139194 -79337 -19088 343
41946 343 -48544 -154238 -247083 -231858 -88142 70577 101526 5197 -75044 -43888 37515
41935 37515 72337 64957 63958 48222 -28211 -125841 -158660 -118513 -68045 -32841 3676 15624
41923 15624 -49697 -168533 -248473 -250428 -217752 -176630 -97241 30109 166063 288183 403204
41912 403204 477065 444590 318316 198495 136584 74518 -33987 -125063 -109426 6760 141638
41901 141638 224185 212973 87696 -116668 -305497 -403996 -414519 -372767 -296965 -207900 -140621
41890 -140621 -99506 -56684 -25662 -66403 -172059 -223351 -122785 73263 212292 195993 39906
41879 39906 -154486 -248197 -164431 1486 49946 -77431 -203322 -149614 20260 106609 48707
41868 48707 -41366 -76056 -76916 -71610 -44349 -6477 -542 -9766 34757 131236 187382 153481 86863
41855 86863 51859 41855 39548 70676 144829 210757 226017 216073 211666 179987 81440 -41427
41843 -41427 -101347 -84024 -70809 -131107 -228387 -258381 -172679 -42818 11915 -50726 -169284
41832 -169284 -271398 -346567 -407978 -434454 -397659 -315382 -231936 -170861 -144474 -170562 -228535
41821 -228535 -241168 -165993 -69743 -39822 -55596 -31821 36393 67660 23530 -49090 -103687
41810 -103687 -134737 -132884 -87793 -38454 -35175 -53682 -36186 -5132 -25413 -62873 -18877 78790
41798 78790 73116 -83920 -237985 -254022 -196524 -193485 -243829 -276237 -295817 -338825 -354228 -265579
41786 -265579 -110733 -6139 -2472 -68814 -176597 -297373 -355530 -293264 -166430 -85232 -78902
41775 -78902 -99507 -125720 -168571 -202816 -194069 -178725 -222074 -308900 -363050 -357242 -314435 -228112
41763 -228112 -87563 38625 63172 16579 1471 14294 -46839 -176072 -215355 -82266 88498
41752 88498 125226 44246 -6434 39018 110160 125911 85556 42215 44100 96863 149427 134366
41740 134366 50878 -17426 3191 89061 152180 136228 56083 -33456 -85145 -94534 -101729 -140912
41728 -140912 -191180 -208895 -200610 -216875 -277233 -354479 -426933 -478456 -452128 -298265 -89597
41717 -89597 11824 -48444 -141793 -137688 -75009 -74604 -155669 -237578 -275829 -292935 -295780 -257921
41705 -257921 -186288 -132594 -128796 -158817 -191551 -203240 -182302 -151678 -165363 -242830 -332770 -379690
41693 -379690 -389293 -385583 -354537 -289926 -240850 -237574 -221819 -141760 -67230 -98999 -199552 -241601
41681 -241601 -206102 -191754 -227010 -227416 -172852 -169872 -266730 -346778 -303708 -205940 -173030 -183123
41669 -183123 -130229 -7443 92878 118877 84435 -6615 -142009 -233248 -191734 -68919 -4827
41658 -4827 -32507 -48990 2787 41602 -20020 -150368 -257339 -292678 -248305 -123649 46289
41647 46289 187883 262002 289811 277097 189316 48387 -30893 23333 133394 180223 157955
41636 157955 133735 112671 53021 -21265 -43351 -26354 -46325 -99902 -98206 -24468 21913 -14698
41624 -14698 -52056 -4777 78708 99255 57961 30959 39151 37428 11418 -1636 15857 41575
41612 41575 65940 103890 150709 181602 199601 229729 257629 230682 142835 71722 96074 198259
41600 198259 276253 246127 122652 4039 -23851 25181 56836 12319 -60752 -80143 -40087
41589 -40087 851 23710 70024 150435 203969 185178 137152 125785 135780 92433 -21340 -125552
41577 -125552 -137698 -72193 -18618 -33943 -83378 -94636 -50550 -3130 1606 -20254 -29713 -33005
41565 -33005 -69866 -138498 -174933 -124758 -8975 103353 172531 213152 242903 233340 141203
41554 141203 -6474 -94912 -35949 107082 170755 91845 -5898 22237 143213 197229 122061
41543 122061 27030 29222 106989 161933 160166 149753 170328 201420 194856 126883 19492 -78833
41531 -78833 -142638 -197992 -277247 -349397 -338002 -221255 -74332 9003 6530 -35662 -61726
41520 -61726 -42351 15484 74788 108210 137911 203082 288593 337056 339018 347861 384666 399293
41508 399293 365036 341183 380466 430033 396718 274777 139668 42105 -22419 -57584 -52966
41497 -52966 -27684 -26678 -60122 -85332 -58617 17500 96209 119891 67606 -15092 -58593 -55897
41485 -55897 -68906 -129225 -185743 -185407 -148647 -116269 -80818 -34005 -24829 -88412 -159176 -142979
41473 -142979 -49381 28819 41388 5279 -64812 -156269 -211155 -179478 -111073 -101157 -156329 -211740
41461 -211740 -263057 -362005 -482826 -523255 -458586 -369603 -289861 -159090 23854 139172 116579
41450 116579 51023 55344 96188 78558 10989 -26597 -23835 -38774 -86459 -120602 -107559 -48185
41438 -48185 48733 151744 197831 165034 126446 168515 279141 371107 386417 323619 198166
41427 198166 39404 -98460 -178758 -214356 -219532 -173559 -78389 2573 25110 30823 65586
41416 65586 87966 40161 -42389 -85667 -97925 -136777 -192029 -207117 -189258 -186556 -174828 -86975
41404 -86975 48815 121318 98452 61887 59317 38133 -36380 -104511 -106851 -68919 -41147 -31764
41392 -31764 -44738 -105098 -192848 -224442 -161417 -79203 -69824 -126494 -178240 -189386 -167068 -113224
41380 -113224 -33572 29777 31155 -21643 -79520 -111774 -126839 -140021 -137167 -75552 60051 190093
41368 190093 179779 5655 -162630 -143307 20869 127802 110252 108870 209391 275160 153428
41357 153428 -77992 -212053 -180947 -83282 1319 78214 142844 163193 166395 222233 316408
41346 316408 341645 245619 101948 1521 -50431 -92143 -128743 -145437 -149596 -152303 -134580
41335 -134580 -70563 24426 91224 76539 -10236 -89662 -85239 -13685 34890 24509 20279 62715
41323 62715 69890 -42081 -196191 -241822 -190486 -219045 -400706 -565758 -512434 -263685 -19519
41312 -19519 85168 77813 39175 -747 -50274 -111697 -174790 -220925 -224387 -175568 -106830 -74484
41300 -74484 -110949 -201627 -298294 -347076 -324763 -265990 -235006 -249576 -252642 -183606 -57209 59050
41288 59050 128054 164342 180354 156613 77734 -34583 -143422 -230147 -287729 -299385 -251882
41277 -251882 -166783 -92481 -56999 -47581 -46071 -57965 -79240 -58040 56081 217315 293235
41266 293235 205219 23574 -117735 -172237 -198421 -247399 -294000 -283157 -196246 -62257 58174
41255 58174 96201 26779 -89931 -155630 -132840 -66103 -8327 25016 26647 -12155 -58542 -48818
41243 -48818 18271 55372 6008 -56737 -17620 120335 228538 198300 41176 -145830 -257679
41232 -257679 -227384 -63884 128194 214168 153485 38709 -11463 24732 79957 102093 104981
41221 104981 114685 112871 68284 4289 -9544 58259 158822 222856 233600 213698 168652 88348
41209 88348 -5426 -58526 -36809 49231 163925 256419 269913 197899 124835 142977 220378
41198 220378 223581 93214 -75572 -158387 -130643 -29845 122862 288308 370180 311447 190467
41187 190467 125179 108595 37114 -113240 -244205 -277908 -246874 -215568 -192222 -154785 -103992
41176 -103992 -56619 -30035 -50981 -130434 -216218 -227979 -159477 -88633 -61860 -30757 56533
41165 56533 155289 171104 80757 -39363 -97792 -76752 -42940 -76884 -182043 -275535 -291684
41154 -291684 -267857 -279372 -316569 -302063 -219955 -139787 -104294 -83281 -55211 -38695 -19154
41143 -19154 48240 126334 109994 12611 2512 152701 283899 197851 -38640 -210390 -270471
41132 -270471 -338467 -424953 -389057 -202416 -43691 -43753 -104337 -76455 16681 55384 17973 -27758
41120 -27758 -57929 -98188 -141803 -167564 -204723 -282930 -344162 -297165 -144134 26325 152746
41109 152746 227130 231162 143825 14648 -60791 -57657 -44189 -73567 -121831 -149047 -152361 -133755
41097 -133755 -80578 -9345 31400 37775 72129 163481 240715 225288 152849 134276 211007 312750
41085 312750 358652 341983 300000 251128 194703 141687 106017 73990 15535 -68739 -136521
41074 -136521 -153739 -139471 -142237 -180413 -228370 -258059 -266276 -255290 -218495 -163735 -122673 -110528
41062 -110528 -99937 -64071 -19475 13274 63134 162625 263851 277903 208708 167861 220915
41051 220915 292552 281924 211153 182114 224727 274494 284835 275350 265458 243225 219607 236567
41039 236567 287736 299393 232417 139273 68251 -23080 -181570 -334955 -354821 -230606 -85775
41028 -85775 -12366 18201 52158 55839 -14659 -113112 -154976 -139013 -140670 -193821 -248637 -255440
41016 -255440 -232678 -229495 -259003 -290182 -282470 -217475 -119732 -52050 -61373 -117410 -131766 -54989
41004 -54989 64676 135112 119399 68541 63204 128906 206238 212986 142519 76350 75251 91396
40992 91396 41211 -59123 -109296 -75148 -30848 -21141 21826 155432 298276 322353 231434
40981 231434 148367 143469 172678 183311 180140 163887 97868 -15858 -98513 -91632 -42695 -33570
40969 -33570 -57935 -35813 60481 156082 163858 84494 -9587 -69241 -112381 -166591 -201467 -158105
40957 -158105 -39824 76185 134780 161233 194210 217295 210079 210232 244076 241023 122394 -49823
40945 -49823 -135673 -126343 -152746 -257489 -308185 -212098 -80181 -63726 -132880 -150093 -89158
40934 -89158 -39819 -40052 -44299 -37425 -48647 -61136 -35326 -20262 -107100 -255048 -301026 -186387
40922 -186387 -49084 -28737 -92264 -130505 -128373 -137864 -148456 -92704 40778 177865 234035
40911 234035 174497 25922 -128358 -196268 -165507 -117432 -118756 -139737 -118610 -56515 6048
40900 6048 59238 102980 94337 -7849 -165037 -292471 -353661 -360350 -305234 -175666 -25501
40889 -25501 51220 31903 -16226 -41980 -70035 -136271 -222497 -281715 -283798 -218870 -101576 11726
40877 11726 59029 46345 38664 58479 49043 -28459 -116227 -131655 -83536 -58675 -104164 -171807
40865 -171807 -184092 -123947 -49522 -31809 -78944 -122765 -94972 -15997 21387 -32757 -122690
40854 -122690 -164020 -150341 -144433 -184556 -243856 -275353 -255282 -182106 -75994 8845 12865 -58486
40842 -58486 -118730 -90738 -4027 33897 -32805 -142161 -195810 -174246 -132677 -100633 -43290
40831 -43290 63292 171077 214171 193789 166611 168046 190132 219794 248899 252707 211392 156258
40819 156258 143739 177831 212550 237652 290621 356684 336544 177140 -21330 -106943 -56153
40808 -56153 19938 31162 -4246 -22579 9518 93089 203903 280676 265020 180080 118577
40797 118577 124751 139022 94714 18255 -18070 -5174 537 -35734 -92873 -135990 -141187 -83974
40785 -83974 43500 197449 308710 348533 326964 234041 53442 -148817 -234034 -151763 -34379
40774 -34379 -50066 -188912 -279911 -216106 -76101 359 -21560 -78321 -121719 -159097 -203051
40763 -203051 -239890 -249994 -226897 -179296 -137055 -141112 -196543 -245437 -219080 -115648 -2852
40752 -2852 50741 27777 -37472 -81586 -51096 44164 126854 135676 98520 81761 87527 62344
40740 62344 -868 -43940 -37753 -19730 -9837 34170 128824 199617 170230 68735 -23732 -86764
40728 -86764 -143448 -167883 -117433 -53463 -112442 -311663 -477355 -441443 -251910 -103713 -90811
40717 -90811 -118427 -66597 47310 116412 97187 45043 13902 -10682 -60190 -116979 -137244
40706 -137244 -110965 -59538 7692 91680 168548 203472 200857 194545 181165 114421 -13843 -134298
40694 -134298 -172020 -120089 -15010 115116 237467 293294 248384 144731 54658 2576 -26002
40683 -26002 -28180 5396 45352 54177 49937 74319 106397 81480 -2945 -77147 -107244 -134567
40671 -134567 -182763 -206804 -178149 -147186 -160691 -176566 -132936 -60670 -46781 -101691 -137893
40660 -137893 -87389 17771 100002 131387 152064 211566 305818 369562 335343 205492 56016
40649 56016 -35139 -48389 -12358 33563 55039 38797 17611 47940 136201 217631 234190 197370
40637 197370 144090 77896 2975 -29979 15377 79807 66504 -25646 -99715 -93383 -41461 4788
40625 4788 45797 93514 129030 139786 148488 165778 156979 94670 6114 -70135 -137393 -207473
40613 -207473 -248549 -218679 -130969 -35397 51394 149153 251296 306013 269658 151439 4410
40602 4410 -104249 -124917 -65345 1143 2788 -51133 -89038 -74016 -39118 -16080 20825 105414
40590 105414 209767 271762 279413 280484 302251 303137 229931 102276 10001 25636 135354 255398
40578 255398 299605 230450 72665 -98970 -201289 -209845 -191892 -242860 -374727 -492651 -502277
40567 -502277 -413977 -309785 -232170 -157543 -74894 -26596 -40121 -64888 -27164 69009 142466
40556 142466 137545 88453 68859 103977 151524 157468 113832 61583 43506 59012 71155 56812
40544 56812 32428 19734 9037 -15009 -28654 3506 53977 36767 -86932 -246218 -340175
40533 -340175 -352286 -342557 -343954 -318825 -223087 -73494 62964 124099 94866 20904 -20266
40522 -20266 7691 54083 41098 -32525 -94554 -111325 -132709 -193038 -232326 -180764 -77025
40511 -77025 -18001 -6971 54434 204034 334914 325391 195326 70387 27159 42714 78786
40500 78786 132500 182850 158396 15742 -179040 -302387 -302501 -235081 -171454 -121373 -68319
40489 -68319 -35744 -68227 -159120 -241766 -258445 -208442 -126478 -48558 -7313 -21293 -63935 -71722
40477 -71722 -12394 73680 124720 128767 115556 102034 88900 96498 149505 218759 228708 149655
40465 149655 51130 32692 114737 219065 249560 176886 49516 -65157 -146065 -222039 -310360
40454 -310360 -372560 -357441 -277092 -201275 -171067 -157552 -123499 -87550 -93614 -140819 -183317 -192837
40442 -192837 -189000 -204931 -243932 -272751 -245549 -141434 3926 110335 120160 56627 -1681
40431 -1681 -5557 24613 47484 65015 114443 201028 264670 233600 108888 -24087 -81037 -64470
40419 -64470 -46616 -75228 -124902 -147216 -137630 -128633 -133979 -129301 -87568 -14387 54621 80382
40407 80382 47152 -21592 -71057 -53169 29935 118243 136652 59364 -57337 -113555 -55324
40396 -55324 70368 161494 160853 96540 31561 4098 19735 62557 92473 64316 -19271 -94859
40384 -94859 -106804 -72312 -54173 -89331 -168768 -258308 -303376 -246701 -97582 36191 48815
40373 48815 -38412 -114386 -131062 -137411 -153869 -115892 4851 111079 97963 8377 -22514
40362 -22514 46761 122538 115254 36378 -54976 -126204 -166208 -168927 -154243 -157364 -170636 -143543
40350 -143543 -67741 -11377 -34549 -118771 -214737 -301306 -347862 -286480 -107625 61143 75228
40339 75228 -43571 -143537 -157437 -167019 -233846 -289130 -256273 -183307 -164471 -196801 -203851 -154526
40327 -154526 -74676 17751 102400 116388 18036 -127275 -206318 -180358 -71362 124136 386182
40316 386182 569586 509689 248693 9569 -90702 -149181 -244887 -275432 -144269 36110
40306 36110 89482 27669 -9350 2414 -36234 -140424 -201622 -166018 -103976 -75945 -56235
40295 -56235 -18392 19283 61804 140799 221272 214322 115143 21838 -12918 -34490 -58643 -24139
40283 -24139 70720 117985 65211 3993 521 -33436 -178115 -330366 -341544 -244277 -179888
40272 -179888 -164158 -101460 3242 33850 -28901 -63896 -11363 37178 7253 -39419 -30343
40261 -30343 -10690 -57311 -153348 -238258 -313033 -404882 -477892 -469559 -390663 -312136 -262799 -199825
40249 -199825 -79152 84958 228522 284647 237070 144208 88071 87277 91459 69171 51844
40238 51844 69943 100350 111446 110031 105029 76192 24259 -1046 20853 27938 -28691 -81177
40226 -81177 -26555 111493 197435 160664 70019 17798 13204 23020 43385 78398 97500 72759
40214 72759 34193 37259 82872 109111 64892 -36346 -144904 -236811 -328441 -429937 -504969
40203 -504969 -500968 -416525 -307108 -212932 -118227 -9023 69188 65105 10630 -8870 27224
40192 27224 50367 10902 -52252 -81450 -83652 -94087 -96831 -47442 34336 56364 -40322 -202590
40180 -202590 -317670 -328818 -275945 -227681 -201829 -169829 -119649 -73512 -34654 39059 169078
40169 169078 291411 313677 232184 135935 85754 49826 -14108 -73510 -72500 -29894 -19650
40158 -19650 -64862 -111715 -115219 -99471 -112424 -156871 -192495 -188586 -155851 -134974 -161796 -233319
40146 -233319 -304730 -333046 -323427 -313250 -311543 -285924 -222301 -163497 -157068 -185017 -182345 -116489
40134 -116489 -11124 102756 209547 273586 242724 131333 51882 92525 181723 154605 -36804
40123 -36804 -256618 -354499 -322273 -232409 -106764 55106 170497 126924 -52485 -207134
40113 -207134 -232556 -183166 -147210 -120602 -71163 -38937 -75937 -141524 -158500 -140296 -160758
40102 -160758 -213965 -213375 -144120 -114345 -209105 -362780 -428710 -336668 -147339 13668 48565
40091 48565 -48518 -186710 -257865 -237603 -187422 -161046 -153616 -144432 -126003 -71391 57023 225768
40079 225768 322094 284214 187127 135715 120982 60386 -55033 -146745 -172455 -174193 -190789
40068 -190789 -199119 -165701 -94779 -4484 84055 112770 12991 -191170 -366514 -414652 -386787
40057 -386787 -393539 -440528 -434300 -336180 -219642 -153733 -108141 -24920 69334 92856 31509 -35188
40045 -35188 -38322 6606 50278 79283 94126 63734 -31384 -129614 -136225 -47395 43445 81837
40033 81837 119539 205199 283539 275335 202617 147003 119222 67061 -4835 -30216 -2423 6852
40021 6852 -23179 -19675 50618 108491 94645 82808 162778 280074 308057 240588 192428 220295
40009 220295 263422 276952 312367 423028 579242 730562 882381 1052664 1205428 1283850
39999 1283850 1269840 1162955 944560 623454 285595 32593 -117568 -216483 -287710 -303096
39989 -303096 -253586 -183588 -139384 -126120 -129949 -145793 -168247 -185162 -191500 -183160 -136548 -34264
39977 -34264 82459 135758 105539 56437 47703 69303 100728 165659 260112 284610 153527
39966 153527 -47343 -126571 -26315 110765 148828 121624 118677 113875 24125 -122132 -205989
39955 -205989 -189961 -149558 -130727 -91507 -9506 61811 89201 117614 176732 213581 183767
39944 183767 135939 131247 143915 127221 125177 219568 393225 539547 596340 587120 540825 460978
39932 460978 379790 354494 384881 406187 394915 422032 562391 790166 997762 1098170 1092575
39921 1092575 1054115 1054114 1102518 1178836 1319675 1612219 2065340 2566946 3049471 3627699 4459581
39910 4459581 5517486 6618346 7637391 8564976 9429874 10375900 11781009 14062597 17405443
39901 17405443 22026746 28672979 38127651 49589745 59828637 64814354 62666767 54941873
39893 54941873 45076734 35895473 28546402 23064973 19171586 16499620 14590206 13039980
39885 13039980 11648155 10365811 9172692 8044614 6979297 6008419 5195355 4605117
39877 4605117 4234848 3985713 3742846 3467139 3175881 2873924 2566248 2308083 2160447
39868 2160447 2094076 2004870 1836659 1634247 1462224 1323663 1183621 1035161 912460 853568
39858 853568 863818 905221 920294 881894 820366 787053 792676 796057 751736 656856 553493 490907
39846 490907 478140 471602 423844 344768 291736 297508 337397 370281 376345 353684 325378 349759
39834 349759 454370 549077 497830 315696 191522 244713 363794 387094 337744 332947 348641
39823 348641 272912 155186 174275 330948 398888 267093 121241 148490 246144 210078 73065
39812 73065 30052 102046 111852 -12372 -125503 -95686 36944 188631 351201 502706 551675
39801 551675 481020 426566 489402 567603 510785 368059 328967 454911 625259 746918 860291
39790 860291 997304 1075198 1014402 866335 734595 635350 523449 404214 319835 253463
39780 253463 153283 53365 65893 217861 382484 431947 394341 386453 435494 457476 401392
39769 401392 323027 291373 296228 292656 280971 286822 300690 299217 303017 346997 402767 401004 338685
39756 338685 294527 313577 341784 315350 257232 229696 236932 241777 246890 281363 320159 301982
39744 301982 238823 225852 305209 386476 358978 242766 168515 223058 362113 470414 471639
39733 471639 382335 289776 278545 353428 428770 408398 279818 126654 55516 109284 229664
39722 229664 298339 244043 123451 64865 115565 188112 186953 134044 112430 134270 151639
39711 151639 174909 275062 449610 578726 561590 433417 303052 229586 207470 220976
39701 220976 251460 261614 229037 177290 132548 78104 -1055 -61537 -52747 -3132 17320 13650
39689 13650 63758 181698 261144 204198 55416 -50828 -49882 3517 33622 27843 3885 -51088
39677 -51088 -153321 -253345 -259720 -154324 -34184 5084 -8608 21623 108474 165467 152974
39666 152974 147604 220801 325782 372695 354583 317015 253238 133831 17200 14676 131843
39655 131843 246674 277834 284398 353898 475160 585288 675265 773048 867776 929581 978897
39644 978897 1062412 1173596 1267178 1349735 1487674 1713544 1984938 2259885 2562784 2943122
39634 2943122 3407529 3932444 4517356 5174212 5862076 6473964 6915949 7195680 7429292
39625 7429292 7768024 8302664 8988097 9624482 9948615 9823029 9364018 8840908 8422526
39616 8422526 8060552 7641514 7182436 6805710 6572037 6445279 6417937 6561239 6907052 7350919
39606 7350919 7714746 7854070 7684177 7188735 6471586 5742540 5170592 4765616 4440213
39597 4440213 4135132 3823759 3455224 3000938 2543885 2219239 2048310 1912311 1716470
39588 1716470 1505333 1372241 1314880 1243623 1107129 949393 838103 781654 745765 732230
39578 732230 792896 939846 1077190 1083120 958241 824559 757588 697284 574531 445546
39568 445546 409960 448063 450036 386403 336504 344350 358947 345872 353421 417647 488378 510321
39556 510321 508024 527081 549674 534868 494547 461598 422813 355473 302237 333132 438743
39545 438743 522891 505357 390040 237556 112344 50277 36397 15324 -45736 -114581 -143875
39534 -143875 -139237 -130757 -98145 8212 168271 282443 290618 253055 272384 362172 434411
39523 434411 410843 311846 222966 192441 185950 146130 71261 6727 -27807 -54020 -66548 -4864
39511 -4864 160036 344375 417781 347130 226220 159672 164730 201711 253117 329264 409859
39500 409859 424532 317850 128827 -18728 -26737 79919 184548 200977 139433 60355 10769
39489 10769 15467 75837 146744 160101 104869 38344 -12966 -96479 -220729 -275819 -169185
39478 -169185 6149 62983 -31605 -122428 -90663 15502 109566 193157 277188 289843 176117
39467 176117 21172 -39447 4610 55896 73791 109616 179838 218296 189053 154109 171381
39456 171381 190989 125090 -11066 -100214 -66240 40762 123466 156579 182959 212282 189857
39445 189857 90862 -9347 -17337 51965 97054 69412 18145 -10474 -33230 -59298 -46729
39434 -46729 11759 36100 -28158 -105209 -91335 -15676 8550 -36447 -64879 -54341 -88240 -197592
39422 -197592 -281427 -247682 -136320 -30694 65723 174493 236250 172849 25478 -72686 -58112
39411 -58112 10211 55669 60654 32250 -28416 -97917 -134467 -134701 -131533 -117539 -39600 93578
39399 93578 171492 118985 23243 31802 137742 166910 13281 -193842 -231126 -52505 164904
39388 164904 248661 219405 204627 234400 221711 133847 72495 131347 252497 306280 269262
39377 269262 227469 218321 177512 70832 -17932 4019 103359 167666 152115 108551 87514
39366 87514 81009 62336 25703 -19474 -49211 -23219 67254 154357 157982 99033 77154 118474
39354 118474 128395 40663 -67054 -81543 -16523 28266 31914 64033 136952 163502 96601 10151
39342 10151 -17404 -16758 -49108 -82065 -43730 36091 49411 -24081 -76755 -27157 73587 136934
39330 136934 161394 190653 203182 137485 12168 -69281 -51065 7430 25352 1117 -22715
39319 -22715 -43607 -83658 -113248 -59862 95644 278926 395994 415090 363592 281465 202244
39308 202244 149280 116261 67212 -13184 -81643 -83542 -34402 -16393 -82709 -195419 -276411
39297 -276411 -295610 -281197 -256378 -204886 -112045 -11035 45832 58416 84001 151109 199505
39286 199505 151729 35975 -19482 63575 216561 316049 333219 334558 355984 349695 268914
39275 268914 144486 44381 -3287 -12354 7295 57581 123032 165154 152955 91677 22654
39264 22654 -7439 11969 48813 76446 110964 167654 198976 137441 6399 -80610 -62537
39253 -62537 -13071 -36334 -132243 -218499 -241136 -201882 -114616 -7337 56123 30513 -43494
39242 -43494 -88178 -90353 -89635 -87017 -49048 6053 20960 5783 35858 121872 180049 167402
39230 167402 147429 168585 175929 119192 61591 86238 160887 196575 186768 180663 164239 94243
39218 94243 27454 75086 211951 263014 129144 -81082 -205741 -222812 -215315 -222805 -223148 -215233
39206 -215233 -219218 -207827 -128527 -7576 41550 -52149 -224604 -350257 -381347 -375052 -389809
39195 -389809 -395519 -311511 -120606 85369 186550 147188 36651 -44816 -45572 13137 65031
39184 65031 58863 11462 -11580 13504 26233 -33815 -132231 -185870 -177482 -149508 -101908 2417
39172 2417 122157 147380 75087 59282 195702 353223 344517 201450 132398 223313 333204
39161 333204 315113 203159 113006 68053 23525 -6325 40661 150689 213233 145179 -14644
39150 -14644 -153654 -199341 -174845 -161730 -214678 -301119 -325924 -227874 -50851 89139 105793
39139 105793 9774 -112382 -174889 -154675 -89023 -19362 49048 121385 169687 154242 87226
39128 87226 30961 17074 7766 -36747 -90719 -103133 -78678 -68681 -89910 -101551 -71542 -26354
39116 -26354 -14835 -46209 -83733 -86744 -43118 31014 106259 154039 160405 138192 124278 152172
39104 152172 218262 281103 302632 282943 245275 201700 155020 120390 110550 104335 69820 21095
39092 21095 5627 22707 7085 -75638 -163396 -169925 -89430 11815 75670 78612 12415 -100858
39080 -100858 -192114 -201594 -143214 -66196 22274 130672 202826 155708 5763 -127963 -168701
39069 -168701 -150289 -116360 -45415 68894 148152 122856 41011 -413 5305 -13410 -82395
39058 -82395 -154738 -194475 -203438 -167626 -63465 66886 125088 70995 -34287 -123798 -197181
39047 -197181 -265819 -296184 -261822 -195150 -123952 -4425 202364 415480 488286 384398 221518
39036 221518 120060 81048 49199 24434 42285 85996 98954 76552 73018 103878 105745 26341
39024 26341 -91401 -157429 -140470 -88044 -58881 -71190 -105101 -121546 -87655 -17069 22883
39013 22883 -20281 -113585 -171782 -155154 -95392 -33836 11614 17723 -38768 -124900 -163753 -138791
39001 -138791 -127581 -184817 -248479 -227515 -138285 -72657 -53406 -9145 103201 231016 305309
38990 305309 325267 329847 328802 298576 225702 131323 61796 53879 88346 87490 -6285 -154866
38978 -154866 -266229 -304245 -308022 -308723 -294214 -267735 -268264 -296025 -278361 -159632 14164 143500
38966 143500 176924 133296 63118 25483 62828 153122 218286 217263 191113 177269 136201 29663
38954 29663 -77069 -80768 13427 98855 113934 97135 92166 84844 55672 19111 -18976 -76076
38942 -76076 -133582 -127561 -39790 57541 91165 70196 35835 -18367 -112861 -206844 -230846 -184691
38930 -184691 -140457 -143506 -160327 -137517 -76275 -29768 -42718 -103127 -148994 -126976 -48830 21866
38918 21866 39967 10727 -51077 -147749 -256445 -306011 -248896 -133594 -55465 -51487 -92197
38907 -92197 -158522 -261711 -387802 -485067 -518728 -487865 -386095 -211305 -27488 60686 33808
38896 33808 -9329 7466 33503 -3448 -53600 -11280 107355 170712 122652 54864 52487 70588
38884 70588 30489 -44284 -78428 -76603 -102462 -149983 -142196 -67697 -20226 -63381 -134451 -140400
38872 -140400 -93553 -83239 -143158 -217007 -249690 -250561 -252701 -255843 -234325 -176798 -98040 -23904
38860 -23904 25863 51166 72018 102200 120798 87014 -11508 -138940 -241374 -281072 -244651
38849 -244651 -148873 -50991 -22365 -81492 -166097 -198803 -172096 -138814 -122880 -81092 25409
38838 25409 152604 206966 154161 59020 5455 6444 18315 21610 45286 107611 172353 188144
38826 188144 151340 103670 75437 56069 25386 -3538 10221 80709 152779 138661 16633
38815 16633 -123955 -171462 -120413 -69792 -93092 -165622 -236560 -305388 -381916 -430331 -418532
38804 -418532 -379191 -351085 -301534 -193371 -92420 -96189 -167440 -164954 -57853 21283 -14487
38793 -14487 -71717 -30975 77818 162789 238857 371543 507086 506783 343608 142592 21744
38782 21744 579 65185 197959 315197 299058 154142 39637 78860 210086 289549 271112
38771 271112 207726 133911 40610 -56882 -108616 -89856 -20233 72041 164870 233907 270297
38760 270297 296240 329429 349024 330474 291221 263414 245911 225500 216919 230221 227747 178094
38748 178094 128717 146598 199255 185458 90553 13878 13041 19648 -34845 -100782 -100621 -65011
38736 -65011 -72317 -95858 -33494 114648 217395 193585 121025 109545 147523 149547 98733 53464
38724 53464 40465 29763 15482 41454 123642 208361 241079 233815 229652 231521 203053 125901
38712 125901 29881 -27732 -4197 89938 187338 224608 213928 219118 250172 234656 128133
38701 128133 -724 -54424 -36843 -26299 -44006 -38826 -3973 -13020 -103182 -200066 -212357 -144387
38689 -144387 -57066 32916 140702 230123 229507 137562 43226 15148 25755 19727 11601 58655
38677 58655 154149 212168 178477 106150 75041 66978 -6816 -146476 -212254 -91042 136351
38666 136351 274897 243568 139705 74199 36556 -38887 -153291 -252159 -300848 -290777 -214791
38655 -214791 -101020 -32567 -56816 -97736 -39995 104174 192743 131885 -16328 -130538 -168465
38644 -168465 -165270 -144523 -93326 -12280 63254 106980 139855 200492 279772 309371 239327 117789
38632 117789 55645 102444 196965 258488 277262 277792 245740 155741 38288 -49571 -96169 -111879
38620 -111879 -68355 49776 160115 164830 114718 159886 309213 378486 246843 38102 -53832
38609 -53832 -14370 40274 75997 151903 256356 288701 218172 137069 126266 164971 199858
38598 199858 212800 189623 107640 -5982 -75701 -74385 -53149 -46087 -22640 26680 42994 -291
38586 -291 -27353 25324 80827 6903 -194216 -369820 -388982 -263530 -100339 3127 12403
38575 12403 -37928 -80294 -89789 -111401 -172074 -200388 -112608 35137 78158 -51888 -237924
38564 -237924 -327429 -295119 -215593 -152168 -131479 -159643 -193822 -158027 -64329 -56410 -230293
38553 -230293 -458769 -521245 -393181 -269489 -282249 -335521 -280120 -128136 726 53844
38543 53844 56971 14504 -82177 -175421 -181792 -109137 -43003 -18592 4696 37667 27091 -43766
38531 -43766 -101051 -70061 34602 139975 188054 156043 56720 -53483 -111450 -111922 -90469
38520 -90469 -39118 88768 271660 403818 427786 402307 386822 344575 235610 126937 109817
38509 109817 160568 187290 177932 195606 248413 271012 232925 172086 122637 96609 127200 228848
38497 228848 316099 275177 132469 38017 52117 67067 -7159 -94528 -69662 65886 207643
38486 207643 278060 254907 139568 -14894 -99219 -60437 21908 47778 33713 52349 88513
38475 88513 64126 -23820 -100601 -136401 -168510 -207298 -222833 -226572 -262370 -305101 -273370 -167059
38463 -167059 -89868 -98217 -122557 -83632 1780 81972 151388 209448 215497 154688 86334 61545
38451 61545 53482 32458 39615 106011 165701 146055 88829 74961 79342 27775 -34500 18193
38439 18193 178581 283116 243839 164677 158104 175667 125892 59011 98855 242697 363413
38428 363413 397640 408491 443963 442017 327268 129230 -56105 -183321 -280256 -366749 -398671
38417 -398671 -314170 -126800 50652 103996 43908 -1249 58802 168007 214092 186335 172038
38406 172038 216155 273006 305960 342493 389539 373779 233193 20371 -150325 -229119 -249828
38395 -249828 -252187 -245753 -233425 -211622 -153684 -43805 77754 149802 165064 166418 178709 193148
38383 193148 208446 228223 219960 141635 20509 -55169 -41216 20440 81291 145781 221302
38372 221302 266895 236402 136282 9750 -98048 -138422 -82115 17976 50009 -14128 -56755
38361 -56755 32427 189825 256078 193385 123246 146080 220568 249823 206047 126415 48059
38350 48059 17 18799 117022 250579 352872 394259 388167 355261 307701 262079 243195
38339 243195 261829 286603 247638 97470 -112781 -246696 -213622 -77070 6425 -49824 -196450
38328 -196450 -325447 -355583 -250423 -32732 190936 287293 226610 118650 83223 120621
38318 120621 142646 93258 -1355 -72937 -65860 19726 107977 103032 -2598 -110686 -140535
38307 -140535 -121174 -111816 -85090 26924 194920 292858 248506 125787 39192 40382 106736
38296 106736 189580 244195 247306 215084 190163 200613 244571 309863 383656 446248 480364 480902
38284 480902 436609 328195 179980 77264 70852 95008 64875 34502 139565 363852 493811
38273 493811 379476 136599 -10918 -8819 30233 51024 122122 272529 408322 450293 445799
38262 445799 465407 471158 385851 242181 150048 125379 63418 -86632 -217554 -202156 -68360
38251 -68360 52137 112311 179590 277032 314038 232391 126241 123066 203865 247795 220946
38240 220946 199082 208347 179449 97187 62415 124079 160228 40820 -166346 -280530 -252196
38229 -252196 -183270 -121394 9563 233852 414222 405290 239210 77240 23606 54660 94567
38218 94567 93118 46148 -6597 -10090 46227 110769 134447 125685 116559 113534 118129 152478 211328
38205 211328 226827 148157 31426 -22429 -5235 2112 -29263 -25208 74436 221337 323852
38194 323852 351238 327298 267842 182662 115313 125282 229595 388130 535492 606229 554481
38183 554481 391443 199809 78566 67213 133950 222820 291641 321610 323233 330076 361971
38172 361971 396876 399195 369961 347241 359950 397803 420351 382736 269467 124580 31344
38161 31344 34482 95492 148777 178175 201008 202622 145739 40267 -54408 -106127 -140153 -181744
38149 -181744 -214372 -207957 -147417 -27715 129489 248749 254578 172946 116522 145166 210754
38138 210754 267748 344431 442383 462711 340897 190867 186469 325872 438392 419415 333351
38127 333351 269532 224032 167726 115631 64618 -36742 -177065 -228898 -105828 86897 162094
38116 162094 77558 -39446 -68116 671 119358 238980 296249 240823 113825 30089 41552
38105 41552 72531 30891 -63925 -110887 -52777 74510 197746 267973 275716 245545 222678
38094 222678 241538 298425 363221 415377 456828 490868 501748 464989 380306 289670 248052
38083 248052 263660 276486 216888 85640 -42898 -98355 -73573 -2428 92743 210398 342834
38072 342834 465386 550881 579502 538432 431467 294359 184970 144027 166973 219562 274201
38061 274201 318862 335395 294862 191494 67116 -20055 -44674 -14679 60493 164185 243319
38050 243319 242822 190874 197432 324599 494406 575814 539861 474067 454858 463044 430469 322607
38038 322607 163645 17007 -50120 -17515 61961 112085 109584 85434 64411 49363 59201
38027 59201 124839 236216 342726 416866 468737 493028 466527 414069 403309 441491 450814
38016 450814 391367 333168 342898 372037 345206 303452 352603 494969 618296 647785 610612
38005 610612 543392 437851 309502 230029 238557 281772 291140 273883 285275 349099 442147
37994 442147 524001 553471 512887 444032 419389 449064 462888 419768 379063 406256 454593
37983 454593 419195 291787 186936 210539 361761 572102 781907 954549 1061260 1090509
37973 1090509 1061028 1010136 974136 972726 991820 990259 952711 928901 984918 1121168 1282652
37962 1282652 1449646 1662523 1943526 2256775 2580491 2959825 3430823 3933657 4368317
37953 4368317 4708351 4981512 5148981 5098721 4792024 4346061 3920601 3567344 3237446 2896362
37943 2896362 2569105 2288404 2054437 1847020 1641857 1424329 1225911 1132126 1200614 1372085
37933 1372085 1515734 1567743 1569030 1559123 1508197 1393376 1273904 1221751 1216237 1180793 1106784
37922 1106784 1066835 1101205 1158930 1177230 1169121 1195859 1281778 1392934 1487806 1556634 1607321
37911 1607321 1636345 1632807 1607214 1592950 1602169 1596594 1534276 1441017 1396310 1444440 1565879 1744692
37899 1744692 1994391 2277363 2473475 2511247 2486356 2555148 2730413 2883125 2947624 3016685
37889 3016685 3194408 3442260 3631492 3696834 3689020 3712667 3848940 4103747 4401018 4659552
37879 4659552 4895059 5202737 5623021 6085319 6516758 6944437 7443062 8037343 8716522
37870 8716522 9506711 10467549 11635418 13012853 14601145 16427509 18575528 21200412
37862 21200412 24456019 28379524 32897176 37944362 43499411 49526802 56081333 63564789
37854 63564789 72748835 84511560 99838056 120235146 147598284 182672788 223025065
37847 223025065 262594576 293634793 309685150 307741790 288970257 258128790 221840326
37840 221840326 186189938 154921866 129280522 109048519 93451674 81409017 71686542
37833 71686542 63318658 55877805 49256674 43336687 37985460 33219157 29155248 25813617
37825 25813617 23068708 20766207 18790622 17046080 15472162 14083200 12921717 11966758
37817 11966758 11134813 10361724 9635448 8960546 8343578 7807281 7365413 6979104 6582024
37808 6582024 6154929 5740718 5387002 5109991 4907768 4758323 4598753 4361226 4054481
37799 4054481 3769381 3577983 3462278 3366834 3278242 3209704 3142148 3040096 2913320 2804898
37789 2804898 2718200 2612883 2482807 2375713 2307360 2217850 2067451 1929633 1912558 2002758
37779 2002758 2064840 2008505 1885985 1793404 1740731 1679422 1619136 1634507 1744065 1844415 1809206
37768 1809206 1633146 1436815 1325598 1278820 1201571 1060103 919136 845877 833841 850780
37758 850780 908738 1028108 1166379 1256887 1305766 1371603 1448688 1461620 1401037 1372163 1456692
37747 1456692 1607805 1749715 1906264 2143209 2446906 2771706 3166093 3717105 4365342
37738 4365342 4900852 5179505 5240634 5166530 4933269 4486806 3896030 3327172 2885734 2557798
37728 2557798 2293688 2077329 1908480 1777861 1680052 1609773 1525906 1355956 1071494 749002
37718 749002 524795 475260 547744 619472 622710 597633 617456 685455 733518 712018 644396
37707 644396 585365 557718 550750 559608 597583 668083 737648 746265 655119 492699 344418 281219
37695 281219 302149 354079 386206 363872 261780 99596 -24767 -5865 141186 275684
37685 275684 290325 236621 250439 380736 541443 623998 608878 552615 499554 439178 348096
37674 348096 247528 195841 224969 304687 376694 403945 378338 310014 230386 176418 145824
37663 145824 101154 48080 60071 171406 296494 335130 317151 343795 416738 449374 437657
37652 437657 472601 557627 569876 469620 398869 468295 576672 574668 501542 501646 578984 606261
37640 606261 543471 478314 451925 404677 320217 278618 318822 369207 370247 362539 392805 422929
37628 422929 400232 347467 315782 300491 262905 197027 127611 74877 55339 82540 137911
37617 137911 174736 171990 149636 123174 93476 89090 150848 250698 293357 233585 132571 65667
37605 65667 38296 30451 53232 106303 141410 132662 134071 202016 300507 347816 324097 270754
37593 270754 214426 159313 132861 165359 222780 220000 120057 -9457 -52963 43871 212612
37582 212612 313102 273963 178364 165862 254852 333060 331478 310653 332192 346168 286485
37571 286485 197880 170967 208862 256735 313631 405259 480079 451272 334994 241192 224421
37560 224421 239694 249271 272111 307853 305596 245568 183435 179801 232200 288792 284126 171747
37548 171747 -12610 -130294 -64416 129854 276600 281849 202997 122373 60153 28259 51814
37537 51814 92211 57187 -50717 -89112 51351 304799 521473 622576 602480 469158
37527 469158 276451 147583 162868 258555 313789 294979 241692 167589 71117 682 4922
37516 4922 43863 47632 39899 96959 196954 226116 149228 67157 71140 128600 155344 127666
37504 127666 76354 27202 -4550 1357 53608 139931 245950 347934 385053 298795 124443
37493 124443 -10400 -14161 79894 178947 238609 267845 266784 214142 108109 -14413 -98996
37482 -98996 -105032 -35751 49587 77253 31348 -32789 -56338 -32008 16671 72348 119041 139052
37470 139052 146862 193388 297287 396767 412591 344111 263980 232763 260566 335525 429471
37459 429471 473049 394061 215383 64310 34606 71653 53831 -29175 -55096 57423 228829
37448 228829 326257 335950 344104 368581 317274 147340 -26465 -58720 42105 138571 149259
37437 149259 123278 129440 155999 155451 132086 139602 215345 341834 454174 475713 377418 218100
37425 218100 98810 63517 68591 52346 -3636 -86893 -174658 -221598 -180780 -70780 25138
37414 25138 63203 92143 156548 204649 165857 79183 50785 92956 98428 -5889 -157252
37403 -157252 -243147 -228868 -159343 -80862 -8662 51791 90836 95722 52085 -38532 -137047 -193765
37391 -193765 -207493 -220814 -242972 -226753 -152302 -82239 -80718 -115522 -105585 -45010 -8832 -36303
37379 -36303 -77515 -75354 -44929 -42057 -91361 -171769 -242794 -265361 -229420 -181400 -189154 -255081
37367 -255081 -299886 -261438 -171702 -99083 -55503 -13562 16971 -3183 -72991 -153261 -230384
37356 -230384 -311180 -359950 -321777 -220754 -149670 -133652 -95471 -7841 15618 -126004 -345003
37345 -345003 -455683 -403886 -289534 -181657 -49833 99172 159654 79136 -33998 -56574
37335 -56574 -33148 -99742 -264684 -386675 -372086 -283360 -218294 -173364 -85710 50674 178257
37324 178257 251992 260127 190824 47185 -101996 -154469 -91102 -16378 -38761 -135529 -185842
37313 -185842 -129736 -38082 -6516 -28625 -17396 71687 188613 258834 263023 233600 202394
37302 202394 172591 127614 53462 -38869 -109309 -122421 -87682 -44195 -1715 69146 169660
37291 169660 232685 190413 64225 -58099 -129966 -182817 -245955 -281517 -239129 -147229 -98594
37280 -98594 -142728 -231517 -284183 -272277 -216753 -130795 -9235 130530 238852 277365 245490
37269 245490 157001 23306 -126521 -245106 -309549 -334315 -322184 -248565 -130993 -59741 -92405
37258 -92405 -157815 -148207 -79903 -60523 -105438 -110446 -34588 19807 -19803 -59456 15292 140530
37246 140530 155005 39009 -61741 -43884 45617 123457 174303 200363 167922 70612 -18406
37235 -18406 -21346 53446 137907 186209 196799 190501 199326 240442 273493 229270 115658 44051
37223 44051 98050 216131 265106 201692 97528 23120 -21297 -57788 -80382 -75031 -45927
37212 -45927 -1554 52460 92507 83849 27973 -26407 -42231 -39762 -58272 -91372 -91811 -34882
37200 -34882 50172 114255 131836 104576 45050 -22490 -55925 -18793 78400 176138 220228 208845
37188 208845 170816 111586 14356 -100798 -157560 -96365 44938 154954 157583 76908 -10121
37177 -10121 -60426 -85092 -100368 -94307 -52930 7133 57292 94286 129196 148411 128248 94679
37165 94679 117186 212467 298953 295315 229463 186749 173040 109915 -32606 -185936 -293890
37154 -293890 -388456 -495861 -538562 -423382 -198196 -27050 -3693 -67019 -120072 -156118 -217262
37143 -217262 -283999 -283082 -197327 -101571 -67533 -78093 -70402 -31645 -2199 2260 8312 12341 -40304
37130 -40304 -157634 -241519 -203272 -105092 -90005 -174095 -214282 -115811 29095 78140 35690
37119 35690 20324 82834 158312 186848 186602 190544 186151 151159 100975 68914 65362 71718 53449
37106 53449 -19981 -134632 -211577 -170454 -27641 105353 139956 97864 62474 70900 82007
37095 82007 41738 -43335 -107295 -100353 -53698 -45897 -100621 -155584 -157739 -144395 -174823 -212472
37083 -212472 -154524 17173 186775 232650 154584 48307 -1778 23213 89469 142504 148006
37072 148006 121871 100737 78603 10653 -107927 -212753 -245941 -221419 -183686 -138188 -63074
37061 -63074 34047 112474 142453 125151 77954 21759 -25712 -59943 -85906 -100931 -98815 -90161
37049 -90161 -88690 -75051 -13709 84429 159680 179215 168833 150569 104244 25584 -29971 -7970
37037 -7970 80411 193539 309778 394773 377182 234292 64288 -10837 5373 11400 -33336
37026 -33336 -71009 -69595 -85547 -166260 -266082 -308079 -277902 -212325 -135767 -52879 24438 84889
37014 84889 138273 197615 250190 267281 236056 173023 118511 119157 189245 278092 301871 226779
37002 226779 104030 8942 -35876 -61040 -93713 -125951 -135061 -113961 -74046 -29822 4984
36991 4984 8647 -35785 -100167 -110964 -35902 42650 10721 -109739 -161102 -61334 73626 99618
36979 99618 56515 88193 197331 230584 112101 -55218 -161830 -226976 -288311 -278935 -130046
36968 -130046 77218 183044 141788 44778 -30913 -99255 -184639 -248976 -235523 -145142 -42454
36957 -42454 765 -32618 -85778 -78140 11967 126317 192485 184857 118306 27030 -35021 -27367
36945 -27367 12743 -7080 -109469 -200140 -190374 -106073 -17974 68731 171358 235051 192701
36934 192701 95374 71835 155155 245522 257527 216968 190183 191954 188178 133780 1002 -171004
36922 -171004 -263395 -195074 -50164 7856 -42278 -55752 49769 164056 152592 49635 -13350
36911 -13350 4659 46646 89463 168741 279258 343602 300184 172126 40719 -20004 4386
36900 4386 50138 28794 -72486 -174377 -215912 -230855 -267734 -291511 -238822 -129531 -38948
36889 -38948 14584 68027 119327 130284 119751 154722 232972 267956 219152 150596 121894 106269
36877 106269 71722 66169 143737 254522 288569 211152 92479 15233 4539 38573 77386
36866 77386 81702 43234 -1225 -11771 7626 29781 51714 81442 93245 48499 -37110 -96074
36854 -96074 -91995 -59903 -46980 -49094 -29361 26624 95662 135640 105000 -4480 -128193 -154459
36842 -154459 -33420 154887 283010 313812 306073 292134 225969 83222 -57022 -97735 -54760
36831 -54760 -26931 -47336 -43888 34994 127000 131270 32743 -92193 -164624 -159729 -101866 -44686
36819 -44686 -37804 -75644 -95077 -55734 2914 26141 35442 93003 189903 244046 217682 167227
36807 167227 153198 164653 168883 179051 221016 270464 276568 228729 157057 83447 12512 -43491
36795 -43491 -73471 -96260 -143576 -212998 -264840 -265460 -215022 -142276 -92705 -104747 -167063 -212759
36783 -212759 -189193 -120428 -64468 -27860 21853 66631 33918 -92792 -221025 -252375 -197976
36772 -197976 -142122 -119549 -85730 -1187 107081 177522 170880 86896 -41318 -154165 -193649
36761 -193649 -145133 -41029 78600 184820 238633 199030 86331 516 19292 88495 74615
36750 74615 -62146 -204075 -215835 -102790 12413 35197 -33081 -147376 -266947 -344540
36740 -344540 -334052 -243609 -143306 -90061 -72035 -48839 -11740 26430 66454 104708 105474 43044
36728 43044 -39395 -65215 -20373 33470 47372 34868 15570 -35454 -137815 -240959 -265471
36717 -265471 -201010 -115988 -66684 -38639 9612 82378 148943 181436 164920 94977 -1367
36706 -1367 -62649 -54968 -27890 -56623 -124144 -121109 9167 181421 271936 268426 256561 289366
36694 289366 344389 395064 437204 433419 320181 113831 -57465 -83582 8041 108444 159106
36683 159106 174569 170484 134671 58271 -52625 -185437 -303525 -343549 -279721 -175850 -125747
36672 -125747 -152199 -204279 -232343 -215288 -136363 2296 145736 224811 229084 196768 150306
36661 150306 100133 87806 142266 201304 168988 60169 -5734 24690 70879 54021 2006
36650 2006 -31395 -54596 -75535 -41375 67961 158962 142485 80736 103239 205798 251776
36639 251776 173658 62823 30694 68083 84901 28884 -78849 -189555 -271230 -320969 -346425
36628 -346425 -327926 -215395 5515 256455 416243 428004 330433 200207 104703 93643
36618 93643 174201 280069 307028 199907 -5722 -215425 -331006 -307475 -198485 -118438
36608 -118438 -112571 -98236 5624 134640 157625 73983 18708 65207 140308 165398 164230
36597 164230 172315 149570 73007 30695 111689 250971 297200 218123 133081 130865 149155 78279
36585 78279 -74030 -178329 -131523 26705 156078 163033 87478 34158 43491 70248 78539
36574 78539 93937 138257 169964 137543 60655 12304 36145 115357 207547 277851 306408 288290
36562 288290 226467 126310 15200 -47326 -30142 -674 -64451 -212688 -306088 -254365 -137474
36551 -137474 -82935 -88295 -52994 54647 156265 175268 110553 2381 -108487 -185846 -212770
36540 -212770 -199344 -147463 -44581 64195 58476 -116843 -333154 -400451 -289300 -134379
36530 -134379 -36205 25859 83649 111483 104347 116483 167101 188398 117901 -22344 -174290
36519 -174290 -302867 -375623 -360782 -285691 -225907 -200191 -152362 -69848 -24399 -41625 -29658
36508 -29658 83463 225362 279753 239643 171322 95733 7632 -47516 -30362 -774 -42171
36497 -42171 -124001 -150899 -120619 -111115 -126068 -86818 12418 73212 51518 30670 86382 178530
36485 178530 230881 228267 178793 71230 -56793 -91006 23558 171660 190107 73829 -28201
36474 -28201 -9264 88076 165362 189269 190114 194254 197951 186304 153216 112774 98987 137300
36462 137300 206956 248771 224536 157266 96689 53045 -10430 -112606 -207815 -231583 -182010
36451 -182010 -119193 -81153 -43464 19315 79692 105657 124286 178428 240800 235893 143912 22743
36439 22743 -76102 -152623 -210962 -231259 -210508 -175067 -130380 -56754 20219 25230 -54920 -119828
36427 -119828 -80428 13238 42370 -15596 -70435 -53108 9189 54406 56815 24622 -19683 -39260
36415 -39260 -5119 63880 111991 105060 52239 -25694 -111420 -175847 -193159 -179992 -177602 -183330
36403 -183330 -143302 -33124 93638 164136 163879 132033 106668 99829 104439 101661 77854 48333
36391 48333 39883 37121 -15593 -131472 -238616 -260130 -204717 -129356 -43774 77535 200136
36380 200136 232399 151781 62498 79723 194151 292940 286161 175613 28785 -70503 -69021
36369 -69021 7839 66396 46479 -2455 5085 63092 90865 69512 73173 143306 220810 248587
36357 248587 257589 282382 266859 150439 -2919 -72867 -55313 -51362 -87770 -75396 20173
36346 20173 87510 23031 -109067 -157513 -74881 50449 122473 128560 117678 138892 188741
36335 188741 189667 56158 -179355 -352907 -337665 -187907 -56221 -12157 -19558 -50711 -114719
36324 -114719 -180411 -180306 -114210 -59245 -48587 -25179 47639 115955 131603 139864 190831 220421
36312 220421 122672 -71919 -188554 -110734 72557 171370 116234 20338 17632 91918 112990
36301 112990 21312 -91278 -106273 -22236 75286 137129 169557 159143 71296 -67282 -162222
36290 -162222 -152358 -64053 42501 119547 123146 42296 -43375 -24136 85260 140906 69413
36279 69413 -20420 2801 108167 170844 155877 124426 102873 61089 1792 -32061 -30876 -8848
36267 -8848 64276 221658 395144 459875 397295 315255 284374 251615 151163 11190 -97954
36256 -97954 -150285 -152653 -107248 -27683 56530 135926 205141 202732 58041 -168604 -294676
36245 -294676 -230898 -101471 -69660 -122383 -127803 -46221 34535 49532 32438 38136 75511 126838
36233 126838 169702 179517 165968 190212 277560 333812 238653 21745 -146531 -154495 -51007
36222 -51007 70224 184050 280862 298965 202816 75263 36235 86984 115075 52351 -43898
36211 -43898 -82482 -50529 -1748 26285 37983 37310 7766 -45367 -61975 20236 172618 271863
36199 271863 220074 50302 -119915 -224212 -290997 -355743 -390141 -349206 -247980 -147101
36189 -147101 -77700 -18130 58267 142019 197728 194991 125909 11417 -99984 -155770 -143994
36178 -143994 -116581 -145798 -237392 -300376 -236960 -64121 93177 142990 115695 86794 68671
36167 68671 39998 35605 111253 226411 260619 172270 59538 27711 71554 134151 204218
36156 204218 284205 322832 268518 161037 89618 75300 67448 43927 34904 43788 23425 -43933
36144 -43933 -103902 -98460 -32731 53498 139985 219263 266415 253364 184914 98095 27519 -19999
36132 -19999 -58569 -91863 -92719 -35984 41573 56449 -10413 -59420 6995 136638 184214 112396
36120 112396 43029 82760 187514 250430 245894 215213 169896 97855 35258 43643 116798 179113
36108 179113 182133 148169 116204 99598 103290 127215 137698 86021 -23051 -123538 -169894
36097 -169894 -185396 -205478 -216685 -189864 -140471 -109580 -102833 -92637 -71893 -61089 -61199 -42757
36085 -42757 6588 62529 111612 180029 278870 348923 313985 187173 71491 37298 45476
36074 45476 22417 -32909 -67416 -68428 -72227 -86517 -77693 -48761 -55274 -106015 -114386 -7668
36062 -7668 163655 291801 347639 373395 370206 295052 174845 118543 170167 230425 188497
36051 188497 75864 18276 69125 161706 211029 195202 136718 66756 25507 49144 128434
36040 128434 204782 222287 163790 34820 -149581 -344651 -478039 -505024 -448188 -362310 -277048
36029 -277048 -194916 -123509 -74358 -38888 -2508 16956 -16583 -92067 -136752 -96989 -11341
36018 -11341 33906 15170 -988 50932 152285 233259 265233 282093 310741 317836 249420 108536
36006 108536 -33143 -105455 -107140 -96434 -124024 -184333 -225565 -192599 -61819 141715 343254
35995 343254 451015 424094 315734 226250 203245 209233 194319 162528 135471 87957 -16388
35984 -16388 -131688 -145983 -24250 119333 145845 58312 -14335 13028 91421 125489 89572
35973 89572 22963 -43731 -106173 -151299 -156233 -122743 -75010 -20778 48399 112089 119175 55404
35961 55404 -19470 -34783 10139 59048 76325 75492 79328 91724 113483 152348 206102 256481
35949 256481 281496 254115 144475 -31710 -175136 -180811 -74618 -6859 -70558 -187566 -230474
35938 -230474 -198444 -190461 -243705 -297338 -306540 -293514 -272830 -219482 -140527 -91789 -79663 -26066
35926 -26066 110922 252614 308859 313980 365987 466630 519361 479390 412314 381730 353793
35915 353793 256310 89758 -60919 -106862 -24611 138045 301326 399778 405681 327933 209275
35904 209275 117251 96450 113896 92887 24646 -5719 51881 115327 78688 -20867 -43018
35893 -43018 56370 167532 190393 164448 189440 285092 384459 423128 388310 308651 229530
35882 229530 177024 132428 71482 23749 35087 71558 46403 -32265 -38122 91589 240828
35871 240828 263802 175736 97429 69285 36853 -12478 -25149 4179 6470 -48943 -104813 -106722
35859 -106722 -68675 -23935 19647 52719 63172 87285 190250 360349 488621 496627 428610
35848 428610 373885 349335 307350 221638 120233 57579 76943 165430 231842 182192 38868
35837 38868 -76270 -102384 -105660 -143932 -159796 -90531 -5224 -19371 -117022 -175048 -145579 -98059
35825 -98059 -77355 -35925 59356 147594 152056 76199 -18441 -80733 -87686 -43930 9593 33184
35813 33184 52333 126050 231020 252693 138615 -8484 -58721 -24677 -22938 -96061 -161014
35802 -161014 -138004 -55786 -1184 -10767 -45576 -53351 -31572 -26909 -71571 -123079 -92083 51962
35790 51962 228550 332047 350668 356294 384311 378828 278134 114624 -8301 -28961 11671
35779 11671 27869 -7912 -37916 262 84877 133023 114792 103476 179435 309447 369259
35768 369259 286561 122940 3787 -3009 74133 163920 219180 240628 253938 268708 262946
35757 262946 214303 138277 76445 49599 47746 68832 131129 223060 270498 200511 38186
35746 38186 -100445 -129380 -75192 -11056 61358 204297 411599 550945 497372 299261 142963
35735 142963 141757 216451 213885 97676 -24819 -40842 51398 160130 192987 123063 -12008
35724 -12008 -158561 -290578 -400269 -458049 -422407 -306239 -191162 -139010 -123490 -95666 -81341
35713 -81341 -142627 -258369 -326325 -298204 -236688 -206905 -180256 -97239 25940 118584 159391
35702 159391 199175 281164 381263 435816 407257 320370 243109 222404 233410 212813 147924
35691 147924 97229 106129 148470 187518 246660 356053 459828 460062 356719 264353 259250 276951
35679 276951 215521 95924 46685 133186 266708 311748 245899 171703 182106 259032 318915
35668 318915 320166 286395 240020 165266 52810 -57330 -109017 -91224 -44826 -20213 -44158
35657 -44158 -113298 -199595 -269586 -310291 -326144 -308886 -239797 -134179 -45771 444 42344
35646 42344 108265 147639 93222 -27260 -107623 -90669 -20716 34337 52299 35846 -12679
35635 -12679 -63835 -60859 11810 95180 127324 117420 113793 130062 144531 146399 135530 96719
35623 96719 29187 -8048 53650 179965 231856 121695 -64091 -154153 -92268 11881 43103
35612 43103 25303 54065 133095 168017 122366 81792 115251 152967 85630 -65136 -176348
35601 -176348 -203078 -216426 -248843 -217825 -63551 128464 230178 240940 258961 310086 308238
35590 308238 200332 62039 807 16789 19257 -39685 -106283 -109036 -54260 -1727 30814
35579 30814 84146 168984 215993 158650 33181 -61475 -89645 -103966 -146982 -197152 -231778
35568 -231778 -276285 -349604 -410290 -406332 -349223 -296994 -283803 -296875 -303235 -276795 -221529 -179449
35556 -179449 -179541 -171159 -66752 125712 280070 299982 219776 110321 -29115 -203083 -323946
35545 -323946 -302286 -191041 -121347 -119562 -106537 -61022 -47864 -72519 -45582 62208 146689
35534 146689 112680 -5161 -123433 -222195 -306453 -334480 -267783 -143225 -27908 55417 105015
35523 105015 95144 14948 -92927 -186294 -265979 -315321 -269364 -122801 -3247 -33675 -161578
35512 -161578 -229841 -189441 -128076 -100270 -59885 9915 21451 -89989 -239972 -277547 -161172
35501 -161172 9104 117950 144211 149190 193726 276520 339499 326626 237645 124689 44709
35490 44709 22871 50506 101268 151908 196482 234992 250640 224118 176143 158015 181612 201746
35478 201746 196444 212630 281390 335535 284441 145203 26720 -573 51106 151904 273662
35467 273662 346378 293876 141653 10859 -27428 -23336 -45628 -84625 -101582 -105278 -121885
35456 -121885 -141045 -147403 -159218 -178227 -143700 -4779 182074 287503 236775 69665 -106908
35445 -106908 -192416 -148540 -29942 53571 42670 -14674 -33808 7677 69102 105969 89242
35434 89242 4178 -115872 -182793 -137974 -24914 71349 130603 184703 225681 204162 117063
35423 117063 27603 -11971 -5672 18613 33979 11154 -50428 -89494 -43750 53675 103583 70577
35411 70577 13577 -20529 -53721 -107518 -159529 -202954 -270525 -356339 -389067 -332988 -243567 -170129
35399 -170129 -83968 27232 78034 -1606 -134684 -191198 -169858 -166188 -189645 -149746 -27797
35388 -27797 72701 81680 52457 49989 55725 43617 53812 113791 163488 141370 84546 62550
35376 62550 65945 47365 27183 61383 131355 161008 130473 83941 36075 -31942 -82634 -35901
35364 -35901 98652 198453 182648 109917 70524 57458 15643 -39842 -41315 21647 86412 105023
35352 105023 86016 47177 -19777 -121683 -231159 -293050 -256257 -115241 62608 176268
35342 176268 187997 158883 156685 160669 109337 17603 -24160 30118 128051 201011 243506 280864
35330 280864 302205 267663 167957 53179 5955 79169 230888 325323 248352 42097 -117874
35319 -117874 -108248 14670 104594 103627 79104 101848 151504 161068 114030 62251 57793 97007
35307 97007 142894 183112 236265 300363 335121 322955 310845 338468 348632 248721 69932
35296 69932 -23335 66774 231853 291274 220425 155146 184127 234440 189498 44853 -100967
35285 -100967 -162299 -123898 -19038 90243 124897 44485 -91828 -163710 -115257 -12523 48270
35274 48270 52494 42046 11684 -89692 -247873 -357260 -347794 -270097 -200492 -131500 -36653
35263 -36653 23186 -21652 -101567 -80211 26424 56076 -43322 -125929 -91840 -58280 -159913
35252 -159913 -309415 -322269 -192413 -65503 6829 94367 189377 182238 68796 49 57080
35241 57080 130385 107210 42492 38955 69241 39518 -45596 -103601 -116667 -143765 -205105 -240891
35229 -240891 -190791 -68086 41863 42069 -83036 -224599 -256109 -192759 -162712 -206797 -227115
35218 -227115 -178146 -159227 -220278 -229177 -89651 37404 -58888 -284926 -330746 -102069 162356
35207 162356 237758 163745 80833 20175 -30700 -19137 76369 158842 150673 121676 160247 213835
35195 213835 190401 133681 149088 216831 232628 193960 188871 219102 194370 108360 64190 94783
35183 94783 105478 45655 -3362 13220 6759 -105374 -230452 -208769 -39962 120314 169258
35172 169258 153435 156107 187892 216073 225499 209267 149766 51602 -36384 -70586 -72592 -111762
35160 -111762 -227449 -381964 -494863 -523762 -508840 -524452 -580314 -595211 -498011 -338036 -246582
35149 -246582 -280293 -350028 -335125 -232560 -147415 -152981 -214158 -255535 -253889 -232822 -201173 -142768
35137 -142768 -58174 24079 82783 119943 136377 123346 87935 51762 9601 -66630 -152375
35126 -152375 -152875 -28349 100183 70800 -89121 -164632 -37666 133340 119569 -63115 -184396
35115 -184396 -127486 -33659 -73889 -213363 -303318 -311373 -327275 -380727 -391415 -310542 -197257
35104 -197257 -118631 -66540 -20293 -9126 -49496 -86497 -72713 -58195 -120636 -234662 -295734
35093 -295734 -267366 -224939 -242797 -307391 -363908 -388457 -381307 -334156 -242469 -126242 -13519
35082 -13519 79229 141722 173008 196160 232596 253593 205853 102709 29624 18520 -24018
35071 -24018 -193127 -425703 -548671 -485854 -340366 -251268 -236428 -221655 -177483 -159932 -216808
35060 -216808 -304010 -324918 -242905 -131376 -97754 -161399 -228438 -205413 -122345 -103848 -205512
35049 -205512 -318347 -283759 -97593 57635 18943 -156736 -258326 -176556 -19462 52146
35039 52146 25123 89 14985 10221 -39906 -74285 -56454 -40841 -67479 -71965 14366 127915
35027 127915 135319 15466 -110560 -137154 -85173 -33956 -5592 42782 141657 257907 316533
35016 316533 266975 135407 8393 -43536 -18630 37281 72981 45010 -61159 -190173 -243713
35005 -243713 -193486 -124542 -117543 -139932 -119439 -67741 -36063 6259 126819 279604 329094
34994 329094 240278 127370 87275 98461 118589 160775 215740 212324 132073 66873 82269
34983 82269 112289 77016 21385 38248 121489 196034 236449 257431 241006 175883 121944 134251
34971 134251 170463 176816 207311 328127 452496 428455 277624 187264 248209 348352 357389
34960 357389 273439 139458 -41802 -233482 -332127 -308593 -285965 -374032 -499478 -506962 -378191
34949 -378191 -242112 -187185 -160165 -63257 110530 261136 279523 160671 22053 -11467
34939 -11467 58330 118731 91905 9346 -64113 -107961 -121016 -88955 -18457 50816 101642 149601
34927 149601 173017 110737 -26301 -122464 -98222 -11987 42750 63652 80386 47385 -86804
34916 -86804 -242588 -261232 -94282 143733 310940 358650 327695 293287 307596 342581 307545
34905 307545 173992 46073 38767 122893 171885 131374 53835 -9935 -57056 -83623 -83710 -89458
34893 -89458 -123445 -127389 -40342 65458 47223 -101978 -229999 -231673 -160441 -101660 -56256
34882 -56256 -5485 19552 5522 5346 48065 75978 37808 -25882 -53266 -48326 -37023 -8966
34870 -8966 32471 37159 -376 9471 124072 256818 287517 227188 170147 131828 54231 -51551
34858 -51551 -93259 -38982 30405 34968 -13820 -55894 -50719 13630 119283 208547 226670 190804
34846 190804 172913 204209 238189 214540 118812 -22172 -156843 -217561 -168433 -65783 -27855
34835 -27855 -114749 -259633 -335783 -276091 -120788 30644 102622 92116 49523 21184 20292
34824 20292 42679 78779 108912 125918 166131 264704 369638 372615 257747 141136 111287
34813 111287 114852 75867 38382 75625 127959 79068 -37347 -63233 45842 157893 172125
34802 172125 147964 167674 196995 168948 110802 92044 108982 107474 75770 39178 -2498 -62239
34790 -62239 -113381 -110659 -55300 -248 2186 -57446 -132797 -145974 -65560 36034 59880 20029
34778 20029 28323 121762 200996 187662 146368 174683 252285 290143 268003 228072 180295 112444
34766 112444 61293 77270 136463 169680 156628 113612 23768 -121716 -239044 -222792 -101139
34755 -101139 -14650 -32891 -95942 -149867 -223885 -333566 -414822 -417500 -383593 -368421 -350803
34744 -350803 -285615 -189062 -104853 -27004 80994 216955 337746 401793 383164 284140 166967
34733 166967 119088 140171 123171 12002 -82829 -18806 169361 306298 310090 272434 286645
34722 286645 314459 282481 212970 170782 145908 89329 29058 40646 104026 98285 -24816
34711 -24816 -150764 -146137 -30129 67725 77124 34574 -12855 -59762 -94454 -87777 -60499 -85901
34699 -85901 -178352 -243921 -203901 -116947 -103884 -183851 -266439 -288574 -267778 -215645 -100337
34688 -100337 60208 153812 102192 -13466 -42117 36703 88713 17995 -95106 -103280 8904
34677 8904 109307 93181 3458 -47623 -21613 27561 45483 33456 23120 42543 104657 186106
34665 186106 223323 181351 123590 147011 237685 267357 164573 10972 -82738 -119124 -159631
34654 -159631 -197813 -186376 -147765 -149832 -187791 -191094 -142436 -93759 -65929 -34277 -19187 -77672
34642 -77672 -179103 -205100 -121830 -43015 -53910 -75683 1439 132453 178481 106690 19349
34631 19349 3604 49744 112645 164718 178174 130207 47067 -9688 -15860 -3430 -4819 -22594
34619 -22594 -55068 -102137 -137205 -121535 -64635 -32153 -72260 -159781 -228753 -238183 -192799 -120586
34607 -120586 -48593 8708 53283 99482 161583 235525 286460 270885 195885 140609 171486
34596 171486 237015 209928 58444 -86413 -80083 65965 211433 239919 134287 -49953
34586 -49953 -215626 -264933 -188945 -97498 -91240 -129431 -102864 -9931 41418 -68 -70737 -115847
34574 -115847 -161734 -224242 -246092 -190104 -118677 -109190 -143199 -144089 -82609 12916 111648 185866
34562 185866 194976 126243 33432 -14762 -6237 36522 118546 251540 386736 434635 361512
34551 361512 222025 88739 -10848 -77040 -98458 -61465 11158 57245 28104 -54245 -110478
34540 -110478 -91679 -37899 -22386 -58080 -105808 -155045 -219855 -253937 -171892 1183 101818
34529 101818 34323 -72892 -28850 149716 258780 188957 56250 18360 73451 108065 67637
34518 67637 605 -28424 -2445 56167 112136 143359 164201 202805 237179 192846 43412
34507 43412 -119446 -172620 -108071 -39886 -60454 -136580 -165965 -99305 21749 124715 171529
34496 171529 170555 152862 145933 157717 177202 190290 188960 158695 74495 -59073 -166086 -144906
34484 -144906 12445 178042 211618 114122 12696 948 50320 86544 90621 91571 107563
34473 107563 136202 171783 197249 188929 160775 168136 230926 292845 303179 297656 336417 395820
34461 395820 397781 330640 264463 249033 267666 292909 315173 308862 245949 162750 143048 209023
34449 209023 292265 336754 362357 395163 407029 372270 324644 305829 305898 301750 303491 311113 276503
34436 276503 170693 48415 -17167 -31016 -48009 -81640 -104955 -114996 -129856 -139934 -121510
34425 -121510 -79916 -25202 64673 190830 275785 241672 129784 58280 68042 93254 80181
34414 80181 44973 8058 -34836 -57108 -8062 93508 154210 127588 63850 10252 -48909
34403 -48909 -113457 -126936 -78173 -51328 -92532 -107290 8711 196860 302847 278216 206775
34392 206775 155592 115177 86459 112560 192642 251745 236279 175894 117543 56451 -28437
34381 -28437 -114049 -148680 -107996 -17527 60446 58887 -43093 -191396 -300419 -322287 -254431
34370 -254431 -110554 63690 174016 157324 78255 67085 151587 232688 243094 232344 252723
34359 252723 261331 210784 155778 173307 230937 235169 178655 140267 155873 187842 220288 283555
34347 283555 364450 384901 309260 198761 116019 43589 -46550 -100994 -39054 126119 291052
34336 291052 382876 417690 431175 408368 315768 171634 42491 -29745 -71159 -137560 -247921
34325 -247921 -368329 -451773 -473331 -426536 -313643 -161345 -29870 26517 13520 -10102 -1785
34314 -1785 19075 4108 -61348 -145796 -214191 -261852 -299343 -319526 -299375 -235899 -163782 -127740
34302 -127740 -147996 -218323 -313397 -376079 -328162 -148028 66898 175612 149139 97702 119909
34291 119909 187366 223504 234336 285329 384984 474926 521702 538534 519326 434044 304022
34280 304022 205561 171886 155853 116694 79290 73752 79835 76503 90944 144797 195558 187432
34268 187432 129214 71685 35821 11481 1886 22011 72395 151566 265492 387625 452653
34257 452653 444261 446065 533385 647064 658344 540143 384999 262032 155881 57506 8201
34246 8201 12331 320 -61320 -100727 -53803 15191 -8525 -128564 -238936 -272139 -266159 -280694
34234 -280694 -315320 -328884 -290978 -197336 -73345 25057 52410 31648 37885 107587 192418
34223 192418 218211 161517 54532 -50332 -97881 -50269 67699 162614 155442 66450 -14955
34212 -14955 -35247 -12039 26373 77956 127395 127794 64440 -1410 -1939 49017 89193 108841
34200 108841 150923 210864 212913 120269 9087 -20302 28240 60410 15948 -70308 -126911
34189 -126911 -122086 -77159 -36445 -30212 -44291 -24161 70403 215048 341669 401026 383346
34178 383346 292295 138667 -37169 -172695 -228770 -211756 -150540 -74173 -8832 35622 82539
34167 82539 163505 268957 349953 374931 356720 318554 267574 211228 160513 98517 -13405
34156 -13405 -167451 -283070 -291187 -221906 -162531 -141772 -108740 -32017 34636 20109 -58607
34145 -58607 -101804 -39682 90274 192730 222271 219398 246710 318194 400785 460490 484051
34134 484051 467316 407344 308468 185674 62842 -33692 -97650 -161004 -257390 -354703 -368964
34123 -368964 -278264 -174645 -145804 -146449 -68178 83860 179848 139033 24690 -59399 -84009
34112 -84009 -71577 -41683 -30729 -90529 -200838 -244091 -141222 32465 139176 148242 140864
34101 140864 178360 245448 304622 326407 272891 130133 -34206 -111796 -69789 19622 72320
34090 72320 71073 47820 30657 18435 -15107 -81405 -121967 -38065 169892 337641 299762
34079 299762 98295 -66348 -89759 -62096 -88912 -125282 -60846 99163 222187 199264 56496
34068 56496 -78728 -100355 -21974 45290 31398 2410 66807 206612 282578 213336 63648
34057 63648 -66830 -152126 -199433 -193462 -144001 -111458 -114397 -81491 24805 102316 27976 -155415
34045 -155415 -274173 -234480 -111174 -27125 -20719 -42989 -26668 55019 160783 213683 187625
34034 187625 138521 119271 107867 69450 37877 61591 110539 121484 99460 80594 31549
34023 31549 -95563 -227537 -225647 -89162 28161 33705 -2517 -3219 1021 -13844 26155 155289
34011 155289 247261 170540 -4596 -93605 -50397 3721 -17687 -72672 -105904 -127342 -140581
34000 -140581 -99656 9879 123670 182438 205508 239796 287529 324220 342841 341019 302510
33989 302510 227936 151285 93109 28286 -66053 -156754 -183813 -129855 -38449 23701 13232
33978 13232 -55890 -112185 -88970 -1770 64681 58303 14141 -5974 12617 42013 46492 -7996
33966 -7996 -127177 -242181 -249424 -142136 -44011 -53793 -113723 -106514 -28695 28084 27441 6182
33954 6182 -36387 -136776 -245309 -238788 -96921 53491 126715 190800 311696 402358 350507
33943 350507 214102 145756 164392 146516 35397 -79469 -110727 -76580 -17303 80242 214979
33932 214979 317305 332835 298065 268406 224444 118219 -25555 -124015 -136458 -100138 -78233
33921 -78233 -107446 -178458 -237825 -232437 -175759 -133609 -121248 -76825 13205 36648 -98271 -283898
33909 -283898 -306248 -120776 84987 139431 84302 55825 67961 28208 -78471 -148369 -111321
33898 -111321 -22048 39009 75912 128689 172490 146967 68087 30345 82860 166974 206350
33887 206350 204765 209829 222493 203685 150492 103211 80560 65679 58445 79786 110062 87275
33875 87275 -1111 -78395 -73205 -14846 7491 -48479 -146177 -214690 -195918 -85967 35236
33864 35236 57673 -33840 -131992 -148968 -130898 -165799 -233538 -240618 -169784 -90956 -36083 32001
33852 32001 122656 192573 234105 288319 343522 321596 207446 96091 53590 16696 -99671
33841 -99671 -265332 -378174 -389097 -317820 -200374 -91886 -67705 -138379 -199542 -144315 3198
33830 3198 135638 205330 238717 244003 204879 155154 159063 204818 203284 114733 5513 -45621
33818 -45621 -35871 -8665 9802 18231 27814 62454 134523 209983 236618 211513 175698 139166
33806 139166 65824 -54121 -168007 -213692 -166801 -31994 155817 312343 354236 297576
33796 297576 249323 271027 307519 284747 218497 175769 174558 178125 160751 131835 113610 127911
33784 127911 180954 233379 216557 109956 -26391 -120176 -149098 -113136 -4261 148437 256501
33773 256501 258821 196054 143333 111225 79902 84986 173524 294168 334179 275235 219532 234733
33761 234733 258192 202509 90510 23489 49493 118499 156510 142647 109676 92650 92704 97976
33749 97976 133927 260472 492724 748674 915452 954643 903665 792007 613204 378569
33739 378569 144399 -24253 -81591 -8223 151534 273794 259978 167822 153002 257644
33729 257644 350483 322026 240914 234648 292510 296641 211480 129782 127512 164426 155525 82628
33717 82628 7298 2106 76383 150924 125154 2608 -80593 -7815 161241 256921 212285
33706 212285 125331 97720 103297 65856 -4756 -31765 3361 30144 -9155 -79073 -99940 -55391
33694 -55391 -18407 -60001 -150589 -183025 -98820 42552 141662 172403 181405 207106 254000 324892
33682 324892 408465 438983 347283 172867 54819 75624 172063 238198 255589 266807 272695
33671 272695 232195 144323 62518 28291 40802 91654 181724 292110 372206 373754 289363
33660 289363 163888 75625 80146 145606 166980 81662 -44711 -87130 -4427 127630 217674
33649 217674 244547 238554 226542 217368 210197 193677 152215 85327 8747 -66652 -140797 -207589
33637 -207589 -250088 -256458 -229350 -183220 -143776 -135916 -150502 -139248 -75172 -5455 -861 -53275
33625 -53275 -70112 14202 156766 254123 244897 150614 41747 -17840 -12822 16617 15489 -33640
33613 -33640 -105343 -166496 -194749 -176221 -122661 -84593 -100838 -131197 -89933 39324 172461
33602 172461 230704 226777 213806 200893 171496 149326 183442 277640 382409 452510 475248
33591 475248 451337 389804 319626 267513 222458 157459 87796 68194 119975 195390 234900
33580 234900 236063 242701 280894 330760 358531 354609 332072 302781 272784 258356 284283 352948
33568 352948 428550 467677 455682 401256 317324 232133 191145 201024 191385 96983 -26189 -45792
33556 -45792 65903 178353 175310 102471 69801 71252 7259 -134781 -231888 -184614 -50996
33545 -50996 22235 -31700 -131481 -138308 -6105 157385 196554 82701 -55476 -99875 -83699
33534 -83699 -105389 -157299 -140998 -36538 53934 54331 13662 16547 70188 129997 176642 209493
33522 209493 204025 133444 17551 -84337 -117350 -58605 63805 163961 155079 41668 -81649
33511 -81649 -145295 -173200 -208938 -229088 -181166 -69820 47857 127443 152212 111988 20871
33500 20871 -61988 -83817 -64885 -68390 -106838 -122317 -67300 27543 79754 36677 -72473 -163180
33488 -163180 -181538 -159323 -163230 -200495 -217238 -184781 -125967 -52302 39484 82923 -34159
33477 -34159 -281834 -423873 -268034 74356 313980 340545 310224 378101 503864 576264
33467 576264 588091 588997 561680 459118 315179 217088 190072 189826 191497 206120 212237 150993
33455 150993 15084 -110456 -131205 -43739 69677 133028 143443 147380 165489 160781 91575
33444 91575 -22389 -116917 -160425 -175934 -183322 -168836 -134955 -131196 -187874 -249582 -232104 -138409
33432 -138409 -63297 -70551 -111579 -97977 -28979 -2086 -89477 -238858 -330647 -320751 -279085 -274122
33420 -274122 -274739 -214136 -108253 -35618 -16655 360 27810 10134 -57621 -78898 5470 102245
33408 102245 82087 -35943 -113557 -79675 12512 103343 190253 252032 213899 47882 -154693
33397 -154693 -266985 -245315 -131136 14531 133957 178868 155694 137474 172687 202713 134633
33386 134633 -9334 -86305 -2794 161087 241032 178286 74455 56310 126857 178868 137471
33375 137471 45515 -7518 -5968 -18040 -97845 -220658 -320491 -352931 -308719 -206366 -97733
33364 -97733 -46804 -66466 -96697 -77885 -26156 -679 -16193 -34659 -35493 -42629 -73915 -108728
33352 -108728 -123666 -125017 -125647 -118596 -94148 -57986 -12626 53196 131862 177745 154352 88991
33340 88991 49109 67694 117132 153497 160840 150095 137999 135170 140273 139729 120950 83284 26210
33327 26210 -61497 -175869 -265176 -258961 -147593 -10408 59416 48948 26147 54715 130177
33316 130177 198196 210014 150520 39762 -62540 -68343 72437 293850 438404 403300 249953
33305 249953 128091 103361 115521 105188 101197 142169 184159 161707 97667 65742 63933 19935
33293 19935 -71630 -113354 -44455 59992 84751 20008 -42617 -28320 51854 129054 141549
33282 141549 92361 60239 119616 234823 285431 221732 129840 97867 88618 17307 -104706
33271 -104706 -196984 -240675 -279109 -305419 -252965 -101624 95797 296856 488544 618519
33261 618519 613147 494962 387336 362070 368768 354240 351718 387136 392384 305602 189445 146023
33249 146023 157073 114344 -8004 -110581 -106713 -24920 47983 72004 78334 117346 195998
33238 195998 261987 265690 239731 268123 352957 379322 270937 119005 70798 132039 178531
33227 178531 141149 72164 28298 -3993 -43122 -69224 -84525 -133209 -214011 -244902 -170280
33216 -170280 -48991 17268 -323 -60216 -125362 -182363 -215569 -212779 -183676 -142510 -91707
33205 -91707 -42906 -22243 -29955 -29719 -3873 20789 29810 52060 91562 83860 -12476 -120652
33193 -120652 -124695 -31164 28419 -32076 -146642 -186532 -111111 -14 42447 -4574 -58772
33182 -58772 -25165 86442 158697 107574 -4677 -45892 20570 114332 174094 229186 306062
33171 306062 342886 265002 105646 -19490 -50410 -39702 -65205 -130042 -167666 -119334 11799
33160 11799 166182 267290 263301 152714 -16058 -168999 -240328 -201285 -75379 67448
33150 67448 144123 110792 221 -97096 -107743 -40074 32422 52974 33077 20646 39862
33139 39862 77331 107319 107514 65061 -4501 -52880 -43400 2958 32704 25537 2300 -27324
33127 -27324 -78226 -139390 -157834 -103729 -18872 32078 33182 9762 -21242 -51546 -54148 -7428
33115 -7428 59389 93695 94893 116455 184937 262455 304115 307585 283881 224621 134878 65365
33103 65365 70444 150578 262602 360361 396518 324234 152910 -17696 -76820 -12661 97725
33092 97725 188757 243001 253697 232889 252083 380227 559464 633862 540784 388646 298397
33081 298397 260715 217435 187568 211891 253014 271613 331907 478321 553186 333266 -125570
33070 -125570 -463380 -417933 -113700 138089 196012 128481 16986 -108939 -185904 -134580
33060 -134580 14127 124585 117200 40917 -33132 -104622 -192575 -259098 -240856 -130820 7076
33049 7076 95728 105771 72624 58357 86226 116859 97974 22447 -74288 -148288 -160712 -94515
33037 -94515 8973 64083 31773 -32933 -60263 -49152 -23499 40342 164727 289196 329740
33026 329740 298491 272357 258403 193237 74673 -16231 -43527 -61445 -99191 -101891 -33317
33015 -33317 52651 97350 114275 126003 103693 36963 -3371 51270 165567 247004 259719
33004 259719 240581 235518 260612 292926 276550 185339 89598 83345 130230 90765 -55605 -143034
32992 -143034 -52893 109266 179451 163600 165697 189540 175831 161161 216507 269092 176199
32981 176199 -29307 -148675 -92578 17917 57766 48221 50320 49747 17503 -19393 -25351 4176
32969 4176 71435 156275 169469 41446 -142243 -221666 -173778 -99079 -16116 137274 292541
32958 292541 274316 95502 -1952 108041 272435 341659 379952 469284 549002 595711 700243
32947 700243 807376 697230 430306 393186 532764 3270 -1765861 -3900273 -4771290
32938 -4771290 -3890688 -2398649 -1514339 -1238911 -942925 -529827 -368221 -479290 -497209
32929 -497209 -319008 -224413 -350084 -493786 -484161 -385439 -284687 -178252 -115943 -190093 -335585
32918 -335585 -374680 -288062 -219232 -204093 -137682 -21518 15367 -22181 24332 167077 216009
32907 216009 109442 40815 134781 239359 192173 79564 59518 107793 118669 108789 146823
32896 146823 205554 243926 319218 466726 584515 585446 541902 529104 462369 269333 89374
32885 89374 86970 172582 138293 -10667 -97296 -79293 -59804 -36347 81932 211178 144658
32874 144658 -81723 -174714 -50402 -38419 -432989 -1049705 -1444049 -1429886 -1176160 -898203
32864 -898203 -671662 -501300 -370170 -214493 3584 193432 225688 119464 24173 17315
32854 17315 35594 13084 -28376 -50919 -58654 -49893 -3354 48668 19498 -108406 -231457 -252934
32842 -252934 -202438 -167569 -159344 -118069 -23659 67930 88589 13819 -122149 -220677 -166773
32831 -166773 41407 235401 245317 127531 114844 304752 510810 504772 313734 158906
32821 158906 154021 201589 178875 91387 10403 -29191 -19717 37142 85736 40932 -80355 -133460
32809 -133460 -26036 148276 238615 231947 222638 245271 255833 250313 280336 349163 398209 413367
32797 413367 455728 563852 693528 766260 719691 523757 227648 -21594 -106271 -83558
32787 -83558 -97889 -147832 -80226 143503 328101 295358 143891 124048 304167 485259 444956
32776 444956 185555 -65605 -63625 217531 510298 460442 -13729 -579886 -772646 -428645
32766 -428645 172100 568968 504055 101164 -277092 -374159 -276106 -269085 -453119 -605303
32756 -605303 -501621 -253099 -155409 -259503 -299889 -88511 209220 309176 196276 125767
32746 125767 280459 563817 746762 717915 546555 364610 245879 180400 119533 34881
32736 34881 -51524 -86911 -38996 71344 186377 257014 277892 289900 345032 445153 507354
32725 507354 424169 193685 -34590 -101114 -21591 36415 -18141 -72788 27554 253095 410378
32714 410378 368191 181712 1531 -60733 23189 198697 343001 346146 217573 78196
32704 78196 32779 84654 168842 211112 155955 7732 -139179 -171807 -77588 52719 132911
32693 132911 135402 66709 -21669 -26192 85442 163024 36851 -206936 -297090 -161057 -31812
32682 -31812 -82716 -170480 -96011 70294 133252 99738 124019 220190 276329 300966 393500
32671 393500 472634 306217 -110623 -432375 -346776 65278 467871 649961 650793 598255 560542
32660 560542 539752 513941 463654 395037 349766 378327 487752 603525 604159 445624 246812
32649 246812 172178 217937 222916 126818 76062 187205 350937 404024 367074 351510 349664
32638 349664 308989 313832 469543 667560 693440 536989 383482 332239 344690 433418 648496
32627 648496 879573 929438 813382 750873 833425 932122 956736 967451 1001743 1022715 1050139
32616 1050139 1105640 1053653 777934 471950 417048 527247 524738 504411 790064 1238292
32606 1238292 1340888 1115898 1147892 1536011 1680940 1500541 1791583 2578692 2157535 -830564
32596 -830564 -4926655 -7036413 -6067013 -3952219 -2834432 -2688993 -2378463 -1730080 -1422290
32587 -1422290 -1569348 -1608717 -1324015 -1043571 -923282 -786588 -643639 -725807 -981987 -1078444
32577 -1078444 -935095 -799001 -762895 -655673 -455708 -385104 -499608 -557025 -406382 -191075
32567 -191075 -59569 35282 138496 160540 65729 -26178 -31677 -4455 26023 105298 165744
32556 165744 14718 -368293 -715048 -782285 -628633 -462876 -367579 -302528 -253433 -236579
32546 -236579 -238670 -259528 -339084 -458001 -499208 -397833 -249437 -181120 -187261 -178287 -126073
32535 -126073 -74657 -58818 -87165 -157704 -224139 -200243 -69798 53100 46454 -69871 -171436
32524 -171436 -186072 -147094 -108048 -71995 -17630 41897 48910 -43595 -201577 -316007 -312828
32513 -312828 -240235 -199468 -205965 -187254 -114081 -50873 -56624 -112192 -174618 -229895 -256010 -209539
32501 -209539 -102781 -30238 -53220 -103699 -69281 54739 159447 155226 62741 -24273 -36124
32490 -36124 8679 24675 -37390 -109450 -74605 70202 184307 158358 58683 28382 88003
32479 88003 125527 74452 5535 11695 78731 124999 119490 99021 105092 179860 399112 790687
32467 790687 1181006 1241889 812270 131739 -367129 -497190 -442754 -452784 -553476 -622492
32457 -622492 -610248 -566102 -521000 -468285 -427348 -422808 -419647 -364389 -269899 -181953 -92578 25467
32445 25467 125810 129207 46511 -30516 -54451 -52763 -44287 -16758 16123 22922 16789 28969
32433 28969 36780 8733 -4668 60507 141230 111817 -8718 -60033 19795 102067 68778 -24419
32421 -24419 -57942 -13909 40441 49488 -7106 -105739 -153849 -67561 88945 148542 64370 -32917
32409 -32917 -46946 -44717 -103751 -173827 -186717 -171514 -157053 -93502 10332 9761 -168405 -364035
32397 -364035 -392605 -304816 -259494 -245606 -147426 -10486 4447 -86479 -86501 66133 200577
32386 200577 188778 113877 74297 1936 -194461 -432091 -539786 -474920 -345297 -252355 -197082
32375 -197082 -128753 -37388 4366 -101578 -347758 -574486 -624248 -523207 -420923 -370185
32365 -370185 -290022 -153825 -66915 -95860 -143905 -86720 52462 152687 160759 125474 107084
32354 107084 122826 159254 188314 184598 146774 79880 -32482 -179077 -259086 -171790 13618
32343 13618 92473 -21141 -183078 -229553 -188776 -184321 -223269 -211736 -127456 -44263 -5215
32332 -5215 8930 -11395 -110131 -255577 -324028 -244379 -97967 -23704 -58126 -115787 -117165 -93340
32320 -93340 -138234 -269265 -383212 -386456 -331274 -349701 -462773 -547640 -513177 -408953 -311388
32309 -311388 -199555 -25007 170931 302777 348861 327223 224027 49762 -87415 -92439
32299 -92439 -40524 -91497 -253044 -364308 -330979 -239638 -193510 -163458 -80277 23908 61483
32288 61483 18720 -41564 -70339 -64685 -42940 -35457 -65006 -99254 -70787 16556 64569 20730
32276 20730 -25398 32539 149756 187202 104475 -9707 -85954 -142163 -195906 -221055 -223178
32265 -223178 -254546 -307179 -291638 -189348 -128004 -205489 -316293 -282334 -115153 -3367 -39393
32254 -39393 -106783 -84340 -24599 -36441 -92424 -75532 36626 158032 243156 328485 416214
32243 416214 430034 327475 166796 11204 -155110 -348818 -490055 -473582 -313760 -139628
32233 -139628 -48356 -28012 -27492 -34992 -60758 -92277 -107339 -110681 -127005 -165243 -207867 -229773
32221 -229773 -215728 -165955 -97978 -44051 -38757 -98705 -201064 -277868 -251765 -106293 76810
32210 76810 174645 133044 12591 -78984 -86272 -31214 38520 96313 132782 136446 101533 47006
32198 47006 6743 -3722 793 -370 -8765 -13014 -11239 -18017 -49358 -99973 -131590 -95627 8219
32185 8219 97438 67229 -93306 -271787 -346070 -307771 -247084 -238712 -280318 -326631 -338907 -304107
32173 -304107 -244202 -204791 -201307 -187709 -120773 -41461 -35102 -114911 -208321 -261101 -283657 -284961
32161 -284961 -247803 -202525 -234677 -357883 -454370 -416976 -287894 -174325 -87811 25045 133626
32150 133626 136465 26495 -77227 -93392 -69726 -66180 -46395 40394 143636 171586 132271
$$ [...]
##END NTUPLES=NMR SPECTRUM
##END=
