##TITLE=31P_DE-80H_X3
 64 sc D2O
 26.2.2025
##JCAMPDX= 6.0         $$ Bruker NMR JCAMP-DX V2.0
##DATA TYPE= NMR SPECTRUM
##DATA CLASS= NTUPLES
##ORIGIN= UXNMR, Bruker Analytische Messtechnik GmbH
##OWNER= root
$$ XWIN-NMR		Version 3.5
$$ Tue Sep 16 11:32:59 2025 Russian Standard Time (UT+4h)  Yarkov@DPX200
##.OBSERVE FREQUENCY= 81.013821
##.OBSERVE NUCLEUS= ^31P
##.ACQUISITION MODE= SIMULTANEOUS
##.ACQUISITION SCHEME= undefined
##.AVERAGES= 64
##.DIGITISER RES= 17
##SPECTROMETER/DATA SYSTEM= spect
##.PULSE SEQUENCE= zgpg30
##.SOLVENT NAME= D2O
##.SHIFT REFERENCE= (INTERNAL, D2O, 0, 198.062)
##AUDIT TRAIL= $$ (NUMBER, WHEN, WHO, WHERE, WHAT)
$$ ##TITLE= Audit trail, XWIN-NMR		Version 3.5
$$ ##JCAMPDX= 5.01
$$ ##ORIGIN= Bruker BioSpin GmbH
$$ ##OWNER= Yarkov
$$ C:/Bruker/XWIN-NMR/data/yarkov2/nmr/P31/2/pdata/1/auditp.txt
$$ ##AUDIT TRAIL=  $$ (NUMBER, WHEN, WHO, WHERE, WHAT)
(   1,<2025-09-16 11:31:48.18 +0400>,<Yarkov>,<DPX200>,
      <created by zg, POWCHK disabled, PULCHK disabled
       configuration hash MD5:
       00 E9 B6 7A A2 85 ED C7 34 08 36 98 17 FE 4E 26
       data hash MD5: 32K
       10 21 85 3F A0 B8 C8 78 51 7C CD 17 B2 51 90 C9>)
(   2,<2025-09-16 11:32:08.04 +0400>,<Yarkov>,<DPX200>,
      <Start of raw data processing
       efp BC_mod = 2 LB = 1.5 FT_mod = 6 PKNL = 1 PHC0 = 1678.773 PHC1 = 24.15952 SI = 64K 
       data hash MD5: 64K
       8E FF 4C 83 31 CA 0D D1 09 29 66 D2 E6 F2 58 40>)
(   3,<2025-09-16 11:32:36.25 +0400>,<Yarkov>,<DPX200>,
      <pk PHC0 = -3.199999 PHC1 = 0 
       data hash MD5: 64K
       1F 36 75 05 0B 65 8A 3D B8 9A CB 8E A8 A1 9B AF>)
$$ ##END=
$$ 
$$ hash MD5
$$ 23 91 14 8B 36 DE 4A C6 D8 2B 7E 45 BA 19 69 DA
##$RELAX= 
##$RELAX= 
##$RELAX= 
##$RELAX= 
##$RELAX= 
##$RELAX= 
##$RELAX= 
##$RELAX= 
$$ Bruker specific parameters
$$ --------------------------
##$DU= <C:/Bruker/XWIN-NMR>
##$EXPNO= 2
##$NAME= <P31>
##$PROCNO= 1
##$TYPE= <nmr>
##$USER= <yarkov2>
##$AMP= (0..31)
100 100 100 100 100 100 100 100 100 100 100 100 100 100 100 100 100 100 
100 100 100 100 100 100 100 100 100 100 100 100 100 100 
##$AQSEQ= 0
##$AQ_mod= 1
##$AUNM= <au_zg>
##$AUTOPOS= <>
##$BF1= 81.014009
##$BF2= 200.13
##$BF3= 200.13
##$BF4= 200.13
##$BF5= 200.13
##$BF6= 200.13
##$BF7= 200.13
##$BF8= 200.13
##$BYTORDA= 1
##$CFDGTYP= 0
##$CFRGTYP= 5
##$CHEMSTR= <none>
##$CNST= (0..31)
1 1 145 1 1 1 1 1 1 1 1 1 1 1 1 1 1 1 1 1 1 1 1 1 1 1 1 1 1 1 1 1 
##$CPDPRG= <waltz16>
##$CPDPRG1= <>
##$CPDPRG2= <waltz16>
##$CPDPRG3= <>
##$CPDPRG4= <mlev>
##$CPDPRG5= <mlev>
##$CPDPRG6= <mlev>
##$CPDPRG7= <mlev>
##$CPDPRG8= <mlev>
##$CPDPRGB= <>
##$CPDPRGT= <>
##$D= (0..31)
0 1 0 0 0 0 0 0 0 0.06 0 0.03 2e-05 3e-06 0 0 0.0002 0 0 0 0 0 0 0 0 0 
0 0 0 0 0 0 
##$DATE= 1758007907
##$DBL= (0..7)
120 120 120 11 120 120 24 19 
##$DBP= (0..7)
150 150 150 150 150 150 150 150 
##$DBP07= 0
##$DBPNAM0= <>
##$DBPNAM1= <>
##$DBPNAM2= <>
##$DBPNAM3= <>
##$DBPNAM4= <>
##$DBPNAM5= <>
##$DBPNAM6= <>
##$DBPNAM7= <>
##$DBPOAL= (0..7)
$$ [...]
##$SUBNAM2= <"">
##$SUBNAM3= <"">
##$SUBNAM4= <"">
##$SUBNAM5= <"">
##$SUBNAM6= <"">
##$SUBNAM7= <"">
##$SUBNAM8= <"">
##$SUBNAM9= <"">
##$SW= 400.765351723535
##$SWIBOX= (0..15)
0 1 3 0 0 0 0 0 0 0 0 0 0 0 0 0 
##$SW_h= 32467.5324675325
##$TD= 32768
##$TD0= 1
##$TE= 0
##$TE2= 300
##$TE3= 300
##$TEG= 300
##$TL= (0..7)
0 120 53 12 22 120 120 120 
##$TP= (0..7)
150 150 150 150 150 150 150 150 
##$TP07= 0
##$TPNAME0= <>
##$TPNAME1= <>
##$TPNAME2= <>
##$TPNAME3= <>
##$TPNAME4= <>
##$TPNAME5= <>
##$TPNAME6= <>
##$TPNAME7= <>
##$TPOAL= (0..7)
0.5 0.5 0.5 0.5 0.5 0.5 0.5 0.5 
##$TPOFFS= (0..7)
0 0 0 0 0 0 0 0 
##$TUNHIN= 0
##$TUNHOUT= 0
##$TUNXOUT= 0
##$USERA1= <user>
##$USERA2= <user>
##$USERA3= <user>
##$USERA4= <user>
##$USERA5= <user>
##$V9= 5
##$VALIST= <valist>
##$VCLIST= <CCCCCCCCCCCCCCC>
##$VD= 0
##$VDLIST= <DDDDDDDDDDDDDDD>
##$VPLIST= <PPPPPPPPPPPPPPP>
##$VTLIST= <TTTTTTTTTTTTTTT>
##$WBST= 1024
##$WBSW= 4
##$XGAIN= (0..3)
0 0 0 0 
##$XL= 0
##$YL= 0
##$YMAX_a= 1553
##$YMIN_a= -1549
##$ZGOPTNS= <>
##$ZL1= 120
##$ZL2= 120
##$ZL3= 120
##$ZL4= 120
##$ABSF1= 0
##$ABSF2= 0
##$ABSG= 0
##$ABSL= 0
##$ALPHA= 0
##$AQORDER= 0
##$ASSFAC= 0
##$ASSFACI= 0
##$ASSFACX= 0
##$ASSWID= 0
##$AUNMP= <proc_1d>
##$AZFE= 0.1
##$AZFW= 0.5
##$BCFW= 0
##$BC_mod= 2
##$BYTORDP= 0
##$COROFFS= 0
##$CY= -3
##$DATMOD= 1
##$DC= 0
##$DFILT= <>
##$DTYPP= 0
##$F1P= 0
##$F2P= 0
##$FCOR= 1
##$FTSIZE= 65536
##$FT_mod= 6
##$GAMMA= 0
##$GB= 0
##$INTBC= 1
##$INTSCL= 9.790993e-09
##$ISEN= 30
##$LB= 1.5
##$LEV0= 0
##$LPBIN= 0
##$MAXI= 10000
##$MC2= 0
##$MEAN= 0
##$ME_mod= 0
##$MI= 50
##$NCOEF= 0
##$NC_proc= -9
##$NLEV= 6
##$NOISF1= 182.463
##$NOISF2= 159.3651
##$NSP= 0
##$NTH_PI= 0
##$NZP= 0
##$OFFSET= 198.0616
##$PC= 4
##$PHC0= 1675.573
##$PHC1= 24.15952
##$PH_mod= 1
##$PKNL= yes
##$PPARMOD= 0
##$PSCAL= 0
##$PSIGN= 0
##$REVERSE= no
##$SF= 81.0140089999434
##$SI= 65536
##$SIGF1= 159.3651
##$SIGF2= -187.1042
##$SINO= 113.3802
##$SIOLD= 16384
##$SREGLST= <1H.CDCl3>
##$SSB= 0
##$STSI= 65536
##$STSR= 0
##$SW_p= 32467.5324675325
##$SYMM= 0
##$S_DEV= 0
##$TDeff= 32768
##$TDoff= 0
##$TI= <>
##$TILT= no
##$TM1= 0
##$TM2= 0
##$TOPLEV= 0
##$USERP1= <user>
##$USERP2= <user>
##$USERP3= <user>
##$USERP4= <user>
##$USERP5= <user>
##$WDW= 1
##$XDIM= 65536
##$YMAX_p= 330071876
##$YMIN_p= -12203911
$$ End of Bruker specific parameters
$$ ---------------------------------
##NTUPLES= NMR SPECTRUM
##VAR_NAME=  FREQUENCY,     SPECTRUM/REAL,   SPECTRUM/IMAG
##SYMBOL=    X,             R,               I
##VAR_TYPE=  INDEPENDENT,   DEPENDENT,       DEPENDENT
##VAR_FORM=  AFFN,          ASDF,            ASDF
##VAR_DIM=   65536,         65536,           65536
##UNITS=     HZ,            ARBITRARY UNITS, ARBITRARY UNITS
##FACTOR=    0.49542278885378, 1,            1
##FIRST=     16045.7642231865, 0,            0
##LAST=      -16421.768244346, 0,            0
##MIN=       -16421.768244346, -12203911,    0
##MAX=       16045.7642231865, 330071876,    0
$$ Real data points
##PAGE= N=1
##DATA TABLE= (X++(R..R)), XYDATA
$$ [...]
40821e12330j92362J0321K02345K42305J29422n2100j60316q0848J10614J89264
40811a13685Q2664j4690N0367J37779N1705j22234j51379k9409L8678j8450o1912
40800a50566j9615n06o9618j08055J235J81224K52087J38452p3105k23008j95051
40789b66526n258K02522K89028K35820R7808q6189k51137k68598j04218N3741
40779a03007J1903j21209p1538J56662K41543L0136k05144j66696L8496J06666
40769h2188R722l0336L9534K5356j44045k54998j32317R4191J99013J72052J47884
40758D3868J50205J08560N7593J01325J89115J39363p0284k29218j94397r1965
40748B04165r3848j38013m3536J77463L04928J95000n9469k57449k76722j37862
$$ plain form
40821 -512330 -704692 -694371 -492026 -249721 -120299 -172399 -332715 -413563 -302949 -113685
40811 -113685 -31021 -45711 4656 142435 194140 71906 -79473 -108882 -70204 -88654 -150566
40800 -150566 -170181 -170687 -240305 -348360 -347125 -165901 86186 224638 151533 -71475 -266526
40789 -266526 -271784 -69262 219766 455586 553394 467205 216068 -52530 -156748 -103007
40779 -103007 -91104 -212313 -283851 -127189 114354 144490 -60654 -227350 -188854 -82188
40769 -82188 -72466 -102802 -63268 -37912 -181957 -436955 -569272 -475081 -276068 -104016 43868
40758 43868 194073 302633 360226 461551 650666 790029 719745 490527 296130 204165
40748 204165 110317 -27696 -71232 106231 411159 606159 546690 289241 12519 -125343
40738a25343K7870Q3130K6919m302N7857R8390K2271m7132K8749R7088j06643
40727A58854m78809n63583j56934L73465N42379L13773K2748r9591r8209r2044
40717g7951j24484j91860k54824k26103o4602J32389K22057J74040O3609m2138
40707c89867j12175j19619o6104j128L8030N7102M9370j402l6116L4471J56396
40696c91042J60994L3127l4663M1771P9230n5232j80514q5379R8090Q3881j17263
40685c67000k28066j31481J0834N4028L1733J0993O504N3577J68265K32713J15975
40674d1925r4964j83092j09804k6309R650R0178K16269K49188J56478P9018Q4542
40663D29229O5807l9908j31385j30691j06519j18776j02833N54J35390K18569
$$ plain form
40738 -125343 -97473 -14343 12576 8274 66131 164521 186792 139660 168409 265497 158854
40727 158854 -319955 -883538 -1040472 -667007 -124628 189145 211893 112302 14093 -77951
40717 -77951 -202435 -394295 -649119 -875222 -939824 -807435 -585378 -411338 -347729 -389867
40707 -389867 -502042 -621661 -687765 -688893 -650863 -593761 -544391 -545793 -581909 -547438 -391042
40696 -391042 -230048 -196921 -231584 -189813 -110583 -165815 -346329 -431708 -333618 -249737 -367000
40685 -367000 -595066 -726547 -715713 -661685 -629952 -618959 -612455 -558878 -390613 -157900 -41925
40674 -41925 -136889 -319981 -429785 -456094 -446444 -356266 -139997 109191 265669 344687 429229
40663 429229 495036 455128 323743 193052 86533 -32243 -135076 -134522 868 219437
40653B19437K17703J12452q3334k50406k70278j96691j50313q6105R9979K76494
40643a11062K01985m5662j18976N2396J42917j2332j41411l0514R0609l6166k23247
40632b31463j44826J24187K54903J74247O3361j3697j18203j80129q9897K7713
40622a33804k7779j66921j49406k5969n8163k18931j91639P4965K24760M8362
40612f24525j90024j80331q778P0501N6466J16848K46390K84545J96137J02342
40602F9571O1516N514j06564k12172k35743j63982l3974Q4933J17125N5893o456
40591c64339J7135R5500J28245Q7417M6058O5723J12496J09440M2038k4241l2291
40580B83181l758Q085M324J5261L944j04336k68553l20195j77667K4194J12624
$$ plain form
40653 219437 437140 549592 466258 215852 -54426 -251117 -401430 -487535 -387556 -111062
40643 -111062 90923 45261 -73715 -21319 121598 109266 -32145 -62659 27950 -8216 -231463
40632 -231463 -376289 -252102 2801 177048 240409 226712 108509 -71620 -161517 -133804
40622 -133804 -161583 -328504 -477910 -503879 -562042 -780973 -972612 -897647 -672887 -624525
40612 -624525 -814549 -994880 -1003658 -933157 -876691 -759843 -513453 -228908 -32771 69571
40602 69571 131087 136601 30037 -182135 -417878 -581860 -615834 -530901 -413776 -357883 -364339
40591 -364339 -347204 -251704 -123459 -36042 10016 75739 188235 297675 339713 315472 283181
40580 283181 279423 287508 291832 307093 311037 206701 -61852 -382047 -559714 -535520 -422896
40569d22896R8116J07056J74035K31255K39082J90298N1531j44217k19848p0014
40559B34398R5183k9273l71333n01290k06332K09188L43973J98741N4727K7843
40549E5825N29q2960j16398m4663K9323J5687k9644j6859M1106Q1541R8472J08916
40537A40875P2530m9295j74759j58041L180J17741L5890j38212j78401m0403J03778
40526b65117J34774J26582J56860J34653n2750l23511m75141m17579k15579L3200
40516a163608K32297K71095J39529J6765P7572K34565K44826N9533j15748j15415
40506a18589J8040J78413L09420L30889J58394j19798k68096j98695p2433k1986
40496A95559K5548J26895J36222o3654l04022l30032j57236r832K8366P6383J92079
$$ plain form
40569 -422896 -324780 -217724 -43689 187566 426648 616946 668477 524260 304412 234398
40559 234398 329581 300308 -71025 -572315 -778647 -569459 -225486 -26745 27982 55825
40549 55825 56354 -26606 -143004 -187667 -158344 -142657 -172301 -189160 -148054 -66513 31959 140875
40537 140875 213405 164110 -10649 -168690 -165510 -47769 -11879 -150091 -328492 -368895 -265117
40526 -265117 -130343 -3761 153099 287752 235002 -88509 -563650 -981229 -1196808 -1163608
40516 -1163608 -931311 -660216 -520687 -503922 -426350 -191785 53041 112574 -3174 -118589
40506 -118589 -100549 77864 387284 718173 876567 756769 488673 289978 217545 195559
40496 195559 221107 348002 484224 420570 116548 -213484 -370720 -380552 -352186 -275803 -83724
40485h3724K60555J81084P227j43523k10244j95346j39299r3554m9317P1315K67370
40474a27456L69384K35655j3294j30096q9634j00995k43088l08611j22182J65406
40464c64911K69315J48915J1541j3810j5449q5027j36542m8831J10843J55564
40454C1608N6075r78J08238K37407J72421l8756j41716n3674J7532r7439k73146
40443A7572k98892j84280o7770N6286K74324M69371L77282j7655l73983l90743
40433a38488j43840Q9308J84919K04502J94433J41897Q3846Q6927J12130L8570
40423H54204j42850k69204j99187R0J24885O5029r2804j90361j78556j38317j39812
40412c06883j43212p5284M2615J11739Q1216j8527j52495k89851l28371j43205
$$ plain form
40485 -83724 176831 357915 365142 221619 11375 -183971 -323270 -416824 -466141 -394826 -127456
40474 -127456 241928 477583 464289 334193 244559 143564 -99524 -408135 -530317 -364911
40464 -364911 -95596 53319 64860 51050 35601 -49426 -185968 -234799 -123956 31608
40454 31608 87683 86705 194943 432350 604771 566015 424299 370625 388157 290718 17572
40443 17572 -281320 -465600 -533370 -477084 -202760 266611 643893 626238 252255 -138488
40433 -138488 -282328 -193020 -8101 196401 390834 532731 616577 703504 815634 854204
40423 854204 711354 442150 242963 243053 367938 432967 340163 149802 -28754 -167071 -306883
40412 -306883 -450095 -525379 -482764 -371025 -289809 -308336 -460831 -750682 -1079053 -1222258
40402a222258K17104M91613M71511K37732L5196k3938j2082P9K2269M2175J718
40391B61119q3945j10859l9901M6948R3568J47586K15613J73962m4132k67537
40381C92422k59673l7732J39446J07976k3714p2343j9169L0865L5399N0953J11965
40370D56395J61199J15883l2929j96363k55551j67143j2525P1453J8584j16863
40360D2140k23602k23270j17611Q574M2051m5245j36099q0475J22146L11844L52759
40349E3212K64621J49605O0017j6199r1191j49366j60432j02790p740K6462o4311
40338c8112j91764j94522o1706L2542l1626j61500k09079j69662j16378m5052
40328a186859P4223J70395J54312Q0700P2596J18766J08576M7399N4900J33958
$$ plain form
40402 -1222258 -1005154 -513541 -42030 195702 230898 206960 194878 194957 217226 259401 261119
40391 261119 177174 66315 26414 73362 166930 314516 530129 704091 659959 392422
40381 392422 132749 95017 234463 342439 318725 246382 227213 258078 293477 344430 456395
40370 456395 617594 733477 700548 504185 248634 81491 68966 140419 159003 42140
40360 42140 -181462 -404732 -522343 -513769 -471718 -516963 -653062 -733537 -611391 -299547 53212
40349 53212 317833 467438 527455 511256 420065 270699 110267 7477 -263 26199 -38112
40338 -38112 -229876 -424398 -486104 -453562 -485188 -646688 -855767 -1025429 -1141807 -1186859
40328 -1186859 -1112636 -942241 -787929 -707229 -634633 -515867 -407291 -359892 -304992 -171034
40318a71034J29693j7209j41783q0812R4358J83183J12398j7783q7660n9535M1433
40307a4751J53862J88862Q6491j07497k54953k50240j34877o0495j10610j87056
40297f91264j37222K3902J29997J20753J33268K53398L33561K12312j2659j29196
40287B36850j32475j68463k16427j05203J40903K50789Q7606j48075k04169p4158
40277c32822R7102K19980K50695J41957n8581j87565j62205q5372o5693o5159
40267b47663j8619L5935N0327N6502O7674K5255o7595j07208o3786k5545J875
40256b92848J23001K86002K52545j5935k19751j66204o1182j03005r8334J61486
40246a34225M18913K96458o3284j94322l6991M1616p4679q9514J14341K35034
$$ plain form
40318 -171034 -41341 -58550 -200333 -281145 -186787 -3604 108794 91011 3351 -56184 -14751
40307 -14751 139111 327973 414464 306967 52014 -198226 -333103 -393598 -504208 -691264
40297 -691264 -828486 -804584 -674587 -553834 -420566 -167168 166393 378705 366046 236850
40287 236850 104375 -64088 -280515 -385718 -244815 5974 93580 -54495 -258664 -332822
40277 -332822 -235720 -15740 234955 376912 318331 130766 -31439 -116811 -182504 -247663
40267 -247663 -266282 -230347 -180020 -123518 -55844 -30589 -98184 -205392 -269178 -294723 -292848
40256 -292848 -169847 116155 368700 352765 133014 -33190 -94372 -197377 -295711 -134225
40246 -134225 284688 581146 517862 323540 286549 328165 253486 163972 278313 513347
40236E13347P9336j10997q5640L4665M8080J4876M7456L5835j36187l17111k99866
40225a76206j41294l2003L425N4785J10156J02585O0985L4030k3079j28109j67902
40214c02627o7362P7786J75786K69472L40257K06966j58045m29568l27162l3195
40204b47692R0781M1387P4355J95675J66393j6267o3130J16880K45738J18010
40194G22130j06478k01791j90150j84866j54933l7978R0314J36102J32071J16319
40184C20740K1562j57464k39703r1229J32335J73979K7621q7327n1199M1312P0876
40173A61503K9309l8634q9039o5774M4475J38904R7076m0865j10174m4358N7817
40162A40240J03313J09589R8836K4995j15680k15180j90981j04207m7004m445
$$ plain form
40236 513347 592683 481686 396046 430711 478791 493667 541123 576958 440771 123660 -176206
40225 -176206 -317500 -349503 -346078 -291293 -181137 -78552 -17567 16463 -6616 -134725 -302627
40214 -302627 -369989 -292203 -116417 153055 493312 700278 542233 112665 -214497 -247692
40204 -247692 -156911 -115524 -41169 154506 320899 304632 241502 358382 604120 722130
40194 722130 615652 413861 223711 38845 -116088 -154066 -63752 72350 204421 320740
40184 320740 342302 184838 -54865 -146094 -13759 160220 187841 100514 49315 90627 161503
40173 161503 190812 152178 63139 -2635 41840 180744 277820 236955 126781 82423 140240
40162 140240 243553 353142 451978 476973 361293 146113 -44868 -149075 -196079 -200524
40152b00524N5419M9113r5806k38966j62890P8559J69840k3232k28805j48005
40142g45297J08064J91944M4248l0505J56866L76895K95864o5494l62832l54333
40132c84580j40185K3148K5082l3284j3356Q8430J53601R8731k2568r1991o2570
40121c59542J8386Q7775J08760O5585m174L549J38035K67300J97054o0007k61811
40110B00910k36390q1198J2569J5467K6865P4554Q3358J2689q2744j24105p5592
40099a73617L7266J27428J06166q388r6008r2703o7864q6749r5643l2987M6129
40088c36970P2813R7126J79057K34881J60707M0526L9159J32612J55991R6252
40078H72154R3390J30251O6l09587m67215k35366J32893J89656j11346l68437
$$ plain form
40152 -200524 -145105 -95992 -191798 -430764 -593654 -515095 -345255 -368487 -597292 -745297
40142 -745297 -637233 -445289 -401041 -431546 -274680 102215 398079 332585 -30247 -384580
40132 -384580 -524765 -501617 -476535 -509819 -523175 -434745 -281144 -182413 -204981 -296972 -359542
40121 -359542 -341156 -253381 -144621 -79036 -83210 -79661 58374 325674 522728 462721 200910
40110 200910 -35480 -116678 -104109 -88642 -61777 12777 96135 108824 26080 -98025 -173617
40099 -173617 -136351 -8923 97243 88855 -7153 -99856 -167720 -254469 -350112 -383099 -336970
40088 -336970 -264157 -167031 12026 246907 407614 448140 487299 619911 775902 872154
40078 872154 965544 1095795 1095861 786274 319059 83693 216586 406242 294896 -73541
40068g3541k67612O2397K78448K23879J0181j73868k18871j22699L0976J24957
40058a25753R9932L749p0096p8967m5180N54M8464R0593J14162J19780J11463
40047B68701O3922n2279j90789k31640j20901L0536O6306j2997n8089J0656R9044
40036a27530J02439P4501J35518K64610K95288J25669j41700k97547k31857k9449
40026A69942J26631J40902Q0446M6510J6629r9803k68636l27496k10880l8273
40016c64028R5656K64472N10458O44691M55233N0590k20071j85845p217R7343
40006A341282Q6317J5982q6224j80263j88086j06889m2450m8056k9752J03016
39996H64877K79185L48907K65700J14500N237j2993J8495l191j20551k16384j39454
$$ plain form
40068 -73541 -341153 -278756 -308 223571 233752 59884 -158987 -281686 -250710 -125753
40058 -125753 -25821 -22072 -92168 -171135 -216315 -215761 -167297 -76704 37458 157238 268701
40047 268701 332623 280344 89555 -142085 -262986 -232450 -166144 -179141 -237230 -226574 -127530
40036 -127530 -25091 49410 184928 449538 744826 870495 728795 431248 199391 169942
40026 169942 296573 437475 517921 564431 581060 481257 212621 -114875 -325755 -364028
40016 -364028 -268372 -3900 506558 1151249 1606482 1657072 1437001 1251156 1243939 1341282
40006 1341282 1427599 1443581 1357357 1177094 989008 882119 839669 791613 761861 864877
39996 864877 1144062 1492969 1758669 1873169 1878406 1865413 1883908 1880717 1760166 1543782 1404328
39985A404328N4220J25373k8477k25592k63284j79715j20166p7989M4891J99793
39975I33382K20122P8746n7148n0428O5151J92162K85904L19262K46637P7725
39965B311515p6045r5130K3388J52940J38971o2473l12820l97538k59383p2188
39955A351237m392J3594J43235L18078K90011K7292j66933o3384J59033J85756
39945B253527L9151K3404K37743M16507L25838R7353K1825J54061K93562K93091
39935D156062K29143K66007M52141O63506P04770N03490K51307K70661O42196
39926H139283J043139J095162Q08296N02919L44498K07618K7746p444K19860M73960
39916A2855037M44412J84892L8427J85511M84063P35170Q97129J009494J083472
$$ plain form
39985 1404328 1458548 1583921 1555444 1329852 1066568 886853 766687 688698 733589 933382
39975 933382 1153504 1232250 1175102 1124674 1189825 1381987 1667891 1987153 2233790 2311515
39965 2311515 2235470 2140340 2163728 2316668 2455639 2393166 2080346 1682808 1423425 1351237
39955 1351237 1346845 1360439 1503674 1821752 2111763 2139055 1972122 1908738 2067771 2253527
39945 2253527 2292678 2316082 2553825 2970332 3296170 3393523 3415348 3569409 3862971 4156062
39935 4156062 4385205 4651212 5103353 5766859 6471629 6975119 7226426 7497087 8139283
39926 8139283 9182422 10277584 11085880 11588799 11933297 12140915 12168661 12161217 12381077 12855037
39916 12855037 13299449 13484341 13522768 13708279 14192342 14927512 15824641 16834135 17917607
39907A7917607J134510J211109J335647J478050J599176J673726J706670J785912
39899B9842407K044072K484778K959166L438363M140696N134415N929203N820303
39891F1793403M671288L035423J418680k46790k218606m327011o025953o921147
39883E1179287p010542o496595n600684m554318l586823k849098k375430k093768
39875A6612029j864741j596347j346957j222003j173121j052781q72099p88513
39867F695467p91712o68162l93949k71937m68492o80222n49612k01513k8038r0206
39857B551624j12821k975K9311r8566j63031j2891J64042J22496r3704k53242
39847B130243k53160j88650j82547k49496k97653k27170n8023O0214K8171o4723
$$ plain form
39907 17917607 19052117 20263226 21598873 23076923 24676099 26349825 28056495 29842407
39899 29842407 31886479 34371257 37330423 40768786 44909482 50043897 55973100 61793403
39891 61793403 66464691 69500114 70918794 70672004 68453398 64126387 58100434 51179287
39883 51179287 44168745 37672150 32071466 27517148 23930325 21081227 18705797 16612029
39875 16612029 14747288 13150941 11803984 10581981 9408860 8356079 7483980 6695467
39867 6695467 5903755 5235593 4841644 4569707 4101215 3420993 2871381 2669868 2641830 2551624
39857 2551624 2438803 2435828 2465139 2366573 2203542 2190651 2354693 2477189 2383485 2130243
39847 2130243 1877083 1688433 1505886 1256390 958737 731567 673544 733758 761929 697206
39837F97206p9883m2119p0225j50311j55477o8118N57J1581M0571J10340J52497
39826D46619J44320J14756K1460j81222l52784k76995J024J85101J41949O4615
39816C08843J22523J92263R8128p8912j28837k1273Q9797Q8821q441j16905j40005
39805D06002l8565R2356J08009J7617k5937K1405K9903m7117n9360P3872J85615
39794G63800J17688k0861m2699K3775M0199K9117J05109K17848J96867K0743j52285
39783A299301k03576j48711n0891J6538j9352j08302m7318K41767M87246L55391
39773A822093o7717l32256j94236R5518J47746j01430l84486m36149k34987K0080
39763C34176J09147j678j38242j24402L1116J95806K77211K41182O8747j69327
$$ plain form
39837 697206 617323 575204 504979 354668 199191 131073 131630 143211 183782 294122 446619
39826 446619 590939 705695 727155 545933 193149 -83846 -82822 102279 244228 308843
39816 308843 431366 623629 721757 642845 514008 492735 582532 671353 662912 546007 406002
39805 406002 367437 459793 567802 585419 559482 580887 610790 563673 504313 578185 763800
39794 763800 881488 860627 817928 841703 881902 911019 1016128 1233976 1430843 1451586 1299301
39783 1299301 1095725 947014 896123 912661 893309 785007 737689 979456 1466702 1822093
39773 1822093 1754376 1422120 1227884 1323402 1471148 1369718 985232 549083 314096 334176
39763 334176 443323 441645 303403 179001 210117 405923 683134 924316 993063 823736
39753H23736k81224j61096L6061Q8720K434p4394j31161k39589k86806q3037K51876
39742e4480L43334R6516j32521m7396J86256K42508R7499m4920j03913j41899
39732D40984j55587r3652j5257j8240n7286j9578O6536P9367J7587j6596j8358
39721B09920p8797j88443k18999j18454K7114J41613K24937K58260J94319P2851
39711E24321N784J2694Q005j3949N9436K38917L25716J44219k12587m81024n02509
39700A09023l14287m7010J57479J92439Q1728J375Q8033K42132K40310L8838j66708
39689F23352k09377j42345r6538p2756P448J25637J83945J68199J52204J36434
39679H76203L1269j51690k40124j39625j5591q1956k71343k98302n5447K32016
$$ plain form
39753 823736 542512 381416 417477 506197 508631 434237 303076 63487 -223319 -306356 -54480
39742 -54480 288854 385370 252849 205453 391709 634217 731716 686796 582883 440984
39732 440984 285397 191745 176488 158248 100962 81384 147920 227287 244874 228278 209920
39721 209920 131123 -57320 -276319 -394773 -367659 -226046 -1109 257151 451470 524321
39711 524321 530105 542799 550804 536855 596291 835208 1160924 1305143 1092556 611532 109023
39700 109023 -205264 -252274 -94795 97644 179372 180747 268780 510912 751222 790060 623352
39689 623352 413975 271630 175092 102336 109784 235421 419366 587565 739769 876203
39679 876203 907472 755782 515658 376033 360442 278486 7143 -291159 -346606 -114590
39669a14590L10780K05345J11853J06221J07571P1497N8024J01218J40656J20514
39659A219089O7458L4355L8243Q2319J67183K49145K62709K22503K17627K46968
39649B807599J59141j30625m30477m33479r2236L06620M77563M13566K66625J01317
39639C445614q5360j96846j01719J24525K15728N9223j21087n0580K26340M12979
39629C928817L47679J63175N5389M9147N3807L0859J1270J3948L5207Q1829J44854
39618D915981J74323J46089J20554J63928K40773K65007K33862K16461K21401
39609F698379J92897J56879K36961M51030O06591N19344K67988R6858R5609J18677
39599I441213L1086j10390j75049j32894k5471J39577L49556M98124M59937K50585
$$ plain form
39669 -114590 196190 401535 513388 619609 727180 798677 856701 957919 1098575 1219089
39659 1219089 1286547 1320902 1359145 1441464 1608647 1857792 2120501 2343004 2560631 2807599
39649 2807599 2966740 2836115 2405638 1972159 1879923 2186543 2664106 3077672 3344297 3445614
39639 3445614 3360254 3163408 3061689 3186214 3401942 3461165 3340078 3289498 3515838 3928817
39629 3928817 4276496 4439671 4495060 4544207 4598014 4628873 4640143 4654091 4689298 4771127 4915981
39618 4915981 5090304 5236393 5356947 5520875 5761648 6026655 6260517 6476978 6698379
39609 6698379 6891276 7048155 7285116 7736146 8342737 8862081 9130069 9226927 9322536 9441213
39599 9441213 9472299 9361909 9186860 9053966 9028495 9168072 9517628 10015752 10475689 10726274
39589A0726274K3490r3717q8680j107J42083L10743M55188N25298M71362K51648
39579A2722582r4388m14752n92813p13148r49503j272952j423416j235403q52874
39570E173333n28460l40820k32440j98385k56924l09558k35330j08872j30020
39561B832524l14159m40732l71064k39697k21566k60249j85672r200Q1660O469
39551H78314r3705o6651M5866Q3696k4311k00079l16780k89039r8361J81509L85791
39540D86250L76937J94560J4007p6105j57590k81670l13580j31099J10343J30380
39530C52433o9437j88506o9399Q8089P3282j9251j5405J2892q3105j93306j04460
39519b16173R4855J14414m6302p0804J44491K93517J47620q2743j00479K2493
$$ plain form
39589 10726274 10749764 10656047 10567367 10566260 10708343 11019086 11474274 11999572 12470934 12722582
39579 12722582 12628194 12213442 11620629 10907481 9957978 8685026 7261610 6026207 5173333
39570 5173333 4644873 4304053 4071613 3873228 3616304 3306746 3071416 2962544 2832524
39561 2832524 2518365 2077633 1706569 1466872 1245306 985057 799385 790185 871845 878314
39551 878314 784609 717958 763824 847520 823209 623130 306350 17311 -81050 100459 486250
39540 486250 863187 1057747 1071754 995649 838059 556389 242809 111710 222053 352433
39530 352433 282996 94490 25091 113180 186462 167211 151806 164698 81593 -111713 -216173
39519 -216173 -121318 -6904 -53206 -124010 20481 313998 461618 378875 278396 300889
39509C00889J6105j43173k46370k00179q9136M1686K03288K93528J69818q8193
39499B58263k13509r9842P0630R9655J713j03088j62563j67199q3497P5628J97296
39488a26513J85360Q1709K16j3148R873M5336R6020J37246J11068K056j05775
39477D23448q9228O7604K07434J46052r8105k96695k80803j34672m0133j3913
39467a09011O5100K14091K98665K42505J33840O7844R270j03601k10917j93071
39457D14715m4516R9632J11328j325j14958j18536k0510O3901L3502r7618k21197
39446A04418k33164j06293Q7770K04857J34709p3096k40151k58779j95571j50029
39436g25329j08059k2077O5188R9295J27637J94796K13730J08612k88M1292J46386
$$ plain form
39509 300889 316994 173821 -72549 -272728 -361864 -320178 -116890 176638 346456 258263
39499 258263 44754 -55088 15542 115197 116910 13822 -148741 -315940 -399437 -323809 -126513
39488 -126513 58847 140556 140772 127624 137497 182833 278853 416099 527167 529223 423448
39477 423448 334220 401824 609258 755310 657205 360510 79707 -54965 -95098 -109011
39467 -109011 -43911 170180 468845 711350 845190 913034 922304 818703 607786 414715
39457 414715 370199 469831 581159 579834 464876 346340 325830 389731 423233 325615 104418
39446 104418 -128746 -235039 -147269 57588 192297 119201 -120950 -379729 -575300 -725329
39436 -725329 -833388 -855465 -790277 -690982 -563345 -368549 -154819 -46207 -46495 -5203 141183
39425A41183J13487k2307m5384M8849M0189r9913j32084k198k639k72274m75819
39414g08910k78853J30641L38917L11088L15347L88512L02165K7842j67280j45996
39404E13473q4505j37248k05091j55028l7236L6696M5908r77j01767j59998l8262
39393c24035J99566K90208J25583p1441n7194R8306J35097m4490k82923l63385
39383b94708k08693N8837K10996J41345O246K2281J39372J08447j05859k28516
39373a50252q6330J29384J68854P2206J7286J3941j9056k5511Q8303K26238K10860
39362F45923M6701j31631k85135m23680m29205j89460J40104K70664J61443K9237
39352a65039K238K0095O1480J79703K82358J74126j01552k45032j33477k023n3742
$$ plain form
39425 141183 254670 232363 186979 235828 276017 176104 44020 41822 39183 -233091 -708910
39414 -708910 -987763 -857122 -518205 -207117 108230 496742 798907 826749 659469 513473
39404 513473 428968 291720 86629 -68399 -105635 -68939 -23031 -24008 -125775 -285773 -324035
39393 -324035 -124469 165739 291322 219881 162687 260993 396090 351600 68677 -294708
39383 -294708 -503401 -444564 -233568 -92223 -85977 -63696 75676 184123 78264 -150252
39373 -150252 -236582 -107198 61656 133862 151148 165089 146033 120522 208825 435063 645923
39362 645923 692624 560993 275858 -147822 -577027 -766487 -626383 -355719 -194276 -165039
39352 -165039 -162801 -142706 -81226 98477 380835 554961 453409 208377 74900 72877 19135
39341A9135j52701r5048M7967R5068Q5235J77636L25563L12755Q8681j48134k17019
39330E39138j47130q0079r7612j71031k07868j37692J1696J42512K04057K19294
39320B75285J84686N6705j17190j87652j07009j6808l1633o8334j9412L6757k7293
39309b1898j40573j21061L7374J52018J11790o744p9103n4919M8088J48726J23128
39298A96826n3135k09496j58656N2679K03976J86145Q4802K369m3339m3570J9004
39287B37605Q6990N9990o5818j96738k73620k88531k00800P733K09487K38338
39277a85364J26593N8808P9699M8209q0645j44849l2766J39025K10370J72738
39267C91818P7300p6137k27339k03520M3399K69742K01040j09016l51415l47109
$$ plain form
39341 19135 -133566 -228614 -180647 -85579 -344 177292 502855 815610 904291 756157 539138
39330 539138 392008 311929 214317 43286 -164582 -302274 -290578 -148066 55991 275285
39320 275285 459971 516676 399486 211834 104825 88017 56384 -11950 -31362 5395 -21898
39309 -21898 -162471 -283532 -246158 -94140 17650 10906 -68197 -123116 -75028 73698 196826
39298 196826 143691 -65805 -224461 -171782 32194 218339 303141 305510 262171 218601 237605
39287 237605 324595 384585 318767 122029 -151591 -440122 -640922 -633189 -423702 -185364
39277 -185364 -58771 37 79736 127945 47300 -97549 -130315 8710 219080 391818
39267 391818 469118 392981 165642 -37878 5521 275263 476303 367287 15872 -331237
39257c31237j94972n5122M6601J52591K30997J91611K4574j40379j61502o5958
39247c02796k3641r2267r5351J15459L67614L47825N2295j80488j28435N3438
39237A13653J11665J1295j34990k40333k16748Q208K90116L04636j3782k81740
39227d8020j60909J49583K13173k26j22067K5009K05078J72771p994j40094j51237
39216A35067p5053M3958J33724J18808K6789l7772m8989p5000j39076j94820k26340
39205c38704k29254j21403J46144M04190M02704J56255n4189o4477j536j3693
39195B86037m9270j8233J6151m2865j44314j67135r1648J2881R8610J55621J83020
39184B38855J95827J94808J17544p5120k59417k46137n4261P4172k822j46068
$$ plain form
39257 -331237 -526209 -581331 -534730 -382139 -151142 40469 65043 -75336 -236838 -302796
39247 -302796 -326437 -418704 -514055 -398596 -30982 316843 369138 188650 60215 113653
39237 113653 225318 236613 101623 -138710 -355458 -347250 -57134 247502 233720 -48020
39227 -48020 -208929 -59346 153827 153601 31534 56543 261621 434392 426398 286304 135067
39216 135067 60014 103972 237696 356504 383293 345521 296532 221532 82456 -112364 -338704
39205 -338704 -567958 -689361 -543217 -139027 263677 419932 365743 301266 299730 286037
39195 286037 236767 218534 234685 191820 47506 -119629 -211277 -198396 -99786 55835 238855
39184 238855 434682 629490 747034 671914 412497 166360 112099 186271 183449 37381
39174C7381j60039m8238N9191J01402R7568O6622L8926O0505J07046Q7841q5l5480
39162D12640L7717J06140N7744n7253j24847j21799q9542n3835m1088p4230j00675
39151d9028m0761N6205N2407m5130p2034K1254R0964O4115N1326J01581R5765
39140C26664P161l783R3167Q6572p3808r5504J59781L35545J07510k48499k64314
39129D30492j2812P5771m6283n4940Q2080N4741j53624j72382R7763K85237J79433
39118G65476L5509L1915m8374k99876l67207l0978L12066K11268j41527k56091
39108B12181r9027K425j2375M8087J22768k8372k81756k29924J39259L52473J67866
39097C93605q5142p3375N8081L6409n8810N805J76317K01368L2939j45431k14689
$$ plain form
39174 37381 -122658 -170896 -111705 -10303 87265 153887 192813 253318 360364 448205 448120 412640
39162 412640 450357 556497 614241 556988 432141 310342 220800 166965 125877 51647 -49028
39151 -49028 -89789 -33584 18823 -26307 -98341 -77087 13877 77992 129318 230899 326664
39140 326664 333825 330042 423209 509781 435973 340469 500250 835795 943305 694806 430492
39129 430492 417680 493451 447168 392228 474308 529049 375425 203043 300806 586043 765476
39118 765476 800985 832900 784526 484650 117443 86465 398531 609799 468272 212181
39108 212181 113154 115579 103204 151291 274059 245687 -36069 -265993 -126734 225739 393605
39097 393605 308463 235088 293169 329578 270768 276573 452890 654258 687197 541766 327077
39086C27077k07275j49047k7057J00272J32641O9803p14m4194r7247j66087k09194
39075b71022k03522j40844P655K24684L76711L25300J09661p4875q9504K7450
39065B91694J49429J95878J66248R9601K4810o2559j61847k08571j21721N8381
39055D31343J66305J12838L055l5611m3866j15859j87112j26397J1169M6199j0093
39044B51971M8913K49349L13290O7679k36867k41573K3917K11181J48509K250
39034H38619o0142j04685k29923l36443k62886m9370R4851N9760n0480q0470j2387
39023a93556M7791K4731m2333p2188m9368j5978J7673P9728J46144J32379K1385
39012I6408q3770j02817r0266j12864j01997L5169K14805K50720J16380k7020
$$ plain form
39086 327077 119802 -29245 -56302 43970 176611 246414 245700 201506 104259 -61828 -271022
39075 -271022 -474544 -615388 -607733 -383049 -6338 318962 428623 353748 264244 291694
39065 291694 441123 637001 803249 902850 927660 865101 703254 494683 372962 431343
39055 431343 597648 710486 713541 677930 634064 518205 331093 204696 215865 262064 251971
39044 251971 300884 550233 863523 931202 694335 452762 476679 687860 836369 838619
39034 838619 778477 673792 443869 107426 -155460 -204830 -109979 -50219 -100699 -181169 -193556
39023 -193556 -145765 -121034 -163367 -235555 -284923 -300901 -283228 -203500 -57356 75023 96408
39012 96408 12638 -90179 -180445 -293309 -395306 -360137 -145332 105388 221768 194748
39002A94748p4827r1635j43450j73216j16251j8613L6155K7736k6559j05005j45463
38991f36380p6943O8572J76019K09285K30564K26548P7052k21351m49056l97488
38981g93178j11744J85312L15414K36612M2017p3763O330J23702J2078k76615
38971c33835l69084j17899J40452R2640p1036M412K52370L20721J44929k0097
38961D3573o2105r9217j32380j9504J71077J75158k0482j13497K7591J68849J35617
38950B74680P9824J43207J79380L5925j58962k22006j92340j65602q0649R6282
38940a0261J90636P4144q6465q6654j6031p1876k01182k10584j05294l1730J6176
38929e39121J42168K72184K26823L6003r0551r3433j09776j92024k27100j56881
$$ plain form
39002 194748 119921 28286 -115164 -288380 -404631 -423244 -387089 -359353 -385912 -490917 -636380
38991 -636380 -713323 -644751 -468732 -259447 -28883 197665 274717 53366 -395690 -793178
38981 -793178 -904922 -719610 -404196 -167584 -125567 -199330 -193000 -69298 -57220 -333835
38971 -333835 -702919 -820818 -680366 -587726 -658762 -654350 -401980 -81259 63670 43573
38961 43573 -18532 -117749 -250129 -269633 -98556 76602 56120 -57377 -29786 139063 274680
38950 274680 354504 497711 677091 713016 554054 332048 139708 -25894 -106543 -10261
38940 -10261 180375 254519 168054 81400 65369 -6507 -207689 -418273 -523567 -555297 -539121
38929 -539121 -396953 -124769 102054 138057 47506 -45927 -155703 -347727 -574827 -731708
38919g31708n7710K7421J37511K52848K90939K56464K19783J52527k2777k26646
38909B98652k77669j62037l6459M3882J63495K89800K46787K4812j39345j08885
38899C43033l8136p9287j28615m7309O6101M4800n7334q0556n0162j00890j76828
38888c05183q0667J63763K57332L3943k70650l06150m9819J95195J96519L9161
38878a26556l7427P2352K71501L96048L41566J08693j83981l56186l28459k17934
38868f0383j79690j80534p4887R9585J09831j09477k91409j93558N7868J86758
38858f35896J80353K21905L07742K40357m688k01987k18115j63691j28666l2733
38848d35419J37562J96708M7180j06659m4573J24585J34491k7256j24262m8790
$$ plain form
38919 -731708 -789418 -761997 -624486 -371638 -80699 175765 395548 548075 525298 298652
38909 298652 20983 -141054 -177513 -133631 29864 319664 566451 591263 451918 343033
38899 343033 304897 225610 96995 49686 115787 160587 103253 22697 -27465 -128355 -305183
38888 -305183 -385850 -222087 35245 69188 -201462 -507612 -557431 -362236 -165717 -126556
38878 -126556 -163983 -91631 179870 575918 917484 1026177 842196 486010 157551 -60383
38868 -60383 -240073 -420607 -495494 -395909 -286078 -395555 -686964 -880522 -822654 -635896
38858 -635896 -455543 -233638 74104 314461 309773 107786 -110329 -274020 -402686 -435419
38848 -435419 -297857 -101149 -53969 -160628 -205201 -80616 53875 26619 -97643 -146433
38838a46433L8417k5586j84063k72148k27019j15864k7866P440L7670J49799L67442
38827c98211N62260N26641J96828k15625l90471k33635P064L2566j34829j89513
38817b36925L1776L19496L84591K39092J16191J09462J04325L0652m0574p0262
38807I87824j15703j78693j77020j18933j20009j84831j63506m588J41617J64848
38797B31006J39250J16228l734k29244l24750j25343J59007K02288R499j44916
38787B9291j36586q2184n4290J9264J45401J92926J00227j7764l6638L4542J19507
38776C13696J63854J27609L833j27695j65999j17975o2523k996J09204K09296
38766D50304J45474q4532k75250k66999j33591l1262K7879J32573K68749K98214
$$ plain form
38838 -146433 -108016 -133602 -317665 -589813 -816832 -932696 -960562 -953122 -915452 -765653 -398211
38827 -398211 164049 690690 887518 671893 281422 47787 54851 87417 -47412 -236925
38817 -236925 -205149 114347 498938 738030 854221 963683 1068008 1098660 1058086 987824
38807 987824 872121 693428 516408 397475 277466 92635 -70871 -75459 66158 231006
38797 231006 370256 486484 482750 253506 -71244 -196587 -37580 164708 174207 29291
38787 29291 -107295 -189479 -243769 -224505 -79104 113822 214049 196285 159647 194189 313696
38776 313696 477550 605159 608992 481297 315298 197323 134800 131804 241008 450304
38766 450304 595778 511246 235996 -31003 -164594 -195856 -167977 -35404 233345 531559
38756E31559J56543k5423o8221J7589L1306j31573k79264j49772J82842L23210
38746E88796N8756l29491m17574j67287R3749J34642L6194l6118m8826m0845j8480
38735a46484J6068L6784L9704M2831L9774K9775N6718J19311J08907k1678j03558
38724B18152L7681K71027K98498Q8448r5709j24175j61885l08805l78411k12747
38714c67926K8018J10387P0932P9500J10560J5752j57885j87566j2749J58987
38704a51990J28361n7500j92573j48764J3770J35758J44404J31758J96091K48354
38694D47669J23463j17131k03306m5387J22567J15045O7276J36957J76231n861
38684H17523k40601k19343j2107K0576j87778l04218j34714J00273J56436J06867
$$ plain form
38756 531559 688102 662679 594458 612047 643353 511780 232516 82744 265586 588796
38746 588796 647552 318061 -99513 -266800 -173051 -38409 -2215 -38333 -87159 -128004 -146484
38735 -146484 -130416 -93632 -53928 -11097 28677 58452 115170 234481 343388 321710 218152
38724 218152 255833 526860 825358 913806 818097 693922 532037 223232 -155179 -367926
38714 -367926 -339908 -229521 -158589 -79089 31471 47223 -110662 -298228 -310977 -151990
38704 -151990 -23629 -81129 -273702 -422466 -408696 -272938 -128534 3224 199315 447669
38694 447669 571132 454001 250695 205308 327875 442920 510196 647153 823384 817523
38684 817523 576922 357579 345472 366048 178270 -125948 -260662 -160389 -3953 102914
38674A02914J15422J39786O8037n1280j09443j07997p6089J1971R7114J6468k10611
38663c708k98984j08992Q6103R957j58404p9924J60145J80552n4520j64945L6949
38652c95771K81872L01233J79003Q6983N413r0667o7006J09798K03984N4752j39068
38641E30526j41903o6104j30469k39093j61799J9597M7876k1682R3825L54554
38631B85328L91378J18546r6377k5867P9287k7429j56918m6515J61474J64997
38621H47904L37p2913k2958j7447o1098l0030L760j44936l88202m26479k20693
38610e32755n1261m6506m773J97750L55751K69664N8106o1617q1860j02660j23715
38599a23876j29665j91503k84247j97626J39671M27974L63226R0560j5160Q4523
$$ plain form
38674 102914 218336 358122 426159 374879 265436 157439 81350 93321 190435 206903 -3708
38663 -3708 -302692 -411684 -325581 -315624 -474028 -553952 -393807 -213255 -267775 -432720 -395771
38652 -395771 -113899 187334 366337 453320 458733 368066 301060 410858 614842 669594 530526
38641 530526 388623 322519 192050 -47043 -208842 -189245 -141369 -163051 -69226 285328
38631 285328 676706 795252 698875 673008 752295 724866 567948 521433 682907 847904
38621 847904 848241 775328 752370 734923 673825 643795 647555 502619 114417 -312062 -532755
38610 -532755 -584016 -630522 -635295 -437545 -81794 187870 245976 184359 102499 -161 -123876
38599 -123876 -253541 -445044 -729291 -926917 -787246 -359272 3954 94514 79354 163877
38589A63877R6114p0283j50981Q979J90026J59970K3236p753K2713o4327k27838
38578A43733k52277j08683r625o4617j06056L4940K50238L08515J88093P7059
38568D61320O7883L6834j16748k67320k27614l0695J02594N4385p5591j56720
38558a51672j80806j73300r4067O0657J59106Q2658p2933r2077O8359K17155J88335
38547A1415M1791n3543l7396K3584O4416O8807K2181p7222j56869j16364K8123
38536a81077J25453P7194j8638p60J13538J37508j7528k02409k26887j05004m326
38525c02936r536n3525n7333j3826P3735K10403L24684K80558N9341j44823j16430
38514B50312J11985K71015J60631j08725k35726q5239J36979J26843j34018l45547
$$ plain form
38589 163877 259991 189708 38727 47706 237732 397702 420938 413185 435898 371571 143733
38578 143733 -108544 -217227 -226852 -291469 -397525 -362585 -112347 196168 384261 461320
38568 461320 529203 566037 449289 181969 -45645 -76340 26254 80639 5048 -151672
38558 -151672 -332478 -505778 -599845 -539188 -380082 -297424 -370357 -462434 -394075 -176920 11415
38547 11415 53206 -337 -37733 -14149 50267 119074 141255 64033 -92836 -209200 -181077
38536 -181077 -55624 21570 2932 2172 115710 253218 235690 33281 -193606 -298610 -302936
38525 -302936 -312472 -365997 -423330 -437156 -363421 -153018 171666 452224 511565 366742 250312
38514 250312 362297 633312 793943 685218 449492 364253 501232 628075 494057 148510
38504A48510k64422J0671K06202K08794J07250l768r4217j23950o9748o039m968
38493A14315O103J12197J86673L3479k57898l64494j76137P5005J91856K30615
38483A51714K41897J14768j38943k48236q1647P8581m5627k59062j84187J38389
38473b32353L11397J68542n0427j00820l019J07771J44450N8510j17250k16865
38463F9936j25275K2776K6092p5782j11874j00380j70367k44972j41849N5681
38453g96014R4878O468O4813K71624L09043R3248o6912j1405J5129j37272k04766
38442c61166J3368K47860J87970p514j8811Q4566K6301j42726j34006O7719J96306
38431A59867J50661P5188K4009j01375k74440l23519k16023r0703K635J32657
$$ plain form
38504 148510 -115912 -105241 100961 309755 417005 413237 319020 195070 125322 119283 114315
38493 114315 120418 232615 419288 452767 194869 -169625 -345762 -270757 -78901 151714
38483 151714 393611 508379 369436 121200 39553 118134 72507 -186555 -370742 -232353
38473 -232353 79044 247586 197159 96339 93320 201091 345541 404051 286801 69936
38463 69936 -55339 -32563 -6471 -82253 -194127 -294507 -464874 -709846 -851695 -796014
38453 -796014 -701136 -694668 -629855 -358231 -49188 44060 -22852 -34257 -19128 -156400 -361166
38442 -361166 -347798 -99938 88032 80518 61707 146273 172574 29848 -104158 -36439 159867
38431 159867 310528 385716 409725 308350 33910 -289609 -505632 -596335 -593700 -461043
38421d61043K57063K37042R7280R087k377o7180j66032j06427J30849K96409K26459
38410D51130N8489j3004J0701K6393q658r5193k00382j90720M3106L35113L52328
38399G69303N1932k07208j44400P9484J48204L0339p7924q7766o3901l5833K3426
38388D85656Q4401R7497R4780J18771J17541M5351j8604r245m4978k60192n19237
38377A91741n19029j93498J76319L06130K03176N4898k7593m9363j8095P5194
38367A99880J84446K19459J52484O1001L1094M3063m85j22047j98317j07588P0819
38356E33809J04571r8744l29818l02660q900K57845K50191M6805q2816l2885L7049
38345C74447k8477j38691r9455P4218J65598Q7560J2711P9792J52316M0317j74612
$$ plain form
38421 -461043 -203980 33062 130342 139429 137052 69872 -96160 -202587 -71738 224671 451130
38410 451130 509619 496615 507316 533709 525051 429858 229476 38756 81862 416975 769303
38399 769303 821235 614027 469627 549111 697315 727654 649730 561964 498063 462230 485656
38388 485656 570057 667554 762334 881105 998646 1043997 1025393 1016148 971170 710978 191741
38377 191741 -327288 -520786 -344467 -38337 164839 219737 192144 142781 124686 199880
38367 199880 384326 603785 756269 817270 848364 891427 890942 768895 570578 462990 533809
38356 533809 638380 539636 209818 -92842 -101742 156103 406294 453099 370283 337398 374447
38345 374447 345970 207279 107824 182042 347640 435200 447911 527703 680019 720336 545724
38334E45724k58071j87611j50530j97907j60473M3816K54111L06682K33323J29443
38324E58507J4653p3023l7678Q9603J08657n5716j90301r9308Q8714J28314L1677
38313E64099q624K8478m707j02506o9498J43790L09243K33037K6761o2093J5175
38302A073155P3729l7171k28814k66992n2592K30176K96212Q4243j81990k76662
38292G13294k08733j23867r3510r8451j12646q6790N2217K61133L43247J92954
38282H38848k6776j07683q0306q5335q6966L1155J73291J35232k9985o4397N7570
38271G54648O9509j30980k87711j91333P093P6352N0873P1293Q2148m9540k39148
38260B13204k62175p4727J40144K10727J12422p7838k19897j67376O5871K52504
$$ plain form
38334 545724 287653 100042 -50488 -248395 -408868 -365052 -110941 195741 429064 558507
38324 558507 573160 500137 462459 552062 660719 605003 414702 315394 404108 532422 564099
38313 564099 555475 583953 579246 476740 407242 551032 860275 1093312 1120073 1057980 1073155
38302 1073155 1146884 1109713 880899 613907 561315 791491 1087703 1171946 989956 713294
38292 713294 504561 380694 287184 188733 76087 -10703 41514 302647 645894 838848
38282 838848 812072 704389 624083 538748 451782 482937 656228 791460 761475 697078 754648
38271 754648 824157 693177 405466 214133 221226 297578 348451 419744 501892 452352 213204
38260 213204 -48971 -123698 16446 227173 339595 261757 41860 -125516 -59645 192859
38250A92859K04004J3295r7285r3258j12175j79463j50048M1799K44308K64861
38240C28897Q9762j11963j51117Q120J90415J75022k3243j36406j0501J36888
38230D95874J5245k76472l46707o7595K32561K16527m5324k36726k01709l3260
38220b47586J23058J87075J28935j1064j01279l0460J53095K84719K58535J02056
38210H47084j00906k83228l86624l58638k06324k4897P6182Q5792R9033J87830
38200f4696K92375K94892J86946Q1050M3671K0712k5264k6380M7845Q1428r531
38189I23048r5020j9717J06300M9783j40916j59780P6062K61838J54302q1955
38179A073945j73765j49152j86032k32943j03409J37213K10276N1176r9214p8399
$$ plain form
38250 192859 396863 410158 312873 219615 107440 -72023 -222071 -180272 64036 328897
38240 328897 418659 306696 155579 163699 354114 529136 505893 369487 358986 495874
38230 495874 511119 234647 -112060 -179655 52906 269433 224109 -12617 -214326 -247586
38220 -247586 -124528 62547 191482 180418 79139 48679 201774 486493 745028 847084
38210 847084 746178 462950 76326 -282312 -488636 -513533 -437351 -351559 -252526 -64696
38200 -64696 227679 522571 709517 790567 834238 854950 829686 803306 851151 932579 923048
38189 923048 828028 808311 914611 964394 823478 663698 739760 1001598 1155900 1073945
38179 1073945 900180 751028 564996 332053 228644 365857 576133 627309 528095 449696
38169D49696k253O548K8925J44588K33902J64081J4327o2202o9701q5553o8653
38158G53705M2808J36287N8671j03022j13214M3710J25107L195j50454j42118
38148F54675k1193M6365N565j05065k43441l08575j56633J63988L45288J93909
38138E74883n0174j3883K71901M15904K30704l6218r4259K8554J28848J21891
38128A578151N4602k0949o3357m9940m9075j49860k65838j98023K5074R9770j17977
38117H42578l58622l15138o3119J25981J90584K18314J61244m5542k04999p7174
38107D74107J80590J82478q2232k18430n2980J20547N8356o9946m9435j552j12973
38096D28530k52283j75948N7399J78297J04915n272k4752M0118J48019K40401
$$ plain form
38169 449696 447443 453991 482916 627504 861406 1025487 1039814 977612 907911 822358 753705
38158 753705 796513 932800 991471 888449 775235 818945 944052 947247 796793 654675
38148 654675 633482 679847 685412 580347 336906 28331 -128302 35686 380974 574883
38138 574883 524709 510826 782727 1198631 1429335 1393117 1298858 1327412 1456260 1578151
38128 1578151 1632753 1611804 1548447 1498507 1449432 1299572 1033734 835711 860785 960555 842578
38117 842578 483956 168818 105699 231680 422264 640578 801822 756280 551281 474107
38107 474107 654697 837175 754943 536513 483533 604080 662436 592490 543055 541503 428530
38096 428530 176247 299 57698 235995 340910 335638 310886 351004 499023 739424
38086G39424K26072J02481J1020M0806R6073R0291J05335J83848J54353r7141
38076A652562l49499l21458r2693M3433K8891K1634L2085n1314j28797J7639K89308
38065A141791L34130J06634m3606M0523O7335j67787l84750k64249J5991N7462
38055I03474j38211j98092M9316L56857M22845K31265j1524j22927r4044p2306
38045A326653j75012k89579j76687J58538L76782K41417k5065n1356J39141J83496
38035A708328n5177k77721j84332J12783K56244R1391j93652l21817k11112l750
38025I21185J23343J34798J19194J34781J37991P1659m6108j46624j61414l7835
38015A250970K03608M04959L80555J44029q3476j42343q6632j6766O9234J54503
$$ plain form
38086 739424 965496 1067977 1078997 1119803 1215876 1306167 1411502 1595350 1749703 1652562
38076 1652562 1303063 981605 888912 932345 961236 982870 1014955 963641 834844 852483 1141791
38065 1141791 1475921 1582555 1538949 1579472 1646807 1479020 1094270 830021 846012 903474
38055 903474 765263 567171 616487 973344 1396189 1627454 1615930 1493003 1398959 1326653
38045 1326653 1151641 862062 685375 843913 1220695 1462112 1437047 1385691 1524832 1708328
38035 1708328 1653151 1375430 1191098 1303881 1560125 1651516 1457864 1136047 924935 921185
38025 921185 1044528 1179326 1298520 1433301 1571292 1642951 1596843 1450219 1288805 1250970
38015 1250970 1454578 1859537 2240092 2384121 2300645 2158302 2071670 2054904 2124138 2278641
38005B278641J10433j12169l32265l48959j95206k6212J20797K75794L66189L05355
37995B442398J59156K9698j21697l27771m19887k42487L7841J28765M4202L4480
37985A764698J47114J97751J47448J38721J48559J098k21904k02073P4654K25521
37975B421587Q7346q730J81612L86160K90764N7981j5628j7970j48384k21779
37965C012959K5838L39256K31502k16061m24369k01690J7378o9148j91526o1997
37955B462142J21731O0494j30621j57030k7062N8965R7739K01452K73121J31442
37945C092373j08203j26948J20527L27183K76360R6015o880k7873n6050o5638
37935C520866K3633J72315K46863J89859P7157J5041L1989P4056Q9278J05964
$$ plain form
38005 2278641 2389074 2276905 1944640 1595681 1400475 1374263 1495060 1770854 2137043 2442398
37995 2442398 2601554 2631252 2509555 2181784 1761897 1519410 1557251 1686016 1730218 1764698
37985 1764698 1911812 2109563 2257011 2395732 2544291 2545389 2323485 2121412 2196066 2421587
37975 2421587 2508933 2500203 2681815 3067975 3358739 3416720 3401092 3383122 3234738 3012959
37965 3012959 3038797 3378053 3609555 3393494 2969125 2767435 2784813 2715665 2524139 2462142
37955 2462142 2583873 2644367 2513746 2356716 2329654 2388619 2486358 2687810 2960931 3092373
37945 3092373 2984170 2857222 2977749 3304932 3581292 3677307 3670427 3642554 3586504 3520866
37935 3520866 3544499 3716814 3963677 4153536 4230693 4245734 4277723 4351779 4441057 4547021
37925D547021J93896L29190L65872K21194L9892N5975K95185N28954N46553L73688
37915G497420J90876J29765J91932K85878K99462K04630J15630J57226K58173
37906I330992K04375n1369k85334l11722k40298k60101l04169j77197M5640M5351
37896G996168k60743n37500m73723j91278j7702j1243L5709J90819K56875J04279
37886G091661r1998p9775J29401K90134K48196J10219P4834J82593K90295K63881
37876H509441J34435M2618P2336J87771L08953L78804L60684K59103J65253J85189
37866A0604587K78576K76719J34891M8192J93479M59368N99817N83735N87925
37857A3767289O70276O86049N77212N19900O63822Q96374J017473J031685J103898
$$ plain form
37925 4547021 4740917 5070107 5435979 5657173 5697065 5753040 6048225 6577179 7123732 7497420
37915 7497420 7688296 7818061 8009993 8295871 8595333 8799963 8915593 9072819 9330992
37906 9330992 9535367 9483998 9198664 8886942 8646644 8386543 8082374 7905177 7950817 7996168
37896 7996168 7735425 7197925 6724202 6532924 6515222 6503979 6539688 6730507 6987382 7091661
37886 7091661 6999663 6919888 7049289 7339423 7587619 7697838 7772672 7955265 8245560 8509441
37876 8509441 8643876 8686494 8758830 8946601 9255554 9634358 9995042 10254145 10419398 10604587
37866 10604587 10883163 11159882 11294773 11342965 11536444 11995812 12595629 13179364 13767289
37857 13767289 14437565 15123614 15700826 16220726 16884548 17780922 18798395 19830080 20933978
37848B0933978J285365J434356J406814J235192J114368J242784J636474K073411
37840C2362742K295178K300605K344132K595000K929757L158003L307914L516014
37832E4809345L735738L781593L647669L561358L658148L780296L715335L526965
37824H4216447L510968L844627M387296M867410N215740N641265O354384P278716
37816A25316853Q127734Q756732R331961J0126786J1270006J2756244J4568122
37809B00254438J6637390J8714301K0355734K0999043K0021621J6908497J1584882
37802C25475906M595970l128847j0647584j7119763k1810207k4324648k4867113
37795B28173714k4047836k2398685k0217611j7809000j5557812j3660690j2009553
$$ plain form
37848 20933978 22219343 23653699 25060513 26295705 27410073 28652857 30289331 32362742
37840 32362742 34657920 36958525 39302657 41897657 44827414 47985417 51293331 54809345
37832 54809345 58545083 62326676 65974345 69535703 73193851 76974147 80689482 84216447
37824 84216447 87727415 91572042 95959338 100826748 106042488 111683753 118038137 125316853
37816 125316853 133444587 142201319 151533280 161660066 172930072 185686316 200254438
37809 200254438 216891828 235606129 255961863 276960906 296982527 313891024 325475906
37802 325475906 330071876 326943029 316295445 299175682 277365475 253040827 228173714
37795 228173714 204125878 181727193 161509582 143700582 128142770 114482080 102472527
37788A02472527j0471075r114686q055608p243958o549205n922524n345986m744154
37780D5025331m087129l484153l039013k691371k327020j971759j745611j674336
37772B4004939j658668j590185j411453j123448q29506p07109q22053j008697
37764A4853820j033056q45430n96121m45182m32109m86662m97164m14410l35611
37755I768075m03848n72101n93415l48684n7011j0565j99536l70608l82757l18055
37745F511495k82242k85987l16420l56460l31255j90228l6228j0134n3111K7919
37735D677349K35148L21718J32207j74067l43252l29849k64389k29895k01894
37726C823076j52017r4198l8278L1007J17843J73671J00755j46079m11101l84452
$$ plain form
37788 102472527 92001452 82886766 74831158 67587200 61037995 55115471 49769485 45025331
37780 45025331 40938202 37454049 34415036 31723665 29396645 27424886 25679275 24004939
37772 24004939 22346271 20756086 19344633 18221185 17391679 16684570 15862517 14853820
37764 14853820 13820764 12975334 12379213 11934031 11501922 11015260 10518096 10103686 9768075
37755 9768075 9364227 8792126 8198711 7850027 7793016 7782451 7582915 7212307 6829550 6511495
37745 6511495 6229253 5943266 5626846 5270386 4939131 4748903 4712675 4702541 4649430 4677349
37735 4677349 4912497 5234215 5366422 5192355 4849103 4519254 4254865 4024970 3823076
37726 3823076 3671059 3576861 3538583 3569590 3687433 3861104 3961859 3815780 3404679 3020227
37716C020227N2586N72049O86354L18841j00720j72992K8873J61838Q0435o5170
37706D582321q8884M1847K26546L20492K48906J18042J34601L24376M40074K80899
37696F629220j955r6340M2393J52914L8348k20635m45672n72721o21018n95009
37686D309525n06441m06775l29694k61092j99048j71010j62556j11140j0787N2779
37676B203761J7395p0167j29583j51846j84442k53232l29235l39201k09699L6030
37666E89781K27741J92337k2811j70041r3303R7712K05218J83730J06163j240
37656A315287j38267k09962j11298O5966R2291p4294j82525k1287K61534L33348
37646A330793J15915j25492j49277k9052Q219q9609j74070j41035m6278K8766
$$ plain form
37716 3020227 3072813 3644862 4331216 4650057 4549337 4376345 4405218 4567056 4647491 4582321
37706 4582321 4493437 4535284 4761830 5082322 5331228 5449270 5583871 5908247 6348321 6629220
37696 6629220 6627265 6530925 6573318 6726232 6764580 6543945 6098273 5525552 4904534 4309525
37686 4309525 3803084 3396309 3066615 2805523 2606475 2435465 2272909 2161769 2150982 2203761
37676 2203761 2221156 2150989 2021406 1869560 1685118 1431886 1102651 763450 553751 589781
37666 589781 817522 1009859 987048 817007 723704 821416 1026634 1210364 1316527 1315287
37656 1315287 1177020 967058 855760 921726 1014017 939723 757198 735911 997445 1330793
37646 1330793 1446708 1321216 1171939 1142887 1151106 1061497 887427 746392 700114 728880
37636G28880Q2395J13494O4544o5570j49516q8450K4048K2405q6540j39757p0002
37625D35931L133l7314j52106k27463k02914p7115J01114K03587J15720p4271
37615H8302j21237M4107J80764Q3549q3651k2559K21554K91217L7530k52695k50829
37604B16052n361J77122J33947k8934j42540j55292j13248o0695P306J13453K22422
37593C64232K25610O4547j45749k15278j12886P472M0095N5879J35847K11875
37583F31644J81931Q1202J4577q368m7890r7321r3345l5052O193k3556j24220
37572D85795k44925k70737j03358J58320K39047K5669k27602k08023L7738K05047
37562I6971J75700J06621J00365O8931k4893n1889N6791J79873K05612J69275
$$ plain form
37636 728880 811275 924769 989313 923743 774227 685777 709825 732230 645690 505933 435931
37625 435931 439064 401750 249644 22181 -180733 -257848 -156734 46853 162573 88302
37615 88302 -32935 11172 191936 275485 191834 169275 390829 682046 719576 466881 216052
37604 216052 210691 387813 521760 492826 350286 194994 81746 21051 28357 141810 364232
37593 364232 589842 654389 508640 293362 180476 187948 228043 283922 419769 631644
37583 631644 813575 894777 909354 900986 853096 755775 662430 627378 633571 610015 485795
37572 485795 240870 -29867 -133225 25095 264142 289811 62209 -145814 -108076 96971
37562 96971 272671 379292 479657 548588 523695 471806 528597 708470 914082 1083357
37552A083357J01755m6156k18030k22988m8914K6774j54821l35531k17250M7626
37542A5822P7798j33406k12362r97K09737J46934n1380q8446O3286J88289J54371
37531C69646L0788n7021n2955J4468M9042m1585k17306k96325j50469J26626L10910
37520H5819K75019P5332j37954k32012j54675K9951J73078J67103M7916n5893
37510B73684o3562k265N4752O8332N0583L0910J7861n150m2862o1021k6569K9264
37498C23957L5682j1568j8969Q3184K17102K18829L1839k09388l17831k45817
37488A07020j03349r671J3697R10k8220m7589k36J20979K05631J39320k7531j31443
37476B39518j18364r2911j21874j27579m2889N6865P3658L2310K498k4860o6866
$$ plain form
37552 1083357 1185112 1138956 920926 697938 649024 675798 520977 185446 -31804 15822
37542 15822 93620 -39786 -252148 -253145 -43408 103526 52146 -36300 26986 215275 369646
37531 369646 400434 343413 290458 304926 353968 312383 95077 -201248 -351717 -225091 85819
37520 85819 360838 436170 298216 66204 -88471 -58520 114558 281661 329577 273684
37510 273684 210122 207857 262609 330941 381524 412434 430295 425145 382283 321262 294693 323957
37498 323957 359639 348071 329102 412286 629388 848217 880056 670668 352837 107020
37488 107020 3671 -6000 7697 8607 -19613 -67202 -67438 53541 259172 398492 370961 239518
37476 239518 121154 28243 -93631 -221210 -264099 -207234 -133576 -101266 -98768 -123628 -190494
37465a90494n2877N7937J43621O7804q9118j16696K7326J66539J57330M6459m0809
37454A77022m9018o370K1423j0713n5577j4288Q0631M1368j78524l08736j13270
37443d16052J98811K20282m6433j82944O160K14465J28049j28324k40720j42758
37433c89464J5272J27072J49762M2382j18431j36267N498M2920j56017l02650
37423g19923r8815K56806L24422O2230j62396j41111k4157M8757J31982K09870
37413a12335J09698j66520l20849j64588Q7648J33674N966m2565O2361J66396
37403b41114J66426J19553P9959J4223p9871j11507k7793P8576P7137j8254n8261
37392i26L4844J38957P8756j29242k73350k07215k1253R6939R0845M9069N3277
$$ plain form
37465 -190494 -243371 -185434 -41813 25991 -63127 -179823 -152497 14042 171372 217831 177022
37454 177022 128004 121634 143057 132344 76767 62479 143110 184478 5954 -302782 -416052
37443 -416052 -217241 3041 -43392 -226336 -220176 -5711 122338 -5986 -246706 -389464
37433 -389464 -374192 -247120 -97358 -54976 -173407 -309674 -304176 -261256 -417273 -719923
37423 -719923 -818738 -561932 -237510 -175280 -337676 -478787 -502944 -454187 -322205 -112335
37413 -112335 -2637 -169157 -490006 -654594 -566946 -433272 -427306 -469871 -407510 -241114
37403 -241114 -74688 44865 124824 139047 59176 -52331 -80124 -1548 75589 57335 -926
37392 -926 33918 172875 251631 122389 -150961 -358176 -379429 -282490 -191645 -142576 -89299
37381h9299R3370R9398Q254j51920k21989o3739K01940K59839L559k87750l20971
37370d69308j66682o3426j6996J15120K56626J85565m3441j05531J04456L10079
37360A06462K81744J27025J9667p4342k17647k94679j97196l1678N1764P1281
37350a57599Q1203J7838j19348j24767J18221L52270K48433r8891k76062j10495
37340f9197J57818K66440K15141J08256l4065j94611k73205k09639q3623l320
37330a20005K1036L3568M6510M9489L5970j2097j00009j68908j49001p1733l6041
37319d71221n4443m1655K3508N1800J0059O369J16085K23203J59312m9708j99594
37308b26285j63137k4942N8633M5012J948j9482l4421o2310q3790p7540n2878
$$ plain form
37381 -89299 4071 103469 111723 -40197 -262186 -325925 -123985 135854 139413 -148337 -469308
37370 -469308 -635990 -699416 -716412 -601292 -344666 -159101 -202542 -308073 -203617 106462
37360 106462 388206 515231 534898 460556 242909 -51770 -248966 -280644 -228880 -157599
37350 -157599 -76396 -58558 -177906 -302673 -184452 167818 416251 317360 41298 -69197
37340 -69197 88621 355061 570202 678458 644393 449782 176577 -33062 -116685 -120005
37330 -120005 -98969 -65401 -18891 30598 66568 54471 -45538 -214446 -363447 -435180 -471221
37319 -471221 -525664 -567319 -543811 -492011 -481952 -475583 -359498 -136295 23017 -26691 -226285
37308 -226285 -389422 -414364 -355731 -310719 -308771 -328253 -362674 -424984 -508774 -586314 -639192
37297f39192k0357K7075P0191M9175n1404j45724j48138r3770o2648j8370J37429
37286h95733L43954L83686J82875l5425k3326J65693K63548J44315m7989j16217
37276C65381l2813P5992Q8032k898r8127j07239n2949l2907p9888j28739j31971
37265a38126j10060n8356O9175K19671K26276M1196j46304j57573o3423j5965
37255a33489K3302J63710K91172J73560j50594l61402k88213j10008m0296l7991
37245d70249L2234J35889J41801N0619j7512j4741j0782n9393j14567r2628K0530
37234c98799J30533J16018k0127j18346n3042Q7670J23528M3558r905k608n3562
37223a55082j78710k03609m0552J31712J14275k8700r5259m2795J1398R260K084
$$ plain form
37297 -639192 -659549 -632474 -562283 -513108 -564512 -710236 -858374 -952144 -1014792 -1033162 -895733
37286 -895733 -551779 -168093 14782 -20643 -43969 121724 385272 529587 481598 365381
37276 365381 332568 408560 496592 493694 395567 288328 235379 202472 122584 -6155 -138126
37265 -138126 -248186 -306542 -237367 -17696 208580 249776 103472 -54101 -117524 -133489
37255 -133489 -110187 53523 344695 518255 367661 6259 -281954 -391962 -432258 -470249
37245 -470249 -438015 -302126 -160325 -109706 -127218 -141959 -152741 -212134 -326701 -419329 -398799
37234 -398799 -268266 -152248 -172375 -290721 -343763 -256093 -132565 -89007 -98912 -101520 -155082
37223 -155082 -333792 -537401 -577953 -446241 -331966 -360666 -455925 -498720 -487322 -478062 -475978
37212d75978K3326N5469R2258J16067O3841o2296j17074N726J72982J71454K8870
37201G4645k6103P9267J66401J14000L7870N2786N5955p7787k27239j64631R5776
37190A80940K90530K45312M6193j47412k83231l38740k30925M9015L02841K96162
37180D10685M8710j80560k06562r3889J83K4072J1817j5693l6106j220P7380R9684
37168A38501L1892p632N4432P2505j02066l14560k74879j6761J06233m6960j82064
37157e41359m3422J73126J48301l3250k9557J86574K75924P3628j63151j64066
37147a17252j5280N8954O0060J28587K33260J99626N507j75698k39320k62785
37137a24341l01860k51322k8420K21360K61158P6959q7437m2035J12102J32941
$$ plain form
37212 -475978 -452652 -397183 -304925 -188858 -125017 -187313 -304387 -298661 -125679 45775 74645
37201 74645 48542 127809 294210 408210 446080 498866 554821 477034 249795 85164 180940
37190 180940 471470 716782 762975 615563 332332 -6408 -237333 -188318 114523 410685
37180 410685 459395 278835 72273 -21616 -21433 2639 14456 -1237 -37343 -38563 38817 138501
37168 138501 170393 162761 217193 289698 187632 -126928 -401807 -418568 -312335 -359295 -541359
37157 -541359 -584781 -411655 -263354 -296604 -326161 -139587 136337 209965 46814 -117252
37147 -117252 -132532 -73578 -13518 115069 348329 547955 553462 377764 138444 -124341
37137 -124341 -426201 -677523 -705943 -484583 -223425 -146466 -233903 -275938 -163836 -30895
37127c0895l9533k12606j90084k356J55478J58877O1293j8180m3611o1138q3412
37116c06167m3310J01401K54001K45222L7756j97839k67502j70992o1881k2179
37106d31490J8261J25579K32434K25573R7643n2014j31438j23808p2688l7755
37096a49703m0157l5560J7491O1758l220j45595j91065n8661J00266J11289L8262
37085b94895Q3697K70635L94117L05424R2499p4759j49781j79480j70080r3733
37075A83644J3206O0201J7481m2316m0386J703j6849j42827k80253k77193j10649
37064f34238O9584J22594Q6491R3546J60290J73923Q4020j4415l0115j369l637
37053A06674j7847J5398O5573M2747n8007j38810j34072q1613l7448M218O4069
$$ plain form
37127 -30895 -70428 -283034 -473118 -475474 -319996 -161119 -99826 -118006 -161617 -222755 -306167
37116 -306167 -349477 -248076 5925 251147 288903 91064 -176438 -347430 -409311 -431490
37106 -431490 -413229 -287650 -55216 170357 268000 215986 84548 -39260 -111948 -149703
37096 -149703 -189860 -225420 -207929 -146171 -149391 -294986 -486051 -544712 -444446 -333157 -294895
37085 -294895 -211198 59437 453554 758978 851477 776718 626937 447457 277377 183644
37075 183644 196850 257051 274532 232216 191830 193533 176684 33857 -246396 -523589 -634238
37064 -634238 -564654 -442060 -355569 -262023 -101733 72190 156210 141795 111680 110311 106674
37053 106674 88827 104225 169798 212545 154538 15728 -118344 -199957 -237405 -233187 -169118
37042a69118J13715J17929R7029Q0840L7970n9099j19862j5265J95702K59611
37032E39452N0996k15491k50532q5807J012p6914j12937L994Q0038l1803j19358
37021b17350O7147L40402K76561j41732m42040l06227J9956J29165K93r5693n2103
37010d21621k97o821K0474J10662J49700Q4901K2057L2988K4042q8676j93893
36999b66484j18983J09112K72296K22170L0053j29278j56874p3526L8818R7725
36989B5029O9549J305j8347M3121J22032J34782P1768n325l8718k5829j3586n6770
36977C09011j56571k27073j65420J3126J56777J45988M0959p359L7530O8367K884
36966B18219j09266j68440j41718p2913l0089n4213j10565j03764o428O3519K104
$$ plain form
37042 -169118 -55403 62526 159555 240395 278365 219266 99404 84139 279841 539452
37032 539452 590448 374957 124425 38618 39630 -37284 -150221 -146227 -66189 -97992 -217350
37021 -217350 -150203 190199 466760 325028 -117012 -423239 -403283 -274118 -273825 -369518 -421621
37010 -421621 -421918 -428739 -408265 -297603 -147903 -63002 -40945 -7957 16085 -72591 -266484
36999 -266484 -385467 -276355 -4059 218111 248164 118886 -37988 -111514 -72696 25029
36989 25029 94578 95883 77536 120657 242689 377471 449239 443914 405196 379367 365781 309011
36977 309011 152440 -74633 -240053 -226927 -70150 75838 116797 109438 146968 215335 218219
36966 218219 108953 -59487 -201205 -274118 -304207 -358420 -468985 -572749 -579177 -515658 -513554
36955e13554q4280j1367J58589J50215r3839k54475p2147K61813L73285K12715
36945A26955L5998j6232k8104m1015J4981R3717L0370j48830j83840K1352K01258
36934A06610J08983j06395j25385P2895K08073J08361r8907k13134j95620j27809
36924b62328o0237J9642J16513J76509J20337n4576k13985j97847j9058J29502
36914b45528J19809M9958O8984J24796L6322k01030l42165j91746J22922K80331
36904a77347J38697j12854k04858j12614m1574j12711j96239j24462M8248J37205
36894g58509J14135J26690K31107K81473J47137r4325k57372k41567o6935J76979
36884c41187L51490L42431J92377P6753Q5361J15436L8407j26559k66971l04085
$$ plain form
36955 -513554 -597834 -609201 -450612 -300397 -394236 -648711 -720858 -459045 -85760 126955
36945 126955 162953 146721 118617 77602 92583 186300 216670 67840 -116000 -94648 106610
36934 106610 215593 109198 -16187 56708 264781 373142 274235 61101 -134519 -262328
36924 -262328 -322565 -302923 -186410 -9901 110436 55860 -158125 -355972 -375030 -245528
36914 -245528 -125719 -75761 -6777 118019 154341 -46689 -388854 -580600 -457678 -177347
36904 -177347 -38650 -151504 -356362 -468976 -510550 -623261 -819500 -943962 -895714 -758509
36894 -758509 -644374 -517684 -286577 -5104 142033 47708 -209664 -451231 -518166 -341187
36884 -341187 10303 352734 545111 621864 707225 822661 861068 734509 467538 163453
36874A63453k11953k7669J03168L5206j51941k01871m2418R5974M9148j9117P3337
36863a34683J73938M2509k02051k23624Q158J77072J03028n5157j24656j39803
36853c75269j45569o0598J21373K19588J15240n7676j13045n8635j0718K178J5022
36842c48109J5817j1968j9124L4214J05865J44503J46632Q9225p0599k61117l04600
36831d79261j58304r001j0872o4270K068J49329K01231J19855L6492M3910J03596
36820f5227J41005J17342K7512q0153j17096o9130m1566j04923j72697j37713
36810e02646m4960J282J8512P6838J20528M6178q1379r4750j492J2922j04777
36799e53744j68202l9017J53614K03158J07973L0724N6341J16438J16401L7828
$$ plain form
36874 163453 -48500 -76169 26999 62205 -89736 -291607 -334025 -238051 -188903 -208020 -134683
36863 -134683 39255 81764 -120287 -343911 -335753 -158681 -55653 -110810 -235466 -375269
36853 -375269 -520838 -581436 -460063 -240475 -125235 -182911 -295956 -354591 -365309 -363131 -348109
36842 -348109 -332292 -344260 -363384 -329170 -223305 -78802 67830 157055 86456 -174661 -479261
36831 -479261 -637565 -646566 -657438 -721708 -719640 -570311 -369080 -249225 -212733 -168823 -65227
36820 -65227 75778 193120 220632 140479 23383 -45747 -87313 -192236 -364933 -502646
36810 -502646 -547606 -546324 -527812 -450974 -330446 -284268 -365647 -460397 -461889 -448967 -553744
36799 -553744 -721946 -760963 -607349 -404191 -296218 -265494 -209153 -92715 23686 61514
36789F1514o9739j30207q7886L5691J42644J47618N2510p5997j68533j85735j36718
36778d14838p6803m1002J3656J28136K17887J51529k1764p3138R0229K49437J57053
36767C80382j05641k34518j14308O9823J28645P7912M944q0761j60328j28480
36757a62330N1383K20933K04539M2581r1027j35995j52517j37854l2616R5572
36747i7331Q1565p5136j68537r1655n664p8084k06815j74384K6488K01473K28300
36736c59780J47863J8676j35672k27219j30913J22788L08332K44411J0736j38791
36726a39569n6113J41247J98242K4270j61196q0837J99318K95006K4629k93633
36716A51364k66840J8979J59816M2798o3273j2846J3286r2391j37888j083R7692
$$ plain form
36789 61514 -8225 -138432 -226318 -190627 -47983 99635 152145 76148 -92385 -278120 -414838
36778 -414838 -491641 -532643 -518987 -390851 -172964 -21435 -43199 -116337 -26108 223329 380382
36767 380382 274741 40223 -74085 -4262 124383 202295 207239 126478 -33850 -162330
36757 -162330 -110947 109986 314525 357106 266079 130084 -22433 -160287 -192903 -97331
36747 -97331 -15766 -90902 -259439 -351094 -356758 -434842 -641657 -816041 -789553 -588080 -359780
36736 -359780 -211917 -193241 -328913 -556132 -687045 -564257 -255925 -11514 -778 -139569
36726 -139569 -195682 -54435 143807 168077 6881 -73956 125362 420368 444997 151364
36716 151364 -115476 -96497 63319 106117 42844 29998 43284 -49107 -186995 -188078 -90386
36705i0386m4396k33875j61258J21340L04434K71922J52743K5579j21530j99546
36695B5027r8121N8379L0189j51828k11435p5092J0602r5177j80129k9559K12379
36684e04765K52225O6566j05935j06646M436J11415J69110J62833P9856m0954
36674H8141j14724j02399n1420k5188k7899k1168P896K8085J8709J0233L3079
36663a56655M5722j9314j31702j67660p1291P0714J59649J95028J93503J12823
36653B30817m1422j39648q8782J8552M7277J5566k809n5599j87391k42074n4962
36642e00475K10068K12712o3358k60411j58229N5342J32045R9776Q9120O9038
36632a14372l5436j39381j19350j6234N1973O5050M4280m3134j66905j62746L6930
$$ plain form
36705 -90386 -134782 -368657 -529915 -408575 -104141 167781 320524 346103 224573 25027
36695 25027 -73094 -14715 15474 -136354 -347789 -422881 -412279 -507456 -687585 -717144 -504765
36684 -504765 -252540 -185974 -291909 -398555 -394119 -282704 -113594 49239 129095 88141
36674 88141 -26583 -128982 -180402 -205590 -233489 -254657 -246761 -218676 -199967 -189734 -156655
36663 -156655 -110933 -130247 -261949 -429609 -500900 -430186 -270537 -75509 117994 230817
36653 230817 189395 49747 -39035 -20483 26794 42360 39551 -16048 -203439 -445513 -500475
36642 -500475 -290407 -77695 -141053 -401464 -559693 -504351 -372306 -272530 -183410 -114372
36632 -114372 -149808 -289189 -408539 -424773 -372800 -307750 -263470 -306604 -473509 -636255 -599325
36621e99325K23953J68096m3673j27236M612J68989J97561J10572J8088m043N1038
36610A68632J02494L9638j08944j55402k0479J01782J7033j55067j63635k8513
36600b02461R976r6173j29194K3761J93027K01634R5392k157p4237j38218j46502
36589b65152p6370K760M7388J09634K01190K10771P0972q7774p7204R9492K38889
36578D74596J66020q2329k90959k64413j8297K28297K82898J67283K0459j10382
36568E73173k55272l55994k99414j17586K7428Q1899J36348J93088J28506k6710
36558H5466k2680K20032L78712J39433l11607n05138l29600j36168j73289k32363
36548h87202j8122L58913N11276L09337L9342o608J00277Q9903r2279k17825j16620
$$ plain form
36621 -599325 -375372 -207276 -250949 -378185 -373573 -204584 -7023 103549 121637 117594 168632
36610 168632 271126 310764 201820 46418 25939 127721 144754 -10313 -173948 -202461
36600 -202461 -192485 -288658 -417852 -394091 -201064 570 95962 93805 19568 -118650 -265152
36589 -265152 -341522 -338762 -291374 -181740 19450 230221 301193 213419 136215 235707 474596
36578 474596 640616 558287 267328 2915 -15382 212915 495813 663096 683555 573173
36568 573173 317901 -38093 -337507 -455093 -427665 -345766 -209418 -16330 112176 85466
36558 85466 62786 282818 661530 800963 489356 -15782 -345382 -481550 -654839 -887202
36548 -887202 -905324 -546411 -35135 274202 313544 306936 407213 497116 404837 187012 70392
36537G0392Q5000J50523M0660q8164j25499j07332r5570r3580r7369j13374r7154
36526d71467J6128J79077K31149Q9611j31247k41532j60214M6347K37895K85254
36516H1001J60056k1268j00519m1519O5470J43065J73548J28787q603j50490j79167
36505B50361j31203j39045j75565p1973J54447K40277O7738j25959j07896J0321
36495b8497J7654k3943N5498J59103N9880j65561j97123L0452K19836J60715r839
36484B78175r1171r3489r5863o0592M6300J20087O5139m1868o8954r837N6598
36473A04525Q7350O3467l8850j75601k34670j87865j35299j29142q9434K0088
36463g15431R3205P8076J01313K27952K65433M0653k50373k53504L1926K49245
$$ plain form
36537 70392 155392 305915 346575 258411 132912 25580 -69990 -163570 -260939 -374313 -471467
36526 -471467 -455339 -276262 -45113 44498 -86749 -328281 -488495 -442148 -204253 81001
36516 81001 241057 219789 119270 77751 143221 286286 459834 588621 580018 429528 250361
36505 250361 119158 -19887 -195452 -267425 -112978 127299 195037 69078 -38818 -28497
36495 -28497 -10843 -34786 20712 179815 239695 74134 -122989 -92537 127299 288014 278175
36484 278175 187004 93515 -2348 -62940 -16640 103447 168586 126718 57764 47927 104525
36473 104525 191875 255342 216492 40891 -193779 -381644 -516943 -646085 -735519 -715431
36463 -715431 -622226 -544150 -442837 -214885 50548 91201 -159172 -412676 -380750 -131505
36453a31505K11930J34319K31204L61903K71042l943j99957k03927j36771j04809
36443D29486q6403p9419j54328k87062l09937j43456N1944R1540L3302O2530J73120
36432b18683J71129O379j14408l9049Q5407L5410j42773k00439m9886J30395J65193
36421a71325R1633M5130O3291Q0471M1533m2863j10838q9999K8034J42179J32836
36410B10082P270j12800j46932j12547l1409R5931J94756J34429q3363k68543
36400a13126k63971j28906j5496L6034O8106O5565j0700j01225j02377k5307K2392
36389e69011L055j8449l075J6197K1939L4794L5008k5665j04871p6233Q8398K37026
36377c60887K11972M2221j09445j40923p7645J6019R8984J26289N0777r6513j79537
$$ plain form
36453 -131505 80425 214744 445948 807851 1078893 1074950 874993 671066 534295 429486
36443 429486 343083 263664 109336 -177726 -487663 -631119 -579175 -487635 -454333 -391803 -218683
36432 -218683 -47554 -41175 -155583 -194632 -109225 -73815 -216588 -417027 -466913 -336518 -171325
36421 -171325 -79692 -34562 28729 109200 150733 107870 -2968 -92967 -64933 77246 210082
36410 210082 217352 104552 -42380 -154927 -186336 -90405 104351 238780 155417 -113126
36400 -113126 -377097 -506003 -521499 -485465 -417359 -351794 -362494 -463719 -566096 -591403 -569011
36389 -569011 -565956 -584405 -587480 -571283 -549344 -514550 -479542 -505207 -610078 -686311 -597913 -360887
36377 -360887 -148915 -106694 -216139 -357062 -434707 -418688 -319704 -193415 -142638 -239151 -418688
36366d18688q8461J03068J86247O1298j28251j74697p0596J3056o901k6967L5413
36355e15479Q7801K4469p6893p0818J7574M2073m612L5344K17883L65608K85398
36344D08348J2447k41200l06752j66405P8316K65571K59830P1594j26001j63727
36334I2021n2012M8962J6313j19213k29888k23013j13866Q618P5528Q9392Q2343
36323c24815N8675J5971r286J8529O6466P9984Q2576J30169J72054R5609n2911
36312C33021n8719J36768K53634J4855m08455n38297k00976K35122L42011J57598
36302B66562M2005J36335K20093J04968q1062j21026m2192l8143j46207k08437
36292A32896j50296r8614j47933j75841l2983J82655K17493J4931j80372j21637
$$ plain form
36366 -418688 -507149 -404081 -217834 -156536 -284787 -459484 -530080 -517024 -523925 -550892 -515479
36355 -515479 -427678 -403209 -480102 -550920 -533346 -491273 -495885 -460541 -242658 122950 408348
36344 408348 420795 179595 -127157 -293562 -215246 50325 310155 381749 255748 92021
36334 92021 40009 88971 105284 -13929 -243817 -466830 -580696 -572078 -496550 -407158 -324815
36323 -324815 -266140 -250169 -259455 -240926 -174460 -94476 -11900 118269 290323 385932 333021
36312 333021 274302 411070 664704 679559 271104 -267193 -468169 -233047 108964 266562
36302 266562 308567 444902 664995 769963 688901 567875 525683 487540 341333 132896
36292 132896 -17400 -116014 -263947 -439788 -472771 -290116 -72623 -57692 -238064 -359701
36282c59701J40154L27518K53675J973j92848j92246p3886k2717j17638k44469
36272d80185k30247m1006J80237K58799J48880l5163j28743p8594k397m4324j68081
36261f20824j83852k0321J52031J69978J26830K01793L29376K74983K7641j40627
36251C17008p8031K5050m5789j93302j84422j9151R6626P3327J6900J266m3143
36240c3661j71743k96124k77390q4040J72220L24523K90209J56421Q3223R3569
36230B57207N6881o1238q7092P8263K15301O3408k45292l18144o0452J98680J99635
36219B97157O9161J1039k7749j57623k47535j18632J02194J28364m5376j38734
36209a27734j9023J35515J46591N2884o3820k22846l84052l64879j05540J50367
$$ plain form
36282 -359701 -219547 107971 361646 363619 170771 -21475 -95361 -118078 -235716 -480185
36272 -480185 -710432 -751438 -571201 -312402 -163522 -198685 -327428 -406022 -408419 -452743 -620824
36261 -620824 -804676 -824997 -672966 -502988 -376158 -174365 155011 429994 457635 317008
36251 317008 238977 264027 218238 24936 -159486 -178637 -82011 -8684 8216 9482 -33661
36240 -33661 -205404 -501528 -778918 -862958 -690738 -366215 -76006 80415 163638 257207
36230 257207 314088 252850 165758 244021 459322 522730 277438 -40706 -101158 97522 297157
36219 297157 366318 377357 349608 191985 -55550 -174182 -71988 56376 11000 -127734
36209 -127734 -146757 -11242 135349 188233 124413 -98433 -482485 -847364 -952904 -802537
36199h02537J55265J7254K2696J76755K01070J066j51629k5745K09593K30932
36189C4720K9751r5277K2656K03873J93650j4728k21207k80990k17335j19001
36179d63888k9242N3095J25637J66701J51599P6633k5118r6615r8710l9481M2025
36168a37364J11963J52200J47176Q7479P43l9770J9961J22321J16343o6374k72744
36157B41934k64527k5541J70858Q2690j96834l71357l13823j57590m5142L1698
36147h47634J05902J26275O7599J5503L0174L0347o6191j69622j19361Q8205K92866
36136d45937L63505K97964J61751K7446m6417o5220j06048k04101k76808k42107
36126e35972j47792p7982m667J25599K22058J50732k0466p8450J6378P0934k3024
$$ plain form
36199 -802537 -647272 -630018 -607322 -430567 -229497 -228431 -380060 -405805 -196212 34720
36189 34720 64471 -30806 -8150 195723 389373 374645 153438 -127552 -344887 -463888
36179 -463888 -493130 -440035 -314398 -147697 3902 80535 55417 -41198 -139908 -179389 -137364
36168 -137364 -25401 126799 273975 361454 362197 322427 342388 464709 581052 514678 241934
36157 241934 -22593 -48134 122724 205414 8580 -362777 -676600 -834190 -879332 -847634
36147 -847634 -741732 -615457 -547858 -532355 -502181 -471834 -538025 -707647 -827008 -738803 -445937
36136 -445937 -82432 215532 377283 404729 358312 293092 187044 -17057 -293865 -535972
36126 -535972 -683764 -761746 -766413 -640814 -418756 -268024 -288490 -366940 -350562 -279628 -302652
36115c02652j07899n718K09620L19012K37479O8542n0558o1198L729M6922j380
36104C55899p9024o0262M1730O6457l8103j01081J2013J58169R9267j55989l62902
36093f3826l54146j88117n722J10565J29249N8138k5633l0841L2849O7920L0998
36082b38566r677K2729J10243J59606R5831o0355j90377j85334p8311j3787n3953
36071d41951j00757o9662l1992p1117r3715M9146K95158M02256K61459L1508p6097
36060A54236k8889N3108O0573j8301j14466j48732j14944q1466q0084m9157N1812
36049c16310J47202J58164J26318J05219K9479j39228k37418j04313J05835R8987
36039b6065q8516j19671R3114K23127O1310j32771n8749J40294J49011J7691L9940
$$ plain form
36115 -302652 -410551 -416269 -206649 112363 349842 418384 367826 306628 310357 357279 355899
36104 355899 276875 216613 258343 324800 286697 185616 197629 355798 455065 299076 -63826
36093 -63826 -417972 -606089 -611811 -501246 -371997 -313859 -339492 -370333 -337484 -269564 -238566
36082 -238566 -248243 -225514 -115271 44335 140166 79811 -110566 -295900 -374211 -387998 -441951
36071 -441951 -542708 -612370 -644362 -715479 -809194 -760048 -464890 -62634 198825 230333 154236
36060 154236 125347 178455 239028 220727 106261 -42471 -157415 -238881 -318965 -368122 -316310
36049 -316310 -169108 -10944 115374 220593 250072 110844 -126574 -230887 -125052 -26065
36039 -26065 -114581 -234252 -141138 81989 143299 10528 -48221 92073 241084 258775 298715
36028B98715K04427J85993r7836l05137j73956R1350J31802p2285k39968k14790
36018a91685j29971j50366k22033j65047N7128K70120L10483K24844J57757J03592
36008B64822o2605k95995l37269p9726K02365J92726k1896q4151J15326L06759
35998B00356K43791Q564j51897j19823L3972J51903J02638q9406k10892q8704
35988H0502J52243K26913P7157r3346j80583l00284m64774m43864j37676J66967
35978i16745J65196k7897p9577N9543J51479Q8470J3018K7852N5945L2286J7229
35967d13201O2808J36024K10237K78040K62637Q8959j42332k36388j84455j67516
35957a05187k42615k44771q4472P3001N8388n0586q4560m5209m3311p6649m0042
$$ plain form
36028 298715 503142 689135 591299 286162 112206 203556 335358 263073 23105 -191685
36018 -191685 -321656 -472022 -694055 -859102 -801974 -531854 -221371 3473 161230 264822
36008 264822 202217 -93778 -431047 -510773 -308408 -115682 -137578 -221729 -106403 200356
35998 200356 444147 452711 300814 180991 214963 366866 469504 380098 169206 80502
35988 80502 232745 459658 536815 443469 262886 -37398 -502172 -946036 -1083712 -916745
35978 -916745 -751549 -779446 -859023 -799480 -648001 -559531 -546513 -518661 -462716 -430430 -413201
35967 -413201 -350393 -214369 -4132 273908 536545 625504 483172 246784 62329 -105187
35957 -105187 -347802 -592573 -677045 -604044 -545656 -596242 -680802 -726011 -769322 -845971 -886013
35946h86013R3796K34863K83651J95830J128j71216j74248k9098P4038M0513k81
35935c37037O0713J10007L0806l8174Q3471K52871J59295j73052l47553j32831
35925c31484K26699L61322K23363K9770p9288j42816k23648l10081l54884l21021
35915i22068k00974l2524J32687K81663M00649M02460K15746l9845j20205L5535
35905A53124J98130J35553j07865l07314l20403j61662O9051K20089J56699p6888
35895d1486k50729k22301j21090j31153j97246j22999J09094L04997L20020J89247
35885a63646J8050j05980j15024k5337K7810k9917m8248J39139L88483L79801
35875D65131Q8793j48798j22958k8480j10643k75101k70132q7715O2513Q3897
$$ plain form
35946 -886013 -792217 -557354 -273703 -77873 -76745 -247961 -422209 -451307 -377269 -336756 -337037
35935 -337037 -276324 -166317 -135511 -173685 -90214 162657 321952 148900 -198653 -331484
35925 -331484 -104785 256537 479900 509670 430382 287566 63918 -246163 -601047 -922068
35915 -922068 -1123042 -1155566 -1022879 -741216 -340567 61893 277639 237794 117589 153124
35905 153124 351254 486807 378942 71628 -248775 -410437 -341386 -121297 35402 -41486
35895 -41486 -292215 -514516 -635606 -766759 -964005 -1087004 -977910 -672913 -352893 -163646
35885 -163646 -145596 -251576 -366600 -391937 -364127 -394044 -442292 -303153 85330 465131
35875 465131 553924 405126 282168 253688 143045 -132056 -402188 -489903 -427390 -343493
35865c43493O2328M9601j217p8873q4168J929P0407N3756J7484K3870J7744o2999
35853b73631j37892n9588J63338L12965J95545r9351k58232j03423J77152K52744
35843A69627O0987j39618j34141n113N0876O626l0752k9053m0065n8556l7929
35832a87111k0285q5491j69626j05078J14506K66485J84219p937n6628R1519K33962
35821B58535J64091j04734l64252m00947j66157J77535L60929K19558j39845l98762
35811c94049l15750K2133K83390K53563M7999q9831j07957j26525j61961q7856
35801f76844R6108J87317R2000O241J03079K20301J10631j25785j64688L5721
35791a15919J77157J00493q25M5240J02501q52j56932j69709q6522q5289j46622
$$ plain form
35865 -343493 -281165 -231564 -232781 -311654 -395822 -393893 -323486 -269730 -252246 -228376 -210632 -273631
35853 -273631 -411523 -471111 -307773 5192 200737 101386 -156846 -260269 -83117 169627
35843 169627 230614 90996 -43145 -48258 2618 9244 -21508 -50561 -90626 -149182 -187111
35832 -187111 -207396 -292887 -462513 -567591 -453085 -186600 -2381 -10318 -66946 24573 258535
35821 258535 422626 317892 -46360 -447307 -613464 -435929 -75000 144558 4713 -394049
35811 -394049 -709799 -687666 -404276 -150713 -102714 -192545 -300502 -427027 -588988 -676844
35801 -676844 -580736 -393419 -301419 -295178 -192099 28202 138833 13048 -151640 -115919
35791 -115919 61238 161731 160906 206146 308647 307795 150863 -18846 -105368 -190657 -337279
35780c37279j00841N1605J22844M8724r772O5901J66879J33946n218q3180k1408
35769C2201P1579L0659j64058l34605k90648o7697J00116P7041j7497k4439K2411
35758e64937K5869N3188K03952L26547J55490k48897m87610l48955q5701j1595
35748i82649n9971K7109K45493L44091K17058J8963r8013j30686r1637N0064K29424
35737b30754K71156J13257q3474j37763n6866L1644N6496K7423l1340q3213p6507
35726a99941j3638L2984L3380N7129J50592K35736K17975J23294L0650o1599j82059
35715D24503k58333j91996m2628J4737o5580j34103o7025O7195J24220P1664j1978
35704f9324o0135p0757p3356q9944j05438o6570M7831J63260J87791J47104J41287
$$ plain form
35780 -337279 -438120 -386515 -263671 -214947 -224719 -158818 8061 142007 136789 53609 32201
35769 32201 103780 134439 -29619 -364224 -654872 -722569 -622453 -545412 -562909 -587348 -564937
35758 -564937 -539068 -485880 -281928 44619 200109 -48788 -536398 -885353 -971054 -982649
35748 -982649 -1042620 -1015511 -770018 -425927 -208869 -189906 -287919 -418605 -510242 -460178 -230754
35737 -230754 40402 153659 70185 -67578 -124444 -92800 -36304 -8881 -40221 -123434 -199941
35726 -199941 -213579 -180595 -147215 -90086 60506 296242 514217 637511 668161 606562 424503
35715 424503 166170 -25826 -68454 -53717 -119297 -253400 -320425 -253230 -129010 -57346 -69324
35704 -69324 -129459 -200216 -273572 -363516 -468954 -535524 -487693 -324433 -136642 10462 151749
35693A51749J60936P9151j26935k86050k54147j07977q779K2083O0915J03507
35683b05547Q4690K6500J3938M4039L6805j6106m4619l4058l6941n4036l2104
35672b17439J9226L9218M5253J06334J76497J15425q3163k37472k12654p3327
35662c22102N3088J17561R1840n9733k49954k75719q7852R5837R6328L8033J15298
35651c87375K36699J61879q1324k03955q7409O3689O8041K0442P1976J58135J18288
35640A39086l9842j64985j80285j29988n4516M5640J38927J69122J32059O4127
35630A19345k6976j31129j60300k5228J97280K94097J67625l8922j40203j42332
35620A13257j67561k12975j49702K6429J17370o691j90974k02310p1219l3409
$$ plain form
35693 151749 312685 391836 264901 -21149 -275296 -383273 -392052 -369969 -309054 -205547
35683 -205547 -120857 -94357 -80419 -36380 425 -15681 -60300 -94358 -131299 -185335 -217439
35672 -217439 -198213 -158995 -113742 -7408 169089 284514 201351 -36121 -248775 -322102
35662 -322102 -269014 -151453 -59613 -119346 -369300 -645019 -732871 -637034 -540706 -502673 -387375
35651 -387375 -150676 11203 -70121 -274076 -361485 -297796 -229755 -209313 -137337 20798 139086
35640 139086 99244 -65741 -246026 -376014 -430530 -384890 -245963 -76841 55218 119345
35630 119345 92369 -38760 -199060 -224288 -27008 267089 434714 395792 255589 113257
35620 113257 -54304 -267279 -416981 -390552 -273182 -279873 -470847 -673157 -744376 -777785
35610g77785j42654j64501N8710L29761L47407J14581r3336j07980k1093L2154
35600d24736N0021P6127R2569P9110O4201M6152l0949j48938j71940l1717J31855
35589b68245J36095N872o3932K8312J77896K24189J24517k9215r9802j5467J43983
35578C64203J88731K4033k04296k66269j44409n7246j57973l28431l42728j44082
35568a068467J28103L17544L58487K53913O6579p2065n5369O0276R1277m8829
35558C1449k19888k15384k2596J52813J36041m843n1413Q1437K30942J94077q924
35547C03711j63875j40766l7850j2749p0673j02505n9443J9801J12100K14748
35537F2499K59194J53554o0683k11109j99489j05258m0949j3747P305O52l8941
$$ plain form
35610 -777785 -920439 -1084940 -1026230 -696469 -349062 -234481 -327817 -435797 -456890 -424736
35600 -424736 -374715 -298588 -206019 -126909 -62708 -16556 -47505 -196443 -368383 -400100 -268245
35589 -268245 -132150 -126278 -190210 -161898 15998 240187 364704 335489 235687 220220 364203
35578 364203 552934 576967 372671 106402 -38007 -95253 -253226 -581657 -924385 -1068467
35568 -1068467 -940364 -622820 -264333 -10420 56159 -15906 -71275 -10999 80278 31449
35558 31449 -188439 -403823 -426419 -273606 -137565 -142408 -193821 -112384 118558 312635 303711
35547 303711 139836 -930 -38780 -51529 -122202 -224707 -284150 -264349 -152249 62499
35537 62499 321693 475247 414564 203455 3966 -101292 -142241 -155988 -148683 -148031 -186972
35526a86972l8744L9393J10896J03779Q9570J41121J52221j2337k40517k69674
35516a11264o8623R7110M3431r2257r6091J1753O1604R088l9943k2085R352j0533
35504b08458p6544j32786j19410k5732O6813M7590p7065j70173j45973q1241p5392
35493i98371q7592j3179J40163K57176K61308J74792O7129P999K6041N9689J1534
35482i3311r8533j26621j7630Q9846O9017m148Q188Q9648J44968J79407K24425
35471D65256J86721j5980k40410k65922j13773M628J6630K1834L0210m9869j52065
35460a12740q3632J18764J61453o6476k98440k72639n7721J48052K84241L18892
35450A39754J37893k14649m07163k11117J38379K43036O9009r8443j11142p3024
$$ plain form
35526 -186972 -225716 -186323 -75427 28352 117922 259043 411264 398927 158410 -111264
35516 -111264 -179887 -82777 -39346 -131603 -227694 -215941 -154337 -145249 -185192 -207277 -197925 -208458
35504 -208458 -285002 -417788 -537198 -562930 -496117 -448527 -525592 -695765 -841738 -922979 -998371
35493 -998371 -1085963 -1099142 -958979 -701803 -440495 -265703 -198574 -190575 -164534 -104845 -93311
35482 -93311 -191844 -318465 -336095 -246249 -177232 -181380 -173192 -83544 61424 240831 465256
35471 465256 651977 635997 395587 129665 15892 20520 37150 58984 89194 39325 -112740
35460 -112740 -196372 -77608 83845 17369 -281071 -553710 -611431 -463379 -179138 139754
35450 139754 277647 62998 -344165 -555282 -416903 -173867 -104858 -203301 -314443 -387467
35440c87467o7941o2042n3772p0836m5533P1328J26115l8346k47200j74279J43769
35429h06204L15853J72951j6249k4316m519j40583k64911j21696J90539L47019
35419c52116K56603J16591P0721O8626M6427J5183m7856j95295l53958l42403
35409g17477j10414J63216K75911K10089Q5120r881o5180q9671p7615l0709K5685
35398c40926N9724O4467O8658J00330J35996J14386J5123j04801j68390j46503
35388b01936o8933j0985n8356k09573l14820k17678K2705J80415J75105J70084
35378e33972K67010K97582J04185j38104j44878K6970N6072j35306k69809j68385
35368f38635j288M2358M5374J31217J93152R8206l4380k5159M8968J1900o6508
$$ plain form
35440 -387467 -455408 -517450 -571222 -642058 -687591 -616263 -490148 -528494 -775694 -949973 -806204
35429 -806204 -490351 -317400 -333649 -357965 -362484 -503067 -767978 -889674 -699135 -352116
35419 -352116 -95513 21078 91799 160425 206852 222035 174179 -21116 -375074 -717477
35409 -717477 -827891 -664675 -388764 -178675 -93555 -103436 -168616 -258287 -335902 -366611 -340926
35398 -340926 -281202 -216735 -148077 -47747 88249 202635 217758 112957 -55433 -201936
35388 -201936 -270869 -281854 -340210 -549783 -864603 -1082281 -1059576 -879161 -704056 -533972
35378 -533972 -266962 30620 134805 -3299 -148177 -121207 -65135 -200441 -470250 -638635
35368 -638635 -639923 -597565 -552191 -420974 -227822 -129616 -163996 -189155 -140187 -128287 -194795
35357a94795K849J47023J27879j4850J498J89759K14495n0127k72261j83964j737
35346c4231l8500j87418j42221Q1131K20587K21123K23351J91944l0408l17693
35336A87665l32011o4203R5442m9429k15103j30176L9803K3655r0040m2866J31802
35325d45461J70886M346j78458k30584j63724q187K02852L36111K71388J01775
35315F0944K0420L4387L296p1454m9733N4277N8227n9240r6370N677K0676j69082
35303a87975l04072j28223J61925J70618r2495k10114J8516K80136K15659o7499
35293a43524j78805j585J90147J51014l1553j23835o1217M9129J29329J81259
35283A60359J85142J03943m873j7512P9157J49841R5867k3547j07766j48284j71616
$$ plain form
35357 -194795 -191946 -44923 82956 68106 69604 259363 473858 423731 151470 -32494 -34231
35346 -34231 -72731 -260149 -402370 -321239 -100652 120471 343822 535766 505358 187665
35336 187665 -144346 -208549 -113107 -162536 -377639 -507815 -468012 -444357 -534397 -577263 -445461
35325 -445461 -274575 -270229 -448687 -679271 -842995 -851182 -648330 -312219 -40831 60944
35315 60944 81364 115751 119047 47593 -2140 52137 110364 51124 -45246 -39569 -18893 -187975
35303 -187975 -492047 -620270 -458345 -287727 -380222 -590336 -571820 -291684 -76025 -143524
35293 -143524 -322329 -323914 -133767 17247 -14306 -138141 -199358 -150229 -20900 160359
35283 160359 345501 449444 444571 427059 506216 656057 751924 728377 620611 472327 300711
35272C00711j45967m7329M7347M1275l8768o6589L0326J94227K89818K12126q3
35261H17094j48587p7426Q8955O3660j88916l57420k29985j9434k3940j52940
35251b28939r7030J44698K60901J30670k1282k6201K309m2372m7911O4167J26513
35240B65523j2922j99047j72765M1450J66454M4503j92829l12778k15302J7953
35230e69760K21443K81817K09403P9329n9298j57487j18281Q4636K74011K30296
35220D76109j3026k13889k59811k49800k30135j14463O6135J13419j5925j02307
35210e43693k0879O1983K1489J7518J76399L07052K19643P5534Q9270J11430r7720
35199D18026l56804k79025Q3908K74332J07701j18822j56948j20683j37110p8225
$$ plain form
35272 300711 154744 107415 154762 196037 157269 90680 121006 315233 605051 817177 817094
35261 817094 668507 591081 680036 743696 554780 197360 -32625 -52059 -75999 -228939
35251 -228939 -325969 -181271 79630 210300 189018 162817 165126 122754 74843 139010 265523
35240 265523 252601 53554 -119211 -77761 88693 133196 -59633 -372411 -587713 -569760
35230 -569760 -348317 -66500 142903 222232 162934 5447 -112834 -28198 245813 476109
35220 476109 463083 249194 -10617 -260417 -490552 -605015 -538880 -425461 -441386 -543693
35210 -543693 -564572 -502589 -481100 -463582 -287183 19869 239512 315046 404316 515746 418026
35199 418026 61222 -217803 -133895 140437 248138 129316 -27632 -148315 -285425 -363650
35189c63650J41146L03323J81006j03095k29162o9455K26955M23821L62944O5485
35179I39318k39212l09425j75751q3189j18047j10760J7915P8980n8588k06654
35169b65413j44911K4778O8742K0651R5146K72662K81230K4909k36887k45791
35159a04884q4041r221p4104r3615L6206J66114J21564j7699k3754J24607J85434
35148B26607J7983j82939j68243j40P4732J2595k3001R489j6182j03463r6997
35137b49559j300l2949k31633l11716q7428K09779K64653J12482j1382o7888j64284
35126e71225k37132j11556J58076L00241K04469M7707k552k008o9601j75267j89738
35115f48586o8076Q7231J31091M2671j7064J07672L05482K72623o1055l56369
$$ plain form
35189 -363650 -222504 80819 261825 158730 -70432 -139887 87068 510889 873833 939318
35179 939318 700106 390681 214930 131741 13694 -97066 -79151 -171 -58759 -265413
35169 -265413 -410324 -385546 -316804 -296153 -201007 71655 352885 377794 140907 -104884
35159 -104884 -188925 -198146 -272250 -365865 -329659 -163545 -41981 -59680 -83434 41173 226607
35148 226607 244590 61651 -106592 -106732 -32000 -19405 -42406 -32917 -49099 -152562 -249559
35137 -249559 -250859 -283808 -515441 -827157 -914585 -704806 -440153 -327671 -339053 -406941 -571225
35126 -571225 -808357 -919913 -761837 -461596 -257127 -209420 -211972 -213980 -283581 -458848 -648586
35115 -648586 -716662 -629431 -498340 -455669 -472733 -365061 -59579 213044 151989 -204380
35105b04380k87206J3066J60012O1739k8537M0174J21472O8985l9253p3522m0609
35094b08059P359P9981J59630J55233M8906m0713l7740k7021r3314j64300j34702
35083b54740n0103l2716q1488p6035L4611J50450J46828K5972q4750p4159L2888
35072b63242J22726J49540J67481J77847O8984j79565l50178k32409N0419J80637
35062a07760Q9161J1574P9940J38531O7430J4797J20082K29083J26365r9002j78232
35051D91969o9809Q853o9746j88110j95465r2563K8924R1494N2485o2205j38576
35040a42749j00060l6357p8738j76154j63787m3460J0333m2551k3918J42375K53084
35029d01982J41431k0520K5842J99173J91544l7900j98048j46717j16270k83586
$$ plain form
35105 -204380 -491586 -478520 -318508 -256769 -285306 -245132 -123660 -54675 -93928 -167450 -208059
35094 -208059 -200700 -120719 38911 194144 243050 202337 164597 137576 44262 -120038 -254740
35083 -254740 -304843 -337559 -419047 -495082 -460471 -310021 -163193 -137221 -221971 -296130 -263242
35072 -263242 -140516 9024 176505 354352 423336 243771 -106407 -338816 -288397 -107760
35062 -107760 -18599 -7025 72915 211446 278876 293673 413755 642838 769203 670201 491969
35051 491969 422160 431013 361267 173157 -22308 -114871 -85947 5547 58032 -4173 -142749
35040 -142749 -242809 -279166 -357904 -534058 -697845 -741305 -730972 -773523 -797441 -655066 -401982
35029 -401982 -260551 -281071 -255229 -56056 135488 97588 -100460 -247177 -363447 -647033
35019f47033l87165p7861M83621P28925M00246j31158l62967k28956j6056P0136
35009a68268L3870p5664j99381j94034K7980K84341K82534L2143j31546j5794
34999a23819J64551J29348o1353j46472o5352K1255M2295R4672J96969J95846
34989D47940P366k13449k61005j34601M588O3277Q9667J44412K01854J99079J19391
34978F68519k775j21729j90386j55697n184J61552J70849l5700k70945k70197
34968e1693k1268J83178R9521j59567k89592j88759k7812M0998N5629R2095J21291
34957a45979J07006J01000J24284P4543j05147k58034j87578M1105J51434J7699
34947g9667j79924k04322l1196J87780L11130K79931J08502r8321j90859j33372
$$ plain form
35019 -647033 -1034198 -1112059 -628438 100487 500733 369575 6608 -222348 -238404 -168268
35009 -168268 -134398 -210062 -409443 -603477 -575497 -291156 -8622 23521 -108025 -123819
34999 -123819 40732 170080 108727 -37745 -103097 -81842 -39547 55125 252094 447940
34989 447940 455306 241857 -19148 -153749 -149161 -85884 3783 148195 350049 549128 668519
34978 668519 665744 544015 353629 197932 192748 354300 525149 489449 218504 -51693
34968 -51693 -72961 110217 209738 50171 -239421 -428180 -455992 -414994 -359365 -267270 -145979
34957 -145979 -38973 62027 186311 260854 155707 -102327 -289905 -248800 -97366 -79667
34947 -79667 -259591 -463913 -495109 -307329 3801 283732 392234 293913 103054 -30318
34937c0318n8632p3844q6655M2571K27462K17813l9231k75229k33510L956J56126
34926a49491J22858N5203O4582M9430j05583k91351k82958m7783J93047K31193
34916a60853Q6716q8427k10975k74938k46971j00558P0922J29518R6104J21046
34906e78416K10238J70361n9360k15112n8156K22881K39476k3951j84482m7441
34896c23962J14957K6775j48402r3778J36419K10232M8868p5031O435J10863L4141
34885D7517j19473j22530J0579N5242p5399k00969j26508R7147K37118J52153
34875d5123o2829k00072j54501R956J68662K46074K21783J08552l2919j15120
34865A44463j10749p4900m3937J7252J08315J22371j0109j70268j78315m3784
$$ plain form
34937 -30318 -88950 -162794 -249449 -206878 20584 238397 199166 -76063 -309573 -305617 -149491
34926 -149491 -26633 28570 93152 142582 36999 -254352 -537310 -585093 -392046 -160853
34916 -160853 -74137 -162564 -373539 -648477 -895448 -996006 -925084 -795566 -699462 -578416
34906 -578416 -368178 -197817 -257177 -472289 -530445 -307564 -68088 -92039 -276521 -323962
34896 -323962 -209005 -182230 -330632 -424410 -287991 -77759 -28891 -103922 -97487 13376 47517
34885 47517 -71956 -194486 -183907 -128665 -204064 -405033 -531541 -434394 -197276 -45123
34875 -45123 -107952 -308024 -462525 -452569 -283907 -37833 183950 292502 259583 144463
34865 144463 33714 -41186 -85123 -67871 40444 162815 152706 -17562 -195877 -239661
34855b39661M8246m162j12173j63856j62538j50978j17010m4965K4340N3164O6285
34844h03308R7143J24606J08429M9277j8088o1415o7981n2016l6085N98J07945
34833e50895K47545K69743J14549m3638r720J33491J44055J1914k0857J27125
34823D23312K13524N2344j77085j92296p472J38950J36732P0781J1671n1173r4843
34812E24445o4177Q211K1957m6977j29586j75824j81559j30659j9537P9011P8445
34801c6250r007j04487j71590k05694j66315l4403R7646J10842J5451p9981j25533
34790g09321j45528j27736k4883J35100K51162K68148K08599J02058k2352r0756
34780a55509l8585Q6434J59204J15872k43j01011j03579K2258J80177J95167K8789
$$ plain form
34855 -239661 -191415 -195577 -307750 -471606 -634144 -785122 -902132 -947097 -922757 -869593 -803308
34844 -803308 -706165 -581559 -473130 -423853 -441941 -503356 -571337 -623353 -659438 -658840 -550895
34833 -550895 -303350 -33607 80942 37304 27584 161075 305130 317044 296187 423312
34823 423312 636836 689180 512095 319799 312327 451277 588009 658790 670461 619288 524445
34812 524445 460268 468479 490436 443459 313873 138049 -43510 -174169 -193706 -114695 -36250
34801 -36250 -45257 -149744 -321334 -527028 -693343 -727746 -630100 -519258 -503807 -583788 -709321
34790 -709321 -854849 -982585 -1007468 -872368 -621206 -353058 -144459 -42401 -64753 -155509
34780 -155509 -194094 -107660 51544 167416 167173 66162 -37417 -15159 165018 360185 388974
34769C88974j40494j61116j19510j56660j99256r2949Q6323J18153l13n3574K2965
34758c07457N5146l6504r9405m8778l5909j61576k56101j42283O5050J37460P8611
34747g51746P0705J56914J96030J14458J4280l857R057n4547j73989j84614K1512
34736e85797L02133L66824J36320j06618o9991J34562J56343n5344j68507J0662
34726A20587K26908J50087j66797m04619l92297k12014j6637Q0752L9303l7064
$$ plain form
34769 388974 248480 87364 -32146 -188806 -388062 -481011 -394688 -276535 -276848 -330422 -307457
34758 -307457 -252311 -288815 -388220 -436998 -472907 -634483 -890584 -1032867 -967817 -830357 -751746
34747 -751746 -681041 -524127 -328097 -213639 -199359 -203216 -194159 -248706 -422695 -607309 -585797
34736 -585797 -283664 83160 219480 112862 42871 177433 333776 278432 109925 120587
34726 120587 347495 497582 330785 -73834 -466131 -678145 -694782 -614030 -574727 -611791
$$ [...]
##END NTUPLES=NMR SPECTRUM
##END=
