##TITLE=31P_DE-80H_X3
 64 sc D2O
 26.2.2025
##JCAMPDX= 6.0         $$ Bruker NMR JCAMP-DX V2.0
##DATA TYPE= NMR FID
##DATA CLASS= NTUPLES
##ORIGIN= UXNMR, Bruker Analytische Messtechnik GmbH
##OWNER= root
$$ XWIN-NMR		Version 3.5
$$ Thu Feb  5 10:28:19 2026 Russian Standard Time (UT+4h)  Yarkov@DPX200
##.OBSERVE FREQUENCY= 81.013821
##.OBSERVE NUCLEUS= ^31P
##.DELAY= (6, 6)
##.ACQUISITION MODE= SIMULTANEOUS
##.ACQUISITION SCHEME= undefined
##.AVERAGES= 64
##.DIGITISER RES= 17
##SPECTROMETER/DATA SYSTEM= spect
##.PULSE SEQUENCE= zgpg30
##.SOLVENT NAME= CDCl3
##.SHIFT REFERENCE= (INTERNAL, CDCl3, 0, 243.863)
##AUDIT TRAIL= $$ (NUMBER, WHEN, WHO, WHERE, WHAT)
$$ ##TITLE= Audit trail, XWIN-NMR		Version 3.5
$$ ##JCAMPDX= 5.01
$$ ##ORIGIN= Bruker BioSpin GmbH
$$ ##OWNER= Yarkov
$$ C:/Bruker/XWIN-NMR/data/yarkov2/nmr/P31/2/audita.txt
$$ ##AUDIT TRAIL=  $$ (NUMBER, WHEN, WHO, WHERE, WHAT)
(   1,<2026-02-05 10:27:34.92 +0400>,<Yarkov>,<DPX200>,
      <created by zg, POWCHK disabled, PULCHK disabled
       configuration hash MD5:
       00 E9 B6 7A A2 85 ED C7 34 08 36 98 17 FE 4E 26
       data hash MD5: 32K
       1F CA 30 02 0D 4D E6 C5 C0 7E 46 DB 69 F7 5A BD>)
$$ ##END=
$$ 
$$ hash MD5
$$ AF 4C C6 DA F3 30 E7 1F FD 53 51 E7 EB 2D A6 9A
##$RELAX= 
##$RELAX= 
##$RELAX= 
##$RELAX= 
##$RELAX= 
##$RELAX= 
##$RELAX= 
##$RELAX= 
$$ Bruker specific parameters
$$ --------------------------
##$DU= <C:/Bruker/XWIN-NMR>
##$EXPNO= 2
##$NAME= <P31>
##$PROCNO= 1
##$TYPE= <nmr>
##$USER= <yarkov2>
##$AMP= (0..31)
100 100 100 100 100 100 100 100 100 100 100 100 100 100 100 100 100 100 
100 100 100 100 100 100 100 100 100 100 100 100 100 100 
##$AQSEQ= 0
##$AQ_mod= 1
##$AUNM= <au_zg>
##$AUTOPOS= <>
##$BF1= 81.014009
##$BF2= 200.13
##$BF3= 200.13
##$BF4= 200.13
##$BF5= 200.13
##$BF6= 200.13
##$BF7= 200.13
##$BF8= 200.13
##$BYTORDA= 1
##$CFDGTYP= 0
##$CFRGTYP= 5
##$CHEMSTR= <none>
##$CNST= (0..31)
1 1 145 1 1 1 1 1 1 1 1 1 1 1 1 1 1 1 1 1 1 1 1 1 1 1 1 1 1 1 1 1 
##$CPDPRG= <waltz16>
##$CPDPRG1= <>
##$CPDPRG2= <waltz16>
##$CPDPRG3= <>
##$CPDPRG4= <mlev>
##$CPDPRG5= <mlev>
##$CPDPRG6= <mlev>
##$CPDPRG7= <mlev>
##$CPDPRG8= <mlev>
##$CPDPRGB= <>
##$CPDPRGT= <>
##$D= (0..31)
0 1 0 0 0 0 0 0 0 0.06 0 0.03 2e-05 3e-06 0 0 0.0002 0 0 0 0 0 0 0 0 0 
0 0 0 0 0 0 
##$DATE= 1770272854
##$DBL= (0..7)
120 120 120 11 120 120 24 19 
##$DBP= (0..7)
150 150 150 150 150 150 150 150 
##$DBP07= 0
##$DBPNAM0= <>
##$DBPNAM1= <>
##$DBPNAM2= <>
##$DBPNAM3= <>
##$DBPNAM4= <>
##$DBPNAM5= <>
##$DBPNAM6= <>
##$DBPNAM7= <>
##$DBPOAL= (0..7)
0.5 0.5 0.5 0.5 0.5 0.5 0.5 0.5 
##$DBPOFFS= (0..7)
0 0 0 0 0 0 0 0 
##$DE= 6
##$DECBNUC= <off>
##$DECIM= 4
##$DECNUC= <off>
##$DECSTAT= 4
##$DIGMOD= 1
##$DIGTYP= 9
##$DL= (0..7)
0 0 52 120 120 21 21 25 
##$DP= (0..7)
150 150 150 150 150 150 150 150 
##$DP07= 0
##$DPNAME0= <>
##$DPNAME1= <>
##$DPNAME2= <>
##$DPNAME3= <>
##$DPNAME4= <>
##$DPNAME5= <>
##$DPNAME6= <>
##$DPNAME7= <>
##$DPOAL= (0..7)
0.5 0.5 0.5 0.5 0.5 0.5 0.5 0.5 
##$DPOFFS= (0..7)
0 0 0 0 0 0 0 0 
$$ [...]
##$SUBNAM1= <"">
##$SUBNAM2= <"">
##$SUBNAM3= <"">
##$SUBNAM4= <"">
##$SUBNAM5= <"">
##$SUBNAM6= <"">
##$SUBNAM7= <"">
##$SUBNAM8= <"">
##$SUBNAM9= <"">
##$SW= 400.765351723535
##$SWIBOX= (0..15)
0 1 3 0 0 0 0 0 0 0 0 0 0 0 0 0 
##$SW_h= 32467.5324675325
##$TD= 32768
##$TD0= 1
##$TE= 0
##$TE2= 300
##$TE3= 300
##$TEG= 300
##$TL= (0..7)
0 120 53 12 22 120 120 120 
##$TP= (0..7)
150 150 150 150 150 150 150 150 
##$TP07= 0
##$TPNAME0= <>
##$TPNAME1= <>
##$TPNAME2= <>
##$TPNAME3= <>
##$TPNAME4= <>
##$TPNAME5= <>
##$TPNAME6= <>
##$TPNAME7= <>
##$TPOAL= (0..7)
0.5 0.5 0.5 0.5 0.5 0.5 0.5 0.5 
##$TPOFFS= (0..7)
0 0 0 0 0 0 0 0 
##$TUNHIN= 0
##$TUNHOUT= 0
##$TUNXOUT= 0
##$USERA1= <user>
##$USERA2= <user>
##$USERA3= <user>
##$USERA4= <user>
##$USERA5= <user>
##$V9= 5
##$VALIST= <valist>
##$VCLIST= <CCCCCCCCCCCCCCC>
##$VD= 0
##$VDLIST= <DDDDDDDDDDDDDDD>
##$VPLIST= <PPPPPPPPPPPPPPP>
##$VTLIST= <TTTTTTTTTTTTTTT>
##$WBST= 1024
##$WBSW= 4
##$XGAIN= (0..3)
0 0 0 0 
##$XL= 0
##$YL= 0
##$YMAX_a= 648
##$YMIN_a= -1026
##$ZGOPTNS= <>
##$ZL1= 120
##$ZL2= 120
##$ZL3= 120
##$ZL4= 120
##$ABSF1= 60
##$ABSF2= -190
##$ABSG= 5
##$ABSL= 3
##$ALPHA= 0
##$AQORDER= 0
##$ASSFAC= 0
##$ASSFACI= 0
##$ASSFACX= 0
##$ASSWID= 0
##$AUNMP= <proc_1d>
##$AZFE= 0.1
##$AZFW= 0.5
##$BCFW= 1
##$BC_mod= 2
##$BYTORDP= 1
##$COROFFS= 0
##$CY= 9.86611175537109
##$DATMOD= 1
##$DC= 1
##$DFILT= <>
##$DTYPP= 0
##$F1P= 182.462994727601
##$F2P= 168.069089081705
##$FCOR= 0.5
##$FTSIZE= 0
##$FT_mod= 0
##$GAMMA= 1
##$GB= 0
##$INTBC= 1
##$INTSCL= 1
##$ISEN= 30
##$LB= 1.5
##$LEV0= 0
##$LPBIN= 0
##$MAXI= 11.51145
##$MC2= 0
##$MEAN= 0
##$ME_mod= 0
##$MI= 1.244541
##$NCOEF= 0
##$NC_proc= 0
##$NLEV= 6
##$NOISF1= 0
##$NOISF2= 0
##$NSP= 1
##$NTH_PI= 0
##$NZP= 1
##$OFFSET= 243.8632
##$PC= 1.4
##$PHC0= 1707.609
##$PHC1= -1.240479
##$PH_mod= 0
##$PKNL= yes
##$PPARMOD= 0
##$PSCAL= 0
##$PSIGN= 0
##$REVERSE= no
##$SF= 81.0140731611343
##$SI= 65536
##$SIGF1= 0
##$SIGF2= 0
##$SINO= 80
##$SIOLD= 65536
##$SREGLST= <31P.CDCl3>
##$SSB= 0
##$STSI= 0
##$STSR= 0
##$SW_p= 25641.0256410257
##$SYMM= 0
##$S_DEV= 0
##$TDeff= 0
##$TDoff= 0
##$TI= <>
##$TILT= no
##$TM1= 0
##$TM2= 0
##$TOPLEV= 0
##$USERP1= <user>
##$USERP2= <user>
##$USERP3= <user>
##$USERP4= <user>
##$USERP5= <user>
##$WDW= 1
##$XDIM= 64
##$YMAX_p= 0
##$YMIN_p= 0
$$ End of Bruker specific parameters
$$ ---------------------------------
##NTUPLES= NMR FID
##VAR_NAME=  TIME,          FID/REAL,        FID/IMAG
##SYMBOL=    X,             R,               I
##VAR_TYPE=  INDEPENDENT,   DEPENDENT,       DEPENDENT
##VAR_FORM=  AFFN,          ASDF,            ASDF
##VAR_DIM=   16384,         16384,           16384
##UNITS=     SECONDS,       ARBITRARY UNITS, ARBITRARY UNITS
##FACTOR=    3.08e-05,      1,               1
##FIRST=     0,             0,               0
##LAST=      0.5045964,     0,               0
##MIN=       0,             -1026,           0
##MAX=       0.5045964,     648,             0
$$ Real data points
##PAGE= N=1
##DATA TABLE= (X++(R..R)), XYDATA
$$ plain form
0 0 0 0 0 0 0 0 0 0 0 0 0 0 0 0 0 0 0 0 0 0 0 0 0 0 0 0 0 0 0 0 0 0 0 0 0 0 0 0 0 0 0 0 0 0 0 0 0 0 0 0 0 0 1 -1 2 -2 4 -5 5 -11 12
61 12 -12 14 -22 33 -67 -1026 648 355 387 248 161 75 -68 -99 -224 -227 -315 -355 -354 -368 -344 -337 -312 -279 -271 -221 -190 -171 -176 -150
91 -150 -98 -115 -45 -27 1 36 90 105 173 248 328 367 451 478 519 522 470 478 397 308 220 118 -1 -67 -175 -258 -287 -358 -394 -475
121 -475 -437 -463 -423 -376 -393 -354 -277 -190 -112 -102 -69 -50 -34 -18 50 42 89 140 155 195 201 241 300 287 301 318 321 283 312 270 240 192
153 192 112 44 -50 -117 -202 -381 -334 -445 -467 -549 -471 -509 -464 -441 -378 -278 -275 -189 -114 -44 18 91 83 164 158 207 188 234 229 227 257
184 257 224 233 229 250 279 208 199 215 178 141 105 53 -23 -86 -117 -235 -282 -358 -371 -418 -455 -438 -432 -388 -389 -301 -262 -145 -112 4 112
215 112 164 158 237 331 288 338 348 324 327 295 287 255 226 192 170 193 163 140 70 79 71 36 -26 -64 -118 -168 -210 -268 -287 -336 -377 -321 -342
248 -342 -354 -340 -291 -199 -160 -56 -19 40 162 189 302 285 354 399 384 394 359 403 330 286 237 179 161 85 94 25 -10 -32 -23 -68
$$ packed form
0@%%%%%%%%%%%%%%%%%%%%%%%%%%%%%%%%%%%%%%%%%%%%%%%%%%%%JkLmOrJ0j6K3
61A2k4K6l6N5j00r59J674k93L2j39q7q6j43l1j25lq8m0Jj4K4PK5L3QN0L1J9nK6
91a50N2j7P0J8K8L5N4J5O8P5Q0L9Q4K7M1Ln2Qq1q9q8j02j19o6j08q3k9p1l6q1
121d75L8k6M0M7j7L9P7Q7P8J0L3J9J6J6O8qM7N1J5M0OM0N9j3J4J7Ll8K9m2l0m8
153A92q0o8r4o7q5j79M7j11k2q2P8l8M5K3O3J00LQ6P5P0O2P3qQ1oM9j9M6nkL0
184B57l3RmK1K9p1rJ6l7l7l6n2p6o3l1j18m7p6j3m7l7J7OM4jQ8L9J17L3J16J08
215A12N2oP9R4m3N0J0k4Ll2ql2k9l4k2K3l0k3p0Rql5o2l8n4n0m2n8j9m9m1N6k1
248c42j2J4M9R2L9J04L7N9J22K7J13j7O9M5j5J0l5M4p3m4m9n8j8p6Ro9l5k2Rm5
$$ plain form
278 -68 -85 -131 -161 -204 -224 -242 -264 -274 -328 -326 -293 -304 -304 -257 -197 -155 -96 -69 -18 101 170 193 361 328 361 400 410 387 336 340 288
309 288 245 159 132 76 -12 -33 -66 -87 -205 -189 -201 -322 -228 -275 -266 -284 -280 -285 -296 -312 -349 -238 -194 -205 -214 -96 -83 -38 2 38
339 38 119 197 262 272 348 380 354 387 374 344 283 252 149 177 106 -32 -105 -142 -153 -191 -222 -287 -318 -308 -326 -270 -320 -248 -261 -212
369 -212 -210 -138 -163 -146 -78 -68 -9 20 32 105 142 172 205 206 245 306 326 290 369 353 322 251 293 200 125 114 13 -77 -121 -130 -175
400 -175 -270 -199 -337 -268 -279 -256 -267 -285 -255 -204 -172 -149 -142 -25 -24 -25 72 58 102 112 151 182 214 198 211 240 259 292 297 263 281
431 281 257 174 214 121 70 47 -13 -73 -148 -174 -236 -277 -287 -390 -313 -324 -297 -256 -247 -202 -141 -154 -90 -41 10 9 82 70 137 151 184
462 184 203 195 192 227 155 194 181 190 180 163 222 151 79 71 15 -37 -80 -47 -162 -171 -228 -300 -332 -305 -265 -342 -317 -313 -266 -252 -190 -132 -129
495 -129 -10 32 37 84 135 184 163 189 198 253 163 194 219 161 196 169 150 77 110 94 22 -19 -55 -53 -80 -101 -199 -204 -238 -204 -260 -296
$$ packed form
278f8j7m6l0m3k0j8k2j0n4KL3j1%M7O0M2N9K7N1J19O9K3J68l3L3L9J0k3n1Mn2
309B88m3q6k7n6q8k1l3k1j18J6j2j21R4m7Rj8Mnj1j6l7J11M4j1rJ18J3M5M0L6
339C8Q1P8O5J0P6L2k6L3j3l0o1l1j03K8p1j38p3l7j1l8l1o5l1J0j8N6n0P2j3M9
369b12KP2k5J7O8J0N9K9J2P3L7L0L3JL9O1K0l6P9j6l1p1M2r3p5j1j01r0m4rm5
400a75r5P1j38O9j1K3j1j8L0N1L2K3PJ17JjR7j4M4J0L9L1L2j6J3K9J9L3Nl4J8
431B81k4q3M0r3n1k3o0o0p5k6o2m1j0j03P7j1K7M1RM5O1j3O4M9N1jP3j2O7J4L3
462A84J9qlL5p2L9j3Rj0j7N9p1p2qn6n2m3L3j15rn7p2l2K7M0p7K5MM7J4O2N8L
495a29J19M2NM7N1M9k1K6RN5r0L1K5n8L5k7j9p3L3j6p2m1l6Kk7k1r8nl4L4n6l6
$$ plain form
527 -296 -268 -323 -292 -287 -220 -196 -183 -134 -32 -25 28 44 105 157 184 164 265 232 261 280 202 274 173 202 179 108 80 18 -8 -45
557 -45 -69 -34 -83 -88 -138 -190 -190 -183 -235 -219 -244 -267 -238 -228 -226 -149 -141 -126 -82 -40 14 49 103 183 157 216 255 267 253 272 259 252 231 205
591 205 192 122 114 81 47 23 -44 -47 -156 -143 -145 -174 -153 -169 -188 -201 -184 -230 -204 -121 -144 -151 -96 -96 -27 -11 21 10 49 106 156 144
623 144 213 190 215 275 306 262 272 220 160 178 109 104 43 22 -17 -37 -147 -155 -154 -156 -205 -212 -206 -203 -214 -180 -202 -154 -189 -149 -91 -119 -59
656 -59 -67 -29 -15 23 86 83 123 104 164 233 184 274 218 232 233 198 170 133 95 61 2 -3 -44 -91 -153 -150 -174 -245 -222 -175 -274 -200 -164
689 -164 -234 -170 -175 -148 -125 -85 -51 -43 -20 -39 48 34 120 133 151 158 182 183 216 188 225 171 221 183 163 109 133 46 42 14 -58 -103 -166
722 -166 -97 -164 -243 -234 -229 -242 -214 -190 -135 -198 -104 -135 -137 -39 7 26 8 62 91 93 161 141 225 169 197 210 191 216 202 154 173 179 149
755 149 96 98 80 4 26 -3 -59 -119 -134 -129 -167 -233 -251 -230 -212 -207 -166 -176 -132 -92 -49 -97 36 33 76 64 122 147 118 155 161 175
$$ packed form
527b96K8n5L1NO7K4J3M9J02PN3J6O1N2K7k0J01l3K9J9p8P2j01K9k3p1k8o2k6l7
557d5k4L5m9nn0n2%Pn2J6k5k3K9J0KP7QJ5M4M2N4L5N4Q0k6N9L9J2j4J9j3pk1k6
591B05j3p0ql3l4k4o7lj09J3kk9K1j6j9j3J7m6K6Q3k3pN5%O9J6L2j1L9N7N0j2
623A44O9k3K5O0L1m4J0n2o0J8o9no1k1l9k0j10qJkm9pOLj1L4k2M8l5M0N8k8O0
656e9qL8J4L8O3lM0j9O0O9m9R0n6J4Jl5k8l7l8l4n9nm1m7o2Lk4p1K3M7r9P4L6
689a64p0O4nK7K3M0L4QK3j9Q7j4Q6J3J8PK4JL3k8L7n4N0l8k0n4K4q7mk8p2m5o3
722a66O9o7p9RNj3K8K4N5o3R4l1kR8M6J9j8N4K9KO8k0Q4n6K8J3j9K5j4m8J9Ol0
755A49n3Kj8p6K2k9n6o0j5Nl8o6j8K1J8NM1j0M4M0M3m8J33lM3j2N8K5k9L7OJ4
$$ plain form
787 175 173 207 157 187 131 126 100 108 93 95 -3 18 26 -77 -68 -80 -167 -128 -153 -213 -176 -221 -223 -208 -165 -176 -163 -135 -87 -58 -22 -7 36
820 36 60 103 84 159 147 199 131 162 158 165 136 138 82 76 55 34 2 1 -54 -39 -32 -98 -105 -154 -164 -174 -187 -160 -208 -151 -210 -199 -172 -198
854 -198 -149 -102 -108 -69 -51 14 30 78 119 113 103 189 143 159 194 167 150 197 142 107 97 65 26 34 -5 -65 -47 -67 -58 -129 -113 -142
886 -142 -143 -157 -128 -118 -169 -141 -107 -104 -102 -61 -73 -69 -39 -19 64 63 30 74 134 165 177 150 156 212 144 176 130 149 96 115 72 55 53 -44
920 -44 -32 -43 -107 -148 -150 -115 -93 -142 -153 -158 -100 -144 -101 -96 -81 -36 -33 -76 -36 18 -14 35 79 82 110 104 120 108 160 149 160 125 120 165
954 165 154 129 53 17 23 -20 -5 -73 -103 -89 -158 -158 -192 -159 -184 -197 -192 -174 -140 -157 -72 -93 -96 -52 -48 -26 18 3 -6 113 67 111 108
987 108 118 148 137 119 111 141 117 110 131 47 65 4 13 -48 -27 -73 -134 -160 -144 -146 -194 -168 -200 -195 -180 -173 -174 -119 -84 -29 -25 -41 -26 -7
1021 -7 47 57 85 116 93 103 79 128 136 138 157 108 145 78 98 89 59 19 18 4 -53 -64 -72 -102 -133 -170 -144 -151 -125 -185 -162 -159 -144 -100
$$ packed form
787A75kL4n0L0n6nk6Qj5Kr8K1Qj03Rj2q7L9k5o0L7m5kJ5M3j1J3K8M8K9L6J5M3
820C6K4M3j9P5j2N2o8L1mPk9Kn6ok1k1l2jn5J5Po6pm9j0j0j3K7m8N7n9J1K7k6
854a98M9M7oL9J8O5J6M8M1oj0Q6m6J6L5k7j7M7n5l5j0l2l9Ql9o0J8k0Rp1J6k9
886a42jj4K9J0n1K8L4LKM1j2ML0K0Q3jl3M4O0L1J2k7ON6o8L2m6J9n3J9m3j7kr7
920d4J2j1o4m1kL5K2m9j1nN8m4M3NJ5M5Lm3M0N4l2M9M4LK8oJ6j2N2j1J1l5nM5
954A65j1k5p6l6Om3J5o8l0J4o9%l4L3k5j3NJ8L4j7Q5k1lM4MK2M4j5rJ19m6M4l
987A08J0L0j1j8qL0k4pK1q4J8o1Ro1K1m6o1k6J6km8K6l2NJ5PjN5L5N5Mj6J5J9
1021gN4J0K8L1k3J0k4M9QKJ9m9L7o7K0rl0m0jj4n7j1ql0l1l7K6pK6o0K3LJ5M4
$$ plain form
1055 -100 -99 -55 -54 24 -8 6 57 52 32 106 102 116 113 146 133 158 119 112 122 81 69 88 31 67 14 -53 -58 -32 -83 -87 -96 -90 -156 -128 -73
1090 -73 -127 -134 -131 -149 -113 -120 -69 -50 -28 2 47 42 29 58 80 111 123 147 129 127 115 155 131 141 51 96 44 32 38 3 -12 -32 -62
1123 -62 -58 -82 -51 -95 -92 -112 -151 -175 -131 -150 -67 -111 -101 -92 -83 -37 -46 34 26 44 64 100 94 88 107 129 151 117 125 115 81 84 74 48 37
1158 37 -3 -33 2 -64 -15 -64 -53 -104 -131 -127 -151 -115 -116 -106 -99 -116 -40 -77 -61 -80 -59 -34 -32 -5 34 31 64 36 98 43 101 141 62
1191 62 94 118 116 96 96 57 62 78 -27 -20 -19 -26 -96 -58 -119 -95 -152 -132 -110 -155 -91 -101 -100 -95 -116 -88 -93 -74 -15 -31 -11 28 66 42
1225 42 40 113 105 88 122 111 165 156 114 129 129 50 49 68 50 2 -1 -53 -54 -82 -106 -85 -106 -129 -152 -156 -100 -119 -104 -110 -47 -86 -58 -69 -21
1260 -21 -33 -12 31 40 75 90 111 96 108 116 69 94 106 87 113 69 74 56 75 18 24 -16 14 -26 -65 -73 -158 -73 -115 -86 -111 -120 -70
1293 -70 -123 -97 -100 -81 -64 -57 -65 9 27 18 43 84 70 100 57 75 91 142 105 49 101 85 98 45 90 76 27 -13 -20 -32 -29 -37 -54 -126
$$ packed form
1055a00JM4JP8l2J4N1nk0P4mJ4lL3j3K5l9pJ0m1j2J9n7L6n3o7nK6n1mrOo6K8N5
1090g3n4pLj8L6pN1J9K2L0M5nj3K9K2L1J2K4j8kj2M0k4J0r0M5n2j2Ol5j5k0l0
1123f2Mk4L1m4Lk0l9k4M4j9Q3m4J0RRM6rQ0qJ8K0L6ooJ9K2K2l4Qj0l4Lj0k6j1
1158C7m0l0L5o6M9m9J1n1k7Mk4L6jJ0Pj7P6l7J6j9K1K5KK7L9lL3k8O2n5N8M0p9
1191F2L2K4kk0%l9NJ6j05PJpp0L8o1K4n7K0K2m5O4j0JNk1K8nJ9N9j6K0L9L8k4
1225D2kP3qj7L4j1N4rm2J5%p9jJ9j8m8ln2jk8k4K1k1k3k3mN6j9J5oO3l9K8j1M8
1260b1j2K1M3RL5J5K1j5J2Qm7K5J2j9K6m4Nj8J9n7Om0L0m0l9qq5Q5m2K9k5rN0
1293g0n3K6lJ9J7PqP4J8rK5M1j4L0m3J8J6N1l7n6N2j6J3n3M5j4m9m0pj2Lqj7p2
$$ plain form
1327 -126 -73 -83 -115 -139 -93 -97 -120 -128 -117 -97 -91 -81 -26 6 29 -1 17 35 60 44 70 118 104 63 106 120 87 91 25 73 57 63
1359 63 93 5 -19 18 -42 -20 -55 -116 -93 -88 -57 -123 -117 -122 -133 -108 -76 -71 -104 -59 -30 5 31 3 -3 -14 72 94 73 60 86 72 36
1392 36 71 82 77 70 48 47 53 93 1 8 -27 -32 -47 -62 -42 -82 -56 -73 -85 -97 -106 -84 -73 -71 -66 -75 -61 -86 -34 -6 -39 63 32 57 50
1427 50 103 57 90 86 98 105 67 97 78 109 59 48 61 62 37 21 -26 -30 -65 -58 -38 -97 -61 -71 -95 -58 -62 -60 -96 -88 -52 -20 -82 -16
1461 -16 -9 2 14 -9 64 29 63 121 83 121 85 96 113 116 112 83 66 92 50 24 -1 8 -33 -23 -99 -77 -59 -119 -89 -112 -56 -108
1493 -108 -93 -96 -76 -55 -90 -63 -37 -28 -43 -16 22 13 45 10 65 97 56 91 62 115 74 105 83 28 56 32 60 40 -12 23 -24
1524 -24 -57 -72 -46 -67 -87 -73 -73 -134 -120 -103 -106 -54 -85 -89 -18 -71 -54 -41 -19 23 22 68 0 61 48 34 76 78 68 27 80 61 86
1557 86 48 67 49 37 27 -14 -21 9 -11 -65 -63 -54 -37 -50 -82 -83 -135 -105 -63 -61 -45 -92 -31 -39 -24 -1 33 14 45 11 31 45 41 24
$$ packed form
1327a26N3j0l2k4M6mk3qJ1K0OJ0N5L2K3l0J8J8K5j6K6M8j4m1M3J4l3Mo6M8j6O
1359F3L0q8k4L7o0K2l5o1K3NL1o6Onj1K5L2Nl3M5K9L5K6k8oj1Q6K2k1j3K6j4l6
1392C6L5J1npk2jOM0r2Pl5nj5j5K0m0K6j7j2j2rK2J1KNrJ4k5N2K8l3J02l1K5p
1427E0N3m6L3mJ2Pl8L0j9L1n0j1J3Jk5j6m7ml5PK0n9L6j0k4L7mKl6QL6L2o2O6
1461a6PJ1J2k3P3l5L4N8l8L8l6J1J7Lmk9j7K6m2k6k5Rm1J0p6K2J8o0L0k3N6n2
1493a08J5lK0K1l5K7K6Rj5K7L8rL2l5N5L2m1L5k9N3m1L1k2n5K8k4K8k0n2L5m7
1524b4l3j5K6k1k0J4%o1J4J7lN2l1mP1n3J7J3K2M2jM6o8O1j3j4M2Kj0m1N3j9K5
1557H6l8J9j8j2j0m1pL0k0n4KRJ7j3l2jn2L0M2KJ6m7O1qJ5K3L4j9L1l4K0J4mj7
$$ plain form
1591 24 91 93 86 91 74 48 40 58 26 70 -28 -5 4 -41 -35 -35 -33 -54 -79 -67 -90 -103 -75 -70 -95 -101 -56 -49 -57 -11 -3 -41 -52 6 24 14 71
1628 71 49 89 43 42 76 113 71 62 28 59 -13 56 34 13 15 -24 -13 -25 7 -32 -67 -36 -122 -57 -105 -60 -54 -66 -83 -95 -28 -52
1660 -52 -79 -13 20 -7 -16 6 7 18 37 60 50 73 31 56 75 33 72 65 42 45 34 -36 16 -51 -34 -49 -20 -38 -72 -40 -65 -75
1692 -75 -85 -101 -117 -66 -81 -77 -64 -75 -36 -45 -33 23 5 11 39 49 28 53 70 98 93 45 70 86 42 56 77 50 34 60 20 -20
1724 -20 -38 -20 -54 -103 -20 -65 -65 -72 -101 -56 -107 -80 -40 -64 -85 -75 -24 -17 -47 -19 -29 31 75 -14 23 61 57 54 55 48 53 47 19 35 25
1759 25 52 14 31 1 12 -3 -12 5 -93 0 -79 -36 -23 -45 -48 -68 -72 -84 -45 -48 -32 -62 -67 4 2 26 6 66 54 24 60 78 45
1792 45 53 26 89 64 55 82 43 68 49 27 2 0 3 20 -6 -18 -54 -80 -29 -63 -94 -70 -78 -81 -87 -52 -67 -22 -11 -15 -45 -24 -36 23
1826 23 23 59 31 29 73 73 84 64 35 67 54 27 28 26 15 46 14 23 -42 -43 -23 3 16 -91 -16 -84 -79 -50 -110 -55 -79 -8 -67 -63
$$ packed form
1591B4O7KpNj7k6qJ8l2M4r8K3Rm5O%Kk1k5J2k3j3K8Nk5oM5PqM6Ql8j1N8J8j0N7
1628G1k2M0m6jL4L7m2rl4L1p2O9k2k1Kl9J1j2L2l9l5L1q6O5m8M5Oj2j7j2O7k4
1660e2k7O6L3k7rK2JJ1J9K3j0K3m2K5J9m2L9pk3Lj1p0N2o7J7j5K9j8l4L2k5j0
1692g5j0j6j6N1j5MJ3j1L9rJ2N6j8OK8J0k1K5J7K8nm8K5J6m4J4K1k7j6K6m0m0
1724b0j8J8l4m9Q3m5%pk9M5n1K7M0k4k1J0N1Pl0K8j0O0M4q9L7L8mlJpNok8J6j0
1759B5K7l8J7l0J1j5rJ7r8R3p9M3J3k2lk0mj2L9lJ6l0nP1kK4k0O0j2l0L6J8l3
1792D5Qk7O3k5rK7l9K5j9k2k5kLJ7k6j2l6k6N1l4l1K4qloL5j5M5J1ml0K1j2N9
1826B3%L6k8kM4%J1k0k9L2j3k7Jkj1L1l2Ro5jK0K6J3j07P5o8NK9o0N5k4P1n9M
$$ plain form
1860 -63 -31 -53 -34 -27 -28 -2 1 21 33 22 22 73 45 73 65 53 67 59 42 2 45 9 31 18 13 7 -54 -27 -24 -58 -33 -85 -61 -74 -49
1895 -49 -63 -53 -53 -81 -40 -17 -52 -54 -37 -16 -11 -13 58 -3 2 53 61 34 49 87 62 35 27 44 83 40 19 -19 -10 -9 6 -9 -43 5 -62
1930 -62 -87 -55 -79 -73 -66 -9 -99 9 -76 9 -39 -8 -8 -6 -13 -3 38 32 38 77 4 20 62 72 75 50 95 44 59 -4 53 23 3 -14
1964 -14 15 -60 -30 -52 -48 -48 -70 -62 -73 -64 -58 -68 -32 -12 -90 -91 -52 -42 -37 -70 -16 -62 30 -30 21 16 -7 70 82 61 58 56 100 42 28
1999 28 54 10 68 -18 1 -34 -32 -10 -59 -65 -50 -27 -69 -80 -6 -47 -75 -88 -47 -72 -80 -31 -7 -17 -60 3 -49 -47 -22 41 28 23 26
2032 26 42 67 57 7 75 96 14 8 35 17 3 38 -30 -21 -49 -48 -37 -23 -65 -80 -66 -70 -84 -71 -84 -54 -63 -43 -19 -49 -6 -76 -14
2065 -14 -28 20 -16 -15 32 29 -3 76 37 -19 -1 35 18 18 21 38 51 13 17 -4 1 -26 0 -37 -76 -20 -79 -28 -62 -61 1 -19 -45 -112
2099 -112 -6 -28 -64 -11 -33 -46 -21 -19 1 28 33 -8 58 12 22 3 20 62 25 25 32 62 20 25 12 -27 24 12 38 -33 -12 -9
$$ packed form
1860f3L2k2J9PjK6LK0J2j1%N1k8K8qj2J4qj7m0M3l6K2j3noo1K7Ll4K5n2K4j3K5
1895d9j4J0%k8M1K3l5kJ7K1NkP1o1NN1Qk7J5L8k5k7qJ7L9m3k1l8RJJ5j5l4M8o7
1930f2k5L2k4OPN7r0J08q5Q5m8L1%KpJ0M1oOL9p3J6M2J0Lk5M5n1J5o3N7l0k0j7
1964a4K9p5L0k2M%k2Qj1ROj0L6K0p8jL9J0Nl3N4m6R2o0N1nk3P7J2k1lkM4n8j4
1999B8K6m4N8q6J9l5KK2m9oJ5K3m2j1P4m1k8j3M1k5qM9K4j0m3O3n2KK5O3j3nL
2032B6J6K5j0n0O8K1q2oK7j8j4L5o8Rk8JJ1J4m2j5J4mj4J3j3L0rK0K4l0M3p0O2
2065a4j4M8l6JM7ll2P9l9n6J8L6j7%LJ7J3l8Mk1Nk7K6l7l9N6n9N1l4JO2k0k6o7
2099a12J06k2l6N3k2j3K5KK0K7Nm1O6m6J0j9J7M2l7%PL0m2Nj3l9N1j2K6p1K1L
$$ plain form
2131 -9 -37 -26 -56 -46 -62 -47 -25 -75 -62 -59 6 7 -37 -48 0 41 22 11 9 65 8 28 40 69 69 75 29 52 49 20 77 51 44 15
2165 15 23 -15 7 13 0 -25 -20 -56 -49 -52 -42 -6 -70 -56 -34 -83 -12 5 -40 11 7 3 3 13 33 38 38 28 37 32 11 65 27 98 60 34
2201 34 65 5 21 11 60 -16 -9 -19 -26 -28 -75 -30 -25 -27 -40 -64 -68 -51 -55 -46 -57 -18 -33 -35 11 -2 20 24 62 40 59 54 75 64 59 31
2237 31 86 29 33 51 28 24 45 -17 6 20 -41 -49 -26 -68 -42 -13 -37 -23 -25 -37 -36 -42 -16 -17 -5 -23 -4 -38 -6 14 -13 -19 11 -16
2271 -16 8 22 -2 22 -6 52 19 50 61 31 -5 71 32 -4 22 31 -9 -24 -17 20 -74 -24 -72 -46 -46 -34 -69 -116 -34 -53 -20 11
2303 11 -37 -31 -8 -26 -61 -29 -23 25 55 -4 42 -6 -13 36 81 16 43 34 -22 70 -23 21 3 20 -5 -2 13 -38 -8 -5 -15 -12 -62 -35
2337 -35 -91 -33 -44 -40 -86 -8 -44 -66 -28 16 -3 -5 6 -13 1 -3 6 20 55 54 16 62 39 43 36 24 17 -10 31 4 -18 22 -16 -33
2371 -33 -75 -1 -30 -16 -30 -47 -45 -55 -10 -44 -60 -48 -24 -38 -33 13 -45 36 16 4 2 -12 46 57 47 -1 54 41 13 3 -3 33
$$ packed form
2131ik8J1l0J0j6J5K2n0J3LO5Jm4j1M8M1j9j1kN6n7K0J2K9%Om6K3lk9N7k6pk9
2165A5Ql8K2Oj3k5Nl6PlJ0L6o4J4K2m9P1J7m5N1mm%J0K0N%j0Rnk1N4l8P1l8k6
2201C4L1o0J6j0M9p6Pj0pkm7M5Nkj3k4mJ7mRj1L9j5kM6j3K2ML8k2J9nK1j1nk8
2237C1N5n7MJ8k3mK1o2K3J4o1qK3m2K6K9k4J4kj2JoK6jJ2j8J9l4L2K0k7oL0k7
2271a6K4J4k4K4k8N8l3L1J1l0l6P6l9l6K6Rm0j5PL7r4N0m8K6%J2l5m7Q2j9L3L1
2303A1m8OK3j8l5L2OM8L0n9M6m8pM9M5o5K7rn6R2r3M4j8J7k5LJ5n1L0Lj0Ln0K7
2337c5n6N8j1Mm6P8l6k2L8M4j9kJ1j9J4mRJ4L5jl8M6k3Mpj2pk7M1k7k2M0l8j7
2371c3m2P4k9J4j4j7Kj0M5l4j6J2K4j4NM6n8Q1k0j2kj4N8J1j0m8N5j3k8j0oL6
$$ plain form
2403 33 -15 -8 27 -8 -53 -33 -33 -25 -15 -40 -54 -51 -96 -26 -73 -26 -15 -42 -48 -20 -45 4 -27 -13 -17 -2 31 1 -19 -14 -16 61 19 58
2437 58 16 28 5 15 5 19 20 -11 -21 2 -15 0 -28 -6 -29 -27 -59 -33 17 6 -13 -28 -42 -34 -29 -9 -5 -34 -22 -1 -27 15 3
2470 3 14 4 -2 8 7 5 -16 11 11 23 1 57 37 12 80 38 -10 30 31 -27 -34 -24 -28 -8 -5 -34 -45 -43 -50 -72 -37 -48 -96 -10 -68 -52
2506 -52 -40 3 19 -50 7 47 9 42 29 2 77 43 6 -5 4 -16 19 40 19 -16 6 14 -36 -8 0 -21 -22 -22 -45 -2 -35 -36 -7
2539 -7 -36 -68 -31 -43 -28 -50 -2 -2 -34 -10 -23 -18 18 -5 7 31 38 0 34 49 11 42 -24 29 5 29 -27 0 -25 -27 12 -10 -65
2572 -65 -1 0 12 -43 -22 -7 -35 -33 -31 -13 -58 -4 21 0 -40 -5 -1 11 13 28 43 24 24 24 65 45 21 81 54 36 59 63 9 67
2606 67 8 20 42 -47 -1 -16 -13 -65 -32 -2 -23 -54 -22 -13 21 28 -50 -39 -41 -29 6 13 -12 13 -8 22 -3 41 37 22 1 42 38 26
2640 26 47 32 18 28 25 42 1 4 -7 -7 -18 -27 20 15 -34 -2 -63 6 -53 -32 3 -18 -25 15 -3 -40 -6 6 38 3 -11 -1 36
$$ packed form
2403C3m8PL5l5m5K0%QJ0k5j4Lm5P0m7M7J1k7oK8k5M9l1J4mJ5L3l0k0NkP7m2L9
2437E8m2J2k3J0j0J4Jl1j0K3j7J5k8K2k3Kl2K6N0j1j9j5j4QNK0Mk9J2K1k6M2j2
2470CJ1j0oJ0jkk1K7%J2k2N6k0k5O8m2m8M0Jn8pJ0mK0Lk9j1Kpk2L5j1m8Q6n8J6
2506e2J2M3J6o9N7M0l8L3j3k7P5l4l7j1Rk0L5K1k1l5K2Qn0K8Qk1j%k3M3l3jK9
2539gk9l2L7j2J5k2M8%l2K4j3NL6k3J2K4Pl8L4J5l8L1o6N3k4K4n6K7k5kL9k2n5
2572f5O4JJ2n5K1J5k8KKJ8m5N4K5k1m0L5MJ2KJ5J5j9%%M1k0k4O0k7j8K3Mn4N8
2606F7n9J2K2q9M6j5Ln2L3L0k1l1L2RL4Pp8J1kJ2L5Pk5K5k1L0k5M4mj5k1M1mj2
2640B6K1j5j4J0lJ7m1Lj1%j1rM7nm9L2o1O9n9K1L5k1pM0j8l7L4J2L2l5j4J0L7
$$ plain form
2673 36 -28 29 68 12 46 63 49 45 64 -20 -28 29 12 4 32 16 9 0 1 41 12 -26 -70 -42 -67 -90 -29 -32 -30 -26 -10 34 -24 -8 28
2708 28 -15 -41 24 -19 28 31 20 12 25 17 6 25 33 31 17 -10 21 30 20 10 6 -20 19 6 15 -30 -26 -26 19 -18 -64 23 -45 -9 -46
2743 -46 -22 -24 5 -39 -26 -16 -22 65 -10 19 3 -7 -12 11 19 1 19 1 39 2 25 69 -22 -22 4 3 -15 -39 23 -28 -21 -10 -69 -24
2777 -24 -46 -43 -5 -16 -53 -44 -51 -29 -23 -36 2 -40 -18 31 -33 0 35 18 37 28 31 33 43 39 37 -5 19 18 25 43 -8 -20 -12 -17 36 -47 -33
2814 -33 15 -31 -29 -20 -49 -4 -19 -17 -40 -55 -43 -25 24 -47 -13 22 -3 37 32 -2 30 5 10 37 -24 -15 -34 -3 35 -5 -6 7 -15 32
2848 32 -17 -10 7 6 -24 -6 -36 -10 -6 -12 -28 -3 -39 -36 -41 -21 -50 0 -63 6 -18 -10 11 5 42 8 8 -37 -2 23 36 61 3 38 40
2883 40 -10 20 -10 31 -11 -14 36 4 2 -13 -3 1 -22 7 -39 -16 -5 -14 9 -42 7 -44 -44 -31 -8 3 -27 11 11 8 5 -14 8 -3
2917 -3 -2 -17 31 -42 42 69 13 0 11 66 -27 -12 -21 -23 14 -26 -12 -62 -25 -19 -8 -4 -16 -41 -74 -9 7 -26 13 -1 -18 -44 -1
$$ packed form
2673C6o4N7L9n6L4J7j4mJ9q4qN7j7qK8j6prJM0k9l8m4K8k5k3O1lKMJ6M4n8J6L6
2708B8m3k6O5m3M7Lj1qJ3qj1J9Qkj4k7L1Rj0j0mk6L9j3Rm5M%M5l7m6Q7o8L6l7
2743d6K4kK9m4J3J0oQ7p5K9j6j0nK3Qj8J8j8L8l7K3M4r1%K6jj8k4O2n1PJ1n9M5
2777b4k2LL8j1l7RpK2Oj3L8m2K2M9o4L3L5j7J9rLKJ0mkm2K4jPJ8n1j2QnN3q3J4
2814c3M8m6KRk9M5j5Kk3j5J2J8M9p1L4L5k5M0nl4L2k5NK7o1Rj9L1L8m0jJ3k2M7
2848C2m9PJ7jl0J8l0K6Moj6K5l6LnK0k9N0o3O9k4QK1oL7l4%m5L5K5J3K5n8L5K
2883D0n0L0l0M1m2lN0l2kj5J0Mk3K9m6K3J1rK3n1M9n1%J3K3J1l0L8%llj9K2j1
2917cJj5M8p3Q4K7n6j3J1N5r3J5rkL7m0J4n0L7OJ1Mj2k5l3O5J6l3L9j4j7k6M3
$$ plain form
2950 -1 -34 28 16 -4 30 23 -15 46 14 21 -11 4 27 26 18 -7 4 -25 -4 -11 10 -3 -29 0 -8 14 -15 -44 -34 13 -5 -33 -2 -33
2984 -33 -6 8 -72 26 -55 -13 -4 2 20 -15 -4 54 -7 17 15 41 36 37 35 29 41 38 43 32 9 -14 -35 -1 -14 -2 -18 4 32 -23 -2
3019 -2 -42 -3 -17 -67 -33 -53 -56 -33 -5 -56 -14 19 6 11 -32 -5 25 15 44 13 34 42 29 -4 -15 -9 15 37 11 37 36 5 -44
3052 -44 -2 48 -18 -24 -3 -48 -27 -14 -46 -45 -34 -42 10 -24 -28 1 7 -1 -12 37 42 -1 -4 9 -6 17 -12 13 -20 25 21 36 -8 -24 -12
3087 -12 0 -9 19 -38 7 -35 38 -19 -13 -1 -41 31 -14 1 -42 -34 -17 -23 -9 -8 12 -25 -11 3 -38 5 1 19 17 7 6 -9 -5 12 17
3122 17 -10 -18 14 6 13 12 -2 -21 -5 -35 -34 -8 -31 -1 -21 14 -2 -23 -40 -28 4 -24 -64 -12 -4 -41 -32 -25 -30 -41 -8 -16 24 29 -21 -4
3158 -4 11 -7 6 -5 25 -9 34 6 4 -8 22 -9 -51 15 -23 -23 -1 -62 -34 23 -72 -45 -28 -17 -69 -31 -21 -20 -10 -28 9 -58
3190 -58 -13 8 -41 22 -9 -28 -49 -21 -17 33 2 22 -18 21 3 27 -1 -51 42 -18 -32 -5 -4 -32 -34 11 -29 -28 -47 -31 -24 -43 -19
$$ packed form
2950al3O2j2k0L4pl8O1l2Pl2J5K3jqk5J1k9K1pK1j3k6K9qK2k9k9J0M7j8k8L1l1
2984c3K7J4q0R8q1M2ROJ8l5J1N8o1K4kK6nJkoJ2lNj1k3k3k1L4j3J2j6K2K8n5K1
3019bm0L9j4n0L4k0lK3K8n1M2L3j3Nm3K7L0j0K9l1K1Qj3l3j1OK4K2k6K6jl1m9
3052d4M2N0o6oK1m5K1J3l2JJ1qN2l4mK9Oqj1M9Nm3lJ3j5K3k9K5l3M5mJ5m4j6J2
3087a2J2rK8n7M5m2P3n7OJ2m0P2m5J5m3QJ7oJ4JK0l7J4J4m1M3mJ8kj0jj5MJ7N
3122A7k7qL2qPjj4j9J6l0JK6k3L0k0L5j6k1j7J2L2k8m0N2Ql7RPnj1L3qM0Nn0J7
3158dJ5j8J3j1L0l4M3k8kj2L0l1m2O6l8%K2o1K8N7r5K7J7J1n2L8J0JJ0j8L7o7
3190e8M5K1m9O3l1j9k1K8MN0l1K0m0L9j8K4k8n0R3o0j4K7Jk8kM5m0Jj9J6Pj9K4
$$ plain form
3223 -19 -63 2 -22 -41 -34 39 16 -27 -9 1 25 35 19 -14 -5 19 40 -18 -5 12 15 -22 26 -23 13 15 21 -89 -17 -9 -20 -34 11
3256 11 -25 -50 -12 -49 -57 15 -9 -33 -30 -46 -39 -14 -43 -26 -40 2 -8 -27 -4 -2 1 -42 -30 26 13 -6 10 -1 9 -1 24 1 -19
3289 -19 0 6 -6 5 -36 -18 -15 -15 3 -10 3 -12 -40 -85 -38 -8 -16 -53 9 -33 38 1 0 -20 20 22 -34 -7 -19 -15 32 -47 -16 -6
3323 -6 19 6 28 -44 4 30 31 62 15 0 15 -13 19 -38 -8 -23 5 20 12 -14 -13 -9 -31 -13 26 5 -24 -19 -46 -16 6 7 39 10
3357 10 45 3 20 -13 20 18 18 37 15 -17 33 3 1 26 -37 18 -50 2 -42 -19 -27 4 6 18 34 -5 -34 -26 -3 -31 -7 16 3
3390 3 -27 26 7 24 20 -37 22 18 50 5 16 33 -14 11 -23 17 4 13 28 -28 20 23 16 -7 14 -43 8 -32 -22 -20 -31 -16 -2 -19
3424 -19 -31 -44 -42 -36 26 10 -3 -17 -3 24 2 45 2 3 -20 4 31 48 3 17 -8 -28 9 -7 29 -22 0 -5 22 19 -3 -10 -21
3457 -21 25 -54 32 -8 -33 23 -14 2 -37 -34 -35 -25 -4 19 19 11 -54 8 15 42 -20 32 -24 31 39 31 52 8 18 -17 17 52 -13 -31
$$ packed form
3223a9m4O5k4j9PP3k3m3J8J0K4J0j6l3RK4K1n8J3J7Ll7M8m9L6KOj10P2Qj1j4M5
3256A1l6k5L8l7qP2k4k4Lj6PK5k9J7j4M2j0j9K3KLm3J2N6j3j9J6j1J0j0K5k3k0
3289a9J9Oj2J1m1J8L%J8j3J3j5k8m5M7L0ql7O2m2P1l7jk0M0Kn6K7j2MM7p9L1J0
3323fK5j3K2p2M8K6JL1m7j5J5k8L2n7L0j5K8J5qk6JMk2J8L9k1k9Nk7L0K2JL2k9
3357A0L5m2J7l3L3k%J9k2l2N0l0kK5o3N5o8N2m4K3qL1KJ2J6l9k9QK3k8K4K3j3
3390Cl0N3j9J7mn7N9mL2m5J1J7m7K5l4M0j3RJ5n6M8Lpk3K1n7N1m0J0Kj1J5J4j7
3424a9j2j3KOO2j6j3j4J4K7k2M3m3Jk3K4K7J7m5J4k5k0L7j6L6n1K2nK7lk2pj1
3457b1M6p9Q6m0k5N6l7J6l9LjJ0K1K3%qo5O2PK7o2N2n6N5QqK1m4J0l5L4L5o5j8
$$ plain form
3491 -31 -47 16 6 -13 -6 -18 -30 -2 4 16 -8 -19 -15 -15 -30 -8 15 -50 -65 2 32 -14 19 -22 -21 21 -17 14 41 14 19 0 3 -14
3525 -14 32 22 -23 -22 -7 4 -28 21 13 13 12 23 2 -27 -2 -21 -49 -9 -36 -59 -24 -40 -25 -55 12 -10 -14 -13 -18 -50 -8 -7 -17 17
3559 17 25 -5 14 35 -25 0 2 16 -15 13 -22 -7 -22 -66 -40 34 -2 -29 9 -49 -6 -4 -31 -16 -73 -2 -22 -45 2 -6 -61 -6
3591 -6 -17 -33 6 -46 -2 -19 -34 -33 -10 -12 -2 -5 -6 -6 -11 -6 -12 8 -27 -3 19 -38 -16 -76 -42 -25 -33 17 -60 -18 -35 -9 -49 -7 -56
3626 -56 -6 -27 -45 -8 -15 -15 -32 -15 -21 -19 5 -23 -52 -64 -2 -29 8 21 -10 34 14 -7 14 11 -2 -28 -1 -33 -53 -42 -29 -22 -18 23
3660 23 -28 -20 -37 -65 35 -19 -22 6 2 -15 -50 -26 -25 10 -69 30 -3 -17 4 -64 35 -14 71 -6 -30 38 -17 8 -8 39 -14 0
3692 0 -52 -23 -11 47 11 -13 26 0 5 -23 3 -35 -41 -41 -10 64 27 -15 3 -54 19 -18 17 -8 -23 -17 7 2 -20 -20 -18 -19 -5 49 -36
3727 -36 -36 14 16 25 -8 17 -37 15 -28 -14 25 -21 -29 -24 -27 -31 -49 -26 13 -14 8 -9 38 2 18 -40 11 -20 -16 -29 -12 -22 -37 0
$$ packed form
3491c1j6O3j0j9Pj2j2K8OJ2k4j1M%j5K2K3o5j5O7L0m6L3m1JM2l8L1K7k7Nj9Lj7
3525a4M6j0m5JJ5J1l2M9q%jJ1k1k9K5j9k8M0k7k3L5j6J5l0O7k2mJnl2M2Jj0L4
3559A7Ql0J9K1o0K5KJ4l1K8l5J5j5m4K6P4l6k7L8n8M3Kk7J5n7P1k0k3M7qn5N5
3591fj1j6L9n2M4j7j5JK3kJ0lj%nNoK0l5K4K2n7K2o0L4J7qN0p7M2j7K6m0M2m9
3626e6N0k1j8L7p%j7J7oKK4k8k9j2O2k7L7J3l1M4k0k1K1lj3k6K7l2k0J1J3PMM1
3660B3n1Qj7k8J00n4lK8mj7l5K4JL5p9R9l3j4K1o8R9m9Q5p7k4O8n5K5j6M7n3J4
3692@n2K9J2N8l6k4L9k6Nk8K6l8o%L1P4l7m2J8n7P3l7L5k5j5OK4nk2%KjJ4N4q5
3727c6%N0KRl3K5n4N2m3J4L9m6qNlmj8K3L9k7K2j7M7l6J6n8N1l1Mj3J7j0j5L7
$$ plain form
3761 0 1 2 26 21 16 16 2 9 27 -16 -6 2 9 8 -1 -26 15 15 -22 19 -4 -23 -48 -22 -15 28 14 17 -6 5 -11 -17 -11 -46 -25 -17 -55 -24 0
3800 0 -19 -15 -2 25 8 4 17 17 -13 34 28 4 -13 -55 43 -48 14 -14 4 7 30 28 -12 17 14 -31 56 -33 5 -15 -16 -38 -35 2 -24
3835 -24 -29 -7 -19 -36 9 -5 -67 51 2 15 -8 -41 -15 18 -14 -17 -16 -1 -20 -51 -60 -28 27 -14 16 -15 13 4 16 -10 -45 0
3867 0 34 -14 -30 -37 -17 -8 6 -1 -4 3 -36 -6 -24 15 23 6 -28 39 7 -2 6 47 22 -5 -15 31 37 18 -6 -28 -21 -9 2 -38 -14 -5
3903 -5 6 24 -38 -9 -9 33 -20 -8 4 1 -5 -18 10 -23 -13 -8 -40 13 -25 8 -29 26 -2 2 27 16 -36 -1 -65 -33 -35 -23 8 -2
3937 -2 -37 -22 -21 -11 -14 -55 10 10 -11 7 -36 -18 -41 14 -6 -1 -45 -40 -7 -21 28 -39 6 -1 -19 0 -26 -26 -15 29 6 -11 -5 -34 -39
3972 -39 -3 -14 2 36 -10 1 -22 -3 -8 10 -23 -10 17 -55 0 8 -4 -45 -48 30 -42 3 11 -8 -20 7 10 1 9 -39 29 -42 4 11
4006 11 -1 9 7 19 33 -12 -14 25 7 6 -19 -12 2 -18 -3 7 -29 9 -9 -20 -36 15 -38 21 -12 -4 24 -44 -41 40 -15 -20 -34 -50
$$ packed form
3761@JJK4nn%j4PJ8m3J0QPjrk5M1%l7M1k3j9k5K6PM3j4Lk3J1j6oOl5K1Ql8L1K4
3800@j9MJ3K7j7mJ3%l0M7ok4j7m2R8r1O2k8J8LK3km0K9lm5Q7q9L8k0jk2LL7k6
3835b4nK2j2j7M5j4o2J18m9J3k3l3K6L3l2lJJ5j9l1rL2N5m1L0l1K8rJ2k6l5M5
3867@L4m8j6pK0RJ4plPl9L0j8L9Qj7l4O7l2rQM1k5k7j0M6Oj9k4k2PJ2J1m0K4R
3903eJ1J8o2K9%M2n3J2J2loj3K8l3J0Nl2N3l8L3l7N5k8MK5j1n2L5o4L2kJ2L1j0
3937bl5J5JJ0lm1O5%k1J8m3J8k3N5k0Nm4NL3j4M9o7M5pj8J9k6%J1M4k3j7Ok9n
3972c9L6j1J6L4m6J1k3J9nJ8l3J3K7p2N5Qj2m1lP8p2M5Qj9j2K7LrQm8O8p1M6P
4006A1j2J0kJ2J4m5kL9j8jk5PJ4k0J5J0l6L8j8j1j6N1n3N9l3QK8o8LQ1n5nj4j6
$$ plain form
4040 -50 -17 -27 3 -60 2 0 -6 22 1 -12 -24 -27 -13 -33 11 -2 7 -16 11 -2 -15 -1 -44 49 -59 -17 -1 -20 -14 -39 -44 12 0
4073 0 -14 -4 1 -20 -50 -16 11 6 -20 3 -22 16 20 -19 2 -7 32 18 3 -12 36 2 6 43 19 -30 45 10 14 19 39 22 23 -50 -13
4108 -13 16 6 53 7 11 8 0 -12 -11 6 -26 0 -19 15 65 28 33 17 7 44 -5 -1 18 21 -40 -20 14 -32 6 10 -1 3 16 38 11
4143 11 -71 41 14 2 -29 11 6 -9 1 -4 15 25 64 11 -20 -27 17 21 -25 61 16 28 -5 13 23 -52 -32 -60 47 25 23 -24
4175 -24 12 46 -5 3 9 -54 -6 -24 -7 11 -10 -13 -10 14 -15 14 22 -23 -36 -4 -12 -5 -17 19 9 -2 61 14 -27 36 -27 -77 21 2
4209 2 -39 10 48 -26 21 8 -33 3 -8 22 -23 21 10 -3 1 -15 -54 -10 3 9 -4 -32 6 35 6 -45 -30 12 -3 14 53 25
4241 25 6 5 31 -10 54 -10 27 14 23 -9 18 -43 -10 0 -7 16 15 9 21 -3 0 -2 1 -20 -28 -32 5 -28 21 28 -29 6 12 -35 7 27
4277 27 -21 -53 -5 -35 24 -15 2 -31 -30 -4 2 50 23 1 6 -22 -1 -11 -21 9 -2 46 -5 -34 -39 -5 -29 15 -16 -31 -28 14 -10
$$ packed form
4040e0L3j0L0o3O2koK8k1j3j2lJ4k0M4j3Rk3K7j3j3J4m3R3j08M2J6j9Ok5nN6j2
4073@j4J0Nk1l0L4K7nk6K3k5L8Ml9K1rL9j4j5j5M8l4ML7k4m9P5l5MNK0j7Jp3L7
4108a3K9j0M7m6Mlqj2JJ7l2K6j9L4N0l7Nj6j0L7m9MJ9Lo1K0L4m6L8Mj1MJ3K2k7
4143A1q2J12k7j2l1M0nj5J0nJ9J0L9n3l1pM4Mm6Q6m5J2l3J8J0p5K0k8J07k2km7
4175b4L6L4n1QOo3M8j8J7J8k1lLK4k9K9Qm5j3L2qPj2L6j0j1O3m7m1O3o3n0R8j9
4209Bm1M9L8p4M7j3m1L6j1L0m5M4j1j3Mj6l9M4J3Oj3k8L8K9k9n1J5M2j5J7L9k8
4241B5j9jK6m1O4o4L7j3Rl2K7o1L3J0pK3joJ2k4LkLk1qmL7l3M9Pn7L5Om7M2K0
4277B7m8l2M8l0N9l9J7l3JK6OM8k7k2Nk8K1j0j0L0j1M8n1k9nL4k4M4l1j5LM2k4
$$ plain form
4310 -10 -39 29 -18 6 14 23 24 -27 13 -7 -27 32 7 -64 -2 -56 2 49 38 -7 13 -20 -22 8 -2 31 0 2 -73 15 -3 23 -45
4343 -45 26 -39 36 -61 -36 0 -47 -11 -40 16 -14 13 -1 18 3 -29 -2 -14 -8 -34 -9 -1 -21 -34 -2 -20 25 -45 9 -34 -16
4374 -16 -3 23 -13 -27 1 24 11 32 -24 -1 -6 -22 -1 -33 -39 10 11 -10 -2 -19 10 12 -11 0 -29 -35 -38 -59 14 -21 22 -30 20 -33
4408 -33 2 -14 -3 -22 2 -14 6 -27 -9 9 -7 -33 -28 -39 -12 -22 18 -49 1 -29 -25 -25 37 -33 25 -10 -37 -25 -18 9 -31 22
4440 22 24 -19 -17 -7 -26 7 -22 41 -15 7 -26 -3 -17 -13 -21 -5 -10 -18 -19 -13 17 31 -21 -19 -17 14 -30 31 -2 11 -2 -30 18 -45 -44 -62
4476 -62 -32 -28 -61 11 -22 66 -15 -12 -12 -6 -8 -34 0 26 36 12 -24 -21 25 -16 78 -21 44 1 -21 16 8 29 -42 7 -18 16 48 14
4510 14 3 10 -38 -8 7 -31 -11 17 -13 24 1 1 -1 -17 -32 29 -17 -16 48 4 3 24 -14 50 -31 21 20 -20 13 25 0 12 -3
4543 -3 -3 5 46 1 -12 27 -20 7 -16 -1 3 -11 12 24 37 12 16 -3 8 12 42 -14 -59 -18 1 60 -14 0 -6 1 -14 11 -16 42
$$ packed form
4310a0k9O8m7K4QRJn1M0k0k0N9k5p1O2n4N8M7j1m5K0l3kL0j0L3l1Kp5Q8j8K6o8
4343d5P1o5P5r7K5L6m7L6k9N6l0K7j4J9j5l2K7j2Ok6K5Qk0j3L2j8M5p0N4m3J8
4374a6J3K6l6j4K8K3j3K1n6K3nj6K1l2oM9Jk1Qj7K9Kk3J1k9olk1P3l5M3n2N0n3
4408c3L5j6J1j9K4j6K0l3J8J8j6k6Nj1K7j0M0o7N0l0M%O2p0N8l5k7J2PK7m0N3
4440B2Km3KJ0j9L3k9O3n6K2l3K3j4MqJ6nqjOL0J4n2KKL1m4O1l3J3j3k8M8o3Jj8
4476f2L0Ml3P2l3Q8q1L%Okk6L4K6J0k4l6LM6m1R4r9O5m3k2L7qK1p1M9k5L4L2l4
4510A4j1Pm8L0J5l8K0K8l0L7k3%kj6j5O1m6JO4m4jK1l8O4q1N2jm0L3J2k5J2j5
4543c%QM1m5j3L9m7K7k3J5Mj4K3J2J3k5Mj9J1ML0n6m5M1J9N9p4J4oPj5K5k7N8
$$ plain form
4577 42 -6 1 -31 28 -38 -7 11 -7 -10 20 17 22 25 -59 15 41 -7 -24 14 -10 -3 -15 18 42 -27 38 36 21 1 12 -4 36 24 -38
4611 -38 16 36 -7 -32 5 5 -23 9 -4 28 -4 -24 6 -10 -20 -30 32 3 41 -17 -28 -25 -35 9 -4 8 -16 13 -8 -29 19
4642 19 -14 -3 7 -37 -5 -2 -23 12 -15 22 26 -21 26 41 -9 -18 -14 -1 -15 -17 -24 -8 13 -22 8 -63 19 17 13 10 3 33 -7 -32 1
4677 1 -18 -37 3 3 11 5 -4 9 9 25 -8 32 -9 2 3 -11 9 8 -38 18 19 22 7 8 -42 2 6 -3 -45 2 25 -49 -32 4 3 -7 -15 -7
4715 -7 -41 1 -7 49 12 1 7 -32 30 -13 -23 12 -29 3 17 0 11 1 17 20 46 -42 -64 -27 -1 10 -31 -7 -8 31 31 39 46 -8
4749 -8 20 14 6 -44 9 -43 -41 17 16 35 13 1 -30 40 20 -20 30 -50 18 37 12 44 -5 27 27 -18 -41 -4 9 4 19 16 11 -19 4
4784 4 23 7 12 8 -25 -6 13 -36 -8 9 24 -5 12 5 -21 -16 -10 36 -20 11 -38 -19 -13 -39 0 -1 -7 -24 -27 25 -38 -20 6 23 9
4819 9 -25 2 -23 27 -1 64 -14 3 9 -27 19 18 15 -23 20 -19 -11 -13 -31 45 8 -10 -14 -44 5 -1 24 -17 -53 48 44 -1 -22 8
$$ packed form
4577D2m8Pl2N9o6L1J8j8lL0lNLq4P4K6m8j7L8k4Pj2L3K4o9O5kj5k0J1j6M0j2o2
4611c8N4K0m3k5L7%k8L2j3L2l2k0L0j6j0j0O2k9L8n8j1Lj0M4j3J2k4K9k1k1M8
4642A9l3J1J0m4L2Lk1L5k7L7Mm7M7J5n0rMJ3j4kpJ6K1l5L0p1Q2kmlpL0m0k5L3
4677Aj9j9M0%QorJ3%J6l3M0m1J1Jj4K0jm6N6JLj5Jn0M4Mrm2M7K3p4J7L6jj0qQ
4715gl4M2qN6l7j1Ol9O2m3j0L5m1L2J4j7J1j0J6LK6q8k2L7K6J1m1K4jL9%QPn4
4749hK8oqn0N3n2KN8jJ9k2j2l1P0k0m0N0q0O8J9k5L2m9L2%m5k3L7J3nJ5lnl0K3
4784DJ9j6Nml3J9J9m9K8J7J5k9J7pk6NOM6n6L1m9J9Ok6L9joj7lN2o3J8K6J7j4
4819Il4K7k5N0k8O5p8J7Ol6M6jll8M3l9Qkj8P6l7j8ml0M9oK5m1l6J01mm5k1L0
$$ plain form
4853 8 19 6 -3 33 -8 -5 -23 42 -1 1 14 -16 44 -17 14 -42 -54 -11 10 -12 -42 -17 19 -15 30 1 58 21 15 3 15 -12 20
4886 20 -10 -4 17 -2 41 3 22 -12 -16 12 12 3 -28 26 5 -16 -1 -20 7 -9 4 8 -2 -20 -21 18 33 22 9 -15 65 11 30
4919 30 -6 -17 -50 -6 20 -12 5 2 -51 -8 -18 -15 -37 -25 17 14 5 -50 25 44 -12 13 -10 17 -12 -23 -9 -14 3 -16 20 5 -24
4952 -24 34 -10 -70 -5 -5 -7 -14 4 13 -24 46 -63 20 -25 -11 15 -42 -1 8 32 -27 -11 14 -5 16 -43 7 31 22 44 9 24 -5
4985 -5 -33 31 36 -1 26 -26 27 22 -58 23 37 2 -26 46 12 2 63 1 17 -38 11 25 29 -49 -47 -4 -3 10 6 23 26 -4 3 26 24
5020 24 -5 6 7 6 4 -28 32 9 0 0 -12 14 -22 11 -30 -25 -5 -6 22 16 6 -13 11 38 7 -10 2 -7 24 24 28 7 -27 -9 -42 5
5056 5 2 16 -24 42 -43 -8 62 -20 7 -33 8 -3 -21 17 -29 -29 23 12 -50 14 14 -24 16 -24 -23 -19 -35 15 13 -15 -42 -9 2 -30
5090 -30 31 -25 39 13 -7 1 -10 5 -17 30 -15 -11 -33 3 0 -19 8 20 -37 12 8 4 -3 -1 62 -6 -18 -27 -4 -46 -20 -12 -45 -56 -6
$$ packed form
4853HJ1j3rL6m1Lj8O5m3KJ3l0O0o1L1n6j2M3K1k2l0K5L6l4M5k9N7l7oj2J2k7L2
4886B0l0OK1j9M3l8J9l4mK8%rl1N4k1k1J5j9K7j6J3Mj0j8jL9J5j1j3k4Q0n4J9
4919C0l6j1l3M4K6l2J7ln3M3j0Lk2J2M2lrn5P5J9n6K5k3K7k9j1J4nJ7j9L6j5k9
4952b4N8m4o0O5%kpJ8Rl7P0j09Q3m5J4K6n7M1RK4n9J6K5j9K1n9N0K4rK2l5J5k9
4985ek8O4Nl7K7n2N3nq0Q1J4l5k8P2l4j0O1o2J6n5M9J4Mp8KM3JJ3mJ7Ll0PK3k
5020B4k9J1Jjkl2O0k3r%j2K6l6L3m1NK0jK8oj0j9K4K7l1j7J2rL1%Mk1l4J8l3M7
5056ElJ4m0O6q5L5P0q2K7m0M1j1j8L8m6%N2j1o2O4%l8M0m0JMj6N0kk8k7L3J1l2
5090c0O1n6O4k6k0Qj1J5k2M7m5Mk2L6lj9K7J2n7M9mmpKO3o8j2rK3m2K6Ql3j1N0
$$ plain form
5125 -6 -25 3 -14 -26 16 -25 -41 -23 6 4 13 -16 10 -58 -5 -35 -33 13 24 -25 -30 -27 42 -44 -1 -33 -64 -16 7 -48 -58 -12 -51
5158 -51 -51 -31 -37 24 -33 -38 7 12 6 -25 -20 4 -12 11 57 -8 -45 3 -2 35 -10 4 -3 -47 -52 -37 -24 -10 2 -39 -31 -23 7 6 -19 12
5194 12 -32 16 -14 -7 3 -7 25 -1 -9 -2 13 16 -12 -2 -38 -52 -41 -4 19 -11 -8 -27 22 -37 -24 18 -40 -1 -25 -21 14 -43 -28
5227 -28 -31 -18 17 1 20 -28 15 -6 30 -10 19 5 22 11 -8 4 38 -12 -35 9 -6 -32 -25 -23 -14 18 -2 -41 -29 4 -41 -15
5259 -15 0 -5 2 12 26 -4 -46 21 15 -15 19 -5 -11 -9 -9 -7 0 10 55 47 -32 13 -7 23 -22 21 -3 14 -20 16 38 -17 -14 73 -55
5294 -55 8 15 -33 4 -39 15 -7 -30 4 -2 13 -32 8 16 7 32 10 -33 0 -21 -39 9 42 -2 2 35 20 3 0 17 -4 8 -46
5327 -46 33 -2 13 36 -21 -9 -19 -10 8 36 -21 -8 -16 -5 -36 4 28 16 -5 -22 -23 25 27 -3 -20 -19 5 23 19 -35 -32 -9 -5 1 0
5362 0 -25 20 -28 3 -20 22 14 14 -45 -51 -5 -22 45 -31 -46 31 0 -15 -15 -19 -32 29 -71 3 -15 -4 60 -1 -7 -8 19 -19 -1 -16
$$ packed form
5125fj9K8j7j2M2m1j6J8K9kRk9K6o8N3l0KM6J1m9nLO9q6M3l2l1M8K3n5j0M6l9
5158e1%K0oO1n7nM5Nol1NK4j6K3M6o5l7M8nL7m5J4pm4nJ5J3J4J2m1QQL0jk5L1
5194A2m4M8l0PJ0j0L2k6qPJ5Lk8J0l6j4J1L7K3l0Lj9M9n9J3M2n8L9k4ML5n7J5
5227b8lJ3L5j6J9m8M3k1L6m0K9j4J7j1j9J2L4n0k3M4j5k6PKRL2k0l9J2L3m5K6
5259a5J5nPJ0J4l0m2O7ol0L4k4oK%KPJ0M5qp9M5k0L0m5M3k4J7l4L6K2n5LQ7j28
5294e5O3Pm8L7m3N4k2k3L4oJ5m5M0QrK5k2m3L3k1j8M8L3m4ML3j5j7lJ7k1J2n4
5327d6P9l5J5K3n7J2j0RJ8K8n7J3qJ1l1M0K4j2k1j7jM8Kl0j7JK4J8mn4LK3MOj
5362@k5M5m8L1k3M2q%n9oM6j7O7p6j5P7l1j5%mj3O1j00P4j8J1O4o1ojK7l8J8j5
$$ plain form
5396 -16 -16 7 -14 1 -17 -12 -11 -22 -26 -57 38 16 19 18 26 -4 -26 -5 -4 6 -12 50 -28 -14 49 -11 27 -40 -4 -8 -23 -30 -14 -17 -8 5
5432 5 -33 5 -52 -42 -31 24 -15 4 -44 12 26 -12 3 -13 -35 -35 -37 2 8 -1 -5 -9 15 10 3 21 14 -1 -6 18 7 35 4 -44 -20 -15
5468 -15 14 -39 17 -49 -35 25 -20 -34 10 -7 -31 -4 -66 -22 32 -42 4 -1 36 23 19 10 -9 -4 -34 28 1 34 14 -14 -70 17
5500 17 -33 -52 -47 -5 -12 1 -19 -37 -29 -23 -8 -43 -39 23 -44 -26 -28 -34 -31 -33 54 -2 13 -11 -6 -47 -5 31 -34 -9 24 -5 -22 13 -32
5535 -32 -32 23 -15 -48 -18 -22 18 -31 -13 2 12 -30 -24 -5 -30 8 -21 -37 -11 -39 18 -12 38 -51 7 22 5 26 -39 23 4 -18
5567 -18 -16 -36 -29 -20 -1 -8 -48 -70 -40 -14 -43 -17 -2 22 8 14 -19 10 -18 -12 8 6 -18 -28 -27 19 -41 -9 -20 -23 -32 4 -1 -34 -24 -12
5603 -12 -40 4 87 -51 -32 -59 38 -76 -17 15 -38 3 19 -2 -10 10 -38 -10 6 -22 33 -21 1 -24 -9 7 -7 15 -2 16
5633 16 -32 -24 -21 -58 -35 0 -7 30 -16 -6 6 59 22 29 -20 40 -24 -21 -9 -46 26 20 -60 -19 13 -1 -10 -13 31 -5 -1 -23 -33 -78 -13
$$ packed form
5396a6%K3k1J5j8NJj1ml1R5k2LjQl0k2K1JJ0j8O2p8J4O3o0L8o7L6mj5pJ6lRJ3
5432El8L8n7J0J1N5l9J9m8N6J4l8J5j6k2%kL9OrmmK4npJ8pj5nK4j1K8l1m8K4N
5468a5K9n3N6o6J4O0m5j4M4j7k4K7o2M4N4p4M6nL7j3mrj9Nl0O2k7L3k0k8n6Q7
5500A7n0j9NM2pJ3k0j8QOJ5l5MO2o7J8koLkQ7n6J5k4Nm1M2L6o5K5L3k9j7L5m5
5535c2%N5l8l3L0mM0m9J8J5J0m2OJ9k5L8k9j6K6k8N7l0N0q9N8J5j7K1o5O2j9k2
5567a8Kk0PRJ9pm0k2L0K6k9K6J5K4j4Ol3K9k8OK0kk4j0JM6o0L2j1lrL6nl3J0J2
5603a2k8M4Q3j38J9k7R7j14N9L2n3M1J6k1qK0m8K8J6k8N5n4K2k5J5J6j4K2j7J8
5633A6m8QLl7K3L5pL7m6J0J2N3l7Pm9O0o4LJ2l7P2oq0M1L2j4rlM4l6Mk2j0m5O5
$$ plain form
5668 -13 -22 -43 47 8 -18 0 1 37 12 37 -36 -5 -43 -15 35 -25 18 -27 -35 26 -14 25 -31 -73 2 22 -10 -30 25 -29 -26 36
5700 36 -22 5 -33 34 -30 24 16 2 -14 -15 18 2 4 -12 5 15 -38 75 31 0 -10 1 0 -35 17 7 13 1 4 35 -28 12 -32
5733 -32 32 -8 -15 -12 -8 -1 -18 10 6 -5 -46 16 9 35 -36 -42 -3 35 6 11 -41 23 -9 -9 -53 -7 -5 -47 23 -34 -8 13 -15 1 -44
5768 -44 -23 -13 -9 3 -24 4 7 -13 10 -4 -14 16 19 -20 -34 9 -46 3 7 30 27 -8 5 -28 -7 -23 12 -3 -7 -47 -40 -9 23 -3
5802 -3 12 -18 -33 -51 4 -1 -13 9 -6 -20 29 -9 -26 -15 -13 -6 35 -3 -8 23 21 -11 11 5 -2 -3 -15 -58 22 39 12 20 -17 -20 -16 54
5838 54 1 9 -18 -4 -11 -3 26 38 -39 -24 31 -21 -21 -33 -22 -6 34 -27 29 -7 -26 -11 12 -1 -17 -17 16 -6 -39 -3 -29 30 -8
5871 -8 -10 -14 -25 -5 -8 2 -18 -4 -17 -37 3 -15 -26 3 -44 -58 -17 11 41 -28 -45 -17 -30 3 -8 6 0 -14 -9 13 18 -33 8 -8
5905 -8 -35 -5 -38 -2 14 -18 -8 13 -48 14 -20 -22 31 -22 5 -39 6 -11 -19 -30 -17 -6 -2 -4 -5 29 -12 -63 -6 7 3 -10 24 -33
$$ packed form
5668a3rk1R0l9k6J8JL6k5K5p3L1l8K8N0o0M3m5qO1m0L9n6m2P5K0l2k0N5n4LO2
5700C6n8K7l8O7o4N4qj4j6jL3j6Kj6J7J0n3J13m4l1j0J1jl5N2j0Oj2LL1o3M0m4
5733c2O4m0pLMPj7K8mj1m1O2pK6p1oL9L8k9Nn2O4l2%m4M6Km2P0n7K6K1k8J6m5
5768d4K1J0MJ2k7K8Lk0K3j4j0L0Ll9j4M3n5M9MK3ll5J3l3K1j6L5j5mm0PL1L2k6
5802cJ5l0j5j8N5nj2K2j5j4M9l8j7J1KPM1l8nL1kl2K2opjj2m3Q0J7k7Ql7lMP0
5838E4n3Qk7J4pQK9J2p7J5N5n2%j2J1J6M0o1N6l6j9J5K3j3j6%L3k2l3L6k6N9l8
5871hkmj1K0lJ0k0J4j3k0M0j8j1K9m7j4M1K8L0o9j7K8j3L3j1J4oj4NK2Nn1M1j6
5905hk7L0l3L6J6l2J0K1o1O2l4kN3n3K7m4M5j7qj1J3J1MkjL4m1n1N7J3mj3L4n7
$$ plain form
5939 -33 6 -46 -29 -36 -49 3 -28 17 -7 25 -1 8 -25 12 -12 8 23 5 -2 -26 -51 -24 20 -9 -24 10 19 11 1 1 33 11 53
5972 53 22 11 11 -22 -13 14 26 -49 -20 28 -13 -3 -13 -12 2 -10 2 -3 -4 -44 33 -31 32 -27 31 -2 -21 3 1 13 -14 22 -22
6005 -22 24 3 4 8 1 12 -9 20 -8 -25 -4 19 8 1 -21 -22 -37 -10 22 -7 -39 -26 -18 -3 6 3 -9 -34 -21 -53 27 -10 12 -15
6039 -15 7 4 -44 -3 34 0 -11 -5 -12 61 5 -52 9 -16 35 -15 16 0 40 42 -28 13 -34 6 5 -2 -12 -39 -11 2 -36 12 5 40
6073 40 18 34 -21 10 3 -42 14 -22 -30 -7 28 -14 -5 -15 3 -16 -21 8 19 -2 -2 17 6 23 17 -5 -5 -4 15 -6 -17 12 30 27 -8
6108 -8 39 63 -10 -26 40 -37 37 1 32 22 41 -16 9 8 5 -22 -45 -4 -48 -4 -7 -14 9 0 -30 -9 -14 -1 3 -4 40 -8 35 5 -14
6143 -14 -10 6 21 20 8 25 -32 9 -5 -52 -32 27 -12 -56 -2 -5 13 8 14 -21 -9 -3 15 30 -52 33 1 -42 -26 -9 13 -22 11
6176 11 -51 -5 -5 -3 13 -16 -14 -6 6 -15 45 17 -8 7 -15 -4 -19 34 -11 -60 12 -28 -26 -26 3 -12 -5 8 1 4 -28 18 47 -17 -31
$$ packed form
5939c3L9n2J7pj3N2l1M5k4L2k6Rl3L7k4K0J5j8pk4k5K7M4k9j5L4Rqj0%L2k2M2
5972E3l1j1%l3RK7J2p5K9M8m1J0j0JJ4j2J2njm0P7o4O3n9N8l3j9K4kJ2k7L6m4
6005b2M6k1JMpJ1k1K9k8j7K1K3j1pk2jj5K7L2k9l2J3QJ5Rlj2k5J3l2Q0l7K2k7
6039a5K2lm8M1L7l4j1OpP3n6n7O1k5N1n0L1j6M0Kp0M1m7M0jpj0k7K8J3l8M8pL5
6073D0k2J6n5L1pm5N6l6qK3L5m2Rj0J8j9nK9J1k1%J9j1J7ok2%JJ9k1j1K9J8ll5
6108hM7K4p3j6O6p7P4l6L1j0J9n7K5jlk7k3M1m4M4lpK3rl0K1nJ3MpM4m8M3l0j9
6143a4MJ6J5jj2J7n7M1j4m7K0N9l9m4N4lJ8nOl5J2OJ8J5q2Q5l2m3J6J7K2l5L3
6176A1o2M6%KJ6k9KQJ2k1O0k8k5J5k2J1j5N3m5m9P2m0K%K9j5PJ3pLl2M6K9o4j4
$$ plain form
6211 -31 -3 -9 -39 -30 17 0 -14 23 -9 -21 25 -15 21 4 24 40 -29 -17 -8 19 -8 -9 3 -3 -7 28 -6 -10 14 -54 2 -27 28 -16
6245 -16 -27 23 -75 -30 -26 -29 -35 11 -11 -32 -17 -21 -45 -16 -9 -28 -3 9 -18 16 -31 56 -8 -43 12 -60 -32 -34 11 42 -34 15 -15
6278 -15 -18 -51 -26 -45 20 21 -18 -8 -17 5 -31 -68 -45 0 -35 -6 23 -2 -56 -2 -3 51 -22 54 17 -28 16 25 2 -5 -41 41 29
6311 29 8 -13 16 13 -10 -28 26 -47 -35 -1 -28 37 -22 -35 5 -20 8 16 -17 34 -47 -41 -11 -24 -27 -39 -25 -9 -19 38 -20 -8
6343 -8 -9 0 -39 -21 32 -16 43 -12 -1 -30 15 60 3 -51 3 6 -65 -6 22 -59 -60 6 -35 -43 -25 -12 -2 -8 7 30 25 18 27 -5 -29
6378 -29 19 -27 56 -5 -2 -10 -13 -16 -11 -8 4 -47 -5 17 16 2 1 -52 -35 7 -11 17 -42 21 14 -19 -17 3 -5 -13 13 -15 -8 -47 -38 19 23 6
6416 6 -41 -21 -5 -14 -17 13 11 -3 26 -35 -28 25 -8 31 -2 -32 1 -17 1 11 -37 -39 -34 16 0 -11 19 5 -32 -62 -5 -34 44 10
6450 10 -24 1 28 -57 -48 6 23 35 4 47 -4 -21 -2 4 -13 -46 3 -30 -3 -12 24 31 3 -14 1 -5 52 3 26 30 -30 1 -16
$$ packed form
6211c1K8ol0RM7j7j4L7l2j2M6m0L6j7K0J6o9J2RK7k7jJ2omL5l4mK4o8N6k9N5m4
6245a6j1N0r8M5MloM6k2k1J5mk4K9Pj9K5J2k7L4m7Q7o4l5N5p2K8kM5L1p6M9l0
6278a5ll3K5j9O5Jl9J0rK2l6l7K3M5l5K9K9k5n4N4jN4p3P6l7m5M4Rk3pl6Q2j2
6311B9k1k1K9lk3j8N4p3J2L4k7O5n9j3M0k5K8Ql3N1q1OL0j3lj2J4J6j0N7n8J2
6343hjRl9J8N3m8N9n5J1k9M5M5n7n4N4Lp1N9K8q1jO6m1qJ8J3J0oJ5K3npRl2k4
6378b9M8m6Q3o1LqllNLJ2n1M2K2jj4jn3J7M2j8K8n9O3pl3KK0qqK6k8Pl9RN7Mj7
6416Fm7K0J6rlL0kj4K9o1PN3l3L9l3l0L3j8J8J0m8kNN0j6j1L0j4l7l0N7k9P8l4
6450A0l4K5K7q5RN4J7J2l1M3n1j7J9Oj7l3M9l3K7rL6Pk8j7J5oN7m9K3Mo0L1j7
$$ plain form
6483 -16 -15 -17 -5 6 21 3 9 -13 14 -19 -21 7 -19 -36 -15 -5 33 21 -43 28 -18 17 22 -22 5 53 -31 -22 20 -31 -4 12 -41
6516 -41 -3 -23 37 -17 36 -17 -8 13 35 -16 -32 -14 3 -3 28 16 16 1 10 -2 -22 46 -44 23 -34 17 -3 31 33 12 -20 -30 -22
6549 -22 56 -30 2 51 -24 -17 18 -3 7 7 -2 -23 -20 1 36 27 11 28 23 -13 -32 -12 54 42 60 13 -4 -53 38 -2 8 -20 -5
6582 -5 -16 -47 1 -50 -52 -30 41 12 -29 -12 -2 -14 -6 -20 -27 4 16 44 -14 -5 6 31 -34 -22 30 -56 30 7 -24 11 -17 -54 11
6615 11 3 14 16 46 -28 -33 -30 -31 3 9 -48 -15 33 -10 -15 1 12 -3 -38 12 27 -16 -28 5 35 25 1 -39 -19 59 1 -47 26 -24
6649 -24 -8 -9 20 -2 -16 51 -16 8 4 24 20 5 -25 -45 1 9 -35 -14 -34 36 -8 -19 -4 6 31 -3 -33 10 -17 17 -63 -38
6681 -38 12 -38 5 -29 64 -30 25 7 9 22 -6 -4 32 -8 -24 23 -6 43 -1 7 11 -2 2 37 -38 9 -28 29 18 -14 -9 -43 -19
6714 -19 -14 15 -1 0 8 -6 -28 -14 6 -12 -5 14 -21 14 -4 33 -27 -12 4 -51 5 31 -10 -17 -34 10 -13 5 -44 -2 -1 -13 -12 -13
$$ packed form
6483a6JkJ2J1J5j8Ok2K7l3kK8k6j7K1J0L8j2o4P1m6L5Nm4K7M8q4RM2n1K7J6n3
6516d1L8k0O0n4N3n3RK1K2n1j6J8J7oL1j2%j5Rj2k0O8r0O7n7N1k0L4Kk1l2j0Q
6549b2P8q6L2M9p5PL5k1J0%rk1LK1L5rj6J7nl6j9K0O6j2J8m7j7m9R1m0J0k8J5
6582ej1l1M8n1kK2P1k9m1J7J0j2Qj4pL1J2K8n8RJ1K5o5J2N2q6Q6k3l1L5k8l7O5
6615A1qJ1KL0p4nLjL4On7L3M8m3nJ6J1j5l5N0J5m3j2L3L0j0k4m0K0P8n8m8P3n0
6649b4J6jK9k2j4O7o7K4mK0mj5l0k0M6Qm4K1k0P0m4j1J5J0K5l4l0M3k7L4q0K5
6681c8N0n0M3l4R3r4N5j8KJ3k8KL6m0j6M7k9M9m4QMj3ML5p5M7l7N7j1l2Nl4K4
6714a9NK9j6JQj4k2J4K0j8PJ9l5L5j8L7o0J5J6n5N6K6m1pj7M4k3J8m9M2Jj2Jj
$$ plain form
6748 -13 -53 -20 4 3 6 11 5 12 -32 7 4 21 -4 36 38 8 -3 -16 28 1 16 -4 33 -31 -21 -19 31 -8 27 -21 -17 8 -16 -3 -17
6783 -17 -9 28 -11 7 -31 20 -32 -28 11 -33 32 -7 19 -90 -35 -6 -30 -42 -55 -30 -19 -28 22 -28 6 36 -49 -54 -19 -24 -14 17
6815 17 -20 -42 -26 11 -16 5 -42 8 -31 -45 -21 3 6 44 23 18 -3 -5 7 -20 9 -16 24 1 10 2 -7 11 -11 -22 -11 -35 -24
6848 -24 -12 -18 -45 -24 19 -20 -2 -37 -37 31 14 -21 10 20 31 7 14 2 -19 -15 -60 -37 24 -3 19 -16 0 23 25 25 -11 -23 -2
6881 -2 -22 32 3 -14 16 -14 24 24 4 -36 -8 -10 -12 12 19 15 -6 0 23 -12 8 17 28 37 -2 42 -34 -22 1 16 30 -51 -13 24 7
6916 7 3 28 -31 -12 -2 -7 -25 4 -1 -31 -16 -17 -30 -10 12 37 -52 5 37 -11 -2 22 -28 20 7 -17 -25 -5 13 -10 24 -28 -33 27
6950 27 -28 -5 5 -33 -4 29 20 -8 -3 -4 48 18 -32 -25 -34 -9 3 18 -5 24 -10 -33 -9 10 3 -11 -8 18 -23 7 7 26 -24 -1
6984 -1 -30 -9 -49 -55 15 -17 14 15 -15 5 9 14 -12 -25 -16 -10 -6 -5 42 30 -11 -10 -25 -15 -19 12 3 18 6 -19 22 29 9 19 -4 -7 -51
$$ packed form
6748a3m0L3K4jLNoPm4L9lJ7k5M0Kl0j1j3M4k7J5k0L7o4J0KN0l9L5m8MK5k4J3j4
6783a7QL7l9J8l8N1n2ML9m4O5l9K6j09N5K9k4j2j3K5J1rN0n0L4L0q5nL5nJ0L1
6815A7l7k2J6L7k7K1m7N0l9j4K4K4LL8k1nk1kJ2k7K9k5M0k3RqrJ8k2j1J1k4J1
6848b4J2ok7K1M3l9J8l5%O8j7l5L1J0J1k4Pj2k1Mm5K3O1k7K2l5J6K3K%l6j2K1
6881bk0N4k9j7L0l0L8%k0m0K8kkK4Pmk1OK3l5K0RJ1Rl9M4p6J2K3J5J4q1L8L7j7
6916GmK5n9J9J0nj8K9nl0J5jj3K0K2K5q9N7L2m8RK4n0M8j3k4qK0J8k3L4n2nO0
6950B7n5K3J0l8K9L3rk8NjN2l0n0PrK5J2J5k3K9l4k3K4J9pj4LK6m1L0%J9n0K3
6984ak9K1m0oP0l2L1Jl0K0MNk6j3ROMJM7j2m1Jj5J0mL1rJ5j2k5M1Pk0J0k3lm4
$$ plain form
7021 -51 19 42 33 -7 -56 47 30 4 -16 30 -3 -38 -61 -30 -14 -55 -21 -19 -11 -13 -33 -18 -35 -48 -24 -17 -4 -56 28 28 2 8 -7
7054 -7 -9 -42 -11 -60 -29 -39 -25 -4 -9 -14 -23 -26 -46 -5 -8 -1 38 -32 -10 -2 -19 -19 -12 29 -36 -24 -31 -3 -39 -63 12 -6 -30 -10 20 -10
7090 -10 -20 31 -41 -21 -18 -15 -23 -1 -38 -86 -37 -17 -9 29 2 1 16 -25 -50 -31 -38 -35 -33 17 0 10 -24 -16 4 22 -2 5 16 -13 11
7125 11 21 -10 -16 11 -26 -10 14 15 2 -20 24 -16 7 3 9 -1 27 -1 23 -32 41 17 -9 25 -10 33 -14 10 -7 -2 30 -16 26
7158 26 -17 -17 -14 -36 -24 31 -24 8 21 10 -19 -21 -15 19 -11 -5 -18 2 -19 1 3 -23 -3 -23 10 9 24 13 -56 3 9 4 3 9 39 -32
7194 -32 17 5 13 -26 27 23 -8 -37 19 -17 -5 6 -25 52 12 8 -64 -3 -38 -21 -29 -12 -7 -2 -20 33 -7 -17 -13 -10 12 -7 -24 33
7228 33 19 19 14 -33 -15 26 -39 0 -47 -3 25 6 41 18 0 1 12 -41 -9 13 52 -8 -42 -11 0 26 2 36 -11 -13 22 12
7260 12 0 23 -7 15 0 -16 1 -2 43 -8 6 15 23 -19 13 34 -44 28 -19 -9 -31 9 -38 12 -7 0 -22 2 11 -6 -19 -1 35
$$ packed form
7021e1P0K3rm0m9J03j7k6k0M6l3l5k3L1J6m1L4KQkk0J5j7j3K4PJ3n2Q4%k6Oj5
7054gkl3L1m9L1j0J4K1nnrlk0M1lPL9p0K2Qj7%PM1o5J2pK8l6k4P5j8k4K0L0l0
7090a0j0N1p2K0LLqK2l7m8M9K0QL8k7jJ5m1k5J9pLKN0j7J0l4QK0J8k4PJ1k9K4
7125A1J0l1oK7l7J6K4Jj3k2M4m0K3mOj0K8k8K4n5P3k4k6L4l5M3m7K4j7NL2m6M2
7158B6m3%Lk2J2N5n5L2J3j1k9kOL4l0Oj3K0k1K0Kk6K0k0L3jJ5j1o9N9OnjOL0p1
7194c2M9j2Ql9N3ml1k9N6l6J2J1l1P7m0mp2O1l5J7qJ7NNj8N3m0j0MLK2j9j7N7
7228C3j4%nm7J8M1o5L9m7M4K8j9L5k3j8JJ1n3L2K2L9o0l4L1J1K6k4L4m7kL5j0
7260A2j2K3l0K2j5j6J7lM5n1J4RQm2L2K1p8P2m7J0k2M0m7N0j9Pk2K4Rj7j3J8L6
$$ plain form
7293 35 29 -16 -29 -2 -4 3 -22 39 37 -28 -6 -17 -1 34 4 42 32 13 -26 -8 21 -5 13 -6 26 -34 -44 -18 0 19 -8 26
7325 26 25 24 17 21 -31 5 16 -39 -2 4 -11 -11 12 23 -28 -28 -51 -26 32 -35 8 -35 12 -11 11 1 -20 27 -13 -10 32 10 2 -8 -14
7360 -14 46 -14 9 -20 -10 -2 53 -13 -2 26 4 -5 24 15 3 28 -3 9 2 -27 2 -44 -36 -33 41 -27 -11 -15 23 8 -43 18 23 -1
7394 -1 16 -1 -43 -56 7 -8 -5 -41 -18 23 11 -6 8 -5 -2 60 -45 -13 9 8 -4 27 9 -8 2 26 -7 31 -15 1 47 -15
7426 -15 -34 -23 16 -22 4 -40 25 -54 -1 -14 23 42 7 53 -33 14 -5 1 -34 -46 42 -40 17 -17 -10 9 17 -22 22 -25 -12 8
7458 8 -26 -31 -15 38 6 26 -18 18 -37 -53 -27 -15 -48 -16 -30 22 -11 -52 -4 -16 -36 41 6 15 -13 -1 -5 -39 -15 19 -18 2
7490 2 41 45 -82 -4 -34 5 14 -30 32 -63 20 -1 32 -59 -32 15 -44 9 -22 2 -16 -42 -27 -38 29 14 -8 -10 -11 35 27 8 -68
7523 -68 -11 -12 -2 -18 -23 -20 -7 5 19 11 -17 -16 -15 -67 -12 11 -25 -9 -22 -18 -8 17 -36 8 22 -24 9 -1 2 -12 -19 36 3 -29 6
$$ packed form
7293C5om5j3K7kPk5O1ko5K2j1J6L5l0L8j0j9l9J8K9k6J8j9L2o0j0K6J8J9k7L4
7325B6jjpMn2L6J1n5L7Oj5%K3J1n1%k3K5N8o7M3m3M7k3K2j0k1M7m0LM2k2qj0o
7360a4O0o0K3k9J0QN5o6J1K8k2rK9rj2K5l1J2pk9K9m6QLP4o8J6mL8j5n1O1Nk4
7394aJ7j7m2j3O3j5Ll6K3M1j2j7J4j3LO2j05L2K2jj2L1j8j7J0K4l3L8m6J6M6o2
7426a5j9J1L9l8K6m4O5p9N3j3L7J9l5M6q6M7j9Ol5j2Q8q2N7l4PJ9Ql9M4m7J3K0
7458Hl4nJ6N3l2K0m4L6n5j6K6J2l3L2j4N2l3m1M8j2k0P7l5Rk8J2ml4K4L4l7K0
7490BL9Mj27P8l0L9Rm4O2r5Q3k1L3r1K7M7n9N3l1K4j8k6J5j1O7j5k2kjM6qj9p6
7523f8N7jJ0j6nLJ3J2J4qk8JJn2N5K3l6J6j3MJ0K5n3M4J4m6L3j0Lj4pN5l3l2L5
$$ plain form
7558 6 5 -7 6 -8 18 17 -14 43 9 4 -18 -27 35 14 -30 -4 30 -9 3 36 -3 -14 19 -46 23 -25 -16 17 -6 -17 -2 -47 -21
7591 -21 -31 27 36 -8 7 21 3 3 8 7 1 8 21 -45 15 -2 1 -31 -31 16 35 -52 32 32 53 0 14 -6 -13 46 -28 6 -29 28 2
7626 2 -9 -28 -5 20 1 -5 47 1 -21 -3 26 -30 10 -18 -39 -49 -37 -27 -11 3 -4 13 17 4 1 25 8 -46 -3 10 50 14 14
7659 14 -27 19 -3 -29 1 -31 19 -5 -10 53 10 -12 6 8 2 24 1 35 12 33 -23 -22 -42 9 -22 17 19 23 -36 -13 -21 -22 8 -21
7693 -21 39 -19 -29 -31 -20 18 2 -10 12 32 -31 -2 -28 -20 0 -30 -1 33 1 3 44 17 0 -5 -8 14 -21 -28 34 -37 26 -6 -52
7726 -52 -25 -54 -28 -20 -29 -13 16 -22 -17 3 -28 -34 -36 -28 -32 -35 9 -6 -50 2 16 -13 -17 42 -14 9 1 -12 -29 -7 -18 9 37 -10 -45
7761 -45 13 -37 -25 -7 -41 16 -40 20 -46 3 -18 -7 -11 -5 -21 -19 25 46 -9 3 9 -19 -13 14 19 -37 42 -3 14 -5 18 -24 -26 -31
7795 -31 -39 11 0 -2 -18 -36 -27 -12 -19 -2 -46 0 -14 -24 -76 32 -43 -18 -30 30 -23 -32 -1 -36 -24 -12 -1 32 -23 -21 6 -3 -28
$$ packed form
7558Fjj2J3j4K6jl1N7l4nk2rO2k1m4K6L4l9J2L3l9j1L3o5O9m8RL3k3j1J5m5K6
7591b1j0N8Rm4J5J4j8%NjoPJ3o6O0j7Ll2%M7J9q7Q4%K1n3J4k0pN9p4L4l5N7k6
7626Bj1j9K3K5j9oN2m6k2J8K9n6M0k8k1j0J2J0J6J4pJ7Mj3lK4j7n4M3J3M0l6%
7659A4m1M6k2k6L0l2N0k4nO3m3k2J8KoK2k3L4k3K1n6Jk0N1l1L9KMn9K3qjL0k9
7693b1O0n8j0kJ1L8j6j2K2K0o3K9k6QK0l0K9L4l2KM1k7j7nlK2l5pO2p1O3l2m6
7726e2K7k9K6QrJ6K9l8NK0l1okQmlM4j5m4N2J4k9mN9n6K3qj3j7K2j1K7K8m7l5
7761d5N8n0J2J8l4N7n6O0o6M9k1J1mOj6KM4K1n5J2Ok8OK7Nn6P9m5J7j9K3m2kn
7795c1qN0j1kj6j8RJ5pJ7m4M6j4j0n2J08p5K5j2O0n3rL1l5J2J2J1L3n5KK7rk5
$$ plain form
7828 -28 -35 -45 2 -21 -3 38 16 -16 -25 -39 15 -19 -15 -6 1 3 -23 9 11 16 6 0 33 -38 -21 -4 -35 6 1 14 -13 1 -23 0 8 -4
7864 -4 -5 -49 -31 41 -15 26 -12 -45 10 4 20 14 14 -31 -51 -9 -24 -13 -16 29 -61 8 -27 9 -4 -22 -12 47 26 -19 -11 -47 7 15
7898 15 -14 -23 27 -22 -51 -16 -46 -28 -53 -15 -11 8 -9 -11 -68 15 2 13 16 -22 -29 -13 1 20 -15 -14 -6 -54 1 23 -27 -25 28 -22
7932 -22 -3 26 1 21 8 3 -37 -34 18 -43 10 4 -30 -10 51 -21 -1 3 7 -11 -2 -12 -8 -28 -5 21 -15 -17 -5 -8 -11 11 20 1 -14 14
7968 14 15 1 9 -2 13 -28 5 0 -15 4 -17 4 16 -58 -29 -19 -27 3 3 4 69 16 -18 8 -6 8 -31 1 -31 -25 -18 36 -27 -4
8002 -4 16 37 24 -9 -25 18 -10 -33 17 18 22 1 -38 7 2 22 3 1 34 -4 -3 25 1 4 22 6 17 11 17 9 -22 -1 21 -35 -39 45
8038 45 25 20 -14 -20 3 37 -9 -4 -22 22 23 -7 12 -1 5 2 64 -33 -10 -10 31 -8 1 -20 -12 -11 11 15 19 25 19 11 35 0 -39 19 -15 4
8076 4 -21 12 -10 -17 4 -40 -21 31 -17 9 -26 -4 -18 3 -7 22 26 28 -53 -22 37 -24 17 -20 -16 -22 -8 -5 -19 4 -3 2 4 -36 0
$$ packed form
7828b8pj0M7k3J8M1k2l2rj4N4l4MRPKk6L2KNj0oL3p1J7J7l1M1nJ3k7J4k4K3Qj2
7864djm4J8P2n6M1l8l3N5oJ6o%m5k0M2j5J1lM5r0O9l5L6j3j8J0N9k1m5Ql6N4Q
7898A5k9rN0m9k9L5l0J8k5L8MJ9j7kn7Q3j3J1Ll8pJ6J4J9l5JQm8N5K2n0KN3n0
7932b2J9K9k5K0j3nm0LN2o1N3ol4K0O1p2K0MMj8Rj0Mk0K3K6l6kJ2llK2Rj9j5K8
7968A4Jj4Qj1J5m1L3nj5J9k1K1J2p4K9J0qL0%JO5n3l4K6j4J4l9L2l2OPN4o3K3
8002dK0K1j3l3j6M3k8k3N0JMk1l9M5nK0j9kL3l8JK8k4LJ8j6J1oOql1K1K2n6mQ4
8038D5k0nl4oK3L4m6Nj8M4Jl0J9j3OlO2r7K3%M1l9Rk1QJK2MMOoqK4l5l9N8l4J9
8076Dk5L3k2pK1m4J9N2m8K6l5K2j4K1j0K9MKq1L1N9o1M1l7MoJ4Lj4K3pNKm0L6
$$ plain form
8111 0 7 12 -33 -35 49 -12 -68 -39 -40 2 -29 -24 14 -15 -52 -8 -45 36 -5 54 -5 21 -10 24 -11 -26 26 -26 -34 -23 -39 -30 1 -1 -37
8146 -37 -13 -19 -14 -5 1 0 -37 -7 14 -13 9 -39 0 -24 -5 -2 -17 10 -18 11 -29 -40 -23 63 -38 -23 23 -43 8 -33 5 10 -33
8179 -33 -31 -33 36 4 31 38 25 -36 -9 -19 -53 -31 -41 -24 2 -27 17 30 -42 9 -33 -30 26 -17 -21 -6 4 -20 -31 26 -18 39 -14
8212 -14 36 3 -9 22 -21 11 -30 -45 -5 -9 -20 -59 -5 -24 -20 18 -22 -31 -3 3 -70 -36 -4 39 -31 -50 24 -18 30 7 -20 41
8244 41 6 -18 -30 -3 -29 -32 12 -24 2 -41 11 23 25 -62 1 -15 -23 -38 -65 -31 6 5 -3 6 18 -37 -17 -2 0 5 -25 -4 -13 11 6
8279 6 -16 33 5 8 11 -32 -22 -29 44 -6 -46 -6 -20 12 -14 -11 -28 4 1 7 1 -17 0 -13 -65 6 -38 8 -7 -15 -22 -46 -19 -48 -40 -9
8315 -9 11 2 -2 -10 -26 -11 -25 -15 -35 19 -22 -29 -55 -2 16 -16 1 -13 11 -35 -15 5 -15 11 -23 6 31 -19 -26 13 -4 -6 22 -7
8349 -7 -8 -9 -55 -17 -1 -8 38 14 0 11 -24 -13 42 25 -11 -7 11 36 -2 -67 -11 4 26 -29 9 19 3 16 2 -2 -9 -26 -31 -4
$$ packed form
8111@PNm5kQ4o1n6K9jM2l1NL8k9l7M4l7Q1m1N9n9K6l1L4l5j5N2n2qJ1j6RL1kl6
8146c7K4oNROjl7L0K1k7K2m8L9k4J9Lj5K7k8K9m0j1J7Q6j01J5M6o6N1m1L8Nm3
8179c3KkO9l2K7Pj3o1K7j0l4K2j0J7K6k9M4J3p2N1m2LN6m3mJ5J0k4j1N7m4N7n3
8212a4N0l3j2L1m3L2m1j5M0mj1l9N4j9ML8m0rK8Op3L4L2M3p0j9P4m2M8k3k7O1
8244D1l5k4j2K7k6lM4l6K6m3N2J2Kq7O3j6qj5k7L4L7jqRJ2n5K0J5KNl0K1rK4n
8279Fk2M9k8LLm3J0pP3n0m0M0j4L2k6Lj7L2lOoj8J7j3n2P1m4M6j5qpk4K7k9QL1
8315iK0rmqj6J5j4J0k0N4m1pk6N3J8l2J7j4K4m6K0K0k0K6l4K9K5n0pL9j7kK8k9
8349gjjm6L8J6pM6k4j4J1l5J1N5j7l6MJ8K5l8o5N6J5K2n5L8J0j6J3j4mpj7nK7
$$ plain form
8383 -4 -8 -56 -3 2 -7 15 -1 -13 -27 -6 22 -12 -17 12 -20 -38 13 -25 9 -23 -48 -1 -30 -8 26 8 -20 26 -40 14 -31 40 -71
8416 -71 4 -1 27 11 -16 27 -47 24 69 -11 -2 -38 2 -15 33 -28 53 23 -31 3 34 41 -10 10 10 -10 29 16 21 1 -27 13 -19
8449 -19 -4 -10 -18 -20 7 -17 -9 -1 -3 -13 27 -28 -21 -15 11 -3 18 25 -26 2 -6 45 5 -3 34 29 8 42 -6 4 34 -3 50 17 -3 -3 19
8486 19 -37 16 17 -2 3 8 11 -2 37 0 22 41 -13 3 3 45 -20 2 33 18 -13 -10 7 -52 -9 16 32 32 -33 -36 -3 1 -22 -23 43
8521 43 5 -11 19 17 0 -55 -28 -54 34 -50 31 -44 -4 -6 -15 -3 0 0 10 -3 -5 -3 -1 -12 -6 13 11 16 -32 -20 30 -19 -25 0 -37 -27
8557 -27 9 12 -9 11 -17 -14 -65 -68 -4 -5 -48 2 0 32 2 -5 -6 -14 -51 -21 -9 -23 -33 -19 -12 -18 20 -38 -9 -20 -34 11 -26 -9 8
8592 8 -35 -30 -13 -28 -8 6 -9 5 -37 -47 -20 -63 -28 -3 -16 -42 49 -8 -6 -11 -35 -37 -30 -36 -19 -53 42 -7 -2 -62 -15 -13 -37 33 -58
8627 -58 36 -77 -49 -10 -25 12 5 -43 -16 -2 12 7 -21 -1 11 -23 3 7 17 -12 -20 6 -18 12 -8 -41 -25 -35 -13 26 -19 19
$$ packed form
8383dmm8N3NrK2j6j2j4K1K8l4nK9l2j8N1l8L4l2k5M7k9K2L4j8k8M6o6N4m5P1j11
8416g1P5nK8j6k7M3p4P1M5q0Rl6M0j7M8o1Q1l0n4L4L1Pn1K0%k0L9j3Nk0k8M0l2
8449a9J5oqkK7k4QQkj0M0n5POK6j4K1Pn1K8qN1m0qL7nk1L4m8J0L0l7N3l3k0%K2
8486A9n6N3Jj9NNLj3L9l7K2J9n4J6%M2o5K2L1j5l1LJ7n9M3K5J6%o5lL3Mk3jO6
8521D3l8j6L0kj7n5K7k6Q8q4Q1p5M0krJ2L%J0j3kKKj1OJ9kNm8J2N0m9oK5l7J0
8557b7L6Lk1K0k8Ln1lO4jm3N0kL2l0pjql7L0J2j4j0J4PoL8n8K9j1j4M5l7J7J7
8592Hm3NJ7j5K0J4j5J4m2j0K7m3L5K5j3k6R1n7Knk4kPoJ7l4R5m9No0M7Kk4P0r1
8627e8R4j13K8L9j5L7pm8K7J4J4nk8K0J2l4K6MJ0k9qK6k4L0k0l3J6j0K2L9m5L8
$$ plain form
8659 19 8 -10 12 -30 13 -51 17 -43 -38 -38 -14 10 4 20 19 -11 -10 -35 -60 -8 -51 -42 -21 -25 -45 -1 -8 -6 -4 -27 -5 23 5 -47 10
8694 10 8 -62 10 -13 5 -7 -46 -41 -14 -17 -55 23 -13 14 8 -11 28 39 21 23 -9 -3 -52 27 5 25 -11 -13 23 -1 -2 -8 5 -18 -16
8729 -16 -77 19 -3 30 19 -28 29 3 -7 23 -32 -4 -28 -6 -47 -9 36 -74 51 -5 34 1 -21 -15 16 -11 2 4 6 6 7 -50
8761 -50 -45 -14 -17 23 2 -16 4 -19 29 -44 3 -26 -35 3 -46 29 45 31 -21 18 -9 -26 30 -13 -12 22 22 34 -43 23 35 -4 -11
8794 -11 -22 28 26 -9 -38 62 -20 -41 -53 14 9 -7 12 -19 -21 -35 -9 0 3 -13 7 37 15 -26 -7 -7 -19 -22 15 37 33 -1 -1 14
8828 14 -19 -24 8 6 9 18 10 -37 -26 45 -9 -1 -12 -30 19 -6 9 -12 -2 -10 -4 -22 -27 -8 -55 -5 -9 -16 28 37 32 -18 8 -31 13 -8 -14
8865 -14 -9 21 -11 -17 -72 9 18 -22 21 -5 -48 -8 36 4 33 14 14 46 -50 -30 10 -4 -6 -3 8 25 4 7 -15 -32 25 -40 -2 -13
8899 -13 -15 -7 4 28 -13 -9 -40 -44 -39 -28 3 60 -46 9 7 -24 -1 -36 -2 -17 -4 4 -18 21 -30 18 -27 -10 8 -19 8 14 21 -12
$$ packed form
8659A9j1j8K2m2M3o4O8o0N%K4K4oJ6jl0Jk5k5N2m3RK1mk0M4pKKk3K2K8j8n2N7
8694A0kp0P2k3J8j2l9NK7ll8P8l6K7oj9L9J1j8Kl2Om9P9k2K0l6kL6k4joJ3k3K
8729a6o1R6k2L3j1m7N7k6j0L0n5K8k4K2m1L8M5j10J25n6L9l3k2OL1k7J3KK%Jn7
8761e0NL1lM0k1j8K0k3M8p3M7k9rL8m9P5J6j4n2L9k7j7N6m3JL4%J2p7O6J2l9p
8794a1j1N0kl5k9J00q2k1j2O7nj6J9l1kj4K6RLj6K0L0k2m1J9%j2lL7K2ml4%J5
8828A4l3nL2kLRqm7J1P1n4Qj1j8M9k5J5k1J0qOj8nJ9m7N0mpM4Rnn0K6l9M4k1o
8865a4NL0l2on5Q1Rm0M3k6m3M0M4l2K9j9%L2r6K0M0j4kLJ1J7k1Lk2j7N7o5L8j1
8899a3kQJ1K4m1Ml1mNJ1L1N7j06N5kl1K3l5L4j5J3Qk2L9n1M8m5J7J8k7K7OPl3
$$ plain form
8933 -12 3 -13 7 -41 -20 22 -20 -26 16 -6 -21 -2 1 -47 -20 -54 0 -3 -34 -16 -45 8 15 -7 -23 -19 -18 -13 24 -41 17 -39 2 1
8967 1 42 -35 -47 -4 -36 46 -49 -24 14 -27 -58 -34 -29 8 -16 20 -26 6 -4 33 3 1 -43 -39 -35 7 -30 15 3 0 25 -9 -4 -28
9001 -28 4 -19 11 -20 -25 -75 6 7 -44 -1 -8 -10 11 37 -5 -14 -35 -29 19 14 6 3 12 -10 36 -11 -45 -21 -18 -4 25 20 3 -7 -24 -6
9037 -6 -14 -17 -32 -16 -32 -3 -39 -13 -24 -35 -32 -11 -42 -9 -17 -23 -1 -34 24 25 13 5 5 -30 -2 10 -40 -48 -70 -38 -15 12 -35 -31 13 -11
9073 -11 -45 19 -41 -41 -26 -11 2 -48 -41 14 2 12 11 -26 -8 -6 2 -48 -30 -17 -28 -3 -28 -3 -16 21 -16 -19 -48 -26 -33 -5 63 -31
9107 -31 -39 -7 -27 23 -26 -2 -6 49 -19 -25 33 -33 5 10 6 -14 17 -12 -11 8 -18 -50 -9 -14 -35 -25 3 -48 15 -48 42 -11 3 18
9141 18 -20 59 26 24 32 -18 2 -5 -9 -4 10 -18 -12 -2 -37 -10 26 -8 -3 1 37 -1 -2 -37 1 -18 -17 -14 -80 1 -2 1 5 24 -24 1 0 -46
9179 -46 -1 35 -37 -7 -1 -10 17 -16 17 -40 -9 16 8 9 -1 -1 12 -4 -27 37 14 3 -15 -23 19 12 -15 18 -12 -23 14 -9 4 11
$$ packed form
8933a2J5j6K0m8K1M2m2oM2k2j5J9Lm8K7l4N4ll1J8k9N3Pk2j6MJNL7o5N8n6M1j
8967AM1p7j2M3l2Q2r5K5L8m1l1K4NL7k4L6m6L2j0L7l0km4MMM2l7M5j2lK5l4Nk4
9001b8L2k3L0l1nn0Q1Jn1M3pkK1K6m2rk1OM8nqlRk2M6m7l4K4LJ4K9nj7j0j7J8
9037fqlj5J6j6K9l6K6j1j1LK1l1L3qoK2l3N8Jj2q%l5K8J2n0qk2L2K3K7m7MM4k4
9073a1l4O4o0%J5J5J3n0PN5j2J0jl7J8KQn0J8J3j1K5k5K5j3L7l7lk9K2pK8O8r4
9107c1qL2k0N0m9K4mN5o8oN8o6L8Nmk0L1k9JJ9k6l2M1nk1J0K8n1O3o3R0n3J4J5
9141A8l8P9l3kQn0K0pmNJ4k8OJ0l5K7L6l4NML6l8jl5L8j9JLo6Q1lLMJ9m8K5jm6
9179d6M5L6p2L0OrK7l3L3n7L1K5qJj0%J3j6k3O4k3j1j8qM2pk7L3l0j1L7k3J3P
$$ plain form
9213 11 20 19 30 -28 49 -4 -10 1 -6 -3 -14 55 -3 -17 9 -11 -19 -9 27 -1 -21 21 3 -23 9 -18 0 -53 -15 -15 -12 -41 -16 -45
9247 -45 12 11 -23 41 35 22 -43 -10 -10 -23 -27 7 -15 19 -15 11 -4 -21 4 22 5 -5 -17 -3 33 -31 11 26 -47 -33 -1 -4 7
9280 7 -12 -55 -1 5 -41 9 -2 -55 11 -9 5 -17 14 14 -30 -14 -11 4 -14 -21 29 13 -6 87 16 -44 0 35 -22 -11 3 37 58
9313 58 17 0 9 39 1 -20 -40 12 16 -35 -19 -21 23 -2 -8 0 20 -19 -49 -22 -22 -23 -27 46 -10 -24 -7 -34 -10 10 -9 12 2 -11
9347 -11 12 -34 -6 26 -23 10 -2 -9 36 2 -28 -19 -30 -7 35 10 -2 -18 -31 -33 -14 21 -13 5 16 -9 -24 1 -16 -1 -1 13
9379 13 -22 -30 -31 -33 -45 3 8 3 -52 4 -2 -39 -21 -20 2 -27 -7 18 -33 -5 14 -15 20 -30 -19 -44 -27 -17 -21 -2 -11 23 -44 17 -48
9414 -48 -47 -26 -4 40 -54 -26 3 -27 -21 -46 7 10 30 3 -24 -16 0 30 -42 -40 -39 -73 -40 -32 -9 -61 -38 14 -7 17 -35 -11 7 -36
9448 -36 -18 -3 -3 -13 -13 -14 -7 -17 -32 -3 -40 -4 -7 -4 19 -44 -13 -47 -8 -7 -75 -57 -51 -5 -11 -26 -8 -45 11 -35 -12 -5 -4 -11 -50 -35
$$ packed form
9213A1RjJ1n8P7n3oJ1pLj1O9n8j4K6k0qJ0L6k8k0M2j8k6L2k7J8n3L8%Lk9K5k9
9247d5N7jl4O4oj3o5L3%j3mL4k2L4l4K6j5j7K5J8j7j0j2J4L6o4M2J5p3J4L2lJ1
9280Gj9m3N4Om6N0j1n3O6k0J4k2L1%m4J6LJ5j8pN0j6j9R3p1o0M4L5n7J1J4L4K1
9313E8m1j7RL0l8k1k0N2Mn1J6kM4k5oQK0l9l0K7%jmP3n6j4J7k7K4K0j9K1j0j3
9347a1K3m6K8L2m9L3j2pM5l4l0Rj1K3M2k5j2j6j3kJ9L5l4J8J1k5j5K5j7J5%J4
9379A3l5qjkj2M8Nnn5N6ol7J8JK2k9K0K5n1K8J9k9L5n0J1k5J7J0mJ9rL4o7O1o5
9414d8JK1K2M4r4K8K9l0Ok5N3LK0k7k7QJ6L0p2KJl4L3QK3n2K3N2k1K4n2K4J8m3
9448c6J8J5%j0%jPj0j5K9l7L6lLK3o3L1l4L9Jo8J8OM6oj5J8l7N6m6K3PJpl9J5
$$ plain form
9484 -35 -38 15 -41 -16 -24 -19 -31 -56 -21 -12 7 24 -64 58 -39 3 -31 -9 28 -18 24 20 7 -19 -6 -25 -33 6 6 7 -14 -23 37 -7
9518 -7 -53 -40 -6 5 -3 -13 -59 -19 -36 1 -39 -4 -24 -46 -19 -31 27 -18 27 -42 26 -19 -45 29 -7 10 -15 -10 18 27 25 -17 19
9551 19 -6 -35 -42 25 -14 38 20 -19 33 -1 -8 -16 -52 -29 -6 -8 -34 16 -11 -7 -35 -19 0 15 23 -33 17 -22 41 10 -9 46 -4
9584 -4 15 -22 20 8 -4 34 12 7 -10 -10 -34 23 40 23 11 -9 -28 -48 -38 -15 -2 -41 -17 14 -18 -53 12 -27 2 6 8 33 -1
9617 -1 -17 -28 -25 -3 -12 15 -3 -37 7 1 24 -12 -18 -6 -51 -52 5 -35 -22 3 -2 2 17 -25 1 -7 -26 -9 18 -71 -5 27 -17 10 -24
9652 -24 -62 -9 15 10 8 -42 -20 -15 -53 -25 -38 -13 11 -39 -7 -31 -19 -17 0 6 -54 -6 -35 -13 -7 34 -14 -16 23 -46 10 4 -16 29
9686 29 1 36 -22 18 -12 -14 -14 -10 -19 -62 -13 -22 -16 -46 5 13 -15 6 15 -4 -22 2 -19 9 44 27 -21 0 14 26 9 -23 26 22 -37
9721 -37 -3 13 11 -43 4 37 28 -8 8 -1 -5 -14 -24 -55 -30 -24 3 -11 43 -50 -18 -9 7 17 15 -14 3 -13 12 -57 5 -8 -13 11 -25
$$ packed form
9484c5lN3n6K5qNj2k5L5RJ9J7q8J22r7M2l4K2L7m6M2mj3k6J3j9qL9%Jk1rO0m4
9518gm6J3L4J1qj0m6M0j7L7m0L5k0k2K7j2N8m5M5o9O8m5k6P4l6J7k5NK8Rkm2L6
9551A9k5k9pO7l9N2j8l9N2l4pql6K3K3kk6N0k7Mk8J6J9J5Qn6N0l9O3l1j9N5n0
9584dJ9l7M2j2j2L8k2nj7%k4N7J7j7j2k0j9k0J0K3J3l9K4L1l2l5O5l9K9MKK5l4
9617aj6j1LK2rK7j8l4M4oK3l6oJ2m5jN7m0J3K5nMJ5m2K6qj9J7K7q9O6L2m4K7l4
9652b4l8N3K4nkn0K2Nl8K8j3K5K4n0L2k4J2KJ7Oo0M8k9K2OM1m8kL9o9N6ok0M5
9686B9k8L5n8M0l0k%Mrm3M9rOl0N1Qk8K1Rj9j8K4k1K8L5j7m8K1J4J2j7l2M9mn9
9721c7L4J6kn4M7L3rl6J6rmrj0l1K5OK7j4N4r3L2RJ6J0kk9J7j6K5o9O2j3nK4l6
$$ plain form
9756 -25 -11 -44 12 -12 12 62 -21 -24 -6 0 -47 20 16 7 3 -1 -1 -18 1 5 2 5 -27 -15 -58 -15 14 -14 -62 -7 6 -3 -44 -17 13 0
9792 0 -1 -2 -22 29 -6 41 -20 12 49 39 41 5 -16 4 10 5 13 -48 -2 27 2 -31 -3 -3 -1 -8 39 -14 -23 7 20 -8 34 11 -2 -29
9828 -29 -41 -61 7 0 -26 -5 16 16 -32 3 16 -23 -13 -4 -21 -51 -25 62 -44 -19 -38 -22 9 -32 -2 -4 9 27 -11 -8 7 34
9860 34 -13 -32 13 -13 -26 1 18 -15 0 -31 -12 -49 7 -12 -28 7 -26 -25 -7 13 -20 -7 -22 -5 -23 -14 -3 -69 3 -15 -25
9891 -25 -8 -21 -18 -8 -24 31 -4 3 12 56 -7 -25 2 -24 -16 -16 -18 26 -5 12 -10 -16 2 -10 19 -23 14 5 -21 29 -15 18 -5 -3 2
9926 2 5 55 9 -18 7 32 17 48 20 8 21 13 -10 12 -29 -3 -5 7 -9 -11 37 -1 22 -2 52 -10 39 14 -1 16 -21 30 -9
9959 -9 14 -12 -20 1 -9 2 6 -4 14 0 15 -21 52 0 -11 11 -1 -2 25 -2 -16 47 23 8 63 8 21 17 19 39 17 19 -46 -7
9993 -7 -15 -35 -29 5 -11 48 -40 1 20 8 -20 -6 35 8 38 18 32 -26 -12 12 10 -18 -1 -24 -36 19 -29 12 -54 31 38 2 5
$$ packed form
9756b5J4l3N6k4K4N0q3lJ8Om7O7mrmm%j7J9MlLl2J2m3M3K9k8m8N5J3rm1K7L0j3
9792@jjk0N1l5M7o1L2L7j0Kl6k1K0OnQo1M6K9k5l3K8%KpM7n3rL0J3k8M2k3j3k7
9828b9j2k0O8pk6K1K1%m8L5J3l9J0Rj7l0K6Q7j06K5j9J6L1m1L0kJ3J8l8LJ5K7
9860C4m7j9M5k6j3K7J7l3J5l1J9l7N6j9j6L5l3JJ8K0l3J3j5J7j8RJ1o6P2j8j0
9891b5J7j3LJ0j6N5l5PRM4o3j8K7k6Q%kM4l1J7k2oJ8j2K9m2L7rk6N0m4L3k3KN
9926BLN0m6k7K5K5j5L1k8j2J3qk3K2m1K6kJ2j6kM8l8K3k4N4o2M9k5j5J7l7N1l9
9959iK3k6qK1j0J1Mj0J8j4J5l6P3n2j1K2j2jK7k7j4O3k4j5N5n5J3mKK0k2Ko5L9
9993gqk0OL4j6N9q8M1J9j2k8J4M1k7L0k0J4n8J4K4kk8J7k3j2N5m8M1o6Q5Pl6L
$$ plain form
10026 5 51 32 19 36 -19 -10 -10 48 2 16 0 39 5 11 -8 -23 -2 -49 9 -30 12 -15 -4 21 5 31 -30 27 11 -30 22 38
10058 38 22 -5 17 33 14 22 21 -1 5 -3 35 9 -16 8 -8 17 16 9 -12 -27 -8 39 40 2 -48 -18 -20 -8 -3 -11 -25 19 3 22 22
10093 22 3 -30 -47 15 -32 -17 5 23 12 -4 16 -73 -4 -31 -2 -14 23 14 -11 5 36 9 -33 -43 38 -11 8 35 -6 -33
10123 -33 0 -12 5 -10 -46 59 32 -5 32 10 -3 -16 20 -15 -44 -10 -17 6 -2 -23 31 -46 -43 -8 -25 -54 -3 -8 16 23 10 -52
10155 -52 11 28 5 -10 -9 -13 -63 -55 -9 16 -34 -8 27 -16 26 -35 59 14 -44 -41 -6 -17 12 6 4 10 -6 10 0 -18 19 -6 1 16
10189 16 59 -28 -10 -13 -12 -20 -12 -11 10 23 10 -1 34 28 -23 7 -41 -5 -19 -46 0 -39 -30 7 -13 -30 -2 6 -16 40 -24 -42 10 -71
10223 -71 -28 -15 25 -12 -11 -35 24 22 -5 15 5 -41 -15 27 8 -9 21 -28 -31 20 39 16 -39 -2 39 -15 -16 16 -54 -33 -30 -45
10255 -45 -49 -8 -26 -24 -43 -13 -25 30 -31 -2 2 -16 -26 37 -10 -1 -45 -14 18 -34 6 -38 -7 -46 42 5 -40 -4 5 -14 26 -24
$$ packed form
10026EM6j9j3J7n5R%N8m6J4j6L9l4Oj9j5K1m7N8l9M2k7J1K5j6K6o1N7j6m1N2J6
10058C8j6k7K2J6j9Qjk2OqL8k6k5K4j6K5jpk1j5J9M7Jl8n0L0kJ2Nqj4M4j6J9%
10093B2j9l3j7O2m7J5K2J8j1j6K0q9O9k7K9j2L7rk5J6L1k7m2j0Q1m9J9K7m1k7
10123c3L3j2J7j5l6J05k7l7L7k2j3j3L6l5k9L4pK3qk1N4p7LL5j7k9N1nK4Pj3o2
10155e2O3J7k3j5Jmn0QM6K5n0K6L5m3M2o1R4m5n8LL5j1K9okOj6J6j0j8L7k5PJ5
10189A6M3q7J8lJqQJK1J3j3j1L5on1L0m8L6j4k7M6l9RL7k0j7K8Qk2N6o4j8N2q1
10223g1M3J3M0l7Jk4N9kk7K0j0m6K6M2j9j7L0m9lN1J9k3n5L7M1n4jL2p0K1Lj5
10255d5mM1j8Kj9L0j2N5o1K9Mj8j0O3m7Rm4L1L2n2M0m4L1l9Q8l7m5L6Rj9M0n0
$$ plain form
10287 -24 9 4 13 -1 5 21 -20 -33 -61 -2 -5 3 -7 1 -28 48 -30 -46 7 -33 -2 21 -5 19 -5 -7 -12 44 -17 -10 -6 -36 -37 -46 5 9
10323 9 12 -23 14 -46 -9 -18 -13 -1 -34 18 -5 -32 -10 4 -21 -10 -50 -25 -11 -6 -20 -10 -13 -1 7 -47 15 2 -17 6 7 -14 -35 25
10357 25 34 -17 20 -31 17 -20 5 29 0 23 17 35 6 18 26 0 -14 -4 -33 -23 -12 10 -33 -11 9 28 11 6 8 -31 21 6
10389 6 -9 -4 -18 -16 -13 -13 0 51 14 -4 -25 -22 9 -27 8 -16 -27 0 1 -29 -2 -49 24 15 -12 -20 -9 -35 -26 19 -17 31 -50 29 -29
10424 -29 29 26 -19 29 29 -19 -21 14 -53 28 -3 -37 50 15 36 -20 -34 -22 6 -39 -7 36 35 -40 17 -18 -2 9 5 -14 2 -19
10456 -19 -1 -11 -15 15 -27 -44 -19 -38 66 -63 8 6 -22 -1 -12 -5 -1 -47 -8 12 -4 61 -56 -2 -43 -17 -14 -5 3 -1 17 -44
10488 -44 -5 -12 -4 25 -13 -1 -23 30 24 14 20 33 39 -6 10 -31 10 2 -31 -2 -13 36 -34 -2 -27 -11 5 -3 -1 -26 -33 9 -14 -12 -41
10523 -41 -13 10 2 -5 -21 3 -25 -45 -16 -4 -3 1 13 -7 16 -20 -2 -33 17 45 4 -21 -46 2 -14 -13 22 -42 -2 16 0 -7 -11
$$ packed form
10287b4L3nRj4OJ6m1j3k8N9lQj0Qk9P6p8j6N3m0L1K3k6K4k4knN6o1PMl0jrN1M
10323ILl5L7o0L7rNJ2l3N2k3k7K2J4k5J1m0K5J4Nj4J0lJ2Qn4O2j3j9K3Jk1k1O0
10357B5Rn1L7n1M8l7K5K4k9K3oJ8k9J2Qk6j4J0k9J0J1K2m3K2K0J9j7nKl9N2j5
10389Fj5Nj4KL%J3N1l7j8k1LL1l6L5k4j1K7Jl0K7m7P3rk7qJ1k6RM5l6M8q1P9n8
10424b9N8lm5M8%m8kL5o7Q1l1l4Q7l5K1n6j4J2K8m5L2M3jp5N7l5J6J1mj9J6k1
10456a9J8j0mL0m2j7K5j9J04j29P1kk8K1j1PMm6L9K0j6O5j17N4m1K6LRQmJ8o1
10488d4L9pQK9l8J2k2N3oj0OJ3Om5J6m1M1ql3K9j1M9p0L2k5J6J6qKk5pM2k3Kk9
10523d1K8K3qpj6K4k8k0K9J2JMJ2k0K3l6J8l1N0K8m1k5k5M8j6JL5o4M0J8j6pm
$$ plain form
10556 -11 -4 -8 4 -35 -24 -6 1 -6 28 -21 1 -50 -50 -29 -21 -36 -28 -15 1 66 -32 -22 -26 -45 67 -12 29 -21 45 -14 -37 7 -60
10589 -60 -5 -16 -16 1 0 -24 42 -3 -2 -7 -40 4 -8 -30 7 -29 13 -14 -18 6 42 24 -17 0 -11 3 6 39 2 -6 -28 -26 -40 9
10623 9 47 11 -22 -22 20 24 -2 -13 5 -1 10 -26 -1 -9 19 -4 3 18 -19 -44 28 -43 -13 21 -7 -26 5 -2 30 -25 11 -38 -16
10656 -16 10 14 29 -24 10 -4 44 -13 -4 -6 12 15 -7 34 32 -25 -37 5 17 7 -8 20 -20 9 23 23 13 -4 12 20 -57 4 12 15
10690 15 33 0 -21 -6 1 46 2 19 20 33 4 0 4 -23 3 17 -36 -22 14 -24 -19 39 30 -19 -22 -13 -24 6 32 14 22 33 1 -29
10724 -29 12 1 38 12 27 7 28 -5 25 15 12 -1 -8 36 25 -43 -29 -18 1 -37 -5 -32 -30 -6 -57 -7 20 -1 -12 46 -20
10755 -20 -32 46 -20 30 -32 1 23 -18 6 10 -19 5 -25 13 -1 43 -44 33 -5 -8 40 30 28 -20 2 13 -27 6 29 -14 36
10786 36 19 -6 33 -10 -36 -21 -22 53 -35 -13 3 -58 -11 7 5 41 -6 -21 -1 12 8 -36 8 1 0 -30 0 -31 14 29 18 -16
$$ packed form
10556a1PmJ2l9J1J8PpL4m9K2n1%K1Qj5QJ3J6O5r8J0mj9J12p9M1n0O6n9k3M4o7
10589f0N5j1%J7jk4O6m5Jnl3M4j2k2L7l6M2k7mK4L6j8m1J7j1J4LL3l7qk2Kj4M9
10623IL8l6l3%M2Mk6j1J8oJ1l6K5qK8k3PJ5l7k5P2p1L0L4k8j9L1pL2n5L6m9K2
10656a6K6MJ5n3L4j4M8n7RkJ8Lk2M1kn7j2M2J2j0j5K8m0K9J4%j0j7J6Qp7O1QL
10690A5J8l3k1J5PM5m4J7JJ3k9mMk7K6J4n3J4L6l8NN8rm9lRj1L0K6j8QJ1l2l0
10724b9M1j1L7k6J5k0K1l3L0j0lj3pM4j1o8J4J1J9l8L2k7KK4n1N0K7k1j1N8o6
10755b0j2P8o6N0o2L3K2m1K4Mk9K4l0L8j4M4q7P7l8lM8j0km8K2J1m0L3K3m3N0
10786C6j7k5L9m3k6J5jP5q8K2J6o1M7J8kL6m7j5K0J3mm4M4pjl0L0l1M5J5j1l4
$$ plain form
10818 -16 16 -14 -30 -45 -18 -2 -8 2 32 20 -5 45 -43 -5 -28 -19 4 -8 14 13 -27 -5 -27 29 4 20 -26 -37 2 -19 0
10849 0 -50 -35 -14 0 -8 -17 27 -24 16 -12 -19 -58 -32 23 -8 -8 -38 19 -9 26 10 -17 37 -3 -10 -3 -20 5 -31 0 -28 32 16
10882 16 1 2 -10 -27 11 13 -15 16 33 -19 40 -11 -32 -14 -3 25 4 -13 14 20 14 11 13 -6 -8 10 -15 -10 -6 7 -8 -6 -4 -37 -34 -3
10918 -3 12 -39 0 -22 -40 -1 10 1 40 -21 -2 -16 -8 -10 3 -16 -9 -7 -76 -3 -5 4 -5 5 -25 -42 -36 -7 25 -56 -8 -50 -42 -32 -34 -1
10954 -1 10 7 -29 -11 0 -6 -28 -10 15 -41 -25 42 -43 38 -42 -29 0 -19 8 -4 27 -10 -14 -34 -57 17 7 -40 22 3 33 45
10986 45 20 2 -31 19 -20 -15 23 -12 -24 4 42 38 30 -29 -4 -24 -7 -25 -15 24 2 -47 -14 -27 9 -27 -32 25 17 -9 -31 6
11018 6 8 -5 15 -3 -29 -11 20 -6 39 30 42 -15 -7 -17 18 67 4 -16 -3 24 17 -38 5 -23 -5 -11 -19 -2 -4 -1 14 56 4 -16
11052 -16 -14 -24 37 -3 -12 6 9 -7 -13 11 25 9 10 -20 -1 -19 -10 -27 -4 23 -1 -20 5 -7 9 40 10 -21 22 -29 -17 26 24
$$ packed form
10818a6L2l0j6j5K7J6oJ0L0j2k5N0q8L8k3RK3j2K2jm0K2k2N6k5J6m6j1L9k1J9
10849@n0J5K1J4qrM4n1M0k8pl9K6N5l1%l0N7k8L5j6k7N4m0pPj7K5l6L1k8O0j6
10882A6j5Jj2j7L8Kk8L1J7n2N9n1k1J8J1K8k1j7K7OolKj9kJ8k5NMJ3j5KKl3LL1
10918cJ5n1L9k2j8L9J1rL9o1J9j4QkJ3j9PKo9P3kRrJ0l0j7OK9L2q1M8m2QJ0kL3
10954aJ1ll6J8J1ok2J8K5n6J6O7q5Q1q0J3K9j9K7j2L1l7mk0k3P4j0m7O2j9L0J2
10986D5k5j8l3N0l9NL8l5j2K8L8mqn9K5k0J7j8J0L9k2m9L3j3L6l6nN7qk6k2L7
11018FKj3K0j8k6J8L1k6M5rJ2n7Qj0L5M9o3k0J3K7pn5M3k8J8oqJ7kLJ5M2n2k0
11052a6Kj0O1m0rJ8Lj6oK4J4j6Jl0J9j8Rj7K3K7k4j9K5j2J6L1l0l1M3n1J2M3k
$$ plain form
11085 24 54 7 30 -13 2 -11 9 39 23 38 17 -25 26 27 13 -32 41 4 10 -1 -7 -14 2 3 11 35 28 -12 51 -10 7 -26 -17 19
11119 19 -54 -31 8 9 -36 13 56 3 33 16 18 44 8 13 24 23 -62 8 3 11 -12 -25 40 -16 39 3 7 -17 -21 -13 17 20 31 24 -13
11154 -13 -2 23 -39 7 -25 31 5 -14 26 -24 -26 1 31 -19 13 52 8 -2 30 -1 -27 45 -7 15 -4 7 -22 -33 27 1
11184 1 34 -30 43 -38 24 20 -32 52 -8 -11 -26 30 -19 7 36 -57 23 7 48 -8 -26 20 8 0 -37 52 41 -5 35 12 -21 -10
11216 -10 -19 -3 -28 4 -45 3 -28 1 2 24 33 19 -53 6 17 -31 19 28 -14 -4 -10 -5 14 0 -20 -32 5 56 -28 29 10 -4 -6
11249 -6 6 30 14 -38 5 -22 -8 -3 18 -5 -22 -5 -21 -23 -13 -3 -19 4 -31 -5 12 -18 -30 -19 34 -40 11 32 -38 -3 8
11280 8 -8 -23 62 -21 15 56 -57 -23 -23 -15 -18 -8 -37 -17 -12 -33 -9 -13 -2 -20 -1 20 -14 22 -28 -23 15 -3 1 -61 -16 -21 -26 -6
11314 -6 -16 37 -41 5 -5 38 -12 -17 26 4 11 -44 -5 9 26 -8 -7 9 31 -10 -36 9 -29 -25 -1 -4 -36 -3 -34 -1 -16 -43 -14
$$ packed form
11085B4L0m7K3m3J5j3K0L0j6J5k1m2N1Jj4m5P3l7Oj1opJ6JQK4pm0O3o1J7l3RL6
11119A9p3K3L9Jm5M9M3n3L0j7KK6l6NJ1jq5P0nQk3j3O5n6N5l6Mk4mQL0LJ1pl7
11154a3J1K5o2M6l2N6k6j9M0n0kK7L0n0L2L9m4j0L2l1k6P2n2K2j9J1k9j1O0k6
11184AL3o4P3q1O2mn2Q4o0lj5N6m9K6K9r3Q0j6M1n6j8M6j2ql7Q9j1m6M0k3l3J1
11216a0rJ6k5L2m9M8l1K9JK2Rj4p2N9J1m8N0Rm2J0oNJ9j4k0j2L7N1q4N7j9j4k
11249fJ2K4j6n2M3k7J4NK1k3j7J7j6kJ0J0j6K3l5K6J7l0j2J1N3p4N1K1p0L5J1
11280Hj6j5Q5q3L6M1j13L4%QlJ0k9K0Nk1K4mJ1j8J9K1l4L6n0NL8j8Mo2M5nnK0
11314fj0N3p8M6j0M3n0nM3k2Pn5L9J4J7l4JJ6K2m1k6M5l8MK4ll2L3l1L3j5k7K9
$$ plain form
11347 -14 -40 1 14 -29 -41 -24 -6 28 8 6 16 -1 -12 -28 -6 11 -27 -21 -31 -15 37 4 -13 3 -28 -13 -22 1 -29 19 -11
11378 -11 21 -29 7 -13 -25 2 -51 -4 2 -32 46 -52 -23 17 -46 6 -11 41 -1 -27 -18 -7 32 30 -2 17 19 -8 -2 -48 -36 8
11410 8 -7 -34 -4 2 12 14 -9 47 -15 -16 41 6 -22 -19 -11 -39 -12 26 -14 -27 -22 -39 12 1 -11 -15 -28 0 -5 -66 16 -29 5 -20
11444 -20 -6 36 29 -24 -24 51 -16 -1 -9 -39 37 -10 13 5 -26 -24 13 3 -23 30 -13 -36 -26 -13 19 -20 11 -18 -36 46 34 26 5
11477 5 5 12 0 -1 12 9 -28 36 37 20 -7 -22 27 5 10 -16 19 -10 22 -49 7 27 34 -24 4 -32 7 -7 -61 -35 -16 13 -26 -10
11511 -10 -47 11 25 -14 -1 -2 4 -45 11 -5 -34 37 36 18 -9 26 -7 -24 -13 -16 10 -19 18 46 -34 -1 -32 -6 6 18 19 -16
11543 -16 -64 -55 -16 2 -15 7 -16 9 -5 29 14 -30 20 -7 -11 -20 17 35 -10 -61 -19 34 2 -14 -17 -51 2 -28 39 -20 -13 9
11575 9 -63 -7 -20 -16 8 -9 -12 -4 29 36 9 -6 -45 0 -78 10 -45 35 -3 -2 -13 -21 -33 -21 32 -38 31 10 -16 -28 -17 12 24
$$ packed form
11347a4k6M1J3m3j2J7J8L4k0kJ0j7j1j6K2J7l8Oj0J6N2l3j7J6l1J5rK3l0M8l0
11378a1L2n0L6k0j2K7n3M7Ol4P8r8K9M0o3N2j7N2m2k6RJ1L9kl2J9Kk7Om6J2M4
11410Hj5k7L0OJ0Kk3N6o2jN7l5k8LQk8K7L8m0j3Nj7N1j1j2mj3K8no1Q2m5L4k5
11444b0J4M2pn3%P5o7J5ql0P6m7K3ql1KL7j0k6N3m3k3J0J3L2l9L1k9j8Q2j2qk1
11477E%Pj2jJ3ll7O4Jj7k7j5M9k2Nk6L5k9L2p1N6K0Pn8K8l6L9j4n4K6J9K9l9J6
11511a0l7N8J4l9J3jOm9N6j6k9P1jj8k7L5l3j7J1lK6k9L7K8q0L3l1K6J2J2Jl5
11543a6m8RL9J8j7K2k3K5j4L4j5m4N0k7mrL7J8m5n1M2N3l2j6ll4N3l0O7n9PK2
11575Ip2N6j3MK4j7lQL3Pk7j5l9M5p8Q8n5Q0l8Jj1qj2J2N3p0O9k1k6j2J1K9J2
$$ plain form
11608 24 -10 21 -22 19 -10 45 23 -50 21 -52 -14 14 -12 -10 -13 8 -65 -23 -19 18 37 1 -12 -33 2 -23 -13 -20 -41 10 -13 -24
11640 -24 -18 -9 -7 -14 2 -63 20 -14 -32 -8 -59 -33 37 -19 45 -9 -18 -24 -9 -70 -6 -4 -31 -6 17 35 6 40 0 16 72 -25 5
11673 5 -5 -4 -36 -22 31 -7 35 -30 2 3 26 42 -15 5 -11 -20 -7 -6 -27 1 -22 -9 11 15 10 -22 9 -12 -48 -26 -4 -14 -15 17
11707 17 13 9 -4 -8 -1 -10 41 10 5 -35 -2 -14 9 -1 -38 -11 19 -34 -25 17 -6 -9 6 -2 1 -2 -28 -16 -21 -22 -17 -21 -9 -7 30 15 5 8
11745 8 -2 -2 -29 -36 10 18 3 11 -50 -15 4 -2 -3 6 -22 -33 -14 3 -42 -37 -2 -15 37 23 3 32 20 -6 -63 -8 -3 11 9 22 -29
11780 -29 -36 -35 14 13 -14 -12 -11 -29 -8 -43 -19 -6 -24 6 -35 1 8 11 6 -16 7 15 -47 -9 22 -10 -21 28 -14 23 -4 -13 -14 4 3 19
11816 19 6 -9 5 -42 -37 12 -28 32 4 -4 40 -15 12 23 -1 -19 23 -2 31 -24 -39 5 -27 -7 -27 -8 -14 -29 6 -27 -6
11847 -6 17 38 -17 19 24 -43 -28 -40 -9 20 8 1 -34 22 -28 42 11 34 26 -9 26 -23 33 46 3 44 -38 -20 -5 -2 -28 19
$$ packed form
11608B4l4L1m3M1k9N5k2p3P1p3L8K8k6KlK1p3M2ML7J9l6j3k1L5k5J0pk1N1k3j1
11640b4ORKpJ6o5Q3l4j8K4n1K6P0n6O4n4roJ5o1O4Kk7K5K3J8k9L4m0J6N6r7L0
11673Ej0Jl2J4N3l8M2o5L2JK3J6n7K0j6rJ3Jk1K8k3J3K0Mnl2L1k1l6K2K2j0jL2
11707A7mmj3mPrN1l1nm0L3j2K3j0l7K7L0n3RM2k3lJ5qLlk6J2njNmJ2KL7j5j0L
11745Hj0%k7pM6Qj5Qo1L5J9ojRk8j1J9J7m5NL5j3N2j4k0K9j2k6n7N5NJ4kJ3n1
11780b9pJM9jk7KJj8K1l5K4J3j8L0m1L6PLnk2K3Qo2L8L1l2j1M9m2L7k7rjJ8jJ6
11816A9j3j5J4m7NM9m0O0k8qM4n5K7J1k4j8M2k5L3n5j5M4l2K0k0J9oj5L5l3K1
11847fK3K1n5L6No7J5j2L1K9j2pl5N6n0P0l1K3ql5L5m9N6J3m3M1q2J8J5Lk6M7
$$ plain form
11879 19 24 -25 28 -35 62 -6 26 -21 22 17 -16 -24 41 -5 44 54 16 33 -15 25 -20 32 -14 24 -24 14 15 9 23 -3 -18 26
11911 26 23 1 35 1 44 -23 8 14 6 15 -11 10 26 5 -9 27 -30 -6 -23 -1 -29 37 3 36 30 22 -2 21 22 -7 -21 37 12
11944 12 19 26 -7 28 -32 -29 17 29 -1 -10 27 -4 13 -14 -26 -29 1 67 -23 -46 9 18 2 0 21 -51 -14 8 -11 7 -5 22 -4
11977 -4 -23 1 -14 40 24 23 10 -6 14 -6 8 -5 -14 -7 30 -13 -37 12 -9 11 -22 -1 -43 -49 -18 4 13 -61 15 -28 -2 9 -23
12010 -23 9 27 -14 19 12 -16 -21 9 -10 -16 53 -20 24 5 56 -36 8 23 -21 -21 -39 14 1 -3 26 -48 7 -61 -6 30 -3 -4 -32
12043 -32 38 -50 -43 -32 -40 -4 -7 -40 -47 6 36 -12 33 -10 -32 37 -18 -11 -7 -34 19 2 0 -8 -30 8 16 -33 -24 -18 17 -19 -16 1 -9 32
12079 32 -3 8 21 -33 25 -33 -39 -51 -23 20 -5 -57 -32 -61 15 29 -19 -37 -21 -31 -18 -39 7 10 -35 16 -3 7 13 -10 -11 -13
12111 -13 49 -32 -4 -39 0 14 -45 3 -25 -26 9 -26 -18 -42 -11 0 7 32 -17 -1 2 4 -26 -64 -9 43 10 10 10 -12 4 -32 -17
$$ packed form
11879A9Nm9N3o3R7o8L2m7M3nl3qO5m6M9J0l8J7m8M0m5N2m6L8m8L8JoJ4k6j5M4
11911B6lk2L4l4M3o7L1OqRk6K1J6k1j4L6n7K4j7K2k8O6l4L3oqk4K3Jk9j4N8k5
11944A2PPl3L5o0LM6J2l0rL7l1J7k7j2lL0O6r0k3N5Rj6kK1p2L7K2j9J8j2K7k6
11977dj9K4j5N4j6jj3j6K0k0J4j3rPL7m3k4M9k1K0l3K1m2oL1K2Rp4P6m3K6J1l2
12010b3L2J8m1L3pk8nL0j9oO9p3M4j9N1r2M4J5m4%j8N3j3mK9p4N5o8N5L6l3jk8
12043c2P0q8PJ1qL6ll3pN3L0m8M5m3k2O9n5PMk7N3j7kqk2L8Qm9ROL5l6LJ7j0M1
12079C2l5J1J3n4N8n8oj2K8M3k5n2K5k9P6J4m8j8J6j0J3k1M6Lm5N1j9J0Ok3jk
12111a3O2q1K8l5L9J4n9M8k8jL5l5Qk4L1J1PK5m9J6LKl0l8N5N2l3%%k2J6l6J5
$$ plain form
12144 -17 11 -33 -12 -17 -1 -12 3 0 19 35 8 13 24 14 -48 -8 -7 -20 -7 20 12 -47 -25 -4 1 -57 4 -42 35 -14 -35 -3 30
12177 30 25 -1 20 6 -53 8 -7 5 -5 -84 16 -21 32 -12 -18 -24 -27 -1 8 46 6 -16 -18 -30 -28 6 1 -39 -9 7 -5 10 -23
12210 -23 -10 19 -3 31 -9 49 13 -1 -6 9 -16 -26 -12 -7 48 -2 -16 -23 -8 12 -51 -45 11 3 9 -4 -3 -26 -4 -20 1 -25 -13
12243 -13 -5 4 35 -18 11 51 38 18 -18 23 -31 -47 -22 -13 -7 10 -34 43 -7 5 12 -64 52 -1 10 -69 7 14 21 -12 -22 11 -24
12276 -24 -30 21 -23 -27 -16 -39 3 29 43 -19 -23 -6 -21 9 19 -22 3 30 24 6 8 8 18 15 45 30 3 3 60 -30 -15 -16 3 -19
12310 -19 -26 5 7 3 -7 12 34 30 56 5 -24 49 22 54 20 35 13 21 56 -3 11 -17 8 -5 21 31 -15 -8 -27 12 11 6 12 -27
12344 -27 -22 -44 -35 40 -10 16 -1 1 15 -10 -35 -16 12 -4 -17 2 -11 30 -5 -26 17 -11 -21 -29 -26 4 -12 19 5 -3 -6 0 36 37
12378 37 -24 22 -14 42 -22 -32 32 -14 9 -30 33 -19 19 0 -10 20 -23 -30 56 -13 9 -15 15 -25 -22 20 -24 1 4 17 -36
$$ packed form
12144a7K8m4K1nJ6j1J5lJ9J6k7NJ1j0o2M0Jj3J3K7qn9K2K1Nn8O1m6P7m9k1L2L3
12177C0nk6K1j4n9O1j5J2j0p9J00l7N3m4oolK6RL8m0k2kj2KL4nm0L0J6j2J5l3
12210b3J3K9k2L4m0N8l6j4nJ5k5j0J4NN5n0j4pJ5K0o3ON6qOj3Jk3K2j6K1k6J2
12243a3QRL1n3K9M0j3k0l6M1n4j6K5ROJ7m4P7n0J2Pp6J16n3J1p9P6PPl3j0L3l5
12276b4oN1m4mJ1k3M2K6J4o2mJ7j5L0J0m1K5K7oj8K%J0lL0j5k7%N7r0J5jJ9k2
12310a9pL1Kmj0J9K2mK6n1k9P3k7L2l4J5k2QL5n9J4k8K5j3K6J0m6Pj9L9jnOl9
12344b7Nk2RP5n0K6j7KJ4k5k5J9K8j6j3J9j3M1l5k1M3k8j0qLL0j6L1j4qlOL6J
12378C7o1M6l6N6o4j0O4m6K3l9O3n2L8j9j0L0m3pQ6o9K2k4L0m0LM2m4K5LJ3n3
$$ plain form
12409 -36 -15 7 33 -24 -34 15 -54 25 14 -3 -11 0 -44 -23 -18 -39 -17 -11 3 36 13 -20 -6 -13 -32 -40 -25 18 -12 12 -26 -8
12441 -8 18 -56 -19 -19 23 -32 11 -9 -1 1 -25 17 -12 11 1 18 1 -33 -18 -31 5 -52 -30 -36 -29 9 12 -11 22 -2 -35 8 -12
12474 -12 -3 -35 -9 -24 -8 -30 -53 4 -9 22 -2 -25 -5 1 -24 -28 -18 9 -20 -3 -8 -49 -28 -4 -23 -1 12 0 -32 -5 19 -5
12506 -5 -11 -3 37 -11 3 -3 -7 13 -24 -28 1 -25 11 -33 -25 -36 -35 -16 -24 -8 -3 -52 20 -11 0 9 -24 -3 -32 -23 -33 26 7 -9 -40 20
12542 20 18 6 38 -22 5 -20 11 -4 -49 -15 -10 2 -11 -47 -14 10 -9 -19 9 -39 16 -44 18 8 -26 -58 6 33 -2 -49 -2
12573 -2 -21 3 6 18 15 -7 -2 -22 20 13 -3 -30 -24 40 -73 -2 5 21 12 -32 -1 -45 -2 -3 -16 -14 14 10 -25 5 -13 -23 -15 -4 14
12608 14 15 25 -23 15 30 18 -27 -1 27 4 -11 57 34 20 0 14 21 -21 -21 23 13 -13 4 -19 3 32 -28 -11 32 -57 44
12639 44 3 36 -45 23 -5 -7 10 -11 16 -47 16 6 4 5 21 -32 -25 11 -34 -14 -11 21 27 -24 -39 -4 35 22 -25 21 -14 -14 6
$$ packed form
12409c6K1K2K6n7j0M9o9P9j1j7qJ1m4K1Nk1K2OJ4L3k3l3J4pj9qJ5M3l0K4l8J8
12441hK6p4L7%M2n5M3k0QKk6M2k9K3j0J7j7l4J5j3L6n7K2oPL8Lk3L3k4l3M3k0
12474a2Rl2K6j5J6k2k3N7j3L1k4k3K0Ok5mJ0K7k9J7nm1K1K4j9K2J3j2l2K7K4k4
12506eoQM0m8J4omK0l7mK9k6L6m4Qj1JJ9qJ6Nm9P2l1J1Rl3K1k9Rj0N9j9j6l1O0
12542B0kj2L2o0K7k5L1j5m5L4NJ2j3l6L3K4j9j0K8m8N5o0O2j0l4l2O4K7l5m7M7
12573bj9K4LJ2lk2Nk0M2pj6k7OO4j13P1PJ6rm4L1m4M3jj3KK8ml5L0j8j0QJ1J8
12608A4JJ0m8L8J5j2m5K6K8k3j5O8k3j4k0J4Pm2%M4j0k6J7k3K2K9o0J7M3q9J01
12639D4m1L3q1O8k8kJ7k1K7o3O3j0kJJ6n3PL6m5K0LL2On1j5L5L9j3m7M6l5%K0
$$ plain form
12672 6 19 -1 -28 17 -6 -9 27 -19 46 30 23 -54 24 5 15 -14 17 -5 -6 11 -39 22 -18 26 15 43 -11 -21 -13 -30 -24 24 -15
12705 -15 -15 -2 -12 20 30 -3 -1 1 -12 14 24 12 -46 12 -12 -5 -38 -1 -8 0 6 -13 -37 -2 8 37 3 41 19 26 11 -16 -22 4
12739 4 36 -1 24 24 12 -3 -25 26 -58 27 16 13 3 -28 21 2 -8 -31 -5 3 -26 -39 22 -16 -8 -39 -3 8 -28 32 -9 12
12771 12 30 -36 15 -16 -28 -27 -23 0 -16 -10 -43 -23 -8 31 25 -38 10 -44 -37 24 -5 -12 19 7 -21 -12 -18 14 -2 12 5 -29 28 -21
12805 -21 0 -33 -6 18 43 20 -16 4 -27 11 -22 -22 -22 -18 -5 -14 4 -3 -5 -18 16 14 -63 -6 -28 4 -23 7 28 -16 -9 -20 42 -32
12839 -32 7 -23 6 11 -8 -40 -2 6 -27 -25 28 -42 -18 -20 12 -13 -27 -1 32 28 -10 14 -70 9 -8 -61 6 4 -19 14 -11 7 -54
12872 -54 -41 -31 -38 -19 -28 3 -38 -17 -16 -18 32 13 -12 4 -9 -23 7 -26 -75 -46 -35 -76 -56 -59 7 -43 17 -55 -45 -4 -39 -20
12904 -20 -13 -21 17 11 -8 13 -52 -24 -41 23 7 -41 -20 -41 -35 38 0 5 -19 -25 -18 -55 -29 -14 -65 44 54 -15 -18 -64 11 -13 24
$$ packed form
12672FJ3k0k7M5k3lL6m6O5j6pp7P8j9J0k9L1k2jJ7n0O1m0M4j1K8n4j0Qj7OM8l9
12705a5%J3j0L2J0l3KKj3K6J0j2n8N8k4Pl3L7pQOj9k4L5J0K9l4L8k2Pj5k7oK6
12739DL2l7K5%j2j5k2N1q4Q5j1lj0l1M9j9j0k3K6Qk9j3O1l8Ql1L6J1l6O0m1K1
12771A2J8o6N1l1j2JMK3j6Ol3K0J5L9oo3M8n4PO1k9pL1j2k8RoL2j6J4pl4N7m9
12805b1K1l3K7K4K5k3l6K0l1L8l3%%MJ3rJ8pkj3L4kp7N7k2L2k7L0K1m4Pj1O2p4
12839c2L9l0K9Nj9l2L8Ql3KN3p0K4kL2k5j4K6L3ml8K4q4P9j7n3O7kk3L3k5J8o1
12872e4J3J0pJ9rL1m1K1JkN0j9k5J6j3j4L0l3m9K9J1m1K0lO6n0O0p2J0M1l5J9
12904b0PqL8oj9K1o5K8j7O4j6m8K1k1OP3l8Nk4oPl7K6J5n1J09J0o9lm6P5k4L7
$$ plain form
12937 24 -23 7 -23 20 22 -38 7 -18 37 -38 -25 21 -11 19 18 -7 -1 -2 -22 0 -24 -32 -24 -13 -18 38 -16 -13 -31 10 5 14 -5 6 -19
12972 -19 -17 -16 -32 -5 7 -45 10 -23 -30 -3 -5 12 -49 3 -15 -27 -39 -17 -11 -16 -9 18 -21 7 -15 19 16 6 -3 -21 1 -21 -42 -36 -8
13007 -8 -11 -22 7 -4 -3 -42 40 -19 -14 43 -19 23 2 12 -7 -13 16 -6 30 20 7 -5 5 7 7 -10 -45 12 12 -5 -18 -21 -9 30
13041 30 -53 -25 -25 1 20 29 10 -2 -5 34 7 -10 52 5 11 26 -22 -10 22 31 25 -9 -27 -7 26 18 24 -18 -33 39 20 2 18 10
13075 10 -21 19 17 31 8 3 32 1 0 36 50 22 14 8 45 -13 3 1 -14 -8 27 -21 -14 -25 20 34 13 -43 5 28 3 35 -6 31
13109 31 -34 -40 9 29 -48 -34 37 52 60 -21 35 -7 32 -15 7 27 -4 71 33 5 -14 -5 -6 2 12 -19 5 35 -12 19 0 -11
13141 -11 -62 14 7 -17 36 -12 -2 -8 -30 9 18 -14 36 7 -50 -26 -24 -45 11 -22 -5 5 35 6 -2 -44 -26 -34 3 -19 -19 -37 36
13174 36 -37 -7 3 -6 15 8 14 -1 -5 15 -13 2 -4 -26 -25 -18 -10 -17 15 6 26 -62 48 -18 6 16 -19 -24 -5 -39 1 0 21 -9 -20
$$ packed form
12937B4m7L0l0M3Ko0M5k5N5p5J3M6l2L0jk5Ojk0K2k4qQJ1nN6n4Lj8M1nRj9J1k5
12972a9KJj6K7J2n2N5l3pK7kJ7o1N2j8j2j2K2OnPK7l9K8k2L4lj0rj8K2k2k1OK8
13007hlj1K9j1Jl9Q2n9NN7o2M2k1J0j9oK9k2L6j0j3j2J0K%j7l5N7%j7j3lJ2L9
13041C0q3K8%K6J9Rj9j2lL9k7j7O2m7OJ5m8J2L2Rol4j8K0L3qOm2j5P2j9j8J6q
13075A0l1M0kJ4k3nK9l1jL6J4k8qoL7n8J6kj5OL5m8Pj1M5J4k1n6M8K3k5L2m1L7
13109C1o5oM9K0p7J4P1J5Qq1N6m2L9m7K2K0l1P5l8k8j9RjQJ0l1K4L0m7L1j9j1
13141a1n1P6pk4N3m8J0ok2L9Rl2N0k9n7K4Kk1N6l3J7J0L0k9qm2J8qL7k2%j8P3
13174C6p3L0J0rK1pOj5mK0k8J5ok2JPQpL2rK0q8J10o6K4J0l5nJ9l4M0jK1l0j1
$$ plain form
13209 -20 2 -5 58 -33 -1 -35 -27 -45 -10 -9 -3 32 15 -7 11 5 11 -54 -10 -20 -28 -15 -28 17 -16 3 -6 -2 -11 17 -50 -28 -12 -10 -10 -4
13245 -4 21 -24 5 1 -29 -36 1 -42 -21 13 -36 18 -28 -30 -28 -21 -5 -6 1 -16 -3 -42 -3 -13 8 17 18 10 5 -10 -16 0 25 -8 -29 27
13281 27 14 -35 -16 -15 -14 22 -44 21 -13 -22 48 -47 2 -23 -10 3 -28 -7 -26 -25 -35 -4 7 -43 10 -28 -51 -25 -31 22 0 -31
13313 -31 -9 32 21 6 -25 -11 -23 34 9 -41 22 -13 9 -51 -39 -27 -42 22 -35 -13 7 -39 21 12 -9 -4 15 -11 18 1 -45
13344 -45 -5 40 10 -13 26 -6 -28 19 15 -38 3 3 27 28 -91 -42 -60 66 -42 -17 -25 -4 -13 -13 17 30 4 -1 0 1 -8 -8 -26 21
13378 21 -2 -31 25 -1 0 -6 14 -32 3 35 -43 1 19 10 -22 0 -41 18 18 -4 24 3 -48 3 -32 3 18 -36 1 22 -11 -6
13410 -6 26 -39 22 -12 -9 2 -19 24 -19 -30 13 13 -13 23 5 -25 -2 -14 -7 -11 24 21 16 -6 -2 4 1 2 -8 40 -6 -32 -9 -12 13 21
13446 21 -25 -22 30 -4 20 59 -18 11 19 7 25 -3 -22 11 29 5 9 46 -41 2 9 2 1 17 13 -17 -35 -17 3 13 26 53 -26
$$ packed form
13209b0K2pO3r1L2l4Qj8L5JOL5j7k2J8oOo5M4j0qJ3j3M5l3J9rMrK8o7K2J6K%O
13245dK5m5K9ml0pL7m3K1L4m9N4m6kKPJ6jPj7J3l9L9j0K1RJqnj5oJ6K5l3k1N6
13281B7j3m9J9JJL6o6O5l4rP0r5M9k5J3J3l1K1j9Jj0L1J1n0N3l8k3K6oN3k2l1
13313c1K2M1j1j5l1J4j2N7k5n0O3l5K2o0J2J2j5O4n7K2K0m6O0rk1NJ9k6K9j7m6
13344d5M0M5l0k3L9l2k2M7mn3M1%K4Jj19M9j8J26j08K5qK1r%L0J3k6nJJr%j8M7
13378B1k3k9N6k6JoK0m6L5L2p8M4J8rl2K2m1N9%k2K8k1n1N1l5L5J5n4L7K1l3N
13410fL2o5O1l4LJ1k1M3m3j1M3%k6L6j8l0K3j2PmL5lnk2MOlJj0M8m6k6K3lK5Q
13446B1m6LN2l4K4L9p7K9Qj2J8k8j9L3J8k4ML7q7M3PpjJ6ml0j8J8K0J0J3K7p9
$$ plain form
13479 -26 3 -26 -2 6 -45 -1 43 26 18 3 -27 26 9 7 2 4 -2 37 3 2 11 37 47 26 8 -22 14 -30 17 9 21 10 -20 -15 22
13514 22 -10 -48 -3 -3 -23 -2 -25 3 -30 8 -39 -9 22 16 1 4 -42 -30 -31 27 -74 13 33 30 20 -11 -27 11 3 -15 42 -25
13546 -25 -12 -3 1 26 -8 2 -18 -30 20 28 -19 -41 -29 9 -1 -11 -40 -27 5 -31 5 11 6 19 15 24 30 16 1 -10 -37 -16 -14 -14 -11
13581 -11 -17 6 -32 -14 9 20 42 -6 -25 -16 24 -33 -68 20 -27 -7 11 -14 -29 18 -41 -27 12 -10 -24 0 73 -8 -32 0 -1
13612 -1 7 13 17 -5 -12 36 -3 10 2 -6 67 -57 -2 46 -18 -12 -7 9 -17 -15 -26 -19 12 -25 -28 -13 -15 3 -9 -35 -20 26 15 -31 -38 -1
13648 -1 -34 -43 -13 -28 -14 17 5 30 -15 -23 -15 -40 -30 32 -6 -71 -46 35 -22 -10 18 6 -1 -9 15 22 25 -15 -28 30 -11 -24 -27 -5
13682 -5 -25 7 19 44 0 -9 -51 -17 -13 3 -10 -8 10 -13 -1 -33 -19 -43 -21 -18 -3 0 28 -33 -30 35 4 38 -1 -9 -10 -12 26 -9 19
13717 19 18 -2 -27 -37 38 12 25 -56 35 -6 42 16 38 25 0 10 11 -14 -7 -24 4 -2 24 -13 -23 14 -34 22 1 5 49 24
$$ packed form
13479b6K9k9K4Qn1M4M4j7qj5l0N3j7knKoL9l4jRK6J0k1j8l0L6m4M7qJ2j1l0NL7
13514B2l2l8M5%k0K1k3K8l3L8m7L0L1oj5Lm6J2jN8j01Q7K0lj0l1j6L8qj8N7o7
13546b5J3RMK5l4J0k0j2N0Qm7k2J2L8j0j0k9J3L2l6L6OnJ3mROj4j5j1k7K1K%L
13581a1oK3l8J8K3J1K2m8j9RM0n7l5Q8m7K0J8k5j5M7n9J4L9k2j4K4P3q1k4L2j
13612aQOMk2pM8l9J3qqP3j24N5M8o4ONJ6k6Kj1PL1l7lJ5kJ8j2k6J5M6j1m6pL7
13648al3rL0j5J4L1j2K5m5qQk5J0O2l8o5K5Q1n7J2K8j2pqK4PLm0j3N8m1j3lK2
13682ek0L2J2K5m4rm2L4MJ6j3KJ8k3J2l2J4k4K2LJ5LK8o1LO5l1L4l9qjkL8l5K8
13717A9jk0k5j0P5k6J3q1R1m1M8k6K2j3k5J0Jk5Pj7K8oK6l7j0L7m8N6k1MM4k5
$$ plain form
13749 24 -34 -36 -1 -12 7 -13 -9 -11 -44 -27 -9 16 -26 -35 -13 -35 39 4 24 21 -50 -35 -68 19 8 -16 -26 27 2 -41 -7 -24
13781 -24 -19 41 2 54 -40 7 -33 2 37 -2 13 17 -14 18 25 70 21 -10 -23 -16 -12 -17 5 -63 3 13 -15 -13 -7 3 38 23 16 20 -11
13816 -11 1 39 -10 40 2 -8 7 21 -1 23 -31 25 8 24 -53 -28 0 -23 28 -12 -6 -4 17 -20 32 -35 -2 6 6 -18 -14 -6 -33
13849 -33 11 -42 -24 -8 17 38 -7 24 58 5 1 -13 -1 30 16 -21 -17 23 40 37 37 31 14 -42 40 25 40 32 9 18 -6 -28 -20 28
13883 28 12 -12 24 5 16 21 38 -35 -11 -4 -33 1 -14 -44 34 -20 -1 33 18 -15 -18 23 -32 11 -3 5 37 -9 -14 -51 -26 -30 -16
13916 -16 -17 11 20 -3 -1 3 7 35 -48 -4 -30 -2 36 -28 13 44 1 7 22 -17 -8 -29 -5 18 -38 22 -5 8 8 -42 15 -51 -20 -20
13950 -20 -17 -10 -3 -10 7 -6 -9 12 16 11 4 30 -2 -11 32 -12 -50 37 -6 -14 0 -5 42 -24 -9 -55 -6 -21 1 -1 -11 19 -4 -9 41 -34
13986 -34 -33 15 -6 -26 -33 -19 -53 11 16 7 -54 -9 3 -12 -4 -43 1 20 -8 -13 -8 -2 -32 -12 -6 -32 33 11 -2 -55 4 -3 -22 -64 -34
$$ packed form
13749B4n8kL5j1J9k0Mkl3J7J8K5m2rK2k2P4l5K0lp1J5l3Q7j1k4j0N3k5m3L4j7
13781b4NO0l9N2r4M7m0L5L5l9J5Ml1L2PM5m9l1j3PMnK2o8O6J0k8KOJ0L5j5pMl1
13816a1J2L8m9N0l8j0J5J4k2K4n4N6j7J6p7K5K8k3N1m0OKK1l7N2o7L3Q%k4MQk7
13849c3M4n3J8J6K5K1m5L1L4n3mj4J2L1j4l7MM0J7l%oj7n6Q2j5J5qk3Rk4k2QM8
13883B8j6k4L6j9J1NJ7p3K4Pk9L4j5l0P8n4J9L4j5l3lM1n5M3j4QL2m6nl7K5mJ4
13916a6jK8Rk3KMMK8q3M4k6K8L8o4M1L1m3OJ5l9Rk1K4K3n6O0k7J3%n0N7o6L1%
13950b0LPPpJ7j3lK1MnpK6l2rM3m4l8Q7m3qJ4nM7o6J5m6M9j5K2kj0L0k3nN0p5
13986c4JM8k1k0pJ4l4O4Nro1M5J2j5Ql9M4J9k8nNOl0K0Ok6O5k2j3n3N9pj9m2L0
$$ plain form
14021 -34 9 -24 -20 -56 -2 -27 -54 -44 7 -7 6 -7 -22 -31 -2 -33 -11 -14 -42 -16 -16 5 -18 7 -32 23 -13 -43 -9 6 -57 -49
14053 -49 -40 -21 -9 -39 -27 -26 7 -3 -3 0 -20 -9 -11 -11 -26 26 15 -8 35 2 4 -31 -33 -8 -26 -24 -17 44 -38 -36 -6 -48 21 40 10
14088 10 -29 -4 -23 10 -55 -35 12 -3 -20 -41 -13 -3 -45 29 -38 19 -9 15 10 11 -4 -40 -24 -10 -54 0 -9 12 -7 20 22 23
14120 23 -20 -26 31 -7 16 28 -29 -14 18 -11 -17 -12 -4 3 -8 7 53 29 7 18 -30 26 -14 -3 -13 -26 32 -63 -33 -34 -22 35 5
14153 5 -18 -13 -9 56 -6 -2 -42 18 56 11 -36 -13 13 -38 -4 -4 -25 7 -10 -29 -72 38 -37 1 11 -11 -4 -17 49 -32 -7 -22
14185 -22 -65 -12 -29 1 21 -5 -43 -22 -33 15 32 -13 28 3 5 -4 -2 12 -57 19 -10 -50 -23 -22 -1 10 24 -42 -6 7 -9 21
14217 21 -11 -11 -6 17 -15 8 -6 23 -8 -7 33 12 1 40 -33 38 37 14 44 -12 13 5 -51 -31 -12 32 25 1 30 5 14 19 -18 -23
14251 -23 12 37 24 20 42 7 33 10 -11 31 -9 -32 27 -21 -19 6 -8 -39 19 7 -1 -13 22 -22 -21 -11 -20 3 -24 -15 -17 9 -20
$$ packed form
14021c4M3l3Ml6N4k5k7J0N1j4J3j3j5rK9l1K2lk8K6%K1k3K5l9N5l6l0L4J5o3Q
14053d9RJ9J2l0J2JL3j0%Lk0J1k%j5N2j1k3M3l3Kl5kK5j8KPO1q2KL0m2O9J9l0
14088A0l9K5j9L3o5K0M7j5j7k1K8J0m2P4o7N7k8K4nJj5l6J6J4m4N4rK1j9K7KJ
14120B3m3oN7l8K3J2n7J5L2k9oNQPj1J5M6k4k2J1m8N6m0J1j0j3N8r5L0jJ2N7l0
14153Ek3NMO5o2Mm0O0L8m5m7K3K6n1L4%k1L2j7j9m3J10p5L8J0k2Pj3O6q1K5j5
14185b2m3N3j7L0K0k6l8K1j1M8J7m5M1k5KrKJ4o9P6k9m0K7JK1J1J4o6L6J3j6L0
14217B1l2%NK3l2K3j4K9l1JM0k1j1L9p3P1jk3L0n6K5qn6K0J9M4pk4K9k5RNl7n
14251b3L5K5j3mK2l5K6k3k1M2m0k3N9m8KK5j4l1N8j2qj2L5m4JJ0rK3k7RkK6k9
$$ plain form
14284 -20 -15 7 -1 -12 0 14 -20 8 -29 12 43 44 10 7 43 -20 30 -15 4 23 31 1 -45 -16 -39 -7 8 22 2 -18 47 -34
14316 -34 12 -18 -25 37 11 -19 -17 -7 -5 -17 -8 20 -18 -40 -8 -43 2 -11 -36 -7 -2 -35 47 29 13 40 -24 -21 -31 -18 4 8 11 0
14350 0 6 -14 -13 -34 -5 -21 1 19 -5 21 -19 -38 26 6 4 0 -19 -49 -4 -2 -2 8 -19 47 -9 34 -20 -17 13 -13 -34 -37 -12 -16 8
14385 8 36 -28 2 56 -9 -10 -26 -30 -29 36 -18 -14 -1 31 -25 -2 -48 -21 -38 1 -22 5 38 6 -41 7 -49 -62 -5 -8 -52 6 -48
14418 -48 -13 19 -33 -6 -20 -6 -63 19 -37 54 -41 10 0 -21 11 -23 -42 -2 -19 -19 -44 16 -5 -1 -11 -50 -27 17 30 5 -34
14449 -34 0 -39 5 -30 6 -50 -36 -33 -31 6 26 -14 -12 -14 15 -42 -22 22 -37 -27 -25 -5 -10 30 -36 41 4 -26 -54 -7 -16 -5 -39
14482 -39 -10 -2 39 -30 -13 2 -41 -3 -15 8 -25 20 -17 -15 39 53 34 -39 34 -19 20 24 -38 28 -30 -19 -15 -31 14 -26 9 27
14514 27 -20 -33 19 -8 -33 12 -40 -13 21 -14 8 -18 -14 32 6 5 30 15 -15 64 30 -18 20 -43 -20 21 16 -24 -2 35 -9
$$ packed form
14284b0NK2qj1J2J4l4K8l7M1L1Jl4lL6o3N0m5J9J9Ql0m6K9k3L2J5J4k0k0O5q1
14316c4M6l0pO2k6l0KJ0Kj2RK8l8k2L2l5M5j3k5K9Nl3Q2j8j6K7o4Lj0J3K2MLj1
14350@Ok0Jk1K9j6K2J8k4K6m0j9O4k0kmj9l0M5K%J0k7O6n6M3n4LL0k6k1lK5mK4
14385HK8o4L0N4o5jj6mJO5n4MJ3L2n6K3m6K7j7L9k3K7L3l2m7M8n6j3N7lm4N8n4
14418d8L5L2n2K7j4J4n7Q2n6R1r5N1j0k1L2l4j9M0j7%k5O0k1Mj0l9K3M4J3k5l9
14449c4L4l9M4l5L6n6J4LKL7K0m0KkK9n7K0M4n9J0KK0nM0o6P7l7l0k8M7rJ1l4
14482c9K9QM1o9J7J5m3L8j2K3l3M5l7KN4J4j9p3P3n3L9Mo2O6n8J1Mj6M5m0L5J8
14514B7m7j3N2k7k5M5n2K7L4l5K2k6MM6k6jK5j5l0P9l4m8L8o3K3M1nm0K2L7m4
$$ plain form
14545 -9 -15 1 33 10 -27 -44 1 12 -32 1 -10 -13 -17 -48 7 -5 48 -14 -35 -12 27 -11 13 -30 42 -12 31 -4 -12 -35 11 3 33
14578 33 38 4 -13 43 25 0 24 36 20 12 -3 12 8 -19 -13 -27 11 38 4 -29 -20 -23 48 5 -19 18 -1 12 -37 3 -6 12 -23
14611 -23 22 23 25 37 -9 19 -12 21 -5 20 39 7 15 1 14 12 -40 -66 17 23 7 27 5 -28 3 11 34 -16 7 -5 -19 40 30
14644 30 -9 21 10 -17 21 10 28 -35 37 -7 -31 -27 6 -15 -6 4 -2 14 24 33 -5 16 -20 29 -4 15 0 17 63 -11 18 -16
14676 -16 1 -12 42 -8 -19 38 30 -2 35 -4 2 26 10 -3 -21 6 -43 29 26 53 57 -14 12 -9 27 14 -1 3 -5 -23 9 -3 -14
14709 -14 15 -4 -15 -10 -24 -13 10 19 -50 1 -4 -24 13 -30 -27 -46 5 -26 6 -40 5 -13 16 -4 -20 -18 -19 29 33 18 -54 -11 -13 -12
14743 -12 -25 -12 15 -10 7 -5 27 -30 -43 16 -44 18 -39 -65 28 -6 -8 -12 34 -22 4 14 -6 -18 -47 -17 -35 -20 -12 0 10
14774 10 -8 -17 -53 -17 0 -15 -1 3 5 -17 -56 -11 -28 2 17 7 -16 -34 -6 20 -10 30 -40 27 -10 25 -14 -13 -36 -9 3 -24
$$ packed form
14545ioJ6L2k3l7j7M5J1m4L3j1lml1N5j2N3o2k1K3L9l8K4m3P2n4M3l5qk3M6qL0
14578C3Nl4j7N6j8k5K4J2j6qj5J5mk7Oj4L8K7l4l3RlP1m3k4L7j9J3m9M0rJ8l5
14611b3M5JKJ2m6K8l1L3k6K5J9l2Qj4J3kn2k6Q3Oj6K0k2l3L1QK3n0K3j2j4N9j0
14644C0l9L0j1k7L8j1J8o3P2m4k4ML3k1RJ0oJ6J0Rl8K1l6M9l3J9j5J7M6p4K9l4
14676a6J7j3N4n0j1N7ql2L7l9OK4j6j3j8K7m9P2lK7Mp1K6k1L6j3j5Mqj8L2j2j1
14709a4K9j9j1Nj4J1K3Ro9N1nk0L7m3Lj9N1l1L2m6M5j8K9k0j6KjM8Mj5p2M3kJ
14743a2j3J3K7k5J7j2L2n7j3N9o0O2n7k6R3l4kmM6n6K6J0k0j2k9L0j8J5QJ2J0
14774A0j8rl6L6J7j5J4MKk2l9M5j7L0J5j0k3j8K8K6l0M0p0O7l7L5l9Jk3K7J2k7
$$ plain form
14806 -24 -31 -38 -13 23 2 -15 -10 12 -8 19 9 -20 -37 -7 32 -1 -43 20 24 -26 9 -27 -18 4 -5 2 12 -4 -45 -6 -19 9 12 -28
14840 -28 13 1 -42 -22 -60 20 58 -12 -25 -44 -8 -14 -19 -2 -25 22 -50 -20 12 -22 15 1 7 52 -10 -10 11 9 -30 9 -13 -13 13
14873 13 -23 -1 -8 -4 -3 -55 10 13 5 0 -4 3 -25 -56 -8 -33 -36 -20 12 -10 15 -59 -22 -27 -36 19 -7 0 -53 -28 -50 53 8 -20 -39
14908 -39 -15 -3 -11 16 27 -15 5 -49 -5 12 -12 -6 7 36 28 48 23 -38 -69 -38 17 -11 8 -1 -28 15 -51 8 -3 0 -25 -63
14940 -63 -10 -14 -19 -24 -20 22 -6 0 -37 7 27 3 24 -14 -14 -22 5 -25 -10 7 -3 30 8 15 -19 -31 6 -24 10 -19 -11 27 -20 2
14974 2 31 -41 17 12 21 13 79 12 -25 3 17 -2 4 16 -27 56 21 51 -6 21 -16 5 15 13 26 5 -6 33 9 45 1 7 42
15007 42 25 8 -1 38 35 19 26 -10 38 2 31 8 -14 10 -28 13 5 56 10 12 20 -31 4 -1 -2 24 7 17 -11 16 13 -45 -39 -10 20
15042 20 -16 -1 -1 -29 -15 22 -14 20 9 30 -14 40 9 -15 0 53 -8 -36 -13 -32 63 -3 31 -1 -48 7 -13 -38 0 14
$$ packed form
14806b4ppK5L6k1j7NK2k0K7j0k9j7L0L9l3m2O3Mn0L5l6RK2rPJ0j6m1L9j3K8Lm0
14840b8M1j2m3K0l8Q0L8p0j3j9L6onJ7k3M7p2L0L2l4L7j4OM5o2%K1kl9L9k2%K6
14873A3l6K2pMJn2O5LqnmPk8l1M8k5lJ6L2k2K5p4L7nrN5k6Pn3K5k2J03m5k8j9
14908c9K4J2qK7J1m2K0n4M4J7k4OJ3K9qK0k5o1l1L1N5k8J9rk7M3o6N9j1Lk5l8
14940f3N3mnnMM2k8Ol7M4K0k4K1l8%qK7l0J5J7j0L3k2Pl4j2L7l0L4k9QL8m7K2
14974BK9p2N8nRqO6o7l7K8J4j9OJ2m3Q3l5L0n7K7l7K1J0kJ3k1j1L9k4L6m4OL5
15007D2j7j7rL9lj6Pl6M8l6K9k3k2K4l8M1qN1m6KQn1L5njK6j7J0k8K7ln8OK9L0
15042B0l6J5%k8J4L7l6L4j1K1m4N4l1k4J5N3o1k8K3j9R5o6L4l2m7N5k0k5L8J4
$$ plain form
15072 14 -22 -1 5 -32 30 -37 29 -2 0 45 3 25 -3 29 11 -25 -2 27 26 13 19 -11 6 39 -14 3 6 18 14 18 9 -25 0 20
15106 20 -37 -46 -10 0 -12 -13 -31 31 21 -21 -7 9 43 37 -27 1 20 23 -32 24 22 -17 -1 6 16 -33 -21 36 10 -5 5 -21 -32
15139 -32 -14 14 3 -28 7 73 28 5 -13 15 15 -21 -7 4 0 -15 -29 16 10 9 27 -13 -8 -13 -28 -12 -8 25 7 18 0 32 30 -17
15173 -17 -36 -10 7 -21 24 -17 29 22 56 -26 -45 -14 5 5 5 -26 -2 -40 8 -18 -41 28 18 -34 -29 20 23 0 -21 -1 29 -11
15205 -11 -14 28 -25 6 2 -14 -23 -10 -23 -18 2 -4 -24 9 -37 27 26 30 -4 7 -1 -54 -38 -11 -19 -15 -49 -13 11 3 -27 -22 -5 0 -23 -7
15241 -7 37 6 0 -1 -22 -18 25 21 -33 -1 17 -9 -7 -32 -15 -14 -31 4 7 38 -3 -4 -15 -2 -23 20 -38 -26 53 -17 -21 -2 17 -1 -5
15276 -5 -5 -20 6 -26 -37 18 64 8 -32 -35 -19 4 35 -23 17 43 -20 -9 -2 -18 10 17 -56 -15 7 12 -9 -4 -10 13 4 36 33 -24 11
15311 11 31 -11 -16 -25 -23 1 -19 18 0 -23 -14 -15 49 1 0 -34 -5 -5 -17 -8 -8 -19 -3 21 37 -4 15 0 33 26 -18 15 -3 -8 30
$$ packed form
15072A4l6K1Ol7O2o7O6l1KM5m2K2k8L2j8l6K3K9jj3Ol0J7L3n3J7LJ2mMrl4K5K0
15106B0n7rL6J0j2jj8O2j0m2J4J6L4oo4K8J9Ln5N6kl9J6PJ0m9J2N7k6j5J0k6j1
15139c2J8K8j1l1L5O6m5k3j8K8%l6J4J1mj5j4M5ojJ8m0Nnj5J6ML3j8J1j8L2km7
15173a7j9K6J7k8M5m1M6pL4q2j9L1J9%%l1K4l8M8k6k3O9j0n2NM9Lk3k1K0L0m0
15205a1lM2n3L1mj6rJ3j3NK0ok0L3m6O4jMl4J1qn3J6K7qMl4L6K4ql0NJ7Nk3J6
15241gM4l1ojk1MM3mn4L2J8k6Kk5J7Jj7L5LL1m1jj1J3k1M3n8J2P9p0mJ9J9j8m
15276e%j5K6l2j1N5M6n6m0lJ6K3L1n8M0K6o3J1Pj6K8Pp3M1K2Nk1NoK3rL2ln7L5
15311A1K0m2nrKK4k0L7j8k3RjO4m8jl4K9%j2R%j1J6K4J6m1J9j5L3pm4L3j8nL8
$$ plain form
15346 30 44 7 9 -9 17 48 -6 16 -6 -24 29 5 -21 -60 37 13 13 29 14 32 -13 61 -3 7 -13 9 24 -18 -30 5 3
15377 3 -35 14 3 -37 5 -30 8 -7 -7 -18 -49 13 -12 -29 39 30 -6 -39 7 -6 -36 -33 -18 10 -12 -16 -8 24 19 -24 -7 -46 -7
15410 -7 -19 -16 -8 2 36 35 -24 20 10 14 25 58 25 -24 2 -6 3 -23 2 48 -15 8 -73 51 -29 35 -16 26 40 -29 -17 58 0
15443 0 19 -4 28 -14 33 7 -18 -6 -6 -3 -56 11 -15 -65 16 -26 -3 -6 -25 1 16 10 -14 -18 -30 6 -20 56 1 6 -35 -37 -36 43
15477 43 -48 -1 -35 -21 -4 -14 -18 -14 -29 7 -37 -27 -17 -12 -7 -11 -12 9 -28 -31 -2 -6 -3 4 -20 -29 31 -24 -33 27 17 -37 -40 19 14 -38 11
15514 11 -45 -55 5 -24 8 -29 -26 -35 -12 -34 -24 11 -3 3 -14 21 3 4 11 -25 -36 26 15 13 -10 -10 -22 4 -51 -15 -14 -8 -13 -35 -47
15549 -47 -36 -49 28 0 6 15 -35 -42 -6 5 -45 30 -54 -35 -10 -37 10 -35 14 -17 -2 9 59 -39 -36 -34 4 -15 -4 -19 4 -41
15581 -41 -15 -10 -29 -42 -13 -28 -28 -18 -18 20 10 -39 -33 4 -22 16 -43 5 -42 -49 -44 -20 -44 -13 -12 -6 -48 -20 -10 -12 17 3 19 -25
$$ packed form
15346C0J4l7Kj8K6L1n4K2k2j8N3k4k6l9R7k4%J6j5J8m5P4o4J0k0K2J5m2j2L5k
15377Cl8M9j1m0M2l5L8j5%j1l1O2k5j7O8rl6l3M6j3l0LJ5K8k2mQL2nm3J7l9L9
15410gj2LQJ0L4jn9M4j0MJ1L3l3m9K6qRk6K5M6o3K3q1J24q0O4n1M2J4o9J2P5n8
15443@J9k3L2m2M7k6k5J2%Ln3O7k6n0Q1m2K3lj9K6J5ok4mj2L6k6P6n5Nm1kJP9
15477D3r1M7l4J4J7j0mMj5L6m4J0J0NNmjK1l7lK9mLPk4rO0n5rO0j0n4lN9nn2M9
15514A1n6j0O0k9L2l7LrK3k2J0L5j4Oj7L5j8JPl6j1O2j1kk3%j2K6n5L6JOnk2j2
15549d7J1j3P7k8ORn0pL6J1n0P5q4J9K5k7M7m5M9l1J5J1N0r8LKL8j9J1j5K3m5
15581d1K6Nj9j3K9j5%J0%L8j0m9OL7k6L8n9M8m7pNK4k4L1JOm2K8J0kK9j4J6m4
$$ plain form
15615 -25 -31 -3 20 -12 -56 -1 18 -49 10 -5 -2 -12 -12 8 -18 -8 -7 -31 -14 -54 -2 -16 -17 -5 33 -11 25 48 -42 48 -1 11
15647 11 -36 -24 9 5 -39 22 5 39 -7 2 -5 -36 -6 -22 -36 -41 -29 3 12 -22 -14 -1 -16 7 6 -37 -15 -39 27 -9 -27 3 -51
15680 -51 28 -41 -15 -17 29 -18 -8 -13 -58 9 1 -18 -14 0 -38 10 -12 -51 4 24 -49 -32 -12 27 -26 -39 -4 22 23 -32 10 -9
15712 -9 -33 -12 -49 48 -25 -2 -29 11 0 1 14 -14 -16 33 -25 4 -34 27 -15 -45 7 20 -14 -11 27 -30 2 -10 8 -4 11 9
15744 9 -1 -22 53 -25 24 19 -1 -52 -15 0 -29 -1 0 -14 -62 -12 -2 14 -25 -53 15 3 30 39 7 6 10 4 13 -13 -28 12 -18 -18
15778 -18 -3 12 -1 9 -41 15 16 36 -34 24 37 -8 8 -5 23 -1 -10 29 5 -11 13 6 16 -2 12 20 81 -42 -2 -8 -13 40
15810 40 -46 23 15 7 25 -6 -2 0 -36 12 -14 10 -13 -37 -14 32 -10 11 21 -22 -20 6 2 53 6 -19 -30 38 -16 1 34 -8 14
15843 14 -17 -35 -23 7 31 41 6 -1 -7 23 -19 -10 -29 -9 -33 -6 -11 0 4 35 15 -2 0 24 45 1 10 35 -4 15 -14 23 36
$$ packed form
15615b5oK8K3l2m4N5J9o7N9j5Lj0%K0k6J0Jk4J7m0N2j4jJ2L8m4L6K3r0R0m9J2
15647A1m7J2L3mm4O1j7L4m6Rpl1L0j6j4nJ2L2Rl4QJ3j5K3jm3K2k4O6l6j8L0n4
15680e1P9o9K6kM6m7J0nm5O7qj9MJ4l8M8k2l9N5K0p3J7K0L9n3j3L5K6Jn5M2j9
15712ik4K1l7R7p3K3k7M0j1JJ3k8kM9n8K9l8O1m2l0N2J3l4LL8n7L2j2J8j2J5k
15744Ij0k1P5p8M9nk0n1L7J5k9K8Jj4m8N0J0J6l9k8O8j2K7Rl2jMoRk6j5M0l0%
15778a8J5J5j3J0n0N6JK0p0N8J3m5J6j3K8k4rL9k4j6K4pJ0j8J4QO1j23M0onN3
15810D0q6O9qqJ8l1MKl6M8k6K4k3k4K3M6m2K1J0m3KK6mN1m7k5j1O8n4J7L3m2K2
15843A4l1j8J2L0K4J0l5poL0m2Rj9K0k4K7nJ1ML1k0j7KK4K1m4RK5l9J9k9L7J3
$$ plain form
15876 36 11 25 23 -22 -51 11 26 2 -44 -27 -29 4 -9 0 -38 -8 -2 2 -13 -17 -26 -21 -5 -7 11 -9 -25 15 -25 -14 -39 0 -9 -18 12
15911 12 -5 5 -18 -33 0 -14 -7 -20 -46 -22 -34 -25 -27 11 -9 6 -3 -25 -28 -36 -12 -41 -38 -5 9 -1 -24 -21 -8 17 -40 7 -31 -4
15945 -4 -20 -35 -3 -33 -29 -4 -16 -19 -31 -43 9 -19 41 4 -3 -34 -13 -26 2 -29 0 -14 -23 -21 10 -20 -29 37 -19 32 -40 32 -55
15978 -55 13 -18 39 1 -59 13 -34 14 -27 -31 -8 3 -18 -57 27 -25 2 5 -42 30 5 -7 -6 -13 0 -20 -15 -22 25 -14 -22 -46 -7
16011 -7 1 24 -34 -27 -14 -45 -16 -13 8 34 -50 13 2 2 -8 -20 -29 4 -20 -17 -3 -5 -19 1 25 -11 -20 -4 -3 21 -10 -8 -20 -52 -9
16046 -9 9 -37 -12 -29 -12 -6 -42 5 -27 -22 7 -37 2 -42 -12 -17 -13 -31 -1 -12 -31 -42 -24 8 -11 -4 -22 -17 31 -2 6 -35 4 -13
16080 -13 11 26 -20 -10 14 -6 45 -56 18 16 -29 35 43 -64 7 14 34 -15 -17 -26 -29 11 -29 -10 -38 0 9 31 -59 0 -36 -17
16112 -17 -4 -4 13 -27 -40 9 -63 -16 -13 15 -11 -52 -4 2 -52 4 7 -62 -3 -20 18 -13 9 -39 -33 11 37 -46 -18 17 -13 34
$$ packed form
15876C6k5J4km5k9O2J5k4m6J7kL3j3Rl8L0OMj5mrNJ6kJ8k0j6M0m0J1k5L9rrL0
15911A2j7J0k3j5L3j4Pj3k6K4j2RkL8k0J5rk2lqK4k9LL3J4j0k3LJ3K5n7M7l8K7
15945dj6j5L2l0MK5j2lj2j2N2k8O0l7pl1K1j3K8l1K9j4rKL1l0rO6n6N1p2P2q7
15978e5O8l1N7l8o0P2m7M8m1mK3J1k1l9Q4n2K7Lm7P2k5j2JpJ3k0NpM7l9qk4L9
16011gQK3n8PJ3l1K9LK1K6q4O3j1%j0j2rL3k4LJ4kj4K0K4l6rJ6JK4l1Kj2l2M3
16046iJ8m6K5j7J7Ol6M7l2NK9m4L9m4L0nMj8L0j1j9j1J8L2j9Pj8NM8l3Qm1L9j7
16080a3K4J5m6J0K4k0N1j01P4km5O4Qj07P1PK0m9krlM0m0J9k8L8RK2r0N9l6J9
16112a7J3%J7m0j3M9p2M7LK8k6m1M8On4N6Lo9N9j7L8l1K2m8OM4K6q3K8L5l0M7
$$ plain form
16144 34 33 -6 -40 -28 17 -9 -27 19 16 -13 -23 -11 -19 5 -11 30 -13 -22 -49 -12 -22 -44 2 -14 -9 22 11 30 -24 -20 -9 34 -47
16177 -47 28 -51 -29 5 -42 -17 -15 22 1 -37 3 -36 -15 -25 -15 21 -5 -36 17 -39 -12 -26 -36 41 20 17 -24 -30 -39 -28 -8 -42
16209 -42 34 -3 34 10 62 -7 7 -24 -40 9 54 -17 17 -3 -16 -23 0 -15 1 30 -9 23 -37 28 11 5 -19 4 -31 7 33
16240 33 -18 7 10 7 15 -33 11 -16 -16 15 1 19 -32 26 31 -49 2 -16 18 -2 32 -24 -5 6 -44 10 4 10 18 54 -22 -26 -10 5
16274 5 -11 -69 -20 -19 56 30 13 -33 -41 15 -33 -40 47 14 -23 13 -11 23 -7 -34 16 -9 32 -22 -45 -18 3 -12 26 -38 21 -21
16306 -21 -22 -33 -42 13 4 -14 -16 -12 0 25 7 21 -83 25 -27 -14 -19 1 4 6 27 -56 16 27 1 -31 4 0 -38 -10 4 -23 32
16339 32 -23 -12 -39 7 -44 -9 -39 -39 1 -47 -6 -12 5 42 25 -29 -50 -6 -28 30 -15 -15 12 -40 -3 8 37 -32 -18 -26 -27 35
16371 35 -7 16 -18 -48 -18 -28 9 18 13 -35 -1 -36
$$ packed form
16144C4jl9l4J2M5k6j8M6lk9j0J2qK4j6M1m3rk7L7j0k2M6j6NL1j1J9n4MJ1M3q1
16177d7P5p9K2L4m7K5KL7k1l8M0l9K1j0J0L6k6l1N3n6K7j4j0P7k1lm1orJ1K0l4
16209d2P6l7L7k4N2o9J4l1j6M9M5p1L4k0j3pK3j5J6K9l9L2o0O5j7ok4K3l5L8K6
16240C3n1K5LlQm8M4k7%L1j4J8n1N8Nq0N1j8L4k0L4n6J9J1n0N4oOQL6p6mJ6J5
16274Ej6n8M9JP5k6j7m6qN6m8pQ7l3l7L6k4L4l0k7N0k5M1n4k3K7K1j5L8o4N9m2
16306b1jj1rN5rj8kMJ2K5j8J4j04J08n2J3nK0LKK1q3P2J1k6l2L5ml8K8J4k7N5
16339C2n5J1k7M6n1L5l0%M0m8M1oJ7L7j7n4k1M4k2N8m5%K7n2L7J1K9o9J4qjO2
16371C5m2K3l4l0L0j0L7Rnm8L4l5
16383c6
$$ Imaginary data points
##PAGE= N=2
##DATA TABLE= (X++(I..I)), XYDATA
$$ plain form
0 0 0 0 0 0 0 0 0 0 0 0 0 0 0 0 0 0 0 0 0 0 0 0 0 0 0 0 0 0 0 0 0 0 0 0 0 0 0 0 0 0 0 0 0 0 0 0 0 0 0 0 0 0 0 -1 1 -1 2 -2 4 -7 6 -9
62 -9 10 -19 29 -53 157 419 389 508 509 575 564 543 470 418 357 293 239 205 83 30 -78 -82 -117 -141 -172 -242 -200 -240 -258 -263 -260
93 -260 -285 -283 -304 -343 -342 -361 -398 -356 -325 -236 -236 -111 -15 39 157 183 292 348 446 454 464 495 425 456 322 297 196 80 48 -76
123 -76 -111 -158 -244 -287 -300 -277 -309 -287 -357 -304 -297 -298 -259 -288 -251 -287 -263 -222 -197 -167 -169 -150 -50 35 63 160 210 263 307 328 456
154 456 440 419 487 427 410 352 297 231 101 40 -25 -141 -204 -288 -343 -348 -355 -374 -391 -377 -350 -298 -251 -217 -164 -116 -102 -94 -50 -39 -31
185 -31 26 87 89 174 198 234 244 280 357 383 429 475 387 403 433 372 278 225 199 74 -5 -115 -139 -242 -323 -379 -361 -418 -417 -385
215 -385 -343 -344 -279 -250 -176 -99 -64 -1 20 75 119 202 202 194 198 191 228 269 257 238 288 317 281 289 300 273 252 190 163 107 39 -59 -92
248 -92 -129 -191 -288 -323 -412 -412 -414 -401 -421 -365 -316 -240 -180 -180 -66 0 61 48 132 183 227 245 314 233 235 248 257 251 167 203 171 226 158
$$ packed form
0@%%%%%%%%%%%%%%%%%%%%%%%%%%%%%%%%%%%%%%%%%%%%%%%%%%%%%jKkLmOj1J3j5
62iJ9k9M8q2K10K62l0J19JO6j1k1p3n2o1o4n4l4j22n3j08ml5k4l1p0M2m0j8nL
93b60k5Kk1l9Jj9l7M2L1Q9%J25R6N4J18K6J09N6R8QJ0L1p0L1j34k5j01j16l2j24
123g6l5m7q6m3j3K3l2K2p0N3PjL9k9L7l6K4M1K5L0kJ9J00Q5K8R7N0N3M4K1J28
154D56j6k1O8o0j7n8n5o6j30o1o5j16o3q4n5npj9j7J4K7N2M7L4N3M8J4QM4J1Q
185c1N7O1KQ5K4L6J0L6P7K6M6M6q8J6L0o1r4n3k6j25p9j10k4j03q1n6J8n7JL2
215c85M2jO5K9P4P7L5O3K1N5M4Q3%qMpL7M1j2j9N0K9l6QJ1k7k1o2k7n6o8r8l3
248i2l7o2r7l5q9%kJ3k0N6M9P6O0%J14O6O1j3Q4N1M4J8O9q1KJ3Roq4L6l2N5o8
$$ plain form
281 158 189 64 128 33 14 24 -74 -118 -145 -187 -250 -298 -375 -412 -387 -412 -413 -383 -376 -238 -291 -134 -170 -30 26 65 150 248 242 225
311 225 303 277 312 311 297 264 243 189 130 132 129 70 55 18 30 -56 -79 -53 -148 -166 -166 -217 -226 -231 -323 -300 -332 -323 -328 -296 -219 -166 -120 -39
$$ packed form
281A58L1j25O4r5j9J0r8m4k7m2o3m8p7l7K5k5jL0PJ38n3J57l6J40N6L9Q5R8oj7
311B25P8k6L5jj4l3k1n4n9Kln9j5l7J2q6k3K6r5j8%n1rnr2K3l2RnL2P7N3M6Q1
$$ [...]
16383h
##END NTUPLES=NMR FID
##END=
