##TITLE=1H_DE-80H_X3
 200.13MHz, d2o
 8 sc
 
 19ns.26.2.2025
##JCAMPDX= 6.0         $$ Bruker NMR JCAMP-DX V2.0
##DATA TYPE= NMR FID
##DATA CLASS= NTUPLES
##ORIGIN= UXNMR, Bruker Analytische Messtechnik GmbH
##OWNER= pz
$$ XWIN-NMR		Version 3.5
$$ Fri Aug  1 11:05:16 2025 Russian Standard Time (UT+4h)  Yarkov@DPX200
##.OBSERVE FREQUENCY= 200.1313
##.OBSERVE NUCLEUS= ^1H
##.DELAY= (6, 6)
##.ACQUISITION MODE= SIMULTANEOUS
##.ACQUISITION SCHEME= undefined
##.AVERAGES= 8
##.DIGITISER RES= 18
##SPECTROMETER/DATA SYSTEM= spect
##.PULSE SEQUENCE= zg30
##.SOLVENT NAME= CDCl3
##.SHIFT REFERENCE= (INTERNAL, CDCl3, 0, 14.3821)
##AUDIT TRAIL= $$ (NUMBER, WHEN, WHO, WHERE, WHAT)
$$ ##TITLE= Audit trail, XWIN-NMR		Version 3.5
$$ ##JCAMPDX= 5.01
$$ ##ORIGIN= Bruker BioSpin GmbH
$$ ##OWNER= Yarkov
$$ C:/Bruker/XWIN-NMR/data/yarkov2/nmr/H-C/1/audita.txt
$$ ##AUDIT TRAIL=  $$ (NUMBER, WHEN, WHO, WHERE, WHAT)
(   1,<2025-08-01 11:04:10.42 +0400>,<Yarkov>,<DPX200>,
      <created by zg, POWCHK disabled, PULCHK disabled
       configuration hash MD5:
       00 E9 B6 7A A2 85 ED C7 34 08 36 98 17 FE 4E 26
       data hash MD5: 16K
       9A 1D 24 92 5F 11 77 94 FD B6 D6 17 0E AA D8 08>)
$$ ##END=
$$ 
$$ hash MD5
$$ F4 3A 76 6B E2 2D 9C E9 4B 7F 23 81 10 3B BB CB
##$RELAX= 
##$RELAX= 
##$RELAX= 
##$RELAX= 
##$RELAX= 
##$RELAX= 
$$ Bruker specific parameters
$$ --------------------------
##$DU= <C:/Bruker/XWIN-NMR>
##$EXPNO= 1
##$NAME= <H-C>
##$PROCNO= 1
##$TYPE= <nmr>
##$USER= <yarkov2>
##$AMP= (0..31)
100 100 100 100 100 100 100 100 100 100 100 100 100 100 100 100 100 100 
100 100 100 100 100 100 100 100 100 100 100 100 100 100 
##$AQSEQ= 0
##$AQ_mod= 1
##$AUNM= <au_zg>
##$AUTOPOS= <>
##$BF1= 200.13
##$BF2= 200.13
##$BF3= 200.13
##$BF4= 200.13
##$BF5= 200.13
##$BF6= 200.13
##$BF7= 200.13
##$BF8= 200.13
##$BYTORDA= 1
##$CFDGTYP= 0
##$CFRGTYP= 5
##$CHEMSTR= <none>
##$CNST= (0..31)
1 1 145 1 1 1 1 1 1 1 1 1 1 1 1 1 1 1 1 1 1 1 1 1 1 1 1 1 1 1 1 1 
##$CPDPRG= <>
##$CPDPRG1= <>
##$CPDPRG2= <>
##$CPDPRG3= <>
##$CPDPRG4= <mlev>
##$CPDPRG5= <mlev>
##$CPDPRG6= <mlev>
##$CPDPRG7= <mlev>
##$CPDPRG8= <mlev>
##$CPDPRGB= <>
##$CPDPRGT= <>
##$D= (0..31)
0 0.7 0 0 0 0 0 0 0 0 0 0.03 0 0 0 0 0 0 0 0 0 0 0 0 0 0 0 0 0 0 0 0 
##$DATE= 1754031849
##$DBL= (0..7)
120 120 120 120 120 120 120 120 
##$DBP= (0..7)
150 150 150 150 150 150 150 150 
##$DBP07= 0
##$DBPNAM0= <>
##$DBPNAM1= <>
##$DBPNAM2= <>
##$DBPNAM3= <>
##$DBPNAM4= <>
##$DBPNAM5= <>
##$DBPNAM6= <>
##$DBPNAM7= <>
##$DBPOAL= (0..7)
0.5 0.5 0.5 0.5 0.5 0.5 0.5 0.5 
##$DBPOFFS= (0..7)
0 0 0 0 0 0 0 0 
##$DE= 6
##$DECBNUC= <off>
##$DECIM= 32
##$DECNUC= <off>
##$DECSTAT= 4
##$DIGMOD= 1
##$DIGTYP= 9
##$DL= (0..7)
0 120 120 120 120 120 120 120 
##$DP= (0..7)
150 150 150 150 150 150 150 150 
##$DP07= 0
##$DPNAME0= <>
##$DPNAME1= <>
##$DPNAME2= <>
##$DPNAME3= <>
##$DPNAME4= <>
##$DPNAME5= <>
##$DPNAME6= <>
##$DPNAME7= <>
##$DPOAL= (0..7)
0.5 0.5 0.5 0.5 0.5 0.5 0.5 0.5 
##$DPOFFS= (0..7)
0 0 0 0 0 0 0 0 
##$DQDMODE= 0
##$DR= 18
##$DS= 0
$$ [...]
##$SUBNAM2= <"">
##$SUBNAM3= <"">
##$SUBNAM4= <"">
##$SUBNAM5= <"">
##$SUBNAM6= <"">
##$SUBNAM7= <"">
##$SUBNAM8= <"">
##$SUBNAM9= <"">
##$SW= 18.0517328524113
##$SWIBOX= (0..15)
0 0 2 0 0 0 0 0 0 0 0 0 0 0 0 0 
##$SW_h= 3612.71676300578
##$TD= 16384
##$TD0= 1
##$TE= 0
##$TE2= 300
##$TE3= 300
##$TEG= 300
##$TL= (0..7)
0 120 120 120 120 120 120 120 
##$TP= (0..7)
150 150 150 150 150 150 150 150 
##$TP07= 0
##$TPNAME0= <>
##$TPNAME1= <>
##$TPNAME2= <>
##$TPNAME3= <>
##$TPNAME4= <>
##$TPNAME5= <>
##$TPNAME6= <>
##$TPNAME7= <>
##$TPOAL= (0..7)
0.5 0.5 0.5 0.5 0.5 0.5 0.5 0.5 
##$TPOFFS= (0..7)
0 0 0 0 0 0 0 0 
##$TUNHIN= 0
##$TUNHOUT= 0
##$TUNXOUT= 0
##$USERA1= <user>
##$USERA2= <user>
##$USERA3= <user>
##$USERA4= <user>
##$USERA5= <user>
##$V9= 5
##$VALIST= <valist>
##$VCLIST= <CCCCCCCCCCCCCCC>
##$VD= 0
##$VDLIST= <DDDDDDDDDDDDDDD>
##$VPLIST= <PPPPPPPPPPPPPPP>
##$VTLIST= <TTTTTTTTTTTTTTT>
##$WBST= 1024
##$WBSW= 4
##$XGAIN= (0..3)
0 0 0 0 
##$XL= 0
##$YL= 0
##$YMAX_a= 40495
##$YMIN_a= -25153
##$ZGOPTNS= <>
##$ZL1= 120
##$ZL2= 120
##$ZL3= 120
##$ZL4= 120
##$ABSF1= 10
##$ABSF2= 0
##$ABSG= 5
##$ABSL= 3
##$ALPHA= 0
##$AQORDER= 0
##$ASSFAC= 0
##$ASSFACI= 0
##$ASSFACX= 0
##$ASSWID= 0
##$AUNMP= <proc_1d>
##$AZFE= 0.1
##$AZFW= 0.1
##$BCFW= 1
##$BC_mod= 2
##$BYTORDP= 1
##$COROFFS= 0
##$CY= 83.5205535888672
##$DATMOD= 1
##$DC= 2
##$DFILT= <>
##$DTYPP= 0
##$F1P= 10.8118882576601
##$F2P= -7.23987719738617
##$FCOR= 0.5
##$FTSIZE= 0
##$FT_mod= 4
##$GAMMA= 1
##$GB= 0.15
##$INTBC= 1
##$INTSCL= 1
##$ISEN= 128
##$LB= 0.25
##$LEV0= 0
##$LPBIN= 0
##$MAXI= 10000
##$MC2= 0
##$MEAN= 0
##$ME_mod= 0
##$MI= 1.114404
##$NCOEF= 0
##$NC_proc= 0
##$NLEV= 6
##$NOISF1= 3.799351
##$NOISF2= 2.8
##$NSP= 1
##$NTH_PI= 0
##$NZP= 0
##$OFFSET= 14.38212
##$PC= 1
##$PHC0= -1355.992
##$PHC1= 6.59091
##$PH_mod= 1
##$PKNL= yes
##$PPARMOD= 0
##$PSCAL= 0
##$PSIGN= 0
##$REVERSE= no
##$SF= 200.129724274929
##$SI= 16384
##$SIGF1= 3
##$SIGF2= 2
##$SINO= 400
##$SIOLD= 16384
##$SREGLST= <1H.CDCl3>
##$SSB= 0
##$STSI= 0
##$STSR= 0
##$SW_p= 3205.1282051282
##$SYMM= 0
##$S_DEV= 0
##$TDeff= 0
##$TDoff= 0
##$TI= <>
##$TILT= no
##$TM1= 0
##$TM2= 0
##$TOPLEV= 0
##$USERP1= <user>
##$USERP2= <user>
##$USERP3= <user>
##$USERP4= <user>
##$USERP5= <user>
##$WDW= 1
##$XDIM= 8192
##$YMAX_p= 0
##$YMIN_p= 0
$$ End of Bruker specific parameters
$$ ---------------------------------
##NTUPLES= NMR FID
##VAR_NAME=  TIME,          FID/REAL,        FID/IMAG
##SYMBOL=    X,             R,               I
##VAR_TYPE=  INDEPENDENT,   DEPENDENT,       DEPENDENT
##VAR_FORM=  AFFN,          ASDF,            ASDF
##VAR_DIM=   8192,          8192,            8192
##UNITS=     SECONDS,       ARBITRARY UNITS, ARBITRARY UNITS
##FACTOR=    0.0002768,     1,               1
##FIRST=     0,             0,               0
##LAST=      2.2672688,     0,               0
##MIN=       0,             -25153,          0
##MAX=       2.2672688,     40495,           0
$$ Real data points
##PAGE= N=1
##DATA TABLE= (X++(R..R)), XYDATA
0@%%%%%%%%%%%%%%%%%%%%%%%%%%%%%%%%%%%%%%JlMmNpQj0J2j3J5j7J8j8J8j9K3
55A3k6K6k7L0l2L2l1K9k1KL3j10K99q83N438J8673l4842m356J5456j9008J386
76a7919L216l507J2932J0449J1552o875j5686K6417k978l5580K0810R144k3651
89a1676J2118n505k0090J5709L159q790O023J1167J6078j1900j5852J8682r880
102g57j7349J9575q408n013K7600j2995j7251J5776n96n723p52K963J5081o477
116E674o385R634j5821J267J7134k2894J339K5887j5771p920Q839o294M328K413
130A430r76R696j666M880L42k3115Q553J0610k4034P721J4901j2975O696J905
144C968j3111P379L031j517L181k048J2799m4j8138J1907K524j5832J3104o58
$$ plain form
0 0 0 0 0 0 0 0 0 0 0 0 0 0 0 0 0 0 0 0 0 0 0 0 0 0 0 0 0 0 0 0 0 0 0 0 0 0 0 0 1 -2 2 -2 3 -4 4 -6 6 -7 8 -9 9 -9 9 -10 13
55 13 -13 13 -14 16 -16 16 -15 14 -7 -5 28 -82 217 -666 4772 23445 -11397 -15753 -297 -19305 -17919
76 -17919 -14703 -18210 -5278 5171 16723 9848 -5838 20579 17601 -17979 2831 11975 -11676
89 -11676 442 -5063 -25153 -9444 -6285 -15075 -9052 2115 18193 6293 -9559 9123 -757
102 -757 -18106 1469 -6939 -11952 15648 2653 -14598 1178 582 -5141 -5893 -2930 12151 5674
116 5674 -711 8923 -6898 -5631 11503 -11391 -10052 15835 64 -7856 983 -5311 -983 1430
130 1430 454 10150 8484 13364 13706 -9409 -856 9754 -14280 -6559 8342 -4633 2063 3968
144 3968 -9143 -1764 1267 -250 2931 883 13682 13638 -4500 7407 9931 -5901 7203 6545
158F545j2937J3316m447j4643M888l30K161J940l029J3391r02j0174J0359p984
172a846p357J7305p684o118J6783n481o291L823o360L356J00m951Q156n385k967
187d917Q784j3796r75J4920j0490J454J1651q419K579K246q837N294J12p83P744
202F567o467K762O357j4796K137N976j1614P115M533q654Q131J99o501N964k743
217a034J856N886p427N072K285j1719N737n82r037J0777l92n705R325l843l208
232b009M427o676L158L506o362P524n89p002Q753m370m878J0864m437j263P521
247H167p437J70J504q491M232l27m750Q548l455k819Q548o803m23P821o645L527
263A367M923p138M508l47o295O143l269k317P410o261m45M810q813J965L097o638
$$ plain form
158 6545 -6392 6924 2477 -12166 -7278 -7608 -5447 -3507 -6536 6855 5953 -4221 6138 -1846
172 -1846 -9203 8102 418 -5700 11083 5602 -689 3134 -3226 130 230 -4721 3435 -1950 -4917
187 -4917 3867 -9929 -10904 4016 -6474 -5020 6631 -1788 791 3037 -5800 -506 -394 -1177 6567
202 6567 100 2862 9219 -5577 -3440 2536 -9078 -1963 2570 -6084 2047 2246 -4255 1709 -1034
217 -1034 822 6708 -719 4353 6638 -5081 656 74 -8963 1814 1422 -4283 5042 1199 -2009
232 -2009 2418 -4258 -1100 2406 -3956 3568 2979 -4023 4730 360 -4518 6346 1909 646 8167
247 8167 730 900 2404 -6087 -1855 -2182 -6932 1616 -1839 -4658 3890 -2913 -3336 4485 -2160 1367
263 1367 6290 -848 3660 3313 -2982 3161 -108 -2425 4985 -1276 -1721 3089 -5724 -3759 -662 -7300
279g300O613J880m233P599k448k873O456n527L94N163o988K681J727p877M545
294a88r27n198P236k359j863P119n256J03M849o467L450K847n759N639p27n165
310b666O173l863k316O743m978R10M845o722K334J104o906M556r53m047O719k848
326a915j129O551m951J338N152n748L387K065n945M193j551m499N227l509j249
341b583N475n408R72L488o761K994J822n218N716M36k978O251k464j239M531n236
357b02J074K699o466L161P82n751N181j025l708O377k545j617M992m345R89K797
373B393n005L915J024m321N483k031l453N646m416k429N034m690M90L355m352
388c357L252J100l542M468j899j859N298m678m28N682n280J091M078m953K622
$$ plain form
279 -7300 -687 1193 -3040 4559 2111 -762 5694 167 561 5724 -1264 1417 3144 -4733 -188
294 -188 -1115 -6313 923 -1436 -3299 3820 -1436 -1333 3516 -2951 499 3346 -2413 3226 2499 -2666
310 -2666 3507 -356 -2672 4071 -907 3 4848 -1874 460 1564 -5342 -786 -1739 -5786 933 -1915
326 -1915 -3044 3507 -1444 -106 5046 -702 2685 4750 -1195 2998 1447 -3052 2175 -1334 -2583
341 -2583 2892 -2516 -1544 1944 -4817 -1823 -1 -5219 497 933 -2045 4206 1742 503 5034 -202
357 -202 872 3571 -2895 266 1048 -4703 478 -547 -4255 2122 -423 -2040 2952 -1393 -404 2393
373 2393 -2612 1303 2327 -1994 3489 1458 -1995 3651 -765 -3194 1840 -2850 -2360 995 -3357
388 -3357 -105 995 -2547 1921 22 -1837 3461 -1217 -1645 4037 -1243 -152 3926 -1027 1595
403A595J345m613K671j575k255K939m147J030M327n364K915L858n396M180J730
418C240n203M270K16l056L017k064O35K228m825K725J231n645M220n58n366N908
434I73r76m241N027r67r04K738k570K093J185l304L902j462k992O108l521l650
450b561O377l388k748L659l473K39K105k815K105N2n37M033m037k91N833n502
466i49o94M857m823J002L199m658J466J748k232J087k150Q37K834n239J730L674
482A689n118L582K798n408M368K263n108J735O2j274Q92l165J689J591l965L550
498A81m0m453N991m99n511N424L76l268K850j211K04J857j940J922n72j737M518
515D092l635l524O180l045l452M823k529j031L357k859qJ629n06J954k256M04
$$ plain form
403 1595 2940 -1673 998 -577 -2832 107 -4040 -3010 1317 -4047 -1132 2726 -2670 1510 3240
418 3240 -1963 2307 2523 -533 2484 420 1055 3283 -1542 1183 2414 -3231 989 431 -4935 973
434 973 -3 -4244 783 -184 -1088 1650 -920 1173 2358 -946 2956 1494 -1498 4610 1089 -2561
450 -2561 3816 428 -2320 1339 -2134 -1895 210 -2605 -500 -448 -985 3048 -989 -1280 4553 -949
466 -949 -1643 3214 -1609 -607 2592 -2066 -600 1148 -1084 3 -2147 -1310 1524 -3715 -1985 1689
482 1689 -3429 153 2951 -2457 1911 4174 -934 801 863 -411 481 -2684 -995 596 -3369 181
498 181 141 -4312 1679 1180 -4331 1093 1469 -1799 1051 -160 44 1901 -39 1883 1311 -426 4092
515 4092 457 -3067 3113 68 -3384 1439 -1090 -2121 1236 -1623 -1631 -2 -508 1446 -810 -406
531d06M961m399p88M915m389K63L717n052Q23L042l511p2n1o4J786l110J001L188
549A854m010K204K189n164L858K634n213K553J769k707J122j486l01J437k635
564a896J661K22l308M405m69m827N143M74l814L585m10j473K473j708k02N56j247
581h35K521j917k336M877k611l071M435k296j484M091k638n82K878j514M74l12
597c20k91L224k514o84L899l527k05L280m494N23L276l687L41J396j594J256j244
614a365k00K597k428J347K344l754K582K069m653K445J749l255J846k72j742J714
630A024j859j1J059k428K439L63l517L635L29l402L396k84j929L251j225p56J812
647A897j713P74j04k274K734j089k546L330j840j661L389k204m43L047j925M05
$$ plain form
531 -406 4555 156 -632 4283 -106 157 3874 -1178 -355 2687 -824 -896 -947 -1011 775 -2335 -1334 1854
549 1854 -2156 48 2237 -2927 931 3565 -1648 905 2674 -33 1089 -397 -698 739 -1896
564 -1896 -235 -13 -3321 1084 615 -4212 931 1405 -2409 1176 766 -707 1766 58 -144 412 -835
581 -835 1686 -231 -2567 2310 -301 -3372 1063 -1233 -2717 1374 -1264 -1846 1032 -482 -8 -320
597 -320 -611 2613 99 -585 3314 -213 -418 2862 -1632 -1109 2167 -1520 -1179 217 -1377 -121 -1365
614 -1365 -1565 1032 -1396 -49 2295 -1459 1123 3192 -1461 984 2733 -522 1324 1052 -690 1024
630 1024 -835 -846 213 -2215 224 587 -2930 705 1034 -2368 1028 744 -1185 2066 841 85 1897
647 1897 184 958 854 -1420 1314 225 -2321 1009 -831 -2492 897 -1307 -1750 1297 -628 -223
663b23J217j704J822p22j321K894j852o00K874l060N5K466l427O39J612k536J557
680c09J2j424K318j235k72K544k284J031K006l284J545J172l109J956P6k055K193
697H81j070r61J866k035N44J365k519K105P46k452K631j79j941K683j072r86K306
714A912j905M9J270k423J274K23k366K376p22j698K726j666p54K596j920N18K038
731A528k114J557O45k118K031p72j545K413j895n32K135k611M46J483k553J394
747e08P04k087K237m62j143K417j382n7K169k082Q75J387k601J365K64k351J895
764F40o56j504K133j465l59J894k058Q34J374k190J852N15k057K463o24j292K299
781A799j541l81J675k097N61Q57k352J497R5j960K326p90j202K497j576j40K043
$$ plain form
663 -223 994 -710 1112 390 -931 1963 111 -489 2385 -675 -620 1846 -1581 -942 670 -1866 -309
680 -309 -297 -1721 597 -638 -910 1634 -650 381 2387 -897 648 1820 -1289 667 743 -1312 881
697 881 -189 -1150 716 -1319 -775 590 -1929 176 922 -1530 1101 922 -1019 1664 592 -394 1912
714 1912 7 56 1326 -1097 177 400 -1966 410 -312 -2010 716 -950 -1704 892 -1028 -510 1528
731 1528 -586 971 1616 -502 1529 757 -788 1625 -270 -802 1333 -1278 -832 651 -1902 -508
747 -508 196 -1891 346 -116 -1259 1158 -224 -281 1888 -194 681 2068 -533 832 1096 -1255 640
764 640 -16 -1520 613 -852 -1211 683 -1375 -541 833 -1357 495 1010 -1047 1416 792 -500 1799
781 1799 258 -123 1552 -545 16 873 -1479 18 113 -1847 479 -311 -1513 984 -592 -732 1311
798A311j969Q71J238k015J651J5j763K023j092j152K014j901k31J764k296Q27
814g05J089k038J739K64j498K168p91q63K160j695J36J597k174J017Q25k292J488
831D27j04j815J880r14r30J952j492K30J564j890J257R01j980K010o9j651K078
848A454r63j089J890j616k14J369j926P62M99j828J768l16j413K448j053o96K373
865A449j601LJ737j806Q07O52j704J421n32j349J838j446n61J877k036L20J614
882F83k124J046R66j666J601M4j018J766j039k04J527j941N62J128k405J240N99
899G65k162J536r6j483J738q26m08J464j294P41R11j813J690L74j914K014l51
916H86j575K013j105r89J552j407Q6P45j564J365p2j382K087q02r67K463j411
$$ plain form
798 1311 -658 213 1451 -564 1087 1102 -661 1362 270 -882 1132 -769 -1000 764 -1532 -705
814 -705 384 -1654 85 349 -1149 1019 228 -635 1525 -170 -34 1563 -611 406 1231 -1061 427
831 427 323 -1492 388 -526 -1456 496 -996 -766 798 -1092 165 1066 -914 1096 1027 -624 1454
848 1454 491 -598 1292 -324 -538 831 -1095 -333 166 -1662 106 -210 -1623 825 -228 -924 1449
865 1449 -152 -149 1588 -218 589 1241 -463 958 426 -923 915 -531 -1092 785 -1251 -931 683
882 683 -1441 -395 571 -1095 506 550 -468 1298 259 55 1582 -359 203 1331 -1074 166 765
899 765 -1397 139 43 -1440 298 -528 -936 528 -766 -25 886 -927 763 1137 -777 1237 886
916 886 -689 1324 219 -770 782 -625 -539 206 -1358 7 -65 -1447 640 -162 -1129 1334 -77
933g7m83K256j672J0J218j495P84Pj263J404r44p48J739j759k9J935k130N89J545
952H87j817R67P11j356J377l21n39J284j367K85J186k254Q99J001k347J309M44
969C49j888J610k15j012J468o72P8R85j367J257N53j871J738j12j693J888p07
986C89j459J792r54o13J069j145O46L48j288J546l23j032K095j013p48K358j439
1003B29n13J690j433K13O45j408Q75l03q22J289j234j60J703j804J92J893j846
1020g94O33J159j493J033K71r41J006o54j65J038j722N79J017k165J032O98k005
1037a473J486J95j464J507k57m44J103r22N04P63j516J250K27j735J698l93j564
1054a035J772p68j110J468j030O3P80j171R58K21j027J656n67r08K076j178o90
$$ plain form
933 -77 -560 1696 24 34 1252 -243 541 548 -715 689 -255 -1003 736 -1023 -1052 883 -1247 -658 887
952 887 -930 37 748 -608 769 448 -91 1193 -174 111 1297 -957 -58 943 -1404 -95 349
969 349 -1539 71 -144 -1156 312 -360 -282 703 -664 593 1146 -725 1013 901 -792 1096 389
986 389 -1070 722 -232 -845 224 -921 -275 73 -1215 331 8 -1024 1071 58 -690 1668 229
1003 229 -284 1406 -27 186 831 -577 298 -5 -827 462 -772 -932 771 -1033 -841 1052 -794
1020 -794 -161 998 -495 538 809 -132 874 220 55 1093 -629 -50 967 -1198 -166 532 -1473
1037 -1473 13 208 -1256 251 -6 -450 653 -269 235 998 -518 732 959 -776 922 529 -1035
1054 -1035 737 -31 -1141 327 -703 -640 140 -1031 -73 148 -879 777 210 -698 1378 200 -490
1071d90J837j334j80J079j405N05K53j171J054n35n79J433j213j28J766j644M55
1088b97J351j637Q81O80j357J050j44p41J066j096k0J034j627N78Q05j813J127
1105a60M70j649J524J4r48J348n70j03J067j241O60N72j534J192k3j497J516n31
1123A07j187J492q20l82J130j033L69O92j140J158jr83J564n92q31J667j070l99
1141b59J268j389J80O64j272Q02m7r74J280o41m74J488j120O6J355j339N60Q98
1159A046j367Q65K00j112J117n85o06J070j142jR98j482O87O45j424J193J71j116
1177h43J375l19m77J225r09O7Q75j318O22M10j403J071j19j216J288o38o63J365
1195C93j012P8J068j180O88N37j078J151j27q70J371p50o24J239j098l4Q46j291
$$ plain form
1071 -490 1347 13 -167 912 -493 12 265 -906 148 -387 -966 467 -746 -874 892 -752 -297
1088 -297 1054 -583 298 978 -379 671 527 -214 852 -244 -264 770 -857 -279 526 -1287 -160
1105 -160 310 -1339 185 199 -749 599 29 -74 993 -248 412 984 -550 642 619 -878 638 107
1123 107 -1080 412 -408 -790 340 -693 -324 368 -772 386 385 -598 966 374 -457 1210 140 -259
1141 -259 1009 -380 -200 464 -808 -6 -53 -1027 253 -388 -862 626 -494 -428 927 -412 148 1046
1159 1046 -321 544 744 -368 749 164 -442 628 -514 -515 483 -999 -312 333 -1091 102 273 -843
1177 -843 532 213 -264 961 52 119 994 -324 298 708 -695 376 257 -959 329 -309 -972 393
1195 393 -619 -541 527 -653 35 572 -506 645 518 -352 1019 269 -355 884 -214 -248 598 -693
1213f93N13L82j200J069k19p60J294o61k90J366j039J71J029j232N97M90j268
1230d51J009k43q70J065q16k86R68j129K18R22j295P96M89j110J116n3o98J220
1248H52o40k94R92j085K48O55j266O54K12j176J035l46p83J244o47l06J133r40
1266d58K87R04j137Q42K32r58J086l76p49J103q04l75R50j091J70O46j128P26
1284a30K46r52J071l17n00J278p57o2J041j085L14P42j287P88J05j083R67m39
1302f0o27J062q92o8R65j049L95O44j065Q72L34r95J109l27n63J022p02j74P88
1321F69j037L71M03j190P85Q5r95J109l05o22J098o43J2R60r46L88N59r24P43
1340E20m2q42R99n15n98J023r17k02R24j070L88N95r82P61P6o82J081m69k97J068
$$ plain form
1213 -693 -180 202 -998 71 -148 -908 386 -275 -565 801 -238 -67 962 -270 327 817 -451
1230 -451 558 315 -555 510 -306 -592 376 -753 -535 387 -908 -112 377 -733 383 330 -368 852
1248 852 212 -82 910 -175 73 728 -538 116 328 -848 187 -159 -942 302 -345 -651 482 -458
1266 -458 -171 733 -404 438 670 -288 798 422 -327 776 -28 -403 547 -544 -374 272 -856 -130
1284 -130 116 -836 235 -82 -582 696 -61 -123 918 -167 147 889 -398 390 495 -588 379 -60
1302 -60 -687 375 -517 -585 380 -669 -274 370 -695 177 511 -484 625 298 -265 757 55 -119 669
1321 669 -368 3 406 -784 1 86 -909 200 -105 -727 371 -272 -260 700 -246 142 701 -223 520
1340 520 478 -364 635 120 -478 545 -372 -574 350 -720 -332 263 -719 42 118 -564 517 48 -249 819
1360H19q32L9Q74j092L39M51j074O03N6q31Q35m93l56R58p98J19Q00j010O47M93
1380E47r24Q17O4p77R14l47n10Q44p53J7M59r27M39K56r52Q68r3p23J097m21l36
1401d41J002o78Q0P16q16M16K63q21P62k85o81R87p30l93R65q73R1P33r16M64
1421a55L57o85Q15j09m73R52o24j86Q99r19J30N93j024M61K75r14N82j26n01Q19
1441A67m96j45Q60p50K73O65r34O24L07q29P84j31o21P35n18k25N92q16K17M21
1461A80q31N69J27p79R87j70n63Q97l66k07P70o65J60M09p43N11n5o01O99m18
1481h9n07Q75n97k63Q36p04J47N75o58N20J37n90Q24j81m69Q15o65l4O67r12J50
1502a23N03r02M84J29o77O49k01l00O93n38J51O26p55M80L89q10N90J05p48O55
$$ plain form
1360 819 -13 26 900 -192 147 598 -476 127 183 -648 187 -306 -662 296 -502 -383 417 -593 54 547
1380 547 -377 440 504 -273 641 294 -216 628 -125 -108 351 -576 -137 119 -833 35 -58 -781 316 -105 -441
1401 -441 561 -117 -37 679 -137 279 542 -279 483 198 -483 504 -226 -619 346 -527 -436 297 -619 -155
1421 -155 202 -483 332 223 -250 702 78 -108 791 -128 2 595 -429 32 307 -607 -25 -151 -652 167
1441 167 -329 -474 386 -364 -91 574 -360 264 571 -258 526 395 -226 509 -9 -234 358 -458 -241 180
1461 180 -651 -82 45 -734 253 83 -480 417 51 -156 614 -51 109 518 -225 286 231 -370 329 -89
1481 -89 -596 279 -318 -581 255 -449 -302 273 -385 135 272 -318 506 325 -144 671 6 -28 639 -273 -123
1502 -123 380 -522 -38 91 -586 63 -138 -438 255 -283 -132 494 -261 219 608 -202 388 493 -255 400
1522D00l37l86O06n47o4N50q07L88L03p53O64P0n98Q84k48l27Q03n73pN73o64
1543g0K26J97p50O65k50n22O78l37l93P36n86J9O79o75L22L95n62N76J1n17P11
1564E53m36k11O21o43o9N30q05L32K67p44N15J03n11O25k60j82P39n85K00N30
1584E69p62M62K06o97M83j7n98O15l81k82O11n92J24M31o45M29K11n79O97j29
1604A56m17Q00l90k27O01n91P1L55o07L46J20o77N22j49n01P54m10j37O60n75
1624b96K13M88n99L77K07n27M59n9m53O66m76k57N97p11R6M22o39L13K21n00N33
1645G5o6m20P85l98ON11n91K95K15n93M02P0o04N12k14l72N86m85r1N18n50K77
1667a32L74o03N01J12n27O95j61l83N76l86j39M70n24R6K09n53L32O3m95N65k76
$$ plain form
1522 400 63 -323 283 -264 -328 222 -585 -197 106 -647 17 87 -511 373 125 -202 601 28 21 594 -70
1543 -70 156 353 -397 268 18 -504 174 -163 -556 180 -406 -387 292 -383 -61 334 -228 348 359 -158 553
1564 553 117 -94 527 -116 -185 345 -460 -128 139 -605 -90 13 -498 127 -133 -315 424 -161 39 569
1584 569 -193 269 475 -222 261 244 -354 261 -120 -402 209 -383 -259 172 -473 -44 167 -412 285 156
1604 156 -261 539 149 -78 523 -68 3 358 -249 97 217 -460 62 -87 -588 166 -244 -381 279 -296
1624 -296 -83 405 -194 183 390 -137 322 263 -190 476 0 -257 340 -371 -275 147 -492 -179 42 -458 75
1645 75 9 -411 374 -24 -18 493 -98 197 412 -181 221 291 -313 199 -15 -387 199 -286 -377 141 -409 -132
1667 -132 242 -361 140 252 -275 420 259 -124 452 66 -73 397 -127 -31 178 -375 -43 20 -475 90 -186
1688a86k04O14l67o1N58n26L08K74n39M17M5m98N09l03k72M76m63q1M58n78J80
1709b39L52n79N31M4m28O21k18k66O05l50PL68n62K03K25n91L98n6m50M70k57
1730a72k45N62m31M1M46n05L40K60m80M45L2m78N94k24l02M80m64J0L06n42J82
1751a45K16m55M13p6l74N56k19j43N78l62lM42m88K22K08n41M31p9m45M92m01
1772a73j53N17n05O4L52m67L56J50m46M84k0l29N00k26j69N06m87M8L76o39K82
1793B1J85o07M78j17m13N54l21q6N57n01K22L37n10L50J80m82N11j23l39M05k74
1814B7k15M35m93P1K75m92K82J46m85N62j42k96O39l41l2M41m24Q5L11m67K87
1835A74M7m45L50r0l30M69l88r8M83m42J05L32m55M29K1k92M36j11k60M12l68
$$ plain form
1688 -186 -390 224 -143 -204 354 -172 136 410 -129 288 333 -165 344 41 -231 245 -218 -299 159 -419 -239
1709 -239 113 -466 65 109 -319 302 84 -182 423 73 80 448 -114 89 314 -277 121 65 -385 85 -172
1730 -172 -417 145 -286 -245 201 -304 36 296 -184 261 293 -185 409 185 -117 363 -101 -91 215 -327 -145
1751 -145 71 -384 29 -47 -421 135 -84 -227 351 -11 -14 428 -60 162 370 -171 260 181 -264 228 -173
1772 -173 -326 191 -314 -250 102 -365 -9 141 -305 179 159 -170 330 104 -65 441 -46 2 378 -261 21
1793 21 206 -401 77 -40 -453 101 -220 -306 251 -250 -28 309 -201 149 329 -153 358 235 -104 301 27
1814 27 -188 247 -246 -175 100 -392 -110 36 -449 113 -29 -325 314 -27 -59 382 -42 43 354 -113 174
1835 174 221 -224 126 36 -294 175 -213 -311 172 -270 -165 167 -288 141 162 -130 306 195 -65 347 -21
1856b1j0M22n73J73J84m69K46P7m57M75j39k50N04k63l8M36m05K20J75m27M07
1877B67rl80L89j96k70M17l73j20L95m48J70K33m74M36Ol25N81k51j91N22l33
1898D6J9K88m73J62K10m81L08q6l36M37k39k02M62l89O2L85m01K17K72l83L56
1919B34Jl89M67j72k40M38m40k8L33n26K23J19l55L17l9k33M43k06j30M27l51
1940a07J62K25l50K05J55m43K96n6l23M17k56j57M14m46Q0L05m51K59J49l39L93
1961A32j8k98M87j90j37L37l66L5L01m78K18Q7l69K79l4m40O15l54nM18l75J11
1983d4L11m39L04J33l70L26n9l13L91k83j01L96m30J01J61m23K91Pk76M31j11
2004Cj98M89k55p6L97m52J56K71m17K54Jm11L78j33l48M53k68q6L42l70J75K51
$$ plain form
1856 -21 -31 391 -182 -9 175 -294 -48 29 -428 47 -92 -342 162 -101 -139 297 -108 112 287 -140 267
1877 267 258 -122 267 71 -199 218 -155 -275 120 -328 -158 75 -399 37 43 -282 299 48 -143 379 46
1898 46 65 353 -120 42 252 -229 79 -7 -343 94 -145 -347 115 -274 -212 173 -228 -11 261 -122 234
1919 234 235 -154 313 141 -99 339 -101 -129 204 -322 -99 20 -335 -18 -57 -290 153 -53 -183 244 -107
1940 -107 55 280 -70 135 290 -153 143 87 -236 181 -75 -232 182 -264 -184 121 -330 -71 78 -261 132
1961 132 114 -184 303 113 -24 313 -53 -18 283 -195 23 110 -259 20 -14 -454 161 -193 -198 220 -155 -44
1983 -44 267 -172 132 265 -105 221 162 -151 240 -43 -144 252 -178 -77 84 -339 -48 -41 -317 114 3
2004 3 -195 294 39 -37 360 -92 64 335 -82 172 173 -238 140 7 -341 112 -156 -242 100 -270 -95 156
2026A56m17L39J40l86M17j53j48M15l38p0L57m45J02K09m32K08P3l24L27j03j93
2047b66L72k68J5L60l63K69J63l80K89K0l57L80k26j67L50l44nK89l79J41K36
2068A29m74L04J18l02M10j67j08M07k97QK70l42Q6J54l81K91p3l20L84k11k01
2089c15M19k73k3L54l86J72K65l57M00n4l49L97j15j87L10l59j4L58n30K19J37
2110F9l78K78J0k39L74j62j04M08l55R6K82l44K06N9k94K47q4k67L46k45j26L65
2132A42l18J8K17l44K07K11l47L68o9k38L78j46r7L04l04K5K36l94J84L2l64L77
2154G8r8l02L97k30k9L60l10J24J81k99K46J30l49L07j50j10K75k71j07L45l57
2175a69N0K20l42J93M6k79L49o0k28M07j88r6L84k35nK67m21J65O1l37L16j07
$$ plain form
2026 156 -261 78 218 -168 249 96 -52 363 25 -45 312 -133 -31 178 -254 -46 27 -297 30 -73 -266
2047 -266 106 -162 -147 213 -150 119 282 -98 191 211 -146 234 8 -159 191 -153 -158 131 -248 -107 129
2068 129 -345 -41 77 -225 185 18 -90 317 20 28 298 -44 42 196 -185 106 33 -287 97 -114 -315
2089 -315 104 -169 -192 162 -224 -52 213 -144 256 202 -147 250 135 -52 258 -101 -115 243 -287 -68 69
2110 69 -309 -31 -21 -260 114 -48 -152 256 -99 -3 279 -65 141 200 -94 153 69 -198 148 -97 -223 142
2132 142 -176 -158 59 -285 -78 133 -214 154 85 -153 225 79 -18 286 -18 7 243 -151 33 65 -299 78
2154 78 -20 -322 75 -155 -184 176 -134 -10 171 -128 118 248 -101 206 56 -54 221 -50 -157 188 -169
2175 -169 -119 101 -241 -48 -2 -281 68 8 -220 187 -1 -97 287 52 47 314 -107 58 119 -218 98 -9
2197ik31L33k26j4K24l31K14J75k64K23K3k16L15q8j68L18k70l4K45l24P2K06
2219A73l78J83P9l75L36p6j52L62k41JK78k64J43J32l05L13m8l07L45j93j76L89
2241B19l50p1L35l70J35J74l13K83K7k49L10o5j28L09k53j2K76l76J47P7k80K38
2263F3k6k02K09j28j93L68k53K3K85l15J61J68k88K29K2j97L27k77jK24k64k6
2285i1K28k87J23P2k90K85k6j93K97j76r6L28k17Q4K03l02J97Lk53K43k7k54K49
2308A00j83o8K34k65O6K33l58K25J08l03L37q1j50L17k04p1K76k28lJ73k89J25
2330iQ3l05K39k3k23L17j49o8L12l44J14J94l12K52P9k29J93J9k37L27k61o4K60
2353A65l23RJ66j93J80J6k31J99j5j46L45j68q7L08k78J43Q6k54J74M5k77K13
$$ plain form
2197 -9 -240 93 -133 -147 77 -254 -40 135 -129 94 117 -99 216 128 -40 278 8 -26 219 -105 -33 173
2219 173 -205 -22 57 -318 18 -58 -210 152 -89 -88 190 -74 69 201 -104 209 161 -146 199 6 -170 219
2241 219 -131 -202 133 -237 -102 72 -241 42 69 -180 130 65 -63 246 -7 -19 257 -119 28 105 -175 63
2263 63 37 -165 44 -84 -277 91 -162 -139 146 -169 -8 160 -128 101 123 -74 253 -24 -25 199 -65 -91
2285 -91 137 -150 -27 45 -245 40 14 -179 118 -58 -154 174 -43 41 244 -58 139 142 -111 132 105 -149 100
2308 100 -83 -151 83 -182 -116 117 -241 -16 92 -211 126 45 -105 212 8 -63 213 -15 -18 155 -134 -9
2330 -9 74 -231 8 -15 -238 79 -70 -138 174 -170 -56 138 -174 78 157 -72 121 140 -97 230 -31 -95 165
2353 165 -158 -149 17 -176 4 20 -211 -12 -27 -173 172 4 -83 225 -53 90 176 -78 96 141 -136 77
2375G7q1j63K18j27n6K35k97J32J54k18J39J06k61L09m0j45J45j34k5J86k40J40
2397E4Q3k94J24K7k09K03o7r3K39j67M8J98k12R3J34k37J41R1k93K62r6o5J87
2420A51k97N4J51k57J41J35k54K19kk29L11j10p8K39j85J7K07k91J37O0k89K65
2442I5j0k53J81p7r8K25j93L9J70j92J22J20j98J81J0k08K96j29j28K17k41J0
2464f1J85k68J11R7k31J64J3j42J78q5j20K93j74NJ98k37J61R1k69K22n9j84K12
2487A00j48q4J68j84O5J76l02J97O1j86J93j0j91L26j17j08K43k80Q4J50k80J48
2509B1M4k52K01p5j57K90j94j0K46k25J07J03j82J80J3j80K60j13j41J96j36k0
2531b4J29k09N0R0j80J09%r2J47K9j21J65j02rJ40j35P2Q8j62R5n2j32J58r4j43
$$ plain form
2375 77 -4 -167 51 -76 -132 103 -194 -62 92 -126 13 119 -142 167 127 -18 127 -7 -32 154 -86 54
2397 54 137 -157 -33 -6 -215 -12 -79 -172 67 -100 -52 146 -66 27 161 -76 65 156 -137 125 29 -36 151
2420 151 -146 -92 59 -198 -57 78 -176 43 41 -188 123 13 -65 174 -11 6 213 -78 59 119 -170 95
2442 95 85 -168 13 -64 -162 63 -130 -91 79 -113 9 129 -69 112 122 -86 210 81 -47 170 -71 -61
2464 -61 124 -144 -33 64 -167 -3 10 -132 46 -39 -159 134 -40 -35 163 -74 87 178 -91 131 72 -112 100
2487 100 -48 -132 36 -148 -83 93 -209 -12 49 -137 56 46 -145 181 64 -44 199 -81 3 153 -127 21
2509 21 65 -187 14 -61 -218 72 -122 -132 114 -111 -4 99 -83 97 110 -70 190 77 -64 132 -4 -24
2531 -24 105 -104 -54 36 -144 -35 -35 -127 20 49 -72 93 -9 -18 122 -13 59 147 -15 80 28 -104 54 -40 -183
2556a83K61j44r6K03j77R7J25j69J22j7j00K17r0j01J31n1j03K46j43k3P2j86
2578a09J18K5k00K22j25j12K68j90rK26j91J41P0k45K43n5j53J95p5j50J76j12
2600d2n9J18j65J03J3j23J29O5k24L20j30p3J79j11J5J41j80K4R0k31J81n4n9
2623g3P0l8j41K70k13J25L3j01O3L7q9J26J0j12J99j71j8J85k00k1J38k26J26
2646b1M0j45J22Nj06J09k3n1K05j78L9J39j66N7R4j53J58j15m2R7j01o1J82j88
2670a03L1J49k52J60Q5k04K10j6p0K01j78KJ90k40M5P2j19J8Q8j79J07lj45J57
2694Fn7m0J78j70P5J00j22O2L5p3R8N6j99J61j14k5J37k10P9J35k53J86jk20K49
2719G3r2n7J88r6K0R3j53O3K3n7O1J8j79J64q8r0K19j81qJ27j37M3P7j56J37N6
$$ plain form
2556 -183 78 -66 -162 41 -136 -39 86 -83 39 22 -78 139 49 -52 79 28 -75 171 28 5 77 -109
2578 -109 9 34 -166 56 -69 -181 87 -103 -112 114 -77 64 134 -111 132 77 -76 119 44 -106 70 -42
2600 -42 -101 17 -148 -45 -32 -155 -26 39 -185 135 5 -68 111 0 15 156 -24 0 90 -141 40 -14 -73
2623 -73 -3 -41 -182 88 -125 0 33 -68 -5 32 -57 69 79 -33 166 -5 -23 162 -38 -59 79 -147 -21
2646 -21 19 -126 -4 1 -105 4 -19 -70 135 -43 -4 135 -31 26 120 -33 125 10 -32 65 -36 -97 85 -103
2670 -103 -72 77 -175 -15 70 -134 76 60 -10 191 13 15 205 -35 10 82 -37 -19 69 -110 -3 -6 -151 6
2694 6 -51 -91 87 -83 -8 92 -30 32 67 -6 92 148 -51 110 -4 -29 108 -102 -23 112 -141 45 44 -176 73
2719 73 -19 -76 112 16 36 129 -24 39 62 5 66 84 -95 69 -19 -109 110 -71 -79 48 -89 -46 31 -125 12 68
2745F8j56J98n3j11J86j43n8J84j16nO9j90J06K9j35J95j20m7J59r7JJ26j48J74
2769A16r2o9Q8mp7J25j01l2J19j72Q5N6j44K4R9j67J01Nn7J80j06rJ72q5p7R6
2795G4r8M8N8j58O3J7r1J42j09l4J20j83J19N6o7P8k8j06J80l2j54K58j14j23
2819h4J82j63J9P7j45J05N2j42J22p4r7K04o7q6K37j68L1P0q7J00N3j65P9m5o3
2844e5J01n2o1J06j23L4J18j91J44L4j15J05J8j74J91j12M3J45j41qJ19j87K7
2867c4L9j20J08Mj72K12q9k4J68j83J02Qk6J6P2j10P0k1n1J16q7l9L3q3N4M8j37
2894a26J34Jj84J80J5j36J79q2lJ00j09M5Q8j66J17Qj02N2o3j9J07r1m6J00j45
2919a46R7J64j97J49j9j11J54j17m9J46r6M0J08j91P5L5p9J9nq5J46n5q1J69j68
$$ plain form
2745 68 -88 110 57 -54 132 -11 -69 115 -1 -6 63 -127 -21 8 -127 68 -52 -99 60 -37 -36 90 -58 116
2769 116 24 -45 43 39 -38 87 -14 -46 73 -99 -14 42 -102 -78 21 -146 -45 -40 -97 83 -23 -32 140 55 -22 74
2795 74 -24 24 82 -76 -13 4 -87 55 -54 -88 32 -151 -32 24 -43 35 7 -99 81 49 -105 153 39 -84
2819 -84 98 -65 -46 31 -114 -9 43 -99 23 -51 -148 56 -11 -97 140 -28 3 73 -14 86 139 -26 53 8 -55
2844 -55 46 -6 -67 39 -84 -50 68 -123 21 55 -60 45 63 -111 80 -32 11 156 15 7 126 -61 -34
2867 -34 5 -115 -7 -3 -175 37 -52 -76 92 -91 11 19 -7 9 81 -29 41 20 -31 85 -2 -41 -8 -91 -37 11 -126
2894 -126 8 9 -175 5 20 -116 63 -19 -22 78 -31 14 102 -64 53 61 -41 11 -52 -71 36 -55 -101 -1 -146
2919 -146 -49 115 -82 67 48 -63 91 -26 -75 71 -25 15 123 -68 7 42 -37 -18 -23 -108 38 -17 -98 71 -97
2944i7R5J02j70N6J02j43J36mj08P6J6j64J38q9rQ6j58J16op6J16k3p6J73p7l5
2970b3J16m7j9O5q2j3O5o5J4Lq5L2j6m8J20n4j8J03q7N3N3j10P0K4r6J80j12l7
2998a4J18r0n7J45j70J9P5j03J01o7k9J17j14j2J89j54N5O1j48J66lj07P7J1j12
3023d6J03j03oQ6j34L5Q5j16Q3J2p0J18K6j30J07pm6R7j03L8N7r4L4pj34J40q0
3050e5j9P6p1J3J37j20L2J4o7P2P2j51J69o3j26J91p6p1J27j68N8K8j19J03O3
3075D9j35J25j9r2J44q8k4J42j03J8L9j12J18K2j56J19m7l8N1k6k5O8j31M7J20
3100F6j04L0P9j41J09J2p7O4p1J8J00q5K7l4r5R9l6rR0kj15J07o7J9P8r2P1N1
3128I2j12P2K0o3Q2j22J6J10j10nJ9p0Q7K5p1J00m6o7Q3j5r0J40m0j14J34l0L8
$$ plain form
2944 -97 -2 100 -70 -14 88 -55 81 77 -31 45 61 -103 35 -54 -63 23 -135 -19 -25 -101 15 -8 -84 89 12 -23
2970 -23 93 46 27 92 10 -3 62 -3 11 14 -71 -39 -55 -103 17 -37 -55 48 -39 14 67 -43 27 51 -45 135 23 -14
2998 -14 104 14 -43 102 -68 -49 26 -77 24 -43 -72 45 -69 -81 108 -46 9 70 -78 88 85 -22 55 66 -46
3023 -46 57 -46 -52 34 -100 -65 20 -96 -13 -1 -71 47 73 -57 50 43 -3 94 -9 29 86 -8 26 19 -115 25 -55
3050 -55 -74 2 -69 -56 81 -39 -7 7 -60 12 84 -67 102 39 -87 104 28 -43 84 -84 -26 2 -117 -14 49
3075 49 -86 39 20 -72 72 -16 -40 102 -1 17 56 -56 62 84 -72 47 0 -38 13 -13 -38 30 -101 -54 66
3100 66 -38 -8 71 -70 39 51 -26 38 -33 -15 85 0 27 -7 -102 -3 -39 -48 42 40 -75 32 -35 -16 62 -30 41 92
3128 92 -20 52 72 9 91 -31 -15 95 -15 -20 -1 -71 16 41 -30 70 24 -43 40 25 -65 75 35 -79 55 25 63
3155F3m0n4N0oj09Q1J2j03J28j01O6L4p4K4M4k2Q6J5o2J0m6rQ6o0k2O9r5oR8j53
3185i6R8l3PM4n1kP3n2k0M6l0L5K7n7P0j5j18J76j05j17J87j54P8N9j68Q2J3j3
3213c6K9M5q1J34p6j3O9j40J10L6p7l8R3r9O4p4n9J49p4kN7m5k0J02j13R9L3j07
3241c4J26r2p1J11o8kN5k7Nrj2rK1j07J47m6p6J78j26L9P3j37P8Q0j44J02K1j20
3269d4N6j0m4M3n6j8J03n7nJ17j84J04P5j32J88p0j20J04j6n9P9o6k9J37j83J03
3295A6K4j38J23m9j03J79n5J0N3q3K7K6J1J9l8p1R2q0L1M7m8n3M2m3L4P1j05N3
3323hM3n6N1k1j3O6p0J7L7l7N8m9o8J02l5l8O5o8m9P1r1QJ61j39O1J02j15Q0R
3352G4q3N4Oo5J13o4o6N8j32O2O3r8P9K6j02J17o3qP1m4K1M8j01O2Nr1J06K8j03
$$ plain form
3155 63 23 -31 19 13 -96 -15 -3 -106 22 -79 -13 21 -53 -29 15 -7 79 94 32 42 -4 -13 73 13 -9 60 -35 -41 57 -96
3185 -96 2 -31 -24 20 -31 -33 40 -12 -32 14 -16 19 46 -11 59 44 -74 102 -3 -120 67 -87 -9 50 -118 -36 -23 -36
3213 -36 -7 38 -43 91 15 2 71 -69 41 77 0 -38 55 -44 20 -54 -113 36 -38 -40 17 -28 -48 54 -59 40 73 -34
3241 -34 92 0 -71 40 -28 -30 25 -2 3 -6 -18 -27 -6 -113 34 -12 -88 90 -36 3 76 -61 17 97 -47 55 76 -44
3269 -44 12 2 -42 1 -55 -73 30 -27 -32 85 -99 5 80 -52 136 66 -54 50 34 -25 54 -12 -41 96 -87 16
3295 16 40 -98 25 -24 -127 52 -3 7 60 -23 4 30 41 60 22 -49 43 -37 -6 41 -7 -60 -18 -61 -27 44 -61 -8
3323 -8 35 -21 30 9 -4 62 -8 9 46 9 67 18 -50 52 17 -21 44 -24 -73 -2 -93 -85 76 -63 -2 100 -15 65 74
3352 74 -9 45 51 -14 99 35 -31 27 -105 -43 20 -78 1 27 -75 42 -21 -29 42 -2 19 67 -34 28 33 -58 48 76 -27
3381b7R4j10k3O4k3k1P9n7j1J26j26N3J6o4J20j13M7Qk9J8po2Q3k9j78J71Pj18
3409a12K17j47j7J76j66J8Q5o9K7L1p1L3L2n5R8r1nP5j61P4J4o3M7L8o1R5j8o4
3437d0J25j08J3P5k4m0P7p6KL4r0Q7o5K2M3o8j2J30r8o6Q2m6M8P1o0K4k0k7M9
3466D2k5l8N6n1NO7j20K7R8j81J12o3QP6o4J0N1j1L4K1j8r4J36j11Q8o0n6J16
3494E5j20K0L5m8NN8o9P5rj8L1M9j56K25j14nP8r1L2O3j16P0p0k4R9n4l1L2Rl4
3524b3M2l3nO8j23P8L0p5J15p4m8P6j18K1R2o7N5p8k5Q2M9j38J42o4k6L7n5N9
3552fQ2j02O4j1j6O0k0j08P5k8KL3p4N9J4r1J06m3p5Q6M0m1M4L9j13J06q8J3j2
3581el4K3k5k4O1K4j15J92j07m9J32p8K9L6l6k7M4k9K8l3p8J08j1r0Q3k4j3Nn6
$$ plain form
3381 -27 67 -43 -66 -2 -25 -46 33 -24 -35 91 -35 18 34 -30 90 -23 24 32 3 21 14 -48 35 6 -172 -1 6 -112
3409 -112 105 -42 -59 117 -49 -31 54 -15 12 43 -28 5 37 -18 80 -11 -16 59 -102 -28 -14 -77 -30 8 -53 42 24 -40
3437 -40 85 -23 -10 65 41 1 78 2 4 38 -52 35 -30 -8 35 -33 -45 85 -13 -79 3 -43 5 76 16 40 20 -7 42
3466 42 17 -21 35 -16 -11 56 -64 -37 61 -120 -8 -71 -63 13 -51 -41 10 -1 33 54 36 -58 78 -33 55 -5 -61 55
3494 55 -65 -45 -10 -58 -53 5 -64 11 2 -16 15 64 -92 133 19 14 92 1 33 96 -20 50 -20 -44 55 1 -30 2 11 -23
3524 -23 19 -14 -19 49 -74 4 34 -41 74 0 -48 28 -90 -69 23 -44 11 -67 -92 -10 39 -99 43 -21 -47 -10 -65 -6
3552 -6 76 -26 38 27 11 71 51 -57 18 -10 -8 25 -49 10 24 -67 39 -4 -79 7 47 6 50 89 -24 82 -6 7 -5
3581 -5 -39 -16 -41 -65 -4 20 -95 97 -10 -59 73 -5 24 60 24 -3 41 12 40 7 -71 37 26 -64 19 -5 -18 -13 -69
3610f9N3J5Jk8N4n0N2j7n9O7K0n6M4l6M2K2p3K4j8n3L6l3m0J42o7L7L0j02J11
3639D9n1l5Q7k1o6O4k9M1j1m5lL4n3K7L8j19O6ML6J2l7PN4j21M9L9j0k5R3l1j9
3670B4J7m2J1KJ8nj06Q0Ro0Q8k6p4R4k6m6P9n2N8L5r4kQ7r1R1n3l0L6p4MM9n2
3702e1QP0m5jQ1r3N2L6n5%nj1O1n4j7K5j07J16Kn1K3J9n0L7K2m6J00r6P4ol3L4
3734C9M4j50J35o0j03J14o1N1q0M5l6Q4o2K8n7%L4K9%P0n3j9MRm2R4p8J3L5o9
3764d2J6M0o4R6p1j6M1m7P3K7o4J5M7r4N6P3j20M8j6NL7q5J4O9j08nR5n6Q5m5
3794Dl3M2K5m0K4Nk9L2l8K4j7k9N1p3P1N6j20j7P0j9p2R5p5N6O2l9k6R2r2J8j1
3825cj2N1n7J1j6k0J2K2p1Q5k9j2O2n2J2K8l3J5O9p1K4l6L3oj1j7J4%L0n7M5j9
$$ plain form
3610 -69 -16 -1 0 -28 26 -24 28 11 -48 19 39 -17 27 -9 33 55 -18 6 -12 -65 -29 -62 -102 40 -27 10 40 -62 49
3639 49 -2 -37 50 29 -37 27 -2 39 28 -17 -20 14 -39 -12 26 -93 -27 -23 13 25 -12 -5 49 -72 -23 16 6 -19 74 43 24
3670 24 41 -1 10 12 30 25 -81 -1 8 -52 36 10 -64 30 4 -42 37 -15 43 78 -16 -18 69 -22 69 16 -14 22 -52 -48 1 -51
3702 -51 -43 27 -18 -19 62 -31 21 57 2 2 -3 -14 47 -7 -24 1 -106 10 12 -39 -16 3 -47 -10 12 -34 66 -30 44 38 5 39
3734 39 83 -67 68 8 -95 19 -42 9 -71 -26 -62 22 -40 -12 -69 -69 -35 -6 -6 64 11 -8 -4 5 -37 57 -21 -8 27 -42
3764 -42 -26 14 -50 46 -25 -41 0 -47 26 53 -11 4 51 -43 13 86 -34 14 -2 3 40 -45 -31 38 -70 -75 20 -36 49 4
3794 4 -29 13 38 -2 22 27 -2 30 -8 16 -1 -30 21 -52 19 75 -45 -62 8 -11 -83 12 -63 -7 55 16 -10 82 -10 8 -3
3825 -3 -15 36 -21 -10 -26 -46 -34 -12 -83 2 -27 -39 23 -29 -17 11 -22 -7 62 -9 15 -21 12 6 -5 -22 -8 -8 22 -35 10 -9
3857iL5q0O5Mo8R2n2lJ24j62N0N5r3L4M9j20P1K7k3MJ2p3O4k8jR8o2j17P8K3j
3888gM4k8J8Ql2L5pk0K0q4N0Rl4J3K1m6R8p0j8P8n0J7M1j06K3M5m5L6J3q7O1n
3920ik7J2K2rk1M0Rj3m6O2l4L8kql8Q2q9j7O7l7J9N6q0K4o5o8J35k8%K2J9K5r
3953C2o9L4M8l6J8n4l8R7k9j0Kp4O4O0k3m3mk2JK1RJ7J8%K1n8N8J8q3L7l2N1m4
3986a3N1n9k3J0m6P6l6m3N8n9J02k5j2Q1q4l1J03J0p4L0r1Q9j7k3O6l0n7P6p6
4015d7M1oqL2L8j19O7O0p7J5j9K4JP0r5j1l5l1Q8J8m4K9J4J9j4mJ1m3L7j1m4r
4047e3M9m8P3M4j39M7N9j7J4j7p5J16p6M9k8J0K8KJ5k9j0k5N8m2l4M9o5NO2o3
4077d1M1K6q9P3J5k3pk8k4J01q4M0Lk5J1J9J6LJ1q6N3L2q2Q0r8Q5Rl2k3N6j15
$$ plain form
3857 -9 26 -54 11 15 -53 39 -13 -16 108 -54 -4 51 -42 -8 41 -79 -8 19 -4 0 12 -61 3 -25 -26 72 10 -107 -29 -6 -7
3888 -7 37 9 27 35 3 38 31 11 31 -53 -3 6 -28 -15 6 -40 58 -12 -30 48 -2 15 56 -50 -27 18 -27 9 22 -65 -4 -9
3920 -9 -36 -24 -2 -11 -32 8 17 4 -42 20 -14 24 22 14 -24 58 -31 -48 19 -18 1 57 -23 1 -64 -132 3 -25 -25 -3 16 41 32
3953 32 -37 -3 45 9 27 -27 -65 32 3 -7 -5 -79 -15 45 22 -21 -25 -47 -46 -25 -16 1 19 19 40 -18 40 58 -25 12 -20 31 -13
3986 -13 38 -21 -44 -34 -80 -4 -40 -83 -25 -84 18 -7 -19 62 -22 -53 50 60 -14 16 -75 14 -3 -26 40 10 -47 29 -47
4015 -47 -6 -12 -20 12 50 -69 -2 58 -19 -4 -23 1 2 72 -23 -34 -69 -100 -12 6 -38 -9 5 24 10 6 17 -26 11 0 -44 -53
4047 -53 -4 -52 21 65 -74 -27 32 15 29 12 -63 53 -23 26 -2 8 36 38 53 24 14 -11 47 5 -29 20 -45 -40 22 -41
4077 -41 0 26 -63 10 25 2 -5 -33 -57 44 -40 0 3 -22 -11 8 24 27 38 -48 5 37 -45 35 -63 22 31 -1 -24 32 -83
4108h3J22m8o6M8L8l4O8Kn0J7k8OJ4L7n4J7m5M0l3j8L1L5K7o4%N6p4M4jj0K5K1
4140D0o6k5L8l3pP3k6J6k0m8R0L3r5P7Ok9ml2j5O9o5lLJ0O6n3q0Q6K3k7k4k8O3
4173A3J0l9K0R8j30M3N5r2RJ05p2j6K8nL8j05kL0l7N9M2n5M3J4r7P7l9J5J9j3
4203A6Pn7N2Ok4j0K0l0j4K9k7K7Q5j46O7M2l2%l9j8O9n4L0NPk5M5j7j9M7j09Q9
4235B2p9J05n2Om8kO7o1M2j1M2l5k0L1K5n5N6m7L8J3o9l1O8m7N6j3l1L3L7o1M0
4266A9O9r3JpNO4m3K7k2q6K9%j6L7M4l4lj5l2Q9m5J4mj1L2Mlj1J3J9Jm8O3n3K5
4301B9o8R0j14P5m1QN0nj3k6j1N6j9J7l8L3p6P1l0N1J0q3K7N2q2J0P7q5N5J0n4
4332b4L6J0q3J13j9n7J7j0PN0m7j0M7o6P1r6M6N8j09N8l1P4n7M6l8K5M4n7O2o3
$$ plain form
4108 -83 39 -9 -75 -27 11 -23 45 47 -3 14 -14 -8 6 43 -11 6 -39 1 -32 -50 -19 16 43 -21 -21 35 -39 5 4 -6 19 40
4140 40 -26 -51 -13 -46 -53 20 -6 10 -10 -58 32 65 -30 47 53 24 20 -12 -27 42 -23 -26 -23 -13 53 0 -80 6 29 2 -22 -50 13
4173 13 23 -16 4 102 -28 15 70 -22 -13 92 20 4 32 27 65 -40 -42 -12 -49 10 52 -3 40 54 -43 34 -5 10 29 16
4203 16 23 -34 18 24 0 -10 10 -20 -34 -5 -32 -5 80 -66 1 43 11 11 -28 -46 23 -31 -1 4 11 -14 31 14 -5 42 -67 22
4235 22 -57 48 -4 2 -46 -48 19 -42 0 -11 31 -4 -24 7 32 -23 33 -14 24 37 -32 -63 5 -42 14 1 -30 3 40 -21 19
4266 19 88 -5 -4 -11 -6 58 15 42 20 -66 -37 -37 -53 -16 28 -6 -9 -24 -56 33 -12 2 -2 -13 19 23 20 9 22 41 42 -6 57 4 29
4301 29 -39 51 -63 12 -29 -21 29 24 11 -15 -26 30 11 28 -10 23 -53 18 -12 39 49 -34 -7 45 -37 -27 50 -35 20 30 -24
4332 -24 12 22 -61 52 33 -24 -7 -17 -10 40 -7 -17 30 -36 35 -61 -15 43 -66 -8 -39 35 -22 24 -14 11 55 -2 60 -3
4362cJ6J3j3J3m2L5k8K1o8L0L3n5P9k3k4L4K0k9ml5K8KM1k9n0j0J00n2m7R0j24
4393h1jJ06l9P0o7nL6J6p2P9n7O3k2l3NK9o8K0O5n6K0l4k5P9p9P4k4l0K0K1J1
4424B1J0m8lO1k8l2Mj5j0N3o5Q4lo8Q4j4p7K6J7kJ1ol7K1j0Q9m0m8KK7M8j8k8
4457Fj3J9l7Pj3L4q8R5K0l0J8JJ5J9k2ml8K7O0j66Q4K2j8l2K3M3m3k9J6K8J0R
4489B3J4m9J7M3n0jL3q4J02k9o4M8k7j6R8q2J2N6j25P9K1k5M6K3n8l0J1L5l6K1
4519Fl0O4l1K3l4j7J6l7RO6j2l9O8m4N9j8l4k0J1l4K3k4N4L5j10K5M0n5kL1j1
4550b2N2p4N3K7p0L0ML6m2k4P2m3M8r8N9K6l6j4R5j21M8m8K6J4K7L4l4m2J3N2
4580D8l2j9j2lO7j8p3O0j09R0jk2n2Q7k7rO1o5rM0L8k2j9M0J0j2L1r1OK7J7n7
$$ plain form
4362 -3 13 26 13 26 -16 19 -9 12 -56 -26 7 -48 31 8 -16 18 38 9 5 -30 -2 0 41 12 -38 -48 52 0 -47 43 -81
4393 -81 -82 24 -15 55 -12 -17 19 35 -37 42 -15 48 26 -7 -2 27 -41 -21 44 -12 8 -26 -51 28 -51 23 -1 -31 -11 10 21
4424 21 31 -17 -20 41 13 -19 -15 -30 -40 13 -52 32 29 -39 45 31 -46 -20 -3 -5 6 0 -37 -16 -26 63 23 -25 -23 4 52 34 6
4457 6 -7 12 -25 -18 -31 3 -85 10 30 0 18 19 34 53 31 27 -11 16 76 -90 -6 16 -2 -34 -11 32 -11 -40 -24 4 14 23
4489 23 37 -12 5 48 -2 -3 30 -54 48 19 -45 3 -24 -40 58 -24 -12 44 -81 -2 19 -6 40 63 5 -25 -14 21 -15 6
4519 6 -24 40 9 32 -2 -19 -3 -40 -31 35 23 -16 52 8 67 49 15 -5 6 -28 -5 -29 25 60 -50 -25 15 -40 -42 -11 -22
4550 -22 30 -44 9 36 -34 -4 0 36 -6 -30 42 -1 47 -51 8 34 -2 -16 79 -42 6 -42 -16 -2 25 59 25 -17 -4 48
4580 48 16 -3 -15 -18 49 31 -42 18 -91 -1 -2 -24 -76 11 -16 -25 36 -29 -38 2 40 18 -1 39 49 37 68 -23 -17 10 27 -30
4612c0O8m7j3k8K1mR8o3O6o2j2j0K3j5P7n4l3Q2q6l5Q0l5MPo4P4m3k6O1Orj7L7
4645A8r%L6j4K3o9O4j4q2R0p7K7J8m4N4J3q9P5l6J5mj4Nj3l0Q3lk5K3j5n7kN9
4678FoL0o1L4K5qj2J3j5l4nK5j3N2p6N7l6K2J7k6Rrj5M5k0m8QN7n7O0Jn7k7K8
4712c6L9K2m5RPL4k5mo3R5j3j20J31l2K1pm4P9m0m5L5l0m5L7P7m5Rm5N6l7N3%
4744B8k7J2L0o5k7Q9j0o6j7NN4K0n4L2Kk9M7M1n4j2p2L7M3Pl5K1m0L0j1K1K1l3
4776a2L3J9qj7m5K1Pj0M1m2L6pm0J9K5qK5p7J1J7J3Pp5N2N4o9K8K9o5NP9q2O6
4809C0m3J3M4m6K1qm0M7j2qrN5k0rrj6J2P0m9L6l0j1k4K5jnm1lj2K4M0k7lLk5
4844c1nN8j3k2J9QMm2J4L6n0M2m4J6M0m3l4Q9Jn0J0k7KM9%k4L8o5K0M2l8Nj6P
$$ plain form
4612 -30 38 -9 -22 -50 -29 -33 65 2 68 6 -6 -16 7 -8 69 15 -18 64 -22 -57 23 -12 -8 -1 -65 9 -34 -60 1 7 -2 -19 18
4645 18 9 9 45 31 54 -15 49 35 -47 43 -34 -7 11 -33 21 34 -55 20 -16 -1 -5 -19 -14 -27 -57 26 23 -2 21 6 -51 -53 6
4678 6 0 30 -31 3 28 20 8 21 6 -28 -33 -8 -21 31 -45 12 -24 -2 15 -11 -2 -11 -26 19 -1 -49 -41 16 -41 19 20 -37 -64 -36
4712 -36 3 25 -20 -11 -4 30 5 1 -62 33 20 -100 31 -1 20 13 -31 48 8 -37 -2 -32 -77 -40 37 -8 1 -44 12 -25 28 28
4744 28 1 13 43 -22 -49 40 30 -36 -53 -48 6 26 -28 4 6 -23 24 65 11 -1 -73 -36 7 14 -21 0 -40 -10 -21 0 21 -12
4776 -12 21 40 32 15 -30 -9 -2 -12 29 -13 23 16 -24 -5 20 12 37 -40 -29 -12 1 8 -67 -15 39 -30 -2 27 -38 -33 46 -36 30
4809 30 -13 0 44 -2 19 11 -29 18 6 -2 -11 44 24 15 6 -10 2 72 23 59 29 18 -6 19 18 13 -28 -31 -43 -19 21 -6 -9 -6 -31
4844 -31 -36 22 9 -13 6 14 18 -24 -10 26 -24 18 -26 -10 30 -13 -47 42 43 -7 3 -24 -22 27 27 3 41 -24 -4 38 0 5 -11 -4
4878dN8q4M8jq6P0j9K8K5p9J9Q4j1M9q3K0J5n1m1J00k3j0m8rR%K7N6n3k2k8J9
4910b5K1OJ9m3rO0o5L7J3n0P6n5Q3k4p7L6o5O1j1K5k9k2N5K2n9L5k5jpL3n0O2
4942B7k5l9N5Rk1OP3q1K8q0J3N1r0R2Nm6M7n9J2K7K6o1J13j21QN6l6k8P0p4R7
4973E4k1k7qK1L8r3N9n4J3LPP4l1r3O7m5M5kjJ8n8N5J6o7k2N7O5n7K0p0Q9m9n
5006bPk0Ro2J19k4Jo9M0N0j11R0m4j9P9m8nN2l1PPm0N0q2P1l2k3M3O8j03j1k7
5038f0L1J2rN0o4R8m4k4K4mj5j2L6j6MJ6k7L1k3M6m0Rl8oL3K4OJ1n0J3j2kjKQ
5073Go5R5p3P9l1n0M4j6j3N7k4j7k3NM1n2M6rNj9P4n2J9m8KJ7KJ0j5P7j39J07
5105D1m9oQ2j17L1mqj7N3J0QJ1k9mJlL5j00Q7K5m7Jl0npL3j5l4M8K5K3n2J9J6
$$ plain form
4878 -4 54 -30 18 17 -69 1 -18 10 35 -44 -25 59 48 97 14 34 49 -2 -43 57 34 24 -24 -33 -24 -24 3 59 6 -16 -44 -25
4910 -25 -4 2 21 -22 -31 29 -36 1 14 -36 40 -15 68 44 -33 3 -62 -1 -12 13 -16 -38 17 39 -20 15 -10 -11 -18 15 -35 27
4942 27 2 -37 18 27 6 12 85 4 32 -48 -35 16 -74 18 23 -23 24 -35 -23 4 30 -31 82 -39 -31 25 -11 -39 31 -43 54
4973 54 33 6 -2 19 57 -36 23 -31 -18 -15 -8 66 35 -58 9 -36 9 7 6 24 -34 21 37 -30 -52 5 70 13 33 -37 52 3 -2
5006 -2 5 -15 -6 -68 51 27 28 -41 -1 49 -62 28 -16 -35 44 -4 -9 43 12 19 26 -14 36 -46 25 -7 -30 13 81 -22 -33 -60
5038 -60 -29 -17 -26 24 -40 58 14 -10 14 10 -5 -17 19 3 7 23 -4 27 4 50 10 19 -19 -25 8 32 38 49 -1 12 0 -2 -3 -1 7
5073 7 -58 37 -36 43 12 -38 6 -10 -23 34 10 -7 -30 -25 16 -36 10 1 6 -13 61 9 28 -20 -18 -1 1 11 -4 73 -66 41
5105 41 -8 -14 68 -49 -18 -22 -30 -47 6 16 24 35 6 2 3 0 35 -65 22 47 0 1 -29 -34 -41 -8 -23 -57 -9 16 39 -13 6 22
5139B2K3n9N9j05M6L2L1o9NqK5N2n3J3j3%K1J0m1M1r0N6K0Ol1j9K5J4k7k1rjn
5172e0K1J6P6n5k2LL6l0j6N6j5k3J1k4P0K3m7m6M0J6r3L9K8mp1P0K4m2J7Mm2L7
5204GJ5J4o5K6N9r3O0%n8L4J5lml9Q%j7J5%K6J1j6pL0J4o0R2m7oRkm1oj9K8J4
5240fQj0K9k2j4j5O5l3K5om2N4%J8j9k8%K7J9qk6m7K7J3J5N4o2l7J2Q9m0o2L7
5273A5m9P8l0mnl2LM3J2J8m3JM9m0l7MO4no5l3P1J4J0n7Qj7N5rk1RJo3J10qk7
5308B0pk9K8J1k0mM6r5L8Q2p8Rmk5Q7o3qrM3l9J0L6l2M4p0L2j1QoL2q1ON1K8K9
5343E9q9M2J4mo7O8q4P6m5rJ9L9Mqkjm4j2j5L2K7O9jl4o6L3k1K4no0Q1n0K1O5
5377E6p6K4m7J7N7o2O9j6J0k2Rn0N9J1Rl1m4j0Qm0M4P4j8J8k9o8J7qO1j6J1k8
$$ plain form
5139 22 45 -14 45 -60 -14 18 49 -20 -15 -23 2 54 1 14 1 1 22 32 -9 32 -58 -2 18 24 -7 -26 -1 13 -14 -35 -44 -45 -50
5172 -50 -29 -13 63 8 -14 -11 25 -5 -21 35 20 -3 8 -16 54 77 30 -16 24 40 -53 -14 14 10 -61 9 33 -9 8 12 -30 7
5204 7 22 36 -29 -3 56 -37 23 23 -35 -1 14 11 7 -32 -24 -24 -41 -26 -26 0 11 -5 -12 18 32 -28 64 17 11 20 18 -23 -29 -48 -20 -6
5240 -6 2 -8 21 -1 -15 -30 35 2 27 21 -21 33 33 51 32 4 4 31 50 42 16 -31 -4 9 24 78 16 -21 -9 80 40 -22 15
5273 15 -34 44 14 10 5 -27 -24 19 31 49 6 7 56 16 -21 -17 47 42 -23 -56 15 29 39 -18 -10 -27 28 19 -2 7 8 -55 55 47 20
5308 20 13 -16 12 23 3 -1 45 -50 -12 70 -8 1 -3 -28 59 -4 -12 -21 22 -17 -7 29 -3 41 -29 3 -8 0 -6 26 -55 -49 2 30 59
5343 59 -30 12 26 22 -45 23 -61 15 -30 -39 -20 19 23 15 13 12 -32 -44 -59 -27 0 69 68 34 -32 1 -20 4 -1 -61 20 -30 -9 56
5377 56 -20 4 -43 -26 31 -31 38 22 32 10 19 -31 28 39 48 17 -27 -37 -29 -69 -25 49 31 49 20 -48 -31 -39 22 6 17 -11
5409a1J7M3m4m5O2k9K8m2L1k7M6l7p0N0J1L9l9j1M4k1j1JL1k2RQJ2q3L7Q1n1K5
5441C2k7m8M5l1L0QJ0l5j3O6m2M0l5j8jM1J4q6R9Pm7O6r0K6j0l3LPL0J0k4m4P6
5474B6q1P8p0J10p6K7j4J9m0J4PK7o1R1l0n0LnlMM0j8J1l9j0J9N7n6M9Lj9L3l6
5507A0J9n3O1m3jk8K0l4K0%J5K7m4OjoQM0j7m5P0j2ol1mNL3m1Q6j17L3K0L2KN2
5542G6q9j6K1j6N7o5O6m3nPLk5M8J0l8pk5N4M8m3O1n1l9p2Q8J4pkNl6j3Q9k8k7
5576@k2ooL1L7Npn3M6lj6oLqJ6M5o3Om1RL5L2k1jl1n1P8l0l4N5L8n5L5l8O6r6
5612e1O0l5k1P5j0l5L3j2L1o6O2o7K3L8l1L7o7j8R0r3P2m4N4k1%J8J6m0J3qk1
5643a8j2K0K7n5J0j9Q3l2m3j6M6KM5n7J5n6L2J8K2%p9J02n5L5k3l3P5j5Rmn7R
$$ plain form
5409 -11 6 49 5 -40 22 -7 21 -21 10 -17 29 -8 -78 -28 -17 22 -17 -28 16 -5 -16 -15 16 -6 3 11 23 -60 -23 58 7 32
5441 32 5 -43 2 -29 1 9 19 -16 -29 37 -5 35 0 -18 -19 22 36 -50 49 56 9 75 -15 11 1 -32 -29 -22 8 18 -6 -50 26
5474 26 -55 23 -47 63 -13 14 0 19 -21 -7 0 27 -34 57 27 -23 -20 -25 -28 -24 16 -2 9 -30 -40 -21 36 -20 29 32 13 46 10
5507 10 29 -24 37 -6 -7 -35 -15 -49 -29 -29 -14 13 -31 -25 -26 -32 -24 16 -1 -46 24 12 6 -25 -29 -24 9 -32 54 -63 -30 -10 22 24 76
5542 76 -13 -29 -8 -24 33 -32 34 -9 -14 -7 -4 -29 19 29 -9 -16 -41 13 61 18 79 28 -11 -83 5 19 12 10 15 -21 -34 55 27 0
5576 0 -22 -28 -34 -3 34 39 32 -21 25 22 6 0 3 -5 11 56 -7 -1 -42 -33 2 34 13 12 -19 -70 8 -22 -56 -1 37 -18 17 -21 45 -51
5612 -51 9 -26 -47 28 18 -17 16 4 35 -31 31 -36 -13 25 -6 31 -36 -54 36 -57 15 -29 25 4 4 22 38 -2 11 3 -18
5643 -18 -30 -10 17 -38 -28 -47 36 4 -39 -55 -9 -7 38 -19 -4 -60 -28 -10 12 12 -67 35 -20 15 -8 -41 34 19 28 24 -33 -24
5675b4KL6j6LJ6m5N5K8q1lN8o1J8j0j4j1M6Jl6P4q0M0Q8j16M5jl2P1K1r0J3n3
5707e8M1R2o7j4m4L9J8J8k8jj5N4n2nJ2J2nJ%Ol5L1J7K3n6p2Q5K2o3N2J3jOj5
5741A1Rl5O0J2kk8o7P2j5l3M5kL1p3k1K5k7O1on5K3klrk8N4k9M2m3K4l2M1N4o5
5775a1j7P0k9j0K3Qn2j7K7K4k1L3q9M6N4j01L4M2K7p0N4j2n5P2J3l4M4k2j4JJ7
5806C5k9qK5o9O1ko8L1N2qn1N5Mm1j0M1k5K2J5Jk0j7kk2MM6p1L7KJ1K1m5%K2k9
5841c2lN7p3J5JlM2L0q4M0M0q0L0N4m3nOK3m4N7j2J0n4M0nkl3J8j1Rrj1L1Kj4
5876a3M4k1m6M7rl5N7J5Rl6k4K8m1J2J8j6j9mL0Pk5J6J7ok9K1kL9rl8k1J5O5q
5910C8j6k9l6Q8q0l2N8K4l6Rj6M1j1pJ7K0m8j2JJ0Qk9PL0l9j3J1k2J38j36P8l
$$ plain form
5675 -24 -22 14 -2 1 17 -28 27 55 -26 -29 29 -32 -14 -24 -38 -49 -3 -2 -38 36 -44 -4 84 -32 13 12 -20 51 72 -18 -5 -58
5707 -58 -17 75 8 -6 -50 -11 7 25 -3 -4 -19 35 -17 -22 -10 2 -3 -2 -2 4 -31 0 17 40 -16 -88 -3 19 -44 8 21 20 26 11
5741 11 20 -15 45 57 55 27 -40 32 17 -16 29 27 58 -15 -36 -11 -38 23 17 -38 -15 -17 -20 -29 -57 -3 -32 10 -33 -9 -41 0 54 -11
5775 -11 -28 42 13 3 26 34 -18 -35 -8 16 -5 28 -61 -15 39 -62 -28 14 41 -29 25 13 -42 30 43 9 53 31 17 18 35
5806 35 6 -2 23 -46 15 13 -55 -24 28 20 -31 24 28 -13 -23 18 -7 15 30 31 11 -6 -8 -30 -26 20 -51 -14 -12 -1 20 -25 -25 -3 -32
5841 -32 -35 22 -51 -36 -35 -38 4 34 -50 -10 30 -50 -20 34 -9 -14 -8 15 -29 28 16 26 -28 12 7 5 -28 -10 -21 -12 -21 -32 -1 1 -13
5876 -13 31 10 -36 11 2 -33 24 39 48 12 -12 16 -25 -13 5 -11 -30 -34 -4 3 -22 -6 11 5 -24 -3 -5 34 25 -13 -34 -19 46 38
5910 38 22 -7 -43 45 -35 -67 -9 15 -21 -12 -28 13 2 -5 12 32 -16 -28 -27 -17 -9 -38 -31 -1 -40 -53 -42 -64 74 -62 16 13
5942A3K5Qp6L8j6M7mqk0l1J9J0jl0QK4L6q3L0l4P1l1J7L5m6J8N4o1k6P4n1l8K7
5975bj6%K1l5J0L1K6k8qj5J3l4O3J7j5m5M8o4RJ9LnK1k2N6p6k1QM6lo1N8K8qj7
6010BL4l1J3l6m8O8l1KJ0L1k1L1j4J3j3L3k5k2Pk6nJ2L2l1J6J2K0m6N4p6N0j8
6042cl8J8K1L7o4L9%J4k1j5LO7j06L8Qk1J4K2l9L9l3L2J2j5j9oL4j5n4O2Nn8K3
6075a9J2nK8ok2Nj3J7J2Kk6N1l9mj9l6O5k7J1MJ5N0n2pkK7m4K8Lm2L6j7n3M7l
6110b3L4k4L1m4M2n2J9%N7n8k8P1o3J5K9l8L3J9J7j07J09J6o4l9J8JK0rm3J18
6140E7r2J9Mk4m1J14o2j9O4O8j14LR4r2j2P0j8j3P1q0k3L4k7P7o4P2k3q1K1J1
6170fK2j4L2j1n7J01k3o2K0n2N3l2M8p0M0L1l0pK8R0j27O1j0j6n8K1O5j3ljo3
$$ plain form
5942 13 38 46 -30 8 -8 39 35 27 7 -24 -5 5 4 -26 -18 6 42 -41 -11 -45 26 -5 12 47 1 19 73 12 -14 60 9 -29 -2
5975 -2 -18 -18 3 -32 -22 9 35 7 -1 -16 -3 -37 26 43 28 -17 31 -33 -24 -5 -2 -7 14 -8 48 -28 -49 -41 5 2 -59 -1 27 19 2
6010 2 36 5 18 -18 -66 2 -29 -27 -17 14 -7 24 10 23 10 43 18 -4 3 -23 -28 -16 16 -15 1 13 33 -13 41 -35 15 -3
6042 -3 -41 -23 -2 35 -29 10 10 24 3 -12 -9 58 -48 -10 -2 -23 -9 13 -26 13 -20 12 24 9 -10 -16 18 3 -51 11 16 -42 -19
6075 -19 -7 -12 16 10 -12 -7 -20 -3 9 11 -15 36 -3 -7 -26 -62 3 -24 -13 -9 6 56 4 -3 -5 22 -22 6 9 -33 3 -14 -67 -20 -23
6110 -23 11 -13 18 -26 16 -36 -17 -17 40 -18 -46 25 -38 -23 6 -32 1 20 37 -70 39 55 -9 -48 -30 -29 -9 -18 -61 57
6140 57 -35 -16 -12 -36 -77 37 -25 -44 20 88 -26 -23 71 -21 -33 37 19 6 77 -3 -26 8 -19 58 -6 66 43 -38 -17 -6
6170 -6 16 2 34 23 -34 67 44 -18 2 -50 3 -29 19 -51 -11 20 -10 -17 11 101 -26 35 25 9 -49 -28 37 24 21 20 -43
6201d3L7n0O1m0Q6p9K6k7K9L5o6N4j2n4J5K6Mm8O8k9k3l8P3K0l5L3l0l2P3Lp8
6232d1J9J2K3m3J2j2Q0k6n4jL8M8k1K1m0np4O2NJ7j7l9P4k3MOj4k6Jj1K8J5j2
6265FK2m8K6o0J12j2l4l1j7O0qkm0k4N5Rrl1N3n4J8O4j6p4L5J9k0lQK2l8Kk8O8
6299C0j2l5j9R3o2KJ0K8l8NL6p4KO3m3J9rqN6q4O0n1QK5K3J2m1J3k5j3PN3k7k4
6333b0L2r1Q0k2K1L3n0ML2jP3j19N5m1K3M2m2j4Q9o9n3O6k1kPL9p0O4lj3j0j6
6365Cj1J3l1M4mj5OnNo6M1J0m0NM1j1j5N6l6OQm4N2J2j0jlOK9j4q7Q7k8Lj0l8
6401d2J08p7Q3j08N0n5L5J3j2J9nJ3rM6p5j0rN6j0nj3K9q4J06q3J5K3qK7l5J4
6432cj2K5jm9l0N5L4j0l1M0n4Q2k9K7l5k3qQJ1K1k0l2kj8M2P0p7L2Ro2M2J1Ll0
$$ plain form
6201 -43 -6 -56 5 -35 51 -28 -2 -29 0 35 -31 23 11 -43 -28 -2 2 -46 22 -7 -30 -68 5 25 -10 23 -7 -39 34 37 -41
6232 -41 -22 -10 13 -30 -18 -30 50 24 -30 -31 7 55 34 55 15 10 -64 -2 3 20 3 -36 38 15 19 25 11 -15 -14 -25 3 18 6
6265 6 28 -20 6 -54 58 46 12 -19 -36 24 16 14 -26 -50 5 14 5 -26 27 -27 -9 55 39 -35 0 19 -1 -4 4 26 -12 -10 -38 30
6299 30 18 -17 -36 57 -5 -3 7 35 -3 2 38 -36 -34 29 -14 5 -4 -12 44 -40 20 -31 -23 2 25 37 -4 9 -16 -29 -22 31 4 -20
6333 -20 12 -79 1 -21 0 33 -17 -13 19 18 91 -28 27 -14 9 51 9 -5 84 15 -38 28 7 5 12 51 -19 45 42 29 19 3
6365 3 -8 5 -26 18 14 -1 5 0 5 -61 -20 -10 -50 -45 -4 -15 -30 26 -10 -4 4 -40 12 24 14 13 10 16 45 31 -56 31 3 6 -4 -42
6401 -42 66 -11 72 -36 14 -41 -6 7 -5 14 9 22 13 59 -16 -26 -35 21 11 6 -7 22 -62 44 -39 -24 -1 -9 18 -17 -3
6432 -3 -15 10 9 -40 -70 -15 19 9 -22 18 -36 46 17 44 9 -14 -22 -14 -3 18 -2 -34 -36 -54 -12 58 -19 13 22 -40 2 13 16 -14
6466a4J8J2nKM8k5m2m8O4k3RJ4L8m2kO6p4O8r3M4n5L7l1N0rj4N4n8M6J3o8M7k0
6499GM6k7n1R5k1m7k0NK9j9K6rj9k3N8m2P2l6j0Rl5k1K6%K3l9K4J4l2O3o6k1n
6532d6K2j0N3m0LK3J8N8p2k9j0J3mkk6M6nk5j3N3k5j4P5l5j4K1l8KJlj6oL0Qk2
6567b9R7p4k7RR7oj16J3M1K4k5MJ4rJ6k2JJ0j9N5j5m6Mk9K9L7j1%m0N3k6r0M1
6600c9orM5J7l6nJ4K2OK8k2l4Jm1P9l9k5O4K1j9j2K0l4L5qk1Q6q7q4M9P1j01J0
6633e4O3J1ol5lK3Pl5K1j0mK0L0m9N4n3mN0j8nl7K9Qm3N7p2P7o8P8n3j6N3j6k1
6667b1J5K6q7Q7o2M3j9kJ7k8K9n1J9N0l7KkL9k8M7o9K4K4p0j1P8MJ0j07O1P4l9
6699A6qj1J0K6l2l8j4N0moqjOL3n8Mj1K6j5J3L7pl2M4k5rrN1kk3p2Q5p9M3L0o5
$$ plain form
6466 -14 4 16 11 13 61 36 -6 -54 10 -13 -4 10 48 6 4 70 -4 64 -29 15 -40 -3 -34 16 7 -7 47 -11 35 48 -20 27 7
6499 7 53 26 -25 70 49 2 -18 -13 16 -3 23 14 -5 -28 30 -12 60 24 14 23 -12 -33 -7 -7 16 -23 1 15 -17 46 -20 -41 -46
6532 -46 -24 -34 19 -21 -18 5 23 81 9 -20 -30 -17 -21 -23 -49 -3 -8 -33 -46 7 -18 -32 43 8 -6 15 -23 -21 -20 -23 -39 -45 -15 -7 -29
6567 -29 68 -6 -33 -24 73 67 -49 -36 5 29 4 8 22 13 29 7 8 18 -1 54 39 -7 -3 -32 -3 34 23 23 -17 36 10 -80 -39
6600 -39 -45 -54 -9 8 -28 -33 -19 3 9 37 15 -19 -18 -59 20 -19 -44 20 41 22 10 30 -4 31 23 2 88 1 -83 -34 37 -64 -54
6633 -54 9 20 14 -21 -24 -1 6 -29 -8 -18 -22 -2 28 -21 33 -20 -24 26 8 3 -34 -5 3 -40 17 -55 22 -46 32 -21 -37 16 0 -21
6667 -21 -6 20 -67 20 -42 1 -18 -20 -3 -31 -2 -53 -34 16 -21 -19 -21 18 -10 37 -32 -8 16 -54 -65 13 17 27 -80 -19 55 16
6699 16 8 -3 7 33 1 -37 -51 -1 -5 -11 -19 -20 -14 19 -39 -35 -46 -20 -35 -22 15 8 -24 20 -5 -14 -23 28 26 3 -69 16 -63 -20 10 -55
6735e5J13Ll5k7M3j0m1Nm0P0k2l8L5n9O1O2k2o7lN5n8JJ2kk4K0J0nj1M6k9JL8
6768B7l1l1lN3l9O0J2l9pm5j3M6p5R2m6J4K7j1k5L3O1lm0m8j2M5M5m4MJ5o0L1
6800gj6m0O3Ro3M6m3M9K1Jj28J11L1r5M4nO8o5K9m1L6k2K0oj2J6j1K7%rj7j6N2
6833B7o5O3Lm9L3k0J1n2nM6P9m9Om1j8L1k5kJ6lL5k5K5rk7J5k6QNpJ3l1N7m2l7
6868f0K0K1k6j6P1Pj9Kj5O0k5J4m2k1NmMN4m4j6N8Pl8M5n4j9N3k1J1m4OpK5K4
6902A6k5Q1o4l4P6l4k2J5n7P9m7j2L9pn8Q2n0K9j8L1m1L7j2j3jj2N7p2P6l2o2
6933e5R3l1M7r6N7k2K9n5J6P2j22R7k7l5O7m6m7L2M0K2MJ1m2J0m5Mm1O4qL8j9
6964A2J2lJ2n7K6M4l7l7N6o4N3Oq1J6K2M5n9J6M7k1Lj8m0R3k3l1K0lo5O8l5Q0
$$ plain form
6735 -55 58 61 26 -1 42 32 -9 -4 -44 26 4 -34 1 -58 3 65 43 -24 -27 28 -30 -29 -17 -19 -43 -23 -13 -18 -29 17 -12 -11 27
6768 27 -4 -35 -38 15 -24 36 48 9 2 -43 -56 -10 -85 7 -39 -25 2 -9 -34 -1 60 57 17 -31 -43 2 47 3 7 22 -38 -7
6800 -7 -23 -63 0 9 -54 -8 -51 -2 19 20 -108 3 34 -61 -17 -22 46 -19 10 -31 5 -17 3 -3 -15 1 -10 17 17 8 -9 -25 27
6833 27 -38 25 28 -21 12 -8 3 -49 -54 -8 71 22 28 -13 -31 0 -25 -27 -11 -14 21 -4 21 12 -15 0 -26 -18 -13 -20 -7 -38 19 -23 -60
6868 -60 -40 -19 -45 -61 10 17 -2 0 -15 45 20 34 -8 -29 -24 -28 -24 30 -14 -30 28 35 -3 42 -12 -31 22 1 12 -32 -26 -33 -8 16
6902 16 -9 72 8 -26 50 16 -6 9 -48 31 -16 -28 11 4 -54 28 -22 7 -11 20 -21 16 4 -9 -10 -22 35 -37 39 7 -55
6933 -55 38 7 54 -42 15 -7 22 -33 -17 55 -67 30 3 -32 35 -11 -58 -26 14 36 40 51 9 19 -26 -22 -63 1 -7 31 12
6964 12 24 21 33 -24 2 46 9 -28 28 -36 17 23 -58 -42 -20 25 -34 -18 29 8 11 -7 -47 46 23 -8 12 9 -56 12 -23 57
6996E7o2O3o2%Jj0M3km7N5n6J8rK2j5K8Jk8j7J7j6k6OM8J5K4l7j0M7nm0l4K2J8
7030ILk7M3o5L6L2q3P0n8J06q7K0k5K2J1K7l1J6n3k5L4L5k0J2j8j0M6n0Jl3N4
7061hJ6j3pN2j26R9l0k7O1oJ8n6k4Q0k3K0l5m0J5L3N1l7Mj5Rm9O0o1L4OoK7j0
7094A2l0N8l9n3L5Pl0M0m0N2m8L5k0l1K9KL5l3j9L8L5l1k7J9J7l4j1L6l7k%j4
7126d9M9k6j5j7M1k8mM6J6K0j04L4j3K6K6m8Q7k3m7M0Jm6k7O7oL2j6J1m0K3l6
7157b6K9L0l2J7l4M8l9L7k0qjo8L3L1l3J3k8M4pNk9k6M5K7j1pj0NM1k2m6N0mJ8
7191B2m8LN2k8J2rQn8N2l9K5l1M1pNM0l6l1N8k7r7J55p9J8J3K3n8k2%N3qjK6j5
7225A2n1J8N3m3L0l7J5k3M5k5l4L0K2k3L0K7j6Km3nk5L9L8m4L8k4N8m9LJ0k5j2
$$ plain form
6996 57 -5 58 -4 -4 -3 -13 30 28 -19 36 -20 -2 -11 11 -4 24 25 -3 -20 -3 -19 -45 -39 9 24 48 11 1 48 43 3 -31 -9 9
7030 9 12 -15 28 -37 -1 31 -52 18 -40 66 -21 -1 -26 -4 7 34 3 19 -34 -59 -25 10 -10 2 -16 -26 20 -30 -29 -62 -8
7061 -8 8 -5 -12 40 -86 13 -17 -44 17 11 29 -27 -51 29 6 26 -9 -49 -34 -1 50 13 17 2 11 -38 22 -39 -5 1 -5 22 12
7094 12 -18 40 1 -52 -17 -10 -40 0 -40 12 -36 -1 -21 -52 -23 -21 14 -19 -38 0 35 4 -23 -4 13 -21 -32 4 -33 -35 -35 -49
7126 -49 0 -26 -41 -58 -17 -45 -49 -3 13 33 -71 -37 -50 -24 2 -46 41 18 -29 11 12 -34 -61 6 0 32 16 27 -13 10 -26
7157 -26 3 33 1 18 -16 32 -7 30 10 2 1 -67 -34 -3 -36 -23 -51 -7 -14 -9 -38 -64 -19 8 -3 -10 -20 -15 26 4 -42 8 4 22
7191 22 -26 -23 29 1 13 4 12 -46 6 -33 -8 -39 2 -5 0 40 4 -27 31 4 -93 62 -17 1 14 37 -21 -43 -43 10 2 1 27 12
7225 12 -39 -21 32 -11 19 -18 -3 -26 19 -6 -40 -10 12 -11 19 46 30 32 -11 -16 -41 -2 36 -8 30 6 64 15 18 28 3 -9
7257iJ6K0q6K7j0K3JRJrN1l6mLm9K9K5%M7k7m1l6M7k2K3q8J27j1n0K2j0lJ7L9
7291C6j4%j7J3j2Lj3oL%j1rL2j0N7k4m7j2O4l8k1K4rln4O7j1j7jN3l7K5K4qm5
7326a8Qo6J07m9k9M5Jqk4L8pkOK5o4N8k9L7lj5L2k3ok1N8n1L4l2L3j9l2Oj0j1
7360c1M3l4J7L9p9O7l7lO1m3j06J39k3n3M1Kl8N1k6lM2j9jk3L4MKm4N3m3J6L1
7392C6q2kLP1l8mJ1j4L3k2j9K0J8l6L8K1m5qk7L7PO3q7K4K1J2mJ6j1j3o6P1m9
7425b5L4J4m9J5j0L8Mm5P2k1kn4N7n6N8l8L6k6mK5k1j7M1L0p4k4LK4J9Pm9O9m8
7458a7P4q8N8LK2m0l6oJ9J1M5l2j5J7j2n2L7qJ0K7j9m1L7On1M0l6N5p7OJ26k9
7490C4j04N2J2nJ1L0k7n5M6j6L5k3L1l2m3k8Q2L9m3ql4j7P4o0M4k0k2N8l8M6l0
$$ plain form
7257 -9 7 27 -59 -32 -42 -19 -18 -9 -8 -17 34 -2 -6 -3 -52 -23 2 2 49 22 -19 -55 -8 -30 -7 -95 32 21 -29 -7 -17 -20 -3 36
7291 36 22 22 5 18 6 9 -4 -10 -7 -7 -18 -27 5 -5 52 28 -19 -31 33 -5 -26 -2 -11 -14 -68 -1 -12 -29 -30 23 -14 11 35 27 -18
7326 -18 -10 -76 31 -18 -47 -2 -1 -9 -33 5 -2 -4 2 27 -37 21 -8 29 26 11 43 20 14 -7 51 0 34 2 35 16 -16 -10 -20 -31
7360 -31 12 -22 -5 34 -45 22 -15 -18 43 0 -106 33 10 -43 -2 0 -38 13 -13 -16 26 7 6 -17 17 21 23 -21 32 -11 5 36
7392 36 -46 -48 -45 26 -12 -16 -5 -19 14 -8 -27 -7 11 -25 13 34 -11 -19 -46 -9 -2 61 -26 -2 19 31 27 43 32 19 -47 24 -25
7425 -25 9 23 -26 -11 -21 17 21 -24 48 27 25 -29 28 -28 30 -8 28 2 -2 23 2 -15 26 56 -18 -42 -39 -15 4 11 -38 31 -17
7458 -17 57 -31 27 30 52 12 -24 -30 -11 0 45 13 -2 15 3 -49 -12 -20 -10 17 -2 -43 -6 0 -51 -11 -47 8 -69 -63 63 34
7490 34 -70 -18 -6 -11 0 30 3 -52 -6 -22 13 -10 21 -11 -54 -82 0 39 -4 -12 -46 -63 11 -49 -5 -25 -47 11 -27 19 -11
7521a1k4NK3L2Kp6L4M6pK5q0j9Q0o3L5jk8M4k9j5O4k7J4k9nL9p3L2O3m8k7ON7
7554C9q0L8Nj2kpRO3o6K1lK9m3m4O6q7N0j9K9L1j1k2L1Jk5m4K4Lk3N9o3O2K3n8
7588b6O2l1k4M8nk1j8j1J3l7l8Q9ql2L5J1ll1J0J5k5MJ3Qk2JJ5l3mQK4N1k8K0
7622C0L3q9K2k2pO2j7k1l0L3L6j1n6M9J8k2j6rK1J7oL1n0Mm0N3k5N0l3k3M8j2
7654A8n3JN0p9P4km2mL5NJ9%n3K2K8N5q3P5q9Plk2M2K6j5j1K5rko9K8k1L0k9Q1
7689C5n8N1j5j8O4k1M1j05oP7m4LK9j6MOk7l8L3M6k6l7J9L7l6K8Jm0k4RN4k1k1
7722a6J5K8m0N6r0M6L2J0k8l9O4q6Q9k9k0j9P1j6j20Q3k8Q1o2M4l5joL0k5n2J8
7753d5J6N1p2P7j5lN3r2Q6m9o8P3Pmk9L8o7M6J1j2m4M8J7k8k9j8M9J9m0M9o7K4
$$ plain form
7521 -11 -35 -30 -7 25 27 -49 -15 31 24 49 -31 -50 30 -33 2 1 -27 17 -12 -27 37 10 24 -5 -10 29 -44 -12 51 3 -24 -18 39
7554 39 -41 -3 2 -10 -12 -19 -10 53 -13 8 5 34 -9 -53 13 -74 -24 -43 -14 17 6 -16 15 16 -9 -53 -29 -26 -49 10 -53 9 32 -26
7588 -26 36 5 -19 29 24 3 -15 -26 -13 -50 -88 1 -7 -39 -4 7 4 -27 -17 -2 -27 -23 -10 -2 -24 -23 -8 -41 -45 -37 -13 38 10 30
7622 30 63 -26 -4 -26 -33 29 12 -9 -39 -6 30 19 -37 12 30 8 -8 -17 4 21 15 46 -4 0 -40 13 -12 38 5 -18 30 18
7654 18 -35 -34 16 -63 11 9 -33 -37 -2 3 22 22 -31 -9 19 74 -9 66 -23 -16 -19 -41 1 27 12 1 26 17 15 -54 -26 -47 -17 -46 35
7689 35 -23 28 13 -5 59 38 79 -26 -32 45 1 4 33 17 21 27 0 -38 -5 41 15 -22 -3 34 -2 26 27 -13 -37 -28 26 5 -16
7722 -16 -1 27 -13 43 -47 -1 31 41 13 -26 38 -48 41 12 -8 -27 44 28 -92 -9 -37 44 -18 26 -9 -10 -16 14 -11 -63 -45
7753 -45 -29 22 -50 27 12 9 62 -30 56 7 -61 12 19 15 -14 24 -43 3 14 2 -42 6 23 -5 -34 -52 -3 16 -24 25 -42 -18
7785a8L6J4o1M3K7n2k1L6k9L3o1L8lO8o6Lk0rjOJ1K7L0m8jJ1j3L3o8j1P3l8K0
7818a1n0N3j5N2k6j8J3L4j12N3J9n4K1M6k4J1k0k0Q3l6n6N7J5j5j7RL4m8L0j9
7848a1L9o1rN5Ok7N2p3K7l9P4op4Q0m0M4l1J5J3n0L4qJl0Ol3J00l4m3J4o1N7j9
7881c2J9J1n0O0l0M4k3k2P0m2K3n4Pk6%K1k3L5J5Ml5jJ5K3m4O6m8K1nj0l4K4Q
7914a3PN5rk1pl8O2o6K9JqK0m9MN5l2%K5kn6L4J4l4J3J1L2k7k1K9l9ON0l5L0j
7949A9m4L6o6O8K4m5k0m2O2J5j8P0j09Q9J7q5K4N3m6j6K5l6K1M3J0n7O9j16L2
7978b3M6n0L1J9M2m3J3o9O6K8q0K5k4N3l0k3L5L2q5mJ1mJ4jQ1p2N8m7M5j9Mn1
8010b2pK7M6o0NK2nm6J6J0K4j3KL6k0n1L3N3j5o4j8O0po5RK1JN8l1K3l4m1L4j7
$$ plain form
7785 -18 18 32 -29 14 41 -11 -32 4 -25 8 -53 -15 -18 50 -16 -13 -33 -42 -43 -37 -26 1 31 -17 -18 -7 -20 13 -55 -66 7 -31 -11
7818 -11 -61 -8 -23 29 3 -15 -2 32 -80 -27 -8 -62 -41 5 -19 -8 -28 -48 35 -1 -57 0 15 0 -17 -8 26 -22 8 -11
7848 -11 28 -33 -42 13 19 -8 44 -29 -2 -41 33 27 -47 33 -7 37 6 21 34 -16 18 10 11 -19 -13 -46 54 20 -23 -9 -70 -13 -32
7881 -32 -13 -2 -52 8 -22 22 -1 -23 47 5 28 -26 -19 -45 -45 -24 -47 -12 3 7 -28 -29 -14 9 -35 31 -17 4 -1 -11 -45 -21 -13
7914 -13 -6 49 40 19 12 -26 36 -30 -1 0 -8 12 -37 -33 22 -10 -10 15 13 -43 -9 5 -29 -16 -5 27 0 -21 8 -31 -25 25 -10 20 19
7949 19 -25 11 -55 13 37 -8 -28 -70 -8 7 -11 59 -50 39 56 -29 -5 48 2 -14 11 -25 -4 39 49 -8 61 -55 -23
7978 -23 23 -27 4 23 65 22 35 -34 32 60 -20 5 -19 34 4 -19 16 48 -37 -41 -30 -34 -20 -21 60 -12 46 -1 44 25 29 -22
8010 -22 -29 -2 44 -16 -11 11 6 -40 -24 -14 10 -3 -1 35 15 -36 -3 50 35 -29 -47 13 6 -59 -50 -29 -28 30 -1 22 -12 -53 -19 -36
8044c6K6K7o1O9p1M9qL5k9K3l3NO8o3l0M8n2j6M3L9k4mj2NM8j2n1j2N0l7qM8j7
8077Gj8J8K4K8p1K9m2mN1rm8J8OJ6j4M4J7q2L6l7K6koJ6K2J5m2K8J4l2Lo8K6M1
8111A0o8K2M0l4jO4j7o5J5J03q0j1K5j0KRl6M2p5J33l5m7Qm6N6N7q3j%jO4m1M5
8144D4m5l9O3o4L6J9o1K8O4l6Jl0l1N7o9M3K5k1N6l3Pl9J8j4oL2JL4p0%N7mp2
8177d9K5J6P0q0NJ4k6K8kJ4Om3J3P
$$ plain form
8044 -36 -10 17 -44 25 -46 3 -5 30 1 24 -9 -4 64 1 -29 19 -33 -49 -6 33 9 5 -7 -2 46 34 -17 -29 21 -16 -24 24 7
8077 7 -11 7 31 59 -12 17 -25 -29 22 13 -35 -17 -11 5 -9 35 52 -30 6 -31 -5 -7 -13 3 25 40 -2 26 40 8 11 -57 -31 10
8111 10 -58 -36 4 -30 -31 33 16 -49 -34 69 -11 -22 3 -7 -5 4 -32 10 -65 68 33 -14 -6 -52 4 61 -22 -23 -23 -24 40 -1 44
8144 44 -1 -40 23 -41 -5 14 -47 -19 45 9 10 -20 -51 6 -63 -20 5 -16 40 7 14 -25 -7 -21 -27 5 6 40 -30 -30 27 23 -49
8177 -49 -24 -8 62 -18 -13 1 -25 3 1 15 21 -22 -9 -2
8191b
$$ Imaginary data points
##PAGE= N=2
##DATA TABLE= (X++(I..I)), XYDATA
0@%%%%%%%%%%%%%%%%%Qj6J6j6J6j6K4l2L2m0M8m8N6o7P5q8J02j13J24j39J58j80
39i6K00k21K46k73L04l37L72m09M51m98N49o04O65p34Q10q95R90j097J220j362
59g19J529j728J968k270K657l173L905n028P001j1469M1440O382l5878K4739k8333
74A023j2618J304p548K979R373j421p04j2535K3053J3129k9411J4733K6167k8389
88h65J149O147k1917J0961J1868j3457O188R929N846r842j8946J5880M635k0912
102a3336J7867N055j5852J9173p060k7548J5285N705j1744K756L333R518l159
115gj2975J0480l848m861K1416j1555q482K7770j1412j9413J3373k680k296N948
129A458m602N481q2m293L670j4414M780K1899j6445j50K2187j4602o278N565j5790
$$ plain form
0 0 0 0 0 0 0 0 0 0 0 0 0 0 0 0 0 0 0 8 -8 8 -8 8 -8 16 -16 16 -24 24 -24 32 -35 40 -48 54 -59 65 -74 84 -96
39 -96 104 -117 129 -144 160 -177 195 -214 237 -261 288 -316 349 -385 425 -470 520 -577 643 -719
59 -719 810 -918 1050 -1220 1437 -1736 2169 -2859 4142 -7327 34113 40495 4617 29356 1023
74 1023 -11595 -10291 -17839 -14860 -5487 -6908 -7612 -20147 2906 16035 -13376 1357 27524 -865
88 -865 284 6431 -15486 -4525 7343 -6114 74 10003 15849 6007 -12939 2941 7576 -13336
102 -13336 4531 9586 -6266 12907 5847 -21701 -6416 -711 -12455 -9699 -6366 3152 -7
115 -7 -12982 -2502 -6350 -11211 10205 -1350 -9832 17938 6526 -12887 486 -2194 -4490 1458
129 1458 -3144 2337 2255 -2038 1632 -12782 -8002 13897 -2548 -2698 19489 4887 -1391 4174 -11616
144a1616J723P121o380K854M31N823N312j5031Q934J5154j3982Q120R388j6389
158A462P102K309j8471M964N620k786K956m397N217J598j5084O015J857j0538
172a2176J5761J092j2648J5215j20j2717P102r17M62N732n485N004l5q499P765
187E536o711p344J6199o393q434J2513p607n481O746p373L475O899l217O664k334
202C138l698Q049j0522l278J2147q834N53R321j0620J947M460r566M306K115k614
217c096O771n235o82O619r993K373P496q695P398N357j0400N811r1q620M965k955
233b977j196O843o242K374M010r098N866K160p901J0017O94o903P897l973m426
248b855O189n578J967N610o036N175L29q347O229l482o618Q389m307k570P642
$$ plain form
144 -11616 -9893 -2772 -9152 -6298 -5867 -44 5268 -9763 -829 14325 343 8463 17851 1462
158 1462 8564 10873 -7598 -2634 2986 200 3156 -1241 3976 5574 -9510 -3495 -1638 -12176
172 -12176 3585 4677 -7971 7244 7124 -5593 1509 592 1054 6786 1301 6305 6270 -2229 5536
187 5536 -1175 -8519 7680 1287 -7147 5366 -2241 -7722 -976 -8349 -4874 2025 -1192 5472 3138
202 3138 -560 7489 -3033 -6311 5836 -2998 -2445 6876 -3744 -1797 2663 -6903 -2597 -482 -3096
217 -3096 3675 -1560 -2242 4377 -5616 -3243 4253 -4442 2956 8313 -2087 3724 3633 -4987 -22 -2977
233 -2977 -4173 2670 -3572 -1198 2812 -6286 -420 1740 -6161 3856 4550 -2353 5544 1571 -2855
248 -2855 3334 -2244 -277 5333 -703 4472 4801 -3546 2683 -799 -7417 972 -3335 -5905 1737
263A737o079Q66N573n702N631L276m667P150k561n708N887o610k943O479o478
278d149J726M967p166L880J321o173O400q53l106P652m101j240N699o794J540
293c97M242o615M838J358o321N561k584m655O288m267p77O198n692K057L406o687
309d047M673J127n041P082j304l531O373n023j737M823o155J956L584n921M673
324A532K64n580N555k809l506O292m389o69N550n353K313L759m879N158J181l932
340D87N409l197l757M558n939j315M616n651K319L599n215M318P88m219N252j999
356E4j824N650m503L67M646n886K524K656o089M069K05n399M450k148k589M845
372A028l571J096M423m784L146J869n712M840m29n128N980j735k888N037l469
$$ plain form
263 1737 -4342 -3476 2097 -3605 2026 5302 635 7785 5224 -484 5403 -1207 -4150 2329 -4149
278 -4149 -2423 2544 -4622 -742 579 -5594 806 -47 -3153 4499 398 -842 4857 -1937 -397
293 -397 3845 -2770 2068 3426 -2895 2666 82 -4573 1715 -2552 -3329 2869 -2823 -766 2640 -4047
309 -4047 626 1753 -3288 3794 2490 -1041 5332 309 -1428 3395 -2760 -804 2780 -3141 1532
324 1532 1796 -3784 1771 -1038 -4544 1748 -2641 -3310 2240 -3113 -800 2959 -1920 3238 4419 487
340 487 5896 2699 -1058 3500 -2439 -3754 862 -4789 -2470 1129 -4086 232 1020 -3199 2053 54
356 54 -1770 3880 -623 -256 4390 -1496 1028 3684 -2405 1664 1869 -3530 920 -1228 -3817 1028
372 1028 -2543 -1447 2976 -1808 1338 3207 -2505 2335 1906 -3222 2758 1023 -1865 3172 -297
387b97m39L195m936J891Q44m422M448j467l384O685k556k170O412l452l95M140
403D097m578J118J726l638K839j397j925M950m319j538N230n519j27M246n766
418d601J958L536m077K800J186j225L613k941R8M038n181J499K944o292L491K186
434C032o570L524J193l894K551j423n66K964l338J950J949l973M929K68n469O110
450C237p2n236M375j063k256L406k573j01J712k560K350j828l079N825k702l454
466d019O559k075j796N292l362o72L756k938k59k67j306K766l726j374N322m065
482b164k1M936n120J323M648n459N02L027k065J331r77J36L180l666P50K246n287
499b680L005K020p124L345K858n170K043Q92j528K616j251L69J602k372L175l79
$$ plain form
387 -297 -736 2459 -2477 -586 258 -4164 284 -1183 -4567 2118 -438 -2608 3804 352 -43 4097
403 4097 -481 637 2363 -1275 1564 167 -1758 3192 -1127 -2665 2565 -2954 -3081 1165 -4601
418 -4601 -2643 893 -3184 -384 802 -423 3190 249 347 4385 -796 703 3647 -2645 846 3032
434 3032 -3538 -14 1179 -2715 -164 -1587 -2153 811 -2527 -577 1372 -2601 2328 2596 -2873 3237
450 3237 3165 -2071 2304 1241 -1015 2391 -182 -283 1429 -1131 1219 -609 -3688 2137 -565 -4019
466 -4019 2540 465 -1331 3961 599 -73 3683 745 486 219 -1087 1679 -2047 -3421 1901 -2164
482 -2164 -2185 2751 -2369 -1046 3602 -1857 -1355 1672 -393 938 -39 97 3277 -389 361 2607 -2680
499 -2680 325 2345 -4779 -1434 1424 -3746 -1703 -811 -2339 277 -974 -605 997 -1375 1800 1421
515A421m763N827L74n530M682R3l716L348j761k180K518j256K56p19j460M276
531A410k276l178N779j740k168N403k890j218M826k816j344J930j043J088j932
546a69j262L413l292r94L849m225J005M962n108O16M216l101M09Q25j125K112
562B131j559k93J920l401J845J703n698K997K875n306K176J806l147K245q7j469
578a262K046p98J334J70l027L767J1m889M031J66l776L609j164k853L129j126
594f32j268J004q25K201o95k243M097j253k420M403k296j465M636k688j492K859
610A923j941j43Q2j626K322j485j217L016l045OL890m053O52M020l095O65J955
627A926k231J559j32j385J995j812L17J644l877J527K018m409K003J794l150K514
$$ plain form
515 1421 -3342 2485 2859 -2671 2011 2104 -1612 1736 -25 -2205 313 -943 -687 -1406 -2866 1410
531 1410 -866 -4044 1735 -5 -2173 3230 340 -878 3948 1132 -212 1718 675 1763 -169
546 -169 -1431 1982 -1310 -2304 1545 -2680 -1675 3287 -1821 -1205 3011 -90 319 1144 19 2131
562 2131 572 279 2199 -1202 643 2346 -3352 -355 2520 -2786 -610 1196 -1951 294 207 -1262
578 -1262 784 -14 1320 1490 -1537 2230 2241 -2648 1383 1549 -2227 1382 218 -2635 494 -632
594 -632 -1900 -896 -1721 480 -215 -2458 1639 386 -2034 2369 73 -1392 3244 556 -936 1923
610 1923 -18 -161 -79 -1705 617 -868 -2085 931 -2114 -2108 1782 -2271 -1619 2401 -694 -29 1926
627 1926 -305 1254 1122 -263 1732 -80 237 1881 -1996 -469 1549 -2860 -857 937 -2213 301
643C01L81k175K416o24m97J584j985J745R41l297K507K85l326L005o82k502L100
660A177j367j587K057j652O23J006j885K526K00k036L088j219j786L379k245j175
676h96K873k365j43J372k335J329j9j817K368j251q68K955k526k3L031k648R06
693e7K210k437J480N45k231J855r67j092J941k229J69J963k978R95J465k832J960
710b40O75k156K456l10j248K215j463J40J791k379J277R26k780J935k44k305K447
727G37r22j448K456j703j82J916k272J138J108k053K235Q4j767K531j260j222
743f24K428k164k60J818k471P42R29k280J782m7j553K476j103o42K465j953J75
760b82J917k266J080J117k233J794k79j807J910j362r27J986k013K88J695k304
$$ plain form
643 301 682 -1493 923 299 -198 1386 -599 1146 2087 -1210 1297 1582 -1744 1261 579 -1923 1177
660 1177 -190 -1777 280 -1372 -749 257 -1628 898 1098 -938 2150 931 -855 2524 279 -896
676 -896 1977 -388 -531 841 -1494 -165 -184 -2001 367 -884 -1752 1203 -1323 -1346 1685 -963 -57
693 -57 2153 -284 1196 1741 -490 1365 398 -694 1247 -982 -813 1150 -1828 -833 632 -2200 -240
710 -240 435 -1721 735 425 -823 1392 -71 69 1860 -519 758 1684 -1096 839 595 -1710 737
727 737 -185 -1633 823 -880 -1062 854 -1418 -280 828 -1225 1010 1094 -673 1858 598 -624
743 -624 1804 -360 -620 1198 -1273 -531 398 -1882 -100 -147 -1700 776 -327 -969 1496 -457 -282
760 -282 1635 -631 449 1566 -667 1127 848 -959 951 -411 -1338 648 -1365 -1077 618 -1686
776a686J308J006k090K017J09j546K324j017o71K029j910K47J574k481J277M63
792I53k377J847n05j717K178j128o11K183j653N00J540k022J458O40k001K052
808A337m95j469K159j487p19J881k028K25J374k263J189M20j856J996m36j051
824a223K323j169k61K162k030M79J378k189J162M37j970J533n14j348J724j386
840h92l18J779k000P70J393k224J633O01j809K047k82j139J969j219m29J393j908
857f35O93Q09k198J489J32k011K061n92j369K220j110l05J762j402P34Q74j674
874e22J512p1j587K008j089j145K082j695n49J819j831L94R95j618J270J19j248
891a156J924q34n44K133j693R8J817k066M80J119k034J035J50j511J381p44n60
$$ plain form
776 -1686 -378 628 -1462 555 664 -882 1442 425 -246 1783 -127 120 1694 -787 490 953
792 953 -1424 423 -82 -1799 379 -749 -1360 823 -830 -330 1210 -812 646 1286 -715 1337
808 1337 842 -627 1532 45 -674 1207 -821 -596 778 -1485 -296 124 -1732 264 -172 -1223
824 -1223 1100 -69 -330 1832 -198 281 1659 -530 632 1069 -901 632 118 -1230 494 -892
840 -892 -1210 569 -1431 -661 732 -1492 141 742 -1067 980 698 -441 1528 309 -120 1273 -635
857 -635 58 867 -1331 158 290 -1721 340 -252 -1621 599 -511 -816 946 -456 278 1152 -522
874 -522 990 919 -668 1340 251 -894 1188 -507 -1056 763 -1068 -674 321 -1297 -27 92 -1156
891 -1156 768 -66 -610 1523 -170 -72 1745 -321 159 1278 -756 279 429 -1082 299 -445 -1005
908a005J396j570M71J512k046J184J138k032J713K37j701J810m35q90J265j193
924a46O9Q36j843J079L39j985J877k41j760K345o73j044J975q71j19J256j309
941b15R01K39j403J550p15j303K158j431r64K055j534l55J542j533O07P38j160
958h23J249k54p02J839j413j12J986k011J65J515k071N81Q57j817R49jr07J104
976A34r52P7J438j799Q88J249j981J353Q31k013J636J59j567J316n98m83R81j448
994g79N21N79j795J500P0j824K231l63j445K097o17o72J484r72K28Q30j371R64
1012F66j95j194J671j139j078K095j370o86J780j418J34J219j224P45L84q12J328
1029I06q28l49J834j678k2J616j987L81J186k010P48O07j486R91l02l56J237j251
$$ plain form
908 -1005 391 -1179 -708 804 -1242 -58 1080 -952 761 998 -703 1107 672 -218 1047 -146
924 -146 -77 759 -1084 -5 334 -1651 226 -15 -1775 570 -103 -1147 828 -43 -162 1094 -215
941 -215 686 925 -478 1072 357 -946 1212 -219 -1183 872 -662 -1017 525 -1008 -401 337 -823
958 -823 426 172 -530 1309 -104 -216 1770 -241 -76 1439 -632 -51 806 -1011 -62 -63 -970 134
976 134 -818 -741 697 -1102 -214 1035 -946 407 1238 -775 861 1020 -547 769 171 -312 669 -779
994 -779 -258 321 -1474 26 96 -1728 503 140 -1305 792 175 -497 987 15 243 1073 -298 666
1012 666 471 -723 948 -191 -1269 826 -544 -1230 550 -868 -734 485 -739 6 390 -422 906
1029 906 78 -271 1563 -115 -137 1479 -508 -127 1059 -951 -203 404 -1082 -91 -393 -749 488 -763
1047g63L97J313j689J080Q62j966J473M59j833J408k06j050J122r84o7Q32j399
1064a011Q09L78j595J697j3j522J928l88r71J656p71l04J184j131L70L43j217
1081e58J169n38j112J626r93q19J806j269j99J507j364N01Q83j107J018r1p60
1098c00J391r56m14J502j646J55J163j739N46P85j572Q47K08r61J299o21k17J288
1116G58j155M48J035j573R50O13j659J214P8j345J188o78n71J096j112J89P88
1133B64j333J030L34j357J549q7j135J674o39n92J348j049K9Q07j235O03J57j283
1151i15J232m34r71J516q46n10J484j114K00J086j216Q23L72r91J101l60p75J306
1169I88r35m09J198j498K74Q84j501P30L77j111J179k80o34J316p35r1J316j311
$$ plain form
1047 -763 -366 947 -742 338 1200 -766 707 1166 -667 741 535 -515 607 -377 -444 388 -1011
1064 -1011 -202 176 -1419 278 265 -1257 671 283 -688 968 197 -107 1077 -54 316 659 -558
1081 -558 611 73 -1039 587 -406 -1225 581 -688 -887 620 -744 -243 640 -467 551 460 -300
1098 -300 1091 135 -279 1223 -423 -268 895 -844 -298 487 -1085 -238 -30 -991 308 -313 -530 758
1116 758 -397 51 1086 -487 463 1076 -583 631 709 -636 552 -126 -697 399 -713 -524 264
1133 264 -1069 -39 295 -1062 487 400 -735 939 300 -292 1056 7 36 843 -392 211 368 -915
1151 -915 317 -117 -1088 428 -418 -928 556 -558 -358 728 -488 335 707 -284 817 457 -318 988
1169 988 53 -356 842 -656 -382 502 -999 -269 108 -1003 176 -104 -738 578 -157 -248 1068 -243
1187b43M60P72j345Q33K52j417J163l95q94J222q45l00J060j093M00P51j246J086
1205B21L09j127J289k49p81J326q58k51J004j213L12N62j359R23L8j185J252m42
1223b29p18J388q41j07J199j086M86P02j153R00N9j039J157n48o81J175j097q9
1241e22R70j271M50O24j188R09J43q66J202k63n82J196q11j3R91j189M59N21j333
1260e73Q30oj035R95m33o12J102r07J32R08j077O73N75j137J035M3r04J217m70
1279C56n71J030r53p9Q38j242M77L69j135R60j51q15J260n11l57J187q32P0R49
1298H50j066N08M17j038Q64j60q48J030p37l31R48j036J27Q14j131N87M94r98
1316g06R57k1p07J200n35k83R89r62J21P33j261N54L07j120Q63j84p87J060n25
$$ plain form
1187 -243 217 989 -356 477 729 -688 475 80 -814 408 -437 -737 323 -770 -370 381 -865 221
1205 221 530 -597 692 443 -338 988 130 -121 883 -330 -18 544 -815 108 146 -1039 213 -229
1223 -229 -947 441 -400 -507 692 -394 92 794 -359 541 600 -439 718 170 -511 664 -433 -522
1241 -522 448 -823 -373 251 -937 -28 115 -751 451 188 -394 802 -9 -22 969 -220 239 760 -573
1260 -573 257 251 -784 211 -222 -834 268 -639 -507 401 -676 -3 572 -565 470 513 -391 826 356
1279 356 -215 815 -138 -217 621 -621 -144 225 -910 50 -101 -916 344 -167 -524 663 -169 -99 850
1298 850 -216 292 709 -329 535 375 -473 557 -180 -511 437 -599 -472 342 -789 -202 292 -706
1316 -706 251 230 -477 723 188 -95 894 -68 53 786 -475 79 386 -734 129 -55 -842 218 -307
1335c07l07R92q34K61O98q73O50K87r07J000k51p43J040o61m31Q78q90Q6N85j106
1355h33O46J76q24J046k75n32J110o24r9J015q38Q5P41j002N25J90q69P69m23
1374a6n62R34p44k19R65r92K88P29r73O50L06p52Q04j48m53Q58o18j43P67r70
1394b89K90M41j112O51J53r48R19k05n88R33n67JP60p07M14M40q50P33N0r09R22
1415E32k94o46R24p22k44P25p89K56L89q53P96J0p10J002k72m22R76n91j55Q29
1435G41r11K80L75q36N66k5p52P49m61l47Q70p48L4Q09q36L63N77q21O70J54o90
1456b39Q44l80l15O64p44P2N26r74M59L68j028O65P7o74Q65k42l67Q24m86Q0N70
1477E65p52M66L10r01P30j00p74Q82n01m32O98o12M6M74n76L43L15o55P59j61
$$ plain form
1335 -307 -614 378 -456 -195 503 -370 280 567 -340 660 409 -334 706 45 -386 492 -398 -312 273 -833
1355 -833 -187 -11 -835 211 -64 -596 514 -110 -209 806 -32 53 794 -208 317 507 -362 407 -16
1374 -16 -578 356 -388 -607 358 -634 -346 383 -590 60 366 -386 418 270 -183 675 57 -86 681 -289
1394 -289 1 442 -670 -19 134 -814 105 -100 -688 245 -322 -321 439 -268 146 586 -264 469 519 -390 532
1415 532 238 -408 516 -206 -450 275 -514 -258 131 -722 74 84 -626 376 104 -318 658 67 -88 741
1435 741 -170 110 485 -351 215 190 -562 187 -274 -621 249 -499 -465 344 -492 -129 448 -373 297 451 -239
1456 -239 605 225 -90 574 -170 -98 428 -546 -87 281 -747 -82 -5 -679 186 -56 -423 401 -85 -5 565
1477 565 -187 279 589 -312 418 318 -456 426 -75 -507 191 -421 -375 99 -477 -134 181 -474 285 124
1497A24m61R70m78k59Q07o91n4O09q59L32K39p26N16j48m71P21m54j96Q36p07
1517c50J90O01p74M79L21p30O51j1n60O58m73j76O21q55J79M48q18M77K34p79
1537f67P20J4n29Q07l24j29O10n71J95L62o74N09P5p96O93k32n83P31n29j26N89
1558A45o22K31M39o41N64J69o37Q24k28m49Q35n83j80P32o88M2L63p06L57K7n78
1579e84O71k64l27P98n33J1O30o62L38M54o53L71J21n81O21k63m14N77n27q1M76
1600A79o47K42L18p17O02J70n86O77j62k63O11m19pM70n95L10K06o89N04q4o09
1621d89O66k68l86N90l99n1N55n25L12L02n48M82L6m78O99l36k95O27o15m7M95
1642C27p24K63K51o27M76om48O17k48k10O68m74J13N09o31L32K52o32N24q8n58
$$ plain form
1497 124 -337 633 155 -104 703 12 -42 567 -292 40 279 -447 69 -79 -550 171 -283 -479 357 -350
1517 -350 -160 441 -333 146 467 -263 388 377 -183 475 2 -174 447 -408 -229 219 -599 -122 112 -667
1537 -667 53 67 -462 345 21 -108 502 -69 126 488 -186 323 398 -398 295 63 -520 211 -318 -444 145
1558 145 -477 -246 193 -448 116 285 -352 472 244 -205 630 47 -133 599 -89 -47 316 -390 -33 -6 -584
1579 -584 87 -177 -504 294 -239 -228 402 -260 78 532 -121 250 371 -210 411 148 -266 311 -216 -297 179
1600 179 -468 -226 92 -625 -23 147 -439 238 76 -187 424 5 -2 468 -127 183 389 -300 204 120 -489
1621 -489 177 -91 -477 113 -286 -337 218 -307 5 307 -241 241 277 -201 498 162 -133 494 -121 -168 327
1642 327 -397 -134 117 -510 -34 -40 -488 129 -119 -329 339 -135 -22 487 -144 188 440 -192 332 244 -314
1663c14N57l22k73N83n77O7M41n96L70K25n61N51Pl86O88l19j81N68n14J5L50
1684C79n61K73J08n85L82l7m61O08l15k13O14m90J55L99m65L11K32m66N19j33
1704B54m15O33m08k22N09o12P9M03o30K63J42m48N25j06k71N62l12r5O15n19P1
1725A8L80n50L22R9n65M66j40m53N92l78j74N52m92J33L39n21M47J59m80O15j80
1746A89l05N52m18m5M14n50J43K59o23L63M1m67M53j66k64O05l12k6M31m29K50
1767I5K71m80L46O4m81N17k60l21M90l37j31M18n51J76K43m44L90Q9l89M91j46
1788E0k19N96l86l1M64m66L4K75n33L63k5n20M81k11k35M73l51o9N00m44K08L49
1810C03n39M05K8l56N59k35k72M80m57j1L22n19K88J42n42L91Pl34N24j80j82
$$ plain form
1663 -314 243 -79 -352 231 -346 -279 162 -434 -64 161 -400 151 158 -228 460 141 -40 528 14 29 379
1684 379 -182 91 199 -386 -4 -41 -502 106 -209 -422 192 -298 -143 256 -209 102 334 -132 387 254
1704 254 -161 472 64 -158 351 -261 -182 221 -409 -146 -4 -452 73 -33 -304 258 -54 -149 466 -53 18
1725 18 398 -152 170 269 -296 170 30 -423 169 -209 -383 169 -323 -190 149 -372 75 234 -246 369 189
1746 189 -116 436 18 -27 387 -163 -20 239 -384 -21 20 -447 6 -160 -424 181 -131 -157 274 -155 95
1767 95 366 -114 232 296 -185 332 72 -249 241 -96 -227 191 -360 -184 59 -385 5 94 -295 196 50
1788 50 -169 427 41 10 474 8 42 317 -216 147 122 -398 83 -128 -363 110 -241 -310 190 -254 -46 303
1810 303 -236 169 197 -159 400 165 -107 373 -84 -95 227 -292 -4 138 -404 -13 -6 -340 184 4 -178
1831a78M70l80L1M71m39J74K08n59N01j19m55M90k43k66M24l93rM06n15K93K25
1852A37m72M46Rl36N47k68r9M41m86O0L50n30J74J62m40L06m1l87N57k82j35M64
1874A77m23J70L74m81L60J37m64M77j05l39M05k42k30M15m15N3K40n24L17J38
1894D0m39M58q1l25N73k38j27M80l68J24K40m36K12O9m04M56k40k70L95l17p9
1915b77M02m05J09L11m55L54J76l78L51m4k08L97l00n5L46m65J08K27m29K21N5
1936D1m45M24j09k57M60k69K2M01m23J94L00m75L68j6k87L24j14k93L94l03j06
1957a69K86m19K04K41m42L29N0l24M30j41j56M17l35ML85l97J42J45m21K68o7
1978C0l56M40j67l12N18m03M7L38l64J97K48l81L11P6l59M52k01j54L70l88l0
$$ plain form
1831 -178 292 -88 -57 414 -25 149 357 -202 299 180 -275 215 -28 -294 130 -263 -272 134 -381 -88 137
1852 137 -335 111 120 -216 331 63 -36 405 -81 -21 329 -201 -27 135 -305 1 -40 -427 130 -152 -287 177
1874 177 -246 -76 298 -183 177 314 -150 327 222 -117 288 46 -184 231 -184 -131 109 -415 -98 40
1894 40 -399 59 -22 -347 226 -12 -139 341 -27 97 337 -99 113 182 -222 234 -6 -276 119 -198 -277
1915 -277 125 -280 -171 140 -315 39 215 -163 188 144 -64 333 33 -22 324 -141 -33 194 -235 -14 41
1936 41 -404 20 -89 -346 114 -155 -133 268 -155 39 339 -136 232 216 -71 253 139 -154 240 -63 -169
1957 -169 117 -302 -98 143 -299 30 80 -244 186 45 -111 306 -29 -25 360 -37 105 250 -171 97 30
1978 30 -326 114 -53 -365 153 -250 -203 135 -229 -32 216 -165 146 222 -137 315 114 -40 330 -58 -88
1999h8L18m26J82J14m17K73J9l30M24j62j03M36k89kL82m29K03K05m61L41J1m51
2021b50M34k45k02L94m10O9K65l82K54J95m04L87Pk78M14j96j49L73k63K3K21
2042B57l62J52J65m38K86j10k98M05j67j50M03k89O4L02l08K01J03k93L03k0l60
2063a54L92k36j19K90l54P3J97m06K45J40m03L54j5k15L44j77l9M06l67J89J48
2084B93l68K07K4l46L72j65k72L49k67l7L01l43J54J83l31K86J24l11L93j46k01
2105a01L81k73q9L54l61M6J76l51J77N1l22L55j31k13L99j73o4L59l59J94J97
2126B52l88L02P6l43L30j43k52L49k79m5K37l22O9K32l21K37N6l23M41j38j77
2147a50L79j88l7K53l48Q0K33m25K64K1l01K98j76r2L12l45Q5L06l36J83J63k96
$$ plain form
1999 -88 230 -196 -14 100 -317 -44 -25 -355 69 -93 -196 240 -49 -51 331 -98 105 310 -151 190 201 -250
2021 -250 184 -61 -263 131 -279 -210 55 -327 -73 122 -282 105 112 -166 248 52 -97 276 13 36 257
2042 257 -105 47 212 -226 60 -50 -348 57 -110 -260 143 -146 -82 220 -88 113 216 -77 226 206 -154
2063 -154 238 2 -117 173 -181 -108 89 -317 -72 68 -335 19 4 -211 133 -44 -83 323 -44 145 293
2084 293 -75 132 156 -190 182 17 -255 94 -173 -210 91 -252 -98 85 -246 40 164 -147 246 100 -101
2105 -101 280 7 -82 272 -89 -43 133 -218 -41 10 -312 43 -88 -301 98 -75 -139 220 -139 55 252
2126 252 -136 166 242 -101 229 86 -166 183 -96 -141 96 -226 -157 75 -246 -9 47 -276 165 27 -150
2147 -150 229 41 4 257 -91 -11 222 -203 61 82 -219 79 -97 -189 123 -222 -137 169 -167 16 179 -117
2169a17K36J4k27L91j75j93K98j88j10K25l20J30J27l69K78N2k83L37k03j00L53
2190A56k34Q8K15l02J53J21l38L07o4k81L19j71j64K77k07NK08l61J96J59l24
2211b42L54n6j55K93j58o0K90k60L7J73l86K34%l15L24j22k15K63j28k5K94k68
2233a28Q6K46l61K51J19l42L30o4k13L12k27j05K61k92O9J77l37J77kj49K03k
2255Ij76L85j99m2K87l10J07K61m22K41j4k93L22j21k33L38k54j02L18l03J15
2276h6J83k99K44O5k84L62p9k00L77k64p2L03l22N9J29k82K00k8k50K93j02j89
2298b42L63j78k3K21k63J92J73l19K17L0k40K30j39j58K95k03n1J79l05J43J42
2319F4l01K28J1k17L42j46q0K50j25m5K48k40R5J13k99J98j6l03K76q2j72K46
$$ plain form
2169 -117 119 133 -94 297 122 -71 227 39 -71 154 -166 -36 91 -278 0 52 -231 106 -97 -197 156
2190 156 -78 10 225 -77 76 197 -141 166 102 -179 140 -31 -195 82 -125 -120 88 -273 -77 82 -242
2211 -242 112 56 -99 194 36 -24 266 6 43 216 -170 64 64 -251 73 -49 -264 -1 -129 -154 140 -128
2233 -128 -42 204 -157 94 213 -129 201 137 -76 236 9 -96 165 -127 -58 119 -218 -41 -43 -192 11 9
2255 9 -167 218 19 -23 264 -46 61 322 -100 141 127 -166 156 35 -198 140 -114 -216 102 -201 -86
2276 -86 97 -202 42 107 -177 185 106 -94 283 19 -53 250 -72 -13 116 -166 34 6 -244 49 -53 -242
2298 -242 121 -57 -80 141 -122 70 243 -76 141 171 -69 161 22 -136 159 -44 -95 84 -221 -78 64
2319 64 -237 -9 2 -215 127 -19 -99 151 26 -19 229 -11 84 197 -102 96 80 -223 53 -29 -201 45
2341D5j80k2K63k29J41J67k97K38nj59J95j18r9K31k09l2J72k59J07J19k93K12
2363a2k5j34K92k00p6L12k04M0K16l22K29O8l01K33J4k63K37j21j05K38k68M6
2385a06J91k91J87J35l46K59K4j67K51r9r0K75k16k4J92k90J38R2l05K18l3k27
2407b32L25k36K1K25k51N4J89j95J56P8j89K10q5j46K68j60q1J82k43J5J55k41
2429a81J08O2j72J99j5r5K01j76J3K55k66Q8J45k47K23J7k90K47j03j95K18j49
2451a13j1K18k41J31J33l25K22P7k08K60n0j24K46k27n9K41j76N0k5j94K13K4
2473F2k52K50r9j48L06k36k2K46k09O6J66j71J69m8j14J83j20j09J74j30m9J65
2495H0k17P3J06k78K12N3j13J80j20o1K94k31J2J92k30J18N1k01J67p8j56J94
$$ plain form
2341 45 -135 -157 106 -123 18 185 -112 126 121 -38 157 39 -60 171 -38 -70 102 -157 -50 69 -224 -12
2363 -12 -37 -171 121 -79 -155 157 -47 -7 209 -113 116 184 -117 116 130 -133 104 -17 -122 116 -152 -106
2385 -106 85 -206 -19 116 -230 29 53 -114 137 38 -52 223 7 -17 175 -115 23 115 -190 28 -5 -232
2407 -232 93 -143 -122 103 -148 -94 95 -100 56 134 -55 155 70 -76 192 32 -49 133 -110 -95 60 -181
2429 -181 -73 -11 -183 16 1 -94 107 -69 -56 199 -67 21 166 -81 142 159 -131 116 13 -182 36 -113
2451 -113 -124 94 -147 -16 117 -208 14 91 -117 143 93 -31 215 -12 -71 170 -6 44 19 -175 38 62
2473 62 -190 60 -39 -187 119 -117 -139 107 -102 -36 130 -41 128 80 -34 149 29 -80 94 -36 -85 80
2495 80 -137 -64 42 -236 -24 29 -84 96 -24 -85 209 -22 -10 182 -48 70 121 -80 87 9 -147 47
2517D7q5j28K23j59J5J83k61J96K6j30J68mj64K11j52l8J37n8j16J66k35J29O9
2540D0k67K39o1j76K94j09oJ33j37N9J23j72R8L6j54J78j8k14K27j09j84J96j74
2563a58N2R1j79J41J02j70J87n3o9J61p0o5K42k39L7J35k23J26K1j84J70p6j08
2586a29J81j60k8K15k09J17J02j99J80R4k27J61pj31P4n5o6K14k28L8J30k25J05
2609e3J4j46J82l1k1J64j49K2J45j26M6J14k72K38k1k20J72o9r7K00j54p8J60
2632B0j71J05R0j41J55K6j85J63Kq3J95j70k4J19j63Q0R7k17J71j00j49K39j09
2655e0m1J08p0k6J82j60M6J65k65K17k7j03K17j30o0J00j63L4Q8j30nJ37k26J76
2679A4k4j38K17j7r6J27j55P4J34j27M6K7j53J11j4j32J49o9j15J89q9o1K08k15
$$ plain form
2517 47 -38 -166 57 -102 -87 96 -165 31 57 -73 95 91 -73 138 -14 -52 85 27 -89 77 -158 -29 40
2540 40 -227 12 -49 -225 69 -40 -46 87 -50 9 132 -40 58 94 -60 118 100 -114 113 4 -180 16 -158
2563 -158 -106 -15 -194 -53 49 -121 66 13 -56 105 35 -30 212 -27 10 145 -78 48 69 -115 55 -21 -129
2586 -129 52 -108 -136 79 -130 -13 89 -110 70 164 -63 98 91 -40 34 -21 -87 127 -101 -63 67 -158 -53
2609 -53 -39 -185 -3 -34 -55 109 -40 -18 127 1 47 161 -111 127 106 -114 58 -11 -108 92 -62 -140 20
2632 20 -151 -46 44 -97 58 84 -101 62 64 -19 176 6 -18 101 -62 18 115 -102 69 -31 -180 59 -50
2655 -50 -91 17 -53 -79 103 -57 -11 154 -111 106 79 -24 193 63 3 103 -60 -26 62 -68 -73 64 -162 14
2679 14 -10 -148 69 52 -44 83 -72 2 136 9 55 82 -71 40 26 -106 43 -26 -141 48 -41 -102 106 -109
2703a09J07J23j50J46k9j48J87r0o2J53j60LR6j68P0O1j19P3j3j00J41q0l6K18
2727A14j35L1J22j68O3R9k27J69J1j49J43j54k2J80j39m5J38j75J28O9j42Q9K5
2750B5o9J93p7n2J68j92J13Mk03J36jr6J31r5j37J97p2p6J63j36J0J22j85K02
2774G3lj22J44m9nJ27j79PK2j06M2N5j19O6P6j76J99q7n4J58j08L1J28j57J33
2799I6K7j32O8N3j52J37r2q5J56j72M1R8j32O9Q6j85J18N7j80K37j11p0J79j29
2823a8L0J14j84Q4M5j59J00J3j88J98m0o6J21j26N6J06j29O7R2j39J07qj14J29
2847I1j24k1J32j02j2J01j98O4P5j82J74J6j04J11m0k7J11p6MJ16j25J09K7j79
2871e9J14Nj57J59l6j29J40o2m6J04j04J03J29k52J84k6j15J55r9jQ7r2j7Q0j88
$$ plain form
2703 -109 -2 121 -29 117 88 -60 127 37 -25 128 -32 -29 67 -101 -31 30 -89 -16 -29 -129 12 -68 -104 114
2727 114 -21 10 132 -36 27 126 -101 68 79 -70 73 -81 -103 77 -62 -107 31 -144 -16 53 -89 0 25
2750 25 -44 149 72 20 188 -4 109 113 -90 46 45 -51 80 -15 -152 45 -27 -103 60 -76 -66 56 -129 73
2774 73 70 -52 92 43 38 165 -14 -7 15 -91 -49 6 -113 -47 29 -147 52 -35 -89 69 -39 -8 120 -37 96
2799 96 123 -9 59 112 -40 97 5 -80 76 -96 -55 43 -89 -20 66 -119 -1 56 -124 113 2 -68 111 -18
2823 -18 12 126 -58 26 71 -88 12 25 -163 35 -5 -71 50 -76 -20 86 -43 24 116 -23 84 76 -38 91
2847 91 -33 -54 78 -24 -36 65 -133 -69 6 -176 -2 14 -90 21 -19 -46 65 -11 -7 109 -16 93 120 -59
2871 -59 55 60 -97 62 26 -103 37 -25 -71 33 -71 32 161 -91 93 67 -48 107 8 7 94 2 -15 65 -123
2896a23L4J34j50J26k4j30J13J2p2J23p6m1J69r5j3J17r6R5p8l1O5j0j65J81r8
2921c3j9P2j40J58m7n2J21m1QM4n8%J45j58j9J21j03j1K9j39J47k6r6J02q3j5
2947i3J07j10M9J25j94J45J9j47J73k5o3J44j06p4J27j08KP9j43N6K3j0N5m4k7
2972d0J23q3rQ8r6N0J2q6N8L4j14J45j08o7J40j32k2J59j38K8N8j11J03N2j23
2997g9J44l3l7J02j13O4J5n6m0Q4j79J42l5j38J85p6o0J68p6l0Q6m7M0J06j82
3022d5Q0m2j03J64k7q4J11j60J4Q7q3O5Q6j59N8P0r8Q8n7j0J46p2MR4j55K4L7
3049C3j30J32%j17J85j33o5J00r1K2J11r6P5O0j34R6lm3M8p4MR4j31R1K8j46O4
3076b0Po2M8M6j22J41m0m2N9p5R8Q0j81J15N6j32R1K4j31J03l1p9P7p6N0O1q4
$$ plain form
2896 -123 -89 45 -105 21 -3 -133 -20 -8 -80 43 -33 -74 95 0 -13 104 8 103 25 -6 59 49 -116 65 -33
2921 -33 -52 20 -120 38 -9 -61 60 19 27 71 13 13 158 0 -19 102 -1 -12 17 -122 25 -1 -97 5 -78 -93
2947 -93 14 -96 -47 78 -116 29 48 -99 74 49 -14 130 24 -50 77 -31 -29 50 -93 -37 -14 -24 31 -13 -40
2972 -40 83 0 -9 79 -17 33 45 -41 17 51 -63 82 -26 -93 47 -85 -107 52 -86 -58 0 -111 -8 44 -79
2997 -79 65 32 -5 97 -16 48 63 7 -33 51 -128 14 -21 -159 26 -50 -110 58 -18 -48 38 -9 31 137 -45
3022 -45 35 -7 -110 54 27 -57 54 -106 -92 -5 -88 -23 63 -96 -38 32 -66 22 -35 -45 101 29 33 127 -28 -4 33
3049 33 -97 35 35 -82 103 -30 -95 5 -86 -64 47 -49 26 86 -48 48 45 2 50 -24 -20 74 -57 34 62 -84 -20
3076 -20 -13 -75 -27 19 -103 38 -2 -44 15 -60 38 118 -63 52 108 -24 67 91 -40 63 32 -47 30 -46 4 65 -19
3103a9k9J25j29P3om7Q4o5m1J54n1n2K1r3J43k0j31J02Rj20J58j29J9R8q6NP7
3130E0m3oP2q8J08l2j03J33n0m4O5p2j3M3j36J02M6j08J17p0l6Q5j08L9J48j61
3156f2N1R2q9M1M8j17P2p0m3J24o8j4L6o3J9R3j02O0O2j33J13m1p8K14j88N9P8
3183I4j46Q4j2o5M8k3q3P0Ko2J03j01P3R1j01N0P9j54J29j7j08P6k9o3J12p8l0
3210f1J09p9J9O3j12Q7m4l2O6Kn2J23p6J7M9o0K0J0j02N8nj48J41p5O2n1L4qJ3
3239c2o5N7P4j31J40L7j51J57n6n9J47j37j0O7l7LJ6j01P2N2j41J16o2qJ39p2
3265A5k9P1o4O3oj17O0M9p9M5l9m9J34j11k1J01q9J8L6n6P9qo5J14n0l7J45q1
3293B9q9K12j90M2K7q5J21r1p3J42n9n3J34j14L2O4q8J02O8j76R4mo4J01r2l8
$$ plain form
3103 -19 -48 77 -52 21 15 -32 52 -13 -54 100 49 -3 18 -75 68 48 -83 19 28 -92 66 -63 -44 54 -32 -27 50
3130 50 7 1 73 -15 93 61 -42 91 41 -3 62 -10 -23 20 -116 -14 32 -76 41 -29 -65 20 -88 -49 99 -62
3156 -62 -11 81 -8 33 81 -36 36 -34 -77 47 -21 -35 1 -62 -43 50 -52 8 70 -63 50 9 -69 145 -43 16 94
3183 94 -52 32 20 -45 3 -20 -103 -33 -31 -93 10 -91 -18 73 -28 22 101 -53 76 59 -49 27 -2 -65 47 -31 -61
3210 -61 48 -31 -12 51 -61 26 -18 -50 16 18 -34 89 13 30 79 19 39 49 -53 5 0 -148 -7 -82 -20 -71 -37 -45 -32
3239 -32 -97 -40 34 -97 43 80 -71 86 30 -29 118 -19 -29 38 1 4 20 -81 -9 43 -98 18 -44 -52 87 15
3265 15 -14 57 -7 56 50 -67 -7 42 -37 8 -31 -80 54 -57 -78 23 -66 -48 -12 -68 11 3 -62 52 2 -35 110 29
3293 29 -60 152 -38 4 31 -54 67 -24 -97 45 -14 -67 67 -47 -15 49 -39 63 131 -45 49 45 -19 82 -10 -48
3319d8J09r4j1R8j42M0O0q3N2k0j7J38r5j7M1l8L9R7j46R2L5j11PJ0qM2q2m1J54
3348F1r7J5R2r2N4K3p7M8ML0Pq2m4J30j22L7P7j36J01m3j25J53J3j44J02p4L1
3375e8J38r7M4J2p0K9R2r7L6Or4J11o2o2J48j35L9P8j56Q7M2n6M6l9J2N0l2j3
3403aJ04p1n7N7q9R2p4k0L9J9q5P7j5k9J7m0M7R4j15P0M1l9O9o9lM3j19N8Lq7
3433h3P6J8r6R4j3j3K7K1p8J30r7k6P2p0J09oj02J05q7l2P2nq6R4n4n2J09r0%
3462f3Q2q9R3Mn9O0N0m8L2m4m4J30r9L9%o2L5j2q5P1m1j1Q3k4j4N7p5L9N7o8M1
3493C5K8r4R2p5j9O5j04Q6o2J2k2K8o9J98l9q5L8p4J02k5j2k7R4p2L9k6Rm6N3
3522B8p6M2K1r7J10j26N4M8j5L3j9j14J25k4n8Q9k7rN5n7o8R6l5K3N7q6L4o5L1
$$ plain form
3319 -48 61 -33 -44 54 -88 -48 12 -71 -19 -39 -56 82 -13 -30 11 -27 12 109 -37 55 90 -21 -14 -4 -12 30 -52 -93 61
3348 61 -36 -21 71 -21 33 56 -21 27 31 61 68 -14 -58 72 -50 -13 64 -72 29 -14 -139 14 27 -117 -15 -89 -58
3375 -58 80 -17 27 39 -31 -2 90 -7 29 35 -59 52 -10 -72 76 -59 -20 58 -98 -11 31 -25 21 -18 -6 44 12 -1
3403 -1 103 32 -25 32 -57 35 -39 -59 -20 -1 -86 -9 -24 -53 -36 -76 -29 65 -50 20 61 22 91 22 19 62 -57 1 4 -83
3433 -83 -7 11 -85 9 -4 -17 10 31 -47 83 -14 -40 32 -38 71 65 -37 68 -19 -51 21 16 -70 24 -30 -82 27 -63 -63
3462 -63 19 -70 23 27 -32 28 78 30 62 18 -26 104 5 44 44 -18 17 5 -80 -9 -50 -61 22 -2 -16 41 -34 5 62 -6 35
3493 35 63 -31 61 -14 -33 32 -72 14 -48 -36 -58 -30 -99 99 60 -25 13 -61 41 16 4 -23 71 -1 38 12 21 -25 28
3522 28 -48 -6 15 -82 28 -98 -44 4 -11 22 3 -111 14 -10 -68 21 -6 -15 40 -17 -85 11 -24 -1 56 -30 4 -61 -30
3551c0O0n5qM5k2Q3L3j54P9rl2O0n6K7j0J1m4K0l1K4Nn9Q3J0pJ6n8n1J02m3NK6
3583B0l6L8K8p3J9K2r6J11l1o0Q3l7o0J32p3K5P7j12P5o5k4R0l7ML7n2l1N8l9
3612gm0K1o1N7L1j3KJ6q3J08r1J15mo7L7mq2M4K5j04R5K2n0M3p1L4J0m4N3K1p0
3643e7M7J6p9J04J0p2R4p6L7K8r1M7l5L9m1Lo7R7m7LK6J8o8P8j6K7J8Nk6K9m3
3674HJ3O6j53J56m4k7N1j24OM9l9K9n4NR4oq4P8k3LN8q2pJ5n9J28q9k7O8j2l0
3705c3J6p8L4O3m0k5O6J6K7k0n7J10k6r4J02p1J4O8j39R2r1J4K5K3k3O3j23O1
3733b6J03j42R2L6n1K9ml7L6jj17P7j5K8K0n4QL5j10N9N8r0O4L8j4K7n5J3M0m6
3763AJ9Om2M2N5j70J22l0j6L8j13K9Q4m4l8J16r5K9K2m2P1J0o1jM9o3kL7j1qm8
$$ plain form
3551 -30 30 -25 -33 12 -10 73 106 -48 31 22 -10 50 -6 21 11 22 -22 -2 -33 -9 -4 -63 20 30 23 39 -19 -70 32 -11 -6 20
3583 20 -16 22 50 -23 -4 18 -78 33 2 -58 25 -12 -72 60 -13 12 89 -23 52 -13 -37 53 16 20 57 5 -26 32 -7
3612 -7 -47 -26 -87 -30 1 -12 -10 6 -77 31 -60 55 51 -16 21 17 -65 -21 4 -100 -5 17 -33 10 -61 -27 -17 -61 -8 13 -57
3643 -57 -10 6 -73 31 41 -31 63 -13 24 52 -39 8 -27 12 -29 -26 -93 4 -43 -40 -14 4 -64 14 -2 25 43 48 22 51 8
3674 8 21 87 -66 90 46 19 70 -54 -48 1 -38 -9 -63 -58 36 30 -54 24 1 4 62 -20 -27 -12 -71 57 -32 -59 9 -3 -33
3705 -33 -17 -95 -61 2 -38 -63 3 19 46 26 -31 79 53 -41 61 -10 4 72 -67 25 -66 -52 -27 -4 -27 36 -87 -26
3733 -26 77 -65 27 63 12 41 37 0 36 35 -82 -5 -20 8 28 -26 -18 17 -93 -34 24 -66 -2 36 22 49 -6 7 47 1
3763 1 20 26 -16 26 81 -89 33 3 -13 25 -88 -59 25 -19 -57 59 -36 -7 15 -27 44 54 -7 -8 41 -22 -24 13 2 -6 -54
3794e4L6J3m1O0l8mP5o2k2J02q4O9k5j2M2n1l8M3J9j6%l3l3O6o4O1k8l0K6K5j9
3825a7L2Nj5N3q7j4N6m2lN9r5P5K9q9M1%K3K2n9LL6JpM6m0k0M2j00J31j9n2L8
3857C3rk7Np3K2J04j55J41n4m2J30q4j7J9J9o1P8k6M8lo6O5j4o2N9n9K1RK0o0
3887c9M2l2M4j1J3Qo5R7K0r7N5m8J2M6K4n9nK2l7NJ1r7J50p7QN1n1N2K2q5Q8m
3919F3q0M0m3m3J44n6m1K1k6k0Q0l6l2R3o4K1l7qK0J9m3M3l9k4J09k0n6k9LQ7
3949D6m2o4P7m7n7J46j00P6l2l9K8Oj3N6m4l8O7j8J1j1o8O8m3J7L6j2J5%j1L2
3979D2J4r0R7n5Pk5L9p7P2jlJ3n2m3P1n4L5Ok8J1ML3k6M7m3R3q9oN9m6OL2p3L9
4013InK8qk0PQ1r4l4N1j6J6J8n2mP9k6N8n5n4N0n6m6K4L3Rk5j6K9O7n9MMj8L2
$$ plain form
3794 -54 -18 -5 -46 14 -24 -28 47 -15 -37 65 -19 50 25 13 55 4 -34 9 28 12 12 -21 -54 12 -52 9 -19 -49 -23 2 -17
3825 -17 15 20 5 58 -29 -43 13 -29 -32 27 -68 7 36 -53 -12 -12 11 33 -26 -23 13 14 7 53 13 -7 35 -65 66 47 -5 33
3857 33 24 -3 2 -71 -49 55 -100 41 -13 -55 75 -9 -26 -7 12 -49 29 3 51 48 -18 47 33 -29 30 -29 -8 1 21 -39
3887 -39 3 -29 15 4 17 25 -40 57 77 -20 35 -13 -1 45 69 10 5 27 -10 -5 6 -91 59 -18 -10 41 -10 42 64 -21 67 63
3919 63 -17 23 -20 -63 81 25 -16 5 -21 -41 39 3 -29 64 0 21 -16 -24 -4 15 -28 15 -24 -48 61 41 -15 -44 -41 46
3949 46 4 -60 17 -30 -87 59 -41 35 3 -36 -8 -2 -15 41 -3 -41 26 8 19 8 -60 8 -35 -18 18 6 21 21 10 42
3979 42 56 -34 63 8 15 -10 29 -48 24 23 20 33 -19 -62 9 -45 -10 -4 -32 -21 -17 16 -10 37 -6 87 -2 -8 51 5 11 43 -30 9
4013 9 4 32 24 4 11 92 -2 -36 15 -1 15 33 -19 -23 56 30 88 33 -21 29 -27 -73 -49 -16 -7 -32 -48 -19 48 -11 -7 -3 -21 11
4047A1k2J5M5p3L2M3k1l2j0k1M7k3Q1J9j00j0K0K0o5N1j7oJ7l7O0M3p1K0qo7J39
4078H0j55R1J0m1k1K9L8j6pq1J07m4K5L1k1J7m2J7nm6ML3M1l6M0q7O3J3m3L4P5
4109A03j13m6M1k2L2k6lN4j9l6Q7p5Q3n0j8rK4o5O7l6j9R7m7k0O0l3Olm0K0L4
4140B8%K1l3j2j0M2k7K4n8J4PlK5Pp1M4J0l4L6m2k3M3M2l7L6r6M8J8o4L9J5K1
4172A0m1K0J2rp4J29m4K5K5j4m6K0O2q5J9n7Q9jm5m1L8M8k7Ll4L0k2qM7n9N2m9
4204b7K3N4l9k1K1m7jR7m3K1M7j74L0J14q8j7Q1j04J03k3m3J41p7m0L9l6K6mj
4233A2n9O1J7m3N0l5M3q7M4K4q2K5N0m5OJ06j32K8M6j16Q9M6p3O0o1K9J5nk8K2
4263Gl5K8l9J0K9K5m5N7Pm2nk2N1J4p3N2j7L1l6k7k3M5j2j6P5q3J12k6m2L3l3
$$ plain form
4047 11 -11 4 49 -24 8 51 30 -2 -12 -33 14 -9 72 91 -9 -19 1 21 -44 7 -10 -16 1 -36 24 67 -4 16 8 -59 80
4078 80 -75 16 26 -15 -36 -7 31 15 8 -73 34 -10 15 46 25 42 0 17 12 -34 -30 3 44 8 48 -39 24 37 -6 28 103
4109 103 -10 -56 -15 -37 -5 -31 -34 20 1 -35 52 -23 60 10 -8 -17 7 -58 9 -27 -46 51 4 -16 44 11 17 14 -26 -6 28
4140 28 28 49 16 4 -6 36 9 33 -25 -11 -4 -7 18 25 -46 -2 8 -26 10 -32 -55 -12 30 -7 29 -67 -19 -1 -65 -26 -11 10
4172 10 -31 -11 1 -8 -82 47 3 28 53 39 -7 13 75 -10 9 -48 41 40 -5 -46 -8 40 13 16 -18 12 -10 -18 29 -30 22 -27
4204 -27 -4 50 11 -10 11 -36 -37 60 17 38 85 -89 -59 55 -33 -50 31 -73 30 7 -36 105 28 -12 27 -9 17 13 12
4233 12 -47 14 31 -12 38 3 46 -41 3 27 -55 -30 20 -25 -19 87 -45 -17 29 -87 2 48 -25 35 -26 3 18 13 -15 7
4263 7 -28 0 -39 -29 0 25 -20 37 44 2 -3 -25 26 40 -33 19 2 33 -3 -30 -53 -8 -20 -36 39 -44 68 42 0 33 0
4294@k1O8l4j3rj0RM0Mo8N6o2J9J1n8N8pK5OJ7m5Q2m9k0M5l0M5k4o2J6%K0%k1
4328a2j3K0k9j1%m3R5k7k7M1OK8Qo9J27j23N7l5N0j2qrl5M4J7p6O3J4k9l6kO0
4360C4l4RPml9Rn8O5L7m4N2n5q4P0M3n5M9Kl9K5L9o2Q7n4K6j1n0P9k7k2K6k3l1
4393c3J73j34J8k9K9l8K7o8L6N9r9R0rl0P5q2lj8NL3N4m9QO9j23J09o8l2J5j5
4423c0K4J6m0KJ7PK0jp4Q9k1m9J06l5o0N2j9Ml3n6J11K5r3N0n1N5K4n5K1k6K4
4454Dp2L8p7J48q5N8j6l4LN4k5l7J2m1O7l6O7L7l8m4L1k8K1M6n0mL2p0O8L5q9
4485b5R3p9J1l6m2P5K3l9j4J01n1k3L5m2N3n8pK9k1k6M3J0rL4j14M3N6l0J6M5
4515E1m0nN1k1M8o2k9k2J3J8K6o2k0O5L7n0k4J3k6%M4L3o3N4l7o7J18l3k1J1L8
$$ plain form
4294 0 -21 47 13 0 -9 -19 -10 30 34 -34 22 -40 -21 -10 -68 -10 -17 8 14 31 -14 68 19 -1 44 14 59 35 -27 -11 -11 9 9 -12
4328 -12 -25 -5 -34 -45 -45 -88 7 -20 -47 -6 0 28 36 -33 94 -29 28 -7 43 31 23 14 -21 23 40 -36 27 41 12 -24 -26 34
4360 34 0 9 16 12 -27 -18 -76 -11 26 -18 34 -21 -105 -35 8 -47 2 4 -35 -10 29 -33 54 0 26 15 -35 44 17 -5 21 -2 -33
4393 -33 140 6 24 -5 24 -14 13 -55 -19 40 -59 31 22 -8 67 -15 -18 -36 -31 2 56 7 15 84 -39 70 2 -30 -15 -30
4423 -30 -6 10 -30 -28 -11 -4 16 15 -59 30 9 -40 66 31 -29 23 4 8 -25 -81 30 55 -38 12 -39 16 40 -15 6 -20 4
4454 4 -68 -30 -107 41 -44 14 -2 -36 -33 21 -4 -41 -29 -70 -3 -39 28 65 27 -17 14 -14 7 53 3 -1 31 -39 29 64 -25
4485 -25 68 -11 0 -36 -78 -3 20 -19 -33 68 17 -6 29 -13 40 -18 -25 4 -17 -43 0 10 1 35 -79 -36 20 -10 6 51
4515 51 11 6 57 36 84 22 -7 -29 -16 2 28 -34 -54 11 48 -2 -26 -13 -39 -39 5 38 -25 29 -8 -75 43 10 -11 0 38
4546C8n4mJ5j8J9k0NJ2kN0Np7N1k0m1N9jJJ1n5O0K1n4O2p6LQk6M6m0M0Qm0l1O
4581c9L2K0J6l6j9K9j6K5K4j2k9Qn7LO1p1L0l3L4O2j4k3J7J1k2O0o5N4M1p2L0
4612D9k3J4Ml3n4QMK2J8Rk5K9o8J6K4j6L6k6ooL1MMn9M1K9m3M7m1j9K9r%M3l2
4647AOK5p6Q9l4mK5k7j2%M6k4j4nl4nJ2J1J1k6R1p7J5L2l8RL4l1nOm6R5m9j0J5
4682FJ2%J4Ll3l1J4N1mm5N6Jk8Jj6JkK8k8l9K8L8j0k8J9o1M3m8J9J7%JNJ5o1J11
4718D9kJ2J8l3p5rJ02r5Q5n5M7o3N8k6kJ2M7r1O3K8o6j3O1l4j4K9Po0P7m9K7k5
4750A0l4j3RK4K3j0m5J29l1j6p0O3J2n4P9k4nn5M3n6Lj8J0N5k6JK0NPjJ6%m5m
4784Bm5N1J2n9K1k5M9n1N5M5o8J2M7n9k0N2k3pQK5l1j5M7j0K4j2j7nL9m8kN5m2
$$ plain form
4546 38 -16 -20 -5 -23 -4 -24 -19 -7 -9 41 46 -31 20 0 -41 18 17 18 29 -26 34 55 1 63 -13 -10 -2 -28 18 -22 18 26 -14 -45 -39
4581 -39 -7 13 29 -7 -26 3 -13 12 36 24 -5 3 -54 -51 10 -61 -31 -64 -30 32 18 -5 12 23 1 61 -4 50 91 19 49
4612 49 26 40 44 11 -43 -35 -31 -9 9 18 -7 22 -46 -30 -6 -22 14 -12 -18 -24 7 11 15 -44 -3 26 -17 30 -11 -30 -1 -10 -10 33 1
4647 1 7 32 -44 45 11 7 32 5 -7 -7 39 15 1 -4 -38 -43 -31 -20 -9 -35 56 -21 -6 26 -12 -3 31 0 -5 1 -45 50 1 -9 6
4682 6 18 18 32 35 2 -29 -15 36 32 -13 43 44 16 17 1 2 0 28 0 -39 -11 27 17 -11 8 -53 -10 -58 -39 -22 -22 -21 -16 -1 -62 49
4718 49 47 59 77 44 -31 -40 62 -33 52 -3 44 -19 39 13 11 23 70 -21 42 70 4 -9 52 18 4 33 40 -20 57 8 35 10
4750 10 -24 -37 -28 -4 19 9 -36 93 62 46 -24 39 51 -3 76 52 47 -8 35 -21 -18 -36 -26 29 3 4 24 29 36 35 51 51 6 2
4784 2 -43 8 20 -39 -18 -43 6 -45 10 55 -13 -1 46 -13 -33 19 -4 -11 -3 22 -9 -24 23 13 37 25 8 3 42 -6 -8 47 5
4817EOJ4k5L5j3l7J5K7j02M5JJ0L1J9l4N7p9J7K2j2N7l2l6M8pm8K6r9J01l9M7
4848B0J1nj3J2l8N9k2k7NL3j6k6M5n8k9J07n1qk6N2k7L9o6K1j9J2j6j1L1K7k9
4879a3J6m1N7l8J3L9n5l8M1Nj0L1m1J8k2N4nKK4J1jp9L7N9p6l9Q7k8m8Q4p8O5
4911C1rJ2j4m3rK1LM0k9J9K3l8j5K1omnk0J7L2l2J2n1R3nm0l5K3P2n2J0J6l2J0
4945A6j2K1J2l3K1L0m4l4Q7q2N3l8qJ5k1k9P6o4L2J6l7J4PmK3J2RPk9l1k3l0J04
4978C6n4rN9l6M5oK7n8P4o6JK9j08N7kRk6L9n1Q7n1l5LPm0JO0k2L7j9j1NL8J2
5012C2n8j5N2l1M4J1k9j8P4p7Q1m1k0K2K4n1N4k6OO0l1m0k5j1M5pj4j9O6o6k7
5043c5P5p6Q5o2j8M7n8M3k6RL1rmK3m3N9ro1L5k3o3J15j4k9jRoN6r0M3L5k7j1
$$ plain form
4817 5 11 25 0 35 22 -15 0 27 -75 -30 -29 -19 12 31 -3 54 -25 -8 14 2 59 27 -9 39 32 -16 10 -89 12 -27 20
4848 20 31 26 13 25 -13 46 24 -3 2 35 19 -7 38 -20 -49 58 7 -1 -27 25 -2 37 -29 -8 -27 -15 -31 -42 -11 16 -13
4879 -13 3 -38 19 -19 -6 33 -22 -60 -19 -14 -24 7 -34 -16 -38 16 11 13 37 48 47 -32 5 64 -12 -51 36 8 -40 44 -34 31
4911 31 22 34 20 -23 -32 -11 -8 32 3 22 45 7 -8 13 7 3 -2 -22 -5 27 -5 7 -44 49 44 4 -31 -8 64 12 22 38 6 16
4945 16 4 25 37 4 25 55 11 -23 64 -18 35 -3 -11 4 -17 -46 30 -34 -2 14 -23 -9 -2 -6 17 29 38 45 16 -15 -38 -68 36
4978 36 -18 -27 32 -4 41 35 62 4 78 12 13 42 -66 -9 -11 -2 -28 11 -40 47 -4 -39 -36 -29 -69 -68 -8 -30 7 -12 -23 -18 20 32
5012 32 -26 -41 11 -20 24 35 6 -12 62 -15 66 25 5 27 51 0 54 28 34 94 63 23 -2 -13 32 25 11 -8 58 -8 -35
5043 -35 40 -36 49 -13 -31 16 -42 1 -25 -16 15 6 2 25 -18 41 32 -29 6 -17 -80 35 21 -8 -9 0 -6 50 -40 3 38 11 0
5076@N2o4O0l6k1K1l5K3j7J0k9JL2k4J5j1k0l4R2kQn7R9j56Q6K7N7p8j5O6n6L3
5108B7r1J21q6ol7R6Jm1Ol1L6K3q0P1j3N6m0m3Q0r5M8L3l2j3oL9L6l7j0j6j9J6
5140gK7k0RJ6l6k9M3J4K6ro0J6J3K3j2Ql2j2LL7k6J4j0Nl0L6rl0K6nL5J3j3k1
5174C%q6J20k7m2O2j2L4l4r6R1m2J6L6m4N5k9L1n3P5q2M2O2p3k4mLQM7J2m1k7
5206a9k7K6J5J3n6J0N1j7JM5o6L0m3N7m8J5k8K6M5q8J01ko5qJ3P1k6mqoL2p7N9
5239B2j8OK1Km5M6m3k9%M1Mp3P2n1M0OKRJ0m3J8k7NjN4J0l1k7RM6j2l0N6l0j1
5274HK3j7KJ1k4mjl4O2Rn7J14k1p2k1j6K1M9m8RJ3m8M2K0jo6M0k1N6p3O7k7l2
5307c7M9j5J7M1j6P1j22KJ0Nl1J7K7rrj2J1L3j1j6m2j1Q6j1k9M8k9p1K4j7k3N2
$$ plain form
5076 0 52 -12 48 12 -9 12 -23 0 -17 -7 -36 -35 -3 -27 -12 -23 -43 -77 15 13 21 -36 63 -93 -7 20 77 -1 -16 50 -6 27
5108 27 -64 57 -29 -35 -72 24 25 -16 -10 -41 -5 18 -62 9 -4 52 12 -31 49 -46 2 35 3 -10 -16 23 59 22 12 -4 -23 -7
5140 -7 20 0 9 25 -11 -40 3 17 43 34 -26 -10 3 26 14 22 -10 -22 -19 18 -8 6 -4 1 -29 7 -2 -32 -6 -11 24 37 24 3
5174 3 3 -83 37 10 -32 30 18 52 18 -78 13 -29 -13 23 -21 34 5 36 -17 58 -24 18 80 7 -17 -21 -18 -10 37 49 8 -19
5206 -19 -46 -20 -5 8 -48 -38 13 -4 -3 42 -24 6 -37 20 -28 -13 -41 -15 30 -58 43 41 -24 -32 -19 52 26 22 14 8 40 -37 22
5239 22 4 10 31 33 -12 34 -9 -38 -38 3 7 -66 6 -45 -5 1 3 12 22 -21 -3 -30 -25 -26 28 38 7 -20 -11 35 23 -7 49 19 8
5274 8 31 14 16 27 3 -1 -2 -36 26 35 -22 92 71 -1 -22 -38 -17 32 -16 -7 6 -42 0 20 19 -47 -7 -28 28 -45 22 -5 -37
5307 -37 12 -3 14 55 39 110 -12 -10 0 5 -26 -9 18 9 0 -12 -1 32 21 5 -37 -48 38 27 -2 46 17 -54 -30 -47 -70 -18
5339a8k1l8J06j0k3O5k4k9Rj06P2NK9o5RL5k1k6O6j5J5l0J9J3k1J5r2J00o0P1
5369C0jq1L6Q7n5n6K4K3m9L2lJ9m6KlM1l4k7L9J07n0p4M0K1L9m6%j6M1k9K8Mk6
5402A7n6M7J4J4Ll5lk2l1M8qK6N1j28Q8j0J3nl1L7j9r2L6J5J7J1J1l3K2JK3l4
5434a3rOK8M7n8j4R3j25M6k0lN2j10J34kj11J7j3N0m2RP5m4k6L6oMn0N6j8pL1
5466A3m5P6J2r2L6l6OJ1K5j4N1J0J9l3rK4Mj22J28j44O4N7q1P5j6l5L0k9L2l3
$$ plain form
5339 -18 -39 -77 29 19 -4 61 37 8 17 -89 -17 -12 17 -48 -39 -4 -25 -51 15 0 15 -15 4 17 -4 11 -81 19 -41 30
5369 30 29 -52 -16 71 16 -40 -16 7 -42 -10 -13 6 -40 -38 -41 0 -34 -61 -22 85 35 -39 1 22 61 15 15 -1 40 11 39 43 17
5402 17 -39 8 22 36 39 4 1 -21 -52 -4 -12 14 65 -63 25 15 28 23 -8 29 10 -82 -46 -31 -14 -3 8 -25 -3 -2 21 -13
5434 -13 -22 -16 12 59 1 -13 80 -45 1 -19 -22 30 -80 54 52 -59 -42 -55 -5 -47 -38 37 -7 -33 3 -3 1 -49 7 -11 -18 13
5466 13 -32 44 56 -36 0 -36 -30 -19 6 -8 43 53 72 39 30 54 58 -64 64 -80 -16 41 -40 35 19 -16 14 -15 17 -16
$$ [...]
8191a
##END NTUPLES=NMR FID
##END=
