##TITLE=1H_DE-80H_X3
 200.13MHz, d2o
 8 sc
 
 19ns.26.2.2025
##JCAMPDX= 6.0         $$ Bruker NMR JCAMP-DX V2.0
##DATA TYPE= NMR FID
##DATA CLASS= NTUPLES
##ORIGIN= UXNMR, Bruker Analytische Messtechnik GmbH
##OWNER= pz
$$ XWIN-NMR		Version 3.5
$$ Thu Jul 31 11:00:01 2025 Russian Standard Time (UT+4h)  Yarkov@DPX200
##.OBSERVE FREQUENCY= 200.1313
##.OBSERVE NUCLEUS= ^1H
##.DELAY= (6, 6)
##.ACQUISITION MODE= SIMULTANEOUS
##.ACQUISITION SCHEME= undefined
##.AVERAGES= 8
##.DIGITISER RES= 18
##SPECTROMETER/DATA SYSTEM= spect
##.PULSE SEQUENCE= zg30
##.SOLVENT NAME= CDCl3
##.SHIFT REFERENCE= (INTERNAL, CDCl3, 0, 14.3821)
##AUDIT TRAIL= $$ (NUMBER, WHEN, WHO, WHERE, WHAT)
$$ ##TITLE= Audit trail, XWIN-NMR		Version 3.5
$$ ##JCAMPDX= 5.01
$$ ##ORIGIN= Bruker BioSpin GmbH
$$ ##OWNER= Yarkov
$$ C:/Bruker/XWIN-NMR/data/yarkov2/nmr/H-C/1/audita.txt
$$ ##AUDIT TRAIL=  $$ (NUMBER, WHEN, WHO, WHERE, WHAT)
(   1,<2025-07-31 10:59:12.01 +0400>,<Yarkov>,<DPX200>,
      <created by zg, POWCHK disabled, PULCHK disabled
       configuration hash MD5:
       00 E9 B6 7A A2 85 ED C7 34 08 36 98 17 FE 4E 26
       data hash MD5: 16K
       8F 54 F0 DB E3 AC 72 18 6A 93 C9 BA 76 B6 08 FD>)
$$ ##END=
$$ 
$$ hash MD5
$$ 3E 2C 5C D8 68 49 C8 DD BE EA E0 E4 7A 32 91 0A
##$RELAX= 
##$RELAX= 
##$RELAX= 
##$RELAX= 
##$RELAX= 
##$RELAX= 
$$ Bruker specific parameters
$$ --------------------------
##$DU= <C:/Bruker/XWIN-NMR>
##$EXPNO= 1
##$NAME= <H-C>
##$PROCNO= 1
##$TYPE= <nmr>
##$USER= <yarkov2>
##$AMP= (0..31)
100 100 100 100 100 100 100 100 100 100 100 100 100 100 100 100 100 100 
100 100 100 100 100 100 100 100 100 100 100 100 100 100 
##$AQSEQ= 0
##$AQ_mod= 1
##$AUNM= <au_zg>
##$AUTOPOS= <>
##$BF1= 200.13
##$BF2= 200.13
##$BF3= 200.13
##$BF4= 200.13
##$BF5= 200.13
##$BF6= 200.13
##$BF7= 200.13
##$BF8= 200.13
##$BYTORDA= 1
##$CFDGTYP= 0
##$CFRGTYP= 5
##$CHEMSTR= <none>
##$CNST= (0..31)
1 1 145 1 1 1 1 1 1 1 1 1 1 1 1 1 1 1 1 1 1 1 1 1 1 1 1 1 1 1 1 1 
##$CPDPRG= <>
##$CPDPRG1= <>
##$CPDPRG2= <>
##$CPDPRG3= <>
##$CPDPRG4= <mlev>
##$CPDPRG5= <mlev>
##$CPDPRG6= <mlev>
##$CPDPRG7= <mlev>
##$CPDPRG8= <mlev>
##$CPDPRGB= <>
##$CPDPRGT= <>
##$D= (0..31)
0 0.7 0 0 0 0 0 0 0 0 0 0.03 0 0 0 0 0 0 0 0 0 0 0 0 0 0 0 0 0 0 0 0 
##$DATE= 1753945151
##$DBL= (0..7)
120 120 120 120 120 120 120 120 
##$DBP= (0..7)
150 150 150 150 150 150 150 150 
##$DBP07= 0
##$DBPNAM0= <>
##$DBPNAM1= <>
##$DBPNAM2= <>
##$DBPNAM3= <>
##$DBPNAM4= <>
##$DBPNAM5= <>
##$DBPNAM6= <>
##$DBPNAM7= <>
##$DBPOAL= (0..7)
0.5 0.5 0.5 0.5 0.5 0.5 0.5 0.5 
##$DBPOFFS= (0..7)
0 0 0 0 0 0 0 0 
##$DE= 6
##$DECBNUC= <off>
##$DECIM= 32
##$DECNUC= <off>
##$DECSTAT= 4
##$DIGMOD= 1
##$DIGTYP= 9
##$DL= (0..7)
0 120 120 120 120 120 120 120 
##$DP= (0..7)
150 150 150 150 150 150 150 150 
##$DP07= 0
##$DPNAME0= <>
##$DPNAME1= <>
##$DPNAME2= <>
##$DPNAME3= <>
##$DPNAME4= <>
##$DPNAME5= <>
##$DPNAME6= <>
##$DPNAME7= <>
##$DPOAL= (0..7)
0.5 0.5 0.5 0.5 0.5 0.5 0.5 0.5 
##$DPOFFS= (0..7)
0 0 0 0 0 0 0 0 
##$DQDMODE= 0
##$DR= 18
##$DS= 0
$$ [...]
##$SUBNAM2= <"">
##$SUBNAM3= <"">
##$SUBNAM4= <"">
##$SUBNAM5= <"">
##$SUBNAM6= <"">
##$SUBNAM7= <"">
##$SUBNAM8= <"">
##$SUBNAM9= <"">
##$SW= 18.0517328524113
##$SWIBOX= (0..15)
0 0 2 0 0 0 0 0 0 0 0 0 0 0 0 0 
##$SW_h= 3612.71676300578
##$TD= 16384
##$TD0= 1
##$TE= 0
##$TE2= 300
##$TE3= 300
##$TEG= 300
##$TL= (0..7)
0 120 120 120 120 120 120 120 
##$TP= (0..7)
150 150 150 150 150 150 150 150 
##$TP07= 0
##$TPNAME0= <>
##$TPNAME1= <>
##$TPNAME2= <>
##$TPNAME3= <>
##$TPNAME4= <>
##$TPNAME5= <>
##$TPNAME6= <>
##$TPNAME7= <>
##$TPOAL= (0..7)
0.5 0.5 0.5 0.5 0.5 0.5 0.5 0.5 
##$TPOFFS= (0..7)
0 0 0 0 0 0 0 0 
##$TUNHIN= 0
##$TUNHOUT= 0
##$TUNXOUT= 0
##$USERA1= <user>
##$USERA2= <user>
##$USERA3= <user>
##$USERA4= <user>
##$USERA5= <user>
##$V9= 5
##$VALIST= <valist>
##$VCLIST= <CCCCCCCCCCCCCCC>
##$VD= 0
##$VDLIST= <DDDDDDDDDDDDDDD>
##$VPLIST= <PPPPPPPPPPPPPPP>
##$VTLIST= <TTTTTTTTTTTTTTT>
##$WBST= 1024
##$WBSW= 4
##$XGAIN= (0..3)
0 0 0 0 
##$XL= 0
##$YL= 0
##$YMAX_a= 38589
##$YMIN_a= -41108
##$ZGOPTNS= <>
##$ZL1= 120
##$ZL2= 120
##$ZL3= 120
##$ZL4= 120
##$ABSF1= 10
##$ABSF2= 0
##$ABSG= 5
##$ABSL= 3
##$ALPHA= 0
##$AQORDER= 0
##$ASSFAC= 0
##$ASSFACI= 0
##$ASSFACX= 0
##$ASSWID= 0
##$AUNMP= <proc_1d>
##$AZFE= 0.1
##$AZFW= 0.1
##$BCFW= 1
##$BC_mod= 2
##$BYTORDP= 1
##$COROFFS= 0
##$CY= 83.5205535888672
##$DATMOD= 1
##$DC= 2
##$DFILT= <>
##$DTYPP= 0
##$F1P= 10.8118882576601
##$F2P= -7.23987719738617
##$FCOR= 0.5
##$FTSIZE= 0
##$FT_mod= 4
##$GAMMA= 1
##$GB= 0.15
##$INTBC= 1
##$INTSCL= 1
##$ISEN= 128
##$LB= 0.25
##$LEV0= 0
##$LPBIN= 0
##$MAXI= 10000
##$MC2= 0
##$MEAN= 0
##$ME_mod= 0
##$MI= 1.114404
##$NCOEF= 0
##$NC_proc= 0
##$NLEV= 6
##$NOISF1= 3.799351
##$NOISF2= 2.8
##$NSP= 1
##$NTH_PI= 0
##$NZP= 0
##$OFFSET= 14.38212
##$PC= 1
##$PHC0= -1362.596
##$PHC1= 17.79091
##$PH_mod= 1
##$PKNL= yes
##$PPARMOD= 0
##$PSCAL= 0
##$PSIGN= 0
##$REVERSE= no
##$SF= 200.129724274929
##$SI= 16384
##$SIGF1= 3
##$SIGF2= 2
##$SINO= 400
##$SIOLD= 16384
##$SREGLST= <1H.CDCl3>
##$SSB= 0
##$STSI= 0
##$STSR= 0
##$SW_p= 3205.1282051282
##$SYMM= 0
##$S_DEV= 0
##$TDeff= 0
##$TDoff= 0
##$TI= <>
##$TILT= no
##$TM1= 0
##$TM2= 0
##$TOPLEV= 0
##$USERP1= <user>
##$USERP2= <user>
##$USERP3= <user>
##$USERP4= <user>
##$USERP5= <user>
##$WDW= 1
##$XDIM= 8192
##$YMAX_p= 0
##$YMIN_p= 0
$$ End of Bruker specific parameters
$$ ---------------------------------
##NTUPLES= NMR FID
##VAR_NAME=  TIME,          FID/REAL,        FID/IMAG
##SYMBOL=    X,             R,               I
##VAR_TYPE=  INDEPENDENT,   DEPENDENT,       DEPENDENT
##VAR_FORM=  AFFN,          ASDF,            ASDF
##VAR_DIM=   8192,          8192,            8192
##UNITS=     SECONDS,       ARBITRARY UNITS, ARBITRARY UNITS
##FACTOR=    0.0002768,     1,               1
##FIRST=     0,             0,               0
##LAST=      2.2672688,     0,               0
##MIN=       0,             -41108,          0
##MAX=       2.2672688,     38589,           0
$$ Real data points
##PAGE= N=1
##DATA TABLE= (X++(R..R)), XYDATA
0 0 0 0 0 0 0 0 0 0 0 0 0 0 0 0 0 0 0 0 0 0 0 0 0 0 0 0 0 0 0 0 0 0 0 0 0 0 0 0 0 -2 3 -3 3 -4 4 -7 7 -7 7 -9 9 -11 11 -11 14
55 14 -14 14 -17 20 -20 18 -16 15 -10 4 18 -64 179 -572 4062 17721 -23911 -41108 -27195 -27866 -16887
76 -16887 -18257 -15836 6960 12511 19121 21992 11222 29049 22010 -14395 -874 6417 -17897 -15045
90 -15045 -13672 -12654 1107 -6214 -3590 7581 370 6268 2600 -6633 14440 6128 -15614 6016
104 6016 11886 -109 1231 -6337 -1053 5120 -10024 -7546 -5659 -8750 7109 -2527 -9472 17846
118 17846 11900 -2534 11147 9211 6748 5851 -7763 -2925 -3008 -12709 -6001 -14201 -14580 4845 -6358
133 -6358 -6098 16429 7176 4301 14473 7086 9017 5010 -6953 -548 -4455 -7416 -703 -12937
147 -12937 -5569 10122 -6643 -4023 9759 -754 1875 3679 -3748 4739 2160 -3167 1926 -4618
161 -4618 1816 6336 -11605 -2609 7870 -7152 -1584 2999 -4172 4795 2146 -2899 5274 724
175 724 2069 3505 -6549 5136 6474 -10777 284 4182 -6611 718 -2804 -6056 5148 -652
189 -652 -2810 2000 -808 7542 2569 -8351 8269 6503 -7527 2883 1579 -2446 4734 -4130
203 -4130 -3838 4341 -2164 -1464 -3453 -5229 7334 -2418 -10883 6770 3020 -5135 2869 -924 2216
218 2216 6334 -4433 288 5520 994 3309 -4428 -2712 10865 -3317 -9687 4405 -622 -2564
232 -2564 -186 -6803 1761 4246 -5150 -102 664 1661 5601 -6687 -1773 10855 -3275 -4740 4293
247 4293 -774 2301 323 -5286 5061 2691 -3782 1092 -2316 2304 4371 -9728 -1596 7846 -4276
262 -4276 -2947 272 -1141 5855 -1179 -4847 5847 2360 369 1585 -4169 5202 5534 -7811 446
277 446 4443 -2701 873 -2793 -2734 5000 -3378 -4180 2523 -1767 1545 -124 -5616 5730 3379 -5874
293 -5874 2550 1861 -685 2803 -4283 -843 5015 -4100 -2091 770 -2198 4062 -1571 -5707 5976
308 5976 1841 -3106 2240 -2099 1124 3793 -5450 -489 2689 -3526 754 -1725 -2652 5266 -2034
323 -2034 -3426 5181 20 939 3254 -3229 3138 3905 -3568 1648 384 -2215 2578 -3630 -2380 4232
339 4232 -3705 -2290 2100 -2456 2509 1087 -4835 3356 2317 -1982 2221 -1976 211 4476 -3857
354 -3857 -728 3726 -2604 873 105 -2993 4565 -207 -4739 2481 -335 -566 1317 -5185 428 3467
370 3467 -4512 -208 1230 -1356 3690 -1298 -1701 6505 234 -1654 2751 -1024 2597 1558 -5811
385 -5811 1368 2323 -3515 -2 -2204 -848 3706 -4284 -2302 4423 -1567 -513 415 -2220 4661 1380
401 1380 -4258 3212 2582 122 1451 -3268 1489 3855 -5614 -1930 1768 -2807 348 -2037 -3127
416 -3127 4774 249 -2932 2458 716 2238 844 -5039 2831 3186 -5165 -135 838 -1082 3173 -1841
432 -1841 -1577 5004 -124 -971 533 -1564 3049 -1154 -6228 3118 1674 -3723 1061 -789 779 4457
448 4457 -2456 -872 3386 -578 529 -1704 -2370 4201 -1881 -4720 3936 755 -1157 1921 -1985
463 -1985 1450 3329 -3030 -519 427 -1045 1741 -3034 -1730 5035 -2172 -2788 3652 -244 347 578
479 578 -3369 1923 1991 -2382 345 -1344 642 3890 -3451 -649 4628 -2149 -616 1901 -1810 1754
495 1754 15 -3625 1185 -70 -1111 242 -3893 817 3179 -3918 706 3056 -2335 1873 1871 -1092
511 -1092 2847 -20 -1253 1925 -673 855 -60 -4793 1669 1662 -4644 488 504 -2043 2640 -397 -1274
528 -1274 2939 -174 -158 230 -1676 3319 441 -4110 2896 1885 -1279 2504 -1496 -1757 2857 -1850
544 -1850 -2304 -138 -1803 707 -1276 -1914 4299 -54 -2341 3878 377 -487 2657 -2394 -607 2446
560 2446 -1544 -450 -374 -301 2577 -2439 -1539 4607 -1339 -2366 1830 -1669 417 1102 -4237 -549 1808
577 1808 -325 520 -1570 1362 4612 -2355 -727 3536 -2100 -638 526 -3256 1238 1382 -2612 577
593 577 1170 1290 1010 -3100 1366 2792 -4455 -528 2037 -2255 1242 723 -1508 3353 1592 -1037
609 -1037 572 -394 1834 -268 -5174 1191 1635 -4129 154 240 -1299 2872 -282 -1278 3079 986
625 986 238 -448 -1746 2652 -813 -4835 1803 545 -2672 1547 -521 -482 3061 -985 -942 1445 20
642 20 1048 -1678 -1646 4200 -529 -2937 3099 220 -958 1678 -2017 -498 1603 -1963 -846 -504
658 -504 -243 2225 -2067 -998 4269 -934 -1238 2513 -1168 288 1465 -2511 291 1083 -1155 396
674 396 -1200 634 2616 -2880 -429 3060 -2235 -564 823 -2562 1032 884 -2129 805 631 874
690 874 1441 -1989 1514 2782 -2813 376 1564 -2431 851 33 -2578 1172 8 -1239 552 -1001
706 -1001 1223 956 -2640 1858 1514 -2549 1553 670 -1479 2274 -402 -1448 1912 35 19 -296 -1705
723 -1705 2010 -254 -3441 1574 25 -1874 1966 -1012 -944 2896 -632 -814 937 -45 1740 -918
739 -918 -1915 2975 -188 -1975 1937 -1166 -860 1957 -2071 -642 1625 -1131 27 -117 -208 2227 -1729
756 -1729 -1352 3096 -897 -844 1625 -1644 828 1754 -2340 149 1098 -770 164 -1848 61 2543 -2596
773 -2596 -1023 2290 -1097 643 816 -2305 1617 1466 -1618 584 44 499 1128 -2338 662 2182
789 2182 -2637 -178 955 -1672 1375 -248 -2085 2001 392 -914 677 -762 1366 863 -2769
804 -2769 1521 1582 -2201 729 -163 -1072 2063 -1388 -1973 1564 -269 -32 -174 -1614 2119 507 -2451
821 -2451 1767 623 -1050 1535 -1038 -226 2478 -1221 -607 1033 -487 1165 -743 -1900 2256 -470
837 -470 -1960 1391 -871 -479 1208 -2004 365 1853 -1421 261 370 -189 2137 -1117 -1143 2443 -928
854 -928 -869 918 -1895 433 791 -2514 522 719 -978 1013 -815 68 2463 -1326 -133 2105 -1092
871 -1092 689 561 -1874 1544 405 -1885 883 -387 -363 1060 -1929 208 1606 -1941 244 685
887 685 -1310 1450 -160 -1617 1989 12 -768 1072 -1046 575 951 -2269 588 752 -1594 993
903 993 -356 -992 2113 -823 -985 1679 -679 230 534 -1767 1341 628 -1866 1258 201 -493 1786
920 1786 -1062 -200 2072 -1392 -426 523 -1433 670 -698 -2311 1523 -129 -1257 1251 -680 552
936 552 1932 -1520 552 1631 -1222 613 -185 -1227 1609 -1019 -1671 1549 -474 -304 670 -1500
952 -1500 1086 1063 -1934 884 572 -759 1463 -722 -394 2396 -942 -605 1215 -832 642 -292 -2163
969 -2163 1253 -63 -1949 752 -637 -241 1575 -1453 252 2119 -1034 229 505 -686 1516 -818
985 -818 -1633 1787 -529 -825 1036 -1380 554 1401 -2034 357 1071 -942 612 -722 -455 1952 -1220
1002 -1220 -698 1832 -760 377 846 -1701 1081 760 -1796 493 -81 -514 839 -1584 50 1760
1018 1760 -1570 -56 978 -1163 1177 101 -1787 1641 323 -1083 809 -523 639 997 -1786
1033 -1786 882 1220 -1579 757 -109 -1333 1577 -665 -1541 1345 -425 -203 467 -1193 1331 665
1049 665 -1664 1408 501 -945 1458 -653 -730 1706 -1129 -820 706 -983 420 -334 -1581 1550
1065 1550 -189 -1321 1523 -368 -127 1833 -1134 25 1725 -924 169 236 -834 1136 -999 -1323
1081 -1323 1413 -1048 -731 1188 -1539 307 1474 -1451 462 1070 -488 913 -485 -243 1693 -1235
1097 -1235 -417 1277 -1547 233 767 -1982 753 801 -1429 596 48 -149 1029 -1251 202 1434
1113 1434 -1395 450 737 -1476 1373 390 -1817 1206 394 -804 528 -702 409 657 -1740 589
1129 589 567 -1506 1058 -160 -1493 1739 -168 -1376 1139 -65 175 399 -926 1305 579 -1495
1145 -1495 1091 -119 -1125 1351 -1054 -1170 1598 -731 -758 606 -476 794 -38 -1023 1715 29
1161 29 -851 1552 -714 -178 1772 -1413 -584 1298 -907 -237 -291 -586 1218 -877 -869 1631 -841 -344
1179 -344 1284 -1426 315 1487 -1471 206 959 -269 634 -749 -282 1427 -1383 -645 1004 -1395
1195 -1395 391 816 -1703 905 924 -1309 478 68 -23 820 -1132 426 1389 -1274 581 658 -1486
1212 -1486 1057 119 -1881 1003 177 -867 434 -497 525 523 -1617 764 639 -1367 1072 32 -998
1229 -998 1789 0 -960 1109 -215 -129 157 -1181 819 119 -1464 1087 -88 -878 1434 -835 -869
1246 -869 1543 -536 -397 806 -331 833 168 -655 1418 -460 -971 1094 -1022 -639 1299 -1417
1262 -1417 -424 1182 -792 1 -26 -524 989 -621 -518 1520 -739 -32 1409 -1118 345 1231 -1416
1279 -1416 9 372 -737 473 -599 -312 1118 -1004 -8 1024 -1272 573 843 -1513 857 903
1295 903 -900 717 -8 -178 706 -1139 27 698 -1403 471 338 -1380 1122 273 -1469 830 154
1312 154 -663 487 -617 441 818 -993 788 582 -994 1195 -191 -1173 1338 -317 -1022 815
1328 815 -352 70 286 -1036 758 291 -1097 996 -195 -566 1545 -636 -586 1520 -512 -425 467
1345 467 -711 581 -196 -1078 942 -319 -788 950 -903 -254 1266 -1238 -166 1096 -582 350
1361 350 78 -422 1193 -362 -557 1160 -650 -80 915 -1245 271 907 -1301 285 358 -654 521
1378 521 -601 -346 1192 -768 -93 927 -804 679 659 -1277 822 495 -968 483 -216 -309 645
1395 645 -1092 -182 732 -1126 295 283 -1038 1088 160 -1011 1128 163 -290 739 -490 377 701
1412 701 -1125 475 383 -1018 666 -469 -1050 990 -589 -774 786 -384 209 586 -615 884 464
1429 464 -803 866 -129 -617 912 -876 -702 881 -894 -300 493 -708 642 138 -732 1027 14
1446 14 -458 952 -640 -188 981 -1025 15 769 -759 446 181 -594 937 -254 -491 873 -666
1463 -666 -158 601 -1113 177 539 -1030 456 143 -607 831 -364 -411 1002 -553 1 727 -777
1480 -777 476 497 -1005 668 170 -817 574 -477 -404 719 -885 -117 825 -587 476 505 -543 1098
1498 1098 257 -681 896 -197 -384 511 -999 -181 502 -1167 129 300 -756 805 -32 -547 1090
1515 1090 -233 -316 707 -624 263 526 -1018 540 490 -757 560 -90 -383 863 -695 -452 751
1532 751 -815 -21 343 -822 717 315 -791 890 266 -388 774 -515 -45 725 -1029 -14 341
1549 341 -874 493 -84 -779 889 -117 -626 798 -282 -88 480 -858 265 419 -801 559 134
1566 134 -506 978 -317 -499 997 -462 -328 472 -702 243 78 -881 619 27 -580 783 -290
1583 -290 -220 1020 -634 -137 823 -576 164 221 -636 660 -121 -648 738 -346 -227 601 -874 22
1601 22 604 -1007 129 388 -590 556 -31 -293 907 -272 -31 806 -587 282 505 -1067 264 240
1619 240 -1028 244 -123 -475 497 -507 -15 763 -547 443 624 -668 752 360 -766 705 21
1636 21 -524 437 -515 -200 395 -792 151 230 -787 613 32 -754 938 -9 -539 822 -147 -40 550
1655 550 -499 225 215 -732 480 -245 -703 804 -477 -588 851 -388 -225 513 -442 300 204 -559 637
1674 637 -35 -381 811 -482 -300 910 -763 -266 647 -557 149 195 -555 468 -157 -470 606 -550
1692 -550 -152 683 -868 130 851 -750 199 442 -426 478 -32 -282 599 -435 -20 484 -915 216
1710 216 428 -1137 250 372 -736 353 66 -193 654 -272 102 662 -563 333 243 -932 579 85
1728 85 -971 479 -19 -542 395 -430 -107 443 -570 346 269 -556 764 -43 -701 920 -58 -616 599
1747 599 -214 -174 409 -472 312 173 -621 496 -262 -614 788 -486 -564 876 -305 -171 581 -241 312
1766 312 320 -415 644 -115 -346 730 -572 -291 759 -850 -341 447 -728 -34 172 -427 497 1 -143
1785 -143 799 -458 86 688 -810 57 596 -848 101 336 -518 331 -185 -245 443 -531 -50 467 -790
1804 -790 289 502 -850 541 465 -506 551 105 -220 506 -400 -40 325 -707 273 137 -982 534
1822 534 93 -769 651 23 -370 562 -242 12 377 -551 312 171 -624 755 -53 -655 899 -93 -519
1841 -519 584 -310 -151 311 -561 148 -4 -560 560 -142 -376 910 -272 -338 821 -382 -110 494
1859 494 -498 139 72 -462 375 -214 -351 553 -558 -169 738 -616 -63 658 -451 176 251 -341 468 -72
1879 -72 -222 564 -457 11 583 -852 78 528 -720 145 265 -493 366 -188 -288 548 -387 75 529
1898 529 -613 345 401 -721 383 229 -558 452 -69 -371 435 -451 -91 272 -638 279 224 -640 590
1917 590 115 -590 634 16 -284 511 -291 -36 439 -480 326 104 -568 572 -125 -643 612 -256 -512
1936 -512 493 -418 -97 343 -496 352 289 -332 605 6 -381 740 -389 -289 599 -503 -165 319 -577
1955 -577 152 37 -504 398 -188 -309 624 -470 -19 654 -440 77 541 -466 327 213 -493 443 -194
1974 -194 -359 385 -518 -159 411 -709 137 468 -596 398 289 -408 505 -102 -237 464 -412 -98 369
1993 369 -587 271 329 -673 427 200 -476 502 -166 -320 443 -456 -108 324 -603 217 302 -464 616 150
2013 150 -407 665 -51 -237 495 -470 -181 232 -652 203 38 -601 455 -42 -463 650 -193 -209 603
2032 603 -295 33 456 -378 334 226 -464 420 -151 -400 493 -432 -284 446 -527 47 366 -532 383 190
2052 190 -369 603 -16 -201 592 -274 -169 467 -584 8 229 -565 272 104 -475 520 -106 -285 519 -430
2072 -430 -143 479 -618 143 325 -634 318 45 -474 605 -129 -182 636 -300 31 476 -568 160 186 -664
2092 -664 207 -60 -523 442 -270 -240 679 -303 176 635 -318 334 306 -471 389 -140 -583 309 -454 -356 421
2113 421 -519 -64 494 -457 273 293 -362 540 68 -307 548 -234 -123 471 -462 84 346 -600 249 116
2133 116 -534 375 -60 -347 506 -298 -110 460 -346 228 388 -512 389 154 -458 464 -147 -423 400 -381
2153 -381 -111 433 -478 186 233 -497 332 36 -492 550 -169 -355 471 -273 -114 453 -435 195 344 -344
2173 -344 392 40 -352 543 -249 -358 537 -451 -139 420 -483 101 176 -472 353 11 -275 494 -213 -103
2193 -103 551 -366 15 427 -543 89 133 -553 234 -127 -353 329 -316 -87 538 -426 144 536 -408 316
2213 316 279 -421 358 -1 -336 434 -245 -121 379 -489 142 306 -592 336 181 -500 453 -18 -359 456
2233 456 -203 -79 312 -346 243 234 -541 310 112 -500 465 -109 -348 419 -265 -99 284 -418 141 168 -490
2254 -490 418 21 -430 580 -48 -224 576 -196 -53 466 -375 137 98 -465 326 -177 -455 373 -368 -285
2274 -285 465 -316 -86 444 -301 182 336 -170 378 -12 -250 445 -401 -261 401 -595 -130 285 -484 185
2294 185 189 -312 399 39 -60 566 -176 70 497 -447 90 288 -564 156 119 -536 244 -40 -286 314 -240
2315 -240 -74 329 -420 197 327 -566 429 236 -486 410 -46 -316 274 -326 -74 222 -396 182 182 -420 459
2336 459 101 -450 452 -85 -301 345 -260 -123 262 -356 124 155 -343 497 76 -264 559 -131 -268 485
2356 485 -272 -217 199 -424 -11 87 -428 352 -24 -225 580 -223 -177 615 -368 -93 410 -361 162 199 -258
2377 -258 290 -64 -195 425 -406 -137 383 -526 -38 301 -432 256 325 -221 377 86 -76 423 -238 33
2397 33 331 -564 18 222 -618 86 145 -463 278 -16 -182 359 -179 105 324 -404 209 213 -504 329 128
2418 128 -368 393 50 -166 359 -190 -123 218 -422 172 121 -457 354 30 -347 484 -29 -167 400 -169 -57
2439 -57 253 -334 138 126 -382 279 -61 -359 454 -229 -277 402 -264 -150 241 -351 177 108 -276 379 -64
2460 -64 -160 488 -235 -52 489 -264 12 290 -360 93 30 -358 193 -108 -258 335 -263 -40 459 -289 136
2481 136 339 -376 223 193 -286 253 -82 -218 239 -339 -85 286 -463 93 247 -429 278 197 -259 376 -19
2502 -19 -151 334 -216 17 304 -358 154 151 -425 303 46 -432 343 -105 -169 321 -201 -6 242 -311 232
2523 232 146 -318 307 69 -253 394 -82 -219 391 -233 -53 200 -345 106 39 -400 246 -89 -256 448 -188
2544 -188 -136 389 -172 -16 367 -206 187 155 -259 257 -56 -234 348 -266 -144 337 -375 12 265 -371 129
2565 129 94 -261 254 -16 -199 334 -258 -22 393 -270 204 256 -373 118 80 -352 215 -103 -240 258 -213
2586 -213 -75 316 -301 157 236 -340 305 55 -308 346 -25 -170 295 -155 -1 271 -391 101 129 -394 193
2607 193 -36 -366 297 -158 -161 282 -211 74 334 -187 266 184 -263 309 -12 -330 304 -176 -215 243 -305
2628 -305 -29 205 -339 206 191 -224 325 -23 -187 342 -141 -82 377 -212 11 273 -248 126 22 -364 176
2649 176 -106 -278 242 -194 -65 373 -204 86 231 -235 216 51 -312 259 -96 -221 260 -256 -139 248
2669 248 -325 126 147 -304 272 12 -258 290 -116 -219 303 -242 -43 263 -135 164 194 -194 298 36 -205
2690 -205 313 -214 -214 255 -252 -35 232 -362 94 90 -294 204 -2 -160 337 -153 -73 334 -223 9 243 -261
2712 -261 201 151 -313 140 -29 -263 181 -254 -150 253 -268 108 296 -254 211 227 -221 276 15 -146 281
2733 281 -233 -146 180 -312 -18 66 -395 224 38 -290 299 8 -125 296 -143 -46 240 -194 110 195 -284
2754 -284 185 88 -274 304 -141 -198 293 -208 -89 219 -257 73 82 -239 192 -3 -234 384 -63 -133 375 -226
2776 -226 -3 204 -271 -31 51 -285 156 -71 -256 291 -129 -189 305 -214 -39 207 -282 121 159 -200 263
2797 263 44 -97 297 -182 -63 243 -232 -64 217 -362 66 100 -264 167 -6 -151 290 -89 -16 310 -249
2818 -249 125 193 -278 216 73 -307 124 -46 -229 190 -162 -105 144 -240 83 156 -275 226 97 -255 265
2839 265 55 -178 233 -70 -31 202 -251 30 31 -281 248 37 -209 316 -79 -168 255 -178 -103 196 -141 56
2861 56 104 -207 210 -43 -196 399 -123 -190 288 -230 -94 179 -320 16 18 -247 177 -33 -128 256 -121 8
2883 8 329 -151 42 247 -207 69 154 -265 103 -68 -133 204 -202 -27 301 -275 43 212 -350 143 149 -184
2905 -184 202 12 -83 249 -103 5 220 -156 112 87 -369 98 30 -340 164 29 -247 201 -161 0 157
2926 157 -244 156 129 -246 191 49 -189 202 -50 -180 248 -148 -33 212 -224 34 11 -175 140 33 -228
2947 -228 253 -69 -111 302 -139 -82 191 -142 122 68 -262 149 -82 -237 221 -197 -180 263 -286 -24 209
2968 209 -249 66 123 -207 216 -12 -80 302 -138 -93 294 -286 -46 207 -221 75 45 -183 163 -40 -198
2989 -198 196 -218 -30 239 -324 85 278 -264 172 144 -189 204 -91 -169 167 -202 -6 166 -270 43 199
3010 199 -367 168 23 -246 235 27 -127 274 -125 -39 207 -181 125 144 -243 252 32 -275 222 -58 -175
3031 -175 167 -165 -47 149 -180 91 31 -265 251 -31 -152 316 -77 -114 223 -214 -67 178 -191 74 54
3052 54 -261 188 -61 -211 212 -163 -34 258 -159 32 235 -201 136 140 -157 213 -45 -79 214 -190 -114 210
3074 210 -270 -24 149 -309 54 98 -225 159 -47 -126 274 -153 45 188 -235 126 131 -304 107 76 -210 154
3096 154 -101 -126 137 -194 -20 183 -236 156 178 -261 242 40 -168 263 -55 -105 173 -131 22 128 -251
3117 -251 78 80 -233 197 -53 -245 245 -82 -115 210 -143 38 169 -199 172 72 -174 200 -63 -227 244
3138 244 -182 -97 223 -237 7 189 -214 102 110 -177 208 -78 -112 302 -95 -28 241 -165 29 120 -211 117
3160 117 37 -195 133 -151 -167 215 -221 -63 197 -192 33 142 -176 153 56 -144 243 8 -123 210 -138
3181 -138 -33 197 -214 63 126 -231 159 69 -173 179 -84 -98 192 -119 -19 205 -182 114 138 -201 198
3202 198 11 -152 244 -77 -125 194 -204 -17 147 -270 47 108 -207 202 41 -140 243 -59 -64 286 -172
3223 -172 92 158 -161 148 92 -257 167 -31 -146 135 -208 -29 163 -142 60 167 -186 152 114 -224 214
3244 214 -21 -116 219 -142 -105 153 -238 38 83 -312 83 -34 -218 188 -35 -109 285 -134 -71 215 -155 95
3266 95 57 -206 227 56 -197 188 -120 -99 195 -148 -30 182 -233 45 73 -183 168 -7 -132 211 -92
3287 -92 -96 195 -153 44 203 -221 92 31 -214 134 -73 -104 189 -87 -66 211 -218 27 145 -233 86 102
3309 102 -151 214 -10 -51 247 -63 -44 223 -186 11 94 -267 77 20 -197 155 -79 -169 158 -121 -13 155
3331 155 -207 74 111 -189 141 0 -138 194 -17 -134 65 -115 5 119 -183 -5 73 -240 124 83 -152
3352 -152 197 20 -102 209 -129 -51 186 -134 51 42 -221 148 21 -188 176 -101 -157 193 -127 -2 167
3373 167 -151 98 75 -191 174 -50 -124 150 -151 -78 184 -150 26 154 -201 39 30 -178 170 -64 -136 226
3395 226 -146 -32 224 -196 124 106 -172 138 77 -129 150 -24 -146 160 -173 -95 131 -206 -28 122 -220
3416 -220 81 83 -130 194 -30 -61 243 -91 -18 147 -203 48 121 -249 120 50 -132 169 -73 -153 166 -165
3438 -165 5 122 -156 122 67 -175 175 20 -120 188 -6 -105 186 -112 -71 147 -206 85 67 -211 141
3459 141 -105 -157 223 -62 -62 124 -150 -9 129 -178 94 96 -194 151 -60 -80 188 -127 -104 144 -219 18
3481 18 157 -113 85 54 -142 138 -20 -67 145 -110 -93 185 -207 -3 93 -253 144 36 -188 55 -14 -74
3503 -74 121 -130 -46 92 -223 104 133 -226 157 73 -184 171 -8 -114 199 -105 -9 118 -162 107 67 -190
3525 -190 125 29 -136 188 -78 -76 189 -78 2 172 -67 126 51 -203 168 5 -146 189 -91 -159 137 -132
3547 -132 -10 82 -144 55 -11 -116 171 -19 -75 249 -71 -50 158 -145 -41 112 -189 147 80 -148 151 -58
3569 -58 -80 160 -105 -11 156 -139 51 110 -145 59 50 -98 135 -53 -67 117 -132 -20 92 -187 53 85 -236
3592 -236 147 -13 -161 77 -73 -92 206 -78 11 145 -108 89 120 -123 146 13 -184 148 -38 -78 118
3613 118 -108 7 88 -157 67 71 -158 169 74 -127 146 -74 -65 138 -143 -38 100 -168 80 -12 -154 149
3635 149 -75 -157 169 -88 -78 134 -155 2 128 -118 58 62 -117 185 -23 -58 151 -123 10 146 -158 84
3657 84 85 -156 27 12 -132 123 -88 -42 169 -96 45 139 -114 6 124 -139 91 1 -107 105 -4 -62 171
3680 171 -111 -65 107 -185 45 113 -160 162 1 -99 191 -99 -40 168 -117 16 140 -138 32 59 -160
3701 -160 110 -10 -111 91 -63 -106 87 -136 20 110 -181 99 14 -108 93 -39 -166 122 -59 -46 144
3722 144 -80 19 40 -137 49 19 -114 127 -21 -36 153 -60 -79 122 -67 68 99 -137 99 44 -120 128
3744 128 -38 -120 128 -88 -79 117 -148 11 32 -194 112 29 -124 121 -76 -61 159 -105 -19 81 -126 22
3766 22 38 -120 70 7 -138 130 -30 -27 168 -67 59 132 -152 62 74 -57 110 15 -81 117 -54 -28 110
3789 110 -101 -72 64 -155 47 75 -129 114 -22 -131 157 -70 -88 123 -95 14 65 -85 30 60 -106 101
3811 101 7 -57 118 -91 -75 132 -173 47 95 -106 86 34 -155 151 26 -88 150 -42 -19 152 -98 48
3833 48 90 -197 40 -1 -92 88 -103 -105 123 -88 -19 102 -151 68 56 -129 100 -1 -126 161 -35 -71 98
3856 98 -100 0 116 -129 50 18 -145 115 -29 -99 144 14 -19 133 -48 40 139 -111 27 43 -137 80
3878 80 -65 -143 136 -56 -105 112 -80 25 70 -173 75 97 -98 118 -11 -18 118 -58 -42 188 -153 -7 68
3901 68 -107 54 36 -96 103 -57 -89 79 -78 12 96 -101 46 82 -120 125 3 -68 140 -25 -100 150 -123
3924 -123 -33 112 -117 5 85 -96 80 -14 -112 119 -28 -54 118 -18 -4 49 -152 25 39 -88 107 2 -146
3947 -146 108 -40 -43 101 -28 -59 114 -53 60 37 -119 73 11 -39 134 -64 -16 194 -78 -34 62 -147 47
3970 47 -9 -146 65 -3 -94 251 -60 -2 111 -113 68 65 -124 71 65 -78 107 -61 -12 128 -5 -6 103 -156
3994 -156 45 32 -151 42 91 -115 72 -41 -10 123 -122 19 49 -107 23 39 -92 108 74 -95 35 -22
4016 -22 -70 52 -118 -16 116 -129 76 53 -122 73 11 -82 182 30 -78 146 -98 87 100 -71 81 41
4038 41 -95 69 2 -124 130 -50 -41 82 -90 -28 53 -60 92 5 -114 55 -13 -121 99 -28 -95 63 -100
4061 -100 -15 76 -149 64 27 -44 84 -53 -61 115 -89 -6 155 -105 56 104 -92 78 4 -100 154 -34 -66
4084 -66 116 -79 7 101 -82 32 16 -97 107 22 -138 58 -22 -65 107 -56 -1 84 -135 5 37 -138 117
4107 117 5 -113 109 -49 -87 102 -66 16 91 -111 128 66 -97 169 45 -113 99 -42 -52 90 -104 -64
4129 -64 61 -64 64 6 -148 73 31 -29 118 -21 -33 135 -39 34 117 -103 124 31 -136 91 -5 -97 158
4152 158 -62 -41 113 -110 44 115 -140 110 21 -45 127 14 -34 169 -113 -32 99 -140 9 68 -151 33
4174 33 12 -122 72 -37 -90 85 -104 19 174 -100 66 47 -95 64 -17 -124 93 -19 -61 43 -98 -45
4196 -45 107 -82 36 96 -121 87 95 -68 116 25 -46 89 -105 -12 77 -147 49 7 -96 45 -35 -62 110 -110
4220 -110 -58 125 -62 9 94 -79 39 17 -69 99 43 -41 160 -74 -51 89 -125 14 20 -87 36 30 -64 96
4244 96 -42 -6 120 -56 -3 183 -80 11 88 -89 56 -14 -49 73 -27 -106 102 -109 2 87 -126 -9 -34
4267 -34 -114 44 -52 -45 63 -52 -41 147 -33 18 67 -107 71 43 -136 82 -12 -123 114 -65 1 83 -94 22
4291 22 94 -164 62 128 -45 75 13 -67 84 -90 -26 77 -124 15 22 -81 7 28 -163 123 -20 -60 164 -78
4315 -78 -57 134 -47 89 112 -66 61 68 -21 112 -13 -38 144 -81 -84 125 -68 8 86 -125 53 23 -121 119
4339 119 -18 -27 116 -10 25 76 -78 43 8 -123 13 30 -108 97 -115 -102 97 -82 -6 146 -108 69 88
4362 88 -80 68 19 -51 77 -40 -40 152 -78 -21 62 -106 38 32 -127 65 -47 -100 111 -70 30 104 -44 35
4386 35 77 -105 70 38 -128 52 -39 -127 67 -35 0 102 -104 38 62 -153 6 40 -53 75 -20 -69 95 -60
4410 -60 -35 56 -57 57 88 -71 38 -10 -61 85 -13 -53 114 -69 -27 155 -58 1 67 -101 84 2 -94 67
4434 67 -59 -33 48 -56 -26 43 -110 6 44 -68 127 21 -84 92 24 -39 106 -24 -3 123 -70 36 7
4457 7 -99 57 26 -81 56 -63 -30 78 -85 -25 45 -99 17 10 -111 97 29 -44 72 -81 -48 80 -100 -10
4481 -10 77 -111 40 26 -98 43 -17 -125 22 -19 -52 89 -46 38 94 -30 73 66 -74 44 -74 -61 106 -50
4505 -50 -55 127 -151 1 53 -136 66 73 -112 84 -5 -62 96 -61 49 90 -130 23 21 -140 67 31 -83 57
4529 57 36 -67 110 -42 39 61 -96 99 11 -46 92 6 -108 70 -36 -29 95 -50 42 81 -111 40 60 -110
4553 -110 100 -60 -33 55 -74 -36 146 -70 30 117 -24 39 56 -115 83 -69 -91 171 -36 -59 48 -84 34
4576 34 56 -109 50 3 -75 79 -51 -81 101 -56 24 85 -58 42 60 -60 112 46 -69 71 -10 -47 112 -108
4600 -108 -6 76 -130 -12 106 -70 48 17 -78 100 -48 -17 74 -36 -27 48 -93 71 105 -80 75 28 -101
4623 -101 110 -18 -66 51 -81 2 124 -125 24 64 -76 97 25 -132 57 -46 -82 69 -76 -17 25 -84
4645 -84 71 42 -106 68 -92 -30 94 -4 -16 93 -33 42 90 -24 53 21 -77 38 -52 -76 111 -68 -87 100
4669 100 -50 -5 49 -113 78 102 -61 74 33 -13 40 -112 -9 86 -116 -11 -4 -122 23 5 -100 8 -73 -57
4693 -57 17 -70 19 50 -108 35 69 -68 104 12 -62 113 -9 -21 99 -39 -26 76 -81 -16 -10 -78 56 -8 -44
4718 -44 126 -5 29 85 -60 -9 146 -54 -7 48 -108 51 32 -53 75 -37 -60 100 -26 -2 21 -93 19 65
4742 65 -65 45 37 -51 106 -56 6 53 -66 46 47 -11 72 -13 -51 53 22 -5 108 -37 -85 75 -74 -18 60 -61
4768 -61 28 25 -105 99 18 -82 57 -103 -58 92 -76 -42 62 -86 75 33 -32 31 -28 -48 77 -72 44 83
4792 83 -53 75 40 -99 32 -3 -81 20 -40 -63 36 -43 10 99 -72 24 -1 -32 58 33 -54 37 7 -64 26 -98 -5
4819 -5 24 -92 25 34 -90 75 -5 -3 79 -27 8 44 -97 51 50 -68 14 86 -41 81 -21 -76 67 -109 -36 7
4845 7 -20 29 26 -147 33 -16 -94 81 13 -42 86 -78 0 77 -28 40 4 -76 39 16 -69 24 -80 -47 51 -32 17
4872 17 55 -60 21 75 -60 8 12 -3 103 4 -45 60 -46 -9 2 -88 44 -15 -75 61 -12 -49 -46 -29 6 112 -56
4899 -56 11 76 -26 90 0 -69 40 -32 -55 99 -47 -6 43 -14 -3 99 -57 56 62 -119 88 47 -100 94 -49
4924 -49 -4 90 -80 2 20 -22 53 27 -21 66 -20 -82 50 -106 -43 67 -73 32 19 -89 -21 -4 -75 111 -57 -31
4950 -31 79 -63 -94 59 -3 29 42 -14 55 12 -99 94 -63 -62 43 -60 29 116 -68 55 35 -33 71 -5 -76
4975 -76 37 -62 -37 80 -53 29 55 -107 19 1 -18 60 58 -49 44 12 -36 73 -42 -5 59 -4 44 25 -55 48
5001 48 -24 -69 83 -49 -19 113 -39 57 7 -34 85 -48 8 60 -12 -35 106 -61 -73 42 -146 -27 33 -108
5025 -108 -46 -15 -37 16 42 -14 48 -60 -30 47 -17 14 93 -88 94 8 -80 30 -53 17 -9 -74 -47 50 -62 -12 6
5052 6 -79 57 29 11 57 -16 -5 50 -61 -33 -8 -42 36 9 -18 51 10 -57 76 3 3 16 10 24 42 -71 20 25 -67 10
5082 10 0 -34 56 -20 -52 82 -43 -51 56 -76 -24 37 -4 42 -8 -51 26 -20 8 103 -81 35 34 -100 -44 -3 -27 65
5110 65 20 -19 -3 1 -70 41 -70 -1 57 2 45 -9 6 66 32 -34 91 -15 -28 82 -29 -20 4 -109 2 47 -49
5137 -49 -47 40 -76 59 -13 -12 3 -59 -19 82 -75 35 -33 -77 40 -52 -32 17 -34 -77 25 -60 6 38 8 55 -27 -91
5165 -91 76 -42 8 32 -32 -8 59 -41 29 66 -55 -3 -23 -69 70 -11 -19 42 -79 12 57 -60 5 13 -52 -5 -23 -59
5193 -59 60 -51 8 49 -135 -8 31 -64 21 65 -86 19 -3 -25 63 -30 5 88 -60 -1 88 -32 55 24 -38 100
5219 100 -35 -93 46 -73 -32 59 -40 -59 27 -61 60 -52 -71 83 -1 -3 43 -40 0 27 -25 48 37 -30 21 -74 -16
5246 -16 43 -50 -100 52 -22 -44 11 -72 36 85 -55 17 31 50 82 52 -14 64 -56 -24 20 -67 -16 25 -62 77 -56
5273 -56 17 92 -14 4 45 -34 -28 60 -79 37 24 -56 39 -26 -83 53 -64 -50 7 -109 19 14 -78 44 4 26 68
5300 68 -17 -72 37 16 19 71 -49 35 40 -67 -11 8 -39 45 3 -42 33 -40 -40 50 -84 13 59 -53 50 -23 -34 82
5328 82 -26 -76 27 -57 -27 74 -40 53 2 -29 57 -23 -39 32 36 -4 89 -16 18 9 -28 -1 9 -76 -1 3 -82 27 34
5357 34 -49 41 -42 27 18 0 16 -3 -47 87 9 -19 65 -81 -30 83 -46 80 65 -101 116 23 -53 32 -5 -9 73 -33
5385 -33 11 76 -50 77 32 19 37 61 8 20 -61 -23 57 -34 -56 -9 -61 4 -33 -60 73 12 -59 -25 15 15 78 -73 -21
5414 -21 14 -30 13 -6 -79 45 17 -86 -15 10 52 35 -37 32 98 -37 -16 23 -58 33 3 -84 78 -49 24 60 18 -14
5442 -14 37 -76 9 23 -49 33 -45 -57 30 -18 -46 86 -67 -14 74 -68 91 17 -37 58 23 -29 43 -5 -26 -13 -51 -13
5470 -13 41 -63 6 16 -39 91 30 -48 63 36 6 83 -92 28 7 -22 -6 50 -66 49 -78 -12 -10 -77 -1 18 -60
5497 -60 -9 81 -79 -13 -35 -65 84 10 -17 73 -33 -25 58 -102 -10 1 -61 12 -23 -5 2 -70 3 72 -22 -27 41 -61 89
5526 89 -32 -13 61 1 -60 75 9 4 93 -21 47 13 -18 -18 42 -63 58 -64 -68 11 -30 -15 52 -4 -12 57 -28 -2 64
5555 64 -32 55 27 9 61 -60 1 -38 -37 -52 12 -54 48 -51 -86 18 -32 0 68 -35 8 16 -45 -37 14 -17 0 -1 -34 10
5585 10 -58 20 35 55 -26 14 -27 11 55 7 30 -38 -134 -49 -29 -24 78 -47 -25 29 -7 10 -29 -119 27 -48 -111 51 -49
5614 -49 7 33 -64 -29 25 -69 6 5 -63 97 45 -10 96 -27 3 69 -8 -29 18 -44 13 13 25 96 -10 -19 90 54 58 45
5644 45 -43 -52 39 -67 8 20 -21 -7 -17 -107 46 -23 -52 -26 -81 38 14 -45 -1 -3 -58 65 3 -45 -5 -15 -9 67 -9 7
5674 7 26 6 -3 -15 -18 78 13 29 81 -12 50 8 -17 39 33 4 17 20 -76 12 -57 -61 68 -18 13 72 -37 -24 43 -42 96 -1
5706 -1 -4 78 -21 29 57 -5 29 87 -76 -26 -5 -25 -3 33 -109 36 -27 -6 38 4 -15 82 -8 30 1 -82 -25 -4 19 54
5736 54 -41 -35 10 -65 -16 13 -42 31 55 -21 -10 20 -62 48 -31 -6 39 -26 -6 55 2 8 20 -21 52 -12 -11 141 -13 -25
5766 -25 48 -10 56 43 -49 36 60 -21 1 -49 5 30 11 -44 29 -52 -13 19 -58 -20 0 8 53 -40 -19 -20 -9 23 44 16 27
5797 27 18 -43 16 -10 -15 81 -22 -24 33 -81 18 89 -45 32 72 32 53 71 -28 54 -52 -91 18 7 -16 24 -62 22 31 -57
5827 -57 43 -30 -1 -8 16 7 25 -41 60 11 -6 17 10 -68 -24 25 -10 35 -6 10 27 -27 8 50 -74 14 38 -37 29 -27
5857 -27 -53 53 2 51 80 -31 16 25 -36 36 23 -92 24 -52 -39 -5 -38 -100 11 -37 -80 -9 -53 26 14 -19 82 1
5885 1 -43 63 27 -50 37 22 7 7 11 32 -13 -16 13 -41 -47 27 -24 3 12 -66 8 58 0 -10 -16 -78 74 -34 -29 66 -29 12 23
5918 23 -26 -16 30 -42 11 -55 -29 66 -44 40 47 -44 -1 -12 -36 -7 39 -39 -16 3 16 4 -11 -27 13 -72 34 61 -15 40
5948 40 9 -45 68 -13 -25 92 -51 -12 21 -20 11 -21 -72 74 6 -8 0 -17 -15 28 5 -43 40 -8 -39 24 -14 18 15 -7
5978 -7 64 -48 -18 13 8 -48 -3 -46 -9 29 -32 45 -18 -62 11 -13 -10 28 -39 -47 44 -22 9 17 -100 -29 50 -75 68 -78
6008 -78 -49 42 -55 4 58 23 35 48 -25 -8 -4 -47 69 -5 26 14 -102 -12 -3 -53 52 15 -46 60 7 -63 46 -11 5
6037 5 -3 -110 -36 -23 -47 10 22 -10 37 -41 -70 65 -37 -6 56 -27 31 14 -5 41 -3 -51 6 -21 -28 16 46 -42 86 -32
6067 -32 -37 45 -50 -22 -15 -4 37 -21 -45 -10 -34 -11 -13 -27 0 -1 -44 9 28 7 4 20 -56 75 -29 17 7 -48 3 6 -34 65
6099 65 -11 -9 18 20 -8 94 -27 -6 62 -16 0 26 -32 62 -21 -21 -20 0 53 48 -20 24 -17 -79 -13 -41 -50 -44 -7 -104 34 -46
6131 -46 31 -21 -11 14 30 -17 45 -25 -43 43 -22 4 17 32 18 31 0 45 33 -67 75 -46 -66 69 11 -38 17 51
6159 51 -30 23 -103 18 -10 -32 21 -18 -72 67 28 -32 38 -22 -12 61 -36 -30 16 -25 -11 6 -75 21 5 -12 -4 11 24 25
6189 25 -2 20 -14 -11 29 54 -74 80 -50 -17 -40 -95 -60 83 5 3 -11 -73 42 -9 -20 40 -27 8 16 -64 44 15 -33
6218 -33 56 29 -69 31 17 -24 45 -42 -35 14 -25 -44 13 -78 -3 -6 -2 46 40 -26 53 -7 23 30 -49 -25 18 3 -16 30 -45 62
6250 62 -3 13 24 -34 5 30 22 8 1 20 18 17 -10 107 12 -14 20 -42 45 42 -51 22 -1 -43 8 33 -9 32 16 4 16 -17
6282 -17 60 -25 -39 -19 -36 -35 -1 -24 -8 24 -14 4 8 -15 -32 6 44 -1 20 -34 27 49 -2 70 -51 -9 71 -16 15 7 -73
6313 -73 43 17 -47 54 36 -30 42 -13 -27 6 -20 -27 -7 -81 17 -14 -10 17 -103 -24 7 -14 34 -26 -46 17 10 -59 5 -50
6343 -50 32 55 29 31 -25 -33 17 51 -31 24 40 -28 76 9 -29 7 30 26 15 -46 -29 33 -14 12 20 23 17 -17 -19 39 -24 -7 14
6376 14 19 24 -7 -40 17 40 -7 -1 32 6 37 -38 -7 47 9 28 30 -38 19 43 16 22 30 -26 -19 42 14 -44 -58 27 -7 -54 -18 16
6410 16 -62 37 -5 -38 11 6 13 30 -23 8 40 -46 8 26 -19 70 12 -26 74 -8 -19 4 -35 45 -20 -26 20 45 -21 41 -15
6441 -15 -11 94 -31 -25 6 -28 37 -14 -8 38 2 8 -23 -31 -18 32 16 19 81 -52 6 75 9 -53 -2 7 46 -24 -61 64 -6 -19
6473 -19 55 -45 28 14 -31 44 8 3 66 19 33 94 24 49 46 0 4 11 -28 21 51 -34 29 -25 49 96 12 2 9 -61 33 -2
6505 -2 -50 38 -35 -3 47 19 -14 9 -47 -13 25 -6 88 34 2 86 14 -29 27 -46 -23 54 -36 6 -11 5 41 -20 -80 29
6535 29 21 -20 35 -31 25 18 -20 23 38 -49 15 48 -38 29 49 -28 70 -22 -3 22 0 30 52 -35 15 63 1 42 -59 -1 25
6566 25 48 -39 34 -16 32 43 -48 41 8 -41 75 -30 -48 60 -18 -26 -40 -34 47 29 -23 66 24 -46 88 3 35 43 -46 -39
6596 -39 -8 -36 -6 9 -47 11 12 -34 25 8 1 7 -16 -14 3 -69 17 29 1 24 60 -83 28 -66 4 61 -42 -36 15 38 8
6627 8 34 -45 67 39 -2 48 -6 -20 -7 -59 -11 10 -36 -22 -13 26 15 -53 -45 19 35 1 42 -7 4 -39 -50 15 -39 20 -25
6658 -25 -33 -26 -26 -46 -14 87 -18 -15 3 -72 -5 31 -89 7 -21 -86 18 -42 -39 0 21 -21 26 -23 75 -1 -39 24 -27 -19 38
6689 38 -5 9 31 -38 -21 23 -25 -46 38 -24 42 -30 -10 8 -38 -37 -15 -23 -24 51 -8 6 -60 -52 30 -16 -17 -13 -44 -24 8 -38 55
6722 55 -33 -33 89 34 -15 -30 -2 -4 -1 -53 -8 -5 -41 35 39 -41 48 10 -29 66 -25 -31 -8 -48 13 -20 -16 7 83 -2 38 -11 -28
6755 -28 32 2 -24 33 16 -3 1 -39 7 -9 -41 31 -11 -67 2 -23 27 27 -30 -14 2 21 -1 20 -4 34 11 -22 59 5 -7
6786 -7 31 15 74 3 -76 19 38 -10 27 -32 13 63 -17 -10 41 -70 6 42 -56 11 20 -25 -68 -92 -36 73 -31 18 -17 -22 59
6817 59 21 29 -5 8 11 74 4 24 40 21 -16 27 22 -16 29 -47 22 -41 -36 84 19 24 -42 -15 11 -19 -80 3 -18 -66 -31 -5
6849 -5 1 59 -69 -42 69 -62 50 -6 16 -18 55 -47 1 37 12 49 -3 39 7 -27 20 31 -47 67 -16 -27 -8 16
6877 16 18 17 -6 -5 19 -42 -60 29 25 45 4 -21 47 30 -38 20 -39 1 -21 -88 -24 -2 -79 -3 -67 -50 28 -28 -15 31 -48 -32
6909 -32 55 -62 16 57 -23 69 20 -45 36 -3 0 41 -20 -2 -12 8 -13 38 -22 -12 -1 -27 17 -8 -20 59 8 11 29 8 42
6940 42 41 37 61 22 -26 -4 -9 -1 15 -33 -31 33 -36 34 -9 -2 46 12 19 44 -24 -2 15 18 2 19 -3 3 8 9 -4 40 36 -19 -39 18
6976 18 -19 -37 35 5 -34 3 -44 -2 2 -22 21 61 -7 -10 34 -45 19 -4 -95 57 20 1 48 -2 30 55 -25 43 61 -18 -6
7007 -6 23 0 36 -12 -45 29 -37 -23 9 -5 37 57 31 20 45 -3 8 33 21 7 -1 23 8 -42 15 74 -14 36 -16 -32 47
7038 47 -7 51 68 -3 22 -19 -41 6 41 -19 4 35 43 16 -10 -12 7 -21 -40 74 -17 -33 -56 -28 93 -14 -35 54 42 -22
7068 -22 40 -12 27 72 -20 14 17 -9 44 1 29 -43 -26 20 24 14 -1 47 11 10 -1 5 51 -9 -20 -20 13 9 56 11 -33 -42 -25 8
7102 8 0 -6 20 -31 17 44 -11 -4 35 -11 22 13 36 13 36 -26 74 -1 4 -17 26 17 -27 10 -25 10 -23 -14 -7 -27 21 -11 -30 8
7136 8 -27 -18 22 30 -29 69 -30 -9 6 -12 34 -32 -21 43 -30 -7 11 32 69 39 -2 -1 10 -25 61 24 8 36 11 -6 2 -55 16
7169 16 -26 -3 26 -41 -4 12 10 -13 28 20 5 51 -20 -27 44 42 64 -19 19 20 -1 -8 37 14 -28 70 96 29 28 -41 16 18 -25 73
7203 73 15 19 17 -15 6 78 -21 -12 2 -4 22 -57 25 36 11 -1 18 4 28 15 -37 -46 0 -22 85 -44 -34 62 -58 6 9 -61
7235 -61 23 44 -21 6 25 -75 -13 16 32 19 17 36 20 8 15 77 -9 21 26 -46 94 -40 8 -5 -34 11 -1 -37 20 -11
7265 -11 -36 12 -37 12 12 -23 -31 -49 21 -3 -30 -37 -38 14 1 -27 -41 -32 38 -12 -2 74 -36 18 9 -16 15 45 44 28 16 -67 72
7298 72 9 -1 -16 -3 20 56 -36 -22 38 -69 61 22 -40 -21 -25 15 -5 -11 27 8 6 16 -4 28 -9 -27 10 35 -72 39
7328 39 0 -39 -16 21 -34 25 -39 -25 48 22 -34 47 -23 33 0 -49 5 39 -30 -3 15 28 39 -6 24 4 10 -4 20 -111
7358 -111 26 -3 -6 10 31 3 16 -36 -15 9 -12 14 28 -7 50 26 -3 35 -28 16 -17 -56 -54 52 -52 0 76 -47 52
7387 52 -1 -66 -20 -6 1 17 -59 34 44 -18 -23 32 -62 38 20 -44 16 30 44 -1 27 -44 3 -21 42 -37 60 2 -17 33 18
7418 18 40 -36 1 -18 23 1 -57 50 38 -57 38 -15 -1 -5 -15 -56 17 -26 -79 -8 -50 -18 -29 24 6 61 -61 9 -27 -11
7448 -11 76 -15 -7 10 -26 26 -4 -56 -5 -34 -46 -4 5 -70 -2 3 7 36 44 15 40 -20 0 5 -28 58 7 -4 -26 -5 12 67 -28
7481 -28 45 -1 -72 28 14 13 5 -14 5 51 -19 20 -53 15 61 -18 37 43 18 -31 57 -23 -11 -19 -13 -5 33 -39 23 34 3 17 -106
7514 -106 14 40 28 0 -16 -69 18 4 -88 51 -39 15 -46 -40 22 24 35 0 -15 -26 29 20 -14 48 22 -45 26 27 7 40 -17
7545 -17 31 -43 -33 -4 -3 -78 30 -21 -22 30 -22 -12 11 13 24 50 -53 57 -30 -50 35 -5 32 42 -24 1 93 -37 37 69
7575 69 -22 -14 17 -22 12 25 -29 -9 16 -43 110 -40 31 37 -12 93 -4 -12 31 41 -37 -11 -25 -20 -11 -45 -19 58 -3 17 -13
7606 -13 -27 -23 -23 -57 23 -9 7 40 -8 -51 -8 -27 16 18 17 37 -24 59 44 14 -3 43 -5 18 38 9 28 15 17 12 -30 -39 29 -48
7640 -48 -4 55 20 -48 -17 -42 27 15 -32 -29 -4 -5 49 -14 43 1 18 48 -10 -11 27 -34 -23 4 -59 34 33 -8 -3 58 -52 3
7672 3 -16 -58 11 56 6 26 -37 20 11 18 12 37 -32 14 -13 -57 1 -26 -18 3 -37 -10 67 8 17 -7 -28 30 -1 34 51 12 -84
7705 -84 13 -6 -35 13 -12 45 3 13 13 32 -59 15 30 -2 73 -3 -17 6 -4 -1 -8 -21 -35 -5 60 37 -35 -66 74 -32 12
7736 12 25 -40 -30 -42 6 11 21 6 8 -16 20 -26 57 43 26 -18 17 -6 -35 47 41 8 8 -37 17 22 -5 25 57 -77 21 -43
7768 -43 -39 36 1 -51 33 -12 -14 -20 -6 15 4 -47 46 -23 -49 125 -31 38 32 57 -47 5 -40 31 -25 -18 46 -9 1 -54 6
7799 6 0 33 -7 13 28 -59 -44 52 -71 -7 -43 4 -7 -34 -16 -4 -19 -66 -44 -14 -25 6 -39 22 -44 -33 22 -25 -41 66
7829 66 -66 30 46 -18 10 15 -6 14 -12 -56 2 -42 -8 4 -5 0 9 -34 -42 -5 -22 6 -22 -49 8 -55 -20 4 -20 66 14 -46
7861 -46 -64 48 -47 49 -32 -41 30 -64 40 15 -31 -48 25 2 46 -6 -32 -10 15 41 20 -76 3 21 -30 76 22 -24 30
7890 30 -10 15 32 -45 -39 40 -24 -5 33 -41 5 -11 -34 27 -46 -77 68 -7 -6 -30 -54 9 28 -7 2 -13 -27 29 10 -2 38
7921 38 -24 -1 73 71 -15 27 -10 -10 -56 -30 11 20 -63 5 9 -51 11 -35 0 5 -44 43 63 -10 36 -40 8 -24 -11 -28 27 28 45
7954 45 -27 5 -27 -10 -22 35 -18 -2 6 -49 9 34 -52 -50 14 -49 17 -30 31 32 77 15 34 -10 -8 -50 -52 34 -21 0 15 -40 -12
7987 -12 17 16 19 -49 9 -19 21 -53 -4 14 -12 10 30 -52 -47 -29 21 32 -17 0 38 -8 -2 -63 31 37 20 -35 18 -23 -48 9 -17
8020 -17 29 33 -1 39 -14 -49 57 -35 -8 56 0 24 18 56 30 -3 -24 -3 42 16 64 15 -59 21 30 10 -10 -63 6 67 11
8051 11 33 25 -2 60 -7 30 48 -29 -6 46 23 42 58 23 58 -60 1 -13 -4 66 25 -61 18 48 -50 -42 -14 -34 50 -35 7
8082 7 -11 46 9 13 31 -24 45 -4 -33 53 -49 31 19 57 18 8 16 51 -49 -71 -17 16 6 15 -45 -5 29 -8 12 -15 -34
8113 -34 25 -62 -3 7 -64 -19 20 -4 41 76 3 30 -42 25 17 -3 -10 4 19 42 -3 -38 11 -1 3 -2 -42 33 -40 -67 6 13 -4
8146 -4 22 13 -2 4 -25 -10 43 -7 -13 32 -44 -3 -19 -22 -6 -23 -10 82 20 8 22 30 -11 14 -66 -53 54 -24 -13 -48 2 50 -19
8179 -19 -10 45 -15 28 3 0 -3 14 23 -29 -17 33
8191C3
$$ Imaginary data points
##PAGE= N=2
##DATA TABLE= (X++(I..I)), XYDATA
0 0 0 0 0 0 0 0 0 0 0 0 0 0 0 0 0 0 0 8 -8 8 -8 8 -8 16 -16 16 -24 24 -25 32 -34 40 -48 55 -58 65 -74 83 -96
39 -96 105 -116 129 -145 161 -177 194 -216 236 -260 288 -316 348 -386 426 -468 519 -577 643 -718
59 -718 807 -917 1048 -1216 1435 -1732 2166 -2856 4135 -7312 33902 38589 -3046 22050 7019
74 7019 -4392 -19703 -32449 -23330 -18339 -23399 -10255 -11131 7748 20073 -3017 10077 34111
87 34111 7195 1781 8440 -876 2353 -5416 -14684 -2395 -8148 -8229 -1489 -9243 5799 9187 -14848
102 -14848 2846 17047 -2342 -2072 54 1157 11153 -1158 -4046 4650 -3169 2128 -2937 -19586
116 -19586 71 1263 -19557 -2995 7392 3082 10774 6446 10532 18027 4965 4631 278 -11610
130 -11610 -139 -9051 -21969 -1429 -4841 -14605 2534 3043 2888 9188 1345 7865 11285 2012
144 2012 6337 -1877 -5844 8707 -6082 -13679 4727 -2905 -6703 2899 -3022 2517 6248 -2636
158 -2636 2935 1327 55 7397 -6988 -5612 10683 -3735 -6024 5109 -3923 -693 2056 -6988
172 -6988 679 889 -2915 3198 -3097 2579 10741 -5871 -448 10847 -3408 -1187 1950 -6149 2605
187 2605 426 -7502 122 -1376 802 2011 -9259 3006 9179 -8112 45 6906 -2118 4262
201 4262 1097 -3504 6845 1685 -2540 841 -2747 5029 1361 -11585 3540 5659 -9101 -1165
215 -1165 299 -2812 3409 -4543 -3730 6197 239 198 -396 -2079 10466 2236 -9431 6445 5646 -3622
231 -3622 1386 -3139 -532 5030 -5992 -3720 1985 -1447 2080 -4490 -4936 9828 -660 -8238 5104
246 5104 1612 -1206 1502 -4658 2594 4846 -4993 510 1814 661 5132 -5581 -3075 9975 -2399
261 -2399 -6424 2065 -1408 1483 -888 -7540 3185 3132 -3724 775 -1943 2242 6976 -5931 -1342
276 -1342 8391 -1140 -421 1547 -1859 5106 81 -5238 3531 368 -1680 808 -5263 1999 4564
291 4564 -7144 -201 4571 -1997 1990 -845 -1628 6324 -1431 -3672 3270 -1133 1037 99 -6729
306 -6729 3445 3651 -5658 809 766 -632 4578 -2936 -1723 5405 -2007 -1027 970 -3466 2715 -898
322 -898 -6742 2920 483 -3620 1981 -2582 82 5236 -2811 353 4066 -1271 2970 535 -2565
337 -2565 4944 -890 -4147 3180 -1329 -835 1623 -5235 743 3744 -3649 394 287 -1493 4306 -1808
353 -1808 -2693 4949 -1165 -1369 2250 -2468 2716 2095 -4999 2315 2753 -1698 1924 -2419 -875 4781
369 4781 -3653 -2835 2243 -2788 41 -881 -4474 3737 787 -4414 2739 1196 1053 3539 -3300 1215
385 1215 5667 -2364 -472 1023 -1356 3130 -2264 -4111 4402 -658 -3541 963 -2233 1338 1602
400 1602 -5802 906 3802 -1756 898 -399 1071 5870 -2340 -1807 5172 -702 -957 -63 -3753 2239
416 2239 388 -5859 813 1422 -420 1336 -3175 1759 5577 -4111 -1569 3151 -1891 656 -1146
431 -1146 -3674 3685 685 -2856 1964 499 2307 1816 -4631 2408 3955 -4906 -1096 393 -1867
446 -1867 2461 -2055 -2885 4128 687 -529 863 -1334 3460 457 -5492 2666 2123 -3772 711 -711
462 -711 -395 3789 -1941 -1220 2887 -325 1244 -696 -2705 3929 -772 -4971 3179 855 -2051 1184
478 1184 -1975 1032 3472 -2605 -705 464 -782 2668 -2434 -3043 4560 -771 -2498 3293 -285
493 -285 647 2128 -2568 1402 2353 -1637 437 -1949 -616 3484 -3522 -2454 3046 -2949 -1393 1948
509 1948 -2358 824 1182 -1743 2606 1568 520 2012 -2395 1240 3878 -4068 -1166 2103 -2718
524 -2718 480 243 -2944 1793 231 -1934 729 -1020 1469 1386 -4418 1396 3471 -2451 1212 754
540 754 -1700 3667 813 -2085 1833 -88 -113 -193 -3046 1638 -177 -5081 1704 1330 -2372 2416 -69
557 -69 -801 3948 -102 -1249 854 -896 1162 -1283 -2879 4111 518 -3234 3007 1089 -293 2175
573 2175 -3008 -1631 2354 -1519 -1688 -1465 -644 3415 -1632 -2356 4339 -36 -1478 2355 -1507 225
589 225 2305 -3019 -821 1603 -284 320 -1989 397 4052 -2723 -1574 3735 -1760 -1109 923 -2824
605 -2824 795 1433 -2491 525 1485 1949 2146 -2395 1633 4346 -3344 -1550 1205 -2818 41 -614
621 -614 -3227 1933 1478 -784 942 -65 2585 1656 -3893 1309 2504 -3505 -42 321 -2174 1778
637 1778 -576 -2328 1742 347 -57 -386 -1842 3006 634 -4071 2278 1860 -2071 1744 -18 -679
653 -679 2735 -763 -1250 786 -712 785 -1494 -2814 2930 -288 -3116 2461 336 -763 2335 -1288
669 -1288 -211 2302 -1194 -304 -91 -525 2184 -1752 -1641 3777 -707 -1631 2253 -1346 -82 1626
685 1626 -2694 -568 816 -951 275 -1671 -58 3255 -1790 -535 3455 -1142 289 1852 -2101
700 -2101 606 1132 -1958 232 -315 -241 1162 -2381 218 2324 -2728 -83 1668 -2077 1065 714
716 714 -2040 1845 1042 -798 684 -694 1465 1368 -3068 966 1772 -2496 749 13 -2328 1900 -335
733 -335 -2368 1056 164 491 174 -1947 2411 1389 -2645 1548 553 -1691 2003 -760 -1618 2153 -592
750 -592 -939 724 -668 1114 -820 -2362 2621 135 -2322 1836 -411 -384 2435 -1594 -598 2189
766 2189 -710 -221 -372 -401 2424 -1472 -2235 2581 -513 -1305 1085 -2021 191 2044 -2014 -229 1155
783 1155 -110 1151 -1207 -232 2827 -1730 -1225 2188 -1117 151 822 -2300 1096 1199 -2048 291
799 291 -104 34 1258 -2181 476 2817 -1968 -41 1534 -1085 1559 24 -2402 1700 674 -1171
815 -1171 180 -1283 925 1118 -2945 497 1523 -1962 617 14 -1205 2158 -490 -1571 1707 10
831 10 250 472 -1601 1818 1108 -2337 1284 511 -1372 1205 -1179 -871 1950 -1477 -1048 1002 -694
848 -694 1125 -175 -1690 2470 474 -1471 1701 -375 -221 1733 -1903 -370 1464 -1633 -251 -343
864 -343 -1248 1582 -1021 -1591 2139 -457 -477 1506 -1217 871 1709 -1830 631 980 -805 1056 -854
881 -854 -613 2090 -1335 -935 1447 -1286 244 632 -2069 1217 841 -1656 950 -92 -182 1605 -1402
898 -1402 -155 1812 -1549 16 639 -1590 1294 -14 -1968 1493 90 -826 1064 -1106 454 1454
914 1454 -2105 198 1016 -1443 934 -283 -1092 2294 -251 -826 1921 -295 406 827 -1928 962
930 962 771 -2370 280 -322 -1099 1336 -1304 -695 2195 -804 -59 1162 -902 1306 332 -2061 1456
947 1456 296 -1418 731 -999 -93 1469 -1963 -155 1323 -1358 489 -13 -1287 1890 -217 -1407
963 -1407 1873 243 107 1025 -1289 1116 1366 -2054 322 229 -1401 875 -1210 -1226 1996 -913 -912 1284
981 1284 -451 962 404 -1727 1679 623 -1632 1007 -475 -522 1669 -1523 -567 1807 -993 -126
997 -126 255 -965 1484 -547 -1794 1777 -125 -852 1280 -1084 363 1734 -1561 150 1166 -759
1013 -759 665 -639 -680 1846 -1170 -1198 1563 -956 -2 822 -1816 882 1093 -1764 443 200 -345
1030 -345 1022 -1343 -107 1922 -1334 -45 1233 -1162 1105 493 -1924 1119 396 -1173 493 -971
1046 -971 166 992 -1977 361 1357 -1439 883 480 -1115 1804 91 -1105 1475 -166 -178 511 -1528
1063 -1528 700 517 -2162 625 128 -1430 1191 -646 -1014 1911 -387 -457 1217 -312 890 311
1079 311 -1339 1451 70 -1503 1126 -767 -1007 1455 -1350 -798 1244 -800 18 217 -665 1554
1095 1554 -221 -1002 1829 -423 -562 1454 -1353 -128 1510 -1519 -174 749 -758 657 -709 -672
1111 -672 1642 -943 -580 1427 -1219 371 1230 -1837 582 1338 -1245 364 121 -168 1083 -1119
1127 -1119 36 1550 -1356 221 810 -1751 902 560 -2026 682 495 -783 489 -684 489 1141
1143 1141 -1533 553 1088 -1246 1045 238 -1452 1698 159 -1499 714 -316 -241 158 -1565 771
1159 771 612 -1514 1119 301 -904 1773 -376 -1115 1829 -227 -744 633 -369 768 -140 -1474
1175 -1474 1282 -184 -1437 1231 -852 -716 1690 -1068 -561 1591 -318 111 26 -544 1501 -416
1191 -416 -1048 1558 -483 -438 1355 -1415 -155 1300 -1583 -370 685 -573 521 -543 -243 1641
1207 1641 -816 -322 1361 -1110 311 1035 -1613 697 1212 -1125 338 131 -213 605 -1451 -146
1223 -146 1197 -1468 234 816 -1365 1025 585 -1560 939 451 -692 574 -509 516 986 -1307
1239 -1307 571 803 -1390 772 -124 -1673 1159 -98 -1227 959 -84 -29 537 -907 918 408
1255 408 -1264 1195 150 -874 1633 -410 -972 1532 -515 -858 370 -814 308 -183 -1166 1241
1271 1241 -67 -879 1409 -655 -481 1559 -887 -489 1300 -472 259 261 -715 992 -482 -1021 1039
1288 1039 -946 -453 1215 -1275 43 1407 -1071 149 657 -516 682 -425 -367 1270 -692 -50
1304 -50 1173 -1176 373 944 -1620 335 746 -1112 285 -174 -272 920 -950 -40 1029 -1066 404
1321 404 700 -1214 1032 645 -1276 831 436 -461 516 -752 89 710 -1295 290 461 -1058 1034
1338 1034 29 -1212 1371 74 -931 809 -162 199 610 -956 774 547 -1127 787 -261 -999
1354 -999 1159 -803 -1073 1209 -464 -490 384 -672 638 125 -1073 1016 105 -625 1043 -592 -235
1371 -235 1383 -838 -349 994 -647 148 -33 -738 970 -318 -844 947 -593 -223 968 -1150 214
1388 214 1180 -957 268 660 -423 853 -290 -468 1094 -692 -451 704 -1104 137 502 -1501
1404 -1501 484 491 -972 467 -86 -152 1074 -594 137 1129 -663 508 543 -987 866 175 -1303 611
1422 611 -197 -749 426 -771 12 738 -970 444 651 -599 1000 118 -793 1147 -197 -887 654
1439 654 -605 -172 370 -1072 375 418 -922 792 60 -583 1133 -434 -573 1011 -601 -228 547
1456 547 -748 542 316 -779 874 66 -493 992 -460 -301 988 -947 -227 589 -966 271 109
1473 109 -875 867 -91 -698 914 -390 -133 917 -829 214 833 -796 416 277 -674 781 -364
1490 -364 -773 749 -663 -459 510 -865 316 607 -884 689 641 -440 892 -82 -238 1022 -697
1507 -697 -380 640 -876 14 172 -1002 663 172 -790 707 -80 -232 787 -721 -23 908 -815
1524 -815 184 484 -591 732 7 -629 963 -288 -595 594 -730 -58 457 -1132 269 505 -755
1541 -755 494 182 -211 1023 -339 -256 944 -512 -53 410 -930 430 273 -1046 547 129 -505
1558 -505 660 -433 -118 739 -840 -11 522 -764 457 123 -839 1005 150 -625 825 -136 -52 592
1576 592 -801 199 433 -942 323 24 -764 809 -300 -621 922 -270 -234 649 -482 318 387 -763
1594 -763 598 174 -634 733 -317 -397 956 -602 -356 696 -716 -69 212 -784 464 2 -592 842
1612 842 -176 -129 1039 -499 145 1027 -705 26 392 -701 302 -232 -714 495 -567 -438 659
1629 659 -747 105 706 -862 384 688 -606 512 198 -342 695 -421 -236 554 -675 24 358
1646 358 -1044 344 286 -972 561 208 -497 629 -137 -60 717 -493 312 458 -734 653 135 -958
1664 -958 707 -60 -792 467 -326 -226 483 -567 249 352 -643 621 122 -670 929 -183 -651 911
1682 911 -190 -262 497 -453 153 263 -602 521 -83 -465 762 -449 -452 899 -530 -421 700 -550
1700 -550 29 289 -456 573 18 -290 765 -318 -125 852 -816 -149 751 -858 -183 332 -624 251
1718 251 -171 -452 642 -341 -48 758 -654 361 845 -800 326 603 -722 226 -74 -429 481 -428
1736 -428 -91 521 -619 233 350 -842 566 296 -909 498 208 -455 532 -199 -22 492 -480 242
1754 242 353 -697 612 123 -846 704 -32 -717 425 -291 -267 320 -504 253 399 -419 750 190 -381
1773 -381 993 -174 -557 778 -378 -442 333 -547 49 149 -651 464 -106 -369 758 -351 -251 943
1791 943 -465 -172 732 -430 77 258 -458 395 -119 -364 602 -539 -195 710 -816 -135 576 -754
1809 -754 66 442 -396 473 137 -120 664 -224 -8 552 -715 95 465 -971 220 303 -721 377 40
1828 40 -348 466 -285 -49 387 -596 337 324 -812 574 322 -757 603 235 -365 528 -222 -92 320
1847 320 -577 175 130 -766 552 -23 -770 738 -3 -446 615 -128 -36 509 -376 235 280 -476 420 -84
1867 -84 -541 727 -332 -542 644 -430 -276 425 -458 166 231 -398 511 -32 -272 766 -376 -245 889
1886 889 -453 -173 554 -488 53 179 -478 337 -154 -412 509 -460 -168 660 -657 36 665 -575 236
1905 236 372 -436 493 -16 -323 479 -349 -58 484 -781 88 437 -829 308 281 -533 438 41 -333
1924 -333 505 -273 9 428 -485 311 388 -634 522 233 -751 414 -44 -478 435 -342 -181 329 -601
1943 -601 205 200 -555 603 63 -523 780 -17 -408 656 -238 -82 408 -490 133 104 -551 377 -109 -485
1963 -485 638 -335 -449 686 -412 -119 553 -371 323 336 -404 531 16 -350 557 -497 -335 504 -563
1982 -563 -149 453 -591 221 260 -353 487 -26 -276 504 -326 -112 601 -551 -8 499 -580 260 268 -435
2002 -435 479 -46 -324 472 -438 -209 394 -696 48 332 -652 323 249 -438 589 110 -241 573 -281 -92
2022 -92 408 -555 107 292 -698 315 40 -653 446 -91 -300 557 -293 -30 476 -411 277 353 -459 531
2042 531 95 -458 512 -141 -354 432 -490 -144 345 -560 192 268 -496 467 52 -348 715 -113 -207 592
2062 592 -393 -83 359 -551 208 214 -482 394 -16 -394 571 -325 -188 495 -423 30 237 -591 212 76 -586
2083 -586 465 -21 -307 584 -200 -8 582 -413 147 328 -577 159 -20 -622 332 -258 -488 497 -265 -90
2103 -90 574 -311 276 495 -346 420 183 -399 404 -214 -404 388 -517 -315 433 -511 86 305 -426 400
2123 400 153 -294 531 -48 -186 533 -387 -24 492 -515 129 246 -580 302 -19 -491 411 -241 -242 475
2143 475 -410 56 481 -422 291 327 -436 394 3 -419 426 -263 -245 427 -444 52 302 -531 278 177 -513
2164 -513 364 -54 -432 432 -305 -202 462 -415 26 309 -432 382 177 -501 545 2 -413 511 -269 -254
2184 -254 361 -398 25 151 -446 271 -10 -464 559 -157 -301 624 -217 -114 508 -345 115 256 -465 227
2204 227 -36 -495 410 -246 -331 527 -383 -121 488 -388 146 370 -411 338 111 -299 465 -256 -216 489 -469
2225 -469 -27 477 -561 93 191 -552 276 55 -308 357 -195 -137 452 -409 80 435 -533 240 242 -536 360
2246 360 84 -306 424 -231 -122 387 -413 108 301 -575 277 151 -496 346 -3 -349 487 -95 -41 421
2266 421 -247 188 275 -404 339 27 -550 411 -250 -502 374 -283 -253 370 -321 182 258 -235 483 88 -263
2287 -263 604 -140 -277 506 -341 -251 325 -421 -41 129 -399 264 -9 -250 500 -220 -112 607 -283 8
2307 8 518 -379 111 187 -393 209 -54 -315 332 -303 -116 457 -465 41 408 -480 203 288 -354 314 43
2328 43 -278 322 -233 -79 304 -509 129 293 -560 287 272 -419 416 33 -290 357 -214 -155 226 -488 34
2349 34 208 -502 419 260 -342 501 100 -267 448 -176 -188 291 -378 59 146 -508 337 22 -481 427 -92
2370 -92 -314 514 -156 -136 353 -232 100 193 -260 362 19 -303 494 -175 -324 438 -395 -222 273 -418 0
2391 0 198 -298 352 63 -78 584 -109 -33 535 -381 -186 352 -495 -43 157 -350 239 26 -265 416 -237
2412 -237 -74 410 -402 58 307 -468 152 253 -371 266 48 -197 329 -168 -50 312 -458 43 223 -499
2432 -499 146 133 -434 272 33 -244 348 -121 4 327 -363 147 217 -503 271 73 -460 445 -20 -284 384
2453 384 -167 -88 213 -341 72 86 -392 375 59 -296 446 -23 -189 531 -232 -73 368 -307 98 92 -398
2474 -398 212 -125 -341 323 -232 -263 396 -257 11 366 -291 165 181 -213 253 -38 -225 315 -265 -154 352
2495 352 -398 -73 363 -384 98 174 -313 313 -29 -203 398 -144 -39 405 -341 128 278 -409 143 171 -382
2516 -382 258 -16 -271 262 -182 -93 239 -390 58 203 -398 250 162 -345 390 24 -271 351 -132 -73 263
2537 263 -248 107 126 -407 244 62 -403 270 -97 -277 373 -154 -47 320 -205 132 196 -304 266 34 -314
2558 -314 377 -102 -237 330 -271 -52 245 -305 72 84 -276 279 -26 -315 418 -170 -153 399 -225 58 359
2579 359 -358 235 161 -269 239 -113 -266 203 -222 -172 309 -330 34 248 -308 122 166 -260 245 -6 -202
2600 -202 348 -187 -49 299 -265 97 239 -369 127 102 -378 185 -82 -250 215 -207 -67 332 -241 153
2620 153 259 -203 292 143 -238 372 -73 -244 247 -203 -120 235 -379 82 139 -319 273 -6 -278 377 -83
2641 -83 -116 390 -127 4 347 -262 173 182 -284 223 -59 -284 205 -223 -279 296 -219 -3 282 -254 185 172
2663 172 -235 242 27 -276 276 -143 -136 273 -263 -18 254 -295 188 91 -260 252 -49 -274 220 -119 -98
2684 -98 309 -218 126 212 -262 206 118 -238 341 -27 -217 266 -164 -113 197 -260 47 189 -303 145 49 -255
2706 -255 237 -75 -172 326 -206 -16 314 -235 101 213 -244 237 29 -279 204 -142 -181 194 -299 -85 237
2727 237 -312 89 203 -189 203 128 -154 359 -28 -138 271 -257 -96 189 -352 70 62 -254 190 13 -231
2748 -231 294 -139 -71 271 -148 79 273 -250 136 122 -290 269 64 -224 247 -138 -106 299 -254 30 157
2769 157 -335 146 75 -268 321 11 -240 310 -84 -37 261 -246 29 143 -238 180 45 -318 275 -67 -220
2790 -220 245 -174 -129 203 -223 52 196 -252 186 49 -211 296 -86 -112 386 -172 -70 215 -257 75 110
2811 110 -297 32 -25 -253 217 -145 -97 253 -232 31 316 -258 99 179 -236 179 -38 -224 204 -181 -151
2832 -151 195 -277 -16 188 -371 73 152 -280 218 86 -124 198 -105 -53 257 -220 119 148 -258 170 86
2853 86 -305 223 15 -198 160 -219 -42 144 -275 41 163 -254 207 64 -224 297 -52 -148 294 -166 -113
2874 -113 194 -260 84 107 -310 153 -55 -226 271 -87 -123 351 -91 -17 258 -244 56 167 -221 168 -45
2895 -45 -223 242 -90 -136 276 -239 -133 231 -272 40 135 -215 218 -27 -168 312 -82 -57 319 -224 -23
2916 -23 236 -258 67 116 -318 120 -20 -209 178 -139 -70 246 -319 57 195 -267 222 118 -279 221 93
2937 93 -133 258 -105 -60 232 -200 84 117 -250 111 13 -316 170 -33 -166 261 -21 -85 211 -149 135 195
2959 195 -187 290 50 -263 235 -67 -169 205 -163 -101 227 -204 38 68 -196 233 68 -171 299 -39 -148
2980 -148 309 -99 -39 229 -188 41 115 -229 144 -95 -151 263 -174 -156 264 -298 13 226 -204 77 169 -197
3002 -197 231 18 -97 261 -195 -65 281 -298 32 224 -296 107 54 -240 161 16 -151 160 -107 15
3022 15 253 -178 72 184 -256 161 120 -248 199 -3 -173 216 -127 -88 127 -249 71 188 -251 144 86
3043 86 -256 173 -37 -66 257 -134 -30 204 -167 107 95 -224 163 24 -249 209 -97 -207 205 -112 -30
3064 -30 172 -202 41 121 -138 184 -15 -186 237 -127 -160 324 -231 -51 179 -227 0 73 -239 188 -36
3085 -36 -134 264 -168 -71 258 -154 7 208 -145 86 206 -228 167 -24 -206 203 -153 -21 168 -225 -3
3106 -3 171 -264 113 87 -200 173 31 -128 180 -156 19 149 -204 46 212 -283 137 -7 -254 204 -68
3127 -68 -158 226 -106 -92 189 -207 88 122 -214 237 84 -157 206 -50 -184 213 -127 -30 210 -185 50 78
3149 78 -253 190 8 -227 255 -103 -118 231 -139 -41 207 -196 92 188 -170 160 -20 -218 228 -107 -161 236
3171 236 -211 5 177 -235 119 51 -204 180 24 -145 241 -86 -36 232 -267 0 128 -227 138 41 -275
3192 -275 113 -84 -210 194 -147 -48 225 -218 128 147 -237 191 88 -210 219 -35 -158 147 -171 -101 168
3213 168 -210 21 100 -273 151 -13 -216 209 -63 -139 232 -131 20 240 -158 140 89 -213 173 47 -203
3234 -203 226 -66 -148 140 -221 -8 165 -267 99 111 -218 162 52 -106 238 -41 -85 214 -184 -43 132
3255 132 -268 91 63 -237 208 -60 -218 221 -127 -70 207 -183 -30 148 -132 145 80 -262 192 20 -150
3276 -150 194 -106 -43 171 -184 -44 160 -219 64 21 -151 217 26 -88 182 -187 -42 260 -197 74 96
3297 96 -182 153 40 -249 176 -70 -130 217 -138 -65 222 -170 5 108 -268 147 21 -137 241 -33 -67
3318 -67 204 -135 -20 211 -216 78 69 -210 81 -22 -186 159 -128 -156 229 -141 36 165 -159 135 150 -186
3340 -186 191 12 -176 166 -145 -82 145 -207 43 133 -255 62 90 -172 129 60 -134 196 -28 31 188 -104
3362 -104 100 113 -218 153 96 -234 154 -70 -157 169 -137 -67 153 -224 46 105 -193 179 11 -136 196 -28
3384 -28 -132 232 -129 -15 198 -173 67 91 -211 103 -24 -183 167 -104 -119 226 -182 -2 189 -178 80
3405 80 121 -134 139 -33 -154 160 -101 -116 164 -172 -51 187 -232 43 94 -138 125 1 -105 182 -133
3426 -133 -23 199 -114 56 172 -176 109 83 -136 152 -5 -174 116 -46 -88 114 -184 3 108 -242 160
3447 160 73 -208 206 6 -111 203 -102 -27 111 -272 16 56 -218 126 35 -138 259 -49 -99 227 -118 -101
3469 -101 113 -146 44 85 -166 153 -24 -123 205 -70 -87 181 -131 -57 166 -169 62 71 -139 151 -23 -93
3491 -93 195 -89 -66 262 -153 -16 146 -114 56 84 -124 137 -53 -94 143 -137 -49 110 -164 -28 121 -164
3513 -164 100 123 -109 123 12 -63 150 -64 -15 156 -128 34 145 -283 122 43 -178 131 -29 -81 156 -81
3535 -81 -26 119 -134 79 169 -211 98 21 -152 176 -15 -65 110 -145 -6 148 -202 23 87 -143 183 36
3557 36 -100 200 -27 -95 201 -46 -4 100 -148 106 53 -75 144 -23 -164 207 -126 -118 212 -155 -29 118
3579 118 -142 21 26 -110 161 -72 -103 131 -122 -62 130 -96 -9 111 -194 99 45 -164 66 -53 -139 155
3601 155 -115 -32 150 -150 67 99 -119 138 111 -135 101 -11 -115 81 -122 -14 94 -192 40 105 -209
3622 -209 84 55 -169 160 -50 -80 195 -55 11 122 -120 131 65 -211 164 37 -118 123 -23 -82 163 -70
3644 -70 8 138 -116 114 26 -158 181 67 -127 181 -48 -46 144 -101 -35 126 -160 42 63 -202 126 -102
3666 -102 -80 192 -109 -50 149 -165 56 149 -114 96 49 -83 195 20 -108 118 -102 -97 128 -131 20 86
3688 86 -168 90 82 -121 125 103 -53 202 -86 -17 106 -167 50 101 -244 65 -9 -114 138 23 -49 119 -64
3711 -64 3 171 -128 66 109 -161 145 13 -116 170 -43 -118 126 -164 19 140 -139 103 62 -169 167 -31
3733 -31 -102 91 -86 -47 120 -109 7 120 -107 28 74 -161 129 19 -156 103 -86 -124 105 -141 -31 71
3755 71 -161 55 28 -128 124 -29 -94 84 -86 11 166 -41 20 112 -129 89 25 -160 107 -47 -113 126 -76
3778 -76 -26 147 -115 16 84 -63 78 56 -113 163 5 -79 118 -68 -71 102 -181 8 59 -157 32 13 -143
3801 -143 159 1 -62 167 -101 40 167 -74 68 138 -94 164 5 -67 87 -104 -93 60 -90 -5 124 -196
3823 -196 52 87 -123 147 -16 -88 128 -43 -6 146 -97 -3 105 -115 99 -8 -156 79 -13 -134 70 -64
3845 -64 -19 84 -102 46 137 -132 132 38 -93 152 -4 -68 164 -128 18 106 -148 -7 66 -118 39 25 -136
3868 -136 115 -14 -98 160 -94 -24 87 -59 98 90 -137 74 34 -159 138 -66 -70 110 -88 -69 49 -97 43
3891 43 87 -59 74 25 -122 94 -2 -19 162 -75 8 56 -105 -14 46 -150 61 -33 -101 121 -49 -11 130 -72
3915 -72 -10 52 -110 78 32 -142 130 -31 -100 116 -79 -15 74 -136 52 47 -128 86 58 -154 52 -34 -86 192
3939 192 -33 -28 127 -76 42 65 -114 128 11 -115 105 -24 -101 90 -93 -71 96 -106 -4 15 -121 92
3961 92 0 -48 128 -21 -109 193 -18 -5 65 -77 50 46 -98 96 13 -132 149 -88 -101 149 -62 -36 139 -102
3985 -102 43 18 -75 140 17 -78 103 -32 -52 109 -128 -19 76 -140 -3 34 -180 118 13 -72 123 -25
4007 -25 8 164 -125 15 131 -125 91 74 -157 31 1 -85 125 -61 19 85 -118 -8 57 -133 75 68 -156
4030 -156 117 -58 -25 115 -48 24 159 -118 -1 18 -146 91 -41 -122 60 -28 -68 165 -108 38 125 -89
4052 -89 92 65 -173 163 58 -100 128 -21 -55 120 -148 -23 118 -123 -8 35 -100 142 -63 -115 191 -83
4074 -83 -47 138 -31 48 112 -47 54 70 -61 55 -24 -101 103 -87 14 136 -71 5 122 -92 41 75 -42
4097 -42 100 -37 -33 106 -80 -6 84 -106 85 60 -93 27 24 -158 74 6 -75 115 -112 -49 69 -145 82 99
4121 99 -133 79 65 -32 69 -67 -59 163 -101 -11 41 -95 71 78 -149 56 20 -84 173 34 -36 74 -64 -28
4145 -28 138 -15 66 74 -101 167 -49 -99 66 -66 -54 116 -119 -25 122 -102 -5 34 -108 135 -49 -75 133
4168 133 -46 32 107 -107 17 111 -102 53 17 -153 85 -42 -104 123 -88 -43 115 -93 54 104 -113 43
4190 43 89 -69 108 -15 -70 129 -89 -15 140 -95 15 79 -150 72 34 -107 118 -47 -34 95 -64 -20 110
4213 110 -98 5 29 -126 67 11 -110 169 -40 -91 87 -86 41 92 -50 -5 113 -111 43 13 -38 180
4235 180 -2 33 130 -59 8 132 -168 95 71 -154 76 -39 -117 76 -66 -46 148 -30 31 104 -77 51 88
4258 88 -74 70 -5 -33 125 -106 -64 42 -107 -57 107 -129 10 64 -132 60 18 -49 125 -33 -3 102 -87
4281 -87 38 94 -82 73 38 -112 77 -23 -49 94 -37 -6 47 -105 -13 74 -93 73 32 -81 132 -3 -93
4304 -93 85 -80 -21 65 -82 34 -16 -170 43 -53 -107 127 -19 -39 159 -132 -44 79 -87 59 55 -113 115
4327 115 25 -56 56 2 -102 112 -93 -22 95 -134 66 -11 -118 109 -19 -106 145 -49 -27 72 -128 39 34
4350 34 -118 28 23 -51 95 -5 -45 144 -95 -17 26 -83 -3 35 -86 58 72 -82 100 62 -48 96 -16 26
4374 26 88 -21 77 81 -88 59 -35 -134 78 -25 -78 94 -46 -6 86 -71 40 62 -89 44 -39 -69 110 -18
4398 -18 -69 104 -122 -67 84 -109 125 -16 -105 97 -7 -41 98 -10 1 113 -106 70 95 -102 80 47 -99
4421 -99 96 -26 -123 70 -83 -16 111 -63 -14 72 -62 117 60 -127 75 6 -81 120 -61 -18 71 -62 -25 56
4445 56 -137 79 91 -134 61 47 -56 107 -11 -62 88 -102 25 73 -67 102 91 -58 119 -65 -59 127 -114
4468 -114 -77 38 -125 21 27 -85 53 11 -130 85 -51 -39 130 -82 -17 113 -59 14 47 -106 102 21 -159
4491 -159 115 -91 -54 95 -71 -10 108 -40 81 83 -48 18 -1 -42 131 -37 -41 159 -83 -2 128 -54 15 -28
4515 -28 -153 24 33 -89 38 -44 -25 111 -71 46 116 -137 83 64 -90 63 -27 -86 89 -24 -34 109 -124
4538 -124 22 123 -92 16 -6 -59 49 5 -70 112 -39 -22 105 -51 19 63 -124 16 4 -63 32 -48 -76 150
4562 150 -6 -2 101 -85 47 115 -35 38 5 -98 156 -23 -122 106 3 -52 87 -93 50 0 -71 105 4
4585 4 -89 82 -51 -26 103 -74 19 74 -53 -8 66 -70 61 6 -75 44 2 -62 125 -109 30 104 -70 42
4609 42 58 -110 114 -54 -59 75 -38 4 26 -107 48 39 -69 13 -18 -22 10 -26 -77 49 -99 -62 112 -69 96
4634 96 94 -106 122 -22 -80 64 -4 -78 66 -74 -37 67 -95 -3 58 -123 51 7 -86 112 60 -49 62 -43
4658 -43 14 47 -40 61 69 -101 112 49 -74 89 -36 -67 65 -90 0 44 -148 51 -33 -29 55 4 -39 49 -79 -58
4684 -58 40 -69 44 47 -99 3 4 -99 35 -27 -67 93 -50 -13 83 -94 21 64 -45 -21 42 -29 57 16 -98
4709 -98 48 -44 -23 96 -155 21 60 -65 80 19 -93 136 18 -93 133 -44 -42 126 -34 57 70 -47 29
4732 29 17 -26 59 -44 -68 61 -45 -2 -7 -20 34 55 -120 23 26 -56 124 -35 -34 103 -6 -41 43 -49 30 36 -66
4759 -66 30 -29 -45 -5 -56 -26 80 -24 -5 -12 -73 6 37 -68 23 -4 -89 65 -40 -65 73 -83 -23 -9 -36 -3 142
4786 142 -56 57 -17 -42 108 -30 -29 68 -92 7 23 -24 11 36 -28 34 5 -69 83 -40 -2 69 -92 8 64 -57
4812 -57 -6 -32 -21 66 42 -34 103 -54 -28 59 -66 27 47 -95 40 4 -106 97 -51 -21 46 -64 7 63 -56
4837 -56 27 104 -64 62 13 -40 100 -12 -50 47 -61 14 26 -69 24 74 -55 58 5 -20 58 9 -28 60 -38 3 66
4864 66 -64 64 34 -66 30 -47 -44 56 -36 11 63 -52 6 59 -64 32 25 -76 73 -4 -78 59 -58 -26 51 -38
4890 -38 32 104 -82 62 -13 -114 15 26 -10 82 -23 -28 90 -34 11 31 -42 48 -16 -71 37 -42 -51 10 -15 17 61
4917 61 -103 -14 54 -84 33 25 -55 5 -34 6 59 6 -19 56 -104 27 29 -4 -6 28 -115 54 -13 -122 46 -4 21
4944 21 16 -47 51 98 -44 10 -30 -18 29 -24 -25 8 -39 18 64 -50 25 1 -69 36 38 -53 142 -93 -17 114 -50 -2
4972 -2 62 -75 65 42 4 99 10 -70 48 9 -31 70 -5 3 0 -58 41 22 -67 57 16 -24 33 -91 -51 93 -41 26
5000 26 63 -14 61 -10 20 145 -35 -33 77 -31 -3 71 -79 24 -2 -104 93 40 -39 117 -35 -41 59 -97 11
5025 11 42 -91 -25 14 -134 45 1 -58 34 -40 -26 100 -73 -4 95 -73 102 28 -32 -3 27 -103 28 -82 13
5050 13 49 -43 -8 81 -16 36 83 -10 65 -21 -12 79 -69 -34 52 -66 22 3 -90 17 0 -75 60 -22 -60 27 -19 -41 29
5079 29 -14 20 51 -67 51 28 -73 64 9 -36 71 -55 -11 70 -92 -15 103 -66 23 -19 -14 162 -35 -39 57 -69
5105 -69 -2 70 -10 11 71 -23 72 36 -36 13 -5 -65 50 -41 -5 38 -88 30 69 -49 -28 46 -62 55 -37 20 65
5132 65 -84 26 45 -17 57 40 -48 51 -51 -83 -12 -60 -14 81 -24 -9 89 -42 56 58 -63 21 27 -28 6 71 1 69
5160 69 -35 -24 54 -108 53 -21 -39 43 -36 -42 87 -16 -86 69 -19 -34 31 -47 32 43 -57 84 24 -76 63 -23
5186 -23 64 56 -40 48 -23 -30 48 -3 -12 30 -25 -35 59 -67 10 83 -36 52 33 -50 60 18 -81 45 18 -46 61 -23 -20 67
5216 67 -42 18 3 -37 60 25 -35 50 -17 -25 18 -72 16 69 -42 -32 -18 -51 41 19 5 40 -58 -1 94 -19 -53 44 -100
5245 -100 23 35 -29 15 -31 -75 50 6 -27 58 -86 -32 19 -33 44 53 -6 85 -3 23 23 -75 -43 80 -32 -29 -23 -6 26
5274 26 -37 -63 64 30 -15 124 -53 13 22 -53 -63 -18 -24 61 35 1 28 -34 -22 68 -18 26 40 -46 41 12 -46 3 -9 -90
5304 -90 45 39 -43 71 -62 60 22 -98 24 16 -96 25 15 -32 29 -58 -11 45 -88 19 54 2 49 -64 8 93
5330 93 -14 -11 32 -52 3 44 -23 -18 50 -73 12 20 -18 50 27 -73 34 -15 1 71 16 24 34 -28 10 -21 -5 73 -19 -46
5360 -46 73 -47 -4 19 -76 35 -34 -73 48 -21 -26 22 -35 -43 60 -42 3 24 -31 10 -22 -68 61 -17 -63 39 -16
5387 -16 -73 54 -71 -18 102 -61 59 -28 -95 45 -52 -36 114 -76 -23 39 -59 -52 63 -33 29 -53 -42 9 36 -37
5413 -37 29 -16 -13 113 -33 20 73 -90 47 50 -36 43 -16 -13 43 -4 -52 36 -97 -31 81 -95 51 -8 -67 100 13
5440 13 -39 52 -20 -8 46 -2 33 28 -57 -16 34 -21 -19 38 -4 24 7 0 23 -38 71 76 -71 24 -38 -16 34 -10 -28 65 -13
5471 -13 25 0 -27 14 24 -34 44 38 -8 47 -31 -61 79 -51 38 32 -35 0 46 -35 42 -2 -10 80 -51 -56 -13 20 7 41 4
5502 4 -11 12 -45 23 41 -72 24 -58 4 55 -78 47 48 -47 60 17 -41 43 -23 -14 6 -87 32 19 -27 4 28 -14 34
5531 34 -11 -24 70 11 -34 25 -50 23 6 -48 15 -12 -45 62 42 -35 24 -45 -38 42 -22 -26 39 -31 21 -5 -31 27 -9 -56 35
5562 35 -54 -76 49 -51 -26 33 -53 18 -10 -60 46 -57 -43 52 -44 -3 62 -24 39 31 -14 -18 -4 -89 17 3 -21 22 -61
5591 -61 -27 -9 15 35 109 -13 -9 60 -33 57 -46 -86 50 13 46 5 -34 14 59 -39 64 1 0 84 -21 -68 33 22
5619 22 -7 39 -42 57 -34 -90 15 -1 -71 84 -14 43 22 -25 24 43 8 -19 -10 -11 37 -5 -80 49 -63 -12 16 47 15
5648 15 55 -11 33 31 -39 5 24 -25 12 -77 -27 34 -56 1 49 2 -3 70 -31 70 11 -12 100 -30 -34 55 -82 -29 23
5677 23 -93 -1 -10 -23 24 80 -80 76 -25 -37 34 -34 49 -13 -81 25 35 -74 32 -1 -53 126 -40 5 39 -37
5703 -37 -25 9 -4 13 55 -37 37 24 -1 37 -10 9 64 8 20 50 3 110 20 -62 56 -16 -18 86 -53 18 -6 -12 32
5732 32 65 -52 31 46 10 92 -38 -22 -34 -61 -6 25 -40 9 81 -16 16 22 -35 85 10 31 16 -15 -3 15 -10 83 17
5761 17 -16 32 -40 -72 32 -38 -26 67 -35 -16 4 -38 22 18 -26 36 -4 -11 90 -23 -34 28 -67 4 9 -26 31 25 -63 61
5791 61 -45 -23 79 -60 -8 57 -31 10 19 -42 11 21 -32 37 39 -49 33 -84 -17 -12 -15 -28 -10 -25 52 25 -7 97 -9
5820 -9 -17 31 -10 -14 53 4 43 28 -11 38 -4 -43 34 9 -23 -17 -49 12 58 -18 58 37 32 55 -6 -60 -4 52 -9 -16 2 -20 -39
5853 -39 -24 1 39 -45 94 12 -45 96 18 -104 56 -59 -63 24 -10 -12 -17 -5 21 24 -35 25 18 21 9 -50 -5 37 -18 77 19
5884 19 -20 5 7 22 51 -14 23 7 -43 -17 30 -20 9 -30 -39 -10 19 -37 22 -2 -14 34 -9 43 -15 -60 54 11 -23 25 29
5915 29 8 57 -46 50 -13 -31 -2 47 -48 18 8 -16 36 -2 43 79 -37 13 -18 -55 -35 24 -37 25 -20 18 63 -60 -31
5944 -31 48 -61 -51 2 -15 33 -1 -37 14 28 -19 -9 45 22 -3 -37 -12 48 -16 4 2 -29 5 -14 43 56 -98 -46 20 27
5974 27 -41 24 -14 31 -21 -28 64 -34 -45 19 -85 -16 76 -17 -1 6 -18 -32 -34 -32 31 -32 2 27 -24 -33 65 22 6 -17 -55 6
6006 6 18 -46 28 -36 -35 23 54 -41 -11 8 12 25 -20 39 15 -72 88 20 -25 50 -59 -46 12 -92 19 37 -109 56 18
6035 18 -34 22 -35 20 85 7 -72 37 -29 27 -2 -18 -12 -13 -15 70 19 -13 -3 -63 -35 18 -13 4 -20 -27 33 38 -10 54 25 -13
6067 -13 -5 8 51 57 -19 25 5 -80 -39 -15 -49 13 21 -20 29 -40 -25 32 -118 55 -6 15 89 15 -19 56 14 22 30 -1 37 -24
6099 -24 -42 15 29 -40 55 4 39 -7 -44 -24 64 -17 47 48 -39 10 -30 -82 48 -3 -52 8 -39 -29 7 0 -13 -30 -59 72
6129 72 38 -28 13 37 28 40 -53 -26 48 -46 -3 23 1 63 21 -4 107 -18 -88 34 -41 -8 11 -35 64 5 -64 -12 31
6158 31 10 38 -50 -19 49 1 -4 57 37 12 3 -13 22 30 13 38 -75 49 47 -8 27 90 -11 27 17 -82 -20 18 -26 40 -45
6189 -45 27 5 -19 53 40 3 -2 -20 33 94 -25 31 53 -83 -5 -14 31 -24 3 -10 17 -7 -80 49 38 -63 49 -45 -20
6218 -20 -7 4 25 -18 14 38 34 42 23 10 -18 6 20 -51 88 -26 46 19 -52 -14 22 -18 53 -42 -27 43 -16 -11 43 11 16
6249 16 11 -14 6 31 -24 -4 -65 -19 40 -29 20 0 -43 46 27 2 71 -20 -33 28 3 26 29 -2 -10 7 -46 -15 -25 -52 33 -38
6281 -38 -59 42 -27 -43 48 -11 26 -18 -44 28 -5 -19 11 -40 20 21 -55 -65 34 -24 1 41 -58 -16 65 -42 89 -9 -5 47
6311 47 18 -29 16 60 23 -24 -31 6 29 -6 12 -10 -33 -23 -25 -70 -14 -2 14 -3 45 37 3 -4 13 29 1 -10 -48 -10 13 -46
6343 -46 -41 53 -63 89 -49 -5 33 -23 -8 0 -82 63 3 -32 27 81 -16 -6 -14 -39 62 -4 10 29 4 18 32 -35 -22
6372 -22 -13 -67 -5 -16 -74 22 42 52 49 -29 -4 9 -18 3 18 -53 19 5 -45 2 -39 13 87 -59 -32 -3 -7 43 75 -16 12
6403 12 3 -35 53 23 -35 -11 -106 82 16 -5 -25 -28 -5 39 -39 -19 11 -73 -30 -4 12 -7 35 -41 -12 -16 -11 20 27 41 43 39 -40
6436 -40 49 -32 46 27 -59 0 18 4 31 -21 -2 33 -27 43 18 19 6 1 -42 45 -24 11 -40 3 -59 30 -2 -6 23 -39 1 6
6468 6 8 11 50 33 64 -5 -36 45 -46 -43 -3 -51 -5 14 -26 63 4 19 24 -88 -1 64 -30 -36 47 -20 35 9 -14 30 6 37 2
6501 2 -34 -8 -9 -13 -16 70 -38 35 46 31 24 -4 -4 34 -8 -20 40 -48 -10 44 -80 -24 -6 -9 27 -36 -29 4 -36 -9 21 -44 -28
6534 -28 4 -36 14 -36 -40 76 -40 -18 48 -59 -17 52 -77 2 -9 -64 10 -45 -98 18 -22 7 -7 0 7 8 17 17 15 -22 23
6565 23 6 31 41 -44 -16 20 -7 15 28 1 31 2 17 -22 -33 5 -34 18 -31 -16 -47 9 -12 -36 13 -9 -23 16 27 -24
6595 -24 22 4 38 24 32 59 -12 -41 65 12 -30 49 40 10 40 -56 61 7 -19 10 5 -53 9 -19 -31 -23 -44 19 48 10 -17
6626 -17 33 -45 42 20 -28 67 2 -28 9 21 38 3 -20 4 -19 -57 23 50 -59 66 -25 14 -34 10 -70 49 -2 14 8
6655 8 -21 -1 -54 0 2 -1 -25 36 -10 -16 46 -32 -31 30 -88 -40 -10 -71 56 -21 -13 0 -12 -13 47 -11 68 57 -10 43 19 -19 29
6688 29 -23 -47 53 -2 -28 31 -19 32 14 -55 19 2 -37 38 23 -20 23 -10 23 -2 -33 22 -33 -35 9 17 -10 34 -17 -57 -4
6719 -4 -74 27 24 -16 30 39 -28 70 -4 27 71 -11 -47 63 50 50 54 1 1 24 48 32 44 -22 34 -2 -78 -7 11 -16 -56 -60 -20
6752 -20 -22 -77 -16 6 -99 62 -1 -39 23 -38 -45 -3 12 30 33 -26 49 6 25 10 2 30 -9 -25 -9 72 -27 6 54 -62 31
6783 31 8 -47 0 18 -24 37 26 -7 12 -50 26 12 -34 -16 7 -59 35 35 -10 -42 -90 46 18 -29 60 7 12 9 21 -11 -1
6814 -1 -52 -39 14 -6 33 29 -15 -24 48 -70 54 -4 15 28 -35 30 -3 3 13 42 -49 -7 0 -42 75 20 -49 37 0 16 54
6845 54 -2 -28 -6 14 30 -9 -13 -3 -4 3 20 -14 -29 57 -43 39 46 -2 64 19 -40 40 1 -58 -27 -60 -27 1 -73 63 13
6876 13 -28 48 -34 10 64 -50 -72 28 -44 -13 32 -35 29 55 -13 -23 -17 -41 -4 -10 -41 7 -40 3 48 -28 10 -4 28 -9
6906 -9 -12 -61 -8 -105 -12 19 18 37 -19 -42 -13 -1 20 26 48 -47 1 -39 -5 -11 2 20 18 -16 15 -44 -13 24 -14 29 -16 -21 -4 46
6940 46 9 -16 73 -26 20 -25 -1 22 -59 -14 34 -17 -12 8 -33 -50 29 -67 39 19 13 44 -39 -34 40 -44 34 13 -17 15 5
6971 5 -76 4 -11 -64 15 21 -62 33 -31 -3 5 -53 59 6 -20 12 -16 7 42 -15 20 -44 5 23 18 -18 -18 79 31 13 -21 -48
7003 -48 19 -22 33 59 -41 21 48 -51 23 20 -69 65 -58 9 43 -50 -17 -17 16 24 65 28 22 -12 -11 98 11 58 66 72 9 61
7035 61 23 -1 -17 7 8 23 2 28 -3 -47 -10 -49 -23 29 -2 36 3 -17 -5 10 -2 29 63 -82 27 27 -13 -3 -28 73
7065 73 -24 -96 -7 17 -1 8 -12 17 78 -24 24 38 18 -50 18 34 -20 36 -33 48 19 -20 -19 -47 -29 11 -6 30 -8 -71 20
7096 20 7 -28 93 33 -13 -22 -19 54 14 -54 25 20 -41 37 0 29 7 -9 27 26 2 44 -44 34 -3 -9 -10 32 13 7 36 -24 20
7129 20 -3 -53 -22 59 4 38 45 22 57 -21 7 -3 -74 -23 20 -16 35 38 -23 63 -44 -4 18 -2 16 17 4 12 55 31 27 15
7161 15 -28 20 61 -6 62 32 12 43 -27 -46 25 -44 -37 22 -45 39 -63 -43 -21 -63 9 25 -70 -37 29 -63 22 47 14 32
7191 32 2 -48 72 -39 44 62 -58 34 103 20 -15 40 -53 33 -34 6 79 -13 -14 76 -46 -26 -19 7 22 31 -14 80 8 10
7221 10 51 41 -12 -26 -8 54 -4 -6 25 11 -3 93 -53 -17 31 20 5 -15 -35 3 44 6 -20 23 18 18 23 -22 5 -39 -3 -34
7253 -34 -1 1 16 -15 -31 -21 -1 51 -85 -28 61 -31 7 91 -45 -21 -10 -69 22 4 -31 66 -28 -18 49 -3 -50 85 -31
7282 -31 -10 -3 -34 57 4 -33 12 -36 -42 0 23 -21 37 -52 -34 15 -40 22 0 -21 57 1 -21 68 5 23 -25 -8 7 6 44 18
7314 18 4 62 -8 -67 37 27 -30 54 -11 7 6 51 -43 -25 -27 -11 30 58 5 22 -24 40 11 -20 15 -4 -8 20 -53 -1 61
7345 61 -63 19 -46 -35 29 -8 -10 63 -1 -54 37 -34 11 40 -37 18 56 4 -2 25 -12 15 -47 -26 22 29 30 21 -62 -21 10 -4
7377 -4 28 -24 54 53 -21 -4 9 -66 13 24 -26 7 10 -14 16 16 -14 29 27 3 9 -57 14 -23 -36 70 25 -22 34 -12 10 48 -21
7410 -21 -45 59 21 20 62 -23 16 41 -43 -2 -22 -70 10 30 14 3 -6 42 5 -6 -24 -42 36 3 -20 6 67 39 -29 61 -60
7441 -60 34 -9 -91 29 64 4 17 -23 -3 16 -32 40 55 10 42 47 -12 52 15 -52 51 -9 2 36 60 -13 -15 -18 -43 8 -33
7472 -33 -2 9 0 32 -66 41 52 -55 -30 47 -22 29 -9 -9 48 -12 -4 14 -26 40 46 2 14 -31 -5 -17 3 10 42 -22 -34 -1
7504 -1 24 -27 88 -85 35 4 -44 7 35 -14 -16 -7 -36 54 -56 -1 34 -24 -32 51 1 42 13 -30 41 1 -2 59 -19 5 24
7535 24 -19 4 5 -52 50 -15 -15 -5 -63 -30 -32 -59 49 65 -46 11 29 -29 54 -25 -58 17 28 -26 14 -8 12 44 -17 54
7565 54 -8 -7 35 10 -35 44 45 -5 42 -12 -10 15 4 -21 9 -37 59 -3 -18 55 -35 41 9 -31 -40 -7 -57 32 5 -114 82
7596 82 9 -19 5 -13 -51 2 -26 -54 4 12 47 -20 20 62 25 -11 -13 -5 9 27 39 29 38 -10 46 7 -77 -3 15 -37 94 -63
7628 -63 -20 -1 -30 4 -23 -56 -9 -3 -25 59 -54 -34 59 -81 -22 34 2 -54 -12 18 21 -5 -62 46 45 26 22 -19 4 42 -52
7659 -52 -9 20 -36 -16 15 13 31 -41 -16 -35 -32 2 -17 -87 15 45 -41 67 7 27 39 24 -1 19 -12 8 -20 -58 45 2
7689 2 -4 1 -17 3 23 0 19 39 -57 -35 47 8 24 69 38 -21 34 -7 62 -16 26 36 -6 44 46 -14 33 14 -50 45 -5 -20
7721 -20 8 -3 56 45 -44 -39 23 38 68 28 -3 1 -35 -20 32 9 -17 36 -40 -7 10 31 21 0 -16 23 -11 25 37 -7 -4 30
7753 30 -25 -38 88 -12 57 52 14 30 -10 -60 3 -40 -7 -25 -1 -10 8 0 43 14 5 -10 -10 4 19 6 7 -23 11 -17 -8 -47 -5
7786 -5 -6 -35 53 -40 16 33 -33 -36 -7 22 44 2 -40 51 -56 -21 -3 -63 -61 -11 14 -7 -16 -30 6 -22 -67 16 26 -45 -15 12
7818 12 12 -4 5 27 9 -24 30 17 19 -18 30 -2 -38 12 -54 30 -30 11 -11 -31 38 17 -13 36 0 25 8 -19 -36 41 -32 16
7850 16 46 -63 12 3 -24 13 37 -2 -5 21 -33 -32 -48 22 52 -3 32 33 -71 26 -33 -10 27 18 36 -30 11 23 54 -47 5
7881 5 -16 -6 24 -18 -2 41 -2 48 -2 -22 28 32 -44 33 -12 -31 58 -16 -31 -4 16 32 10 -14 -6 16 -53 24 3 23 -2 31
7913 31 39 -2 28 30 13 20 10 -39 -18 30 38 -8 -28 18 -6 23 -3 -11 -12 2 13 -41 -43 74 -70 4 -11 -17 -11 49 -39 12 43 -2
7947 -2 74 -52 25 -21 -38 33 10 -12 -30 -16 56 8 -25 -34 55 11 5 10 -1 41 10 -35 -8 55 29 -21 56 -1 51 -16 18 40
7979 40 13 -55 19 -93 30 20 -89 28 7 -77 8 -6 -1 -23 -20 26 -46 -32 31 50 56 76 43 -26 41 9 -23 8 -14 -63
8009 -63 -5 10 63 59 -9 10 -67 -40 0 -13 -17 3 -9 21 18 21 -12 32 -29 -18 32 -45 -65 6 -12 15 -28 7 -13 -31 14 -16
8041 -16 -42 39 -14 -36 16 5 13 6 -20 90 16 -6 -18 -1 3 23 -25 -14 -23 26 -10 -5 -58 22 -8 -41 26 -12 30 21 -4 22 -3
8074 -3 36 28 20 -42 31 50 7 60 52 -33 27 70 -1 2 11 -65 13 -16 -2 19 -76 14 58 -74 13 27 22 109 -65 -67 68 22 1
8107 1 31 -40 31 -20 2 57 -12 -3 2 43 29 18 -37 -20 46 -33 32 39 10 -21 -18 9 8 -4 -6 8 -10 50 27 -52 46 31 -12 83
8141 83 10 -20 -9 -40 -2 7 -50 17 5 2 -17 -3 -51 13 40 24 -19 -35 15 40 -29 62 37 -18 61 -15 -1 -8 -35 31 -22 14
8173 14 13 36 4 19 -39 -15 68 -51 -16 41 -39 23 16 24 14 63 -61 16
8191A6
##END NTUPLES=NMR FID
##END=
