##TITLE=1H_DE-80H_X3
 200.13MHz, d2o
 8 sc
 
 19ns.26.2.2025
##JCAMPDX= 6.0         $$ Bruker NMR JCAMP-DX V2.0
##DATA TYPE= NMR FID
##DATA CLASS= NTUPLES
##ORIGIN= UXNMR, Bruker Analytische Messtechnik GmbH
##OWNER= pz
$$ XWIN-NMR		Version 3.5
$$ Wed Jul 30 10:47:48 2025 Russian Standard Time (UT+4h)  Yarkov@DPX200
##.OBSERVE FREQUENCY= 200.1313
##.OBSERVE NUCLEUS= ^1H
##.DELAY= (6, 6)
##.ACQUISITION MODE= SIMULTANEOUS
##.ACQUISITION SCHEME= undefined
##.AVERAGES= 8
##.DIGITISER RES= 18
##SPECTROMETER/DATA SYSTEM= spect
##.PULSE SEQUENCE= zg30
##.SOLVENT NAME= MeOD
##.SHIFT REFERENCE= (INTERNAL, MeOD, 0, 14.3821)
##AUDIT TRAIL= $$ (NUMBER, WHEN, WHO, WHERE, WHAT)
$$ ##TITLE= Audit trail, XWIN-NMR		Version 3.5
$$ ##JCAMPDX= 5.01
$$ ##ORIGIN= Bruker BioSpin GmbH
$$ ##OWNER= Yarkov
$$ C:/Bruker/XWIN-NMR/data/yarkov2/nmr/H-C/1/audita.txt
$$ ##AUDIT TRAIL=  $$ (NUMBER, WHEN, WHO, WHERE, WHAT)
(   1,<2025-07-30 10:47:07.35 +0400>,<Yarkov>,<DPX200>,
      <created by zg, POWCHK disabled, PULCHK disabled
       configuration hash MD5:
       00 E9 B6 7A A2 85 ED C7 34 08 36 98 17 FE 4E 26
       data hash MD5: 16K
       B5 CE 02 FA D4 33 6D 14 F8 0B F9 1B 3F 89 BA 2B>)
$$ ##END=
$$ 
$$ hash MD5
$$ 63 12 5F 1E AC FE 37 9C 5D B5 F8 ED BD A0 92 23
##$RELAX= 
##$RELAX= 
##$RELAX= 
##$RELAX= 
##$RELAX= 
##$RELAX= 
$$ Bruker specific parameters
$$ --------------------------
##$DU= <C:/Bruker/XWIN-NMR>
##$EXPNO= 1
##$NAME= <H-C>
##$PROCNO= 1
##$TYPE= <nmr>
##$USER= <yarkov2>
##$AMP= (0..31)
100 100 100 100 100 100 100 100 100 100 100 100 100 100 100 100 100 100 
100 100 100 100 100 100 100 100 100 100 100 100 100 100 
##$AQSEQ= 0
##$AQ_mod= 1
##$AUNM= <au_zg>
##$AUTOPOS= <>
##$BF1= 200.13
##$BF2= 200.13
##$BF3= 200.13
##$BF4= 200.13
##$BF5= 200.13
##$BF6= 200.13
##$BF7= 200.13
##$BF8= 200.13
##$BYTORDA= 1
##$CFDGTYP= 0
##$CFRGTYP= 5
##$CHEMSTR= <none>
##$CNST= (0..31)
1 1 145 1 1 1 1 1 1 1 1 1 1 1 1 1 1 1 1 1 1 1 1 1 1 1 1 1 1 1 1 1 
##$CPDPRG= <>
##$CPDPRG1= <>
##$CPDPRG2= <>
##$CPDPRG3= <>
##$CPDPRG4= <mlev>
##$CPDPRG5= <mlev>
##$CPDPRG6= <mlev>
##$CPDPRG7= <mlev>
##$CPDPRG8= <mlev>
##$CPDPRGB= <>
##$CPDPRGT= <>
##$D= (0..31)
0 0.7 0 0 0 0 0 0 0 0 0 0.03 0 0 0 0 0 0 0 0 0 0 0 0 0 0 0 0 0 0 0 0 
##$DATE= 1753858026
##$DBL= (0..7)
120 120 120 120 120 120 120 120 
##$DBP= (0..7)
150 150 150 150 150 150 150 150 
##$DBP07= 0
##$DBPNAM0= <>
##$DBPNAM1= <>
##$DBPNAM2= <>
##$DBPNAM3= <>
##$DBPNAM4= <>
##$DBPNAM5= <>
##$DBPNAM6= <>
##$DBPNAM7= <>
##$DBPOAL= (0..7)
0.5 0.5 0.5 0.5 0.5 0.5 0.5 0.5 
##$DBPOFFS= (0..7)
0 0 0 0 0 0 0 0 
##$DE= 6
##$DECBNUC= <off>
##$DECIM= 32
##$DECNUC= <off>
##$DECSTAT= 4
##$DIGMOD= 1
##$DIGTYP= 9
##$DL= (0..7)
0 120 120 120 120 120 120 120 
##$DP= (0..7)
150 150 150 150 150 150 150 150 
##$DP07= 0
##$DPNAME0= <>
##$DPNAME1= <>
##$DPNAME2= <>
##$DPNAME3= <>
##$DPNAME4= <>
##$DPNAME5= <>
##$DPNAME6= <>
##$DPNAME7= <>
##$DPOAL= (0..7)
0.5 0.5 0.5 0.5 0.5 0.5 0.5 0.5 
##$DPOFFS= (0..7)
0 0 0 0 0 0 0 0 
##$DQDMODE= 0
##$DR= 18
##$DS= 0
$$ [...]
##$SUBNAM2= <"">
##$SUBNAM3= <"">
##$SUBNAM4= <"">
##$SUBNAM5= <"">
##$SUBNAM6= <"">
##$SUBNAM7= <"">
##$SUBNAM8= <"">
##$SUBNAM9= <"">
##$SW= 18.0517328524113
##$SWIBOX= (0..15)
0 0 2 0 0 0 0 0 0 0 0 0 0 0 0 0 
##$SW_h= 3612.71676300578
##$TD= 16384
##$TD0= 1
##$TE= 0
##$TE2= 300
##$TE3= 300
##$TEG= 300
##$TL= (0..7)
0 120 120 120 120 120 120 120 
##$TP= (0..7)
150 150 150 150 150 150 150 150 
##$TP07= 0
##$TPNAME0= <>
##$TPNAME1= <>
##$TPNAME2= <>
##$TPNAME3= <>
##$TPNAME4= <>
##$TPNAME5= <>
##$TPNAME6= <>
##$TPNAME7= <>
##$TPOAL= (0..7)
0.5 0.5 0.5 0.5 0.5 0.5 0.5 0.5 
##$TPOFFS= (0..7)
0 0 0 0 0 0 0 0 
##$TUNHIN= 0
##$TUNHOUT= 0
##$TUNXOUT= 0
##$USERA1= <user>
##$USERA2= <user>
##$USERA3= <user>
##$USERA4= <user>
##$USERA5= <user>
##$V9= 5
##$VALIST= <valist>
##$VCLIST= <CCCCCCCCCCCCCCC>
##$VD= 0
##$VDLIST= <DDDDDDDDDDDDDDD>
##$VPLIST= <PPPPPPPPPPPPPPP>
##$VTLIST= <TTTTTTTTTTTTTTT>
##$WBST= 1024
##$WBSW= 4
##$XGAIN= (0..3)
0 0 0 0 
##$XL= 0
##$YL= 0
##$YMAX_a= 128457
##$YMIN_a= -121018
##$ZGOPTNS= <>
##$ZL1= 120
##$ZL2= 120
##$ZL3= 120
##$ZL4= 120
##$ABSF1= 10
##$ABSF2= 0
##$ABSG= 5
##$ABSL= 3
##$ALPHA= 0
##$AQORDER= 0
##$ASSFAC= 0
##$ASSFACI= 0
##$ASSFACX= 0
##$ASSWID= 0
##$AUNMP= <proc_1d>
##$AZFE= 0.1
##$AZFW= 0.1
##$BCFW= 1
##$BC_mod= 2
##$BYTORDP= 1
##$COROFFS= 0
##$CY= 83.5205535888672
##$DATMOD= 1
##$DC= 2
##$DFILT= <>
##$DTYPP= 0
##$F1P= 10.8118882576601
##$F2P= -7.23987719738617
##$FCOR= 0.5
##$FTSIZE= 0
##$FT_mod= 4
##$GAMMA= 1
##$GB= 0.15
##$INTBC= 1
##$INTSCL= 1
##$ISEN= 128
##$LB= 0.25
##$LEV0= 0
##$LPBIN= 0
##$MAXI= 10000
##$MC2= 0
##$MEAN= 0
##$ME_mod= 0
##$MI= 1.114404
##$NCOEF= 0
##$NC_proc= 0
##$NLEV= 6
##$NOISF1= 3.799351
##$NOISF2= 2.8
##$NSP= 1
##$NTH_PI= 0
##$NZP= 0
##$OFFSET= 14.38212
##$PC= 1
##$PHC0= -1348.879
##$PHC1= -1.809091
##$PH_mod= 1
##$PKNL= yes
##$PPARMOD= 0
##$PSCAL= 0
##$PSIGN= 0
##$REVERSE= no
##$SF= 200.129724274929
##$SI= 16384
##$SIGF1= 3
##$SIGF2= 2
##$SINO= 400
##$SIOLD= 16384
##$SREGLST= <1H.CDCl3>
##$SSB= 0
##$STSI= 0
##$STSR= 0
##$SW_p= 3205.1282051282
##$SYMM= 0
##$S_DEV= 0
##$TDeff= 0
##$TDoff= 0
##$TI= <>
##$TILT= no
##$TM1= 0
##$TM2= 0
##$TOPLEV= 0
##$USERP1= <user>
##$USERP2= <user>
##$USERP3= <user>
##$USERP4= <user>
##$USERP5= <user>
##$WDW= 1
##$XDIM= 8192
##$YMAX_p= 0
##$YMIN_p= 0
$$ End of Bruker specific parameters
$$ ---------------------------------
##NTUPLES= NMR FID
##VAR_NAME=  TIME,          FID/REAL,        FID/IMAG
##SYMBOL=    X,             R,               I
##VAR_TYPE=  INDEPENDENT,   DEPENDENT,       DEPENDENT
##VAR_FORM=  AFFN,          ASDF,            ASDF
##VAR_DIM=   8192,          8192,            8192
##UNITS=     SECONDS,       ARBITRARY UNITS, ARBITRARY UNITS
##FACTOR=    0.0002768,     1,               1
##FIRST=     0,             0,               0
##LAST=      2.2672688,     0,               0
##MIN=       0,             -121018,         0
##MAX=       2.2672688,     128457,          0
$$ Real data points
##PAGE= N=1
##DATA TABLE= (X++(R..R)), XYDATA
0 0 0 0 0 0 0 0 0 0 0 0 0 0 0 0 0 0 0 0 0 0 0 0 0 0 0 0 0 0 0 0 0 0 0 -1 2 -4 5 -5 6 -6 6 -7 9 -12 12 -13 14 -16 18 -19 21
51 21 -25 27 -28 31 -32 36 -38 40 -43 43 -42 38 -29 10 35 -135 384 -1208 8025 28275 -77117 -121018 -94277
74 -94277 -91375 -57928 -61863 -39413 37832 38954 39090 60735 43777 70464 39249 -51311 -21283
87 -21283 -6106 -65996 -61318 -51077 -33268 -1675 -25849 3551 56886 29526 28684 26405 6261
100 6261 42901 11679 -45118 -1151 4922 -25284 -15211 -14497 15899 23245 -21543 12075 39850
113 39850 7727 17612 4631 -6318 31744 -451 -24124 16603 3518 -12007 -11635 -21898 10937
126 10937 -2130 -44661 -5807 2111 -17779 5441 -5882 4237 36155 1546 4927 36218
138 36218 15502 10048 -6371 -19704 13808 -12939 -42320 -4063 -9677 -17145 2059 -9647 14716
151 14716 28489 -8299 8072 21828 2589 7261 -15877 -19236 11393 -20801 -28881 6878 -5236
164 -5236 -3962 2239 -7431 24380 18596 -13126 10107 8308 -4214 4415 -19420 -7678 14667
177 14667 -20193 -11635 14799 2764 10781 1868 -2781 30173 9104 -10805 15005 3573 -564
190 -564 2608 -18568 5474 12273 -22498 -6136 4990 -3619 5811 -13707 -7372 21354 -7991
203 -7991 -12576 11328 -142 4181 -1877 -15750 14831 7677 -18335 1058 424 -351 5898 -16874
217 -16874 1309 20852 -10410 -4873 10557 3088 10687 -6698 -11404 18756 -139 -15528 2087
230 2087 -3783 3522 1943 -19792 7490 16216 -11872 -2037 2789 2060 9589 -15169 -8802 16700
244 16700 -7169 -10966 1791 -4290 9213 -1387 -17154 12834 9721 -10145 982 -1820 5968
257 5968 9549 -16213 989 18482 -4957 -825 3447 1207 15874 -3759 -11393 15162 3479
270 3479 -6630 318 -5777 9037 5242 -17290 5429 12393 -6042 658 -3258 570 11673 -12492
284 -12492 -9697 10633 -4209 -5200 -3254 -7080 11818 148 -15480 8937 6348 -5286 250
297 250 -8313 2558 7195 -17190 -5485 7235 -6043 -1110 -5373 -4185 14570 -3154 -9445 11811
311 11811 3275 255 2122 -7057 9085 6242 -13775 2799 6229 -2813 3397 -5896 1374 14824
325 14824 -6282 -3390 11221 803 3475 -153 -5511 12229 1503 -11075 6061 2563 -452
338 -452 3028 -8125 4895 10422 -9985 -1156 5422 -3545 1495 -7675 -7133 8571 -7425 -11060
352 -11060 3902 -2688 266 -382 -9267 7876 5289 -10686 2100 1974 -2440 2294 -9286 -1328
366 -1328 9752 -8063 -3606 6413 -575 5575 -588 -5266 11584 1449 -8083 4197 -744 661
380 661 2193 -8841 5564 10022 -6240 2964 6814 2031 7390 -4010 -2865 9846 -5085 -7717
394 -7717 1434 -4070 1885 -1317 -9198 8613 6309 -6355 3685 2560 1693 3430 -9903 -1728
408 -1728 6112 -9336 -5311 219 -2710 5853 -2274 -5313 12018 3781 -4221 3130 -995 2290 -1076
423 -1076 -13084 767 3372 -9790 -1650 -477 417 8666 -3147 -914 12225 885 -1949 1566
437 1566 -1864 5519 -2885 -11167 5827 2997 -5964 1979 -1022 2816 6573 -6726 31 7422 -3537
452 -3537 -2186 -3107 -2538 7361 -4709 -7879 8650 2029 -2370 3105 -1068 5311 3262 -8378 1889
467 1889 4136 -3609 -299 -5304 -753 8134 -6314 -4442 7859 -667 -1629 -199 -2332 6530 -375
482 -375 -7584 4167 2087 -107 3245 -4508 3047 7842 -6553 -1004 5964 -2082 -1452 -4722 -3519
497 -3519 5715 -4776 -6969 3206 -2456 -254 1894 -5104 4843 4936 -6613 1939 4986 966 2182
512 2182 -4777 370 7111 -5263 -2632 3587 -3710 125 -1009 -4897 5886 1754 -5225 2957 2143
527 2143 2993 3343 -4835 2970 4963 -6827 8 3137 -2892 1421 -2597 -2168 7124 -91 -1854 3270
543 3270 -1314 2232 114 -6889 3025 419 -9218 -393 709 -751 3013 -2921 1792 7652 -717
558 -717 2435 4220 -1620 2764 -2472 -6423 4264 -1722 -7655 -240 -1496 878 1878 -4035 3590
573 3590 3812 -4728 1925 1855 -1761 2604 -4709 -4074 5716 -1043 -2634 1558 -740 3448 357 -3815
589 -3815 5662 1483 -5762 1278 -353 -76 3225 -4313 -343 5424 -1072 1460 2197 158 4829 -2495
605 -2495 -3854 6643 18 -4498 1081 -1601 1641 2109 -4388 1987 2422 -3767 257 -1991 -1236 3013
621 3013 -6619 -4673 4848 -1459 -1960 1212 -952 3939 515 -3238 4535 668 -3299 67 -3778
636 -3778 300 3371 -6211 -1547 4855 -708 1083 1378 1488 5579 -1835 -2536 4933 -742 -1903 -67
652 -67 -4700 1699 2736 -4792 1240 3469 -561 1288 -1276 1582 4452 -5032 -2783 3058 -2830 -675
668 -675 -339 -3635 3380 1321 -3266 3168 2003 356 947 -3623 1904 3150 -6115 -1349 1718 -2726
684 -2726 1051 -654 -1317 4759 -366 -1809 3285 316 1320 -56 -4718 2543 1502 -5481 694
699 694 995 -1743 1549 -1754 458 4352 -2239 -681 1936 -1329 2039 -1027 -3814 3725 110 -3842
715 -3842 2381 688 349 1779 -2507 2083 3012 -3242 391 330 -2074 2000 -2351 -2435 3911 -1554 -2428
732 -2428 2227 -384 1490 551 -2973 3251 1351 -3107 1701 -354 -868 2096 -3248 -538 3788 -2481
748 -2481 -876 1371 -773 2420 -873 -2295 4069 -105 -2111 2177 -878 776 1577 -3579 1360
763 1360 2445 -2851 166 -206 -1100 2108 -2713 -1645 3409 -1828 -1464 1125 -1679 1723 145 -3537
779 -3537 2560 1187 -2207 1400 -514 693 2626 -3033 544 3214 -2004 215 570 -1123 2703
794 2703 -1113 -2398 3402 -87 -1270 1380 -1095 1797 1430 -3420 1775 2017 -2185 620 -1027 -776
810 -776 2481 -2988 -1952 2595 -1709 -849 90 -1806 2426 -129 -3211 2475 740 -1422 1311 -1488
826 -1488 978 2596 -3000 314 2678 -1192 926 -275 -705 3409 -1222 -2138 2823 -364 -608 547
842 547 -2204 1846 1156 -3401 1168 1165 -1210 1021 -1692 -277 2912 -2780 -1421 2003 -1545 122
858 122 -638 -2454 2622 -175 -2860 2160 414 -237 1492 -1834 1421 2694 -2530 626 1766 -780
874 -780 1663 -840 -883 3494 -904 -1547 2069 -599 613 236 -2655 1798 725 -3095 968 143 -783
891 -783 1402 -2180 -363 2662 -2046 -892 863 -1523 884 -931 -2428 2385 -343 -2138 1765
906 1765 -401 423 1608 -2172 1407 2198 -2024 739 496 -601 2022 -1308 -807 3308 -855 -604
922 -604 1992 -931 1287 525 -2562 1464 173 -2573 428 -1141 -606 1408 -2567 81 2641 -1532
938 -1532 172 964 -1119 1489 -802 -2153 1686 -1070 -1712 991 -1261 848 1419 -2285 1554 2308
954 2308 -1250 1187 356 -416 1774 -1688 -616 2345 -1538 -426 1088 -1323 1855 482 -2271 1907
970 1907 449 -1631 720 -1040 -179 823 -2885 175 1787 -1888 274 198 -1102 2056 -590 -1543
986 -1543 2111 -550 -721 713 -1297 1513 807 -2720 1496 1086 -1545 1255 -383 -618 1880 -1590
1002 -1590 -418 2051 -807 358 217 -1126 2414 183 -2294 1755 88 -1320 657 -1349 91
1017 91 799 -2568 118 1064 -1049 1215 -653 -1039 2836 -627 -1307 2024 -638 -669 144 -1441 1454
1034 1454 494 -2332 1242 424 -479 1995 -1019 -76 2401 -1389 -647 1581 -626 272 -762 -1479 2029
1051 2029 -427 -1526 1631 -725 -256 1706 -1468 596 1563 -1988 -218 418 -451 963 -1592 -1137
1067 -1137 2033 -1335 -696 1928 -953 375 911 -1364 1538 1077 -1406 607 -647 -135 1276 -1974
1083 -1974 -137 1583 -2151 -135 1343 -907 926 -18 -1116 1783 47 -535 1051 -1082 309
1098 309 882 -2056 824 1235 -2219 151 401 -454 1224 -860 -592 1610 -919 336 1119 -1270 985
1115 985 163 -2077 1501 667 -1547 606 -574 98 1109 -1350 400 1104 -1660 601 543 -1213 1336
1132 1336 -607 -1635 1471 -167 -710 819 -893 622 603 -1582 1538 787 -1524 897 -270 -546
1148 -546 1517 -1056 -782 1100 -935 6 297 -941 1227 -195 -1503 1885 470 -857 1265 -636
1164 -636 20 1232 -1260 345 812 -1311 492 -243 -730 1717 -931 -1279 1710 -409 -337 958 -932
1181 -932 572 469 -1426 1099 284 -899 781 -956 -204 1646 -1305 -524 1265 -886 176 220 -774
1198 -774 1261 -365 -1432 1326 -286 -490 889 -1131 313 1235 -1280 317 925 -735 627 -492
1214 -492 -412 1656 -942 -767 1279 -678 96 469 -1255 870 477 -1316 894 95 -466 956 -1021
1231 -1021 153 1482 -1247 -102 892 -1029 460 -56 -1067 1319 -366 -893 942 -406 285 792
1247 792 -1336 609 965 -1169 470 424 -657 844 -615 -589 1357 -764 -424 759 -822 597 334
1264 334 -1344 925 289 -1259 708 -170 -199 908 -1114 135 1101 -943 233 602 -812 846 -247
1281 -247 -1017 1195 -325 -718 595 -641 236 672 -1242 840 823 -977 787 169 -545 1167 -637
1298 -637 -572 1045 -670 -230 413 -844 701 148 -1108 1094 42 -941 771 -518 -244 862 -1113
1315 -1113 139 805 -913 349 122 -651 1163 -245 -771 1187 -434 -359 649 -752 462 526 -1062
1332 -1062 704 442 -744 777 -153 -132 1097 -811 -82 1130 -655 151 269 -826 787 -45 -1074
1349 -1074 940 -345 -617 506 -880 -33 673 -1242 212 631 -871 642 20 -365 927 -349
1365 -349 -472 1082 -507 -94 520 -786 535 340 -961 767 208 -556 763 -313 51 1193 -785
1382 -785 25 751 -743 313 42 -821 661 -115 -824 762 -487 -371 511 -885 305 535 -1158
1399 -1158 282 197 -771 421 -425 -382 961 -602 -243 828 -422 420 448 -629 843 271 -745 727
1417 727 -26 -480 585 -718 -82 759 -793 30 558 -585 631 -12 -622 1026 -129 -422 652
1434 652 -387 13 314 -1016 291 307 -985 264 -45 -470 628 -404 -277 909 -470 -100 595
1451 595 -423 478 111 -744 652 142 -607 620 -208 -144 643 -561 -31 642 -515 284 197 -691 611
1470 611 -280 -574 832 -392 -551 576 -485 55 489 -645 291 342 -586 532 -238 -346 738 -683
1488 -683 -256 844 -579 63 428 -483 507 225 -460 701 -45 -249 678 -506 154 663 -863 -18
1506 -18 532 -596 218 80 -368 548 -306 -283 664 -387 -221 482 -616 352 491 -777 404 132 -498
1525 -498 423 -280 -149 446 -688 -53 552 -626 308 317 -641 512 152 -444 553 -107 -297 320 -451 295
1545 295 585 -812 308 241 -679 423 -11 -547 581 -268 -270 562 -396 115 140 -666 528 262 -712 535
1565 535 75 -483 469 -174 34 558 -458 109 339 -549 480 -24 -729 696 -202 -467 689 -44 -229
1584 -229 208 -468 359 290 -490 238 -56 -522 538 -283 -407 596 -405 -351 432 -224 226 46 -523 582
1604 582 45 -433 640 -233 -397 528 -393 56 656 -468 53 191 -290 497 -150 -357 610 -366 -392 554
1624 554 -313 -25 283 -568 233 319 -372 214 -160 -233 577 -450 -241 667 -544 -97 342 -309 218 -45
1644 -45 -468 322 -76 -262 507 -432 -42 523 -523 192 595 -431 137 142 -272 455 -268 -259 298 -427 -123
1665 -123 440 -533 34 233 -639 378 304 -372 231 -154 -255 386 -311 142 365 -628 116 258 -468 336
1685 336 94 -499 364 79 -113 433 -234 -21 335 -490 198 484 -393 261 113 -350 418 -82 -207 408
1705 408 -279 105 120 -497 288 72 -642 347 43 -452 391 -295 -165 369 -337 57 325 -492 253 39
1725 39 -389 487 -48 -475 377 -153 -269 368 -342 6 122 -423 231 218 -426 532 -232 -173 639 -232 -208
1746 -208 369 -315 -32 157 -263 183 27 -410 536 -89 -205 414 -428 -55 278 -522 26 338 -307 316
1766 316 70 -215 476 -94 -220 411 -261 -105 241 -427 3 129 -471 212 -15 -291 468 -129 -72 350
1786 350 -210 -32 406 -384 79 109 -333 338 -41 -203 398 -228 -58 381 -326 69 259 -372 121 138 -248
1807 -248 416 -87 -218 376 -157 -55 369 -197 222 249 -406 200 146 -402 225 -170 -211 255 -369 -122 442
1828 442 -279 28 280 -282 308 50 -409 262 -67 -257 312 -196 -79 420 -393 85 345 -450 228 -64
1848 -64 -344 270 -192 -268 414 -279 -96 314 -268 170 169 -329 292 -65 -287 290 -119 -109 313 -395 -86 284
1870 284 -290 140 160 -274 352 -35 -188 372 -168 -128 234 -305 -22 294 -316 171 106 -319 347 -50 -288
1891 -288 171 -264 -216 307 -280 55 191 -249 337 122 -299 299 -25 -130 300 -158 -86 231 -293 52 130
1912 130 -239 91 35 -252 301 -7 -220 275 -104 -55 246 -282 94 243 -298 219 67 -174 232 -112 -176
1933 -176 355 -173 21 219 -360 76 121 -356 283 98 -126 298 -131 -188 158 -337 47 276 -368 58 78
1954 78 -322 185 -68 -217 350 -34 -37 259 -189 112 274 -438 157 97 -342 236 5 -225 276 -109 -126 306
1976 306 -300 14 157 -321 155 132 -356 247 -41 -273 337 -116 -107 210 -207 42 250 -341 288 51 -240
1997 -240 249 -145 -206 210 -92 -52 273 -254 -17 -9 -266 223 -31 -356 207 18 -207 260 -237 -171 196 -287
2019 -287 153 86 -214 143 3 -284 271 -194 -226 239 -288 11 234 -249 181 61 -252 282 73 -188 341
2040 341 -229 -220 339 -183 -122 206 -193 130 -15 -217 222 10 -174 281 -128 -211 309 -355 -47 124 -131
2061 -131 73 70 -213 148 -75 -181 373 -144 27 248 -322 17 165 -224 64 10 -194 287 -56 -85 208
2082 208 -205 -98 275 -256 82 297 -184 216 -12 -153 215 -26 -60 198 -266 -46 241 -265 119 266
2102 266 -165 246 108 -178 168 -81 -166 186 -133 87 120 -332 124 64 -239 165 120 -142 166 -14 -46 155
2124 155 -170 26 155 -220 211 156 -132 269 58 -323 267 -138 -48 214 -196 102 99 -251 97 63 -223 250
2146 250 4 -107 171 -169 -98 235 -145 90 112 -179 186 37 -235 236 -80 -274 259 -302 -105 271 -126
2167 -126 -31 63 -228 292 107 -220 370 -81 -116 229 -98 -125 132 -210 -47 37 -48 102 26 -139 171 -41
2189 -41 -27 272 -148 23 195 -123 -8 91 -138 102 -77 -137 226 -169 -73 184 -247 -8 263 -209 50 171
2211 171 -145 224 5 -154 240 -225 -20 235 -158 84 137 -233 99 130 -159 119 64 -228 189 -115 -23
2232 -23 90 -242 55 223 -236 98 47 -105 149 48 -120 109 -126 -1 74 -234 -26 152 -207 143 51
2253 51 -275 185 -50 -108 177 -41 -13 189 -246 53 167 -81 111 74 -256 199 -30 -167 152 -183 22
2274 22 151 -141 67 92 -203 145 -2 -193 235 -95 -58 86 -114 -40 58 -131 162 72 -137 223 28 -34
2296 -34 367 -63 -72 187 -186 -15 259 -261 169 42 -176 97 -65 -94 157 -115 -127 156 -213 89 159 -180
2318 -180 156 29 -80 111 14 -120 110 28 19 168 -200 142 60 -127 69 72 -173 224 -69 -118 221 -156 38
2341 38 145 -161 63 110 -80 93 -21 -78 199 103 -59 67 -110 -25 147 -207 25 -51 -217 117 -101 -111
2363 -111 238 -97 4 118 -176 36 196 -186 87 64 -138 155 -39 -64 63 -10 57 64 -152 89 141 -166
2385 -166 138 52 -173 64 -92 -116 209 -152 8 127 -205 12 172 -59 99 18 -227 162 -67 -187 68
2406 68 -111 -118 197 -119 65 130 -192 -16 -3 -14 98 -4 -93 20 -37 -42 159 -94 74 130 -225 55 32 -130
2430 -130 103 -24 -76 159 -72 27 99 -198 55 122 -89 163 43 -122 157 -61 -78 198 -13 -37 80 -76
2452 -76 58 9 -212 96 -11 -103 52 -25 -36 70 -82 29 102 -110 76 229 -134 65 9 35 60 -91 -25
2475 -25 65 -192 -59 124 -211 116 79 -74 113 12 -102 87 -32 -109 74 -68 64 66 -237 72 -45 -67
2497 -67 46 0 -4 127 -150 4 173 -124 16 -8 -90 161 1 -31 142 -112 -91 131 -148 10 59 -148 163
2520 163 56 -131 7 -75 -127 75 -53 -14 113 -81 -18 105 -149 135 -13 -244 31 55 -127 26 -96 -3
2542 -3 137 -88 13 92 -127 120 47 -80 141 -40 -51 68 -27 -10 108 -62 58 20 -100 91 2 -131 148
2565 148 -21 -34 137 -41 14 108 -171 -6 -29 -116 20 89 -37 172 13 -62 -22 -123 -64 67 -49 -59 78
2588 78 -199 2 -77 -92 179 74 51 183 -33 -8 146 -140 106 -19 -128 129 -51 77 90 -36 -114 105
2610 105 -73 -152 153 39 17 -3 -92 126 45 -27 22 -152 -126 98 -107 -161 82 -140 36 -13 -24 200 12 47
2634 47 132 -27 -23 149 -50 -56 142 -108 1 10 17 81 -36 -25 -7 -9 34 13 -65 27 24 -176 -74 57 -217 107 -101
2661 -101 -70 8 -51 33 63 -118 -30 193 -179 77 3 -42 70 89 -42 28 -185 70 173 -97 11 144 -126
2684 -126 160 68 -141 160 -73 -44 5 -100 -101 -2 -58 59 49 -159 75 3 -17 135 -85 -74 -29 -43 -19 68 -93
2709 -93 -75 13 -42 159 -4 -89 97 14 -32 155 -48 55 -71 -114 69 8 -51 83 14 -38 95 13 28 110 -217
2734 -217 -9 104 13 24 94 -134 -8 18 -49 23 -67 -15 -11 -43 62 77 -67 67 -15 -37 29 -16 -70 32 -39 -25
2760 -25 4 -55 83 69 -14 0 -52 -176 140 66 -2 114 -1 -26 -9 -20 77 -8 -94 -3 -18 -135 9 -28 -22 148 -124
2787 -124 -137 10 -26 -27 19 -94 49 67 2 93 -4 2 56 -150 -38 87 -73 101 -11 -59 101 20 -88 118 -57
2812 -57 0 99 -79 65 55 34 102 27 -41 16 -79 -114 49 -81 58 99 -33 77 -36 -126 49 -6 -107 50 97
2837 97 -22 103 14 4 47 -88 17 15 98 -61 30 18 119 -72 -124 124 -47 -10 -11 -170 -13 0 -73 103 9
2862 9 -175 153 -10 -61 125 17 131 8 -121 20 -24 -48 17 5 -86 175 -30 -24 -9 -42 24 -6 -82 -15 0 -60
2888 -60 75 113 -25 108 -28 -179 60 -71 62 91 -83 54 61 -63 -28 -68 -81 101 -93 -73 57 -23 -7 -5
2912 -5 -16 38 -75 -20 -25 -1 -51 91 -72 45 41 -8 109 31 -93 10 -22 -156 88 -33 -86 110 -66 94 69
2937 69 -26 -4 8 -110 -30 47 -64 61 14 5 -22 46 -80 167 -30 -123 4 -47 24 26 -29 3 -6 5 24 -73 -59 -51 -186
2966 -186 23 28 -153 -4 -38 -37 142 97 35 35 -81 18 9 -37 -23 1 -62 94 1 62 -57 -111 4 -50 45 -16 5 -16
2994 -16 75 -15 -127 26 44 -21 53 -44 -17 111 -122 -10 -25 18 45 0 -14 122 -99 6 178 -85 9 47 -9
3019 -9 46 -38 -141 -12 41 -21 14 22 -56 37 -55 42 49 -98 35 140 -96 93 -4 -28 89 -114 71 97 -56 -63 28
3046 28 -141 -43 -61 -15 38 -19 31 -2 -29 -14 96 -7 -69 27 -80 4 -61 -144 71 -28 -102 134 -43 -58 21 46 78
3073 78 45 -82 -29 -11 -35 -5 -62 -111 -68 -36 -77 118 -155 18 158 -35 -33 35 -27 74 -54 -44 26 -98 45 30
3099 30 -55 -64 81 -67 55 0 -17 95 -57 -18 116 -34 68 55 -135 92 77 -6 -44 -21 -110 12 64 -32 -47
3124 -47 71 136 -8 -83 -41 21 -33 -36 15 -114 79 -153 -6 105 16 21 168 64 43 32 -20 -7 69 73 27 -54 130
3151 130 69 -21 -91 21 -11 74 111 -19 15 -87 -3 5 -16 -44 126 -23 -39 85 -52 52 85 -28 71 -69 -57
3176 -57 -128 -104 93 -34 -38 3 9 -111 1 43 -117 -8 169 -9 74 -72 20 69 -57 79 45 34 -8 -39 50 88
3202 88 -3 -110 -34 -78 51 -46 -27 74 -115 -48 -66 -60 -78 48 14 50 17 -128 -22 100 22 76 -69 -25 -26 -108 -126
3229 -126 -27 -47 75 -21 -146 1 6 6 -91 14 57 -9 35 -64 86 24 -114 -7 -6 -42 69 74 -94 -67 32 44 -63
3256 -63 -52 150 -29 21 -10 -75 24 76 39 150 -52 -89 7 -6 -134 107 -41 -50 23 -55 -59 67 51 48 -24 4 -7 -50
3284 -50 -53 63 -106 -45 -9 76 -4 -76 -4 -143 -222 -21 115 -47 -73 -58 -3 38 48 -54 -1 -73 -83 0 -35 -93 -22
3311 -22 7 -8 -59 82 68 -16 21 2 80 32 114 -37 30 116 32 3 59 -17 64 -36 54 -95 12 52 -62 -65 -97 -174
3339 -174 -64 21 -25 -21 63 -78 9 -22 19 -79 120 -21 -4 93 -95 13 128 -121 41 83 3 39 80 52 -51
3364 -51 11 50 64 46 41 -48 55 -6 10 -22 97 22 115 -28 -91 -45 31 -72 -28 13 20 13 -67 -35 -11 -53 -42 0 58 11
3394 11 -41 79 100 -6 81 28 -28 -13 116 63 48 -26 18 41 66 -30 -55 9 -35 -17 -40 -26 38 15 -38 -26 25 -54 18
3423 18 -44 44 160 -16 -59 48 58 87 -65 10 25 6 -46 -24 59 79 96 -61 -25 5 -103 11 -56 -16 9 -70 2
3450 2 -15 26 100 64 -65 4 -5 -66 72 100 -53 105 -49 -56 10 -81 -34 93 -9 29 -72 61 48 94 -9 -97 -67
3477 -67 31 40 1 34 34 41 27 12 -7 -41 -61 131 30 48 182 -13 -13 106 149 -53 -52 17 -118 -12 5 9 22 -92 35
3506 35 -69 27 46 -44 14 9 83 100 -39 -89 71 77 66 2 -83 -61 42 48 96 43 15 34 106 -22 48 4 -3 133 100
3535 100 9 72 49 2 -10 51 -10 1 -90 -59 -37 79 43 -19 -67 28 49 -89 92 66 54 -14 -112 10 -44 -38 63 -5
3563 -5 22 -46 -41 25 149 -97 56 -57 31 -10 51 -42 23 -32 -24 2 3 -121 35 65 81 61 -61 -90 -18 103 -130 -29
3591 -29 -72 -26 -42 76 -98 -22 -3 38 38 -67 -38 36 -28 -61 33 41 -107 -1 -5 85 13 5 57 -5 0 -65 -12 13 -40 -99
3621 -99 -26 -116 -26 78 9 18 -52 2 19 -106 -88 24 31 123 70 -31 66 104 57 -38 -56 -16 89 -69 17 37 -42 -15
3649 -15 5 15 -53 -49 52 -59 -4 -49 -12 -67 -45 56 12 -6 67 -50 137 101 -34 84 -41 -83 -58 83 -33 25
3675 25 61 18 -39 39 -85 4 -118 23 -113 102 -8 -37 -12 94 157 -81 -33 3 -54 -56 -35 13 -55 51 10 -86
3701 -86 67 68 -48 29 -96 -129 64 -80 23 79 123 -137 -24 -2 20 -16 80 15 55 32 9 77 17 -53 -93 29
3727 29 23 33 126 -193 19 64 -50 -28 -79 -9 -73 -53 -41 21 160 -6 -87 -74 38 21 41 -87 -2 -7 -17 64 -10 -22
3755 -22 -36 29 32 18 -119 8 -107 7 -86 27 58 -66 -2 52 -84 45 70 -154 -70 -38 51 8 -101 93 67
3780 67 -39 27 118 -46 -80 67 77 62 -4 -122 -39 -108 18 80 -9 -40 12 -34 -85 95 -11 107 24 -14 -18 -47 57
3807 57 18 40 13 -30 -16 -93 -71 -5 -29 -37 -57 62 -4 -127 62 -16 -5 2 -52 57 7 -48 116 40 44 23 -49 -31 -62
3836 -62 44 -7 -69 46 50 66 74 31 81 72 77 3 3 -17 -10 8 57 -73 78 -100 34 80 76 -67 16 -56 -79 25 -59 92
3866 92 -10 -59 -9 119 -90 32 15 -28 -14 64 -30 -138 40 12 -64 67 -34 21 -10 65 14 -60 -103 -121 73 9
3892 9 23 74 -91 -46 3 -52 68 -8 6 3 13 67 -3 -76 109 -99 -54 -9 -30 23 -10 -2 -29 93 -38 -14 87 -7
3920 -7 -4 -2 15 -10 -85 -51 -47 68 58 -102 7 -84 -88 -122 1 36 23 28 -25 26 -40 -95 -3 -76 44 -25 -18 23 -65 56 22
3951 22 -1 155 -28 26 -33 -83 81 12 -32 10 55 111 -6 -54 2 -12 -48 -38 30 56 -15 -7 -57 80 51 -42 85 53
3979 53 108 -20 -71 -6 -199 -21 -43 -41 -39 -32 143 -80 0 47 -49 8 -40 -34 18 -9 9 54 -51 30 48 -4 53 -10 40
4008 40 130 7 45 46 -78 18 69 -43 -106 28 10 -63 51 -109 -52 -30 70 64 8 -13 50 27 35 -108 -98 67 -57
4035 -57 -17 -19 -2 -90 -31 -43 58 31 -20 -64 -7 89 27 -23 -98 20 -4 69 -66 39 21 -50 -5 30 -34 -65 69 139
4063 139 -15 -7 -56 -60 -15 -133 26 71 79 -22 72 71 -77 -51 95 198 114 58 137 -40 9 -30 24 18 -6 -31 127 59
4091 59 7 22 82 13 36 -21 55 167 -39 -69 -10 -35 -40 -101 9 -50 45 76 -22 -27 1 -46 -12 -123 29 48 35 -54 76
4120 76 -71 -190 -18 101 -65 -2 116 -38 -41 -79 -65 -30 -50 51 64 39 16 -51 16 87 140 -15 19 78 34 83
4146 83 -47 63 13 -47 37 68 -49 -101 33 -4 -32 -42 3 94 34 4 -94 -25 37 -166 6 -24 58 65 51 98 -5
4173 -5 89 76 -26 82 107 3 79 71 4 3 -225 -30 20 -17 -30 -3 -63 -12 134 -57 -136 -42 14 -178 54 -115 18
4200 18 -24 48 31 -73 -34 -33 -88 42 29 167 57 64 -36 -49 -39 16 36 -47 -41 -42 35 -13 -139 -114 -52 77 48 -70
4228 -70 4 24 -9 36 -30 40 -33 13 -57 -59 -75 -119 46 30 73 12 26 25 -34 -64 -61 -6 -45 -11 -12 73 -15 15 -29 106 87
4259 87 32 25 -44 144 57 -29 -75 -1 80 100 36 13 -39 27 -12 82 -79 24 -33 32 8 -162 64 -45 -25 -40 -8 -13
4287 -13 -14 -88 -34 -26 -152 -62 -108 -89 114 18 64 -114 -31 37 7 59 105 41 6 -102 -117 15 30 -3 -40 45 -54 63
4315 63 -6 11 -26 -67 -42 -18 45 -62 11 23 1 -5 72 -73 -51 69 97 -50 77 11 -44 18 36 23 31 74 29 -8 -35
4344 -35 -61 96 -16 60 127 -38 68 -56 -20 57 21 64 33 -69 -59 25 -22 -25 -51 7 -48 63 53 -110 -7 -43
4370 -43 79 -18 -73 17 -16 119 -117 -19 91 29 21 90 150 -133 -12 -51 2 12 -24 47 76 -85 -83 -33 84 13 49
4397 49 -9 21 -56 19 138 -6 -23 29 108 -1 108 -46 -43 -65 28 31 42 58 -55 57 50 15 6 6 111 17 -94 8
4425 8 56 166 33 11 -76 -113 40 26 21 90 -45 -9 8 -11 21 -5 14 -47 -87 99 -37 13 -17 -44 -75 -106 59 -109
4453 -109 31 -124 6 36 -104 -107 11 38 -67 112 13 50 -68 28 55 64 -69 -122 -58 -19 39 13 142 78 51 11
4479 11 -1 10 89 -70 -1 45 -10 -7 168 19 27 -48 -16 -13 -25 133 14 -36 32 12 -108 -80 38 58 -31 -152 58
4506 58 71 -28 83 -42 -18 11 -35 -47 -37 -35 -15 -50 -87 -1 -46 -75 56 70 -5 17 41 -84 82 7 -14 -13 -28 -89 52
4535 52 33 -70 69 -70 -83 -29 -50 -104 39 62 -38 12 -43 -83 -7 -37 -2 -2 4 86 -10 40 73 17 58 8 26 23 -117
4564 -117 21 -70 110 25 5 93 -30 -41 81 -88 -5 -30 81 -48 10 -164 -48 -58 6 -44 -12 -23 -204 -6
4588 -6 -5 82 -79 -7 -29 -23 16 -80 -2 61 -7 129 -16 20 -161 51 -51 22 61 59 4 19 13 -17 131 -113 -90 -31 -37
4617 -37 -45 93 -49 -13 -54 107 95 -16 -65 -5 -19 2 -32 -15 -15 28 22 141 45 42 51 8 70 85 74 48 13 -36 21 -29
4647 -29 44 31 -4 48 -66 60 -31 52 90 33 -39 -69 -33 27 -20 13 -87 -68 -171 13 30 19 18 -35 94 60 -60
4674 -60 -2 21 -119 34 -12 -64 76 -33 20 27 -93 -86 -23 31 44 -152 11 15 -58 79 -2 -11 59 -76 -2 22 17 -15
4702 -15 7 -11 -43 69 -158 36 -20 1 17 15 -95 -33 11 -30 -1 152 -101 -32 51 44 -37 -13 -51 108 71 81 43 71
4730 71 4 -14 -10 62 -58 -7 43 -3 13 54 1 49 25 29 -5 14 -4 37 -130 -13 -48 0 -66 35 -36 -38 112 -53 -86
4759 -86 -32 37 61 1 8 -71 -21 -14 -65 43 -34 53 -10 90 2 -35 -94 -45 -50 -185 -57 -42 -52 -89 -44 -110 53 -65 -110
4788 -110 -116 -75 -12 66 13 -16 35 -19 7 -36 -7 33 20 33 -99 31 23 -106 -81 29 26 -44 -42 -61 34 63 15 -5 -7 -14 121
4819 121 45 -86 -27 -92 -39 -7 11 -26 -46 7 42 -53 -5 -5 -89 -44 -86 26 -8 -96 -83 11 3 14 29 -9 20 -83 100
4848 100 31 0 35 -53 -16 122 39 -39 88 36 16 25 -1 -3 -3 -23 -102 20 -9 -60 -1 1 104 -118 -121 38 13 8 -16 -8
4878 -8 -123 -96 101 65 -54 -112 -56 -48 48 27 -89 -10 -39 23 -51 -85 -65 -4 20 -6 63 -25 -23 101 -6 -80 -55 21 85
4907 85 0 33 -17 -53 30 35 -31 8 -25 -50 121 -195 0 21 -100 -109 26 4 -132 -23 -17 60 11 -20 -63 -14 -14 -53 -24
4936 -24 42 21 -100 19 98 -8 13 78 -110 -57 -15 -62 -56 13 2 -50 66 16 -78 56 41 -30 34 50 -17 -26 -33 -23 104
4965 104 -50 -32 11 24 -12 -71 -26 -44 -21 41 -44 50 -21 50 31 -74 77 -11 21 59 33 7 21 8 58 -20 47 -21
4993 -21 -1 46 -11 -26 7 -10 -20 20 -80 2 30 9 -63 -39 -97 -5 14 -7 16 -85 75 -55 -46 43 72 -48 -24 -28 -6
5022 -6 63 8 57 -94 -41 -22 -11 50 24 116 36 9 -21 22 16 -85 11 5 -26 -35 -11 81 -47 -68 -21 -36 -131 10 -113 14
5052 14 81 -57 32 23 0 -37 19 -59 6 -27 48 96 50 -49 -1 16 10 96 -1 99 23 70 39 -71 -165 70 29 51 25
5081 25 110 96 -53 -53 -3 54 -27 107 91 -87 -45 -5 -39 50 -44 -36 -48 -26 -72 -61 30 -80 54 30 -67 -11 -34 -11 -7
5110 -7 5 92 116 -25 -22 -17 -29 102 20 -12 11 129 84 -18 49 76 52 9 16 -67 23 -20 -64 23 -95 -11 -12 15 -92 -32
5140 -32 26 177 -13 34 -8 -76 63 -6 75 -84 -4 -67 -46 -5 -58 -56 -125 30 138 -30 -57 -35 -73 -58 16 62 6
5167 6 51 72 -125 -64 -30 -73 -46 41 30 -74 -13 63 30 -85 70 -21 29 -29 -34 27 91 1 27 4 -26 -19 -10 -27 -9 -6 -33
5198 -33 46 -139 -43 -106 4 -39 -2 -3 -33 -102 -105 -45 146 3 -121 -67 60 18 5 -56 -19 -110 -26 -28 15 -68 -133 149
5226 149 -8 -44 29 20 -40 -107 -61 -16 -52 92 66 70 5 101 -45 13 76 -24 14 -32 -29 87 23 -8 -4 82 50 -101 -60
5255 -60 42 18 87 57 -38 -29 18 -8 2 97 -50 -19 35 -82 -2 -44 -108 -72 -20 -113 -60 -36 -99 8 -26 27 37 -27 -7
5284 -7 -12 -12 11 35 39 -49 32 5 27 -100 12 -10 35 25 17 48 27 -58 -171 52 0 -60 -11 132 142 -71 14 -101 -85
5313 -85 -29 144 -86 28 20 -27 -1 22 -44 -115 -66 31 -71 17 14 -72 30 52 -66 26 75 27 -67 -104 10 -15 53 -30
5341 -30 -23 -101 -16 -131 -47 -22 48 183 79 -7 13 26 -44 -80 2 78 -95 -24 9 -54 35 -15 -85 -88 -15 -20 -62 14 147
5370 147 75 46 84 -36 116 12 8 -23 131 -74 27 -20 -6 16 50 162 -82 5 5 34 3 126 -48 -15 60 -53
5396 -53 -30 61 -47 -70 65 78 -77 -56 70 -131 -26 5 -14 -28 -60 -29 6 -73 93 65 2 4 -7 -5 50 -20 -61 -32
5424 -32 11 -32 42 -43 32 97 -13 22 5 73 26 -81 -89 5 -117 -10 21 47 59 -28 -31 -92 26 -23 44 17 -15 -12 -79
5453 -79 -36 37 19 48 189 46 -33 -88 95 -26 -38 37 -1 18 58 14 16 -47 66 4 -12 -17 160 -35 -36 11 2 41 -30
5482 -30 126 -78 -2 60 -116 -6 121 -90 38 51 -81 -36 47 4 56 -29 23 -53 16 -30 81 12 104 75 -33
5507 -33 56 42 75 -1 -65 -51 160 -34 27 11 -25 92 -52 11 80 -64 -85 22 93 -36 43 -105 14 -26 53 -46
5533 -46 34 -52 1 16 -26 -54 -34 58 -5 -22 59 47 76 53 9 -132 9 -112 -73 5 -35 28 6 -35 12 67 -60 -28
5561 -28 -24 8 -22 -94 141 35 53 -75 41 22 -67 59 23 41 66 113 45 77 -70 -6 11 6 71 -105 -22 -86 -81 -50
5589 -50 14 -95 95 27 -26 -146 -29 -70 42 -17 -67 21 2 34 -30 31 18 27 59 -22 -15 -69 12 -54 4 66 -8 10 19
5618 19 20 -111 78 4 1 -20 -6 -142 8 41 -51 73 -90 -21 55 40 -70 -34 -95 30 -38 51 -21 -43 18 -46 52
5645 52 -38 10 -40 87 -7 61 43 69 -36 -26 -63 -16 47 -15 -49 7 -90 -85 16 -4 5 -34 28 -49 101 43 -91 -98 -33
5674 -33 -91 6 -27 -17 -84 -75 -117 -131 -38 12 -67 34 -77 42 -3 -112 -61 127 -17 -18 136 35 33 104 -97 64 -77
5701 -77 47 45 7 107 -47 -10 -43 -50 75 61 19 -3 124 148 -17 25 17 15 48 41 -103 15 -14 1 -32 29 5 -58 67
5730 67 -12 38 26 14 -63 26 -11 -118 13 -81 97 76 -21 25 -31 74 -20 -46 82 24 -74 -107 34 -86 12 75 36
5757 36 181 3 4 12 -120 -4 1 122 -90 -16 17 -39 -20 32 0 32 8 -21 13 -47 -118 13 -32 -144 -7 -41 -31
5784 -31 56 14 51 38 15 -39 1 -16 -42 98 -37 35 -15 -15 16 46 53 9 -26 -25 -34 -60 -47 8 0 -24 -80 -39 -9 -2 -1 25 -5
5817 -5 -38 18 11 107 -39 -66 -24 -68 48 -143 -34 47 -53 -60 -29 -54 54 2 -73 -3 7 2 48 131 66 33 -63 58 50
5846 50 103 -12 -22 -16 26 22 -38 -32 34 38 17 -23 67 -64 -41 -14 -121 -2 26 -66 -24 -88 102 52 -41 -81 9 74 63 -25
5876 -25 68 107 4 40 -62 -36 83 -4 26 66 -111 72 -13 -74 -12 -21 -42 26 -43 -19 -25 54 103 -37 38 -96 -123 -11
5904 -11 62 38 -21 8 -2 -44 119 47 9 93 6 36 -21 -24 3 47 70 15 0 -48 14 17 17 81 150 -48 -65 -18 -68 -51 -57
5935 -57 -4 12 -20 5 -40 -67 72 -110 38 84 62 -73 10 -67 20 -51 -108 11 117 8 116 55 3 13 -36 9
5961 9 52 53 29 -62 125 64 44 25 -93 15 -5 -57 7 44 -78 -68 -19 -45 -12 -59 -27 31 58 20 5 -55 28 -14 -42
5990 -42 72 -19 -67 -41 6 170 -168 28 39 -4 22 -24 2 99 65 39 65 -54 -130 33 -128 -40 -13 -9 34 -84 86
6017 86 -91 -133 -49 -12 51 121 77 -25 -60 -12 26 -91 -62 4 8 -66 -46 -51 107 -17 -94 -52 45 40 40 66 7 13 -89 -48
6047 -48 -92 -57 -7 -95 -43 -21 78 -36 58 13 19 95 -110 5 -92 31 82 -33 -26 66 -6 57 -29 -50 -65 -81 51 28
6075 28 -27 -39 45 26 60 26 46 -1 -79 -48 93 33 44 -11 0 -89 -25 2 -1 -8 -5 55 69 -19 -98 33 -64 64 -16 -92
6105 -92 108 -25 -56 -19 82 10 51 -9 97 14 101 -76 -51 -23 46 -29 -62 -61 -35 54 -102 -104 34 72 -104 -36 58
6132 58 22 16 86 58 -15 -20 153 113 -37 -84 -7 16 2 -17 -28 48 102 27 19 42 28 34 -185 -64 -46 92 -37 -9 -41
6161 -41 89 112 -60 51 -89 -58 8 -69 -45 -41 43 -40 -27 47 -65 28 26 -63 -42 20 44 31 11 -12 37 -52 -63 13 0
6190 0 13 -46 81 -1 -133 -26 -57 -70 16 -116 6 40 -84 129 -53 -69 -24 21 56 -49 15 -42 87 39 47 40 7
6217 7 -20 64 -11 -43 90 34 18 -57 -12 9 -21 -26 -96 10 -17 -62 -24 20 4 106 -68 -98 92 -45 -19 -50 -20 -54
6245 -54 99 69 -48 -14 -51 101 -14 59 1 -65 101 62 -83 130 54 -4 37 -16 -15 1 35 -154 -65 85 -107 -53
6271 -53 38 1 2 -90 -39 -10 -34 -63 54 114 4 6 -30 -37 14 32 76 46 8 -50 53 -24 -65 -41 87 -3 92 -32 -140
6300 -140 64 -102 2 -49 24 108 0 57 -85 153 30 25 -87 -14 53 -6 26 -69 15 -43 -132 -89 -35 35 1 87
6326 87 -17 49 -37 -131 -19 21 47 -85 -38 -25 49 -51 -63 -22 26 38 -55 79 18 -70 100 14 -105 39 22 86
6352 86 91 2 26 -42 -21 65 71 -5 -1 51 -19 -15 107 39 135 -45 -86 -54 26 66 16 -65 -13 55 -57 22 -9 22 0 1 -87
6383 -87 29 -4 -36 -4 21 33 -55 128 78 48 20 36 -42 60 -121 -43 9 49 14 43 -79 111 56 72 117 -7 -32
6410 -32 -26 84 31 -119 -17 -14 82 -88 -78 -68 -36 -59 89 12 3 -101 21 -106 37 -37 -15 97 78 107 70 62 1
6437 1 68 32 -17 130 7 8 2 10 -38 2 58 -90 -30 2 -38 -55 38 -104 -39 -85 -34 -44 -35 10 -7 -66 8 -38 10 -18 -22
6468 -22 23 -83 -126 -26 83 -8 8 82 40 -27 -37 70 -59 3 14 44 30 127 -186 -126 12 -77 -2 -46 195 83
6494 83 -94 49 62 -102 1 56 15 79 -65 -15 20 13 -9 24 45 22 -67 -14 -99 -28 26 33 77 27 -33 0 22 44 28
6523 28 -95 -50 36 -33 8 7 -53 11 -50 -42 48 -64 -29 -77 22 15 -65 -62 -100 -73 0 -25 20 -25 -18 -14 36 -2 -30 58 -69 60
6555 60 -9 -55 -34 -9 -57 18 -142 95 159 -6 61 73 31 44 71 -31 53 79 -2 -58 145 -21 -12 -17 -30 114 -96
6582 -96 47 -64 -28 72 20 88 0 -52 -24 105 -62 96 17 27 -104 18 62 38 -20 69 -67 52 -46 46 -108
6607 -108 -12 -32 -43 15 -11 -80 88 -29 66 76 37 90 -135 57 -21 -59 -10 -42 -100 -35 -80 -41 -99 69 -40 11 -22
6634 -22 -33 -58 -107 26 118 5 -12 -60 -64 8 -35 18 -35 35 86 35 -3 13 25 -36 46 -60 62 -51 -17 98 -53
6661 -53 -18 4 78 -96 70 -108 17 8 1 5 50 -151 19 98 -113 -10 90 -58 6 51 -23 51 -52 202 93
6686 93 42 38 91 25 24 -61 -35 57 -15 71 -42 69 -21 -26 40 127 69 11 -23 48 -74 -107 21 -30 -34 4 -69 -4 5 -50 77
6717 77 15 -164 -25 -87 -3 19 -35 -47 -119 -15 147 16 -57 20 -21 -82 2 11 -26 -20 37 23 48 27 42 -14 -86 -26 -25
6746 -25 -104 -84 111 26 43 23 -70 -50 8 -61 -20 2 -10 19 22 -6 -1 -18 -37 -51 113 -88 70 -97 -16 5 -97 -111
6774 -111 -11 33 -57 138 5 -30 17 -36 -104 46 -22 14 7 133 -43 -38 -6 -39 -53 48 -66 1 -25 -35 49 -13 49
6801 49 50 -45 -93 60 -25 -6 -20 7 97 44 -105 19 -62 118 44 91 108 84 100 35 42 -25 -10 -47 -68 65 -63 -41
6829 -41 24 77 30 10 20 -49 -28 -128 27 29 -59 -104 -3 53 -61 15 -79 -29 -123 -5 -85 103 -49 -44 -10 9 -78 -108
6857 -108 -56 61 -93 115 -127 -54 54 143 59 -84 -47 5 -104 22 13 -1 3 -42 -46 -10 28 147 -124 26 -39 65
6883 65 39 94 114 1 54 -8 30 -19 -33 -138 27 69 -10 -20 18 -83 -40 -83 97 -31 -8 73 -49 69 32 12
6909 12 -66 -149 31 -41 -6 9 20 -69 -42 -31 96 -83 82 102 -3 -204 87 -91 54 -77 -24 -84 116 115 29
6934 29 30 -64 67 56 8 -18 -26 60 -39 57 -17 -85 3 90 -40 29 37 81 84 -60 -131 75 64 -65 102 71 5 -67 161
6963 161 -63 -72 -3 -12 -93 -3 29 -93 -13 5 46 -23 -59 -29 77 42 78 -88 -25 -25 76 -3 47 31 70 50 38 69 -52
6992 -52 -37 80 -21 85 -79 89 15 -26 -88 -22 18 -77 44 -73 -24 -59 -43 97 -37 -87 35 23 30 6 37 19
7018 19 50 -59 -9 49 -54 53 -66 -71 17 33 -55 3 191 32 -22 -168 28 36 -29 -114 -15 7 111 9 -156 -71
7044 -71 15 101 -79 -23 38 10 66 -2 33 43 17 -151 51 -75 -60 -2 -40 14 53 -79 -60 65 -81 -51 -27 66 -62
7071 -62 -10 57 -23 -66 -18 17 -15 68 22 -1 -84 -19 -37 44 -23 -56 30 43 -88 79 37 66 -26 8 -50 -109 2 -17 -13
7100 -13 -36 -87 -47 23 -21 24 77 23 -35 -26 -17 78 68 -1 -9 -30 56 50 -20 -51 -85 -4 16 66 -72 125 66 84 -49 -15 -23
7131 -23 11 -103 -62 95 7 60 43 1 -7 -35 15 60 16 10 28 37 -111 11 -15 -59 -24 -42 -51 -26 -39 -53 -60 85 88 123 16
7162 16 1 36 -53 52 -80 86 5 62 -4 -4 -82 15 -3 -55 -29 34 -75 -100 -12 -6 19 -37 12 -44 -8 19 101 26 -37
7191 -37 25 -57 79 -11 43 -6 59 9 32 156 -23 -34 -40 65 33 -10 15 -25 -78 17 -19 73 17 8 0 67 9 -15 81 -76
7221 -76 -80 -79 21 -53 -7 53 6 89 -26 -24 174 35 -7 8 -2 -4 14 79 -66 55 32 -38 -24 -139 -66 79 1 -76
7249 -76 -13 65 15 -72 37 83 -115 -42 11 4 85 -37 -43 -113 14 -14 48 -164 49 -50 -6 -52 -98 -21 11 -76 -6 76
7277 76 60 -99 49 -32 -90 117 35 23 43 -46 -81 10 -90 -33 59 -17 -62 0 -114 -45 10 -57 -117 -66 -16 -65 103
7304 103 8 44 50 -53 20 -66 38 -109 -80 -48 61 11 33 2 56 -68 1 90 32 -55 55 -71 62 53 10 50 21
7331 21 -73 -9 -34 41 104 70 -1 24 -53 -6 -59 -52 -63 -19 88 0 -14 -66 -46 -24 56 7 -82 26 -45 59 -24 -74 73
7360 73 101 16 -34 -26 -73 -37 117 22 -78 -17 18 -4 -2 59 -40 69 -35 4 68 -37 83 -12 19 38 -13 -96 -30 -66
7388 -66 -18 37 43 82 -26 -16 -53 -99 31 37 -60 -47 -78 92 -137 18 10 47 -78 -39 33 26 69 66 -88 -16 -33 124 -46
7417 -46 108 55 -89 -2 33 35 7 -112 -115 -76 48 -126 -34 -83 9 -105 -66 -104 -15 62 -5 44 63 14 53 102 -32 50
7445 50 13 63 -151 -122 -9 -21 56 -37 63 18 -79 58 -23 -46 -11 -57 26 -24 -33 -135 -4 -27 -42 -69 18 33 -8 -125
7473 -125 -24 -77 -47 22 -138 19 -91 -47 -111 57 10 81 -28 91 21 60 -16 51 36 99 -16 -21 111 -3 12
7498 12 -11 55 72 -41 135 -96 28 69 -4 19 2 0 15 -19 -77 -32 -36 -7 44 -5 -68 33 -39 -64 -52 74 20 114
7526 114 -69 19 -48 -78 -34 -10 -53 -42 -6 19 8 45 22 -10 -91 -28 -13 20 76 81 -9 -125 78 1 -31 5 40 2 -102
7555 -102 -61 23 49 14 -62 -57 -42 -44 -40 -61 -58 140 138 60 -28 46 23 -15 12 7 31 -63 -51 -39 -10 14 22 58 58 122 -104 45
7587 45 10 -38 -14 19 95 -56 -8 110 -55 84 -62 100 -37 -1 -37 -117 40 9 -81 -79 74 134 46 24 26 29 -46
7614 -46 143 -19 -32 -65 51 4 -34 22 31 25 52 26 -165 67 -59 -75 -149 -104 -3 52 -4 45 -139 34 -72 55
7640 55 -103 7 80 -80 20 -55 18 -7 -25 -9 -64 -36 64 -77 -67 -91 -54 -12 -63 14 56 -4 71 65 28 51 -6 41
7668 41 36 -54 34 21 19 -21 22 2 -40 82 50 81 -47 -139 -26 56 -25 3 14 40 -49 -151 41 -61 -18 -32 -54 -50 -70
7697 -70 60 61 40 135 2 53 -39 10 -6 -98 -38 5 -40 71 102 94 26 2 -58 -62 55 93 1 -76 -106 15 -81 17 -32
7726 -32 38 42 -70 -11 -95 -98 -41 0 -156 1 8 19 21 -34 -39 95 -19 37 26 107 -97 95 -73 90 -34 77 76 -12
7754 -12 71 -60 1 124 -33 -68 20 -56 -13 27 92 128 -16 63 -65 40 9 41 -65 53 35 -20 -149 67 138
7779 138 -68 21 -72 10 -19 13 -4 3 -5 43 -7 -68 -64 -4 58 70 1 -16 85 -1 -74 31 22 -42 -57 -100 -7 -10 -117 39
7809 39 67 4 75 26 104 -20 50 -88 34 4 -53 -24 -41 -5 92 -22 -58 -17 12 29 -75 -15 -40 -39 92 34 106 10
7837 10 60 43 74 109 -78 -63 31 -21 68 -85 100 84 -118 -50 -34 -51 71 -17 38 -1 37 44 -62 8 -4 -29 -78 -4
7865 -4 -86 -95 -51 -10 -109 -71 -70 -16 13 -35 38 10 -19 4 -15 -55 -53 -120 28 34 0 -6 -41 7 66 23 -14 20 -130 95 7 -12
7897 -12 85 43 15 96 -52 36 -4 -33 -20 -19 123 -110 -18 -43 -52 41 20 11 -68 32 20 13 -45 34 -56 -60 -50 -17 71 37 -10
7928 -10 -13 2 -88 -5 47 107 82 -80 -45 -55 -34 63 28 9 88 -7 -110 88 -54 -44 81 15 -120 -41 -4 -74 -90 -109
7956 -109 -23 3 -16 -31 63 -64 -63 -89 -53 7 19 59 -40 -28 -38 31 -64 108 34 -61 0 -100 25 -86 -22 -40 -1 44
7984 44 -91 -87 -67 -46 -44 19 10 -51 -25 -29 -81 -8 9 -13 -112 -5 10 3 61 -71 -49 80 -84 -61 12 -60 7 -6 51 -7
8014 -7 36 39 8 36 76 -83 -141 15 -22 7 -34 0 -69 17 -6 -71 -40 8 -10 -41 -53 54 63 -41 30 62 -47 -31 73
8043 73 44 11 88 66 4 -85 65 65 -121 61 89 62 26 14 77 -37 -76 -12 -32 -30 -34 -6 29 -12 -91 -21 -54 -82 49
8072 49 -25 -33 -12 26 -53 34 30 44 28 29 -26 -13 64 -23 -27 27 -38 87 -49 41 -21 71 8 71 -35 21 68 -54 46 65
8102 65 -19 -48 78 -113 85 -5 -24 -27 -12 -55 -81 -61 -55 -100 -4 -80 -53 -29 -29 -55 -69 32 -4 67 13 14 -23 81 107 30
8132 30 -80 87 -13 -65 -82 -6 -17 18 -32 -15 94 -35 21 -44 16 -15 -86 18 -91 22 -19 -12 -3 -36 3 120 62
8159 62 57 -5 37 -40 -19 -121 -68 11 -27 -77 -8 -137 -37 5 -12 -57 126 -38 2 50 -51 -70 -52 50 53 -119 51
8186 51 117 57 39 -74 -9
8191i
$$ Imaginary data points
##PAGE= N=2
##DATA TABLE= (X++(I..I)), XYDATA
0 0 0 0 0 0 0 0 0 0 0 0 0 0 0 8 -8 8 -8 16 -16 16 -24 24 -32 34 -40 48 -56 64 -77 88 -99 112 -128 145 -167
35 -167 185 -208 234 -263 292 -325 362 -402 444 -490 543 -598 660 -728 801 -882 973 -1072
53 -1072 1183 -1306 1447 -1606 1790 -2001 2254 -2555 2924 -3390 4001 -4833 6045 -7982 11581
68 11581 -20589 94322 128457 16640 67719 21177 -8479 -58916 -90947 -60155 -59272 -84508
80 -84508 -28403 -8026 32070 56652 10096 44664 96538 22203 -2922 3590 -21189 -25182 -57628
93 -57628 -65209 -11216 -31736 -40830 -3633 -2000 32129 37487 -17027 20481 43549 -10243 -13081
106 -13081 -8314 -7787 83 -41008 -23213 25163 -7346 -7709 9784 -4347 28589 19000 -17801
119 -17801 24326 26496 -5196 7653 5017 20088 20565 -27627 -3739 18416 -22659 -14587 -13956
132 -13956 -26262 3678 -16552 -25855 21583 13310 2686 14729 7795 35604 26602 -17659 11122
145 11122 12979 -21815 -9372 -17488 -16277 5312 -23693 -13615 23440 6997 10095 11038 444
158 444 28426 6853 -22877 9749 -1282 -23409 -10011 -18262 -719 9568 -22208 519 20160
171 20160 -557 9287 60 -4981 19199 -11897 -23216 9650 -6428 -13804 -7198 -15548 12706
184 12706 9011 -18203 12364 16698 -439 11443 -1594 6579 22905 -13128 -8157 16102 -1931
197 -1931 61 -5435 -11125 17853 -1626 -20267 11175 4514 -4832 1864 -10889 9705 15209 -17779
211 -17779 -1373 10591 -3862 3145 -10978 -7621 17618 -10506 -16669 11147 1664 1329 -675
224 -675 -9941 18011 10662 -15632 5742 6949 -903 4107 -14797 -348 17962 -13344 -9606 9122
238 9122 1161 6730 -5723 -9074 19697 1394 -15546 5441 -264 237 255 -18296 4780 12584
252 12584 -15334 -4385 3399 -626 6218 -13471 -7693 17190 -6821 -12220 4686 -1346 7185
265 7185 118 -13390 14000 11108 -9442 2891 1661 4438 8265 -14429 -263 16844 -6850
278 -6850 -3691 4587 876 12297 -2836 -9235 15977 3744 -8298 1849 -3568 5686 3291 -16878
292 -16878 4530 12061 -7962 228 658 2054 11689 -9480 -7030 13034 -3991 -7375 -2434 -8013
306 -8013 6186 -3290 -17500 6190 4450 -7975 1078 -4019 3678 9158 -12508 -1542 10682
319 10682 -5781 -2103 -3027 -4814 9824 -5605 -11284 10095 1603 -3286 2705 -4030 8622 6763
333 6763 -11350 4900 8741 -3785 2654 -3262 1001 12426 -6356 -3342 12513 933 2120
346 2120 2314 -2980 11316 1270 -11295 5880 1934 -5077 61 -8098 1964 7175 -11187 -1149
360 -1149 7500 -3290 1470 -3714 -4069 9146 -6458 -10617 5427 -2773 -3182 -645 -7626 6750
374 6750 4789 -10027 3766 4542 -2937 1794 -7447 -1606 8033 -9670 -5545 6655 -1340 2917
388 2917 806 -2167 12834 3578 -6126 7202 2116 -965 743 -9289 2155 6317 -10299 -875
402 -875 6148 438 5162 -1853 377 12344 -2956 -6327 4211 -2884 -823 -2978 -10522 5503
416 5503 4084 -8417 3390 5271 3161 5458 -5271 2510 9455 -8330 -5810 739 -5525 257
430 257 -5518 -8660 7764 1278 -5805 4587 2571 4819 2783 -8439 4623 6761 -8876 -1849
444 -1849 722 -2102 4312 -4666 -2740 10115 -553 -3096 2496 -733 5240 -1773 -10529 5335
458 5335 2880 -7993 644 164 1312 4834 -5556 1470 9088 -2176 -1077 -219 -1574 6597 -3964
473 -3964 -8252 7344 682 -5630 1366 -910 3596 1762 -8524 2234 4757 -4001 805 -2819
487 -2819 -904 7906 -4126 -2941 9586 990 -1251 1574 -346 6830 -181 -7950 3486 315
501 315 -4388 1126 -5105 -833 4246 -8116 -2238 6111 -1386 -393 -1950 -689 8154 -1682 -4364
516 -4364 6172 -808 -1951 1694 -4520 2069 1896 -8514 -590 2618 -1198 1633 -3489 428 7405
531 7405 -3910 -1076 6856 -2042 -945 -201 -3723 4649 388 -5548 2854 1407 1304 4174 -2747
546 -2747 3765 5790 -6815 -892 3521 -3979 -1814 -4746 -4479 3893 -2515 -2428 5121 219 2903 4142
562 4142 -1835 6440 4158 -6474 496 1412 -2266 123 -5091 -1099 3858 -4983 -150 4904 -1608
577 -1608 1673 -756 -4031 5430 395 -6101 494 -881 -362 935 -4278 3536 3913 -6001 982 3237
593 3237 -1709 1649 -3604 -3804 4202 -1976 -2872 2112 -936 2444 465 -3458 6837 3510 -5378
608 -5378 1894 1642 145 2761 -3329 325 4804 -2328 780 2923 -158 3906 -2323 -5035 5526
623 5526 -183 -5838 67 -1793 -44 636 -4106 3147 3534 -3219 1579 882 -250 3846 -4944 -4846
639 -4846 3730 -2569 -4110 11 -1325 2348 -497 -3281 5900 2908 -2299 2310 -1220 429 3601
654 3601 -5067 -1977 3404 -2337 -919 500 621 4990 -1643 -2509 5851 377 -2012 1283 -3322 312
670 312 1473 -5249 480 2551 -1685 1049 -707 1731 5697 -3360 -1885 4455 -2002 -1484 98 -3483
686 -3483 1693 -328 -4239 2534 1753 -189 1860 -2017 2354 4433 -4410 -485 2946 -2919 -518
701 -518 -1017 -1942 3104 -1707 -2727 3084 81 667 1175 -3332 2522 1960 -4920 1000 1711 -2030 649
718 649 -1618 322 3972 -2191 -466 2972 -1034 1550 245 -2977 3146 -134 -4436 1822 159
733 159 -1130 784 -2861 1344 2871 -3424 803 1958 -1492 1726 -1268 -1823 3854 -1622 -2781 2183
749 2183 -752 316 244 -3120 2683 1309 -3424 1948 831 -769 2141 -2139 67 3995 -2126 -712
765 -712 2123 -958 1695 -645 -2358 3620 -364 -2987 1830 -687 -278 1077 -3506 838 2259 -3467
781 -3467 -146 568 -1236 1811 -1946 -1261 3708 -1505 -1446 1887 -910 1479 448 -3111 2606 1236
797 1236 -3004 1194 -141 15 2128 -2804 529 3734 -1974 141 1411 -803 2497 -865 -2425
812 -2425 3458 -144 -2315 1141 -1279 721 830 -3739 1216 1802 -2757 311 -296 -791 2412 -2424
828 -2424 -1515 3199 -1287 -868 873 -1064 2280 179 -2863 2897 1260 -1550 1417 -718 600 2338
844 2338 -3041 84 2608 -1598 321 55 -914 2953 -1021 -2156 3139 -348 -1031 821 -1939 1208
860 1208 848 -3989 650 887 -2163 433 -1579 -463 2562 -2485 -1066 2638 -1134 102 338 -1694
876 -1694 2644 462 -2547 2397 854 -394 1427 -1414 1191 2526 -2648 376 1778 -1300 1061
891 1061 -708 -1273 2826 -871 -1696 2229 -448 -48 555 -2422 1435 598 -3413 643 58 -1522 882
908 882 -1734 -370 2451 -1981 -559 1722 -1054 852 -354 -1945 2549 -201 -2106 2087 140
923 140 159 1905 -1311 1455 2524 -1774 746 812 -1269 1157 -1656 -1523 2397 -1551 -1525 1819 -804
940 -804 801 778 -1662 1858 617 -2430 945 -639 -1227 885 -2732 -740 2302 -1939 -297 1423
956 1423 -837 1500 -56 -1270 2661 -461 -1498 1556 -798 346 1290 -2195 1216 2045 -1638 1053
972 1053 825 -269 1557 -1402 -725 2508 -1652 -1033 1108 -1444 889 395 -2261 1597 501 -1760
988 -1760 962 -476 91 1213 -2572 164 2131 -2055 143 686 -1203 1392 -570 -1480 2101 -478
1004 -478 -1045 998 -1045 1338 1190 -2366 1491 1839 -1440 1192 400 -383 1516 -1729 -831 1696 -1377
1021 -1377 -387 41 -1789 1855 215 -2316 1910 671 -1189 871 -543 512 1099 -2570 56 1072
1037 1072 -1415 838 -363 -1421 2277 -524 -1318 2221 155 -429 477 -1052 1617 612 -2348 1152
1053 1152 163 -1261 1434 -694 -513 2098 -1223 -545 1853 -254 497 -337 -1439 1763 -434 -1924
1069 -1924 1548 -635 -1170 1069 -1157 460 1646 -1604 96 838 -408 1487 -755 -870 2067 -1360
1085 -1360 -1332 1732 -977 -573 278 -1719 1064 845 -1233 1035 -249 -306 1749 -1263 115 2099 -1802
1102 -1802 -599 1266 -913 343 -281 -1468 1403 -351 -792 1413 -874 -16 1308 -1613 793 1657
1118 1657 -1888 36 584 -719 1103 -680 -575 1502 -1255 -173 1430 -946 655 521 -1753 1229
1134 1229 786 -1361 510 -474 -319 742 -1336 360 1368 -1826 264 934 -863 1162 15 -1330
1150 -1330 1500 -231 -891 857 -907 127 246 -1942 942 907 -1812 671 177 -596 1332 -444
1166 -444 -265 1401 -909 44 817 -868 1078 -143 -1841 1434 341 -1111 836 -363 -72 1052
1182 1052 -1145 602 1285 -1285 399 127 -781 1602 -506 -1200 1474 -356 -603 738 -782 549
1198 549 267 -1643 846 491 -1194 680 -538 -520 1455 -1017 -562 1139 -955 -25 344 -788 1276
1215 1276 -133 -1404 1414 -10 -744 894 -861 158 992 -1338 279 972 -893 557 -346 -526
1231 -526 1531 -714 -694 1516 -634 -132 817 -1047 704 432 -1440 689 172 -737 775 -942 -228
1248 -228 1315 -1069 -262 1100 -854 435 135 -814 1128 -148 -945 938 -297 -94 853 -1096 244
1265 244 1012 -1252 265 561 -618 679 -505 -614 1217 -730 -560 974 -785 246 596 -1079
1281 -1079 854 390 -1296 591 -154 -600 683 -1239 -41 975 -1096 165 767 -710 770 118
1297 118 -742 1246 -208 -601 977 -441 159 624 -1122 508 714 -1115 479 210 -588 780 -511
1314 -511 -464 1050 -719 -319 551 -760 464 166 -1087 921 83 -908 805 -373 -282 832 -940
1331 -940 62 846 -1118 291 372 -705 814 -304 -785 1230 -301 -414 866 -589 296 586 -991
1348 -991 732 562 -702 811 -162 -486 910 -895 -453 886 -886 -229 316 -845 557 -72 -920
1365 -920 961 -90 -546 734 -638 -68 734 -1004 248 564 -950 189 102 -620 955 -479 -531
1382 -531 1071 -350 -107 749 -565 500 403 -959 722 277 -652 538 -279 -126 794 -780 -62 729
1400 729 -742 86 110 -706 666 -171 -1009 596 -149 -421 442 -759 278 592 -973 358 484 -639
1418 -639 682 -126 -391 943 -523 -422 655 -585 -113 301 -745 593 295 -897 697 231 -190
1435 -190 738 -501 52 821 -808 3 397 -543 351 -179 -781 746 -257 -676 732 -191 -118 504 -700
1454 -700 379 464 -849 331 204 -518 571 -234 -286 880 -402 -165 664 -443 310 289 -875 694
1472 694 135 -800 607 -101 -317 546 -600 -22 574 -515 205 276 -437 504 -86 -694 810 -258 -485
1491 -485 547 -488 -77 390 -724 303 270 -629 548 -45 -335 808 -460 -324 799 -381 -95
1508 -95 485 -424 218 208 -471 650 24 -510 532 -402 -77 648 -620 -167 576 -528 227 205 -342 521
1528 521 -177 -378 646 -330 -193 553 -585 32 484 -643 434 169 -501 309 -230 2 684 -644
1546 -644 -85 686 -619 39 454 -633 383 83 -530 557 -80 -269 280 -476 76 556 -732 93
1564 93 323 -701 275 209 -335 476 -302 -251 605 -345 31 317 -664 423 291 -770 417 52 -594 339
1584 339 -155 47 447 -590 135 381 -421 493 215 -511 464 -36 -573 549 -84 -173 164 -522 164 398
1604 398 -547 356 199 -645 446 127 -304 542 -330 -360 525 -72 140 76 -476 501 46 -532 583 -83
1624 -83 -408 484 -229 -101 471 -481 -180 77 -475 382 4 -474 593 -323 -471 576 -176 -246 332 -469
1644 -469 171 240 -331 213 -22 -386 582 -300 -140 710 -392 -187 619 -137 331 221 -489 480 42 -221
1664 -221 583 -317 -247 436 -405 -167 440 -390 -14 130 -390 329 -96 -263 388 -415 -132 582 -427 1
1684 1 400 -449 102 264 -343 254 -33 -122 450 -365 66 628 -377 76 376 -421 332 163 -308 424 -34
1705 -34 -170 405 -330 -19 349 -485 198 317 -471 180 135 -389 263 -114 -145 303 -272 -127 320 -344 270
1726 270 274 -512 330 182 -364 411 -119 -292 371 -328 99 416 -391 103 224 -377 501 69 -283 429 -32
1747 -32 -224 389 -329 13 255 -470 148 214 -377 348 -115 -394 442 -255 -184 459 -363 -19 158 -424 332
1768 332 216 -426 435 129 -292 488 -219 -97 529 -394 -41 302 -377 129 4 -450 514 -48 -208 403
1788 403 -118 -44 428 -450 47 234 -433 234 -1 -278 360 -223 -215 401 -204 -136 280 -257 13 28 -443 248
1810 248 -64 -404 255 -227 -113 333 -235 -9 432 -328 131 106 -309 256 40 -319 375 -109 -136 349 -167
1831 -167 134 313 -230 26 234 -313 231 -49 -311 360 -201 -147 388 -393 9 350 -345 213 143 -281 384
1852 384 2 -272 341 -228 -92 356 -342 223 295 -146 180 140 -217 329 -18 -181 436 -179 -115 250 -258
1873 -258 44 256 -393 200 117 -255 267 -1 -208 335 -330 -165 305 -256 131 149 -291 236 38 -281 270
1894 270 -32 -207 162 -265 19 333 -361 176 220 -375 279 41 -282 287 -8 -185 303 -186 -146 187 -330
1915 -330 186 132 -318 303 14 -156 349 -210 -117 255 -370 70 265 -319 91 219 -269 380 -23 -245 322
1936 322 -241 -48 263 -241 -38 216 -215 133 98 -304 368 -43 -212 343 -139 22 350 -232 -132 197
1956 197 -234 168 -10 -304 199 -133 -150 231 -299 -51 261 -167 111 159 -250 161 55 -265 121 -81 -76
1977 -76 334 -166 90 198 -283 41 242 -357 219 106 -207 267 -131 -111 303 -283 133 219 -275 151 27
1998 27 -284 208 65 -178 237 -104 -115 198 -200 27 274 -333 133 86 -321 182 55 -169 319 -197 -61
2019 -61 333 -138 27 89 -277 211 171 -301 188 -55 -107 177 -138 -133 193 -152 50 105 -217 133 124 -180 380
2042 380 -56 -161 190 -104 -67 160 -203 55 69 -280 146 8 -196 294 -237 -199 340 -156 -23 326 -174
2063 -174 -2 126 -216 266 -49 -260 301 -82 -76 413 -40 29 335 -240 -10 99 -334 277 -102 -202 293
2084 293 12 -102 154 -263 126 315 -120 223 91 -236 229 -33 -57 235 -242 -91 112 -215 -24 220
2104 220 -128 111 45 -176 190 160 -72 272 -206 -91 304 -246 45 95 -390 70 173 -182 194 -36 -47
2125 -47 267 -67 63 252 -136 46 340 -255 132 3 -369 152 23 -134 174 -250 92 278 -163 76
2145 76 92 -345 42 71 -202 167 105 -46 197 -182 12 292 -114 91 27 -339 -11 0 -123 221 -95 -187
2167 -187 69 -195 17 143 -269 107 145 -275 228 12 -291 15 -102 -5 239 -156 1 182 -276 363 35
2188 35 -218 202 -59 -315 281 -178 -48 99 -176 93 200 -68 -28 57 -159 160 -148 -110 238 -170 -212 200
2210 200 -214 147 129 -213 112 -62 -144 146 -60 -219 29 -101 -49 159 -190 13 62 -171 141 20 -64 146
2232 146 -192 -106 73 -188 -63 249 -168 -8 179 -216 175 173 -133 191 -111 -133 309 -128 -29 136 -187 29
2254 29 54 -280 122 -45 -152 284 -199 -57 212 -107 15 54 -136 90 97 -259 127 -9 -191 157 -62 -147
2276 -147 106 -272 -18 246 -179 50 108 -193 81 -82 -93 128 -145 -76 173 -148 43 81 -312 118 -44
2297 -44 -83 121 -101 -169 190 -193 -9 111 -201 92 131 -258 101 2 -213 226 -99 -173 86 -155 1 169
2319 169 -220 61 137 -226 143 8 -187 223 -52 -69 203 -50 -45 107 -119 123 82 -105 196 -7 -122 227
2341 227 -64 -168 158 -145 -7 73 -143 109 53 -192 277 76 -160 186 -143 -145 86 -184 85 115 -27 109
2363 109 -27 -109 168 -28 -104 165 -39 -5 83 -184 49 139 -158 92 6 -105 49 34 -31 154 -8 -124 149
2386 149 -325 37 232 -154 43 70 -90 91 -4 -129 169 -124 42 172 -7 131 120 -184 143 22 -113
2407 -113 108 -4 -55 117 -105 45 145 -158 80 -59 -190 67 -27 -80 178 53 -10 171 -34 1 108 -223
2429 -223 90 68 -105 144 -68 -184 217 -195 -35 78 -42 -52 151 -59 64 7 -136 77 -71 -84 185
2450 185 -21 80 127 -131 46 113 -134 130 9 -25 118 -76 -210 35 -34 -113 120 -69 52 34 -36 212
2472 212 63 3 62 -123 -105 131 -138 20 77 -134 7 -45 -66 147 63 -120 100 2 -38 93 -60 37 67 -143
2496 -143 135 -32 -101 67 14 -34 47 -48 -109 190 -61 -40 24 -68 51 11 -71 158 75 -138 251 -31 -66 -14 -50
2521 -50 23 -61 -53 63 -20 -57 176 51 -64 219 -62 -38 186 -212 64 6 -78 66 -133 -185 66 -78 -3 183
2545 183 -58 -41 180 -29 -15 92 -111 206 -47 -92 96 -36 56 74 -106 68 27 -194 66 87 -153 84
2567 84 -26 -54 40 52 -37 136 -97 -66 83 -78 165 86 -84 111 -40 -14 132 -81 -22 48 -34 -24 111 -31
2591 -31 42 19 -96 -9 61 -53 85 -2 51 -4 -41 20 95 -69 65 -19 14 70 -34 -156 110 -48 -142 105 6
2616 6 15 21 -118 72 73 -62 57 -14 -37 142 -203 -140 -89 -66 49 -11 26 57 36 -237 101 -18 -68 56 -70 -70 -26
2643 -26 -117 49 -12 -47 37 -31 -124 59 6 68 98 -34 -235 94 -127 -15 18 40 139 52 13 43 -34 -2 154 -121
2669 -121 -13 24 53 -33 61 -87 -25 12 -39 138 -64 79 158 -134 74 124 -89 66 59 -150 55 4 -108 66
2693 66 -135 -70 1 -150 27 37 -158 113 18 -22 60 -9 -38 37 -48 -39 114 -25 34 128 -70 18 48 -9 123 -5
2719 -5 -86 -13 -59 -70 86 -33 19 66 8 105 10 -101 91 -54 -28 45 -42 85 86 -132 -32 -30 -11 94 34 -92 6
2746 6 3 -86 94 -64 63 -17 -168 -27 60 -220 82 -7 19 79 4 54 25 -43 71 -69 20 48 35 35 194 -4
2772 -4 -56 54 -77 -60 89 -37 50 90 23 72 73 -173 63 -8 35 31 -144 24 53 -86 2 72 -109 -18 9 19 -29
2799 -29 66 -6 161 -13 -96 88 -77 -97 145 24 85 -20 -120 -98 -68 -3 39 -7 -8 93 -68 18 43 -78 63
2824 63 119 -80 41 -97 -22 -66 -61 1 36 -130 107 8 -52 29 48 -116 90 -79 64 103 55 56 74 67 7 122 -99
2851 -99 1 -5 -129 -65 -54 7 30 -6 -72 48 -30 -21 98 -1 -4 33 18 121 5 -76 130 11 2 -50 -60 18 19 -145
2879 -145 -65 50 -65 32 -68 -79 112 -34 77 75 -71 209 -20 -113 -20 74 1 -10 67 -38 102 -119 -34 19
2903 19 -22 80 -129 -24 41 -133 65 87 2 3 4 12 25 7 14 109 8 -24 -20 -81 11 -19 -11 68 147 -95 116 70 52
2932 52 72 -50 -41 62 -49 -83 30 -70 26 -4 0 69 -44 -90 87 6 -95 66 -177 -135 100 47 -82 -30 59
2957 59 11 -58 9 6 -18 86 148 63 -18 191 -99 56 101 30 19 93 10 94 55 62 66 -27 -41 113 -189 56 53 -159
2985 -159 57 87 -42 -17 -102 -34 30 -131 -18 34 -101 -73 3 -21 137 8 -205 66 77 -47 -4 -46 -74 145
3009 145 -88 82 36 -28 104 -14 -48 136 -53 74 184 -38 52 -8 -2 65 -28 -121 -39 80 12 36 53 16 2
3034 2 -47 -12 31 -1 86 -76 -87 150 46 -29 106 25 -18 22 2 76 -45 18 -62 -56 -54 6 27 -58 39 37 -69 -84 -3
3063 -3 76 -8 -35 22 -22 44 40 -83 -44 58 -26 38 27 -79 -31 17 -91 6 -29 -2 -116 -47 -74 60 -52 -121 -50 20
3091 20 94 -20 40 80 -6 19 23 21 129 31 -9 41 71 64 5 86 67 203 25 104 49 -178 -40 34 51 103 110 -121 -35
3120 -35 43 25 -19 12 -70 58 24 59 -11 -53 -63 99 -61 43 -47 -23 52 32 -67 90 -6 2 125 20 -50 111 19
3147 19 56 31 -101 40 68 -110 -22 -23 -29 25 -154 83 -1 -127 -25 33 -36 15 -28 -20 42 -20 10 49 -37 11 107 49
3175 49 -47 17 -44 119 -93 100 46 -49 39 19 35 65 107 -141 -38 26 -30 129 -56 18 115 122 67 13 28 29 -85
3202 -85 -43 47 43 -110 -8 -10 -97 -6 15 -42 -70 -155 58 37 -25 20 -17 -62 68 16 -83 117 28 33 38 39 -1 33 -17 50
3232 50 37 -122 126 100 61 96 -71 18 11 -93 -17 83 -55 118 -140 42 46 3 -96 -43 34 3 -20 60 -41 14
3258 14 25 119 45 -117 -15 -24 7 11 -46 -29 -37 21 90 25 -4 162 -46 32 48 6 2 -21 -67 -17 -22 36 37 18 53 8 -67
3289 -67 -90 31 -46 26 73 94 83 50 -75 55 -55 -28 35 -13 -82 -28 11 60 212 39 47 -21 -59 138 68 -6 -69
3316 -69 -26 -37 -82 44 22 54 -8 59 -2 -57 28 -36 -8 20 -157 -65 63 -72 -37 -45 -10 14 5 -66 -37 24 -32 147 -47
3345 -47 7 -12 -59 -26 -32 -34 -10 -1 -42 55 69 -79 104 -94 -51 61 -44 -33 -8 24 51 -48 5 3 -30 -85 -78 -54 21 -65
3375 -65 43 58 111 -10 58 -64 71 44 -91 -76 82 -86 91 -8 -102 -32 -66 10 67 -110 38 64 36 102 -32
3400 -32 2 -24 99 -196 63 3 97 63 30 35 49 16 8 24 13 -19 -48 59 -8 11 -41 40 -48 79 77 68 -72 -41 -49 -24
3430 -24 -9 89 -38 -91 94 -72 -65 135 110 24 28 24 -34 69 49 -131 -58 -20 31 77 11 74 -1 -91 4 42 6 -39 -73
3459 -73 -117 40 138 -30 25 -42 13 -16 -13 -27 33 -78 -56 -18 55 24 11 24 60 -6 26 71 41 22 -26 -66 77 -53
3487 -53 -46 32 34 -28 14 -23 -23 -37 59 70 -29 50 -41 91 10 25 18 80 -23 22 -26 -24 -97 -44 -32 17 -39 -20 -56 -11 100
3518 100 23 53 65 1 29 23 38 -4 -55 -36 -58 60 33 -5 72 -5 113 -81 -82 -1 39 -13 -25 139 11 -62 19 -89
3546 -89 63 4 -66 41 77 15 31 -44 109 14 75 6 -38 79 104 -74 -126 26 -78 31 -55 45 32 18 -63 -86
3572 -86 -112 -63 14 39 -111 -36 -12 20 117 61 69 -93 -72 -134 58 -56 -66 -68 -104 75 -21 -60 -16 108 -117 -4 -31
3599 -31 142 -83 -72 9 -16 26 -8 1 9 157 -30 36 -32 67 -10 23 37 25 -48 -123 52 48 -20 59 81 -33 -4 -40 52
3628 52 -28 35 117 -65 33 69 -45 -55 -52 -28 -144 -48 79 50 16 20 26 1 16 -17 -63 57 92 -17 42 26 -130 33
3656 33 -66 -65 -21 19 -46 1 -55 -60 28 10 -79 -23 -113 -20 83 -104 33 -69 33 31 -51 33 15 -28 -115 14 5 -67 9
3685 9 -16 -27 72 167 110 15 -105 83 -17 26 1 37 10 -19 42 -9 -18 27 -23 117 53 -86 -47 37 28 17 -86 -55 61
3714 61 81 30 -88 -37 22 1 29 2 -46 86 -36 15 40 80 91 51 -64 98 10 17 -105 34 -7 -60 -122 36 -28
3741 -28 31 83 -65 136 -28 -102 13 -86 -2 -10 46 -25 47 68 -16 45 -24 -79 -28 -149 103 -10 58 43 15 21 97 31
3769 31 72 106 78 18 -49 -82 49 71 -85 87 46 20 14 -5 73 51 72 -16 10 134 -3 21 96 -62 14 -46 -26 14
3797 14 -62 -6 94 -43 -49 -46 57 85 129 30 -91 -13 11 -30 -23 85 -152 -55 -45 9 36 46 -84 -82 -45 69 -11 28
3825 28 -2 58 70 -65 -26 113 3 30 28 -65 -21 -19 7 -120 -78 4 29 49 103 2 -4 -5 104 -46 -42 40 -71 -22 -11
3854 -11 -51 -56 101 62 -29 28 152 66 23 53 -8 89 -52 -91 -37 69 -60 -35 -147 -6 -6 -64 95 -48 71 25
3880 25 26 -15 -77 5 -81 -37 -54 10 25 -6 -38 31 34 53 -12 -40 -34 66 126 22 54 -54 91 -133 -23 -85 7 30 40
3909 40 -53 -41 -31 63 83 15 55 78 111 -31 -85 -69 -87 -110 -50 -21 -7 -19 73 -66 31 13 4 -32 -10 125 71 25 -27
3938 -27 88 57 -49 29 11 21 -116 26 16 144 58 43 125 48 81 84 122 0 5 -9 2 70 -1 -95 -49 9 -36 -40 -102
3967 -102 -25 -40 -44 64 -84 -25 -32 -20 10 -62 61 -101 3 -6 -1 -47 -81 36 55 79 27 -41 -27 113 5 60 91 6
3995 6 -102 -14 -120 22 14 65 38 -9 -8 -14 -73 -71 -11 18 -20 -12 90 -136 -78 27 -40 -35 23 10 92 40 17 -82 -43 42 16
4026 16 -52 -12 -36 23 -72 0 13 -143 53 122 74 -20 79 -55 -18 44 -18 -75 78 -77 25 -1 -82 10 30 -12 -5 -25
4054 -25 35 67 -23 -67 -90 -49 83 -88 16 -11 39 -13 -1 95 -15 42 -42 -4 22 32 21 -28 -98 68 1 -36 19 -61
4082 -61 121 -88 26 -87 20 -23 -13 -15 75 63 -30 51 79 -66 12 75 -43 -166 -38 -13 -32 15 -2 -72 -11 8
4108 8 52 -31 -43 80 -83 22 -39 -133 -63 -63 -39 30 -55 -53 -5 -29 -47 35 50 37 19 78 80 96 2 5 -60 -62 29 15 -35 55
4140 55 -86 -82 -11 -21 12 -68 -39 16 -65 -86 22 -86 4 28 -52 -11 -71 -4 -41 100 35 7 61 -9 52 81 116 -11
4168 -11 -7 117 29 33 73 119 101 30 -56 -30 45 2 -3 -10 -102 -12 -70 -4 32 -115 69 -39 99 85 50 2 -7 95 -46
4197 -46 -10 -30 -4 28 -38 -15 111 34 39 65 20 105 -20 -59 28 73 -33 -31 8 16 18 -46 105 -44 -27 -29 54 44 -142 -19
4227 -19 -40 -1 43 -125 -124 -141 58 66 119 -23 -11 75 -84 27 -15 -66 -83 -29 -29 -90 16 -130 78 -5 -32 74 -75
4254 -75 20 -90 11 -26 3 44 42 -5 -44 35 2 33 29 -73 -93 21 18 -55 78 45 -98 17 6 15 -47 -41 -9 -131 -4
4283 -4 -17 7 23 -56 -19 70 13 32 -30 -13 40 39 -6 -17 29 78 -45 -26 150 113 48 -100 12 -20 -19 -52 -62 14 -9 21
4313 21 -45 1 48 7 -9 9 -45 -44 -20 -70 68 -62 -24 -15 10 44 -7 -161 9 62 -88 -36 22 103 -2 -31 46 -5
4341 -5 74 62 79 29 -8 -31 -24 90 57 -24 32 -54 57 -197 5 -35 -45 -41 -5 -63 -92 0 -97 -94 -10 -30 64 -58 -12 32
4371 32 110 65 30 17 69 -18 -33 44 17 41 87 6 -14 -123 -8 -14 36 -107 21 46 34 -28 27 8 -20 22 -23 13 -40
4400 -40 -29 12 95 -42 -14 46 -33 33 99 39 -56 -45 119 89 13 -47 -22 78 16 108 6 47 101 -48 -113 72 -20
4427 -20 50 -68 -24 107 48 -90 88 56 -56 -108 103 7 94 14 -29 -83 -66 17 -48 -36 74 31 50 3 33 63 -25
4454 -25 -131 89 142 1 40 56 -16 42 106 99 69 15 -38 56 -7 9 -11 -42 36 16 19 -55 91 24 -86 -16 -10 -70 7
4483 7 66 5 -107 24 46 -28 -53 -32 65 16 48 21 79 -6 -62 2 6 31 27 -141 -55 -12 50 -61 36 137 -10 131
4511 131 107 -77 55 -14 95 41 8 86 -58 40 -17 61 83 -90 55 29 -104 8 -23 100 -10 -83 3 52 114
4536 114 -1 -29 134 -86 33 -114 -13 118 60 8 62 -6 -102 -21 25 104 -53 70 26 53 -90 -14 -105 75
4560 75 -56 -59 30 -74 25 89 -53 -18 -7 -4 -14 -51 51 -62 68 8 -99 36 15 77 -34 28 -52 33 35 41 -52 -79
4588 -79 3 -15 54 -54 -28 80 19 18 47 -78 55 -9 -35 6 -73 74 -19 -72 35 -28 28 1 26 -22 -95 -140 62
4615 62 -10 20 -27 -40 35 -88 -54 -13 -19 54 -49 197 -29 -50 -9 -14 82 137 -1 -28 -44 20 33 57 -71 -30 21 86
4643 86 -94 -76 42 88 110 110 50 -9 -90 11 38 -81 -52 14 42 95 113 -126 17 58 32 -98 -45 46 1 -47 70
4670 70 -100 -34 2 -69 7 -39 11 -71 -34 24 56 -7 67 2 5 51 17 71 -32 5 -39 17 27 31 13 -103 -99 50 -2 -19
4700 -19 18 -6 -102 -52 -8 88 -28 -29 -13 -16 -67 41 -48 79 105 57 -16 50 30 42 -51 25 153 -4 -7 55 98 93 -21
4729 -21 62 -5 9 134 -53 136 -12 -2 -15 -2 50 30 -35 -99 53 -20 -33 44 38 -11 82 27 -36 61 99 28 -37 70
4757 70 -42 92 87 37 73 102 60 72 98 -40 -24 -29 167 -90 -34 34 -7 34 -73 95 44 94 12 -64 -142 -68 -111 -21
4785 -21 22 -25 10 14 -14 20 -171 -124 5 52 -116 -36 57 -26 -37 25 -121 -22 2 -49 -77 -10 64 24 46 -14 -85 60
4813 60 5 9 20 -30 31 50 7 56 130 -52 -67 -5 -83 67 -114 32 -39 30 57 10 -28 -17 -3 141 120 -22 131
4840 131 -10 -47 -55 -75 -41 102 75 -15 -13 -50 -78 -31 53 32 -20 -75 53 98 -33 -70 -13 18 -74 -62 68 22 24 38 -91
4869 -91 -11 36 -58 14 59 -7 4 64 -10 81 -6 -82 -117 17 7 39 -27 -1 -46 -5 -42 -5 13 53 -7 -15 -16 20 -30 -73 -75
4900 -75 -99 51 139 -16 -20 -135 15 -102 36 -79 -47 9 -1 -1 10 -77 119 9 -61 1 86 -75 134 7 -60
4925 -60 115 -21 12 -62 -69 -15 -17 -98 -54 121 -50 69 61 34 -13 3 119 73 64 -23 76 6 11 19 120 -20 26 -98 80
4954 80 24 17 -2 7 34 30 7 13 108 -69 -25 -6 12 -40 -54 -17 47 -84 -11 -59 56 5 17 22 73 11 25 64 128 74 68 5
4986 5 -94 -11 -80 89 67 -63 -61 2 -157 19 20 -12 65 -43 -19 2 32 -37 -42 34 0 -72 -22 -48 167 22 -28 -140
5014 -140 -27 -65 24 -84 -122 -1 2 20 13 -6 12 16 -72 81 -36 -157 1 90 72 -34 44 -2 73 -69 2 -33 55
5041 55 -8 -16 22 81 -63 -23 -24 -8 15 -6 137 -16 -29 53 -57 -40 -79 -40 -1 117 121 -16 50 21 -13 -52 -38 22 -6
5070 -6 44 21 -186 59 41 50 59 -24 -30 -65 -79 26 101 -57 -37 -19 43 25 53 33 -15 -14 15 8 -2 -23 85 14 26 4 34
5101 34 -74 82 -58 -35 -10 5 17 11 2 -35 5 -39 110 90 15 -60 47 -75 61 13 62 -33 30 12 -63 63 -16
5128 -16 20 0 23 -91 0 -4 -40 114 -10 3 14 -62 70 25 57 17 53 -34 -8 21 4 63 71 2 71 -111 66 52
5156 52 -54 95 -44 24 14 -124 -88 91 -58 -19 -52 35 -2 25 -30 21 110 16 -1 -91 -8 56 10 23 58 -24 -6
5183 -6 8 -12 57 -62 93 55 -4 -3 34 -69 -25 -39 15 27 -84 12 -26 -49 -127 20 -43 62 -35 -56 -116 22 18 48
5211 48 22 -9 -51 -38 -29 26 -134 -31 15 65 32 -67 20 5 13 -46 53 12 90 63 141 36 32 -29 28 -48 33 -9 145 92
5241 92 -12 -6 71 -25 29 -38 191 -24 -95 6 -162 -38 -53 56 89 83 -25 -13 46 -114 39 65 -17 79 74 -46
5267 -46 34 26 -117 -98 -103 -20 -115 -15 29 43 5 -15 -165 -92 16 -97 78 -111 44 27 102 -26 -17 -128 -25 47
5293 47 68 -12 -62 14 48 -6 -103 74 30 -26 -70 -44 37 83 27 102 -47 5 -44 60 55 33 99 30 -72 -8 34 -73
5321 -73 -58 -27 51 -19 -114 -1 -110 -131 -3 -76 7 -2 -70 -7 -45 86 32 114 -35 17 -41 72 22 -41 -22 16 -105
5348 -105 59 22 -56 68 -19 49 13 39 25 13 33 92 45 1 15 5 -65 -24 9 67 115 -74 -38 12 22 -80 -143 37
5376 37 -102 35 -11 37 58 -36 59 -55 4 63 -37 12 25 38 -30 38 2 70 -38 -52 26 31 -43 -41 16 9 78 59 -28
5405 -28 25 28 -32 -96 33 -36 93 110 14 -5 8 6 12 -85 -26 -82 25 36 34 56 35 44 -16 -78 -30 58 -56 57 -73 -24
5435 -24 -11 7 -58 -28 -78 -37 30 -51 87 -35 19 46 181 88 -95 -50 75 -40 6 21 2 7 -6 -12 -90 24 -9 -33
5463 -33 -12 12 -64 -39 112 122 -59 42 -159 12 112 60 -10 59 77 -10 -10 55 40 47 111 12 61 82 28 -24 -29 -11 8
5492 8 7 -52 71 -112 3 4 50 98 -2 -19 -24 -37 -17 -77 -47 41 -40 12 30 3 -36 -27 -71 -5 -12 -10 64 -35 -23 -85 92
5523 92 98 22 -21 25 33 -70 62 -8 -72 17 -38 8 13 -84 0 106 -16 38 107 54 12 48 37 -16 57 -5 0 24 -95 -17
5553 -17 26 -56 -121 50 -70 45 72 -37 88 36 45 21 33 -53 -112 23 70 122 -31 32 10 -118 -14 -19 -3 13 44
5580 44 -81 -14 -113 -2 -68 51 -96 -7 -56 -77 -66 -56 -46 43 17 6 -116 28 -2 -49 38 11 36 -14 -40 21 -59
5607 -59 -41 -71 -81 30 -13 -38 20 76 91 -67 42 47 34 -26 83 -23 62 -100 -132 -120 -120 20 25 -37 -2 9 -44 31
5635 31 14 -25 51 -53 2 -2 0 -171 -89 74 78 -2 83 22 -42 114 54 -31 76 119 -1 -38 79 -28 54 25 96 192
5663 192 79 -98 -3 11 72 153 -66 -62 -16 45 -27 12 -54 27 -48 -50 93 -13 -112 -7 87 33 18 -62 4 6 159 -23
5691 -23 -2 20 95 9 -8 63 -97 -48 -47 -76 -7 -40 -71 -34 -102 86 -79 9 71 -40 -28 -13 -148 -63 -51 10 -37 -52
5719 -52 -55 -39 46 10 -24 -7 38 109 69 -35 -30 4 -1 -38 0 45 57 65 91 -12 24 86 66 -17 -19 -35 -33 62 73 40 -8 54
5751 54 -84 4 19 74 -10 -52 -18 38 -1 -4 -17 -91 -34 -43 152 49 -146 -53 -115 -83 -95 -165 -115 57 5 -40 93 -23
5779 -23 138 34 -83 -39 -12 -2 21 -94 60 188 70 -124 -121 -117 63 -8 107 -3 -13 75 90 -73 -48 16 20 -10
5805 -10 43 135 14 -69 -19 22 38 45 -14 21 42 26 35 75 25 75 83 -41 -31 63 -14 -1 -67 63 -6 -78 -36 20 -52 47
5835 47 -47 23 -29 44 9 66 -12 10 -9 -77 -92 47 -75 -19 -105 61 -3 5 22 -51 88 35 -34 -26 -6 56 9 151 -38
5864 -38 52 -74 -60 -46 51 -20 -34 108 -55 8 56 18 -76 -5 19 3 0 13 -55 152 7 87 -62 -4 -153 48 -95
5891 -95 54 7 67 -13 -31 -96 -9 -32 0 -50 30 -4 -93 -28 -44 -112 21 40 -9 -65 -76 37 35 -33 38 -36 82 -102
5919 -102 -54 25 96 -13 -49 -1 -48 56 7 19 115 -41 -13 -13 -65 -76 68 82 -34 21 -83 54 0 57 -16 -73 -103
5946 -103 -80 65 2 -100 21 -3 60 3 -35 46 -120 -53 69 -42 9 -13 37 -8 66 -49 7 -95 -73 -21 22 96
5972 96 -30 29 -10 43 -1 -17 -31 28 -75 -86 -48 -8 -46 32 -14 -15 -18 37 33 -116 129 -29 79 30 18 8 17 122 -36
6001 -36 98 43 74 5 90 80 17 26 59 -61 -104 -10 34 62 -73 64 -30 40 20 15 -88 -46 103 28 -16 -72 -92 41
6029 41 -33 58 3 42 34 73 -105 -24 131 -30 48 -84 48 60 -38 33 -97 3 -78 12 17 -57 35 -34 20 -9 32 -2
6057 -2 -24 -10 83 106 3 -12 -9 13 47 -151 5 22 -39 66 -106 -112 23 -13 32 16 -110 -25 12 -119 -73 -21 0 28
6085 28 3 6 -88 44 12 94 -75 29 -25 -29 72 67 -102 102 -2 -158 -18 -142 -46 -1 26 35 20 -61 -76 38 -15
6112 -15 9 36 -46 20 35 34 -28 2 73 56 -4 -151 50 -17 20 -24 14 33 64 87 3 112 23 53 63 1 64 13 -4
6141 -4 -47 -122 -33 29 -77 -52 -110 -20 82 -30 97 -38 -38 -108 -108 -26 95 60 19 2 -34 15 32 34 -18 -15 -24 2 20 -42
6171 -42 -34 37 -46 -50 -44 107 -79 33 36 -18 -26 9 47 48 18 -64 -55 -65 43 -6 5 -65 110 45 -40 -36 -90 -27 -17 31 -2 7
6203 7 50 5 -21 -45 2 -25 30 62 -73 56 16 -44 62 -49 -32 30 1 -42 -67 48 44 23 47 30 18 -12 93 116
6231 116 -17 47 -42 -82 8 -24 76 -148 90 -35 28 -5 -49 29 67 33 67 47 -51 32 -68 1 20 -19 -70 -51 -48
6258 -48 -74 176 83 12 109 -12 121 -47 10 48 80 -76 75 -23 57 -88 -6 7 -85 75 -63 69 113 12 83
6283 83 1 17 -98 -40 -66 18 -8 23 69 77 -64 -128 125 -55 64 59 14 98 4 -54 5 -53 6 -17 82 -85 -2 67
6311 67 115 -51 -34 -69 -60 26 2 24 3 134 -14 42 165 -28 -43 -43 100 -51 -58 84 -46 -9 49 42 20 -59 4 63
6339 63 41 40 7 -49 29 -35 2 -76 35 46 27 -79 -137 -39 -35 -77 57 -56 8 -27 -103 -13 -11 8 15 7 73 113 -27 -38
6369 -38 -31 -25 15 -17 38 -15 15 86 -23 -22 48 -36 24 -13 -86 45 -47 43 -7 42 30 131 -60 -61 -160 -32 92 31 -7
6398 -7 7 108 73 54 -30 -2 160 -11 -84 -25 11 -26 3 31 9 117 28 0 -56 -85 -85 77 -115 37 -21 -142 -118
6425 -118 11 63 -45 25 26 80 32 -61 97 21 -32 -37 1 9 -10 28 -34 9 92 -15 -54 41 -9 -8 18 66 13 -52 -112 132
6455 132 -21 48 -46 -58 6 34 98 -48 92 -25 34 139 -44 19 48 68 -52 -130 -15 -75 90 -45 27 -61 -25
6480 -25 -62 6 -10 26 38 -3 -23 -71 33 48 -48 -8 -114 -81 -68 -84 -108 -40 17 -97 -103 61 -16 -8 -22 -137 -60 -48 43
6509 43 70 6 -23 -38 18 34 -73 -72 -49 114 27 8 -8 -2 -147 123 18 -50 2 1 20 55 62 -144 -2 -57 6 -98
6537 -98 -29 -4 -8 -30 -42 -5 -31 -86 50 -40 -17 45 30 40 -11 49 7 30 67 26 30 81 25 -80 26 33 -52 -93 -39 88
6567 88 33 35 13 13 21 -75 -7 -183 -37 7 -49 -18 71 66 -29 78 -98 -25 13 7 -51 -39 67 -13 13 -34 -32 14 -85 63
6597 63 -128 31 51 43 -12 24 51 -64 9 4 45 -1 -16 -82 -45 44 14 -37 17 79 -18 -12 -95 -62 -102 1 -45 -10 60 41
6627 41 21 -60 -24 9 -4 61 18 -33 59 83 21 -20 -121 136 -46 -16 76 63 64 -101 -54 -90 2 -104 -81 -24 37 -14
6655 -14 97 -7 92 -10 -29 17 12 39 -159 84 136 -17 15 -86 -30 38 -127 36 40 37 -90 27 48 22 125 86
6681 86 7 -138 -7 -21 -18 -54 28 -36 -90 -14 22 -80 68 -5 -90 89 32 -47 104 -35 63 -57 -146 141 8 38
6707 38 43 25 -19 -14 -24 62 -23 17 -73 -14 -37 3 36 -8 -63 -13 41 -50 13 -55 79 39 10 -113 -17 112 18 52 4 15
6737 15 41 -107 25 62 24 -65 18 -78 37 50 -1 -148 -81 54 -140 -73 -30 80 -30 -24 78 32 117 91 -6 29
6763 29 -18 -71 131 -11 -40 54 104 66 -142 -45 -53 62 -71 -19 -21 -47 8 -79 21 -19 -116 -19 -24 -11 -7 5 113 3
6791 3 -22 67 5 -99 94 -190 77 89 -82 -33 83 69 5 78 8 -88 54 94 -7 95 -23 -73 24 19 38 55
6817 55 -57 -53 -29 48 34 -85 5 -24 30 76 -8 30 4 44 29 -14 123 52 12 25 50 3 -30 140 36 41 -26 1 96
6846 96 69 -67 -33 12 -17 52 19 -34 46 -37 29 4 42 11 -18 84 47 1 24 -109 -3 29 112 17 -25 -35 -29 14 -56
6875 -56 98 -32 100 20 25 46 -17 20 73 21 44 -8 23 -86 -15 0 -23 -16 38 -48 58 55 -38 103 4 -33 6 -41 24
6904 24 81 -2 10 -97 -115 -55 75 -21 -108 -62 63 0 -23 -147 -21 -123 21 -50 86 -60 -3 103 -1 -2 4 42
6930 42 20 -24 -7 84 -74 -31 -24 -64 -136 14 6 17 68 -21 -11 120 -1 -41 -66 41 3 -91 97 16 -29 -63 55 -108
6958 -108 36 -94 61 63 -35 -32 -117 74 -4 -91 29 30 54 26 2 13 19 186 -51 -93 -30 3 59 27 -42 54 33 38 -19
6987 -19 -69 29 -77 -4 121 -95 38 70 -32 33 36 -3 -35 78 -85 28 39 -16 75 -52 21 -14 13 42 -25 -46
7013 -46 -1 -35 -69 65 113 145 -42 87 -112 38 -9 -30 -8 -23 104 -34 31 18 -25 51 22 32 32 63 -4 -22 -74
7040 -74 -23 -103 -106 -28 -7 55 4 -138 79 4 64 124 37 100 23 61 46 -44 -118 64 47 -82 -35 73 25 -61 -33 68
7068 68 -10 30 -37 68 35 -51 -30 -25 96 3 -52 -27 -54 79 21 -29 72 -38 73 -67 88 -43 81 -45 87
7093 87 -15 21 52 57 50 67 -19 -128 90 -122 1 11 -124 -10 -55 99 93 -44 35 107 117 26 47 8 66 -62 13
7120 13 33 -125 -67 1 54 89 -78 64 30 36 57 -71 46 -48 71 -78 -12 -72 71 98 -71 -18 -82 93 -15
7145 -15 -22 35 -25 147 80 11 55 -94 -43 -32 22 -64 36 26 -61 90 -57 -42 48 -93 -28 -5 -23 -51 36 -60 -23 -52
7173 -52 25 42 93 -89 -38 5 83 -41 69 -32 12 145 -64 126 9 37 3 14 45 -43 -79 -22 121 -25 61
7198 61 -101 19 36 85 -4 -20 -49 -45 27 58 34 93 50 7 36 24 79 31 -86 -63 110 12 -54 -10 -43 32 58 25 -22
7227 -22 82 2 27 5 19 -27 -21 -29 -55 51 66 -73 31 3 7 -33 -75 -14 -34 84 63 7 -69 -90 -56 57 -84 10
7255 10 110 -29 45 -22 -55 17 -79 44 -6 34 58 3 -20 -24 -21 22 52 -38 127 -62 -34 -68 20 -81 -78 107 0 -21
7283 -21 -55 61 -52 -15 19 71 5 -61 -107 19 -52 60 34 -98 18 -53 -2 3 -49 -40 47 -32 -117 -10 65 36 78 -85
7311 -85 -50 -60 27 15 42 35 -4 3 39 -56 90 -71 16 1 9 -46 37 49 9 34 -112 -8 -44 -40 65 -39 11 -120 -66
7340 -66 24 -44 59 -48 -8 15 85 -81 -44 -59 35 -12 108 21 58 39 -36 66 77 -26 47 111 -37 1 -32 141
7366 141 -37 -43 47 -58 58 80 69 -27 77 -87 13 60 -65 108 13 -6 -18 42 83 -21 -67 -10 14 50 -14 -60
7392 -60 0 -58 -84 -20 9 50 -62 -67 51 5 34 9 60 140 112 -72 -10 -53 -28 99 -33 98 -17 50 -11 -138 39
7419 39 24 -42 -15 29 -62 4 17 -69 -25 37 -58 -40 51 29 98 -19 -68 50 1 31 -2 93 17 80 -2 -32 -53 -28 -4
7448 -4 12 9 15 114 120 101 18 -56 32 68 26 -49 52 24 -21 -10 -5 -101 -13 -52 -25 -75 3 51 26 -17 50 13 -4 -76 -22 111
7480 111 4 37 78 25 43 27 -19 -50 13 77 0 -3 -26 -99 -56 -16 21 89 42 -85 175 -21 4 18 11 -16 -2 93 -17
7509 -17 71 -77 20 69 -113 34 -10 6 57 -95 -10 22 1 -12 2 88 28 -50 56 -13 27 23 58 -99 14 -5 26
7536 26 4 113 44 -78 6 -28 9 24 -71 10 76 -112 171 61 68 -19 19 59 -19 -36 -59 47 -2 52 58 -50 -119 65
7564 65 -54 121 86 -14 -9 34 30 31 46 25 14 -16 -25 88 81 -7 -6 -63 -8 36 112 -6 112 -166 91 -30 -43 4 92
7593 92 29 -64 -28 -27 66 50 146 47 60 0 -46 -5 -9 55 -48 50 57 -2 -57 -27 93 -17 14 21 -80 -63 -54 71 -32 66
7623 66 4 -45 46 -110 34 111 17 -81 -49 -4 -59 -31 96 19 4 58 -65 -66 44 -29 61 -33 -12 -19 55 -15 -43 73
7651 73 26 139 -31 -73 -42 27 86 -47 -35 65 5 -72 71 -12 23 8 -51 -14 -88 140 22 -29 180 -85 -7 -20
7677 -20 -6 18 13 -57 -52 8 42 24 -18 -58 88 54 44 7 96 50 30 -89 -53 78 -7 79 -39 41 -18 -7 -46 -1 -69
7706 -69 20 67 53 62 -35 101 74 18 -3 0 -65 -69 166 -86 33 -72 -133 -129 -70 30 15 -142 -12 79 -48 15 18 39
7734 39 -19 -49 31 -64 88 43 -63 -58 27 14 65 99 -51 34 -19 13 110 123 -1 -20 52 -69 -85 -114 19 -108 -52
7761 -52 70 -43 -21 -75 -54 45 82 59 11 42 14 -3 119 1 22 -50 68 18 37 0 -70 18 164 35 61 55 15
7788 15 16 -41 67 39 116 -34 70 22 79 -12 94 12 9 -47 64 -125 -55 -14 -21 -36 41 69 -20 -18 -35 62 -34 4 -78
7817 -78 34 3 -92 -7 76 63 84 57 47 -70 -11 71 113 32 9 169 -21 76 13 -34 66 34 47 -14 -98 -66 13 16
7845 16 0 -30 -57 -61 -54 -4 55 -123 -83 -23 -47 77 46 62 113 -54 -87 102 101 54 54 -25 -7 7 57 55 27 63 -20 -90 -23
7876 -23 25 62 43 -5 43 -38 -3 -95 -128 -1 -23 125 44 -96 -54 -24 68 77 0 -33 -3 109 -27 -41 11 -55 -16 -74
7904 -74 28 17 47 23 -40 -19 -30 29 6 5 -30 24 17 33 0 -10 -9 -50 62 -10 -71 -67 7 -65 7 -16 -25 50 -32 17 -8 -37
7936 -37 4 28 36 -23 -96 52 -69 -69 -2 100 -83 54 31 -46 68 29 -35 -13 60 -17 89 75 -22 -14 97 69 29 52
7964 52 -64 149 59 -40 -44 20 -17 -18 -5 40 -9 -26 -1 -79 -10 -2 -1 -76 32 92 137 38 -7 -29 61 -4 -66 -6 -5 43 23
7995 23 56 154 102 -4 18 -52 71 -3 27 -46 53 -13 1 -124 -13 53 8 -30 40 -12 2 66 42 62 28 -34 -73 -41
8023 -41 -26 -57 -83 -16 -26 -96 16 -108 -49 62 82 -48 -63 24 51 -5 -114 -26 174 9 54 -10 55 -22 -73 -4 11
8050 11 104 33 -44 16 -54 18 8 -108 67 11 33 -11 21 -96 -43 -148 12 71 -117 60 4 50 -129 23 -76 55
8076 55 17 -2 -6 70 93 52 0 12 -37 1 4 -48 3 9 65 -55 76 62 -78 -56 -60 -97 -45 -109 3 40 -36 67 -20 -42
8106 -42 -25 52 89 -106 -45 59 -11 -16 16 139 15 -24 -20 45 -72 60 51 4 20 -9 -110 21 67 123 22 57 -4
8133 -4 -53 116 -75 -2 78 9 99 82 32 42 -2 29 87 15 23 21 31 5 -4 -90 74 136 -87 -35 -33 -102 -43 37 -11 149
8163 149 8 17 40 7 -140 -61 2 -31 46 22 93 82 67 -78 2 -74 28 -4 -23 -7 24 -42 -10 4 100 45 -20 -8
8191h
##END NTUPLES=NMR FID
##END=
