##TITLE=1H_DE-80H_X3
 200.13MHz, d2o
 8 sc
 
 19ns.26.2.2025
##JCAMPDX= 6.0         $$ Bruker NMR JCAMP-DX V2.0
##DATA TYPE= NMR FID
##DATA CLASS= NTUPLES
##ORIGIN= UXNMR, Bruker Analytische Messtechnik GmbH
##OWNER= pz
$$ XWIN-NMR		Version 3.5
$$ Thu Jul 17 14:19:51 2025 Russian Standard Time (UT+4h)  Yarkov@DPX200
##.OBSERVE FREQUENCY= 200.1313
##.OBSERVE NUCLEUS= ^1H
##.DELAY= (6, 6)
##.ACQUISITION MODE= SIMULTANEOUS
##.ACQUISITION SCHEME= undefined
##.AVERAGES= 8
##.DIGITISER RES= 18
##SPECTROMETER/DATA SYSTEM= spect
##.PULSE SEQUENCE= zg30
##.SOLVENT NAME= CDCl3
##.SHIFT REFERENCE= (INTERNAL, CDCl3, 0, 14.3821)
##AUDIT TRAIL= $$ (NUMBER, WHEN, WHO, WHERE, WHAT)
$$ ##TITLE= Audit trail, XWIN-NMR		Version 3.5
$$ ##JCAMPDX= 5.01
$$ ##ORIGIN= Bruker BioSpin GmbH
$$ ##OWNER= Yarkov
$$ C:/Bruker/XWIN-NMR/data/yarkov2/nmr/H-C/1/audita.txt
$$ ##AUDIT TRAIL=  $$ (NUMBER, WHEN, WHO, WHERE, WHAT)
(   1,<2025-07-17 14:18:57.34 +0400>,<Yarkov>,<DPX200>,
      <created by zg, POWCHK disabled, PULCHK disabled
       configuration hash MD5:
       00 E9 B6 7A A2 85 ED C7 34 08 36 98 17 FE 4E 26
       data hash MD5: 16K
       40 0A 77 7F AC D7 11 24 3A B5 DF 55 03 16 DB 98>)
$$ ##END=
$$ 
$$ hash MD5
$$ 37 FF 70 C2 6F 30 5E 82 4D 23 57 E9 89 28 06 80
##$RELAX= 
##$RELAX= 
##$RELAX= 
##$RELAX= 
##$RELAX= 
##$RELAX= 
$$ Bruker specific parameters
$$ --------------------------
##$DU= <C:/Bruker/XWIN-NMR>
##$EXPNO= 1
##$NAME= <H-C>
##$PROCNO= 1
##$TYPE= <nmr>
##$USER= <yarkov2>
##$AMP= (0..31)
100 100 100 100 100 100 100 100 100 100 100 100 100 100 100 100 100 100 
100 100 100 100 100 100 100 100 100 100 100 100 100 100 
##$AQSEQ= 0
##$AQ_mod= 1
##$AUNM= <au_zg>
##$AUTOPOS= <>
##$BF1= 200.13
##$BF2= 200.13
##$BF3= 200.13
##$BF4= 200.13
##$BF5= 200.13
##$BF6= 200.13
##$BF7= 200.13
##$BF8= 200.13
##$BYTORDA= 1
##$CFDGTYP= 0
##$CFRGTYP= 5
##$CHEMSTR= <none>
##$CNST= (0..31)
1 1 145 1 1 1 1 1 1 1 1 1 1 1 1 1 1 1 1 1 1 1 1 1 1 1 1 1 1 1 1 1 
##$CPDPRG= <>
##$CPDPRG1= <>
##$CPDPRG2= <>
##$CPDPRG3= <>
##$CPDPRG4= <mlev>
##$CPDPRG5= <mlev>
##$CPDPRG6= <mlev>
##$CPDPRG7= <mlev>
##$CPDPRG8= <mlev>
##$CPDPRGB= <>
##$CPDPRGT= <>
##$D= (0..31)
0 0.7 0 0 0 0 0 0 0 0 0 0.03 0 0 0 0 0 0 0 0 0 0 0 0 0 0 0 0 0 0 0 0 
##$DATE= 1752747536
##$DBL= (0..7)
120 120 120 120 120 120 120 120 
##$DBP= (0..7)
150 150 150 150 150 150 150 150 
##$DBP07= 0
##$DBPNAM0= <>
##$DBPNAM1= <>
##$DBPNAM2= <>
##$DBPNAM3= <>
##$DBPNAM4= <>
##$DBPNAM5= <>
##$DBPNAM6= <>
##$DBPNAM7= <>
##$DBPOAL= (0..7)
0.5 0.5 0.5 0.5 0.5 0.5 0.5 0.5 
##$DBPOFFS= (0..7)
0 0 0 0 0 0 0 0 
##$DE= 6
##$DECBNUC= <off>
##$DECIM= 32
##$DECNUC= <off>
##$DECSTAT= 4
##$DIGMOD= 1
##$DIGTYP= 9
##$DL= (0..7)
0 120 120 120 120 120 120 120 
##$DP= (0..7)
150 150 150 150 150 150 150 150 
##$DP07= 0
##$DPNAME0= <>
##$DPNAME1= <>
##$DPNAME2= <>
##$DPNAME3= <>
##$DPNAME4= <>
##$DPNAME5= <>
##$DPNAME6= <>
##$DPNAME7= <>
##$DPOAL= (0..7)
0.5 0.5 0.5 0.5 0.5 0.5 0.5 0.5 
##$DPOFFS= (0..7)
0 0 0 0 0 0 0 0 
##$DQDMODE= 0
##$DR= 18
##$DS= 0
$$ [...]
##$SUBNAM2= <"">
##$SUBNAM3= <"">
##$SUBNAM4= <"">
##$SUBNAM5= <"">
##$SUBNAM6= <"">
##$SUBNAM7= <"">
##$SUBNAM8= <"">
##$SUBNAM9= <"">
##$SW= 18.0517328524113
##$SWIBOX= (0..15)
0 0 2 0 0 0 0 0 0 0 0 0 0 0 0 0 
##$SW_h= 3612.71676300578
##$TD= 16384
##$TD0= 1
##$TE= 0
##$TE2= 300
##$TE3= 300
##$TEG= 300
##$TL= (0..7)
0 120 120 120 120 120 120 120 
##$TP= (0..7)
150 150 150 150 150 150 150 150 
##$TP07= 0
##$TPNAME0= <>
##$TPNAME1= <>
##$TPNAME2= <>
##$TPNAME3= <>
##$TPNAME4= <>
##$TPNAME5= <>
##$TPNAME6= <>
##$TPNAME7= <>
##$TPOAL= (0..7)
0.5 0.5 0.5 0.5 0.5 0.5 0.5 0.5 
##$TPOFFS= (0..7)
0 0 0 0 0 0 0 0 
##$TUNHIN= 0
##$TUNHOUT= 0
##$TUNXOUT= 0
##$USERA1= <user>
##$USERA2= <user>
##$USERA3= <user>
##$USERA4= <user>
##$USERA5= <user>
##$V9= 5
##$VALIST= <valist>
##$VCLIST= <CCCCCCCCCCCCCCC>
##$VD= 0
##$VDLIST= <DDDDDDDDDDDDDDD>
##$VPLIST= <PPPPPPPPPPPPPPP>
##$VTLIST= <TTTTTTTTTTTTTTT>
##$WBST= 1024
##$WBSW= 4
##$XGAIN= (0..3)
0 0 0 0 
##$XL= 0
##$YL= 0
##$YMAX_a= 934752
##$YMIN_a= -738668
##$ZGOPTNS= <>
##$ZL1= 120
##$ZL2= 120
##$ZL3= 120
##$ZL4= 120
##$ABSF1= 10
##$ABSF2= 0
##$ABSG= 5
##$ABSL= 3
##$ALPHA= 0
##$AQORDER= 0
##$ASSFAC= 0
##$ASSFACI= 0
##$ASSFACX= 0
##$ASSWID= 0
##$AUNMP= <proc_1d>
##$AZFE= 0.1
##$AZFW= 0.1
##$BCFW= 1
##$BC_mod= 2
##$BYTORDP= 1
##$COROFFS= 0
##$CY= 83.5205535888672
##$DATMOD= 1
##$DC= 2
##$DFILT= <>
##$DTYPP= 0
##$F1P= 10.8118882576601
##$F2P= -7.23987719738617
##$FCOR= 0.5
##$FTSIZE= 0
##$FT_mod= 4
##$GAMMA= 1
##$GB= 0.15
##$INTBC= 1
##$INTSCL= 1
##$ISEN= 128
##$LB= 0.25
##$LEV0= 0
##$LPBIN= 0
##$MAXI= 10000
##$MC2= 0
##$MEAN= 0
##$ME_mod= 0
##$MI= 1.114404
##$NCOEF= 0
##$NC_proc= 0
##$NLEV= 6
##$NOISF1= 3.799351
##$NOISF2= 2.8
##$NSP= 1
##$NTH_PI= 0
##$NZP= 0
##$OFFSET= 14.38212
##$PC= 1
##$PHC0= -1362.974
##$PHC1= 20.39091
##$PH_mod= 1
##$PKNL= yes
##$PPARMOD= 0
##$PSCAL= 0
##$PSIGN= 0
##$REVERSE= no
##$SF= 200.129724274929
##$SI= 16384
##$SIGF1= 3
##$SIGF2= 2
##$SINO= 400
##$SIOLD= 16384
##$SREGLST= <1H.CDCl3>
##$SSB= 0
##$STSI= 0
##$STSR= 0
##$SW_p= 3205.1282051282
##$SYMM= 0
##$S_DEV= 0
##$TDeff= 0
##$TDoff= 0
##$TI= <>
##$TILT= no
##$TM1= 0
##$TM2= 0
##$TOPLEV= 0
##$USERP1= <user>
##$USERP2= <user>
##$USERP3= <user>
##$USERP4= <user>
##$USERP5= <user>
##$WDW= 1
##$XDIM= 8192
##$YMAX_p= 0
##$YMIN_p= 0
$$ End of Bruker specific parameters
$$ ---------------------------------
##NTUPLES= NMR FID
##VAR_NAME=  TIME,          FID/REAL,        FID/IMAG
##SYMBOL=    X,             R,               I
##VAR_TYPE=  INDEPENDENT,   DEPENDENT,       DEPENDENT
##VAR_FORM=  AFFN,          ASDF,            ASDF
##VAR_DIM=   8192,          8192,            8192
##UNITS=     SECONDS,       ARBITRARY UNITS, ARBITRARY UNITS
##FACTOR=    0.0002768,     1,               1
##FIRST=     0,             0,               0
##LAST=      2.2672688,     0,               0
##MIN=       0,             -738668,         0
##MAX=       2.2672688,     934752,          0
$$ Real data points
##PAGE= N=1
##DATA TABLE= (X++(R..R)), XYDATA
0@%%%%%%%%%%%%%%%%%%%%%kOqQj0J4j8K1k6L3m0M9n7O6p8R0j04J21j39J58j77
42i3J97k23K53k83L15l50L89m31M73n19N71o24O78p36P95q52R03r47R73r65Q97
63D21p14L04N83k588P717k4808J65179P88658r97511o75909R80817M23q20891
76e78319L83694N17827o96937k09221Q16930l4206p27709L36897O20089l73859
86E5186l24296L84203J21964k73757j4164J37952j08670q1313K78792J41606l90897
97g3394j66523L93787Q8435l40355O5K04538j34235j43277J83520M2254k05458
108a50643J15175K19331k35540j20749L02664l2864k61354J49896J31657j34373
118a6800P8229Q8022k22043j6317K94440m3794k80947J19247J85548k18690o5729
$$ y = [0, 0, 0, 0, 0, 0, 0, 0, 0, 0, 0, 0, 0, 0, 0, 0, 0, 0, 0, 0, 0, 0, -2, 4, -4, 4, -6, 8, -10, 11, -15, 18, -22, 27, -30, 36, -42, 48, -56, 65, -74, 84, -93, 104, -119, 134, -149, 166, -184, 205, -226, 247, -272, 299, -325, 353, -383, 412, -440, 463, -484, 489, -476, 421, -293, 11, 594, -1994, 5723, -19085, 146094, 934752, -62759, -738668, 242149, 242572, -578319, -194625, 323202, -373735, -582956, 233974, 199768, -527941, -191044, 429045, 55186, -269110, 115093, 237057, -36700, -50864, 87088, -21582, -102895, 175897, 317503, -73394, -239917, 153870, 242305, -98050, -97985, 106553, -27682, -170959, 12561, 54815, -150643, -35468, 183863, -51677, -172426, 130238, 97374, -163980, -14084, 117573, -16800, 61429, 149451, -72592, -88909, 205531, 161737, -119210, 37, 185585, -33105, -98834]
129i8834K18765j12787j36633K53639q416l34450P6577K65721j39982j95063J51195
140f0268J29115j33277k8619J33836o4945r1762J75917P4646k07470n8856J97362
151F5679O8739j75537n9108J94712M4058j66833L1609Q4979j48865j9058J92727
162A13102n7723k07117Q7596J75143j19149j27296J62695P5542j59940J4888J11466
173F9207j00983l6913J37121j6902j07171N3344R8372k9572r0291K057P3019n31
185E0757n0196o750J1427n756k5137O260M6791l2996m5858P5621j739j14532M7698
198d4410J02933p3153o7184P1001M5206m7931j6204N1079q875m1071N6468K3562
210E1421q5536j562O7130j5100l6442P086K5441Q447l5712o525L3782k4010j5711
$$ y = [-98834, 119931, 7144, -129489, 124150, 115734, -218716, -142139, 123582, -16400, -211463, -60268, 68847, -64430, -93049, 40787, -24158, -115920, 59997, 134643, -72827, -131683, 65679, 134418, -41119, -100227, 94485, 138543, -28290, 3319, 88298, -60567, -79625, 113102, 55379, -151738, -64142, 111001, -8148, -135444, 27251, 102793, -57147, -42259, 69207, -31776, -68689, 68432, 51530, -55641, -2297, 96075, 66503, -23788, -21731, 51288, 50757, 561, -6189, 5238, -518, -25655, -19395, 27396, -5600, -51458, 24163, 22424, -92108, -44410, 58523, -14630, -81814, -10813, 34393, -13538, -29742, 21337, 12462, -28609, 27859, 51421, -34115, -35677, 31453, 16353, -20089, -13003, 12438, 20885, -14827, -21352, 12430, -11580, -27291]
223b7291M4185j2442m3975J7069L2240k130k2606P621L6555j4903j9713L5335
235B9945k552k1959K2362o224j2244J9773j8803j0426K6836k0413k2658K6913
247A0550N341l0499j6318K0527N523m1081J5206M7828n5059k9711P9636Q46n5697
260d2908L8552L6783l7160j1996M7658J5957n8299n855P1295k4167o3541N2775
272A9094K8895o5529l189M8823j3435m5268R887M2519l1680m7909N6812K8028
284B7048o8426J1274N9591l1959k7405M3806J8929l6679j3241M4532M148n3240
296b1622K1706M3233n0262j8086N2322q678l4923J6143J7050j7389k0029J9727
308h08J7930l7766r167L7505j7354k1292L1843l9k3413J0949J3334n46m193M382
$$ y = [-27291, 16894, 4452, -39523, -22454, 9786, 7656, -14950, -7329, 29226, 14323, -5390, 29945, 27393, 5434, 27796, 21572, 9328, 29101, 10298, -128, 26708, 6295, -16363, 10550, 15891, -14608, -30926, -10399, -4876, -45957, -30751, 17077, -37982, -67693, 11943, 12789, -42908, -4356, 32427, -4733, -16729, 30929, 46886, -11413, -17268, 54027, 29860, -33681, 19094, 47989, -17540, -20729, 28094, 14659, -30609, -20722, 21797, -9883, -57792, -980, 27048, -41378, -30104, 29487, -2472, -29877, 13929, 32858, -3821, -17062, 27470, 31618, -21622, 84, 43317, -6945, -25031, 27291, 18613, -16310, -167, 16883, -506, -20535, -808, 17122, -20644, -29811, 7694, -9660, -30952, 891, 852, -22561, -11612, 1722, 1176, -3017, 1365]
322A365J0136j5288j690L3735r310k3890K2355K366j5827J9385N908k3036q792
335b583J1017Q810j7949j4092J6675j1622k1623K9835O605l4232R321K3689j1442
348g591p489J4720J0035j7379r841L0299J157l1079K1026J8259l4787J255L2446
361B1031j1393k3355O195J2436j0273r950K1179k247l4804K0402L5769k5134j2170
374a2314K1623l180m763J4429J772j6317q333J9078Q024k5613K201J8938j7936
387b391k684K0395j3426j1067J5817r40j4760J594J7479J51k6221M928K5773j5000
401c52o805K1796j6290j7485K7293Q122k5740n829K0454L591k2367N385K3648
414A5421k0949j2593L1612o805k4972K2149Q642k9049m411K4360O372k4801j0055
$$ y = [1365, 11501, -3787, -5477, 28258, 18948, -4942, 17413, 19779, 3952, 23337, 29245, 6209, -2583, 8434, 17244, -705, -14797, 1878, -9744, -31367, -1532, 5073, -29159, -19838, 3851, -7591, -15080, -360, 9675, -7704, -17545, 12754, 13911, -17168, 3858, 22117, -12670, -11415, 21031, 9638, -13717, -7522, 4914, -5359, -15309, 5870, 3623, -31181, -10779, 24990, -144, -12314, 9309, 6129, 1366, 15795, 17567, 1250, -7083, 11995, 20019, -5594, -3393, 15545, -2391, -5075, 15320, 1894, -9173, 6644, 5704, -9056, -7462, 10017, 10168, -16053, -11125, 14648, -352, -7157, 14639, -1651, -19136, 8157, 16279, -9461, -15290, 5164, 8755, -13612, -8227, 15421, -5528, -18121, 13491, 6686, -18286, 3863, 12505, -16544, -20955, 3405, 9777, -15024, -25079]
427b5079K3140Q80j4708J1737j059j1184J7772P176j4530j070P497J4728Q266
440B3566j7470n040J7566O139o474j2537j249J5902n965j3122O654r764q283K1514
454A1437m762k7602R669K3175j1837k9823R122L7321j0285k6068K5046L922l0124
467b0809K6849L0825m0476k3719M1160J4997m3902r384M5985r152m6761L0559
479c828L2102m4752j1207L3064j9805k0234L8673J5782m7244j9734N0171K1546
491B4534l8199L1K4696j8431j124K7639j5258j9624K5836J9708j7292j5526J7335
504A4325J8344j8141j7422Q894R769J2031m642l8512m139L9010O755k0913j1009
517e650j0313q63K0667Q814l2027k3587M2777L1483m8911j8368M8941m305l4768
$$ y = [-25079, -1939, -1059, -15767, -4030, -5089, -16273, 1499, 8675, -5855, -6925, 572, 15300, 23566, 6096, 1056, 18622, 24761, 18287, 5750, 4501, 20403, 14438, 1316, 7970, -1794, -10077, 11437, 6675, -20927, -11258, 11917, 80, -29743, -20621, 16700, 6415, -19653, 5393, 9315, -20809, 6040, 36865, -3611, -27330, 13830, 28827, -15075, -24459, 21526, 12374, -34387, -3828, 28274, -16478, -27685, 5379, -14426, -34660, 4013, 19795, -27449, -47183, 2988, 24534, -13665, -13634, 11062, -7369, -8493, 19146, 3888, -15736, 10100, 29808, 12516, -3010, 14325, 32669, 14528, -2894, 6000, 15769, 27800, 23158, -15354, -19493, 19517, 26272, 5359, -5650, -15963, -16826, 3841, 12655, -19372, -42959, -182, 31301, -17610, -35978, 12963, 8658, -26110]
530b6110K6486J6001l7298L730M3308k3205m8919M9085N6959o5095m6548O4952
542A3346R513o0543K3681M1782m9293k1352O7662Q822p3555J1784P6921l1529
554A7239o1838N3179L2804o6052n544O4035q412m1724K8228K6334m6129j4602
566b2482N7927m497o4538J9485N2312l0491l2071L0343J3323k2327M531J9446
578B0961k1788k6308K5889J6697l4126n414L4074k12k2766l741P900J0978K912
591E056j3080r532O248J1530K228o008l14R99O015J9941j0049l7821J2532L6032
605B3777j9361k3951K3489J0396k4611M5K5363j1422k2094K9784J4312m8243l721
618b6237N3420r230m2519K2518L2770k4956j8774K8403J643l8788J2897M1371
$$ y = [-26110, 376, 16377, -20921, -17191, 26117, 2912, -46007, 3078, 60037, -5058, -51606, 13346, 22859, -37684, -14003, 27779, -21514, -42866, 24796, 33618, -39937, -28153, 48768, 17239, -44599, 8580, 41384, -24668, -30212, 33823, 25411, -16313, 11915, 38249, -7880, -22482, 35445, 30948, -33590, -14105, 38207, 7716, -24355, 5988, 19311, -3016, 1515, 20961, -827, -27135, -1246, 15451, -18675, -24089, 9985, 9773, -12993, -16734, -8834, 2144, 5056, -8024, -17556, -11308, 222, 2450, -3558, -3872, -2873, 3142, 23083, 13034, -24787, -12255, 23777, 4416, -19535, 3954, 14350, -10261, -10216, 15147, 3725, -18369, 11415, 25727, -22516, -26237, 27183, 17953, -24566, -2048, 30722, 5766, -13008, 15395, 17038, -21750, -8853, 32518]
630C2518l0393l5813L8546J9023m0903k862M0219l885l5952R851K7243k2070j5080
643a9558L4894J329l6005J4377K9843k2524k2829K1257J5784k0949j1338J9531
655C812j04k0587J0129J5248j4469m861J5406R25j3576l905J5227R703j4534n722
669g308J4378q73j0935N019P421n051p341N787Q245j2895p278J8945J350j8227
683h763O320J3798r259r903Q069Q734q390o267J3818N44j8545N458J5657j0999
697B72r983J1029N442j2776n776J5369M624j7502K758J7411r891j1271J3993M724
711H423j2040n19J1611m07j3756J526J3860p167j1523J0136N164r539j827N978
725h0J029n953M89J1064k458j3299P854J1786r636n337J0416J983j0709j183J2037
$$ y = [32518, 2125, -33688, 4858, 23881, -17022, -19884, 20335, 16450, -19502, -9651, 17592, -4478, -19558, 15336, 16665, -19340, -4963, 24880, 2356, -20473, 784, 16568, -4381, -15719, 3812, 3708, -16879, -6750, 8498, -5971, -10832, 4574, 5499, -8077, -11982, 3245, 12948, -1586, -7308, 7070, 6197, -4738, 281, 7702, 2651, -4690, 1097, 9342, -3553, -10831, 8114, 9464, -8763, -2443, 11355, 2096, -7807, 262, 8996, 606, -5661, 8157, 8701, -9844, -4386, 11271, 272, -9711, 1318, 6760, -6016, -11792, 3577, 8201, -9301, -6543, 10868, 977, -10294, 3699, 8423, -3617, -4136, 7475, 7068, -6688, -5162, 8698, 1531, -9992, 144, 5308, -4231, -6058, -80, 949, -5004, -4515, 6549, 4091, -9208, -1354, 10432, 796, -4541, 5875, 7858, -2851, -4034, 8003]
740H003j750j5258O517J1989j3676o268J5310k84j4058K287J2727j757j1312M946
754b584R708j0346m963J5702P06j4793K045J0482l143q185M905P054j0487o378
768a0277J5187K290j4654L084J0368o021m423Q590L611j0159l534J2677K549j2034
782b746K236P318p398l512P609J460p582l848O405L894p430n26P330m535n245
797f570P002M063n139l719L963L667m764q00P230m358q514O423N634n419l742
812e043K237K159j918l92O239j411q323M762Q556m228m933L552L249k882k205
827e81O120Q59j0229J560R663o244o686O774K097p603p15Q322Q97q922J693R013
843F018n597m541R465r8j0107K816Q109k459p231K182N689n708l578Q355j280
$$ y = [8003, 6253, -9005, -2488, 9501, -4175, -10443, 4867, 4583, -9475, -7188, 5539, 3782, -7530, -2584, 7124, -3222, -8185, 7517, 8223, -6570, -4525, 5957, 2814, -5371, -466, 6588, -3899, -10277, 4910, 7200, -7454, -4370, 5998, -23, -4446, 4144, 7755, -2404, -5938, 6739, 9288, -2746, -510, 6808, -590, -4102, 3507, 4967, -2615, -6463, -58, 3836, -3594, -4120, 3210, -1325, -6570, 432, 4495, -644, -4363, -400, 3267, -1497, -2297, 4933, 575, -7939, -1516, 4118, -1301, -5043, -2806, -647, -2565, -2957, 3282, 1871, -6452, -1690, 6866, 2638, -2295, 1257, 4506, 1624, -581, 5539, 6398, -3831, -2271, 7392, 1148, -5538, 1236, 3333, -4270, -4985, 3337, 4234, -4688, -2995, 6018, 421, -4120, 5345, 5247, -4860, -2044, 6065, 3606, -3625, -1443, 4246, -1462, -5040, 3315, 2035]
858B035r997M464O790n347k651M620J696m284j12O595j335p007L801M393n170
873a509j47L409k736j358K262M80j316j686J701J976k287K04J693p46J813J65
889A918k952K727K272l497kJ839j697l46J327q24k603j55M617j070o677L878N839
906D594m668j682M465j513j649L623J479m166k371N687R72p463Q09N992n261l813
922d965N032l32m128J152J439k340n76N230P17p508R45Q780j792m437L197j90
938B24j901L916P43n140n52N252P14o353R6O244k363l685L795j96j876N377p3
955D222p300Q23Q479J426p427k397N005Q0j447K299m052m779O787L694p699l321
971e607N003K491l142r71K637q38j188L162j625l302N317K910o583k405L536J370
$$ y = [2035, -7962, -3498, 3292, -2055, -4706, -86, 1610, -2674, -2786, 3809, 2474, -4533, -732, 3661, -1509, -1656, 1753, -983, -2341, -79, 401, -915, -2601, -900, 1076, -1211, -1007, 686, -60, 1753, 1918, -1034, 1693, 3965, 468, 466, 2305, 608, 262, 1589, 765, -1838, -1993, 2624, 1554, -5123, -1245, 4594, -74, -1756, 2709, 1196, -453, 3170, 4649, 483, -1888, 3799, 4771, -2692, -1883, 4109, -1152, -4965, 67, -265, -4393, -3241, -1802, -4142, -4718, 512, 1229, -6279, -5334, 3446, 1654, -2783, 414, 224, -1677, 2239, 2982, -2158, -2710, 2542, 3256, -3097, -3001, 3243, 880, -2805, 990, 794, -1082, 4295, 4222, -3078, -2255, 6224, 7650, 223, -2174, 2831, 2911, 1464, 3763, -289, -5068, 1719, 5413, -2286, -5607, -604, 1887, -1255, -2226, 411, -427, -1615, 1547, -78, -3380, 1937, 4847, -1736, -4141, -605, 765]
987G65j004j421j278o83K167K422l768l305N487K136m093J993K767l611K70M358
1003C202q48k385L297K023o709k347R067N13r760J743O636m901k595N611k048
1018D99n568N780O800p863o917J0088M888j0767k12J0014l355o505M762Q60o929
1033d425K534Q599n637j0879O503R844p900o171P631K401m692K269J857n493n85
1048d144P539J760q160r67P386j136o410J861L426r90p11m20j390k36K188K070
1064A666q33k123J719K623j059k486o41L797K532m376k145L851j201l751K854
1079D27K241l894j042M141j406o110L199Q092m863o118P520L156q223J0P500k076
1095B554n387M449L508q558k755R882j45j0394L643Q371o443o311O604L687n746
$$ y = [765, -239, -1660, -2938, -3621, -1454, 968, -2800, -6105, -618, 1518, -2575, -582, 2185, -1426, -1156, 3202, 2354, -31, 3266, 5289, -1420, -3767, 5300, 5813, -3947, -2204, 4432, -469, -3064, 2547, 499, -5069, 711, 7511, -352, -7269, 2819, 7707, -3060, -3272, 6742, 3387, -3118, 1644, 2504, -4425, -1891, 6708, 1071, -9808, -3305, 6539, -1361, -7532, 99, 2500, -2192, 77, 1934, -3559, -4144, 3395, 5155, -3005, -3972, 3414, 2278, -4132, -2271, 1155, 165, -546, -966, -2356, -2592, -404, 1666, 833, -1290, 429, 3052, 1993, -493, -1134, 2663, 5195, 819, -1326, 2525, 1324, -2427, 427, 2668, -1226, -2268, 1873, 467, -5643, -2444, 5648, 785, -5333, 2187, 5343, -2880, -2870, 4630, 2554, -2833, 1616, 5124, -3434, -6189, 3693, 3548, -6846, -3203, 5168, -1275, -7586, -982, 2705, -3041]
1110c041M81P063l120p261O034O081p522k527Q327M52p817J37N352j975l828L764
1126F00K726n781j256N888r02m590L207M535k328l886J637L293k591j725L523
1141B350P07l969j10K344j580k497J769L132k669l809K936K813l875n33N154K54
1157B417l944N54L216j485l247L454L125m912k028N329o11n568J613M843k055
1172G01m018K586K520m277p20O453j50n191K423L981l415k908L708K395m390j747
1188b049M389o30n133J885L881l205k182L517R98m220j077M781R94l909J350L742
1204C132l014k609L788J957l699j490L506K71m366O75L834k311l108L699K159
1219B424l867j324L604R58l057J102L858k442l677L250K839l594j415L185j25
$$ y = [-3041, -2560, 4503, 1383, -5878, 156, 6237, -1285, -3812, 4515, 4967, -2850, -2713, 2639, 664, -3164, 600, 3326, -2455, -3711, 2177, 1275, -3315, -108, 4427, 2099, -1787, -150, 3143, 552, -1173, 2350, 3057, -912, -1022, 1322, -258, -2755, -986, 2146, -523, -4332, -1396, 1417, -2458, -2991, 2163, 2417, -1527, -973, 2243, 758, -2489, 965, 4090, -822, -2850, 2479, 1868, -3700, -2087, 2756, 701, -3317, -731, 1789, -2488, -3208, 3245, 3095, -2096, 327, 4308, 893, -2015, 1693, 4088, -302, -2049, 2340, 1710, -3423, -1538, 2343, -862, -3044, 473, 1471, -2749, -3826, 955, 1949, -1960, -610, 3132, 118, -2491, 1297, 3254, -445, -1935, 1571, 1842, -2524, -1849, 1985, -326, -3434, 265, 2424, -1443, -2767, 837, 1795, -1262, -160, 3698, 1256, -2421, 829, 3668, 74, -1341, 1844, 1719]
1234A719l574L36L473j867l744K996K860l562j432L744J33l067J317L886j341
1249A877l893K004K844l243j360L504o27m003J072L262j250l392J895K827k832
1264a315j712L941K38l893J586M189j190k769J921K293k957j583L535Q8m502M51
1280a679L412j442k703K164K124k818j655L606J039m252K17M126r78k533K647
1295A275J961k847j758L069R27m283n53L266j339k803K505K315k995j410L656
1310I86P32l480L7L514j044k888K901K396l193j209L307K72l555j6K747j740l270
1327c503K550K261l068p58L551o4k634J176K555j563k194K134J998k504q82K962
1343B017k10k429Q29J614j868j899J331J123j980p41K492M31j815R18J751p89
$$ y = [1719, -1855, -1519, 1954, 87, -3657, -661, 2199, -1363, -2795, 949, 1082, -1985, -668, 3218, 1877, -2016, -12, 2832, -411, -1771, 1733, 1106, -2897, -1825, 1437, 187, -3205, -1310, 1517, -1315, -3027, 914, 1152, -2741, -1155, 3034, 1844, -925, 996, 3289, 332, -1251, 2284, 2372, -2130, -1679, 1733, 291, -2412, -248, 1876, -942, -2597, 1009, 2048, -2204, -1987, 2139, 1161, -1372, 1275, 3236, 389, -1369, 1700, 2627, -1656, -2209, 1057, -282, -3085, -580, 1735, -1260, -2670, 986, 1718, -1762, -1725, 1789, 745, -2143, 758, 3154, -39, -1248, 2059, 2331, -1224, -1240, 1507, -233, -3503, -953, 1308, -1760, -2518, 1033, 969, -1665, -489, 2066, 503, -1691, 443, 2441, -63, -945, 2017, 1807, -622, 207, 1821, -47, -1946, -615, 508, -1472, -2213, 279, 710, -1105, -187, 1564, 775]
1359G75j172Q50J136j114j246J842M32k116J82J854r20k048P36J285j217j736
1375b477J743J219j794K39K383m27k029J600J785j933j594K049R44k504n66K547
1391A185p05k466J562J340k308p08K399J11k465Q68L010j115j971J953J627j882
1407D35k55J708p25j600R90J181j682j438J735O09j961k14J552m90r74P68O93
1424C32m45j9O99J92q65K35J023n79r56J00N01k55o35l94N40R2p16M05N07m53
1444f91l77J191K05o93L17J543n27j489J170J279j486p94J172k62j129K24O43
1461B96j068o56J500O61j964M9K011l80j309J224J023q78k78J028m34j185R51
1478E91R63j664r41J476rj554K37P43n00k20Q01l13n32O24J258o46o71J164J99
$$ y = [775, -397, 453, 1589, 475, -771, 1071, 1503, -613, -431, 1423, 503, -1545, -809, 476, -741, -2477, -734, 485, -1309, -1070, 1313, 886, -1143, 457, 2242, 309, -1285, 764, 1708, -796, -1362, 1185, 480, -1986, -424, 916, -1392, -2100, 299, 410, -2055, -1187, 1823, 708, -1263, 690, 2317, 435, 180, 1888, 1163, -437, 553, 1734, 52, -1386, 349, 958, -1003, -1217, 335, -155, -1129, -361, 332, -113, -132, 567, 759, -106, 129, 1152, 573, -383, -283, 218, -37, -672, -1066, -526, -434, -1150, -745, -238, -691, -1068, 123, 328, -365, -48, 1495, 968, -521, 649, 1928, 442, -352, 820, 558, -571, -347, 296, -772, -1428, 72, 733, -1231, -1182, 829, 449, -860, 364, 1387, 509, 231, 1259, 825, -360, 591, 1554, -110, -1051, 425, 416, -1138, -901, -158, -658, -878, -77, -390, -922, -298, 960, 314, -357, 807, 1006]
1497A006r99K93K80m11n7L05o69p69L51N61o46m22R69K55n60J93M00m56O84P96
1517A104l47n38L22M38n85n11N81J61p69j42R0p93J64P24l74j64L63K69k29j39
1537c75N06N37K0J61l2m17Q9K18o56n0L58l19o00Rj86k08L28N04j38m90O08M49
1559C16q41Q9J412j52p05N99O5j095J56P66r8j298L22R65j264p90J216M49q83
1578g71L41J087q24p33J266Q15r40j51J551n59j679N89J014j087n61J027j75j290
1596a080o7J080m62o85J064Q63j096l37J251j2n12L01R72n98p36M00K33p99l84
1615f04Q14J9j116p5N01j06l72L67R55m50m15P58K06n50J81J043j31p14k7N03
1635G87o55o47P14M10j189m18P73k70o60M82J121m08o83P48O49r62p7J360j71
$$ y = [1006, 7, 300, 580, 169, 112, 417, -252, -1021, -670, -109, -755, -1177, -208, 47, -513, -320, 80, -376, 308, 1104, 757, 219, 541, 979, 394, -117, 464, 625, -144, -286, -196, -989, -825, -101, -475, -639, -276, -7, -236, -375, 131, 668, 688, 849, 817, 400, 489, 707, 51, 1, 359, 40, -560, -551, -737, -945, -617, -113, -251, -741, -133, 316, -525, -436, 976, 824, 119, 718, 783, -312, -156, 610, 512, -786, -464, 501, -763, -1553, -337, 112, -771, -430, 657, -167, -900, 366, 1181, 241, 90, 1641, 1082, -597, -8, 1006, -81, -642, 385, 210, -1080, -1147, -67, -529, -1214, -150, 713, -383, -720, 531, 519, 7, 308, 1280, 682, -54, 346, 579, -220, -604, 210, 229, -887, -962, -461, -567, -939, -572, 383, -67, -482, 276, 482, -68, 113, 1156, 1025, 311, 284, 787, 132, -515, 199, 609, -580, -998, -225, -495, -1155, -673, 448, 40, -643, 105, 754, -208, -285, 1075, 904]
1654I04j002L60N49o59r20P43O15r93n55J044m83j068P75R52n38k68Q99L21o82
1673fj82J256o5r74L99Q09j021q11P59K97q58j78Q21k83j231L39J244n87m91J032
1693B69N32j023k4R98R6q77J55R06o86j120Q36L81j100j08P86k68q76P0J086l09
1713b76o48J063Q15j150R0R81k00p28M58P44o14r72O42O73j209n00J155k90j038
1732a004K80O23k16n66P85Q61n54n37J140O0j034L32P43m79n88K04L41l60p36
1751g05Q25J40j097K5J055o32o79Q62P66n08l77R90M89j163o2J206o49j060O63
1770H9L99p73n69P52N19j071k69J188k64j275Q00Q85o89k59J100N11r58mJ175
1789A287l66j306N46O94j366m88J109M6r65P3J226l08j322P71J155j230l59J388
$$ y = [904, -98, 262, 811, 152, -768, -25, 590, -403, -958, 86, -397, -1465, -690, 262, -276, -544, 355, 676, -6, -188, 1068, 1003, 29, 428, 1237, 216, -595, 164, 461, -397, -575, 246, -37, -1268, -929, 315, -272, -763, 269, 801, -222, -246, 752, 848, -29, 126, 1032, 346, -774, 62, 443, -657, -765, 21, -247, -1123, -1053, 33, -276, -924, 139, 954, -196, -106, 875, 675, -53, 405, 1149, 535, -437, 205, 878, -331, -831, 324, 34, -1004, -724, -101, -317, -883, -98, 763, 209, -328, 812, 872, -162, 170, 913, 434, -154, 50, 391, 31, -705, 120, 260, -837, -812, 243, -389, -1068, -206, 560, 52, -325, 665, 1154, -9, -71, 1135, 486, -574, 89, 488, -285, -854, -102, 417, -654, -923, 265, 1, -1274, -474, 411, -278, -537, 563, 1074, 116, 112, 1287, 921, -385, 161, 855, -511, -999, 110, 156, -809, -736, 490, 182, -1140, -369, 786, -444, -803, 585]
1807E85J59r48L74J023l19j124N58Q10j504o87J254j70j141M19R50m73o79O50
1825b63Q00q76m92J451j89r14P62P72p29k23M09K54o64n55M24J05j071K97N50
1844a52m66K1L21N02j41l72M76O77q11k42R45j22o32K75M40j48p22p1P42r30p42
1865a152J046Q7j083M42J109m36n02N25Q87o41p19J405p8j436N31J135j192p06
1883g78J104O7j131l97J382l10j395Q78J110j209p5J446k84q08O83P50n31q26
1901c24O50P96j308k88J090p05o03O84j98l90J06J99K53k57l00R31J30p10N85
1920C41M02k99J89l34m4K70o35mM87p35k87O43l46j23r5L39M56p42j24J311n30
1941A40m84R83O4j006O04N14n10p19L76P25j028o32J334l40j310R99O70j130J33
$$ y = [585, 744, -204, 170, 1193, 874, -250, 308, 1118, -386, -1073, 181, 11, -1130, -711, 239, -234, -913, -263, 537, -339, -831, 620, 431, -483, 279, 1051, 322, 99, 508, 762, 98, -457, -33, 72, -999, -702, -152, -618, -597, -276, 226, 85, -287, 189, 866, 55, -187, 758, 636, 4, 279, 719, 571, -151, -222, 520, -410, -1152, -106, -19, -1102, -660, 449, 13, -489, 36, 923, 282, -437, 968, 890, -546, -15, 1120, -72, -778, 326, 393, -738, -1135, 247, -63, -1458, -580, 530, -679, -754, 692, 408, -400, 283, 1033, 502, -324, 326, 1122, -186, -474, 616, -89, -692, -8, -206, -596, -490, -291, -38, -295, -595, 336, 466, -244, 341, 743, 444, 633, 299, 255, 525, -110, -114, 373, -362, -649, -6, -352, -475, -570, -231, 225, -517, -641, 670, 140, -344, 639, 703, -303, 301, 815, 305, -414, -38, 687, -341, -973, 361, 21, -1289, -290, 380, -750, -617]
1960f17R78l5p57K18J305l08j196R29N42j256K74N88q30k29M57j50j65l64L43
1979b73M63r06K75Q78o52J21O50m47K68K95m01P2K7p5N5m68j02K05m20J13J88
2000a34p07M22N98p24M2Q09l76L5M86r9j05k92O31K34j207L22R79j148n11J032
2020B87k78p06M46J17p1n42P80M18j069L25J276o63p11J332k58p14N71k7l61n50
2040c98K78M60r53k12J095m12p57R47L2o78N40K30m6j08J23N36m76n28J102m36
2060C39p96Q61m6r87L78K13m86j50L61L07m13j90R64m9r23J127K98j153O86M43
2080G84o77o5J84J72l54n70M23J91j007O12N79r96L22O91o09J55M23J9J36m53
2100d0K63N11r16K21O82q18j61O97p66J5L13n01K87K0k20L97k64j48O67l09P8
$$ y = [-617, 361, 326, -431, -213, 1092, 784, -412, 517, 1059, -197, 77, 665, -165, -394, 63, -87, -252, -616, -273, 190, -716, -441, 437, -215, -94, 556, 109, 377, 672, 271, 343, 370, 295, 350, -118, -220, -15, -435, -322, -134, -841, -419, 179, -545, -503, 306, -70, -35, 451, 352, 247, -45, 586, 820, -387, -65, 914, -234, -745, 287, 9, -697, -251, -134, -205, -747, 33, 451, -618, -293, 983, 320, -391, 941, 683, -31, 540, 513, 152, -398, -120, 340, -613, -825, 270, -142, -899, 48, 80, -598, -58, 172, 126, 18, 141, 677, 201, -327, 775, 339, -457, 404, 358, -629, -251, -38, -524, -674, -313, -6, -419, -609, 355, 306, -617, 510, 808, -345, 341, 784, 107, 42, 226, 398, 44, -526, -103, 88, -919, -307, 272, -724, -402, 289, -320, -165, 258, 277, 413, -40, 223, 734, -182, 39, 721, -97, -258, 439, -327, -312, 1, -500, -213, -193, -413, -16, -280, -428, 239, -70, 8]
2121HQ55q67P0Q36p01k03M43l25j88j57j85O09o90l16J135o51l42J152l90n35
2141d42O56j34R4K29k19K96l42l36R03m03r15Q33j21p72K66J89k29J03l59O84
2161a9K65j015O97Q35q78K77N83m67j69K07j03J30n23oO07q39o2P99p34oO94m76
2183b03J90r6m2N23k73k58R98n43l78P69l68k48J52l75P6o2o42N80J70q57N45
2204c42M83m36K72n1NM29l74K16L97m80J7L81n52J76J45m30K94j57m40M71k21
2225a97l77N74j50j27N20l52J63K42l17M86K1o50O22p0q29N32R8m86K14k71M9
2246c05K60p77N01P56r68J64P64m45J47J5J27N24o63n9Q32r35m67J240o17o47
2266e53O94k55j80k19nP63o00m38J401m31q47J137K10p75K32J68Q5m39l97R66
$$ y = [8, 863, -4, 66, 902, 201, -2, 441, 116, -72, -229, -414, 195, -495, -811, 324, -327, -669, 483, 93, -442, 214, 80, 174, 403, 184, 480, 138, -198, 705, 302, -613, 220, 99, -673, -407, -218, -447, -344, -703, -19, 246, -769, -72, 763, -115, 162, 745, 278, 109, 316, 213, 343, -180, -186, 421, -418, -480, 319, -415, -421, 273, -203, -13, -109, -151, 372, 99, -159, 839, 296, -82, 687, 319, 71, 223, -152, -76, -138, -780, -200, -30, -887, -342, 141, -295, -23, -74, -69, 360, -14, 202, 599, 119, 136, 517, -35, 141, 286, -144, 150, -7, -447, 24, -197, -574, 0, -150, -277, 243, -109, 54, 296, -21, 465, 486, -164, 458, 388, -441, 91, 189, -297, -83, -354, -305, -45, -822, -321, 435, -533, -369, 395, -50, 97, 112, 239, 763, 100, 41, 873, -62, -529, 711, 94, -553, 141, -114, -294, -513, -518, 245, -355, -793, 608, 177, -670, 467, 677, -98, 134, 302, 387, -52, -449, 517]
2286E17r0j509R85P40j395R1Q14m96k2J5M56K31q09Q44O75j240M46Q52j207l4
2306a36P63n51N2j70j99L38m88j10Q02p03k52R18n01J73L81o28M90L27q62P16
2326C60L72r13K42Q5j12P2q02M08N71j183J89J414j228l52J240j46n74K25N05
2345C73J19r67M32J375j549p23K064n74j794J383N80j101n47Q46O44j427k77K167
2363A024p42j737K123O23j939N40J258o36q89L00R23o82j188J439R1j795J163
2380a24R49j629K31R40m84j50j17O95K4p98O16O43j180N63P27j014Q3K76o13L54
2400hj9o45M40Q5l3J9k34O80R8j125Q57R39j637L19J517j308k92J051j9q98n16
2421g29J242Q1j892Q95J544k043k36K300j003j293J293Q49r99p87J370P24k025
$$ y = [517, 427, -1082, -97, 643, -752, -661, 153, -343, -365, -350, 106, 337, -472, 372, 1047, -193, 253, 1105, -102, -136, 627, 76, 128, -42, -241, 97, -391, -501, 301, -402, -654, 264, -237, -64, 317, -311, 179, 506, -356, 360, 732, -181, 61, 146, 34, 106, -696, -288, 283, -900, -711, 703, -525, -877, 363, 217, -357, -132, 373, 492, -475, -43, 1332, -217, -940, 1124, 550, -1244, 139, 719, -382, -929, -83, 561, -866, -1143, 1024, 282, -1455, 668, 1291, -648, -108, 1150, 514, -375, -75, 848, 166, -1022, 417, 508, -1287, -124, 825, -804, -573, 367, -117, -267, -384, 311, 335, -463, 153, 796, -384, 179, 906, -108, -25, 251, -362, -8, -27, -672, -232, -147, -180, -161, -395, 285, 383, -742, 115, 1054, -583, -264, 1253, -55, -347, 704, 685, -213, -729, 513, 594, -1298, -403, 1141, -902, -1138, 1162, 159, -1134, 159, 1008, 9, -778, 592, 1316, -709]
2438g09K30K162j518j312K134k30j865O43J069p55r93P49J186j278n52K020n68
2455D13j276J452L38j433N41M04k68l42l2O54l29p51Q32k09r17J037n2r71P70
2474a39L95p38P07R8l32L03N2K76o43l32J190n11j356J657m7j728J087P45j196
2493e12j72R55J21j045j22J644l76j676J699R29k266N18J688j515n61Q90K91q66
2511c76o13J502J7j827Q65J476j878r0J755r67o51J000M76o28m93Q29P38j650
2529e15J80J432j318n60J497o86p39Q18j51j97l8J43M99n99p5J073r05k85J339
2548I13p12o24J146l32p04M95j26n2l57j4O11o45m56J329n53q36J426m8r88O54
2568A27L55m14j29J19P20o34o63J240l66j284J186K83j435O27N08m89j84R7N11
$$ y = [-709, -479, 1683, 165, -1147, 987, 757, -1108, -465, 604, -151, -1144, -395, 791, -487, -1039, 981, 413, -863, 589, 927, -506, 35, 439, 171, -171, -203, 451, 122, -629, 203, -6, -923, 114, 62, -909, -139, 256, -482, 225, 323, -9, 294, 346, 622, -21, -353, 837, 326, -1030, 627, 580, -1148, -61, 684, -512, -684, 271, 392, -653, -775, 869, 493, -1183, 516, 1445, -821, -303, 1385, -130, -691, 199, 490, -376, -989, 513, 530, -1297, -432, 1044, -834, -924, 831, -136, -787, 213, 689, 61, -432, 397, 1135, -515, -335, 1097, -221, -781, 716, 30, -709, 109, -42, -239, -277, -134, 365, -234, -309, 764, -141, -426, 913, 201, -423, 723, 391, -313, 182, 56, 4, -353, -367, 244, -401, -857, 472, -81, -917, 509, 461, -527, 127, 482, 68, -61, 58, 778, 144, -519, 721, 355, -929, 257, 540, -895, -268, 240, -249, -433, -336, 175]
2587A75p3o05R31J75j268R85M92j134M98N82q34O2J25l35K30l48K66K05q82N83
2607a70O65j084M48O15q67L79L37l56J47K0q8M25p74K68M82j001J94Q68j046N4
2627d84O77m78j53J59M00K11o27P9R75q63k64J184o72n13R22k95l07l6n7L31m44
2648b55k88R88n94o38J016j43n06N69J02k58J11k29N47q0p62Q67P4j011M54J39
2668A03n65K22J05n5K39o33L47M49p77L72O77o39K42K18l20M21k98j80O10m60
2688G8l40N51m22j71N59o35K29K69n76M76J35n64P94N2o94N62R2n31L57r7p7K87
2710C34o43L30L41j058L04O62o91J16L47m43M30j84j27O25m63r0Q91p86NN90n47
2731e7K0K88m78J28J49n25M40j12l62O57k38l54P13m76m6O78m73qN61n30J02L30
$$ y = [175, 102, -503, 428, 603, -665, 320, 812, -322, 176, 758, -76, -14, 111, -224, 6, -342, -76, 129, -753, -170, 495, -589, -141, 474, -393, -14, 323, -33, 114, 134, 46, 471, -303, -35, 447, -554, -360, 508, -538, -484, 193, -285, -438, -279, 121, 332, -295, -216, 759, -104, -368, 816, 144, -369, 553, 258, -49, -85, -142, 189, -255, -543, 445, -149, -787, 229, 86, -420, 149, 251, -7, 104, -125, 422, 342, -420, 447, 521, -490, -36, 103, -462, -240, -135, -190, 49, -584, -237, 212, -565, -193, 484, -155, 87, 305, -15, 406, 108, -72, 538, 78, -262, 289, -133, -304, 255, -380, -151, 118, -458, 18, 153, -411, 383, 435, -259, 303, 395, -136, 221, 124, 47, 334, -309, 21, 362, -696, -392, 270, -421, -305, 42, -401, 29, -155, -282, 343, -120, -210, 681, -105, -100, 490, -57, -37, 251, -227, -99, 50, -475, -35, -147, -509, 148, -90, -444, 269, -207, -253, 425, -48, -56, 505, -25, 77, 407]
2753D07l51K74l99j33O64n87n71J083n14n80R01j43m08M38K4J50q8l39Q58l93
2773B93q18J043j35q78P10K28p07J05K9Q0J4o09P66Q6r84Q82M29j005N37L86n62
2794a10L06n0M0K70o75M29J67o49L38Q7o91N97M1r40R06M88j126M76N40l78j27
2815f1J02M94l91p70J214K31j784Q86J108j580k04J261m13q51K92J101n25j484
2833a374J580J091k380L96K220j330j215J638K84j326k70J425j34j794P14J778
2849A303j739q94K220m93j642J138R47r16n42Q91N88j447Q0J629j014j127J789
2866G71k50j273P99L57o63j81L04L42n06j85O59k49m35R76m25m81J185l76q18
2885d49J050rj159M67N82k85p92K99J154j167o84J949m02k015J564R49j915N1
$$ y = [407, 56, 330, -69, -202, 462, -125, -696, 387, -127, -707, 194, 51, -357, 81, 105, 255, 167, -172, 686, 293, -525, 518, 383, -495, 215, 443, -264, -159, -130, -50, -36, -645, 121, 207, -777, 105, 534, -471, 66, 452, -110, 196, 146, 186, 456, -219, 210, 377, -272, 66, 153, -538, 59, 100, -840, 66, 554, -572, -96, 444, 66, -61, 41, 535, 144, -626, 588, 819, -965, -79, 1029, -551, -755, 506, 93, -758, -466, 635, 110, -1374, 206, 1297, -1083, -687, 1533, 203, -1012, 626, 910, -416, -686, 739, 605, -1189, -475, 1303, -436, -1330, 890, 397, -1245, -107, 840, -76, -618, 273, 861, -586, -506, 1123, 109, -1018, 771, 521, -752, 47, 404, -259, -440, -136, 206, -300, -485, 174, -75, -510, 466, 41, -440, 745, 369, -449, 601, 592, -567, -100, 482, 197, -595, -296, 858, -309, -993, 956, 554, -1461, 103, 1052, -863, -812]
2903h12J472nj431N28J836j186j682K319L57k929Q30K221j943j114J876O46j764
2920g81k97K192l99k318J676J735k589l39K402q28j558J249R16j023q31J086M44
2937G37j588K25J490j384k97J337m66n56O62L4j35n1r3N31m24j93O58m73j30P00
2957E84r54J22R33j074l32J110l77o29N33N02k55r13R81Q77j676j30K129j235
2975A96j518J954L92j734K04J385k83j748O23J698j651j083K438m5k441J586J457
2992A430j690m52J339K91j534j73J946p66j759J780R06k084K95J372q51j005O50
3009c05P35n55p67J180L42j196N22J021j048j8P40m78r8l2j61L50m39OM00k40
3029d1j55L41l76K39J64p11O31L32r14M21Q58o59k43L54K80n48m47P22L62j493
$$ y = [-812, 660, 655, -776, -248, 1588, 402, -1280, 1039, 1396, -1533, -703, 1518, -425, -1539, 337, 983, -781, -1078, 1114, 715, -1603, 73, 1808, -781, -1120, 1282, 454, -1104, 145, 1061, 38, -793, 293, 737, -851, -626, 864, -520, -817, 520, 54, -502, 160, 194, 59, 8, -85, 446, 22, -171, 487, 14, -116, 584, -370, -248, 685, -389, -721, 389, 12, -617, -84, 418, 163, -750, 231, 1108, -568, -698, 1431, 196, -1322, 632, 1024, -710, -506, 879, 596, -1152, -529, 1169, -482, -1565, 873, 828, -1613, -27, 1430, -260, -712, 627, 918, -616, -789, 1157, 391, -1368, 412, 1318, -766, -471, 901, 50, -955, -305, 430, -125, -892, 288, 630, -566, -44, 977, -71, -89, 651, 173, 75, 43, -118, 232, -207, -201, 199, -41, -196, 145, -231, 8, 172, -539, 92, 424, -490, -69, 789, 130, -113, 241, 521, -27, -474, 248, 610, -883]
3049h83L71J322j298m01J296j18q88K25Q33k15r33O23J257j440m52J648n91j147
3067g91R86K81o62j65L55N12r33k72J266n47r57J171J17p89K64L49kj10j63N56
3087D66j02p81N12L07r02N34J00m58L59k74q7N87l45k55P42m54j36J50M5K25j21
3108A12l78Q70k53r74P76K57q34L99K29k28l16j26P03k78o32Q29M68j208K38R19
3128E73n93j61M50M8j47n78O18N31j328K72J085r06o02Q26ll60m3M22L39o90j70
3149d17J103o54o61J169o7p05K57K19q9m14jO96j87r31Q53K6q10L45M32k18j44
3170a98J23L30N9q54N20P84q75p4O61l51k62j8K74R9n62J9Q04p00n76J172j78
3191A97o72L76K27j9l35K2R56n87o11J058n3j190N33N27o17j80K88M58n79n31
$$ y = [-883, -512, 810, -488, -889, 407, 289, -599, -374, 459, 244, -689, -66, 1191, -249, -701, 947, 356, -791, 195, 476, -186, -351, 4, 516, -417, -689, 577, 30, -927, 244, 361, -428, -164, 185, 183, 73, -90, 466, 364, -417, 95, 402, -500, 34, 134, -324, 35, -239, -326, 261, -84, -339, 403, -51, -187, -37, 8, 233, 112, -266, 604, 351, -623, 153, 410, -424, -25, 204, -24, -340, -466, 237, -41, -673, 156, 624, -584, -346, 573, -20, -181, 269, 317, 170, -408, 210, 741, -587, -315, 770, -136, -738, 88, 85, -275, -318, 104, 443, -247, -417, 686, 32, -629, 540, 473, -232, 25, 244, 155, -259, -260, 436, 249, -682, 171, 197, -613, -268, 164, -54, -198, -75, 255, 314, -540, -20, 764, -111, -185, 476, 125, -137, -155, 119, 218, -344, -325, 479, -221, -797, 375, 197, -475, -99, 128, 109, -226, -204, 752, 165, -446, 612, 559, -631, -98, 429, -188, -368, -80, 378, -201, -732]
3211g32J001J14r55O72O21r81n3P64j56m21JO17n0q36L72N69q65l0Q08o23k97
3232d60L57P6j86j5K14L49l64j10N17l50o6K89k81n2R8l20K56K27n93K56K70k98
3254a86J53K8QQ8l43J92M90o39J81O06n28p1M44k29j70K2K09l0n14Q9O75p94j46
3277d65R30l95n72O78P0m33R3K73J08m64J9O86n72m76J035m19o59P65J26o69o8
3298d09O18k65m78K44P29m98n37J188k17r04Q80K38q74J77O91k83p60L14P84p24
3318h6o38J147L4j267P81P47j193j74J117k96o57K51P80m47p47J042L54j243L58
3337a37P91p65m75P55q5l98P6L52j15n03N30M71p74J25O61o45J18K19k64n8L30
3358B09j29j20m0J69j0l39K76J60p08L05P37r19p1J054m70n38N93M53p15m13J025
$$ y = [-732, 269, 383, -572, 100, 721, -260, -313, 451, 295, -126, -125, 492, 442, -394, -22, 547, -318, -348, 460, -163, -460, -103, -27, -213, -228, -14, 335, -29, -139, 378, 28, -38, 251, -30, -82, 16, -304, -48, 179, -414, -158, 112, -186, -33, -5, 3, 91, -252, -60, 430, -209, -28, 578, 50, -21, 423, 194, 24, 46, 255, 225, -289, -200, 475, -319, -465, 465, 70, -502, 176, 246, -187, -94, 179, 287, -177, -158, 528, -44, -520, 515, 96, -563, 202, 328, -341, -409, 209, -56, -534, -290, 439, -59, -596, 592, 375, -529, 351, 589, -285, -108, 583, 300, -460, -146, 638, -86, -724, 423, 457, -810, -29, 718, -475, -649, 468, 172, -485, -234, 546, 99, -648, 394, 748, -495, -137, 654, -111, -586, 169, 84, -314, -238, 114, -1, -504, 26, 497, -277, -152, 509, -136, -18, 201, -63, -121, 209, 80, -40, -80, 89, 79, -260, 16, 176, -532, -227, 510, -409, -480, 574, 104, -434, 159, 612, -103, -516, 509]
3379E09j3j258L44J333j223n92J568j0j457M79J052r46p27J043Q67j647j74J904
3397A052o95j363J439O64j623j70J452l04j388N32J297r62r76J527J85j591P04
3414b20P88p08n24R04J80p06n2P20L3r27N59N03r67K40M48m39J14p0j48L63p3
3435A8k76J86J65j25k00J56M24l82l00P44J89j188N59P64r67m82R76K62j124k
3455f03J331m52j223R66R59j456k75J661m18j329P27J181r04j016J371M52j730
3472g58J31J746j110j144J335N54j348j36J300o7j292M85J325j049q07J326J52
3489F43j281L48Q36l69o40M84N99p64n35Q99J02p75J68M82j44j99m1N29k24m68
3509c50L07N25n70j84M66O7m21j93M62K78q09K6J021p15p01R66L51q63j12Q99
$$ y = [509, 496, -762, -418, 915, -308, -900, 668, 658, -799, -320, 732, -214, -941, 102, 969, -678, -852, 1052, 357, -1006, 433, 1097, -526, -696, 756, 452, -936, -404, 893, -69, -1045, 482, 667, -924, -220, 568, -140, -664, 240, 420, -286, -338, 382, 415, -512, 47, 550, -417, -177, 271, -168, -54, -124, -272, 91, 18, -258, -72, 93, -32, -232, -76, 348, -34, -334, 410, 599, -589, -30, 734, -233, -715, 261, 523, -601, -603, 728, 276, -947, 19, 978, -478, -753, 908, 490, -839, -112, 1069, 165, -851, 520, 972, -758, -627, 1119, 9, -1135, 200, 754, -594, -730, 570, 503, -789, -304, 1021, -28, -835, 491, 643, -638, -290, 546, 177, -463, 21, 620, -144, -679, 220, 322, -453, -285, 197, 53, -146, -187, 342, 118, -350, -43, 482, -88, -272, 194, 261, -160, -353, 109, 387, -422, -396, 625, -90, -791, 175, 526, -337, -449, 450]
3529D50J11j049J30J232p76j007J413J90j333Q0J172m39r41O69P84q05o70J155
3547C66K19j241K58J214o83q09R28N28q99l73R46J28j151L53R23q18n81R36J83
3566D27p27q4N81J79q69O6R30m54o65Q89K35o26q4L75K82o55j21P64j27q37M75
3587d6M70o56j74M54K22l69k58O03J49r77M07Q06n83m78N87J63m20k20N96J06
3607C82q35K16P60o40n57R49Ro79J07O60j11p36K93Q26n56o48Q77K48r10J45N95
3628C95l8o40R9O05m68o11P82M30q64j08P32k01m77J45P51l34p41O25M88p41j53
3649c24O68No35J44M44j21o94L80O00o63l47Q68m3p13L14O92m04n05K33N40n76
3670a37m82Q55K48r80K14P91m19n52L67O70p84l58R12J56j065K73J063o20o08
$$ y = [450, 561, -488, -358, 874, 98, -909, 504, 694, -639, -559, 613, 174, -767, -98, 686, -119, -789, 366, 585, -656, -398, 816, 133, -676, 252, 780, -119, -492, 454, 582, -569, -216, 707, -111, -692, 244, 427, -300, -384, 197, 376, -493, -427, 503, 49, -616, 273, 508, -118, -202, 173, 455, -200, -321, 443, 316, -521, -46, 424, -232, -406, 48, 270, -99, -357, 246, 395, -582, -175, 631, 48, -430, 157, 320, -100, -320, 276, 382, -453, -237, 523, -117, -674, 275, 284, -395, -288, 372, 261, -475, -182, 644, 88, -560, 317, 565, -345, -200, 395, 357, -283, -184, 421, -47, -658, 124, 554, -310, -418, 314, 113, -364, -219, 532, 198, -543, 82, 570, -171, -324, 344, 349, -286, -142, 302, 181, -513, -133, 467, -196, -543, 325, 282, -431, -117, 575, 171, -334, -101, 439, -137, -619, 236, 484, -496, -282, 509, 90, -462, -95, 575, -209, -567, 345, 501, -564, -291, 772, 152, -456]
3689d56P00M46o92n14Q28J66j011K27R87q68m85P44M75j025k6R11k48o58L83O28
3709E12n66m85P83K91q38J73M32p9n30P1Q56n91n82O34K18p06J83N30j20m88J4
3730b88O34k02n54M65N30p42k65Q24j84m82Q9N34k86n50M14O21q70k56J125k78
3750B79p62K32P21n31m56O90N20q39k75J002k44r95P16M22o64l46O35nm99r6Q08
3771C13j47q15Q37K22p13J08N89k59m29J90N25l45l89M39K78o17J03L95m89mK37
3792B9K2q5j00K29J34m02R8K42j02j36K43k06L7O5k48K25mj40J41J60l01n5J45
3815iJ86j45j27K45P4m15K46L43l71l25N36k8l52O8K32j95j27J71K15n16J01M12
3837B19k32l53M53K9l76J52K87j66l12L76L02n46J2N15k37m61O42j89m63K21L38
$$ y = [-456, 244, 690, -2, -516, 312, 478, -533, -306, 681, -187, -672, 72, 547, -478, -504, 407, 159, -499, -116, 512, -54, -539, 244, 535, -303, -130, 302, 223, -307, -236, 620, 29, -553, 81, 299, -407, -224, 306, 186, -302, -288, 346, 144, -410, 55, 585, -157, -422, 402, 218, -264, -175, 359, 73, -477, -63, 558, -312, -568, 557, 279, -483, -251, 470, -61, -517, 173, 693, -146, -421, 581, 337, -658, 58, 480, -184, -530, 105, 100, -399, -495, 313, 166, -649, 188, 410, -303, -195, 394, 135, -294, -104, 421, 76, -313, 126, 404, -213, -110, 285, -204, -208, 29, 51, -34, -134, 95, 229, -173, -75, 167, 65, -71, 172, -34, 3, 68, -180, 45, 41, -99, 42, 202, -99, -154, -9, 177, 32, -95, 150, 224, -191, 55, 398, 27, -298, 238, 210, -142, -74, 158, -37, -164, 7, 222, -294, -193, 219, -13, -366, 87, 116, -260, -108, 179, 13, -299, 77, 379, -167, -155, 360, 123, -338, 304, 115, -348, -127, 211]
3858B11k97j49K64K67m85o6O09l00n74P71n3l86P3M08j69k25P7J70j66k79N34
3879B35j47m68K76L63m64j23N64j64k64N1L19p3l59L92K57o25J53L24k04j66J26
3900Ck5Q5j79Q5J03j31N0pk8r8K00j04K35j04j84K43J0l16K02J54j84q3P1J86
3924A84p6m36N85M2n79K12M31m96k24N63P9m66L5M46qo92K75P11p59l21P11Rn93
3947c67K20N03k69l89L26L29n56j36Q03k94n86L47M87m03l05L51J87m50K2L83
3967B03N2o72M60L29p10M1M32Qj91j36M07J12o25QP64l81l73M72J1k64j01K69
3989A15K03n02j26O60j85o38N60K03m25l6L34K98n92j93Q15l40o54N62L72o93
4009b62n6N27Q6o03m3P10j71p31N57M97q25m3P52j60n16J80M95k61m77L94N37
$$ y = [211, -86, -235, 29, 296, -189, -255, 354, 54, -520, 251, 198, -188, -115, 293, 124, -101, -24, 146, -20, -299, 235, 88, -380, -104, 259, -205, -328, 236, 72, -192, -141, 178, 105, -254, 138, 395, -230, -77, 247, 43, -123, 3, -22, 63, -116, -31, 72, -59, -9, -16, -44, -142, 58, -46, 189, 85, -99, 144, 154, -162, 40, 194, 10, -73, -2, 184, 108, -328, 257, 299, -280, -68, 363, -133, -357, 206, 285, -181, -146, 300, 292, -400, -125, 586, -173, -494, 217, 226, -367, -147, 356, 87, -302, 24, 353, -203, -339, 464, 170, -416, -69, 418, 15, -290, 61, 248, -202, -180, 203, 255, -417, 43, 372, -338, -297, 135, 143, -48, -184, 223, 335, -290, -282, 482, 101, -272, 200, 211, -53, -154, 115, 318, -184, -310, 350, 165, -473, 87, 290, -135, -171, 163, 461, -131, -324, 491, 151, -503, 59, 431, -262, -318, 209, 295, -308, -351, 359, 188, -543, 14, 511, -314, -357, 395, 235, -281, -101, 394, 133, -344, 50, 587]
4030E87p84j78P46r4p05L69L11k29l03K04M17n03l05Q46q0p72M00M13l07l23L51
4051F1K98m67l89P27J09q00L50O32m92m64M38L34l44l11M11M29r24K11P57m29
4071A37m93N27K23m44l08L44L12n70k04Q38k78o40O08M11o94j3L73O4n57nQ23
4092D54j93o23N15K66n41q6M57K3n59o1O66q7p63M76M40n70o7M91M4n57QN23m9
4115B07n84L38P00o65l54P90j86m86J5N22k14m13J15O65l97n89Q67P4p18J56M95
4136C38l70l06N4O39j85p26O81M20r12Q5P56l79n35K15M82k74m54O51L90p98j06
4157c34R61m69n53L50M21l41l90M06N52q40k28J021k94q25N49K60m91l13N17L60
4177C19l52k94Q91k38p57L71N04n47k99M79J27l73r0O02M5o79K84M59n81n01O57
$$ y = [587, -197, -375, 371, 277, -428, -59, 252, 23, -280, -76, 341, -162, -467, 379, 299, -473, -73, 340, 33, -290, 61, 359, -108, -497, 230, 339, -461, -111, 521, 29, -435, 3, 337, -7, -318, 93, 522, -402, -191, 566, 137, -356, 171, 394, -50, -358, -14, 298, -272, -476, 362, 84, -556, 52, 463, -231, -244, 129, 193, -364, -369, 454, 261, -362, 153, 419, -122, -208, 249, 272, -287, -348, 318, 231, -532, -56, 384, -186, -253, 238, 282, -275, -267, 256, 207, -377, -39, 661, -4, -358, 432, 246, -240, -225, 297, 83, -330, -215, 450, 53, -536, 331, 405, -313, -157, 338, -32, -338, -284, 355, 170, -556, 125, 545, -367, -282, 474, 95, -440, -225, 257, -17, -471, 180, 570, -228, -334, 627, 158, -395, -45, 376, 35, -355, 51, 603, -237, -465, 556, 262, -563, -14, 246, -245, -558, -41, 319, -33, -327, 564, 326, -431, -60, 444, -103, -402, 77, 204, -169, -259, 343, 388, -291, -7, 452, -129, -630, 27]
4198B7K43n23l2M96R1n98J39O63m53m94P22M0o42P0L27J94m75Q0P83n46o46P61
4220B27J28p76L02N02k06m54J71O35l19p08O81K26q71J47O67n13l22N84K56l65
4240hk69M85J53q92K29Q23l47o66P10l5k21j8K26J63n29qN06k14o47O86J43m10
4262a40j19N83k39r0k86O31j68m17J64M13m62j47L10J37n0l02M13M6p72L38N28
4283C71m26k80N21n1l54K05J19J52l56%M99n22l19P66p1m85K42L77l90k09J23
4304h8L42l75l68Q31j75o51N07K88m67%L24qk03r1J49J48n62L66L64n16p1L30
4326G4l5j54k7J06J51k59nM63l58j1K39q9m4P8k14J82K3k53K36J29m73K76Pj24
4350h2N4r1K82p0l04K34J87m15O0M73k41j74P3M7m4j25M3L82l64j46M41l93K2
$$ y = [27, 270, -253, -285, 211, 302, -296, -157, 506, 53, -441, 281, 321, -321, -251, 76, 270, -205, -125, 658, 112, -534, 227, 355, -421, -119, 383, 177, -277, -106, 529, 210, -498, 183, 409, -462, -315, 352, -161, -483, 101, 357, -8, -277, 208, 361, -531, -302, 521, 174, -492, 218, 183, -38, -56, 170, 333, -196, -204, 302, 88, -559, 127, 270, -140, -259, 324, 85, -5, -291, 340, 172, -245, -81, 332, -130, -277, 33, 170, 120, -182, 231, 277, -495, -157, 371, -55, -335, 186, 135, -219, -14, 105, 257, -99, -99, 400, -122, -441, 325, 254, -231, 11, 388, -2, -211, -88, 254, -121, -489, 342, 167, -484, 23, 311, -156, -156, 168, 160, -43, -134, 15, 163, -399, -33, 331, -185, -256, 74, 39, -115, -142, -36, 115, -144, -149, 314, -44, -55, 184, 95, 51, 129, -85, 97, 120, -133, 103, 232, -241, 35, 42, -82, -28, -119, 163, 93, -211, 23, 210, -205, -145, 328, 87, -87, -14, 33, -11, -136, -93, 289, -75, -221, 220, -173, -151]
4373a51L76j63k05P3J65j6r0j2K00l07j6L37k86j72M50j00k33K29lm3o3NK18k28
4397c5j18K72j4j50K33p6k24K43p4j78L3N0J09o6j00J64m9k67M62j39l33K94P2
4420A09k13J14Q3j66K34j92J62p2k81L29J47m13J40K52l06J31k1j44K24k92J95
4441B0J50k31J2K17l25J74N9k59J47J66l31K64R3k66K33j88J5K00k64P6J83l02
4463a57J66J64k59m4L03k50Q1L4J07j23k87K67J99k96p0L41j53k65L72K1k94L8
4485a05R6J25k37j80O31k98m01M58O0l42K15Q9j12j13J05J23K2l10L58L2m46J39
4507i1J68r2Lj30K29M0l73K71K51n11K48J06n5j30J44j27R6o3n3J96j67k97N36
4530A99j07k14J61oJ22j98L8J58j20k63L02J87n75K25K73k05p1Q2J33j49k62M03
$$ y = [-151, 225, 62, -143, -70, 95, 79, -11, -23, 177, -130, -146, 191, -95, -267, 183, 83, -150, 79, 76, 33, -30, -25, 193, -35, -153, 119, 105, -45, 188, 112, -112, 131, 57, -121, -88, -38, 71, 5, -95, 69, 20, -247, 215, 76, -257, 37, 109, -104, 10, 93, -73, 161, -31, 131, 59, -222, 107, 254, -159, -19, 233, -73, 58, 37, -107, 117, -175, 20, 170, -61, -49, 168, -157, 17, 76, -183, -36, 130, -201, 63, 156, -110, 123, -65, -50, 150, -114, -38, 145, -157, 9, 173, -86, -130, 173, -77, 4, 38, 145, 22, -265, 2, 201, -95, -165, 176, 23, -242, 130, 151, -143, -105, -9, 116, -121, -301, 330, 32, -369, 89, 149, -193, 22, 111, -1, -114, -9, 114, 136, -174, 184, 216, -230, -91, 77, -15, -12, -142, 87, 127, -246, 25, 276, -235, 13, 119, 64, -66, 78, -49, 47, -16, -69, 127, -40, -337, 199, 92, -122, 39, 33, 155, -43, -5, 153, 33, -230, 72, 259, -316, -91, 182, -23, -94, -12, 121, -28, -290, 113]
4552A13J28n25L18K28m17J51N8J81l17KL13m9l07j5M32k89l26M31L9k61O0J71
4574A19j0k06j28N35l36k17M47kl31J8K18k9n4j80L30j20m26L22K31l39j5L20
4596A47n2j30q8L34l0l82J33L07k85k16M39Jl51J21J07N4l30J52J86j67j97L76
4618A29l9l73K08M05k34j75oL38l40l95O74J11n77K47M25m66l1K12N6j62k52L75
4640A30M1n93K47N58l21k26L78j54j08p8O2K27m40J13L53k33p6K78K6k27lJ15
4662F9Kj46k40M60m4l31L23J53l84oK39r4m6k16K95K6k89J20M67l08k54L78l1
4685A43l17o7K35J81m86J01N71l93k09N94j02l99P3J78n2m73J24N84l02l13N92
4706B63R9o99J72M08k75k75K17J89k60k7L73j3n33L50L74m62j42K67O9l34K8L83
$$ y = [113, 241, -284, 34, 262, -155, -4, 54, 235, -82, -80, 233, 184, -123, -138, 294, 5, -321, 110, 149, -112, -52, 119, 109, -97, -225, 310, -26, -243, 204, 202, -129, -111, 107, 78, 24, -156, 174, 54, -372, -50, 181, -158, -173, 147, 95, -35, -123, 211, 181, -201, -68, 239, -46, -262, 177, 178, -173, -52, 55, 109, -221, -69, 117, -50, -247, 129, 90, -283, -75, 330, 96, -79, -85, 253, -87, -482, 192, 303, -274, -27, 398, -68, -99, 113, 169, 7, -245, 130, 171, -422, -175, 383, 62, -164, 214, 60, -48, -126, -64, 163, -277, -164, 189, -44, -120, 158, 184, -43, -46, 69, 71, -75, -315, 145, 101, -230, 93, 246, -138, -144, 95, 1, -45, -261, 34, 60, -229, -109, 358, 50, -204, 174, 143, -174, -241, -6, 175, -311, -210, 361, -32, -241, 353, 251, -148, -75, 103, 51, -422, -298, 286, -16, -329, 263, 362, -337, -165, 243, -32, -307, -90, 99, -161, -188, 185, 172, -361, -11, 363, -99, -241, 26, 95, -239, -211, 172]
4728A72j6m47K88L25l76m9J73M3k25J36q8L21l09j42M14j17l29J42J81l02J07
4749i8N7J22j27l41M51J24l77J08L20k27j71K34L08m25j69M66Q4n85J62N00m56
4770d0m16O75j93k24O1M04q4n18L92K61m72k2M54k10l80M10N9k44j43K77J62l34
4792a25L7K83k30l41O18j16k54k4J60Rp2K2K21o0k96K67M0l17J90o5j6J15K5l10
4816b39K87L8k29J34M0l3n3P3J29k56j1J79P3m04L22K27m97L9L18o9k79J55J96
4839A40j28j73M46k5o77L91M14m31j53M10j84j82m5L35N8l79L81Pl18N5K92l49
4861a15j64K32M5k46M1K50Q9k24O5K65l47pK21j13n1N9R8o0j58J44J8j24oK01
4885A13k11J0K14j39r1L56k23k13L48j27q1M9mJ39k53L5J28p9j62L07j02k25J33
$$ y = [172, 156, -291, -3, 322, -54, -103, 70, 113, -112, 24, -64, 257, -52, -194, 220, 103, -226, -84, 97, -205, -98, -41, 81, -46, -387, 64, 188, -189, -81, 239, 12, -159, 75, 383, -42, -211, 255, 339, -246, -84, 416, -40, -456, 219, 26, -198, -137, 267, 183, -335, 57, 318, -154, -176, 278, 68, -312, 98, 157, -87, -230, 47, 209, -125, -88, 195, -35, -376, 242, 126, -128, -152, 8, 17, -55, -33, 188, 128, -168, 99, 139, -178, 12, -53, -69, 46, 71, -239, 48, 86, -143, -9, 31, -2, -55, 18, 147, -109, -120, 59, 132, -272, 50, 277, -220, -181, 137, 68, -211, -56, 140, 12, -161, 285, 260, -417, -26, 388, -43, -196, 214, 30, -152, -197, 138, 196, -183, 198, 205, -113, -58, 234, -115, -279, -47, -2, -248, -207, 43, 132, -92, -27, 238, -109, -116, 105, -8, -59, 0, 98, 38, -120, 24, 42, -82, -88, 113, -98, -88, 126, -13, -104, 252, 29, -184, 164, 37, -44, 5, 1, 140, -113, -78, 50, -29, -191, 116, 14, -211, -78]
4908g8J67q3J2K09r8k53J45K08m16n8M07j19l39L33l6o8j04L45j46m9j18K35%
4931I6k79K16N8k38J39J41j30M0ln2Q8m3P1p5q6J3Nr8J73Q1j66j50J67p3P0n2
4957h7J20n1o5N6M9j7J4J91k15L1J11L5j67o9J40j00R4j12J25k98J58J32n5j70
4981a50K54k8j49J78Q3j32p1K3J29j75q9K62k61J52M9l1r6N3M2k6j6mK4M6r3M1
5007A5J9j52K22J0j20k7o9Q4nN3p2M5o8J6L8q3J60J5k48J56J63k71M8J63r1p0
5033f9k1J01Q4j26j5J62q7m2R6j39j0k7J71j45J27l7Q5j73R6P6j97rK50k37l2
5058a18O7Q5j5L9n3R6j74K33o0k1q7j6k1M5Q1j58J21N9m4l5J21j39K9j00O5o2
5084f2p1M5J65o8j58J59Qn8K29r0j87J16kM1j06kJ60o2j77J17P2k84K95J4j19
$$ y = [-78, 89, 6, 18, 227, 129, -124, 21, 229, -187, -245, 162, 43, -296, 37, 1, -67, -171, 174, 28, -21, -139, 96, 96, -183, 33, 91, -147, -8, 133, 3, 43, 40, -12, 76, 33, 104, 29, -57, -44, -39, -137, 36, 117, -49, -199, -32, -105, -35, -87, 33, -18, -83, -27, 22, 5, 19, 210, -5, 26, 137, 172, 5, -64, 76, -24, 70, -42, 83, -215, -57, 75, 20, -150, 104, 76, -73, 105, 188, 56, -15, 8, 137, -38, -127, 135, -126, 26, 75, 44, -52, 1, 43, 17, 1, -3, 21, 67, -26, 15, 34, -118, 104, 114, -6, -33, -102, -18, -23, 30, -42, 3, -65, -49, -11, -94, 66, 81, -167, -11, 152, -119, -71, 92, 1, -69, -90, 11, 95, -31, -46, 116, 29, -13, 83, -56, -66, -93, 78, -67, 60, 23, 108, -65, 31, 107, -90, -99, 151, -86, -118, -51, 34, 19, 58, 5, 101, -73, 160, 100, 79, -8, -24, -45, 0, 81, -77, 44, 103, 59, 24, 145, 6, 35, -65, 0, -62, -133, -88, 77, 9, -149, 10, 18, -40, 189, 99, -88, 28, 26, 67, -39, -41, 119, 57, -120, -3, 69, -215, 80, 94, -25]
5109b5P3J1K5q8n5J13L5j09j1J98j08j61J19Pk6j08J99n9j20J13J18j83m9J29
5133C8r7k2J51J5n7j32K03P0k23j00L09j69mjRN1o3j0m0Q6j92K71o6N2l0j03Q7
5160C3J8k15P2J71j76j14L41o2j13P1P8n7j89L22j09k31Q5L50l20j04K49Q7l40
5183a53k7M61k25J5lJ16k59j3J79m0k07J48J96k62k3J29N7k51K67K5j06n3J91
5206A62L7k30M8J59o3j55P5P2n8m1P4j19j15Q8J65k51K21q5J8l6P7Mp3N2j3m4
5232c1rLP0p7j7J34k26J46J54l07M4K38j30j55K26P0k75O8K50o8l16K40J86k35
5256a7j00K98j48j02L5J55j10l06L94Q0l48MK96j79r1K26R5k67m1L45l3j72N5
5279F9L4j77n7K16O0k60J72O9k71J54M4j4p0N7J69j98j9O7o1q9P2J74j67J1J24
$$ y = [-25, 48, 59, 84, -4, -59, 54, 89, -20, -31, 167, 59, -102, 17, 24, -2, -110, 89, 30, -90, 23, 141, -42, -91, 38, -59, -81, 70, 85, 28, -104, 99, 169, -54, -154, 155, -14, -18, -19, -10, 41, -22, -32, -72, 14, -178, 93, 27, 79, 49, -54, 33, 51, -164, -92, 79, -97, -211, 130, 68, -45, 26, 104, 47, -142, 180, 71, -160, -75, 275, -45, -149, 100, 187, -153, -180, 281, 56, 71, 68, 184, -75, -88, 91, 51, -156, -8, 188, -74, -97, 32, 89, -162, 105, 130, 24, -29, 162, 199, -31, 17, 176, 113, -42, 33, 105, 47, 6, 80, -39, -154, -66, 99, -152, 69, -16, 2, -34, 43, 47, -26, 26, 13, -31, -40, -37, 33, -44, -61, 73, -153, -7, 147, -160, -116, 122, -8, -163, 63, 133, -142, -74, 176, 108, -208, 32, 218, -17, -117, 181, 33, -69, -34, 121, 11, -295, 99, 179, -169, -165, 131, -48, -139, 87, 182, -85, -126, 219, 186, 14, 69, 103, -74, -131, 85, 145, -115, 57, 126, -145, 9, 53, 39, -31, 26, 195, -3, -22, 45, -16, -105, -33, 141, -26, -15, 109]
5304A09j35J6M3Qn2MJ61r7j13N8M0k30J90J68k15k1K00l9j68m3K32k04j11L44
5328A45k3k25JK56p2k01J63L6j27L3K00j44o3K6J39k53J0L02j81j25Q7J53j94
5351e7pK44k14j98K56Q1j29K0J92l5l27K27Q1k37pK76k20k1O2L1m2J0J75k26P1
5376Fj7Op4J01o3n9j3K53j56NO6m1J39j99J18J9r5j19J50j24n9K30m0Jr0J59j04
5403@j35J40J7l1j19K26rj67Q1K00l55J40J11j15j30J87Q0k71P5J68j42j44K84
5426I1Q9j01j45K05j53p9P2J96j35m6R5j13l4J37m4j9n4O2k9k6J07Mr5mJ27Pj00
5453A5l4J70k59Q8Q6o4K5L9%j28j1O8M1j45j2K01j57R1l3J07j27J28J20j87q2
5478f0J02j06j01Q6Q1q7J14L3k2j43J18L2n5l5J99j72o5P0K9o6J31PR0k58J10
$$ y = [109, -26, -10, 33, 41, -11, -7, 154, 57, -56, 2, 42, -188, 2, 170, -45, -66, 134, 95, -73, -116, 116, -88, -199, 145, 122, -103, -102, 154, 82, -119, 44, 80, -47, -14, 186, 42, -21, 5, 144, -109, -99, 203, 22, -103, -16, 137, -57, -64, 180, -34, -232, 24, 105, -24, -4, 188, 153, -174, 53, 134, -103, -110, 166, -54, -75, -13, 18, -24, -14, 161, -65, 6, -11, -5, -79, 22, -41, -100, -113, 140, -16, -11, 55, 14, 153, -46, 72, 91, -4, -123, 27, -97, -156, 74, 34, 35, -55, 104, 0, -135, 5, 22, -9, -128, 98, 89, -78, 3, 203, -152, -12, 99, -16, -146, 41, 121, -150, -75, 93, -49, -193, 91, 180, 79, -66, 139, -14, -93, -21, 175, 40, -6, 89, -24, -58, 79, 35, 16, -38, 24, -5, -31, 76, 80, -15, -19, 108, 115, 15, -19, 151, -108, -20, 66, 2, 27, 66, 66, -62, -73, -5, 36, -109, -121, 80, -77, 14, -19, 88, -39, 89, 209, 22, -60, 42, -64, -165, -79, 2, -85, 29, 62, 40, -103, 15, 47, -8, -43, 156, -16, -81, -11, 18, -48, 83, 90, 180, -78, 32]
5503C2R4j20j40J90q6n2N8Jnj4J19j94J90r3L5M0r9Q3R4k79K42Po9m5R6r9M3q6
5531e7j6J37j36L4q0N8J54Pj23J8K7K7r9J39k0p8r9K40j14j11N7J5k9J13Mj9r
5558D0p1J04j16j7J4M8rJ02k6j13oJ48j39k4J04M1j08K3J07j22K3k5O2j61J33
5583A2J5L1p9R5k0O8j80N4N3k25J56L6pj23K3J17j11M4N2o0q2K82j26j54O6J8
5609d5KP3Q5j37mK7L2J8r3l2P4j02L6N3j05J36J62j05j08Q3M6n6m3L9M7k3p1L
5637hK2l7O2j5q5P6j1k07K09O6n5m5K9ol9J05P7k18J60Lqj10lN8j44N8J56j38
5665d8j38J97O5j19m4K14p3j47Q1J84j09j09L9nk8J02L0l8n1M6R0k43M1J51k28
5690a40l2K02O7k05J27J08j70o6J79j36p3O0K26k11J26K1o5o9P4m4Rj08K33k6
$$ y = [32, 126, 6, -134, 56, -30, -82, -24, -23, -28, -42, 77, -117, 73, -20, 15, 55, -44, 39, 133, -146, 96, 103, 34, -11, 85, -14, 29, -57, -73, 64, -72, -38, -118, -60, 94, 101, -22, -4, 23, 50, -49, 90, 70, -8, -107, 133, 19, -92, -35, -20, -49, 64, 68, 49, 40, -31, 73, -43, -60, -46, 2, -7, 95, 69, -44, -50, 98, -41, -65, 39, 80, -28, -5, 102, -20, 3, -22, 40, -121, 12, 27, 58, -21, 74, 54, 122, -58, -4, 49, -176, -20, 16, 9, -114, -91, 26, -85, -41, 11, -49, -131, 151, 25, -129, -63, -45, -43, 30, 115, -22, -26, 1, 33, 51, -42, -74, 0, -102, -66, -13, -118, 18, 180, 75, -33, 50, 96, 40, -3, 36, 83, 60, -11, -8, 14, -23, 39, 24, -61, 15, 4, -203, 6, 72, 17, -28, 1, -5, -44, 61, 138, -80, 80, 83, 75, -35, -38, 20, -124, -66, 90, -48, -186, 11, 76, -43, -87, 127, 54, -93, -12, 172, 63, -46, -7, -12, -40, 62, 92, 54, 3, 49, 139, -104, -63, 88, -140, -172, 30, 97, -108, 19, 127, -43, -109, 70, -66, -139, -79, 147, -64, 62, 83, 18, -51, 23, -21, -12, -120, 113, 87]
5714H7Lj53J04j84Q2J40m1K4p0J54j67p8P4K3r7P9J09j24K7L6J0k25K74j33j82
5739b28K88l3O6j49N0J33j73M6K11k22r4K73j68l2l1J31r9o1J26M1q9j22L01n3
5763A12j80J52K9o6o0K45p3k61M9J32j00r9J89j3j91J78J06j26j69K31L9j68k0
5786f4J24j08r1K05M0p6j68K51k46P4K3l9LkJ29j55J03j38J17M3rR9j33M0KJ9
5812D3k16K35j03j0J32o9n5k01K16N3n4j8J31j6j13J50N2l07J17K29j70q5K03
5835A44m1j03r4K22j64j75K66m8j49P9J10K8k37J66M7q1JJ28r6j60J98N3m0k30
5859a76L26j64n3M2J32j31n6O5N9j40K0K07k85J11J61j53J54j52Q2R8j87L5n1
5882e6K4J8K05k39j08R1L1KJ4J01j57J04qj05M7J19Kj62N5N1j36J6Q1J71j93M2
$$ y = [87, 90, -63, 41, -143, -61, 79, 38, 62, -8, 146, -21, -99, -25, -2, -99, -20, 89, -35, -8, 28, 38, -187, 87, -46, -228, 60, 27, 93, -56, -6, 127, -46, 0, 211, -11, -105, 168, 0, -32, -63, 68, -31, -92, 34, 75, -14, -136, 165, 112, -68, 84, 113, 47, -13, 232, 159, -102, -53, 79, -21, -120, 69, 56, -135, 43, 149, 23, -146, 85, 124, -44, -64, 60, -48, -139, 66, 106, 30, -138, 113, -133, -59, -36, -75, -72, -74, 55, -100, 3, -135, -18, 25, 16, 115, -18, 22, 24, 43, -173, 62, -41, -51, 81, 12, -43, -244, -28, 25, -29, -47, 84, 68, -45, 105, 157, -150, -33, 196, 26, -59, 144, 103, 0, -94, 128, -36, -211, 55, 7, -142, -63, 47, 75, -162, 4, 51, -30, -29, 99, 3, -157, 41, 94, 54, -176, 150, -14, -67, -25, 107, -24, -80, -15, 44, -96, -76, 131, -154, -43, 118, -35, 119, -33, 49, 147, -40, -5, -56, -32, -14, 191, -48, -156, -65, -34, -32, -18, 83, -74, 30, 22, -83, -36, 83, 85, -77, -22, 29, -107, -91, -10, 161, -32, 10]
5908A0N1Nj51n2J84j12PR8j14j79L42j39k4Q3J00o2j19j8J22j15j3J36mj77J22
5933a9J7k0KM3l9J34j67M1L7r2J57j75J89n2j4l9K3O7nj44k4N2P0k3o0K8k9K26
5961A84k07q1K8O6j37K73m2j51J72n3k8j2p0J0L2k6J17m5o2j51K15j03J38j65
5985i8J4K08j77J03O8j46o6J86p8J01j91J15rL1k4Nq7k0J36l3j36J18k6j13L8
6010h1Q9M7m7L7r1J62r3m7%K3O8r9j6Q4n4l8K8m4P8L5q4k7J42n9L8J8j8L3j11
6039b7j40J80jM5K1k35O8J62r9m4Q5q6R7q5oJ01P5j53m2J03J41j06q2J54L4j95
6065c5R8j23k1lJ29o7q1Qj21P3J11J06N1r2j60K29q9J7O0o2k1K1k0R7j46N7l4
6092a8K3j43J30j20N2J27l8Kmm0lL5m3L7l5Qm8R3j29J63j4j30J80j64O0P1j63
$$ y = [10, 61, 66, -85, -137, 47, -65, -58, 40, -74, -253, 89, -50, -74, 9, 109, 47, -72, -90, 32, -83, -96, 40, 36, -141, -19, -2, -22, -20, 23, -16, 118, -49, -8, 29, -63, 94, -81, 108, 56, 42, 3, 26, 93, 88, -56, -80, -28, 42, 19, -41, -13, -42, 184, -23, -104, -76, -10, -147, 126, 84, -67, 105, 52, 24, 12, -58, -48, -16, -42, 75, 30, -32, -183, 32, -71, 67, -98, -84, 124, -53, 50, 118, -28, -94, 92, 14, 115, -76, 39, 30, 61, 37, 42, -45, -65, 71, 38, -98, 20, -6, -119, -81, 8, 55, 8, 45, -46, 116, 23, -24, -24, -1, 67, -32, -48, 36, -18, -56, -28, -72, 6, 41, -43, -70, 72, 13, 51, 69, 51, 84, -27, -167, 13, 12, 57, 78, -157, -89, 73, -26, -70, 15, -71, 26, -59, -65, 36, 111, -42, -84, 19, 160, 54, -28, 126, 160, -35, 63, -60, -81, -84, 45, -22, -103, -95, -216, -143, -32, 74, 125, 33, -127, 102, 13, 30, 90, 28, 7, 28, 8, 105, -41, 16, -18, 5, -138, -8, -128, -76, 51, 13, 15, 11, -29, -32, 3, -40, -3, -38, -30, -78, 15, -114, 49, 35, -95, 85, -79, -19, 52, -111]
6119a11J00n1J08m0R5q5j8kN0p2Lr1K18j29j09J80j14l5J47p1N4J6j78J01J59
6144A25k01J44k5o1kK8k4N8j06J67o7j84K16r0r4J97o3n0M8J2k2P4n6L1o3p0P7
6171aJ09j54Q4N6j68M6k8nk2j1R2P7m0l0K5K1q2Q7m5j04J24j3O8Qr8J6M1k6q1
6200e4R6m1J49j96k5J30r3j9J59j24o4J84o4nj10M9M5j4l5J12j06j5K42l14l2
6225a45J77j75J64l5J01L3j99L4K76l20k7K15j1j90M8J72q7j21J26k9o0L5J04
6248H6j9j94J45O4q5J5j5jR3j16J74l2j69J07K21m24J02R9j45J03Kl0On4m6K27
6274A14j29M5P0l4j5q4Q6j7J6%kn8r3J19J34k51J23kJ7j18l6J46%j72K10J4k04
6301a21J14L3j6jL8M1j47k0R8R1k13Q1J28k29Q6m3K9L4J5M5J51j66m7J83j80p0
$$ y = [-111, -11, -62, 46, 6, 101, 16, -2, -4, 46, -26, -23, -114, 104, -25, -134, 46, -68, -103, 44, -27, 27, 43, -135, -34, 125, -76, 68, 43, -18, -20, 8, -16, 42, -64, 103, 36, -148, 68, -22, -116, 81, 18, -32, 16, 28, 6, 80, 24, 55, -8, -78, -1, 108, -46, 38, 94, -74, -28, -56, -61, -83, -94, -2, 75, 35, 5, 30, 51, -31, 56, 11, -93, 31, 18, 86, 94, -4, 12, 53, 27, -54, 42, 1, 150, -46, -71, 59, -34, -53, 106, -18, -82, 102, 38, 33, -77, -28, 17, 3, -32, 80, -26, -41, 201, -113, -145, 32, -143, 21, -14, 87, 120, -79, -45, 231, -89, -116, 99, 88, -102, -54, 118, 31, -90, 36, 7, -53, -18, 86, 67, -127, 18, 82, -3, 12, -3, -4, 89, -27, 147, 115, -54, 53, 274, -150, -48, 51, -94, 9, 11, -19, -13, -67, -113, 114, -15, 30, 100, 66, 51, -33, 53, 36, 52, 52, 50, -8, -101, 18, 152, -99, 24, 22, 39, -79, -115, 31, 31, -141, 69, 83, -121, -7, 26, 10, 9, 47, 88, -59, -79, 19, 110, -103, -22, 106, -123, -37, -80, -51, -17, -2, 43, 194, 28, -19, 164, -16, -86]
6327h6J25K2j50J03O4M2j24mN0o4l9K11j8l20K32J7n1j03N4qR8j72J17J66j85
6352b3k4R6j1k6j9J8j06R1NL0q5m5K20j22q9J76K7Mj2p4kJ17k66J71p0l3P2J9
6380C9j9Q7k05L4J58k17J59J49k35J44J17j67m0J37j05J24k39K7K04k14J03j1
6402C0j37P0k7k6l5J42%J6N2k05L31j58l12L23K1j46J31n0m8L5j04Q9Q7k19Q5
6427e5O2j98J24j6J31nr2J2J82j67q5K77j49q4O1j6J53j14j21J65l9m7P5m9r5
6452i0J65p1k7pO2j12R1L5oJ7k42K96R1k22R9l7j46N0j12J47nj03L4K26p4j55
6478i6O9M3qjN1k0J5k8J42k14J3R7r6j24K41o9M4q5n6J89j51oJ10O0k09J49K9
6505H9j05J19j08j3K3j29Q5J21k43N3K14k69K04m6o0N5M5m0R6k30L9K36k24O7
$$ y = [-86, 39, 61, -89, 14, 78, 120, -4, -8, 42, -22, -61, 150, 132, -188, 44, 61, 10, -93, -39, -47, 51, -121, -4, 162, -23, -47, 49, 38, 12, -7, 11, -95, -4, 1, 31, -54, -99, 121, -1, -90, 86, 113, 117, 105, 31, 29, 146, -120, 51, -19, -52, 20, 39, 20, 107, -98, -64, 94, -123, 36, 185, -50, 94, 211, 44, 4, 141, 36, 160, -79, -52, 152, -62, 41, 30, -107, -37, -64, -90, -125, 17, 17, 33, 85, -120, 211, 53, -259, 64, 85, -61, 70, 20, -28, 7, -97, -8, 79, -140, -55, 7, -191, -67, -83, 48, 43, -49, -37, 145, -22, -107, 170, 21, -63, -2, -18, 135, 21, -100, 65, 26, -21, 54, 5, -90, 75, 4, -23, -30, 32, -80, 11, 46, 40, 57, -185, 111, 202, -20, 79, 42, -104, -54, -166, -19, -24, -127, -93, 133, 59, -96, -27, 16, 8, 7, 58, 38, 53, 25, 167, -47, -34, 63, -33, -157, 84, 15, 59, -26, -82, 107, -44, -50, 60, 120, -89, 60, 89, -16, 103, -5, -18, 5, -124, -39, 82, -161, -108, 106, -163, 41, -5, -65, -10, 35, -5, 91, -139, -100, 136, -88, -21]
6529b1J42Oqk45J66k3Oj17J11J57m07L13l2k48J51J78j41K6L6K2k1q9P4nq0j5
6555f4J69k48J01J01j10R1j45P3N2j6r4R3Kn4J99k11Q9J3j34K64j16j88J88Oj88
6580a27N8NM6N3n3J23r2j32K12O7l27L41k3j50P0nm8R3j65J35N6j68q4K13j38
6605d0J26p8p0O0Nm9Q0j68M5J91K3k27K58l2j56J54j74J05j09R2k0r9K5K36j67
6630A1j37J06p7k5J62j33P9J71j80R8p7j33J53P3k23Q4J2Lm2K9NM7p3p6J63q0
6656f0R6P9j05L5L1r6J34k0k13K27o7q6P1%q5l8k6R1nK9N5l1j39J88M8k18Q2J21
6684I8m6j0j40J37r5p9K00j58j0P4Q5k07N8J36j76K01o6m5P6j62Q5J63j94M5J59
6709A29j29M1Q1n8q9M2J7r0m8M6K12j75j79L60k24R9n9M9jP9p0o1L0j01Q7J4O
$$ y = [-21, 121, 127, 119, -126, 40, 17, 23, -94, 17, 174, -233, 80, 48, -200, -49, 129, -12, 14, 50, 72, 51, -38, 36, 31, -49, -64, 105, -143, -42, 59, -51, 40, -105, -32, 20, 4, -90, 3, 5, -49, 150, -61, 28, 41, -93, 171, 55, -133, 55, 61, -127, -69, -64, -18, 35, -18, 105, 13, -119, 93, 160, -167, 174, 151, 1, 71, 66, 18, 111, -54, 81, 137, -31, -115, 98, -40, 86, 8, -62, -2, 3, -46, 34, -134, -89, 102, 125, -102, 156, 124, -32, 122, -52, 53, -56, 36, 16, -83, -58, 178, 11, -126, -20, -97, -122, 40, -93, -14, 157, -23, 75, -2, -135, 18, 91, -132, -48, -36, -33, -75, -46, -41, 6, -67, -143, 20, -60, 36, 115, 10, 45, 76, -20, 114, 94, -119, 108, 41, -45, 26, 26, -59, -97, -123, -32, -37, -8, 47, 16, -123, 65, 113, -105, -23, 98, 52, 42, -98, 39, -56, -135, 65, -93, -103, -29, 56, -151, -93, 43, -133, 68, 2, -43, 33, -129, -44, 119, -75, -30, 129, 0, 41, 122, 64, -25, 17, 34, -56, -104, -58, 154, -21, -200, 160, -64, 35, -24, 25, 24, 103, 33, -28, 2, -99, -12, 2, 8]
6736Hj2Qj35J38om6K18j63j20J30J04j20K2Kn5Q7k2Q6j67pJ45j41m9J92j02j13
6762a18J33m8j0k6MM8J40j74J15m7K9l4j9j38J92K1j03P4k00J51o7lJ19J14m01
6787b48J71J38j36K5L4L4M4q3J55k3j92J29O8j94J57k3q2n0J35p2Np8j04K56p2
6812fm3K74k05j9O3l2%jj61K10m2j52J81K3j43nM4J0J01j84J28L2j87O4P6j18
6838i2L0K47j85jp1J21k3o9m3K72k29K4J29j36o9O3K9Q8K3k09J61Nj26K07j56
6863a0q2J07Q3j20M7p3O9J7j94K30q8l6M7Ok03J86mR3r0k6J27m8o0m8K45k25j6
6890f6J88n9j9k2Rk8k2o3R4M6k02L11j41j36J61Nj31J29j14K06j14PO5J2j23J28
6916A21j23L6O0j74N7O9n4j19J28J0l9K49j12q5m5n7K30j93pP4p0j15J76kp3j0
$$ y = [8, -4, 4, -131, 7, 1, -45, 173, 10, -110, 20, 124, 4, 26, 28, -27, 60, 38, 124, -43, -50, 95, -46, -95, 97, -5, -118, 15, -33, -43, -69, -65, -17, 123, -51, 64, 17, 46, 12, -7, -145, 47, 68, -35, 39, -161, -10, -77, -80, 39, 153, -248, -77, 61, -75, -50, -16, 18, 62, -21, 134, 111, -81, 48, 116, -78, 79, 56, -26, -76, 59, -13, -8, -86, -190, 66, -6, -49, 225, 20, 1, 64, 32, 32, 31, -130, 80, 38, -114, 67, 90, -53, -58, -14, -4, 97, -87, 41, 73, -114, -50, 26, -92, -62, 185, 0, -1, -72, 49, 26, -43, -86, 186, -43, -19, 110, -26, -95, -32, -3, 85, 108, -101, 60, 65, -61, 146, -10, -92, 15, 98, -22, 25, -48, 21, 38, -156, 74, -14, -50, -3, 3, -200, -14, -18, 75, -15, -41, 86, 38, -22, -70, 175, -50, -66, 122, 63, 44, 22, 31, 3, -19, -82, 12, 58, -144, 167, 26, -110, 51, 56, -75, 54, -60, 146, 32, 39, 104, 116, -7, 121, -2, 34, 94, -80, -23, 46, -8, -127, 1, 11, -28, 221, 109, 24, -21, -78, 152, -41, -48, 26, -44, -159, 17, 15, -58, -68]
6942f8Q2j5l0p3K18n4j31J73n0k05K57K8j40O5m5l8j3k6qN9l2K4R4k21J60K4j01
6969f6J37j82J18M1m5N1K9j09M1K0m0K5j39J00L4R5j47J07m3j40J60Mo1N3j14
6994g1J01Q1k63L44n9k61J2K97k20p8lJ91k0k72K95p7j21K4K65j80m4K06j03m1
7018CM5KL8j52nJ16k1j75P6P7n4M6kj2Q3j87Q0K2j5J98o0j27Q6Q9j90J43j78o4
7046a38J82q5L5N9p9k7N2L6m9j8NJ07q4M9kj20J27n2O9j28R7Rj7r5L5K25k45K3
7074b9J95r9k33J29J06o9o9l7J29j15M2K34j95j95J89J79j17j53J36K%Nl2Kk79
7099b74K43J38j82j0J50q7l1Q3q0J24p2j8J29q9j92L44j61j41J74m9l9l4M9J23
7123I8o1k48J30K03j24N2R8j25j4QOM3p7Lko9R3M9j67p0J75M0k5j17Q8J56j36
$$ y = [-68, 14, -1, -31, -104, 114, 60, -71, 102, 52, -153, 104, 132, -8, 57, 12, -26, -39, -65, -73, -14, -46, -22, 72, -149, 11, 35, -66, 71, -111, 7, 48, 3, 54, 83, -26, 15, 35, -5, 20, -119, -19, 15, 110, -37, 70, 27, -113, 47, 51, -10, 43, -71, 30, 111, -152, 192, 133, -128, -116, 181, -39, -117, -120, 71, 51, -221, 74, -3, -124, -100, 165, -15, -59, 147, 44, 3, 48, 50, 88, -64, -69, 47, 26, -149, -73, 4, -50, -4, -6, -18, 65, -122, -42, -20, -35, 163, 103, -24, 62, 151, -39, 104, -74, -138, 44, -41, -6, 53, -26, -53, -1, 35, -14, -32, -27, 80, -4, 45, 43, -77, 50, -2, 67, -61, 36, 45, 28, -67, -32, 193, -52, -29, 166, 67, -166, -37, 69, 0, -69, -106, 23, -92, -50, 184, -11, -206, -17, 162, 45, -108, 28, 30, 30, 35, 3, 5, -274, -31, 107, -75, -85, 65, -22, -53, 30, -50, 74, 2, -16, 113, 24, -168, 176, 15, -126, 48, -1, -40, -74, -25, 98, 37, -211, -81, 122, -2, 50, 148, 23, 9, 17, 23, 66, -11, -8, -10, -79, 14, 63, -104, -174, 1, 41, 16, -101, -13, 143, 7]
7150Gj42L98k69l1J65j17J1%m5P0n3o4J58j29p3J1J91j62o0J63j25MJ00M8j20
7175f4l1Q7k1o0J65P4j39Rj08R5N3j38K8P5k13P7K84q7j13l1R8k3K3j00J51K4
7201A15l4n4m0l2k5J4P6r6p4K35j30j07K30N8j20m3M3O2q3J60j03J7r8N1R0j70
7227e8K5M2Nj11J53L3j42k4K4J37k58J07K28j55p1J34qk50K10M3l5o9N1l2J15
7252I4k46K09r1K5Q7j76O9NK7l4Q1j02M7q0J61L3j28j10J86j02L9R5p5j22J35
7277B7o3M6o5R0r2Q9n9l9K0m2J13km7R5O9k16J44k1l6j8n4J17K1j32R2J36j70
7304Cj5K9j01J68n3q3Q6K3j74J14l2J02M4k12J44n7j28nJ46p0O8NJ5P4n2J3K8
7331H0l2n9N9L1j44K87k43l4J25k7n9m1J4P9j67J1J51p0o0K18q7r9J98n3k5J6
$$ y = [7, -135, 263, -6, -37, 128, 11, 22, 22, -23, 47, -6, -70, 88, -41, -114, -103, 88, -74, -134, 29, -96, -92, 8, 56, -64, -95, -8, -29, -89, 76, 150, 11, 20, -88, 7, 60, -78, -50, 25, -188, -111, 173, 86, -27, -58, 40, 17, 40, -60, 91, 115, 81, 27, -13, -45, -70, -56, 20, -76, -150, 85, -45, -152, 78, 136, 16, -27, 16, 78, -5, 155, 52, 69, -29, 22, 112, -58, -33, 9, 14, -97, 56, 89, -53, -77, -53, 84, -174, -67, 161, 6, -65, 69, 61, -189, 21, 64, 29, -40, 11, -21, 94, -152, 57, -34, -9, 78, -98, -29, -24, 3, -31, 50, -52, -5, -85, 76, 109, -19, -129, 57, -45, -6, 89, 14, -108, 27, -36, 10, -55, 35, -57, 32, -27, -66, -46, -88, 25, 23, -24, 71, 140, -76, 68, 47, 11, -7, -61, 56, 77, -55, 37, 173, 3, -12, 17, -84, 84, 31, -52, 34, 57, -117, -3, -35, 67, 111, -101, 43, -14, -142, -147, -1, -71, -3, 2, 17, 91, 39, 52, 80, 48, -11, 48, 79, -65, 222, -21, -55, 70, 43, -16, -57, -43, 36, -131, -120, 31, -39, -99, 119, 32, -67, 131, 78, 53, 69]
7357F9k4J4l8j03J53o3M3M4j56pN5n0k8J63k19J74l4L1Q0k2j25J1N8j19O5M6R0
7384A08K8k73J55J0m7M1j25L8Q2P2l3j00P3l7P0j8j21Q6N0n1J11j72m5J67j24
7409e5N7P7k04k0J48n9J20nrO2k20J27l4M7j04J32q4k8J39j06J6N2m0k1l9n9J50
7436D0r4q2J02P4o5J3k3m4L1k4J18J1j42N3L3o9N5O2n9m0M3p1K13j51j4M2m0K4
7464dj6k6Q1n2R9J69k14j58J76M5j9j3p7l9N0m3K1j02LJ59J5k02J61J19m5l3p5
7491b0ln4j2K12m9j91J67L8r9j00K73j44n4O5M7j32J10N8k4j92J8J75q7M0m0k7
7517b5J34q9jL6r2j31J52K5k4l2J18j52KO8k0K6MJK3r5P0k5L5j0J64j71Oj38K22
7546H1j4k00K1J92n7pm5J07Q4j55n0J83j58M2Q0o0n0o9J38j07l7J30J4l5j26J34
$$ y = [69, 45, 59, 21, -82, 71, 8, 51, 95, -61, -68, -13, -63, -91, 72, -147, 27, -7, 24, 104, 82, -43, -32, 26, -93, -28, 18, 108, 136, -137, 18, 28, -19, 22, -103, -65, 17, 89, 56, -44, 29, -8, 62, 44, -77, 9, 59, 8, 119, -53, -98, 69, -55, 2, 79, -125, -145, 3, -56, 64, 59, 50, 112, -108, 19, -15, 32, -72, 60, -24, -52, 87, -19, -3, 49, 9, -12, -51, -110, 40, -54, -136, -34, 40, -25, -12, -35, -79, -48, -72, 46, 57, -85, -32, 1, -68, -13, 49, -10, -50, -7, -78, 135, -16, -30, 12, -28, -4, -20, -46, 35, -17, 82, 251, 37, -121, 55, 100, 81, 68, -9, -48, 2, -41, -20, -122, -119, 40, 55, -147, 14, 133, 88, 55, -20, -23, -77, -89, 123, 74, -117, 50, 88, -11, -111, 162, 18, -36, 29, 76, -56, 54, 112, 88, -104, -86, 89, 2, 42, 2, -25, 109, 20, 19, 55, -37, -168, -16, 9, -15, -47, 71, -81, -79, -11, -31, -5, -1, 0, 23, -72, -2, -27, 8, -2, 162, -9, -3, -141, 81, 67, -133, -112, 80, 23, 16, -29, 78, 162, 7, -43, 140, -18, 24, 104, 44, -6, -75, 63, -44, -81, 49, 63, 28, -98, 36]
7572C6M8j45Q2M4n7o3K14j47ln6P6P9r9q8K36k67R3L3J0k5J2m4P2j64J26P5p7
7599Ao4K94k83J6O4M2r6j8j0K48k45p0J56Pk02N2K10j01m1m4J86k2j95J92p3o2
7625e8%K11j48j3J04j5p4m5J9J82j62Q2J2j58k7J44kj3j54Q1Q0N5q3L9j38M1J52
7652A12o2j71K1M3L1Oq5K32j66m1R0L4j32J59q9jLJ26j14N3j24j6N5L2K6n0j08
7679a36O7R4L5r1QMO4rm6K1L4l3rN0j5r3p2K20j55J1J21J7j69J12M9j11n6J11
7707B3Q0j08K2J2Q5o1j23J76j21o3J10N1r0r1J72q4j9m4K20j38k5Q1k7j13O9P4
7733F8nL1j72J39N6j36K4L3q8LM1K6p4mn9K30o5q7Lj4J35n1k2r8N1K1K5o0Q3j1
7763B3ln9K6l1%J9J4M5j6k1M2o4O2n6n1K7L3Q1j03K8n5N7K6j14J42m4j42R6Q9
$$ y = [36, 84, -61, 21, 65, 8, -55, 159, 12, 9, -47, 29, 108, 9, -79, 157, -110, -17, 16, 26, 1, 13, -31, 41, -123, 3, 78, 1, -63, 231, -52, -36, 28, 70, -26, -44, -54, 194, -51, -121, 35, 42, -160, -108, 102, 1, -40, -84, 102, 80, -115, 77, 4, -58, -58, 153, 5, -8, 96, 81, 7, -38, -19, 163, 1, 83, 95, -63, -90, 54, 52, 39, -115, -34, 46, 101, 18, 57, -81, -40, 112, 50, -121, -100, -57, -26, -20, -105, 127, -39, -80, 10, 44, -88, 71, -18, -19, -16, 110, -4, 49, -75, -91, -36, -4, 22, -28, -136, -69, 25, 60, -31, -23, -19, 45, 36, -10, 11, 45, 12, 3, 53, 38, -55, -127, 93, -62, -51, 70, 87, -82, 30, 79, -32, -88, 23, 103, -5, 17, 29, 114, 53, -70, 106, -15, -78, 32, 83, -7, -98, 74, -10, -29, -73, 147, 9, -16, 65, 38, -75, -6, 68, 63, 94, -78, 61, 117, -19, 5, 38, -50, -47, -6, 20, -54, -58, -117, 113, 48, -39, -36, -50, 85, 34, 12, -86, -35, -14, 11, -49, 34, 23, 20, -39, -13, -44, -44, -25, -11, 34, 18, -3, 39, -25, 37, -19, -70, -43, -10, 71, -32, -4, -59, -2, 24, -90, 52, 8, -134, -38, 51]
7792E1l1q3R8l2l1n6PJ93j60Q2k3N8j41J33j8j24O2J3%q6J26pp4R2m7K5l4L0j46
7821a23J46m2LJ25j42mJ15M4o5L5j06m7J32k02K02o1K4p1k4J45l1l2k3L5j04l0
7847a01R9q1l1K52j81O3J5j05N9k7N6m6J66j21k0M2j01O2m5j9J82j48r0J02R9
7872H1n5k2n0L8rO5jR8j38Ro8j6R9j49J86l5K3j25J22J9j40J73k24J39l4M5k5
7899FM0r7J33o9k5ok8L7m0QqQ4l4OR6j15L3O5j91J47l1m9Q6m2m7N4q5O3K4q9J4
7930f0J22j88J28n9O8j2m4J92j07J6o5K5J0p6R2l2n8KJ4m3J15k0j7j21J1K29j35
7957a3K7j6p0K11j19K5M6k42J47m3J6QLK5q7K54j21n5L6j87K64j11n9J43p7J0
7983A5O6r6K8l9J28q5J40k00jP8K1o3J4j49K10j9p1K4Q4l2N3j24l1K27k82J63
$$ y = [51, 20, -63, 35, 3, -28, -84, -77, 116, -44, 38, 15, 73, -68, 65, 47, -77, -15, -2, -2, -88, 38, 31, -43, 49, 2, 27, -7, 23, -123, 23, -19, -16, 109, -33, -37, 78, 122, 57, 92, -14, -61, 71, -131, 71, 10, 34, -37, -61, 84, 53, 21, -2, 33, -71, -101, -2, -83, -114, 138, -43, 20, 35, -70, -11, -38, 18, -28, 138, 17, -3, 39, -62, 0, -45, -64, 118, -30, -120, -18, 81, 26, 4, -46, -8, -17, 48, 47, 145, 7, 16, -52, -68, 31, -118, 68, 33, 56, -69, 53, 72, -68, 105, -119, 20, -14, 31, 6, 46, -51, 82, 13, -12, -18, -46, -9, -49, -41, -49, 35, 1, 7, 103, -12, 21, 86, -105, 42, 11, -38, 48, 6, -41, 13, -72, -9, 15, -74, -60, 62, -126, 2, -57, 11, -1, -45, 147, 40, 56, -9, 16, 26, -50, 42, 10, -48, -46, -32, -75, 40, 20, 3, -118, -107, 122, -13, 14, -2, -72, 139, 20, 45, 91, -151, -4, -47, -31, -23, -20, 5, -82, 172, 51, -4, 32, -155, 109, -2, -61, 82, 5, 15, 81, -15, 13, -26, 102, 17, 157, -43, -44, 34, 55, -8, 6, -143, 67, 48, -23, 1, 85, 53, 106, -18, -49, 178, -104, 59]
8009E9L3n3p1M0LoJ5l5J61j13j55J65r1n2J10J2k1qL5K1N3k02J71J1j34R3qn3
8037b0Q2n6q3KP2N2n2n8R8j1j7Q8j07L0k1L8m4R1j23l0R4P8k27R1J19j54j8J9
8065f7J27j55M2O7Nrjlk13K15J14j05N3p1kp2l7J12Q3m1j25J48j05j4O9%k0J4
8093IN7K2j00k8J50r1l9O9m7k5K3j31O5J38p5M2J18k08R0j5q1M7j7n0J50n2L5
8120E6l3j60M9K2Q0LN4J5j54L1M9o6qj2K39j39n9Q8q7R3m3j09L1PJ7Q5l6j20J07
8149@j2r4J99o8j06M8M2n8J8j07K05r5r5J97l4jL6r5n6N5O9o9Q9k00J18nq2J9
8177h2L5j8N4o7L8J19p1o0J99j03j11R8O2j31
$$ y = [59, 92, 39, -32, 8, 11, 5, 20, -15, 146, 33, -122, 43, -48, -100, 10, 22, 1, -7, 28, 49, 102, -100, 71, 82, -52, 41, 33, -20, 62, 6, -77, -75, -3, 49, -3, -61, 37, 26, 9, 97, -10, 20, -1, 37, -7, 84, -39, -69, 25, 103, -124, -33, 86, -68, -86, -67, 60, -95, -53, 14, 19, 10, 9, 6, -207, 8, 122, 17, 70, -1, -3, -75, -112, 0, 83, 42, -83, 65, -40, -54, 15, 15, -5, 9, 66, 88, -12, -40, 110, 19, -20, 49, 2, -23, 0, -131, -66, 72, -3, 39, 157, -51, 39, 24, -57, -10, -27, -77, 73, 21, 56, 23, -137, -88, -66, 14, 17, 71, 86, -68, -37, 12, -54, -62, -74, 165, 26, -33, 55, -32, 61, 18, -91, -60, -53, -36, 49, 13, -107, 0, -12, -106, 93, 25, -81, -33, 9, -49, -31, -138, 67, -28, -123, 74, 40, 39, 75, -20, -76, -21, 48, -21, 68, -132, -14, -19, -101, -82, -47, -65, -11, -78, -40, 79, 8, -52, 147, 44, -67, 31, 93, -38]
8191c8
$$ Imaginary data points
##PAGE= N=2
##DATA TABLE= (X++(I..I)), XYDATA
0@%%%%%%qJ6j6J6k4L2m0N6p2Q8j12J44j71K03k48K96l52M16m88N71o64P70q88
29d75J022j174J340j521J723j950K198k469K769l100L462l855M284m754N271n835
45c064O447p117P851q654R534j0503J1570j2750J4064j5531J7180j9048K1186
58A1165k3661K6559l0011L4208l9436M6159n5166O7922q7505J21645j97602O45477
70E19754j43155j105547J112571K03658q84525J19716O88664o30465l52342P26457
80B54786R3595q28998K05839O57863l66438m99573M02107K00913l15607n5137
90b50650K32423k5930o2805K06432J28789l40238j51860M04434J42434l80967
100i7938m6668K64957p1513j76014J64763R3766j99112K5692K13596j90894j90729
$$ y = [0, 0, 0, 0, 0, 0, 0, -8, 8, -8, 8, -16, 16, -24, 32, -40, 48, -64, 80, -91, 112, -136, 160, -192, 224, -264, 307, -357, 413, -475, 547, -627, 713, -808, 915, -1035, 1163, -1306, 1463, -1637, 1825, -2030, 2254, -2500, 2771, -3064, 3383, -3734, 4117, -4537, 4997, -5506, 6064, -6686, 7378, -8153, 9027, -10021, 11165, -12496, 14063, -15948, 18260, -21176, 24983, -30183, 37739, -49766, 71879, -125723, 519754, 376599, -728948, 383623, 587281, -297244, -177528, 511136, -119329, -471671, 254786, 348381, -480617, -274778, 383085, 16647, -482926, -80819, 120094, -195513, -250650, -18227, -44157, -106962, 99470, 228259, -111979, -263839, 140595, 283029, -97938, -144606, 120351, 48838, -127176, 37587, 131353, -67759, -42067, 171529, -19365, -210094]
111b10094K71814M1935k98262J05141K09595j50397k2812J20556j53537m3638
121a29699K77433l872k88563Q6969K48962j64373j23537K38792j7186j87643J87294
132A24577N7214l16408M0570L00977j21985k38560J40287J52613j53508r2480
142a06703J25201k5047j20826J20008P9248j99513o0114K12892P1803j72496n4770
153a30317J94390O4395j82598r182J32864q9916m9108J79850k2289k06001P3615
164d4297J91085j06256j57916J35609R7368j74698l9434J36870o4037p4269J29975
175C0000J0715j20917M5691J05132m0966q9655J8778Q8001M956n9221J79L0940
187B3633K683j1750N500L5785j8834n5959M8475K0578j04796K1550J10106o7797
$$ y = [-210094, 61720, 103655, -194607, -89466, 120129, -30268, -53080, 67476, -86061, -129699, 147734, 143862, -144701, -57732, 191230, 26857, -96680, 142112, 124926, -62717, 124577, 181791, -134617, -94047, 206930, 84945, -153615, -13328, 139285, -14223, -106703, 18498, -6549, -127375, -7367, 71881, -127632, -187746, 25146, 96949, -75547, -130317, 64073, 128468, -54130, -63312, 69552, -20364, -69472, 110378, 88089, -117912, -44297, 146788, 40532, -117384, 18225, 115593, -59105, -98539, 38331, -25706, -99975, 30000, 40715, -80202, -34511, 70621, 29655, -60000, -41222, 46779, 51735, -7486, -7307, 23633, 26316, 14566, 20066, 55851, 37017, -18942, 29533, 50111, -54685, -33135, 76971, 9174]
199I174q8189P3313N3270n9601l1088M8181N647m7091L2979L5098p3858j0029
211e2194Q4074n944m8053J6063K8409K024l0151j2560L5316r728k9521L3670k497
224H908m9429J5808L6117j1562k6553J579K9631r922l0622K8307J1477k9399J8891
237f769J2323j5972K1715J759j3230L0974j181k3740K7673J2294l1255j2422K0073
250B2242Q468l4658l321M1675m0754m7551O7305J2340p4652J8750M4234m0330
262b6252k1336M3423J6392m7872q568P1713j159o5789M4619N1739n9801j2419
274a5310N8610q536m7234Q304L9811k2179n0658M0877L8060o8352j1138O4965
286B7220k5406m3878L9814K0837l9476j4755M0956J2952m7762R882N4056l5055
$$ y = [9174, -79015, -5702, 47568, -12033, -43121, 5060, 10707, -36384, -3405, 31693, -42165, -52194, 31880, 25936, -22117, -6054, 22355, 24379, -5772, -18332, 16984, 7256, -22265, 11405, 8908, -40521, -24713, 11404, -158, -26711, -25132, 4499, -5423, -36045, -7738, 3739, -25660, -6769, 5554, -10418, 11297, 13056, -174, 30800, 29619, 5879, 33552, 45846, 14591, 2169, 22242, 30710, -3948, -7269, 34406, -6348, -53899, 13406, 25746, -48906, -30156, 14078, -26252, -47588, -4165, 12227, -35645, -44213, 27500, 26341, -39448, 5171, 56910, -2891, -15310, 43300, 34764, -12470, -4166, 35645, 13466, -37192, 3685, 41745, -26607, -37745, 27220, 1814, -42064, -2250, 18587, -20889, -35644, 5312, 18264, -29498, -19616, 34440, -615]
298f15k9483N7195M795m3841J5189K4138j7363j7521J6004J8826l0000j7112L8616
311A8828n317l3204K5433Q067l2144N515J5900q588r485j240O095q916p011K7385
325A318j118k8936K0845J8056j6675J4098J3913k0505k944J8655J0039j2307j3394
338A045J6802J655k2585J9764J2449l7997j415K6814j5121j7040J0923N900j5607
351a4413j0459K5044R347l0283J1978K8902k7424o205L6578q007k8200Q509J5862
364A1229q315j3259J2895L470l0542J0204L7027k5397k5701K5086L798j2575J1122
377i58K837j4098k846J9080J1572k1036k867K5167j0188j1498K1013p024j7639
390h485J4960L237j5638J710J4630m76k1802J619K8428r267j7680J9827n235k0779
$$ y = [-615, -30098, 27097, 31892, -11949, 3240, 27378, 10015, -7506, 8498, 27324, -2676, -19788, 18828, 13511, -19693, 5740, 13807, -18337, -12822, 3078, -5510, -14995, -16235, -10140, -19056, -26067, 1318, 200, -28736, -7891, 10165, -6510, 7588, 21501, 996, -1948, 16707, 26746, 14439, 1045, 17847, 19502, -3083, 16681, 29130, -8867, -10282, 16532, 1411, -15629, -4706, 1194, -14413, -24872, 172, 9519, -20764, -8786, 20116, -7308, -13513, 23065, 15058, -13142, -4633, 11229, 2914, -10345, 2550, 6020, -24522, -14318, 22709, -2688, -28389, -3303, 495, -12080, -958, 1879, -12219, -15065, 4015, 15587, -5449, -8316, 16851, 6663, -4835, 16178, 9154, -8485, 6475, 9712, -5926, -4216, 10414, 9938, -11864, -10245, 18183, 8916, -8764, 11063, 5828, -14951]
404a4951K3377J2278k8102o401K2185M963k1023m13K3995j2820j9687K8335L577
417A5313k9849J6158J6733k6809m266K6760M452k4867j0633K3246M759k2473L760
430g716N262j5617Q761P921j9433l389J2104P726K606j5109n315K1616P999q969
444a553n166M474J8123J281j4448Q391L147q699J6554P99k8100N702K2367j4220
458H652k7844Q175L2655r747l5126J6699J6206k8617J2859L2446l4724k6046M3327
471H915K1063l9904j1166M6395K643m7014K0044M0691m1419k4121L9516o221k7359
484a7937K9106J4548m5704j8937M7949K0883m6833j3881L0944j1246j3856K5112
496A48p791k3505K3524K0366k0899j5700J7951J8632j6043j6482J7602J6315K659
$$ y = [-14951, 8426, 20704, -7398, -13799, 8386, 13349, -7674, -8087, 15908, 3088, -16599, 11736, 15313, -14536, 1622, 18355, -8454, -12720, 14040, 18492, -6375, -17008, 6238, 10997, -11476, -7716, -2454, -18071, -9310, -1389, -20822, -24211, -12107, -4381, -1775, -16884, -22199, -583, 7416, -1553, -6719, -2245, 15878, 17159, 2711, 11102, 14249, 5550, 22104, 22903, -5197, 505, 22872, 8652, -19192, -11017, 21638, 11891, -23235, -6536, 9670, -18947, -6088, 26358, -8366, -34412, 8915, 29978, -9926, -21092, 25303, 27946, -19068, 976, 41667, 248, -23873, 15643, 9422, -17937, 11169, 25717, -19987, -38924, 9025, 29908, -16925, -30806, 138, -11108, -24964, 148, -7643, -31148, -7624, 12742, -8157, -23857, -5906, 12726, -3317, -19799, -2197, 14118, 16777]
509A6777n022k4825J771M3520O360l2176j0210L434M761J6077L134k7808j7746
522b1953L5620K7640m8535k9147M8861O341m3870J6046K6033l2299n004M1741
534B1474j1237m4209L7321N4564n8794n5431O6010K9168o4448P641N1460l8407
546d888l2056N8226J3678p2989p33P5322k2590p2200M2569M8646n9886j6320O9330
559B6109n51n2427J8881L3727l7043k0116N3649O128o2033J3307O1535k5165m1518
572b5517L2703K2837k6391m156J9528j4201k3289K4593K3225l0128j0773L5031
584B3462K95l0816k497J3413N668l679j4823q002R734J0539j329q832j129N029
598b967L001Q699p739k9672J1902M0139j4753l0013K2381J7137k4458n246K4519
$$ y = [16777, 11755, -13070, -11299, 32221, 38581, 6405, -3805, -371, 4390, 20467, 23601, -4207, -21953, 13667, 41307, -7228, -36375, 12486, 18827, -25043, -8997, 17036, -15263, -20267, 21474, 10237, -33972, 3349, 57913, -881, -56312, 9698, 38866, -25582, -17941, 33519, -4888, -36944, 21282, 34960, -38029, -38762, 36560, 13970, -58230, -15661, 32985, -26901, -43221, 26109, 25558, -26869, -7988, 25739, -11304, -31420, 22229, 28357, -33676, -20369, 41166, 16001, -25517, 7186, 30023, 3632, -524, 19004, 4803, -18486, 6107, 29332, -796, -11569, 23462, 23757, -7059, -9556, 3857, 9525, 5846, -8977, -16979, -7245, 3294, 1965, -6867, -7996, -2967, 34, 8733, 994, -28678, -16776, 23363, 8610, -21403, 978, 18115, -6343, -11589, 12930]
611A2930o185k5387J8736J7852m0331r442N3350k108m8005J7656L8465k3617k5533
624b1619K6758J1051l2656O122M1869k1639l9946L5416K7647m0874j0920L9822
636B1031k401l9502N640L1712j5299k1182K9808R246l6073P619L4203j8986k5625
649a9809K2920J9369k1015j4197J9562N484k0975M735J7675j4117j1175J4413
661B870J021j5013k051J4137P618j4540q447J5372L237j2321M155R514m791o841
675f080N135P856q855q257J6141M703j9613K451J6051q593j1165R184R709p196
689A471p167J1101M342j6372K473J8350q611j3373J1115O599j2163n983J3241
702E023N157j7185k137J7599o938j4800J2719Q051j2894j827J2245L02j1915R45
$$ y = [12930, 6745, -18642, 94, 17946, -22385, -31827, 21523, 19415, -28590, -10934, 27531, 3914, -21619, 5139, 16190, -16466, -10344, 31525, 9886, -30060, 5356, 33003, -7871, -18791, 21031, 18630, -20872, -15232, 16480, 1181, -20001, 9807, 19053, -17020, -9401, 24802, 5816, -19809, 3111, 22480, 1465, -12732, 6830, 12314, -8661, -3926, 13749, -368, -11543, 2870, 3891, -11122, -13173, 964, 8582, -5958, -14405, 967, 4204, -8117, -3962, 5552, 761, -6080, -945, 6911, -1944, -10201, 5940, 10643, -8970, -6519, 9532, 939, -10226, -1042, 8667, 1471, -5696, 5405, 9747, -6625, -4152, 14198, 5587, -7786, 3329, 9928, -2235, -8218, 5023, 10180, -7005, -9142, 8457, 1519, -13281, -562, 7489, -5405, -7232, 5013, 5315, -6600, -5655]
716e655J4521l961j3130Q960Q128j0861l596P294L53o029p87P949j344j2875N321
731e712J3629q614p953J0931L869r659q85J1835O02j3653M098J3969j0519r810
745g872J4696K093j5682J249J2716k623j2414K779J0595p434p380J3704K968j5606
759h211J536J2821k345q870L727P594p722p181J2834M282j6055O4J2659n000p341
774g208P399L837q941l208J2029M133j2319K29J0571m672m806Q242K011p682k752
789c137O463M107p421l271P294k584o744N914M524o516l596M459M305l585k515
804b303O181j448q004N743P075o684m761L068K458k064j855L340j077p783L128
819d986Q916m642o692M434M352k060k066M918K295p931L33J0789m092q595O612
$$ y = [-5655, 8866, 4905, -8225, 735, 8863, -1998, -5594, 1700, 2053, -3976, -4763, 3186, 1842, -11033, -5712, 7917, -697, -8650, 2281, 6150, -3509, -4394, 7441, 8043, -5610, -1512, 12457, 1938, -7872, 6824, 8917, -6765, -5516, 7200, 4577, -7837, -5058, 5537, -1897, -9277, 4427, 7395, -8211, -6675, 6146, 3801, -5069, -1342, 6252, -1470, -8651, 4183, 8465, -7590, -7526, 5133, 133, -7208, 191, 4028, -4913, -8121, 3908, 8041, -4278, -4049, 6522, 1850, -2956, 5286, 7297, -385, -3137, 3326, 7433, 12, -3259, 4035, 1451, -5293, 621, 5145, -1371, -4967, -508, 3797, 212, -2303, 3878, 2430, -5574, 169, 7244, 560, -4201, -1133, 1325, -739, -2594, 746, -331, -8114, -4986, 3930, -712, -7404, -2970, 1382, -678, -2744, 2174, 4469, -3462, -3129, 7660, 3568, -5027, 1585]
834A585M194p672j498P563L09r057r8R174l646p064Q043K417r770K328R763k385
850D186p219K516O502l544m937O997Q46j0004K597Q251n483n032M680J694m391
865b341r49N507l68p078K724O425m429k031M672j715k041K661M22k100j401J128
881i14J703k498j329K222q09J27R90k595J764L146l119n46L385r47n39J652m07
898A286j828j4L332o32o156K081O302m735m145M770J38k778K893J980l483j367
914b356N363K694o251k9P655l156n348N559J258n394K63K204k294j526K902P3
930A617o886k69Q308j476o872K812K372k358K604J486m500k66N242R56n905q08
946c943O319j456n456L133J649l228K918Q19o448J104Q383P36p450j784P067J883
$$ y = [1585, 5779, -1893, -3391, 4172, 4481, -4576, -4674, 4500, 854, -6210, 1833, 4250, -5520, -3192, 6571, 4186, -3033, -517, 5985, 2441, -2496, 4501, 5347, -4657, -2060, 6191, 708, -4324, 356, 2050, -2341, -3290, 2217, 1849, -5229, -2505, 3920, -509, -2540, 2132, 417, -1624, 1037, 1459, -641, -2042, -914, 789, -1709, -3038, -816, -1625, -1498, -508, -3103, -1339, 1807, -1312, -1858, 1527, 580, 41, 1693, 1286, -542, -556, 2776, 2144, -4012, -1931, 4371, -364, -4509, 261, 399, -2379, 514, 2494, -989, -2356, 3007, 5701, -550, -579, 7076, 3920, -1428, 4131, 5389, -5, 258, 2462, 168, -1358, 1544, 1617, -5269, -5538, 2770, 1294, -5578, -2766, -394, -2752, -148, 1338, -3162, -3428, 1814, 2770, -3135, -3943, 2376, 920, -4536, -1403, 246, -2982, -64, 755, -5693, -4589, 3794, 4530, -2920, -4704, 2363, 4246]
962D246l020J465j041l694N634M260p838l917O244K412m300k154K507j38k192
977a526K136L27l386M110L232o053k313N533J941j993j578n39LJ415R89l603l468
994d773M180K515n484n18L433l027r15M633l42k999K503K431m489j777Q549J995
1010E915r578O02Q567l653n015N057J98n923L594O037p183p198R198O701j0294
1025b975k445J1145j508q335M488M140n664J019P824m402j0199N810J0389p611
1039A676q630P703M032o789r1K897l896o64O952J320p787j277Q005O9p011J892
1055a599M845j782k152l03r32K87J522R86j522k636J258K455j437k232P87L544
1071A089K238l724k495M878P33l864K509K920l605k296L437m11n156J956P176
$$ y = [4246, 1226, 2691, 1650, -2044, 3590, 7850, 12, -3905, 2339, 4751, 451, -1703, 804, 666, -1526, 610, 937, -2449, 1661, 4893, -1160, -3473, 2060, 4001, 2008, 430, -109, -106, 1309, 2298, -1305, -4773, -593, 1922, -3562, -4080, -647, -3674, -4589, 44, -298, -3297, -794, 1637, -2852, -4629, 3920, 5915, -3663, -3061, 5506, 1853, -3162, 1895, 2093, -3830, -236, 5801, -1382, -8580, 618, 7319, -2975, -5420, 5725, 4217, -4118, 370, 4510, -1154, -135, 7689, 3287, -6912, -1102, 9287, 1676, -6954, 749, 4781, -2008, -2099, 798, -3098, -3762, 3190, 4510, -3277, -4554, 3451, 3520, -3491, -1599, 3246, 1464, -688, -991, -1923, -1636, -114, 872, -650, -3286, -2028, 427, -1010, -3242, -2455, 1089, 3327, -397, -2892, 1986, 2719, -1145, 1364, 4284, 679, -1617, 1820, 1409, -3747, -1791, 5385]
1086E385m326p618O045M908q047j233Q682o80o232L451M764o391l008R590J635
1101F925j0667J633R088n728p727O501M750o577j814O048j654p398M645P219o405
1116a161m177Q551J502q183K93O494q53m662K722L073n383k432N883p6n453K180
1132a682M408k986m047K119L694j387k053L487J619l849k25L443o31k447J522
1147I85K606k364m245K346L323l497j890M495K81m704P3L682p11k857K799L590
1163C912m148k379N262O32n513J272M917k171m880J873K785l468j815N493K53
1178B025n855J329M778k733l145M059K985l704j776M500P98m924J312M550k809
1193A390l451L045J335m386j273M390J193m561R0L945k206k990L921K484l614
$$ y = [5385, 1059, -6559, -514, 4394, -3653, -4886, 3796, 3116, -3116, 335, 5099, -1292, -4300, 5290, 6925, -3742, -2109, 6979, 1251, -6476, 25, 4775, -1802, -3616, 2432, 778, -6620, -1975, 5244, -1161, -5338, 3213, 4715, -3468, -3175, 3319, 2466, -2196, 526, 3599, -1784, -4216, 1667, 1591, -3862, -1682, 2726, -260, -4307, -2188, 1506, 119, -1934, 1553, 3172, -677, -902, 2541, 1910, -537, 985, 3591, 1227, -3018, -672, 2651, -846, -2736, 1759, 2040, -2664, -2591, 1091, 380, -2477, 322, 3912, -236, -2615, 2647, 3279, -2234, -962, 3955, 1784, -3096, -1223, 1562, -1906, -3721, 1772, 2025, -3830, -2501, 2277, -456, -3601, 458, 3443, -261, -2037, 2463, 3261, -1663, -351, 4199, 1390, -2061, 984, 2319, -2067, -3340, 1050, 2243, -2318, -2228, 1717, -489, -3479, 442, 2926, -688]
1208f88j549L968P69l856M1M151j555l828K874K228m225j859L630J111l220R1
1224a917L445j539l630L253L677l220j833L671N47l204L00L492j346l998K298
1239dL091l641k393L538O13l353P73L475j283l844K018L626k459j823L713N77
1255B624l797O92L736j439l856J380K740k674k510K933P92l909P51M196j107l380
1271b828J646K933k206j685L403J349l982J98M347j087l257J804J840k851k057
1286b433K702R85l650m43M154m39k979K142K274k482j599L062J559l555r05L956
1302B349l47l173J911K308l143k061K691P83l662o35L480l24k995K343K937k804
1318c42j514L540P04l285o2L156j015k997J993K692k982j843L036J19l464L89
$$ y = [-688, -2237, 1731, 2500, -1356, -1315, 2836, 1281, -2547, 327, 2555, -1670, -3529, 101, 1212, -2008, -1917, 1528, -11, -3641, -388, 3289, 69, -1764, 1907, 2454, -750, -450, 3042, 1696, -2302, -4, 3087, -554, -2947, 591, 1204, -2149, -1376, 2099, 816, -3028, -1010, 2616, 157, -1666, 2047, 2624, -1173, -481, 3255, 1816, -2040, -660, 2080, -594, -3104, -171, 621, -3288, -2537, 1659, 552, -2828, -1182, 1751, -455, -2140, 1263, 2612, -1370, -1172, 3175, 2088, -1169, 635, 2475, -376, -2433, 269, 1254, -2396, -2839, 1315, 876, -2103, 39, 2313, -169, -1768, 1294, 2853, -702, -1607, 2349, 2002, -1171, 740, 3048, -95, -2156, 535, 1318, -2344, -2979, 501, 177, -2818, -475, 2462, -342, -1856, 1684, 2388, -897, -959, 2197, 1182, -1815, 178, 2870, -112, -1955, 1081, 1200, -2264, -1875]
1334a875K476j380k284K117K443k092j058L137N69k588O40J903j402j659J423
1349C70J381j944j177K069L97k238lJ785j048j497J064J215p36o85J689J319j818
1366A43j02K224n49k202M79J542j054j792J120J508j972p12K045l01k330J033
1382i20K003j474j640K240J615k020o29K724o5k779J176J695k145j379K011J46
1398E59k634M12K481r13k519J552K029j856o04K090k5j500J189J608j182j345
1414f58J831Q97j994n89J414m00j250L71P69p21k21N04J70o46L45R88j18r55N01
1433B38Q26k4n21l75N26N2p84j82M04q61m96P34l9q44K09R33q6j028P20J792j037
1454A57r73J578M64j135K10P27o55r10J027N21j981n23J835k40j742Q86J136r98
$$ y = [-1875, 601, -779, -3063, -946, 1497, -595, -1653, 1484, 2053, -535, 105, 2008, 606, -1053, 370, 1751, -193, -1370, 699, 1096, -1142, -1145, 640, -408, -1905, -841, 374, -362, -1047, 642, 1961, 143, 41, 2265, 1716, -486, -7, 1535, 481, -1311, -191, 1317, -655, -1367, 678, 377, -1953, -920, 1083, -391, -2031, 209, 1824, -196, -825, 1899, 1834, -945, 231, 1926, -219, -1598, 413, 559, -2075, -1663, 818, -95, -2614, -1062, 967, -889, -1493, 597, 572, -928, 261, 1869, 687, -658, 1173, 2070, 76, -513, 901, 501, -749, -378, 391, -330, -551, -47, 123, -523, -178, 810, 692, -263, 238, 1064, 1040, 519, 144, 670, 722, -62, -244, 160, -701, -1197, -463, -502, -1346, -1137, -204, -290, -1318, -598, 1194, 157, -816, 762, 1226, 91, 301, 1028, 373, -537, 490, 1011, -970, -1493, 342, 102, -1640, -754, 382, -616]
1472f16l65J110J74p41Q98J328j143j104J644M69j652r1J089o47o42L25l24q56
1490a144M88J050p87q29Q84Q20r27P9J012k52L9M75l72p04M81N07n74p46M68L0
1510bp84m1L49l31P8Q14l32o90Q23M33l10n9O65N51o94j43L60m56j25O16m46o94
1532d18J58J3n38j00M47K56r6L9M9k46L66P37j98J01L58j5o51J51O5m29J84M15
1554F48p14p76K07N36q75k13J398p6r36N35O65p71K44J144Pj161L33J099j215
1573G9r97J284M33j396j43Q41q04o72R37Q69r97k46J363L5j287M93J597p49o19
1592B1J009Q9j368OJ008k90j138N68O19j409o27J182L89p97M03P70k41p79O53
1611F8P99m55j12Q13j88r38j90O89k20o53N9M41m66q26M35N36o19Q6J061j58n93
$$ y = [-616, -981, 129, 303, -438, 460, 1788, 645, -459, 1185, 1654, 2, -89, 1000, 353, -289, 36, -288, -1144, -656, 394, -393, -1222, -338, 482, -445, -366, 646, 394, 433, 908, 536, -168, 313, 820, 246, -500, -32, -2, -786, -827, -478, -809, -731, 83, -249, -939, -116, 317, 7, -52, 613, 1164, 470, 327, 687, 231, 106, 722, 276, -418, -260, -247, -785, -885, -438, -182, -278, -239, -190, -436, -70, 667, 469, 570, 928, 913, 262, 413, 478, 49, 233, 648, -66, -842, -635, -99, -974, -1187, 211, 135, -801, -266, 399, -372, -128, 1016, 1023, -138, 195, 1294, 79, -918, 366, 799, -597, -740, 101, -703, -1375, -438, 431, -566, -812, 551, 586, -701, -208, 1389, 640, 21, 1030, 1119, -249, -243, 765, 475, -663, -95, 524, -885, -1512, -330, 59, -738, -335, 435, 194, -585, 68, 867, 412, 300, 1113, 925, -13, -203, 486, 266, -387, -328, 113, -353, -1179, -744, -208, -827, -741, 320, 162, -431]
1632d31K53Q71j34n74P46P53j176n15Q10r3j067M03Q12o73j073L15Q76o65m70
1651a032J295K37r79K44J053m02o40Q65P62j029o45Q65j56j251K24J194q25q13
1669a033O62J70p03j94J087N37j065L71J047o05o25J126M75p23n57P66r4j118
1687d76L3J228n97j137P42M08j087j12R71L09p29K45J118m49r12R35O37r90j78
1706d1Q76k65j021p6P17j76r04M71O24j167l94J251Q2o57N23P67j27q60P03R23
1726A249p99p07J193n0j286P4O62l35m80J61O21o16p72Q65M94r24J97R30j96l03
1746b2L33P02l86p14O59M84j253l72R57m78q56N20P25n90o18N85O90r87j40J164
1766D03Or12P35Q47n94l95N26N06r62o88R38j86j501N13R66o31o06R55N49r00
$$ y = [-431, -178, 693, 559, -15, 731, 1484, 308, -207, 603, 510, -557, -154, 658, -15, -1088, -773, 103, -562, -1032, 263, 500, -479, -235, 818, 416, -224, 641, 1403, 374, -271, 594, 438, -813, -589, 605, -220, -1033, -371, -201, -904, -1098, -11, 526, -539, -168, 879, 274, -351, 775, 1250, 527, -30, 736, 642, -476, -443, 785, 188, -949, -207, 201, -886, -998, -27, 282, -447, -202, 916, 467, -445, 490, 1127, 137, -41, 835, 570, -451, -527, 190, 14, -890, -419, 205, -962, -1356, -105, -23, -680, -157, 610, 483, -377, 326, 1249, 450, -257, 936, 886, -400, -326, 336, 1, -479, -318, 303, -313, -1085, -220, 274, -650, -453, 477, 281, -22, 311, 1013, 627, -87, 572, 1056, -197, -569, 388, -90, -946, -426, 299, -291, -909, -324, 366, -621, -761, 403, 409, -503, 232, 1079, 485, 90, 616, 1122, 160, -528, 410, 224, -1277, -764, 202, -429, -1035, -80, 469, -431]
1786d31l02J269O7j393O14J317r37o43J420K20j313l3Q91m07j377M53Q91j102
1804g96o61J546K59j049L04J108k78r36N92R50r05q15J472K75j339M28Q90o91
1822C54r56L03M33p02p06J090K94j100O23R77n18k46O00K60m12n59O98L57j000
1841b10J74N94l62l25J56q5k63m86J14O81o07l79J096K56o65L98O39k8m99n3P49
1862H95m55r22R81K63j382K71Q78o33p41M95N31n75o95J090O10j422N89J578j130
1881B26o44J344J01q47o23J148j3j529K36J422j412n83J415k71j177Q87O23l97
1899i4o71O29J051q09l90J251k24j064P84R9p75Q5O6J26k33o73P17M6p33L59O65
1920B12m48K31l8J04N15l89k5Q44n46m40O81k64n35n6J00K09o36m18J022k16j049
$$ y = [-431, -733, 536, 603, -790, -176, 1141, 204, -439, 981, 1201, -112, -145, 746, 339, -1038, -585, 306, -796, -1457, 89, 348, -701, -397, 711, 433, -503, 89, 1039, 134, -681, 791, 1066, -273, 155, 1045, 354, -602, -299, 134, -568, -1274, -184, 110, -990, -367, 610, 92, -154, 446, 706, 294, -265, 433, 790, -210, -36, 558, 196, -129, 27, -58, -321, -807, -693, -12, -619, -998, 98, 354, -311, 87, 726, 698, 199, 146, 895, 440, -482, 499, 762, -620, -349, 529, -104, -845, -350, 181, -394, -1089, 1, 611, -811, -222, 1356, 226, -418, 926, 1027, 180, -443, 705, 692, -837, -601, 821, -591, -1174, 241, -30, -1207, -320, 303, -94, -765, -136, 915, 106, -284, 967, 743, -321, 463, 562, -213, -128, -62, 64, -169, -842, -125, -79, -812, -453, 212, -236, -5, -43, 61, 576, 187, 162, 1006, 460, 20, 701, 437, -98, -154, -54, 155, -481, -899, 123, -93, -1142]
1941a142J049N36j105N06Q11m06m06K29R96n89r37J094L41j800N51R47j215l33
1959h73J024j99q00K16P92j09j106R11J049j105k3J033n75j84M98l4l17k62J25
1978F1L34q13l40Q70m49k74N41k96j7M97j82Q0L07j88K89ql33L68r5m5K34o81
2000a40N6N55q53k85O08k42l77L41J05m6o9L78M77p38J60J091p62o28J105p1r38
2021b73M91J76n57m35L68M91q77l13J270l36j030J007L52p28M44M30l44K9J40
2040C05M35n46m13R78k66j233P80J91r41L36M66m11k09J40N20k55m48J044K34
2059G07j131P97N55j176M72N06o39k97L98ml95m83P20Q1j201Q04O96j144L21R52
2079E39o83n8N79Q9k12k80K55N39q78M0Q36j158j44P16p27q1N14q9j40o4j1P14
$$ y = [-1142, -93, 443, -662, -156, 655, 249, -157, 72, 1068, 479, -458, 636, 977, -823, -272, 675, -540, -873, 151, -48, -848, -632, 160, 51, -1055, -144, 905, -200, -223, 810, 235, 51, 549, 515, 198, -64, 61, 395, -418, -758, 112, -337, -611, -70, -366, -383, 114, -68, 12, 319, 131, 420, 412, 79, 447, 352, 307, 541, -140, -84, 471, -382, -667, -59, -301, -678, -337, -232, -278, -347, 31, 508, -230, -70, 1021, 259, -369, 736, 665, -273, 218, 394, -163, -598, -230, 261, -616, -929, 341, 5, -1025, -18, 334, -394, 50, 480, 136, 165, 305, 740, 194, -219, 759, 493, -740, 40, 231, -710, -374, 92, -319, -528, -388, 132, -123, -571, 473, 707, -424, 373, 928, -248, 224, 730, 91, -206, 192, 188, -207, -690, 30, 111, -1090, -286, 410, -734, -413, 539, -144, -202, 377, 466, 254, -26, 229, 768, -110, -70, 766, -392, -536, 180, -547, -628, -114, -203, -343, -407, -418, 296]
2101B96n02r2R27m42l19R51m63m06M54k51j37K92n34J10q2m11M75o3m15Q80n02
2122b34m53J088k32m96P67r8k47K37j01L04k97m55P20l39q88P87j68q52P10J18
2142a29k97L34o4K38J10m51Q08K62j044O06N52j086J68L44l71o5j42J14L40q89
2162f62J30J060j108L9Q60l98k13M08j0K68k47j60P36m56n06R55m45o31O44m37
2182a73l77K46k40L23jl59O88J2o03O79K62n55M88n2n6L07o77L23N14j049K98
2203bM76o93J4J41l49K47p1j83P00l21k18P29j70j74N46m16O7J76n24L39j6p76
2225d78N57%o83N39k11k35L80k07J67K59n19N70M06p86L15O87o70J47K6j90L31
2246D05o90jO97q35k40R77n07k80M28l8K85l21j03Q71l96o79J250p2q66O26k3
$$ y = [296, -206, -298, 629, 187, -132, 819, 356, -50, 404, 153, 16, 308, -226, -116, -198, -609, -134, -197, -612, 268, -234, -687, 401, 169, -327, 440, 342, 95, 332, 231, 535, 238, -217, 503, 164, -724, 63, -105, -957, -247, -129, -426, -92, -156, 82, 192, -259, 549, 811, -233, 373, 925, -161, 7, 351, -20, -85, -227, -113, 227, -662, -532, 528, -580, -541, 319, -79, -292, 116, 106, 374, 127, -33, 703, 247, -259, 696, 251, -380, 264, -173, -550, -304, -544, -221, -222, -581, 107, 119, -484, 195, 457, -98, 390, 338, 282, 589, -88, 235, 749, -300, -2, 474, -219, -205, -64, -413, -166, -237, -420, 280, -41, -259, 470, 300, 126, 672, 256, 323, 499, -25, 314, 298, -478, 79, 79, -604, -65, -276, -511, -131, -338, -171, 88, -431, 139, 545, -241, 74, 761, 91, 238, 264, 74, 405, -285, -286, 411, -424, -664, 313, -194, -474, -46, -84, 201, -120, -223, 648, 252, -427, 823, 751, -115, 511, 488]
2267D88n03L9j02L44m42o51R79L8j152P71P63j172K73O41j43j32k13O37L90j374
2287e21P15R73j475k17J020o07m28L13L0N6o26L08R47j057j58J372p67m96J114
2306D96r0l02J93j67K18j72l76Q10m18q23P41j87n11O39l01k00P29p03J93Q62
2326F31p42lO52l12J65l57K3P23r49l29J520r23j200J325k6j061L70M51J4n29
2346e57LJ468p99r95J761J13k007J157J067j305n10Q46M06j091p40J838k34k109
2364a688J532J303k172K56J665p47q83O31Q77l25j199J275O92j656M76J363j477
2381g7n98J124l73o20J64K88l4m10K27Q65r15l6J248q03k25Q38n89RM48n63n0
2402h2N14n44k2j43J66K16q70K59J080j330r8J683q36o39J192K75r25j99Q24M24
$$ y = [488, -15, 24, -78, 266, -176, -827, 152, 190, -962, -191, 572, -600, -327, 314, 171, 39, -174, 463, 853, -521, 194, 1167, -308, -525, 495, -112, -540, -227, -197, -141, -767, -459, 488, -569, -727, 645, -122, -618, 496, 406, 104, 297, 130, 348, 176, -200, 610, 192, -631, 110, -77, -588, 51, -250, -450, 279, -424, -231, 631, -111, -114, 538, 226, 391, 34, 57, 780, -169, -498, 1022, 99, -1101, 224, 198, -863, -493, -42, -28, -557, -554, 914, 115, -880, 881, 994, -1013, 144, 1211, -94, -604, 242, 648, -443, -1183, 655, 421, -1688, -156, 1147, -1025, -769, 896, 149, -734, -103, 774, 449, -750, 525, 1217, -439, 37, 1400, -77, -675, 449, 76, -544, -380, -92, -126, -536, -309, 556, -359, -395, 853, 50, -175, 663, 74, 83, 531, -32, -82, 432, -112, -134, -277, -111, 105, -765, -506, 574, -756, -854, 829, -7, -646, 546, 821, -104, -303, 521, 945]
2422I45j696M26J653j531j002K238o01j879J247R57j202p22J247Q91j551l27K466
2439A559j021j816K065N17k042N10J253o66j197O99J023r74j074J651J2j794J118
2456a77P98j395L42R24l78j47R1N52l5q60N47M27j211N17N68j260N51M54r01M34
2476a59K57n73J39L60j10j65k17R81l4j237J201P32j701M33J341j381m38R15n1
2495B93p88j52J076k6j650J067J494k164r1K065r62j002J159O32q28n91R28N50
2513A010j814K86J722j538q97J915n12j401J128L95o17k86N30Q68j202k61J850
2530A176q93j048J624j75j294Q64K77p26R7Q0K59n01m07Q33l07p16J257j05j135
2549h40J297L1j024O88K49l07L3j09N08m41o13R77j26j279J052K90j505P07O76
$$ y = [945, -751, -325, 1328, -203, -1205, 1033, 432, -1447, -200, 757, -445, -1167, 80, 971, -580, -907, 1559, 538, -1278, 787, 1304, -738, -228, 1025, 359, -838, -139, 884, -90, -1164, 487, 499, -1295, -177, 621, -774, -432, 492, 114, -33, 58, 610, 575, -285, 262, 689, -522, -5, 563, -697, -146, 308, -593, -159, 98, -475, -336, 24, -86, -251, -468, 513, 479, -758, 443, 1175, -526, -93, 1248, -133, -571, 344, 293, -495, -647, 429, 403, -1247, -180, 1314, -850, -941, 1124, 162, -840, 319, 951, 123, -468, 460, 1010, -804, -518, 1204, -334, -1231, 684, 172, -1229, -101, 294, -323, -609, -79, 789, -413, -674, 1176, 283, -765, 859, 684, -610, 254, 531, -195, -98, -18, 241, -260, -667, 166, -141, -857, 400, 295, -840, 457, 488, -536, 152, 401, 94, 127, 18, 526, 85, -528, 449, 323, -956, 96, 386, -1119, -412, 264]
2568B64o16L1J61M70j80n65R21J36j233Q28R07j631K63Q88p30j93K32J40M8p42
2588f01N51M22j129L90J217j162l4J001o83q2N20j42k2k09o2M53p45N5O75r33
2608e20o6R48o52k18O44m83J86K12j97L74k69K8O33n35l59J027o08n36R50n57
2628Bk99K05M4J28l24j97Q93o26n28J199j47r65R50J96n38J56o1L86l41m70R25
2649E88k97r67O82K99q24L41K31l37J30j31L93J08n40M23N53r64L61O02o00J3
2669F4J90k02P9l46j8N94q06j2P04n57k09O65m17J50L04l20N64j59m62O25j00
2690C31n33N07j33k38K73l05q3K44m70J58M62p92L17M69l90K06Q2l1L55l90r8
2711e9P41p97o7Q61o55k87O37o58J79J48m62N14j80m77P71k42m98P55j17k17N25
$$ y = [264, -352, -321, -160, 310, 130, -435, 486, 622, -611, 217, 1124, -507, -244, 644, -86, -279, -47, 93, 141, -601, -50, 372, -757, -367, 850, -312, -346, 655, -28, -110, 410, 268, 246, 37, -25, 428, -317, -262, 413, -520, -586, 362, -290, -508, 136, -347, -161, 51, -146, 228, -41, -13, 620, 85, -274, 753, 145, -391, 559, 2, -297, -92, -48, 80, -244, -441, 452, -174, -702, 497, 350, -615, 335, 531, -7, 149, 88, 474, 133, -337, 588, 291, -676, 6, 305, -519, -178, 53, -284, -154, -285, 108, 216, -324, 99, 652, -312, 49, 651, 51, 64, 254, 52, 131, -215, -233, 361, -445, -457, 247, -310, -519, 146, -271, -121, 183, -137, 427, 268, -194, 431, 331, -202, 305, 172, -66, 207, -98, -181, 63, -407, -249, 213, -579, -262, 207, -183, 23, 105, 74, 429, 39, -59, 682, -115, -182, 679, 24, -263, 374, -284, -105, 43, -419, 95, -85, -562, 209, -33, -531, 224, 107, -110, 415]
2732D15l83l6M76o16K87K04o52M63j17o29P31k21n48O96j64l83O85k51j83O50
2752D24l70J24J02k98M84j98o36R64j90j058R18M0p34K89J25o0k0l24O86m7r08
2773f87R11M14j070O24N37q32J15K94k05P4l76K89L22j109M30P78j232J92R27
2792C96o48rK88j37K55j22o1M73n46Q3M61n74J68N68r82K47P09j061k0P93m50
2813a69k07K23K44m5p52R06O85j454K90J475j183p98J469r3j202L34J002m90j235
2832a000Q60J236j802m08K277r14j470J441P54j462o4J362J64j590J79J965j502
2849B6j337K034J14k101Q95J212j173n62Q69O22j219k68J678m92j386J474O11
2866I97j675O30Q38p73k85M86n2k62k30L87J69o79N57R9q55R29M0j040R47K73
$$ y = [415, 32, -4, 472, -144, 143, 347, -305, 158, 41, -588, 143, -78, -626, 70, -94, -477, 208, -43, -226, 424, 54, 178, 280, -18, 466, 268, -368, 596, 406, -652, 266, 306, -428, -139, -14, -74, -94, -418, 268, 221, -687, 224, 638, -432, 192, 729, -103, 12, 306, 101, 175, -201, 88, 410, -699, -269, 509, -723, -531, 396, -252, -261, 27, -110, 145, 23, -38, 435, -111, -28, 433, -141, 27, 595, -387, -140, 569, -492, -512, 281, -169, -376, -153, 91, 46, -706, 200, 885, -569, -279, 1196, 13, -785, 684, 591, -611, -277, 725, 235, -1000, -140, 1096, -706, -1114, 1163, 249, -1221, 220, 974, -488, -552, 810, 974, -616, -437, 1528, 26, -1311, 723, 837, -1264, -369, 843, -330, -892, -23, 599, -620, -888, 790, 298, -1088, 386, 997, -678, -48, 790, 17, -268, 218, 166, -96, -326, 61, 230, -449, 108, 207, -648, 281, 321, -719, 228, 501]
$$ [...]
8191E0
##END NTUPLES=NMR FID
##END=
