##TITLE=1H_DE-80H_X3
 200.13MHz, d2o
 8 sc
 
 19ns.26.2.2025
##JCAMPDX= 6.0         $$ Bruker NMR JCAMP-DX V2.0
##DATA TYPE= NMR FID
##DATA CLASS= NTUPLES
##ORIGIN= UXNMR, Bruker Analytische Messtechnik GmbH
##OWNER= pz
$$ XWIN-NMR		Version 3.5
$$ Fri Jul 11 10:12:11 2025 Russian Standard Time (UT+4h)  Yarkov@DPX200
##.OBSERVE FREQUENCY= 200.1313
##.OBSERVE NUCLEUS= ^1H
##.DELAY= (6, 6)
##.ACQUISITION MODE= SIMULTANEOUS
##.ACQUISITION SCHEME= undefined
##.AVERAGES= 8
##.DIGITISER RES= 18
##SPECTROMETER/DATA SYSTEM= spect
##.PULSE SEQUENCE= zg30
##.SOLVENT NAME= CDCl3
##.SHIFT REFERENCE= (INTERNAL, CDCl3, 0, 14.3821)
##AUDIT TRAIL= $$ (NUMBER, WHEN, WHO, WHERE, WHAT)
$$ ##TITLE= Audit trail, XWIN-NMR		Version 3.5
$$ ##JCAMPDX= 5.01
$$ ##ORIGIN= Bruker BioSpin GmbH
$$ ##OWNER= Yarkov
$$ C:/Bruker/XWIN-NMR/data/yarkov2/nmr/H-C/1/audita.txt
$$ ##AUDIT TRAIL=  $$ (NUMBER, WHEN, WHO, WHERE, WHAT)
(   1,<2025-07-11 10:11:08.64 +0400>,<Yarkov>,<DPX200>,
      <created by zg, POWCHK disabled, PULCHK disabled
       configuration hash MD5:
       00 E9 B6 7A A2 85 ED C7 34 08 36 98 17 FE 4E 26
       data hash MD5: 16K
       2A FA 1C 24 F1 B6 26 69 2E C5 55 A4 CA B2 7F 6E>)
$$ ##END=
$$ 
$$ hash MD5
$$ 93 BE 28 D4 7A 4E 3A C3 46 F6 FB 18 09 B3 0B 4B
##$RELAX= 
##$RELAX= 
##$RELAX= 
##$RELAX= 
##$RELAX= 
##$RELAX= 
$$ Bruker specific parameters
$$ --------------------------
##$DU= <C:/Bruker/XWIN-NMR>
##$EXPNO= 1
##$NAME= <H-C>
##$PROCNO= 1
##$TYPE= <nmr>
##$USER= <yarkov2>
##$AMP= (0..31)
100 100 100 100 100 100 100 100 100 100 100 100 100 100 100 100 100 100 
100 100 100 100 100 100 100 100 100 100 100 100 100 100 
##$AQSEQ= 0
##$AQ_mod= 1
##$AUNM= <au_zg>
##$AUTOPOS= <>
##$BF1= 200.13
##$BF2= 200.13
##$BF3= 200.13
##$BF4= 200.13
##$BF5= 200.13
##$BF6= 200.13
##$BF7= 200.13
##$BF8= 200.13
##$BYTORDA= 1
##$CFDGTYP= 0
##$CFRGTYP= 5
##$CHEMSTR= <none>
##$CNST= (0..31)
1 1 145 1 1 1 1 1 1 1 1 1 1 1 1 1 1 1 1 1 1 1 1 1 1 1 1 1 1 1 1 1 
##$CPDPRG= <>
##$CPDPRG1= <>
##$CPDPRG2= <>
##$CPDPRG3= <>
##$CPDPRG4= <mlev>
##$CPDPRG5= <mlev>
##$CPDPRG6= <mlev>
##$CPDPRG7= <mlev>
##$CPDPRG8= <mlev>
##$CPDPRGB= <>
##$CPDPRGT= <>
##$D= (0..31)
0 0.7 0 0 0 0 0 0 0 0 0 0.03 0 0 0 0 0 0 0 0 0 0 0 0 0 0 0 0 0 0 0 0 
##$DATE= 1752214268
##$DBL= (0..7)
120 120 120 120 120 120 120 120 
##$DBP= (0..7)
150 150 150 150 150 150 150 150 
##$DBP07= 0
##$DBPNAM0= <>
##$DBPNAM1= <>
##$DBPNAM2= <>
##$DBPNAM3= <>
##$DBPNAM4= <>
##$DBPNAM5= <>
##$DBPNAM6= <>
##$DBPNAM7= <>
##$DBPOAL= (0..7)
0.5 0.5 0.5 0.5 0.5 0.5 0.5 0.5 
##$DBPOFFS= (0..7)
0 0 0 0 0 0 0 0 
##$DE= 6
##$DECBNUC= <off>
##$DECIM= 32
##$DECNUC= <off>
##$DECSTAT= 4
##$DIGMOD= 1
##$DIGTYP= 9
##$DL= (0..7)
0 120 120 120 120 120 120 120 
##$DP= (0..7)
150 150 150 150 150 150 150 150 
##$DP07= 0
##$DPNAME0= <>
##$DPNAME1= <>
##$DPNAME2= <>
##$DPNAME3= <>
##$DPNAME4= <>
##$DPNAME5= <>
##$DPNAME6= <>
##$DPNAME7= <>
##$DPOAL= (0..7)
0.5 0.5 0.5 0.5 0.5 0.5 0.5 0.5 
##$DPOFFS= (0..7)
0 0 0 0 0 0 0 0 
##$DQDMODE= 0
##$DR= 18
##$DS= 0
$$ [...]
##$SUBNAM2= <"">
##$SUBNAM3= <"">
##$SUBNAM4= <"">
##$SUBNAM5= <"">
##$SUBNAM6= <"">
##$SUBNAM7= <"">
##$SUBNAM8= <"">
##$SUBNAM9= <"">
##$SW= 18.0517328524113
##$SWIBOX= (0..15)
0 0 2 0 0 0 0 0 0 0 0 0 0 0 0 0 
##$SW_h= 3612.71676300578
##$TD= 16384
##$TD0= 1
##$TE= 0
##$TE2= 300
##$TE3= 300
##$TEG= 300
##$TL= (0..7)
0 120 120 120 120 120 120 120 
##$TP= (0..7)
150 150 150 150 150 150 150 150 
##$TP07= 0
##$TPNAME0= <>
##$TPNAME1= <>
##$TPNAME2= <>
##$TPNAME3= <>
##$TPNAME4= <>
##$TPNAME5= <>
##$TPNAME6= <>
##$TPNAME7= <>
##$TPOAL= (0..7)
0.5 0.5 0.5 0.5 0.5 0.5 0.5 0.5 
##$TPOFFS= (0..7)
0 0 0 0 0 0 0 0 
##$TUNHIN= 0
##$TUNHOUT= 0
##$TUNXOUT= 0
##$USERA1= <user>
##$USERA2= <user>
##$USERA3= <user>
##$USERA4= <user>
##$USERA5= <user>
##$V9= 5
##$VALIST= <valist>
##$VCLIST= <CCCCCCCCCCCCCCC>
##$VD= 0
##$VDLIST= <DDDDDDDDDDDDDDD>
##$VPLIST= <PPPPPPPPPPPPPPP>
##$VTLIST= <TTTTTTTTTTTTTTT>
##$WBST= 1024
##$WBSW= 4
##$XGAIN= (0..3)
0 0 0 0 
##$XL= 0
##$YL= 0
##$YMAX_a= 355246
##$YMIN_a= -272051
##$ZGOPTNS= <>
##$ZL1= 120
##$ZL2= 120
##$ZL3= 120
##$ZL4= 120
##$ABSF1= 10
##$ABSF2= 0
##$ABSG= 5
##$ABSL= 3
##$ALPHA= 0
##$AQORDER= 0
##$ASSFAC= 0
##$ASSFACI= 0
##$ASSFACX= 0
##$ASSWID= 0
##$AUNMP= <proc_1d>
##$AZFE= 0.1
##$AZFW= 0.1
##$BCFW= 1
##$BC_mod= 2
##$BYTORDP= 1
##$COROFFS= 0
##$CY= 83.5205535888672
##$DATMOD= 1
##$DC= 2
##$DFILT= <>
##$DTYPP= 0
##$F1P= 10.8118882576601
##$F2P= -7.23987719738617
##$FCOR= 0.5
##$FTSIZE= 0
##$FT_mod= 4
##$GAMMA= 1
##$GB= 0.15
##$INTBC= 1
##$INTSCL= 1
##$ISEN= 128
##$LB= 0.25
##$LEV0= 0
##$LPBIN= 0
##$MAXI= 10000
##$MC2= 0
##$MEAN= 0
##$ME_mod= 0
##$MI= 1.114404
##$NCOEF= 0
##$NC_proc= 0
##$NLEV= 6
##$NOISF1= 3.799351
##$NOISF2= 2.8
##$NSP= 1
##$NTH_PI= 0
##$NZP= 0
##$OFFSET= 14.38212
##$PC= 1
##$PHC0= -1356.506
##$PHC1= 5.990923
##$PH_mod= 1
##$PKNL= yes
##$PPARMOD= 0
##$PSCAL= 0
##$PSIGN= 0
##$REVERSE= no
##$SF= 200.129724274929
##$SI= 16384
##$SIGF1= 3
##$SIGF2= 2
##$SINO= 400
##$SIOLD= 16384
##$SREGLST= <1H.CDCl3>
##$SSB= 0
##$STSI= 0
##$STSR= 0
##$SW_p= 3205.1282051282
##$SYMM= 0
##$S_DEV= 0
##$TDeff= 0
##$TDoff= 0
##$TI= <>
##$TILT= no
##$TM1= 0
##$TM2= 0
##$TOPLEV= 0
##$USERP1= <user>
##$USERP2= <user>
##$USERP3= <user>
##$USERP4= <user>
##$USERP5= <user>
##$WDW= 1
##$XDIM= 8192
##$YMAX_p= 0
##$YMIN_p= 0
$$ End of Bruker specific parameters
$$ ---------------------------------
##NTUPLES= NMR FID
##VAR_NAME=  TIME,          FID/REAL,        FID/IMAG
##SYMBOL=    X,             R,               I
##VAR_TYPE=  INDEPENDENT,   DEPENDENT,       DEPENDENT
##VAR_FORM=  AFFN,          ASDF,            ASDF
##VAR_DIM=   8192,          8192,            8192
##UNITS=     SECONDS,       ARBITRARY UNITS, ARBITRARY UNITS
##FACTOR=    0.0002768,     1,               1
##FIRST=     0,             0,               0
##LAST=      2.2672688,     0,               0
##MIN=       0,             -272051,         0
##MAX=       2.2672688,     355246,          0
$$ Real data points
##PAGE= N=1
##DATA TABLE= (X++(R..R)), XYDATA
$$ [...]
$$ plain form
1691 2713 -42 -3185 1036 -299 -3856 -188 832 -1370 -524 201 387 -1364 -1618 2081 -12 -1973
1707 -1973 2748 1319 -2058 1052 1151 -1035 -587 197 887 -574 -683 2846 638 -1219 2914 1103
1723 1103 -1690 1208 1041 -180 496 806 1421 -646 -1565 1095 -1422 -2901 1161 8 -1860 604
1739 604 -83 -1160 -1063 -989 684 -793 -1159 2237 -200 -1630 1721 -174 -1749 407 -189 -441 -161
1756 -161 -35 1591 -95 -699 2255 -150 -1062 2096 427 -31 1808 988 659 -87 -750 755 -1175
1773 -1175 -1268 1666 -470 -1096 1442 -440 -993 224 -444 167 -388 -288 1375 -834 -949 1354 -1389
1790 -1389 -1677 851 -1105 -801 728 -45 620 108 88 1230 -991 -396 1689 -684 -177 1745 -739
1807 -739 -442 276 -896 -183 -508 -81 1395 -445 356 1772 -1046 -99 1156 -1311 -242 740 -523
$$ packed form
1691B713k755l143M221j335l557L668J020k202Q46P25J86j751k54L699k093j961
1707a973M721j429l377L110R9k186M48P84O90j461j09L529k208j857M133j811
1723A103k793K898j67j221O76L10O15k067r19K660k517j479M062j153j868K464
1739F04o87j077R7P4J673j477l66L396k437j430L351j895j575K156n96k52K80
1756a61J26J626j686o04K954k405r12L158j669m58J839q20l29p46o63J505j930
1773a175r3K934k136o26K538j882n53J217o68O11n55J00J663k209j15K303k743
1790a389k88K528j956L04J529p73O65n12k0J142k221N95K085k373N07J922k484
1807g39K97P18j172P13l25M27J476j840Q01J416k818R47J255k467J069R82j263
$$ plain form
1824 -523 215 -103 12 542 -1331 114 941 -1676 618 1579 -1283 425 965 -1096 -279 -201 -130 153
1842 153 -743 958 712 -1431 1028 495 -2043 485 503 -1375 255 365 -229 117 -396 702 119 -1108
1860 -1108 1685 681 -1180 1674 599 -1437 484 -25 -889 -237 -416 510 -231 -697 1700 -348 -1548
1877 -1548 1712 -76 -1386 1282 331 -655 408 203 93 -647 -325 1213 -1050 -846 1872 -940 -1291
1894 -1291 1351 -917 -1241 647 -112 9 56 789 1213 -784 320 1832 -1181 -361 1670 -1520 -954
1911 -954 920 -923 -933 -178 10 332 -893 874 1621 -1091 1183 2102 -1605 190 1420 -1378 -1032
1928 -1032 219 -82 -649 -866 715 -21 -1916 1348 1320 -2017 1349 2128 -1532 10 1178 -495 -597
1945 -597 138 1076 -689 -1450 1487 -218 -2748 1581 1272 -2051 714 1366 -995 -553 594 906 -732
$$ packed form
1824e23P38l18J15N30j873J445Q27k617K294R61k862J708N40k061Q17P8P1K83
1842A53q96J701k46k143K459n33k538K528J8j878J630J10n94L46n13J098n83j227
1860a108K793j004j861K854j075k036J921n09q64O52j79R26p41m66K397k048j200
1877a548L260j788j310K668r51r86J063k05j10p40L22J538k263K04K718k812l51
1894a291K642k268l24J888p59J21M7P33M24j997J104J512l013Q20K031l190N66
1911i54J874j843j0P55J88L22j225J767P47k712K274R19l707J795J230k798L46
1928a032J251l01n67k17J581p36j895L264k8l337L366P79l660J542J168j673j02
1945e97P35R38j765p61K937j705k530M329l09l323K765O52k361M42J147L12j638
$$ plain form
1962 -732 -272 2266 -942 -2518 1892 -16 -2642 1224 971 -1472 -345 729 249 -892 297 2522
1978 2522 -862 -1402 2531 -587 -2554 1733 712 -1545 38 388 -626 -1599 112 1902 -1042 -414
1994 -414 2904 -843 -1834 1885 70 -1376 967 836 -323 -962 -55 625 -1980 -503 2215 -1099
2010 -1099 -1152 1716 -501 -739 1219 785 376 -160 417 828 -1542 -324 1738 -1082 -693 929 -1396
2027 -1396 -1147 87 -166 767 370 695 1443 -994 -587 1054 -1044 -169 1080 -480 -148 -408 -1093 238
2045 238 -711 -274 1642 -487 -323 1096 -504 -502 459 -144 351 -812 -481 1028 -920 -252 2261 -166
2063 -166 -512 1255 -552 -942 -203 151 565 -791 171 1265 -1780 -754 1992 -622 -209 2327 722
2080 722 -414 9 233 -309 -1887 91 1206 -2151 -564 1879 -1430 -919 1662 -4 -731 46 658
$$ packed form
1962g32M60K538l208j576M410j908k626L866k53k443J127J074m80j141J189K225
1978B522l384n40L933l118j967M287j021k257J583L50j014r73J711J790k944O28
1994d14L318l747r91L719j815j446K343j31j159o39R07O80k605J477K718l314
2010a099n3K868k217k38J958m34m09n36N77M11k370J218K062k820L89J622k325
2027a396K49J234k53R33l97L25P48k437M07J641k098Q75J249j560L32k60o85J331
2045B38r49M37J916k129J64J419j600KR61o03M95j163L31J509j948O68K513k427
2063a66l46J767j807l90P39L54M14j356R62J094l045J026K746k614M13K536j605
2080G22j136M23K24n42j578J978J115l357J587K443l309N11K581j666p27P77O12
$$ plain form
2097 658 -49 -1518 689 1328 -2165 -34 1696 -2059 -1094 1672 -8 -323 873 1212 -55 -1557
2113 -1557 702 682 -2357 860 2451 -936 405 2041 -407 -881 206 778 -69 -1035 1251 465 -2581
2130 -2581 -18 761 -2198 -68 1616 -267 -162 629 808 -64 -1305 837 -18 -2761 11 419 -2369
2147 -2369 78 1444 -162 156 315 702 -157 -575 2092 1500 -911 1405 648 -2478 -898 -73 -841
2164 -841 78 870 1420 379 -1075 1022 252 -1584 1362 1146 -1110 404 217 -913 -456 -597 518
2181 518 -432 -1432 855 -10 -1520 1245 862 -974 278 -191 -678 -253 -173 1660 1050 -195 1493
2198 1493 -76 -2284 134 -204 -1055 551 427 -23 -369 -1069 384 -53 -714 1757 957 -487 1454
2215 1454 362 -715 146 -578 -382 -749 -1141 638 -29 -726 1761 519 -849 745 -164 -589 499
$$ packed form
2097F58p07j469K207O39l493K131J730l755R65K766j680l15J196L39j267j502
2113a557K259k0l039L217J591l387J341J636k448m74J087N72q47r66K286p86l046
2130b581K563P79k959K130J684j883J05P91J79q72j241K142q55k743K772M08k788
2147b369K447J366j606L18J59L87q59m18K667n92k411K316p57l126J580Q25p68
2164h41R19P92N50j041j454K097p70j836K946k16k256J514j87j130M57j41J115
2181E18r50j000K287q65j510K765l83j836J252m69m87M25Q0J833o10j245J688
2198A493j569k208K418l38q51J606j24m50l46p00J453m37o61K471q00j444J941
2215A454j092j077Q61p24J96l67l92J779o67o97K487j242j368J594r09m25J088
$$ plain form
2232 499 233 979 358 -746 444 -934 -1704 733 14 -567 1152 368 -135 63 -610 125 -554 -916
2250 -916 992 -198 -872 1352 41 -698 621 -92 -355 -36 -254 991 264 -131 1309 -531 -1315
2267 -1315 633 -560 -676 1061 369 483 466 -145 442 -756 -844 927 -639 -453 1317 -323 -497 647
2285 647 -427 -432 -184 -360 586 -211 121 1370 -652 -443 902 -1244 -836 555 -433 229 513 68 348
2304 348 -830 -386 546 -1099 83 1512 -314 543 1169 -594 -261 -64 -606 34 -472 241 864 -682
2322 -682 277 672 -1406 70 585 -682 737 900 99 567 -166 -160 -140 -1283 97 241 -986 869
2340 869 535 -1136 230 -175 -1193 -136 -287 -16 417 23 1055 314 -873 884 -132 -1088 808
2357 808 207 -560 718 -80 -500 -163 -696 282 -156 -185 1666 588 -52 1631 -98 -849 532 -636
$$ packed form
2232D99k66P46o21j104J190j378p70K437p19n81J719p84n03J98o73P35o79l62
2250i16J908j190o74K224j311p39J319p13k63L19k18J245p27l95J440j840p84
2267a315J948j193j16J737o92J14j7o11N87j198q8J771j566J86J770j640j74J144
2285F47j074nK48j76R46p97L32J249k022K09J345k146M08J391r88O62K84m45K80
2304C48j178M44R32j645J182J429j826Q57O26j763L33J97n42O40n06P13O23j546
2322f82R59L95k078J476N15j267J419J63q01M68p33OK0j143J380J44j227J855
2340H69l34j671J366m05j018J057j51K71M33l94J032p41j187J757j016r56J896
2357H08o01p67J278p98m20L37n33R78m38k9J851j078o40J683j729p51J381j168
$$ plain form
2375 -636 -768 -70 -362 77 -701 -763 336 -1176 -740 1180 -435 22 1617 63 -111 383 -488 -408 -768
2394 -768 -409 558 -648 502 1312 -644 159 1169 -773 46 1031 2 358 407 227 146 -1150 74
2412 74 370 -1309 477 1059 -810 443 765 -917 -488 -415 -560 -447 -538 532 527 -738 939 495 -1489
2431 -1489 381 545 -900 234 498 -74 -76 -286 298 -477 -962 1220 495 -692 1728 802 -793 510
2449 510 154 -938 -422 -281 106 -621 -548 1215 -328 -895 1260 22 -1004 945 416 -290 339 121
2467 121 22 -866 -614 474 -952 -619 1655 192 -299 1322 -16 -761 -7 -143 5 -258 89 795
2485 795 -812 -599 921 -607 -383 1153 -200 -230 508 -289 -161 -457 -363 154 -949 -402 714 -643
2503 -643 324 1299 52 393 656 -428 100 -33 -205 688 -113 115 443 -949 -297 267 -646 638 721
$$ packed form
2375f36j32O98k92M39p78o2J099j512M36J920j615M57J595j554j74M94q71Q0l60
2394g68L59R67j206J150Q10j956Q03J010j942Q19R85j029L56M9j80q1j296J224
2412G4K96j679J786N82j869J253L22j682M29P3j45J13r1J070nj265J677m44j984
2431a489J870J64j445J134K64n72kk10N84p75m85K182p25j187K420r26j595J303
2449E10l56j092N16J41L87p27P3J763j543n67K155j238j026J949n29p06O29k18
2467A21r9q88K52J088j426L33K274j463m91J621j338p45P54j36J48k63L47P06
2485G95j607K13J520j528K24J536j353l0P38p97J28k96R4N17j103N47J116j357
2503f43R67R75j247L41K63j084N28j33j72Q93q01K28L28j392O52N64r13J284Q3
$$ plain form
2522 721 -186 678 -126 -661 266 -379 -196 289 -320 270 93 -685 499 -234 -696 816 -210 -777 366
2541 366 -352 -267 302 70 423 -68 -276 808 -232 -339 1345 -9 -297 697 -517 -873 -113 -327 45
2560 45 -92 268 1064 -510 -311 1060 -635 -374 1142 -104 -232 331 -279 -464 -687 -76 622 -762
2578 -762 254 1211 -874 -256 948 -320 -173 596 -79 -374 -860 -30 269 -898 282 1070 -910 -277
2596 -277 612 -804 -160 857 489 221 -217 165 19 -1229 251 990 -703 369 928 -943 -516 244
2614 244 -62 248 230 648 319 -883 297 651 -767 585 1083 -765 -118 -66 -536 -136 -267 507 296
2633 296 -944 153 123 -1202 420 896 -262 444 83 -495 -217 -536 394 425 -363 744 241 -1279
2651 -1279 135 114 -425 355 378 -7 -96 -543 213 300 -350 885 519 -661 213 -3 -465 316 131 169
$$ packed form
2522G21r07Q64q04n35R27o45J83M85o09N90j77p78J184p33m62J512j026n67J143
2541C66p18Q5N69k32L53m91k08J084j040j07J684j354k88R94j214l56P60k14L72
2560D5j37L60P96j574J99J371j695K61J516j246j28N63o10j85k23O11O98j384
2578g62J016R57k085O18J204j268J47P69o75k95m86Q30K99j167J180P88j980O33
2596b77Q89j416O44J017l68k68m38L82j46j248J480P39j693J072N59j871M27P60
2614B44l06L10j8M18l29j202J180L54j418J352M98j848O47N2m70M00j31P74k11
2633B96j240J097l0j325J622M76j158P06l61n78K78l19R30L1p88J107n03j520
2651a279J414k1n39P80K3l85q9m47P56Q7o50J235l66j180Q74k16m62P81j85L8
$$ plain form
2671 169 138 -637 64 -74 -784 733 478 -393 401 -112 -679 -9 -52 269 295 -416 261 -65 -783 424
2691 424 188 -343 590 -18 -291 88 -484 58 199 -452 578 235 -643 440 101 -238 536 131 116 312
2711 312 -307 132 -3 -595 548 83 -557 363 -83 -319 448 8 245 298 -323 246 50 -661 362 3
2731 3 -619 435 -206 -450 251 -123 95 261 -112 529 -56 -589 486 -370 -672 604 -161 -284 335 -114
2751 -114 223 82 -215 604 -33 -335 705 -280 -525 636 -261 -255 226 -334 96 -48 -225 555 -140 -330
2771 -330 746 -411 -385 479 -442 -233 506 -153 98 -37 -204 364 -429 -24 689 -391 -130 523 -663
2790 -663 -191 195 -442 195 127 -132 515 -102 164 631 -476 88 474 -573 1 234 -660 -38 20 -284
2810 -284 202 -236 139 318 -466 332 482 -641 260 111 -573 227 140 -279 228 -42 163 122 -400 464
$$ packed form
2671A69l1p75P01j38p10J517k55q71P94n13n67O70m3L21K6p11O77l26p18J207
2691D24k36n31R33o08k73L79n72N42J41o51J030l43q78J083l39l39P74m05j5J96
2711C12o19M39j35n92J143m65o40R20m46k36P67m40K37N3o21N69j96p11J023l59
2731Co22J054o41k44P01l74K18J66l73O41n85n33J075q56l02J276p65j23O19m49
2751a14L37j41k97Q19o37l02J040r85k45J161q97OM81n60M30j44j77P80o95j90
2771c30J076j157K6Q64r21K09P39o59K51j35j67N68p93M05P13j080K61O53j186
2790f63M72L86o37O37o8k59O47o17K66M67j107N64L86j047N74K33q94O22N8l04
2810b84M86m38L75J79p84P98J50j123R01j49o84Q00q7m19N07k70K05m1n22Q64
$$ plain form
2830 464 140 -619 592 72 -499 569 135 -307 278 79 51 123 -232 467 34 -447 725 -246 -676 580
2850 580 -260 -510 314 -100 -124 102 -179 339 -271 -171 586 -389 -384 723 -363 -322 571 -259 -223 100 -10
2871 -10 277 -236 -55 613 -535 -120 670 -549 -221 534 -232 -116 270 -45 103 -152 200 350 -532 121
2891 121 550 -764 25 648 -621 -84 335 -292 -162 -63 188 147 -546 391 446 -762 370 494 -747
2910 -747 226 453 -378 195 69 42 -21 -289 429 15 -730 585 120 -848 545 299 -608 178 -9 -177
2930 -177 -24 -84 446 -53 -345 749 -230 -682 719 88 -594 460 39 -292 -76 -192 285 -264 -198 769
2950 769 -195 -463 786 -181 -432 585 -125 -257 336 -120 88 -241 -147 543 -367 -296 654 -584 -361 645
2970 645 -360 -82 393 -127 47 -114 15 418 -414 24 627 -677 -27 528 -564 -177 323 -296 57
$$ packed form
2830D64l24p59J211n20n71J068m34m42N85j99k8P2l55O99m33m81J172r71m30J256
2850E80q40k50Q24m14k4K26k81N18o10J00P57r75NJ107j086M1Q93q30L6L23j10
2871a0K87n13J81O68j148M15P90j219L28P55p66J16L86l15J48k55L52J50q82O53
2891A21M29j314P89O23j269N37M19o27J30R9K51m1o93R37N5j208J132J24j241
2910g47R73K27q31N73j26k7o3k68P18m14p45J315m65r68J393k46r07P86j87j68
2930a77J53o0N30m99k92J094r79m52J401o31o82J054m21l31K16j16M77n49O6R67
2950G69r64k68J249r67k51J017p10j32N93m56K08l29R4O90r10P1R50j238K23J006
2970F45j005K78M75n20J74j61J29M03q32M38O03j304O50N55j092L87N00o19L53
$$ plain form
2989 57 66 -14 98 -426 170 363 -541 373 525 -535 160 365 -353 208 102 37 185 -203 173 23 -614
3010 -614 396 255 -625 579 236 -378 367 110 -103 277 -100 223 55 -638 318 -124 -606 583 121
3029 121 -471 278 -295 -412 54 -173 119 152 -195 394 -216 -344 564 26 -257 715 36 -182 406 -121
3049 -121 80 46 -156 440 -200 -531 446 -508 -298 541 -258 -57 318 -369 -113 -84 -182 411 -147 -132 335
3070 335 -492 -278 336 -329 39 463 -294 131 -24 -222 172 -236 53 460 -425 86 468 -508 75 447
3090 447 -149 318 -16 -163 189 -476 -89 306 -397 177 284 -639 29 121 -419 345 133 10 409 -324
3110 -324 9 183 -386 307 464 -294 202 29 -503 156 18 27 442 -269 -61 96 -698 83 138 -283 447
3131 447 63 -500 122 -309 -84 489 -89 190 139 -577 60 -179 -329 508 60 -150 340 -280 -264 202 -149
$$ packed form
2989E7Rq0J12n24N96J93r04R14J52j060O95K05p18N61j06o5J48l88L76j50o37
3010f14J010j41q80J204l43o14P45k57k13L80l77L23j68o93R56m42m82J189m62
3029A21n92P49n73j17M66k27K92L3l47N89o10j28R08n38k83R72o79k18N88n27
3049a21K01l4k02N96o40l31R77r54K10Q39p99K01L75o87K56K9r8N93n58J5M67
3070C35q27K14O14o65L68M24p57M25j55j98L94m08K89M07q85N11L82r76N83L72
3090D47n96M67l34j47L52o65L87L95p03N74J07r23O68R2n40P64k12j23L99p33
3110c24L33J74n69O93J57p58M96j73n32O59j38RM15p11K08J57p94P81N5m21P30
3131D47l84n63O22m31K25N73n78K79n1p16O37k39j50Q37m48k10M90o20J6M66l51
$$ plain form
3152 -149 529 590 -210 379 -80 -395 396 -184 -68 564 -302 -152 59 -529 -32 103 -150 162 -226 -457
3172 -457 174 -428 -107 533 -159 2 333 -536 -93 147 -140 455 38 -40 377 -440 -223 442 -296 310
3192 310 500 -302 92 34 -282 343 19 112 434 -358 -73 173 -496 99 283 -365 258 -157 -354 142 -239
3213 -239 -97 304 -277 43 29 -578 201 123 -186 446 72 -197 289 -280 50 373 -164 358 100 -400 285
3234 285 -36 -268 536 -138 -135 443 -260 -193 273 -330 116 217 -224 360 -208 -285 279 -249 -234 373 -259 -96
3256 -96 225 -433 110 -83 -48 298 -280 -171 466 -328 26 420 -362 37 236 -386 159 160 -148 291 -199
3277 -199 -35 293 -426 23 379 -473 151 282 -323 91 185 -12 186 -271 146 293 -329 326 250 -432 354
3298 354 257 -423 76 88 -153 133 -98 165 261 -445 199 123 -421 401 233 -443 294 43 -219 72 -16 148
$$ packed form
3152a49O78O1q00N89m59l15P91n80J16O32q66J50K11n88M97J35k53L12l88k31
3172d57O31o02L21O40o92J61L31q69M43K40k87N95m17p8M17q17K17O65p38O06
3192C10J90q02L94n8l16O25l24R3L22p92K85K46o69N95J84o48O23m15j97M96l81
3213b39J42M01n81L20j4o07P79p8l09O32l74k69M86n69L30L23n37N22k58n00O85
3234B85l21k32Q04o74LN78p03O7M66o03M46J01m41N84n68p7N64n28J5O07o32J63
3256i6L21o58N43j93L5L46n78J09O37p94L54L94p82L99J99o22N45Jl08M39m90
3277a99J64L28p19M49L56q52O24J31o05M14R4j97J98m57M17J47o22O55p6o82P86
3298C54r7o80M99J2k41K86k31K63R6p06O44p6n44Q22j68o76P37k51k62K91q8J64
$$ plain form
3320 148 49 -319 422 -64 -583 491 -7 -518 414 -25 -369 283 -193 16 -75 -209 570 -260 -323 571 -178
3341 -178 -359 511 -235 -258 297 -72 -30 -95 -55 205 -134 -106 499 -436 -169 606 -294 -155 390 -96 102 135
3363 135 -170 26 -356 -52 331 -563 42 467 -457 -8 507 -311 -103 131 -164 85 -121 200 296 -546
3383 -546 281 440 -513 138 358 -502 89 167 -194 -38 -47 58 61 -483 352 127 -447 220 256 -473 314 214
3405 214 -191 167 53 79 -83 -370 350 38 -471 407 -121 -412 374 107 -349 95 -7 36 -55 -106 256
3426 256 -45 -371 493 -84 -404 473 -54 -354 278 -39 -93 50 -118 249 -158 -248 441 -394 -215 596 -317
3447 -317 -196 409 -174 -174 50 -22 85 -265 30 434 -363 -148 521 -478 -59 392 -267 -70 270 -122 122
3468 122 -123 -78 285 -333 22 364 -481 -15 393 -531 -6 290 -190 -54 -186 -3 191 -331 129 209 -500
$$ packed form
3320A48r9l68P41m86n19J074m98n11R32m39l44O52m76K09r1j34P79q30o3Q94p49
3341a78j81Q70p46k3N55l69M2o5M0K60l39K8O05r35K67P75r00J39N45m86J98L3
3363A35l05J96l82L04L83q94O05M25r24M49N15q18K08K34k95K49k06L21R6q42
3383e46Q27J59r53O51K20q60N91P8l61J56rJ05Ln44Q35k25n74O67L6p29P87j00
3405B14m05L58j14K6j62k87P20l12n09Q78n28k91P86k67m56M44j02M3r1n1L62
3426B56l01l26Q64n77l20Q77n27l00O32l17n4J43j68L67m07r0O89q35J79Q11r13
3447c17J21O05n83%K24p2J07l50K95M04p97K15O69r99M19M51o59J97L40l92K44
3468A22k45M5L63o18L55L42q45M66M08r24N25K96m80J36j32J83J94n22M60Q0p09
$$ plain form
3489 -500 223 418 -443 105 170 -124 192 7 -33 40 -271 217 133 -562 206 161 -401 275 92 -323 139 -44
3511 -44 6 152 -312 320 55 -321 327 -2 -388 327 211 -150 162 -123 -70 88 -316 206 87 -460 299
3532 299 87 -291 329 -41 -152 309 -216 80 97 -147 180 95 -283 397 -50 -179 346 -83 -11 289 -179
3553 -179 110 50 -217 311 80 -58 357 -33 -264 135 -221 114 141 -223 270 97 -441 159 -17 -303 343
3574 343 63 -12 23 -340 -77 103 -253 410 144 -431 79 -28 -305 303 123 85 252 -313 -72 -48 -363
3595 -363 374 122 -167 280 -130 -522 -17 -69 44 326 -54 163 -127 -440 261 -126 -276 492 36 -340
3615 -340 151 -288 -98 211 -2 372 -70 -439 238 -208 -430 510 108 -160 311 -60 -104 -88 -127 420 -205
3636 -205 -192 366 -337 -473 351 42 -168 420 106 16 -128 -154 273 -124 28 639 -356 -383 245 -277 -198 266
$$ packed form
3489e00P23J95q61N48O5k94L16j85m0P3l11M88q4o95P68m5n62O76j83m15M62j83
3511d4N0J46m64O32k65l76O48l29l86P15j16l61L12k85N3J58m04N22j19n47P59
3532B99k12l78O20l70j11M61n25K96J7k44L27q5l78O80m47j29N25m29P2L00m68
3553a79K89o0k67N28k31j38M15l90k31L99l56L35K7l64M93j73n38O00j76k86O46
3574C43k80p5L5l63K63J80l56O63k66n75N10j07k77O08j80l8J67n65K41K4l15
3595c63P37k52k89M47m10l92N05n2J13K82l80K17k90l13P01l87j50P68m56l76
3615c40M91m39J90L09k13L74m42l69O77m46k22R40m02k68M71l71m4J6l9N47o25
3636b05J3N58p03j36Q24l09k10N88l14r0j44k6M27l97J52O11r95k7O28n22P9M64
$$ plain form
3658 266 68 9 -120 -265 183 -314 -114 492 -287 -222 325 -292 -125 136 -98 167 49 48 151 -416 -127
3679 -127 416 -391 -102 326 -385 -100 144 -135 247 -15 -125 164 -218 -15 408 -217 49 373 -207 40
3699 40 39 -130 85 -118 71 174 -193 -48 152 -219 22 225 -214 122 26 -136 274 -170 94 477 -252
3720 -252 -100 213 -177 70 81 -197 163 28 -175 169 -199 -3 395 -206 16 275 -76 57 80 -76 87
3741 87 -131 -123 274 -323 -75 443 -272 75 262 -193 -117 30 5 71 -79 148 200 -294 55 327 -356 145
3763 145 342 -172 -83 86 12 -7 -201 80 144 -403 85 189 -434 65 272 -246 88 44 -47 106 -164 158
3785 158 226 -262 260 132 -402 174 233 -297 65 133 -41 -97 -136 148 50 -248 374 100 -303 304 218 -371
3807 -371 71 61 -200 -21 -142 -52 -173 -258 191 -69 -387 299 -61 -322 360 135 -18 228 6 157 -10
$$ packed form
3658B66j98n9j29j45M48m97K00O06p79O5N47o17J67K61k34K65j18jJ03n67K89
3679a27N43q07K89M28p11K85K44k79L82k62j10K89l82K03M23o25K66L24n80K47
3699D0jj69K15k03J89J03l67J45K00l71K41K03m39L36r6j62M10m44K64L83p29
3720b52J52L13l90K47J1k78L60j35k03L44l68J96L98o01K22K59l51J33K3j56J63
3741H7k18QL97n97K48N18p15L47J87m55P6J47k5O6j50K27N2m94L49K72o83N01
3763A45J97n14Q9J69p4j9j94K81O4n47M88J04o23M99K07n18L34m4r1J53k70L22
3785A58O8m88N22j28n34N76N9n30L62O8j74n6l9K84r8k98O22k74m03O07q6n89
3807c71M42j0k61J79j21R0j21q5M49k60l18O86l60k61O82k25j53K46k22J51j67
$$ plain form
3828 -10 -162 338 -83 -81 397 -177 -235 300 -121 -124 179 -10 92 -61 17 286 -124 -197 371 -239 -87 161 -203
3851 -203 -140 88 -50 -43 -146 -140 172 -197 -13 124 -237 -33 311 -274 -103 219 -299 65 130 -42 134 -150
3873 -150 39 70 -170 155 248 -295 204 285 -266 129 -15 -116 -26 -196 20 48 -286 227 86 -345 140 129
3895 129 -347 196 137 -83 182 -46 99 -45 -220 85 -49 -308 243 6 -325 292 36 -205 233 -67
3915 -67 -63 15 -96 148 -82 -43 333 -157 -321 312 -160 -189 74 -93 -27 68 -11 14 -175 -8 311 -162 -25
3938 -25 439 -127 -125 225 -86 -86 29 66 95 -129 33 94 -371 -33 375 -223 -61 123 -63 52 137 -11 80
3961 80 -107 1 226 -256 -22 205 -224 -72 222 -152 56 2 -146 23 -40 96 102 -166 179 238 -288 93
3983 93 228 -180 82 115 -208 123 -222 16 71 -351 123 137 -335 180 189 -169 107 -50 -63 214 -130 106
$$ packed form
3828a0j52N00m21KM78n74n8N35m21lL03j89J02j53P8K69m10p3N68o10J52K48l64
3851b03O3K28j38Pj03OL12l69J84J37l61K04L44n85J71L22n18L64O5j72J76k84
3873a50J89L1k40L25R3n43M99Q1n51L95j44j01R0j70K16K8l34N13j41m31M85j1
3895A29m76N43n9k20K65k28J45j44j75L05j34k59N51k37l31O17k56k41M38l00
3915f7MP8j11K44k30L9L76m90j64O33m72k9K63j67O6R5p9K5j89J67L19m73J37
3938b5M64n66KL50l11%J15L7K9k24J62O1m65L38M08n98J62J84j86J15Q5j48R1
3961H0j87J08K25m82K34K27m29J52K94l74K08n4j48J69o3J36Ok68L45N9n26L81
3983I3J35m08K62L3l23L31l45K38N5m22M74J4m72N15Rl58K76j57j3K77l44K36
$$ plain form
4005 106 145 -186 130 111 -287 56 -24 -320 208 20 -21 121 7 48 184 -166 110 94 -200 287 104 -80
4027 -80 52 -197 -6 107 -251 85 154 -301 231 132 -106 99 50 -13 214 -236 15 27 -258 219 101 -214
4049 -214 2 48 -199 101 117 8 151 -58 60 17 -308 118 122 -271 87 70 -338 -23 -122 -102 28 -157 253
4072 253 99 -250 222 46 -217 306 189 -152 85 -72 -41 -120 -217 289 7 -367 345 51 -331 210 218 -81
4094 -81 117 127 93 -20 -70 232 -218 -280 334 -65 -506 153 96 -297 89 126 127 -49 -78 424 -178 -175 463 49
4118 49 -319 247 44 -219 -26 67 66 -76 -50 215 -70 -232 395 79 -195 299 -99 -121 -97 134 140 -177 -89
4141 -89 336 -116 -260 395 -88 -165 190 16 -124 -49 72 78 -244 -28 408 -116 -195 379 11 -248 197 -35
4163 -35 -84 -37 -83 -19 -180 -122 256 -285 -174 275 -127 -74 116 -69 -43 17 -126 144 -259 -74 277 -161 -28
$$ packed form
4005A06L9l31L16j9l98L43q0k96N28j88m1J42j14M1J36l50K76j6k94M87j83j84
4027h0J32k49J91J13l58L36O9m55N32r9k38K05m9o3K27m50K51J2k85M77j18l15
4049b14K16M6k47L00J6j09J43k09J18m3l25M26Ml93L58j7m08L15r9K0J30j85M10
4072B53j54l49M72j76k63N23j17l41K37j57L1p9r7N06k82l74P12k94l82N41Qk99
4094h1J98J0l4j13n0L02m50o2O14l99m41O59n7l93L86L7Jj76k9N02o02LO38m14
4118D9l68N66k03k63J93R3jj42K6K65k85j62O27l16k74M94l98k2K4K31Ol17Q8
4141h9M25m52j44O55m83p7L55j74j40P5J21Ol22K16M36n24p9N74l68k59M45k32
4163c5m9M7m6O4j61N8L78n41J11M49m02N3J90j85K6O0j43K70m03J85L51m38J33
$$ plain form
4186 -28 212 -42 -69 132 0 -113 -160 -7 256 -186 -92 222 -146 -38 253 -109 -152 132 43 150 -117 -128
4208 -128 97 -189 -47 232 -150 -64 261 -5 15 61 65 67 -166 -57 178 -289 -143 211 -232 3 134 -60
4230 -60 73 -40 166 145 -27 85 414 -238 -131 223 -393 -182 55 -22 -98 19 109 10 -283 148 292 -239
4252 -239 106 309 -277 53 137 -66 -40 -30 134 -2 -278 92 164 -369 110 246 -256 92 278 -15 -55 63
4274 63 167 -48 -172 155 167 -254 141 188 -298 -105 49 -211 87 -45 154 15 -84 215 51 -151 195
4295 195 82 -291 141 89 -313 -46 -128 -107 -24 -220 135 -10 -112 291 -44 -213 221 -7 -185 74 -60
4316 -60 124 6 -47 198 -21 -88 240 -12 -183 323 -163 -75 111 -42 -53 14 -200 -33 -11 -60 51 -56 -147
4339 -147 25 -257 -92 119 -105 116 138 -155 10 17 -98 42 -162 -75 32 -145 -41 106 -93 174 115 -97
$$ packed form
4186b8K40k54k7K01j32j13m7J53K63m42R4L14l68J08K91l62m3K84q9J07k67j1
4208a28K25k86J42K79l82Q6L25k66K0M6MKk33J09K35m67J46L54m43K35J31j94
4230f0J33j13K06k1j72J12L29o52J07L54o16K11K37p7p6J17R0r9k93M31J44n31
4252b39L45K03n86L30Q4k03K6J0J64j36k76L70P2n33M79J36n02L48J86k93m0J18
4274F3J04k15j24L27J2m21L95M7m86J93J54k60K98j32J99j39r9K99j64k02L46
4295A95j13l73M32n2m02K67q2K1Q3j96L55j45j02M03l35j69M34k28j78K59j34
4316f0J84j18n3K45k19o7L28k52j71N06m86Q8J86j53j1O7k14J67K2m9J11j07r1
4339a47J72k82J65K11k24K21K2k93J65Pj15J40k04Q7J07j77J04J47j99K67n9k12
$$ plain form
4361 -97 70 76 -19 87 -92 112 1 -97 100 141 -143 169 242 -83 112 -67 -83 108 43 55 -6 -233 84 20
4385 20 -190 243 -64 -123 135 -82 -4 84 -40 -31 38 -97 259 -66 -291 203 -65 -181 123 -54 -6 187 -40
4408 -40 59 -15 -58 90 -130 -135 152 -94 -253 183 -41 -127 20 -8 -23 9 -48 78 -34 -178 91 -78 -47 269
4432 269 -26 -99 184 13 13 66 -49 -37 -32 -116 115 -125 -30 208 -40 8 180 -95 67 69 -8 60 -120 -10 89
4457 89 -241 -152 -16 -234 5 63 -46 33 104 -48 12 -185 24 138 -137 -58 192 -60 -15 63 -56 140 117
4480 117 -7 165 -37 52 119 -126 -62 6 -131 -26 15 -132 83 20 -93 137 -125 -83 121 -49 54 -45 -89
4503 -89 50 51 -153 205 -81 118 183 -141 -33 18 -213 10 20 -45 58 -118 42 23 -10 118 189 -113 131
4526 131 203 -153 75 50 -152 41 -72 32 71 -118 117 154 -151 39 254 -130 86 71 -13 90 -11 47
$$ packed form
4361i7J67Or5J06j79K04j11r8J97M1k84L12P3l25J95j79j6J91o5J2o1k27L17o4
4385B0k10M33l07n9K58k17P8Q8j24RO9j35L56l25k25M94k68j16L04j77M8J93k27
4408d0R9p4m3J48k20nK87k46j59M36k24q6J47k8j5L2n7J26j12j44K69j69L1L16
4432B69k95p3K83j71%N3j15J2Nq4K31k40R5K38k48M8J72k75J62Kp7O8j80J10R9
4457H9l30Q9J36k18K39N8j09P9P1j52O0j97K09J14k75P9K50k52M5P8j19J96k3
4480A17j24J72k02Q9O7k45O4O8j37J05M1j47K15o3j13K30k62M2K04j70J03r9m4
4503h9J39Jk04L58k86J99O5l24J08N1k31K23J0o5J03j76J60j9l3J28P1l02K44
4526A31P2l56K28k5k02J93j13J04L9j89K35L7l05J90K15l84K16j5q4J03j01N8
$$ plain form
4548 47 29 -178 46 147 -185 60 105 -176 93 57 -46 151 36 -11 -49 -76 177 175 -229 182 148 -148 100
4571 100 177 -22 -90 -153 21 -49 -189 67 -62 -307 6 90 -155 94 73 44 -14 -11 159 21 -180 102 111 -204
4595 -204 154 61 -136 -43 76 -8 -124 -61 128 -66 -245 145 18 -217 210 82 -229 -29 64 41 44 44 79 -67
4619 -67 -153 200 -54 -204 139 28 -82 49 93 -33 38 -53 159 -65 -76 195 -62 -237 102 -137 -135 111 15
4642 15 -105 -95 -117 96 -16 -95 252 28 -240 74 -94 -68 -68 -19 112 12 7 48 -109 -87 160 -16 -82 164
4666 164 83 -150 52 15 -13 -71 -32 239 -167 -166 109 -102 -64 160 36 34 -68 26 32 -7 -9 252 -57 -154 75 -55
4692 -55 -95 216 -83 -27 19 21 50 -142 66 343 -11 -102 289 -76 -67 17 94 -85 -75 71 183 -90 -76 140 -103
4717 -103 -157 102 -57 6 148 -5 -201 -76 127 174 -139 -54 286 -109 -29 132 -16 -150 93 4 -52 -168
$$ packed form
4548D7j8k07K24J01l32K45M5k81K69l6j03J97j15m7l8k7K53km04M11l4k96K48
4571A00P7j99o8o3J74p0j40K56j29k45L13Q4k45K49k1k9n8LJ70j38k01K82Rl15
4595b04L58r3j97R3J19q4j16O3J89j94j79L90j27k35M27j28l11K00R3k3L%L5j46
4619f7q6L53k54j50L43j11j10J31M4j26P1r1K12k24j1K71k57j75L39k39KK46r6
4642A5j20J0k2K13j12p9L47k24k68L14j68K6%M9J31j00nM1j57K2K47j76o6K46
4666A64q1k33K02l7k8n8L9K71m06JK75k11L8K24j24kj02R4Ol9kK61l09r7K29j30
4692e5m0L11k99N6M6KK9j92K08K77l54r1L91l65RQ4P7j79J0J46J12k73J4K16k43
4717a03n4K59j59O3J42j53j96J25K03M7l13Q5L40l95Q0J61j48j34K43q9n6j16
$$ plain form
4739 -168 79 19 -107 56 225 -178 -8 110 -66 -70 98 34 -27 -80 37 79 -76 132 97 -235 -34 109 -196
4762 -196 4 88 7 3 -155 88 -30 -103 164 164 -260 49 113 -214 47 95 -148 -2 22 69 57 -149 104 69
4786 69 -94 135 195 -35 107 -20 -104 83 39 92 40 -100 25 -6 -182 65 -42 -27 128 -117 -78 58 -99
4809 -99 52 1 -51 -18 19 -167 142 -14 -88 76 -128 1 8 -106 -6 -37 -95 -45 -5 -126 -17 42 6 88 35
4834 35 139 4 -76 186 -6 -69 32 144 -10 -52 -31 -89 -3 -71 10 42 -120 -28 44 -39 5 24 -73 55 -11 -22
4860 -22 -59 -222 70 68 45 80 45 -173 -33 69 -15 38 47 -68 62 -4 97 126 -148 77 68 -44 84 -16 0
4885 0 -53 9 8 -69 -255 93 -21 -63 90 68 -88 61 -81 -141 17 17 -188 -59 -39 42 -108 -73 177 -39 -80
4910 -80 45 -29 -104 7 25 -13 -95 29 91 46 -91 143 -72 47 45 -30 79 48 -30 -78 12 49 -55 -6 -13 3 -134
$$ packed form
4739a68K47o0j26J63J69m03J70J18j76mJ68o4o1n3J17M2j55K08l5l32K01J43l05
4762a96K00Q4q1mj58K43j18p3K67%m24L09O4l27K61M8k43J46K4M7j2k06K53l5
4786F9j63K29O0k30J42j27q4J87m4N3n2j40J25l1j76K47j07J5J55k45L9J36j57
4809i9J51n1n2L3L7j86L09j56p4J64k04J29Pj14J00l1n8N0M0j21J09N9l6Q2n3
4834C5J04j35q0K62j92o3J01J12j54m2K1n8Q6o8Q1L2j62R2P2q3M4J9r7J28o6j1
4860b2l7j63K92kk3L5l5k18J40J02q4N3Rj15J30o6J01K9k74K25rj12J28j00J6
4885@n3O2jp7j86L48j14m2J53k2j56J49j42o0J58%k05J29K0Q1j50L5K50k16m1
4910h0J25p4p5J11J8l8q2J24O2m5j37K34k15J19kp5J09l1p8m8R0L7j04M9pJ6j37
$$ plain form
4937 -134 -54 30 48 -20 -3 -20 65 -12 -85 29 -75 -20 -103 -133 159 -19 -99 118 -12 -49 -28 -10 70 106 6 96
4963 96 -15 -103 52 -23 -117 -53 73 20 58 -8 -41 21 -151 2 112 -73 6 -16 -108 -74 32 -57 12 -12 -128 45
4989 45 -175 -32 48 -158 -31 -55 16 51 48 -141 -6 -120 78 81 -14 -13 -30 0 46 26 13 -82 35 56 41 -1 -40
5016 -40 126 -130 102 14 -68 98 36 106 -60 -36 -72 92 -64 -7 66 -28 -20 91 -28 -32 33 74 -78 -84 100 44
5042 44 -33 14 54 -96 29 127 -31 69 34 30 129 -62 67 12 -84 40 33 -23 49 0 -18 -76 -81 -40 47 -71 -52 -4
5070 -4 -123 82 -27 -125 61 99 -51 -40 0 -4 15 -67 22 -22 -136 11 52 -30 67 2 -96 -124 108 19 21 -54 77
5097 77 -51 -88 36 31 -197 41 -1 21 -8 33 -15 8 -32 145 -124 -157 89 13 -72 89 60 19 -53 -16 78 34 -83
5124 -83 61 -39 -53 76 65 -53 72 32 -44 46 -66 43 -67 -123 36 -66 24 136 16 -25 101 59 -30 42
$$ packed form
4937a34Q0Q4J8o8J7j7Q5p7p3J14j04N5q3l0K92j78q0K17j30l7K1J8Q0L6j00R0
4963I6j11q8J55p5r4O4J26n3L8o6l3O2j72J53J10j85P9k2r2L4J06q9O9k4j16J73
4989D5k20J43Q0k06J27k4P1L5lj89J35j14J98Lr5Jj7L0M6k0j3r5J17K1j5m2l9
5016d0J66k56K32q8q2J66o2P0j66K4l6J64j56N7P3r4QJ11j19mO5M1j52oJ84n6
5042D4p7M7M0j50J25R8j58J00l5mR9j91J29n5r6J24pn6P2m9j8n8nM1Q7j18J9M8
5070dj19K05j09r8J86L8j50J1M0mJ9q2Q9m4j14J47M1q2R7o5r8k8K32q9Kp5J31
5097G7j28l7J24nk28K38m2K2k9M1m8K3m0J77k69l3K46p6q5J61k9m1p2L7R4m4j17
5124h3J44j00j4J29j1j18J25m0p6R0j12J09j10n6J59j02R0J12j20m1J26m2q9P2
$$ plain form
5148 42 -6 -80 -20 -56 147 -56 -56 26 -10 -100 56 -30 -88 51 43 109 -71 37 -28 -6 24 131 -67 -23 85 57 11
5175 11 -5 38 163 -18 84 55 -114 -11 26 34 27 35 -8 102 -71 -30 -7 -134 24 10 -59 -96 86 -72 65 38
5201 38 41 42 -23 65 80 -146 18 204 -52 -16 10 -20 -93 63 132 6 -41 82 -1 -136 -19 28 -14 32 89 -14
5227 -14 -67 36 -44 -75 -52 44 -25 -45 -30 112 -110 -86 -13 -42 35 47 -26 -16 -22 -42 80 -56 39 -59 -85 -78 -9 -34 59
5256 59 -180 -37 -69 -115 57 24 -35 91 56 38 -55 77 -48 31 56 10 54 14 77 -44 -4 19 45 21 -1 -45 64
5283 64 -49 -62 -69 14 -93 -34 8 -92 81 38 -34 -18 -102 -73 -88 -62 -53 33 -28 17 -7 -73 150 47 51 60 -51 -29 -62
5312 -62 -83 30 80 -7 8 -55 -37 34 55 -10 -13 76 -15 34 -88 -31 54 -68 90 59 -6 41 -73 -21 -22 10 27 23 0
5341 0 -18 -10 -37 -92 85 8 64 94 75 55 -6 42 -2 -19 60 -43 23 35 70 6 11 -9 -62 81 59 -23 -75 39 20 81
$$ packed form
5148D2m8p4O0l6K03k03%Q2l6r0J56q6n8J39qO6j80J08o5K2L0J07j98M4J08k8m6
5175A1j6M3J25j81J02k9j69J03L7QpQm3J10j73M1K3j27J58j4o9l7J82j58J37k7
5201C8LJo5Q8J5k26J64J86k56L6K6l0p3J56O9j26m7J23q3j35J17M7m2M6N7j03
5227a4n3J03q0l1K3R6o9k0J5J42k22K4P3k9P7J2p3J0ok0J22j36R5r8k6PO9k5R3
5256E9k39J43l2m6J72l3n9J26l5j8r3J32j25P9K5m6M4m0O3j21M0K3K6k4k2m4J09
5283F4j13j3pQ3j07N9M2j00J73m3p2J6q4K9j5K6RQ6o1M5k4o6K23j03MRj11K2l3
5312f2k1J13N0q7J5o3J8P1K1o5lQ9r1M9j22N7Q5j22J58l1o5M7j14N2jL2J7mk3
5341@j8Qk7n5J77p7N6L0j9k0o1M8m4j7P9j03O6J2L5o4Nk0n3J43k2q2n2J14j9O1
$$ plain form
5371 81 -40 -62 132 -59 35 -36 -72 -83 -16 49 34 18 146 -69 -7 66 -10 -15 -49 -60 -16 63 -46 -8 -30 33 12 -87
5399 -87 6 93 121 80 62 -22 69 107 -83 75 -67 -22 7 34 -104 6 -88 66 63 -69 -41 57 34 -96 88 -13
5425 -13 -69 -23 -34 16 8 3 -5 -71 -33 -1 7 30 -13 -94 31 -9 53 44 -38 40 63 -26 -54 79 11 -6 6 -38 -40 -45 -31 -17 72
5458 72 -94 36 -74 -25 -19 -65 46 -33 -4 29 -51 -28 173 -17 82 49 -66 2 36 -41 32 -49 70 110 -53 -5
5484 -5 -109 -12 -38 -11 -78 73 -30 -37 79 11 -8 46 -12 -43 -41 28 25 -35 -117 -44 -9 -28 45 -124 35 12 -38 -118 -115 -120
5514 -120 68 -1 -83 -27 4 -70 -20 -36 7 -70 5 43 -87 -42 45 -44 7 -14 -59 -20 118 -34 37 168 -22 14 -11
5541 -11 26 -2 36 7 19 -91 94 -60 7 -23 24 -14 34 -14 57 99 -90 9 30 7 62 -29 4 21 68 27 61 -12
5569 -12 -126 83 20 80 -68 37 91 8 -196 -62 2 23 -45 -34 -110 -13 -34 61 27 -43 79 14 5 3 -118 -74 3
$$ packed form
5371H1j21k2J94j91R4p1l6j1O7O5j5j6J28k15O2P3p6nl4j1M4P9j09L8k2O3k1r9
5399h7R3Q7K8m1j8q4R1L8j90J58j42M5K9K7j38J10r4J54lj32K8R8k3j30J84j01
5425a3n6M6j1N0qnqo6L8L2QK3m3q1J25m0O2rq2P8K3q9k8J33o8j7J2m4knJ4J4Q9
5458G2j66J30j10M9Om6J11p9K9L3q0K3K01j90R9l3j15O8L4p7P3q1J19M0j63M8
5484ej04R7k6K7o7J51j03pJ16o8j9N4n8l1KO9lo0q2P3L5j9P3j69J59k3n0q0Ln
5514a20J88o9q2N6L1p4N0j6M3p7P5L8j30M5Q7q9N1k1m5L9J38j52P1J31j90L6k5
5541a1L7k8L8k9J2j10J85j54O7l0M7l8M8m8P1M2j89R9K1k3N5r1L3J7M7m1L4p3
5569a2j14K09o3O0j48J05N4q3k04J34O4K1o8J1p6R7k1R5l4p0J22o5rkj21M4P7
$$ plain form
5596 3 -6 -69 -130 25 1 -35 -15 -39 -30 -52 71 -89 0 0 -33 86 20 92 108 -124 25 70 14 -149 -10 -83 -67 -17
5624 -17 55 27 -26 -53 55 40 -33 20 17 66 143 -8 5 -48 -47 4 -65 -58 -70 41 -79 105 144 7 64 8 75 62 36
5653 36 66 -82 112 75 -35 27 -3 -25 -26 -30 51 -35 -34 9 30 31 -7 -32 -38 50 10 4 -92 -43 -10 52 24 26 47 71 18 -25
5685 -25 -28 -52 -5 -101 -61 -72 49 -104 12 -12 10 24 -6 19 51 32 39 -112 -63 38 35 -46 -100 -17 -6 -32 -65 -21 -94
5714 -94 84 -32 11 95 -19 29 -33 -6 -5 -89 -50 -59 45 64 92 -16 -7 76 23 -9 123 84 22 -65 -6 92 -55 17
5742 17 -10 65 26 40 -42 25 -27 17 -7 -30 18 -7 -194 -13 -34 -14 -101 -30 -66 -26 -61 -55 16 -78 -97 -62 47 -5 -9 -59
5772 -59 12 -17 45 -65 -52 33 -8 -27 13 69 9 -13 -39 50 -10 -124 67 38 -72 -64 88 -39 47 103 -21 -1 8 -68
5800 -68 -141 -7 -69 -22 -10 -59 -22 -88 18 -79 -136 103 3 -43 -52 -21 9 -55 -47 25 8 -44 25 43 5 33 4 50 -32
$$ packed form
5596Cro3o1J55k4l6K0k4Rk2J23j60Q9%l3J19o6P2J6k32J49M5n6j63J39p3J6N0
5624a7P2k8n3k7J08j5p3N3lM9P7j51J3n3JN1o9Pj2J11j20J84L9j37N7n6O7j3k6
5653C6L0j48J94l7j10O2l0k2jmQ1q6JM3K1Jl8k5oQ8m0or6M9L3O2k8KK1K4n3m3
5685b5lk4M7r6M0j1J21j53J16k4K2J4l0K5L2j9Pj51M9J01lq1n4Q3J1k6l3M4p3
5714i4J78j16M3Q4j14M8o2K7Jq4L9rJ04J9K8j08RQ3n3l2J32l9o2q7N9R8j47P2
5742A7k7P5l9J4q2O7n2M4k4k3M8k5j87J81k1K0q7P1l6M0l5OP1r4j9L5J09n2mn0
5772e9P1k9O2j10J3Q5m1j9M0N6o0k2k6Q9o0j14J91k9j10QJ52j27Q6N6j24K0Rp6
5800f8p3J34o2M7J2m9L7o6J06r7n7K39j00m6rL1L0o4QP2j7n2O9J8l8K8k9M6q2
$$ plain form
5829 -32 86 -57 -123 57 47 -88 -27 70 62 -128 36 -5 4 -14 23 17 -90 65 -18 60 -68 55 26 -3 44 10 -12
5856 -12 -20 18 83 -24 64 82 1 -96 -21 67 14 -103 53 93 136 -64 29 -115 -79 5 76 -139 30 -1 -61 -44 -29
5883 -29 33 30 -101 3 10 -173 -15 55 -16 -24 11 9 66 -30 133 37 36 46 -36 -14 106 43 -65 55 11 28 9 83 65
5912 65 -98 -84 2 11 -70 36 62 -61 79 96 -55 -1 -13 -116 -58 -54 17 -28 17 -52 -64 -38 8 14 40 51 -8 -50 -55
5941 -55 -90 -49 7 -15 52 -58 -30 85 -13 20 -55 20 101 76 45 99 -5 -45 34 -64 57 12 -192 -15 46 72 91
5968 91 -51 26 75 -50 -131 57 12 31 10 -59 19 -31 -38 98 -57 119 121 -20 25 91 -4 -29 -11 108 44 139 0
5995 0 -44 70 -3 24 5 -37 9 -124 -6 25 88 4 -7 -51 22 -77 -125 -96 -62 -92 10 35 -81 -15 -112 2 -99
6022 -99 -114 35 99 57 28 48 63 72 -123 -147 -16 59 -134 126 53 24 -106 58 139 -65 -21 118 -159 -21 37
$$ packed form
5829c2J18j43o6J80j0j35O1R7qj90J64m1Rj8L7oj07J55q3P8j28J23k9k9M7l4k2
5856a2qL8O5j07Q8J8q1r7P5Q8n3j17J56M0M3k00R3j44L6Q4P1k15J69l1o0J7J5
5883b9O2lj31J04Pj83J58P0p1qL5kN7r6J63r6jJ0q2K2J20o3j08J20m4J7j9P4j8
5912F5j63J4Q6Rq1J06K6j23J40J7j51N4j2j03N8MP1m5M5o9j2K6M6OK6J1n9m2n
5941e5l5M1N6k2O7j10K8J15r8L3p5P5Q1k5l1N4j04m0P9r8J21m5k04J77O1K6J9
5968I1j42P7M9j25q1J88m5J9k1o9P8n0pJ36j55J76Kj41M5O6r5k5J8J19o4R5j39
5995@m4J14p3K7j9m2M6j33J18L1O3q4j1m4P3r9m8K9L4l0J02K5j16O6r7J14j01
6022i9j5J49O4m2k9K0J5Rj95k4J31P5j93K60p3k9j30J64Q1k04M4J39k77J38N8
$$ plain form
6047 37 15 -6 28 63 -21 -121 98 -109 -149 64 35 -156 -111 39 -14 9 -75 -25 87 -98 45 38 68 49 51 -155
6073 -155 -7 54 63 -108 -45 -22 -49 -23 -54 39 49 103 -36 2 140 29 -23 25 -45 91 96 -30 49 -32 37 1 3 45
6101 45 -11 -45 58 -1 -27 -44 91 -46 55 -52 61 34 26 -44 13 44 -9 -36 -27 68 -18 47 17 -4 -10 45 79 39 68
6130 68 22 81 58 -44 7 -44 -61 36 29 66 105 -31 -13 -74 30 58 -5 72 112 -91 -107 0 15 -8 10 83 62 -84
6158 -84 100 28 9 -11 147 32 -16 87 57 4 113 77 -5 -20 -74 54 4 -86 68 -112 -60 121 12 -21 -13 65
6184 65 -3 -43 136 73 -117 -78 75 -40 8 127 -40 2 -9 56 -13 -154 15 199 0 35 37 -121 -23 -27 -60 34
6210 34 39 -77 -9 -69 118 50 3 45 100 -125 102 46 71 9 41 -120 -51 -43 21 -37 -46 143 55 -20 -71 20 -58 -39 112
6239 112 38 -7 -14 157 65 -54 29 115 -51 61 76 45 43 -19 -61 11 -86 65 57 9 -17 -16 -93 46 28 72 -62 -112
$$ packed form
6047C7k2k1L4L5q4j00K19k07m0K13k9j91M5J50n3K3q4N0J12j85J43pL0j9Kk06
6073a55J48O1Rj71O3K3k7K6l1R3J0N4j39L8J38j11n2M8p0J36Nj26P9q1O9l6KM2
6101D5n6l4J03n9k6j7J35j37J01j07J13k7qp0N7L1n3k7RR5q6O5l0k1oN5L4m0K9
6130F8m6N9k3j02N1n1j7R7pL7L9j36J8o1J04K8o3P7M0k03j6J07J5k3J8P3k1j46
6158h4J84p2j9k0J58j15m8J03l0n3J09l6q2j5n4J28n0r0J54j80N2J81j09l3QP8
6184F5o8m0J79o3j90L9J53j15M8J19j67M2j1O5o9j41J69J84j99L5Kj58R8ml3R4
6210C4Nj16O8o0J87o8m7M2N5k25K27n6K5o2L2j61O9QO4n8rJ89q8p5n1R1p8J9J51
6239A12p4m5pJ71r2j19Q3Q6j66J12J5l1ko2m2P2r7J51qm8k6Jp7J39j8M4j34n0
$$ plain form
6267 -112 -31 -7 -138 -4 -15 -133 173 41 -17 -50 -36 40 -35 20 -113 90 -32 79 54 -90 -23 0 25 -106
6291 -106 -22 -30 95 -17 47 20 -120 58 58 -71 -63 107 -66 30 6 19 -51 -55 46 37 -34 26 -71 -90 63 -57 -37
6318 -37 16 65 -43 67 -39 96 -72 -6 10 47 -61 105 22 -114 4 98 88 -9 -28 14 75 -35 63 -57 6
6343 6 41 21 -78 25 51 -10 37 -25 105 -6 -60 51 0 -65 46 87 61 47 28 4 79 -18 62 23 -106 -65 50
6370 50 -80 111 -121 -45 -15 9 116 13 -73 -10 22 -40 24 -69 -69 66 6 -28 83 25 98 128 -52 45 -131 -170
6396 -170 12 177 -45 112 -152 -37 50 50 -30 3 -41 81 36 -30 -33 2 44 -39 -42 50 37 -31 69 -89 -2 85 -20
6423 -20 -35 40 -59 -4 -28 -24 -26 35 -96 35 -1 -151 127 5 -61 -61 -12 -56 -43 -5 -3 24 -118 40 -19 5 -2 -77 28
6452 28 15 23 -37 -13 -47 15 22 46 74 -64 -41 61 -35 -106 -63 -80 10 -30 73 -8 -77 24 141 -30 -27 18 -21 42 95
$$ packed form
6267a12Q1K4j31J34j1j18L06j32n8l3J4P6p5N5j33K03j22J11k5j44O7K3K5j31
6291a06Q4qJ25j12O4k7j40J78%j29QJ70j73R6k4J3p0mJ01rp1O0r7j9J53j20K0
6318c7N3M9j08J10j06J35j68O6J6L7j08J66q3j36J18R4j0r7j9M2O1j10R8j20O3
6343FL5k0r9J03K6o1M7o2J30j11n4J11n1o5J11M1k6j4j9k4P5r7Q0l9j29M1J15
6370E0j30J91k32P6L0K4J07j03q6O3L2o2O4r3%J35o0l4J11n8P3L0j80R7j76l9
6396a70J82J65k22J57k64J15Q7%q0L3m4J22m5o6lL5M2q3lR2j3o8J00j58Q7Q7j05
6423b0j5P5r9N5k4MkO1j31J31l6j50K78j22o6%M9m4J3L8KK7j42J58n9K4pp5J05
6452B8j3Qo0K4l4O2PK4K8j38K3J02r6p1M3j7R0m0J03q1o9J01J17j71LM5l9O3N3
$$ plain form
6481 95 86 157 80 -13 157 -82 12 -74 -80 115 -74 -9 82 39 -92 -41 -62 -21 36 -119 -42 -29 -5 60 21 -17 -104 87
6509 87 -87 139 -51 -52 70 61 112 -39 -70 -22 -3 -105 -48 -12 -45 90 -43 -61 6 -6 12 55 -80 -64 10 -82 43
6536 43 51 -78 -91 -30 -19 1 -1 167 55 4 -56 86 82 16 58 38 91 30 -70 -72 36 131 10 -72 23 -82 -74 86
6564 86 -45 -8 91 -49 115 91 -90 3 17 -97 50 -17 87 18 -10 -92 26 -154 27 18 -69 22 43 -102 10
6589 10 -9 18 29 -5 -10 57 -41 108 38 -104 96 169 -98 48 34 -6 17 -1 71 -44 3 56 -57 -86 4 107 -55
6616 -55 65 84 -175 57 85 88 41 86 -33 23 15 48 67 -72 57 69 28 67 -28 1 -31 -28 145 -75 -39 31 -1 -58
6644 -58 34 74 -65 -37 -26 117 -64 56 -45 -42 -15 -3 -149 -31 -11 -8 -71 -62 60 -82 -15 18 87 29 29 63 -15 -168
6672 -168 -16 84 -115 40 -21 34 -68 39 235 -1 -101 1 -5 -55 88 83 -27 106 204 142 -140 -78 61
$$ packed form
6481I5rP1p7r3J70k39R4q6oJ95j89O5R1m3j31N1k1M1N7j55P7J3K4O5l9l8q7J91
6509H7j74K26j90jJ22rN1j51l1M8J9j02N7L6l3J35j33j8O7j2J8M3j35J6P4r2J25
6536D3Qj29j3O1J1K0kJ68j12n1o0J42mo6M2k0N3o1j00kJ08R5j21q2R5j05QJ60
6564H6j31L7R9j40J64k4j81R3J4j14J47o7J04o9k8q2J18j80J81rq7R1K1j45J12
6589A0j9K7J1l4nO7r8J49p0j42K00P3k67J46j4m0K3j8P2j15M7N3j13k9R0J03j62
6616e5J20J9k59K32K8Lm7M5j19N6qL3J9j39J29J2m1L9r5K9l2LJ73k20L6P0l2n7
6644e8R2M0j39K8J1J43j81J20j01LK7J2j46J18K0Lo3RJ22j42O7L3O9n8%L4p8j53
6672a68J52J00j99J55o1N5j02J07J96k36j00J02on0J43nj10J33R8o2k82O2J39
$$ plain form
6695 61 -8 -123 88 -35 20 -33 -45 0 -41 17 -45 -82 -18 48 -104 -41 61 -6 -25 74 13 -26 -28 82 48 9 119
6722 119 27 -14 -28 84 -57 -23 74 22 120 2 -30 42 -21 13 40 -74 91 50 36 -64 13 85 -73 11 -119 75
6748 75 -54 -92 156 -10 -25 22 -28 -8 52 -61 -31 35 23 121 -17 -95 97 40 -19 56 6 -20 -9 52 148 18 -11
6775 -11 76 -76 42 38 -134 -40 -5 -28 -50 -24 111 -35 -72 42 -56 -63 23 76 -163 49 -43 -28 -31 -22 85 113 -7
6802 -7 98 32 -158 118 34 -12 43 53 -29 25 -102 91 81 -18 26 82 -31 139 33 -43 29 85 62 -60 58 -72
6828 -72 -3 46 111 -20 -83 -21 39 -113 8 -26 -5 4 -15 111 -2 -34 103 74 -39 23 88 -138 54 -1 -46 -90
6854 -90 -58 -20 -31 -65 31 79 -47 60 6 -80 12 52 -36 73 -61 78 78 -141 58 -18 -132 34 -42 3 -10 -29
6880 -29 22 -45 -151 28 -36 3 -10 4 -55 133 19 -45 23 10 -90 -72 36 153 74 -69 26 -48 -16 45 -9 3
$$ packed form
6695F1o9j15K11j23N5n3j2M5m1N8o2l7O4O6j52O3J02o7j9R9o1l9kJ10l4l9J10
6722A19r2m1j4J12j41L4R7n2R8j18l2P2o3L4K7j14J65m1j4j00P7P2j58Q4j30J94
6748G5j29l8K48j66j5M7n0K0O0j13L0O6j2R8j38p8J92n7n9P5n0k6J1O1R6j30k9
6775a1Q7j52J18mj72R4L5k3k2K6J35j46l7J14r8pQ6N3k39K12r2J5lRJ07K8j20
6802gJ05o6j90K76q4m6N5J0q2N4j27J93j0r9M4N6j13J70j06p6P2N6k3j22J18j30
6828g2O9M9O5j31o3O2O0j52J21l4K1Rj9J26j13l2J37k9j13O2O5k26J92n5m5m4
6854i0L2L8j1l4R6M8j26J07n4q6R2M0q8J09j34J39%k19J99p6j14J66p6M5j3j9
6880b9N1o7j06J79o4L9j3J4n9J88j14o4O8j3j00J8J08J17p9j43R5p4L2O1n4J2
$$ plain form
6906 3 82 41 -53 -2 -129 83 -14 -150 37 -45 0 18 -77 5 -56 41 121 -48 52 -111 -7 62 20 -23 -55 6 -4
6933 -4 -20 11 -176 40 25 -87 74 -3 0 -11 51 39 72 161 38 -1 -7 -18 78 -19 -106 -56 2 92 -102 -61 54 -11
6961 -11 20 -13 84 -27 12 6 20 -12 -69 97 26 44 81 -43 85 -79 -99 107 -29 47 89 -20 41 92 -46 66
6987 66 44 6 -54 -44 -74 86 -18 -2 -17 25 135 27 37 -29 39 -77 -34 -144 -16 6 -97 3 -32 -95 3 98
7013 98 -133 23 75 86 -20 23 18 13 -71 31 -22 -79 76 172 -43 -181 -54 22 113 18 102 -29 -31 -20 105 -51
7039 -51 99 -54 18 38 -56 -29 11 27 57 52 -62 -80 -30 -106 -38 -66 -51 -48 -45 -10 67 -113 -18 -27 -98 -6 132 36 -2 -36
7069 -36 -80 -92 -52 26 -50 26 -37 9 -14 4 13 -115 -129 -75 16 145 -83 -41 58 -111 135 45 -43 62 -11 -125 18
7096 18 36 62 -77 -87 110 -96 -79 -30 19 -48 55 141 -117 -137 28 32 16 71 -66 -31 -215 100 28 -131 68
$$ packed form
6906CP9m1r4N1j27K12r7j36J87q2M5J8r5Q2o1R7Q0j69J00j63J04O9m2m3l2O1j0
6933dj6L1j87K16j5j12J61p7Lj1O2j2L3Q9j23l9oj1R6r7q7N0N8R0j94M1J15o5
6961a1L1l3R7j11L9oJ4l2n7J66p1J8L7j24J28j64k0K06j36P6M2j09O1N1j38J12
6987F6k2l8o0J0l0J60j04J6j5M2J10j08J0o6O8j16M3j10J28K2j03J00l5o3R8R5
7013I8k31J56N2J1j06M3nnq4J02n3n7J55R6k15j38J27P6R1r5Q4j31kJ1J25j56
7039e1J50j53P2K0r4K7M0J6L0nj14j8N0p6O8k8J5LLL5P7j80R5rp1R2J38r6l8l4
7069c6m4j2M0P8p6P6o3M6k3J8Rj28j4N4R1J29k28M2R9j69K46r0q8J05p3j14J43
7096A8J8K6j39j0J97k06J7M9M9o7J03Q6k58k0J65Mj6N5j37L5j84L15p2j59J99
$$ plain form
7121 68 107 4 40 -69 -62 -64 -67 -26 -95 -31 -4 -24 -126 84 68 -3 53 -108 33 -98 -6 113 -101 49 146 2
7147 2 -88 79 -68 -46 153 -19 58 17 41 108 -48 47 114 21 108 -70 130 -134 -13 33 30 74 -63 70 -20 77
7173 77 91 -137 -80 154 9 71 -52 37 96 -32 -43 20 -54 -66 77 107 -108 66 -26 -15 -26 51 38 78 90 197
7199 197 -99 3 90 59 26 104 20 -87 -22 -54 -59 -25 -2 46 -40 -67 16 -44 28 -26 -15 -133 -39 -22 9 -125 20
7226 20 235 11 66 87 31 -114 95 51 64 -23 78 24 -115 -59 -17 -82 -163 -10 -42 0 -117 27 -13 -109 -8
7251 -8 89 -22 17 -47 -117 85 72 -38 25 50 53 65 -125 -1 31 -37 8 89 -12 -38 57 -4 -9 162 109 -93 -51 45
7279 45 109 -85 8 1 -15 108 70 -65 -68 -101 28 67 -4 -51 22 -31 20 -12 -198 -61 31 -5 5 14 -4 -12 -17 -20 -65 -5
7309 -5 54 43 -95 12 -85 -12 56 125 -35 23 -19 -61 72 27 -65 17 15 61 18 -2 68 36 4 30 -9 23 -15 -148 49
$$ packed form
7121F8L9j03L6j09PklM1o9O4K7k0j02K10j6p1N6j61J41j31R2J19k14J50R7j44
7147Br0J67j47K2J99j72P7m1K4O7j56R5O7r3Q7j78K00k64J21M6lM4j37J33r0R7
7173G7J4k28N7K34j45O2j23Q9N9j28j1O3p4j2J43L0k15J74r2J1j1P7j3M0J2J07
7199A97k96J02Q7l1l3P8q4j07O5l2nL4K3M8q6k7Q3o0P2n4J1j18R4J7L1j34J45
7226B0K15k24N5K1n6j45K09m4J3q7J01n4j39N6M2o5q1J53l2M2j17J44m0r6J01
7251hR7j11L9o4p0K02j3j10O3K5LJ2j90J24L2o8M5Q1j01k6R5o1nJ71n3k02M2R6
7279D5O4j94R3pj6J23l8j35ll3J29L9p1m7P3n3N1l2j86J37R2l6J0Rj8qnlm5O0
7309eN9j1j38J07r7P3O8O9j60N8m2m2J33m5r2Q2kM6m3k0P0l2l2K6l9L2l8j33J97
$$ plain form
7338 49 -29 -152 -47 50 -91 45 34 -19 59 2 112 49 -117 70 -30 -94 55 91 7 28 -8 -70 33 -58 12
7363 12 43 -90 -32 -69 -53 56 -115 -39 2 -24 67 -12 -29 -17 22 -65 -73 51 -8 -110 66 87 -61 -44 36 -31 17
7390 17 -38 6 -69 95 2 -85 -29 4 -9 44 -61 62 56 -18 27 65 -48 35 -37 34 -30 -54 -15 -33 27 -72 -26 -14 -23
7419 -23 40 -29 129 35 4 -25 -1 30 5 -21 -70 -73 -31 -9 -79 -14 18 25 50 11 -35 -15 -58 -79 6 -124 -89 98 -26
7448 -26 -43 115 -109 95 81 44 57 -28 -37 146 -151 13 109 -2 97 -35 19 -3 96 -12 81 135 -14 70 -1 -45
7474 -45 124 -34 -42 58 -50 44 87 -80 13 63 -30 104 -18 69 70 7 103 121 -64 -1 60 -11 -31 35 -63 -49 -25
7501 -25 -96 81 -101 -35 18 -45 -5 -18 -11 -86 19 -4 -86 -62 -5 -38 -2 41 81 -135 -45 -24 -20 98 37 32 37 -12 117
7530 117 36 -16 23 21 -92 110 61 -56 24 1 -16 100 -52 -16 35 53 23 -76 -33 -100 -40 -9 -33 13 -54 -55 -29 121
$$ packed form
7338D9p8j23J05R7j41J36j1n3P8n7J10o3j66J87j00o4J49L6q4K1l6o2J03r1P0
7363A2L1j33N8l7J6J09j71P6M1k6R1p9j7J2L9q7qJ24n9j02J76K1j48J7Q0o7M8
7390A7n5M4p5J64r3q7N6L3j3N3j05J23op4M5L8j13Q3p2P1o4k4L9j8O0r9M6J2r
7419b3O3o9J58r4l1k9K4L1k5k6m9lM2K2p0O5L2PK5l9m6K0m3k1Q5j30L5J87j24
7448b6j7J58k24K04j4l7J3q5rJ83k97J64R6j11R9j32N4k2R9j08R3N4j49Q4p1m4
7474d5J69j58qJ00j08R4M3j67R3N0r3J34j22Q7Jo3R6J8j85O3O1p1k0O6r8J4K4
7501b5p1J77j82O6N3o3M0j3Pp5J05k3q2K4N7l3L6M3M0k16R0K1MJ18o1nNm9J29
7530A17q1n2L9kj13K02m9j17Q0k3j7J16j52L6N1J8l0r9M3o7O0L1k4M6o7jK6J50
$$ plain form
7558 121 106 11 3 38 129 58 -35 16 47 68 -13 25 -77 135 120 -6 24 -6 128 89 -18 42 54 16 -24 27 -11 9
7586 9 78 61 45 -62 5 53 -25 -63 66 -3 -35 -11 -110 14 40 -50 111 -25 -45 -84 -38 52 -68 12 -19 132 -60
7613 -60 24 -17 -32 82 76 103 42 70 1 52 -24 106 42 -32 153 -33 2 -73 -33 60 -135 -16 -25 35 -86 58 -18
7640 -18 14 55 -74 -40 51 -23 -77 -62 -22 67 -122 -125 -34 -5 -26 -37 9 -21 69 50 5 41 -51 43 21 -38 56 -29 -101 84
7670 84 79 -78 -43 -43 25 -20 58 19 -36 -41 81 -41 32 135 8 3 14 19 147 -95 -84 -55 52 24 114 72 34 61 -106
7699 -106 -117 -49 -9 26 76 11 127 14 -99 15 -6 137 64 80 26 17 -25 84 9 -25 72 -72 -26 9 -13 7 -19
7726 -19 -92 34 -41 126 -14 -128 17 -50 -30 66 187 35 22 38 59 33 70 -2 33 -16 36 165 -67 -49 78
7751 78 88 22 41 -21 9 35 39 50 27 192 140 -17 -98 -37 23 -5 -22 -7 55 5 109 31 -46 23 98 -212 30 -54
$$ packed form
7558A21j5r5qL5R1p1r3N1L1K1q1L8j02K12j5j26L0l0J34l9j07O0J2l8m0N1l8K0
7586IO9j7j6j07O7M8p8l8J29o9l2K4r9J24K6r0J61j36k0l9M6R0j20Q0l1J51j92
7613f0Q4m1j5J14oK7o1K8o9N1p6J30o4p4J85j86L5p5M0R3j95J19rO0j21J44p6
7640a8L2M1j29L4R1p4n4J5M0Q9j89lR1K9k1j1M6l0R0j9m5L6r2R4k2n9R4q5p2J85
7670H4nj57L5%O8m5P8l9n5nJ22j22P3J03j27nJ1NJ28k42J1K9J07k8R0m2l8K7j67
7699a06j1O8M0L5N0o5J16j13j13J14k1J43p3J6n4rm2J09p5l4R7j44M6L5k2K0k6
7726a9p3J26p5J67j40j14J45o7K0R6J21j52j3J6K1k6L7p2L5m9N2J29k32J8J27
7751G8J0o6J9o2L0K6MJ1k3J65n2j57q1O1O0k8j7J5O2n0J04p8p7O9P5l10K42q4
$$ plain form
7779 -54 -87 11 -1 -36 -22 31 -9 40 -168 -18 -36 99 -35 -57 53 14 74 52 -99 -129 15 37 -138 23 93 -4
7805 -4 -35 -42 -84 -39 -68 -99 21 -132 -49 -29 -88 0 -9 -54 14 18 -103 5 -84 -80 -53 -27 0 29 -57 -31 -96 3 -21 -49 141
7836 141 52 83 48 156 -66 51 131 11 119 10 -24 -43 -31 25 70 10 31 -7 58 -61 112 23 -30 -11 -60 12
7862 12 -25 28 43 -52 102 26 -60 67 81 -51 -43 -27 86 -27 -103 -37 72 -20 -3 -20 -101 2 -61 -82 0 24 -80
7889 -80 29 -36 -64 -76 34 -71 44 -177 29 -39 1 33 -2 -55 -25 10 -49 71 -114 5 79 -14 48 -37 -34 65
7915 65 -30 -16 -61 -85 -11 -3 5 25 50 15 -5 -9 52 56 45 76 -5 -10 -4 -71 -49 0 23 -1 7 6 -118 1 8 47 -40 -17 58 -58
7949 -58 -1 98 -39 -64 -12 -22 55 16 -9 142 -56 -60 6 -63 -52 116 -5 -21 85 -113 29 75 90 77 -44 -29
7975 -29 76 132 81 79 -85 107 47 -86 41 110 -73 -29 8 -40 -47 -57 6 62 3 -124 -67 -30 62 35 -11 -84 -43 41
$$ packed form
7779e4l3R8j2l5J4N3m0M9k08J50j8J35j34k2J10l9O0k2j51l0J44K2j75J61P0r7
7805dl1pm2M5k9l1J20j53Q3K0n9Q8rm5O8Mj21J08q9MK7K6K7K9q6K6o5R9k4k8J90
7836A41q9L1l5J08k22J17Q0j20J08j09l4j9J2N6M5o0K1l8O5j19J73q9n3J9m9P2
7862A2l7N3J5r5J54p6q6J27J4j32QJ6J13j13p6O6J09r2J7j7q1J03o3k1Q2K4j04
7889h0J09o5k8j2J10j05J15k21K06o8M0L2l5n3L0L5n9J20j85J19P4r3O2q5LR9
7915F5r5J4m5k4P4QQK0K5l5k0mO1Mj1L1q1nOo7K2M9K3k4Qjj24J19PL9q7K3P5j16
7949e8N7R9j37k5N2j0P7l9k5J51j98mO6o9J1J68j21j6J06j98J42M6J5j3j21J5
7975b9J05N6n1kj64J92o0j33J27O9j83M4L7m8pj0O3N6n9j27N7L7R2k7m6p3M1Q4
$$ plain form
8003 41 -41 -107 -62 26 -78 -86 49 81 44 32 -49 57 15 -19 47 -28 -3 -38 -8 7 27 -13 30 -8 -23 37 -101 -79 94
8032 94 25 -87 6 -24 -121 3 -52 -58 4 -65 -34 140 -6 66 85 -23 71 -89 -2 -31 11 -14 20 -8 22 -29 91
8059 91 107 -29 20 36 -41 8 38 -45 -113 -75 75 73 -38 38 41 -57 -3 -71 -85 -4 91 -37 -4 60 -26 20 -94 67
8087 67 82 62 -8 138 -40 -48 -97 52 79 47 57 -25 5 -7 -29 -131 28 -24 173 -11 -49 30 -24 -37 25 48 -64
8114 -64 53 -5 -66 -125 -29 4 -10 -102 90 -40 -14 -39 78 28 -8 4 62 32 -30 106 -50 -21 71 50 -114 -18 -40
8141 -40 -53 -35 41 78 28 -44 16 -3 22 61 34 -43 0 -126 5 23 -38 126 -22 -41 64 -29 -62 45 -33 -61 93
8168 93 101 -99 43 59 -26 -30 -69 -1 -45 33 28 -50 -10 54 -82 11 31 -42 -44 146 51 23 14
$$ packed form
8003D1q2o6M5Q8j04qJ35L2l7j2q1J06m2l4O6p5K5l5L0J5K0m0M3l8j5O0j38K2J73
8032I4o9j12R3l0r7J24n5oO2o9L1J74j46P2J9j08R4j60Q7k9M2k5L4k8L0n1J20
8059I1J6j36M9J6p7M9L0q3o8L8J50kj11P6Lr8N4o8j4Q1R5j28L3O4q6M6j14J61
8087F7J5k0p0J46j78qm9J49K7l2J0q2L0j2k2j02J59n2J97j84l8P9n4j3O2K3j12
8114f4J17n8o1n9R6L3j4r2J92j30K6k5J17n0l6J2N8l0o2J36j56K9R2k1j64R6k2
8141d0j3J8P6L7n0p2O0j9K5L9k7p7M3j26J31J8o1J64j48j9J05r3l3J07p8k8J54
8168I3Qk00J42J6q5ml9O8m4P8np8M0O4j36R3K0p3kJ90r5k8r
8191A4
$$ Imaginary data points
##PAGE= N=2
##DATA TABLE= (X++(I..I)), XYDATA
$$ plain form
0 0 0 0 0 0 0 0 0 0 0 0 -8 8 -8 16 -16 24 -24 32 -40 48 -56 67 -80 96 -112 129 -152 176 -201 230 -265 299
32 299 -340 386 -436 492 -552 617 -689 770 -857 952 -1053 1168 -1292 1428 -1576 1736 -1913
49 -1913 2111 -2321 2558 -2821 3112 -3438 3807 -4226 4709 -5267 5929 -6720 7692 -8917
63 -8917 10514 -12692 15853 -20872 30074 -52464 222963 137322 -242532 188541 102968 -239468
75 -239468 -52785 208013 -65111 -117543 137683 21169 -272051 -13050 185069 -70239
85 -70239 -88597 151238 33107 -123244 -14387 55704 -57259 -67436 64692 9395 -183912
96 -183912 -50675 121875 -35234 -65266 128423 53440 -124991 -48299 28942 -92659 -59138
107 -59138 165492 85307 -124826 43825 127764 -115467 -63515 154874 54826 -14301 99632
$$ packed form
0@%%%%%%%%%%qJ6j6K4l2M0m8N6p2Q8j04J23j47J76k08K41k81L28l77M31m95N64
32B99o39P26q22R28j044J169j306J459j627J809k005K221k460K720l004L312l649
49a913M024m432M879n379N933o550P245q033Q935r976J1196j2649J4412j6609
63h917J9431k3206K8545l6725N0946q2538K75427q5641l79854M31073q5573l42436
75b39468J86683K60798k73124n2432K55226j16514k93220K59001J98119k55308
85g0239j8358K39835j18131j56351J08857P0091j12963j0177J32128n5297j93307
96a83912J33237J72550j57109l0032J93689p4983j78431P6692P7241j21601L3521
107e9138K24630q0185k10133J68651Q3939k43231N1952K18389j00048o9127J13933
$$ plain form
118 99632 37714 -104437 -32449 63620 -48353 -91085 73733 64435 -77047 -5126 64439
129 64439 -6786 5283 35292 -11531 -38649 -24455 10050 -8412 -43503 29928 49070 -50159
141 -50159 -47613 4067 -18068 -14355 30579 39574 -5959 -21890 16819 -39244 -99224 4940
153 4940 41304 -29479 16614 51077 -1239 9735 24007 -6507 -5237 21123 30909 -7304 -23283
166 -23283 22988 11433 -24774 -5685 -13018 -10766 14188 -12475 3241 43234 13966 14090 18788
179 18788 -25367 -15016 6779 -12697 -6438 13070 25039 10574 -19222 -2134 -8535 -39806
191 -39806 1001 9465 -25083 9398 17780 -16658 -11865 -16520 -15605 -1068 -13969 2443 20178
204 20178 5552 20518 16614 -10821 1233 2297 -5155 -1442 -6653 19777 22735 -18561 763
$$ packed form
118I9632o1918j42151P1988R6069j11973m2732J64818r298j41482P1921O9565
129F4439p1225J2069L0009m6823k7118J4194L4505j8462l5091P3431J9142r9229
141e0159K546N1680k2135L713M4934Q995m5533j5931L8709n6063n9980J04164
153D940L6364p0783M6093L4463n2316J0974J4272l0514J270K6360R786l8213j5979
166b3283M6271j1555l6207J9089p333K252K4954k6663J5716L9993k9268J24M698
179A8788m4155J0351K1795j9476O259J9508J1969j4465k9796J7088o401l1271
191c9806M0807Q464l4548L4481Q382l4438M793m655R15J4537j2901J6412J7735
204B0178j4626J4966l904k7435J2054J064p452L713n211K6430K958m1296J9324
$$ plain form
217 763 9086 -31276 -11836 6120 -10229 13026 26868 16317 11474 2222 9684 -1015 -23356
230 -23356 6483 10098 -15112 7479 5527 -18528 -10179 -17695 -15731 -2829 -13009 10275 24535
243 24535 -1101 12645 15873 -13196 -4880 -446 -7535 335 2240 16348 9597 -16258 7562
256 7562 4295 -33465 -6217 8834 -13577 3270 12037 1426 467 -5111 3213 -809 -11552 20129
270 20129 18878 -7820 17940 15467 -18171 -11377 -8637 -14606 -12116 -9883 12342 10639 -5328 20809
284 20809 13479 -14044 11644 11107 -12015 4314 8551 -3516 -10816 -13535 -1681 -15714 -24701
297 -24701 12114 8532 -7473 25318 21185 -2277 9570 3490 -9391 -10259 -9265 1895 -9538
310 -9538 -13125 14553 -3012 -18713 12382 5042 -9238 12131 12359 6061 5821 1632 5319 -10486
$$ packed form
217G63Q323m0362J9440J7956j6349K3255J3842j0551m843r252P462j0699k2341
230b3356K9839L615k5210K2591j952k4055Q349p516J964J2902j0180K3284J4260
243B4535k5636J3746L228k9069Q316M434p089P870J905J4108o751k5855K3820
256G562l267l7760K7248J5051k2411J6847Q767j0611r59n578Q324m022j0743L1681
270B0129j251k6698K5760k473l3638O794K740n969K490K233K2225j703j5967K6137
284B0809p330k7523K5688n37k3122J6329M237j2067p300k719J1854j4033q987
297b4701L6815l582j6005L2791m133k3462J1847o080j2881q68R94J1160j1433
310i538l587K7678j7565j5701L1095p340j4280K1369K28o298k40m189L687j5805
$$ plain form
324 -10486 -14003 7674 -9694 -12603 19335 4415 -7859 11510 2905 -8135 -7100 -5868 1086
337 1086 -9824 -6186 14010 -5385 -6698 17664 -1497 -6790 15479 6930 126 4663 4627 2629
351 2629 -15285 -11160 3774 -20348 -14690 14194 -4304 -4766 18767 7784 254 6350 6996 3356
365 3356 -8449 4008 11949 -16651 -5487 15831 -14183 -13310 11625 -751 -5026 5524 8247
378 8247 3329 -7397 5054 5915 -21793 -3343 14814 -16121 -7887 18116 1750 -5120 6379
391 6379 8929 -1398 -9991 8666 5439 -22502 1333 13473 -22838 -11495 12068 -7882 -9163
404 -9163 9728 11818 219 109 19927 6308 -18798 11104 15678 -20908 -4163 13004 -10433
417 -10433 -8600 5987 2135 -5132 477 16266 74 -16604 15032 13551 -18040 2165 13246
$$ packed form
324a0486l517K1677j7368k909L1938j4920j2274J9369q605j1040J035J232O954
337A086j0910L638K0196j9395j313K4362j9161n293K2269q549o804M537l6j998
351B629j7914M125J4934k4122N658K8884j8498m62K3533j0983p530O096O46l640
365C356j1805J2457P941k8600J1164K1318l0014Q73K4935j2376m275J0550K723
378H247m918j0726J2451Q61k7708J8450J8157l0935Q234K6003j6366o870J1499
391F379K550j0327q593J8657l227k7941K3835J2140l6311J1343K3563j9950j281
404i163J8891K090j1599j10J9818j3619k5106K9902M574l6586J6745J7167k3437
417a0433J833J4587l852p267N609J5789j6192j6678L1636j481l1591K0205J1081
$$ plain form
430 13246 -9747 -6769 2053 -2691 -5551 1624 14712 -1892 -14694 12548 4089 -21611 1740
443 1740 7643 -10771 -3030 -1475 -10870 -9875 -920 10058 -1053 -4968 17190 5115 -12474 5857
457 5857 5307 737 13366 3327 -5767 -898 -3228 71 -2204 -1733 14813 8258 -5241 -2311 -6900
472 -6900 1014 9880 -3848 2593 10566 -5300 -3815 -1433 -6263 8038 12492 2858 -5028 -11599
486 -11599 -947 -3402 -19493 1004 10614 -11349 -6767 -3979 -18439 -5652 13796 13525 2501
499 2501 2546 17371 -1560 -25263 5455 14606 -9220 6985 10469 -21016 -15605 8750 2631 -11766
513 -11766 9117 34132 1212 -21355 15354 10925 -14967 18358 23149 -16231 -7502 14291 -9340
526 -9340 -26736 7470 31258 -7162 -19842 14308 -7795 -32368 10093 14383 -17823 3074
$$ packed form
430A3246k2993K978Q822m744k860P175J3088j6604j2802K7242q459k5700K3351
443A740N903j8414P741J555r395R95Q955J0978j1111l915K2158j2075j7589J8331
457E857n50m570J2629j0039r094M869k330L299k275M71J6546o555j3499K930m589
472f900P914Q866j3728O441P973j5866J485K382m830J4301M454r634p886o571
486a1599J0652k455j6091K0497R610k1963M582K788j4460J2787J9448k71j1024
499B501M5J4825j8931k3703L0718R151k3826J6205L484l1485N411K4355o119j4397
513a1766K0883K5015l2920k2567L6709m429k5892L3325M791l9380Q729K1793k3631
526i340j7396L4206K3788l8420j2680L4150k2103k4573M2461M290l2206K0897
$$ plain form
538 3074 21909 -11962 -32639 1051 22132 -9197 -6624 29200 -770 -26864 8999 3309 -25491
551 -25491 4935 27103 -6076 -25272 4758 16423 -16715 -5068 33033 3312 -14196 19126
563 19126 1152 -25995 9461 28167 -2672 -13136 12468 9602 -24961 -9563 22759 -1426
575 -1426 -4433 24151 -2355 -26621 1161 9463 -10877 -9886 13939 12642 -16900 -10100 10027
588 10027 -10062 -7682 18514 865 -15296 2735 5757 -10475 -13082 8240 13724 -11908 -8230
601 -8230 9114 -9831 -7273 17992 6205 -4593 9200 8611 -7894 -13902 5741 15684 -3621
614 -3621 686 13932 -6798 -10580 4711 -2804 -5025 7142 11092 1295 -12089 -891 10103
627 10103 -10014 -6852 13734 -462 -8721 4763 1248 -7418 -938 11072 3378 -15121 416
$$ packed form
538C074J8835l3871k0677L3690K1081l1329K573L5824k9970k6094L5863n690k8800
551b5491L0426K2168l3179j9196L0030J1665l3138J1647L8101k9721j7508L3322
563A9126j7974k7147L5456J8706l0839j0464K5604k866l4563J5398L2322k4185
575a426l007K8584k6506k4266K7782Q302k0340R91K3825j297k9542O800K0127
588A0027k0089K380K6196j7649j6161J8031L022j6232k607K1322N484k5632L678
601h230J7344j8945K558K5265j1787j0798J3793n89j6505o008J9643R943j9305
614c621M307J3246k0730l782J5291p515k221J2167L950r797j3384J1198J0994
627A0103k0117L162K0586j4196q259J3484l515q666O480J2010p694j8499J5537
$$ plain form
640 416 11880 -14284 -7967 16828 -610 -9684 5675 -1035 -14310 -5242 10992 4329 -9474
653 -9474 9054 14679 -14631 -7978 12265 -3829 -6137 10932 5614 -7135 -4100 6912 -1089
666 -1089 -14610 6349 14915 -11295 -2867 15988 -2847 -7104 10235 5844 -7977 -3307 9993
679 9993 -1053 -14091 9452 12365 -14649 -1697 11800 -11347 -9771 8192 1180 -7504 1350
692 1350 8953 -4648 -13414 5731 4316 -13123 3906 11671 -6186 -1552 6826 -2153 -6193 -1250
706 -1250 5021 -1626 -7381 7791 6169 -8767 4111 8889 -5054 80 6957 1407 -1250 1476
720 1476 6297 -1354 -7316 5253 -141 -11567 2985 4253 -6889 2252 4882 -2551 -1795 -860 196
735 196 -3399 -4819 4060 -498 -5548 4564 -102 -5698 2776 -26 -1607 3497 740 3368 2935
$$ packed form
640D16J1464k6164O317K4795j7438r074J5359o710j3275R068J6234o663j3803
653i474J8528N625k9310O653K0243j6094k308J7069n318j2749L035J1012q001
666a089j3521K0959Q566k6210Q428J8855j8835m257J7339m391j3821M670J3300
679I993j1046j3038K3543K913k7014J2952J3497k3147J576J7963p012q684Q854
692A350P603j3601q766J9145j415j7439J7029P765j7857M634Q378q979m040M943
706a250O271o647n755J5172j622j4936J2878M778j3943N134O877n550k657K726
720A476M821p651n962J2569n394j1426J4552J268j1142R141K630p433P56R35J056
735A96l595j420Q879m558n050J0112m666n596Q474k802j581N104k757K628m33
$$ plain form
750 2935 -2124 3219 439 -4395 2646 314 -1879 3880 547 860 2728 -1902 1341 -164 -3935
765 -3935 2546 -787 -3394 3671 -1730 -3566 2013 -3744 -2640 1615 -2532 782 1971 -1097 1833
780 1833 -1457 -1872 1699 -3855 -161 4480 -2585 2340 5240 -2632 1581 2679 -2438 1361 330
795 330 155 2430 -2093 1022 1688 -5222 372 1257 -4697 1785 1905 -1715 2340 -441 -765 927 -4061
812 -4061 362 1756 -4370 2585 3202 -3442 1862 1473 -2396 600 -478 1091 1624 -1867 3577 1466
828 1466 -4511 3230 883 -5431 2734 1867 -2479 1976 362 -510 -678 -3021 979 -1843 -4215 3779
844 3779 -620 -4134 4083 -254 -3252 2209 -560 -495 1646 404 3254 270 -1117 4850 -1557 -3303
860 -3303 4561 -1072 -1913 4076 -345 -639 1606 -474 705 -2288 -649 4477 -2743 -1571 5686 -2517
$$ packed form
750B935n059N343k780m834P041k332k193N759l333L13J868m630L243j505l771
765c935O481l333k607P065n401j836N579n757J104M255m147L314J189l068K930
780A833l290m15L571n554L694M641p065M925K900p872M213J098n117L799j031
795C30j75K275m523L115O66o910N594Q85n954O482J20l620M055k781l24J692m988
812d061M423J394o126O955O17o644N304l89l869K996j078J569N33l491N444k111
828A466n977P741k347o314Q165q67m346M455j614q72j68k343M000k822k372P994
844C779m399l514Q217m337k998N461k769O5K141j242K850k984j387N967o407j746
860c303P864n633q41N989m421k94K245k080J179k993J639N126p220J172P257q203
$$ plain form
876 -2517 -2280 3479 -2870 -2517 1539 -501 -755 -2481 385 2547 -5191 -1396 3733 -4828 -1069 4304
892 4304 -3383 -852 3790 -4 -857 -1358 1501 2389 -3723 1551 4326 -3634 1678 3686 -4893 -276
908 -276 3426 -860 -225 -153 2383 2489 -3479 1105 2783 -3277 2842 3085 -4011 1726 3001 -1374 -176
925 -176 -1177 1364 2072 -4121 -461 992 -3578 1604 701 -4257 1194 248 -2437 -357 -2660 1338
941 1338 3883 -3083 -690 1306 -2784 145 -971 -2223 2310 -343 31 892 -5091 1124 5609 -3236
957 -3236 -395 5032 456 -33 299 1291 2281 324 5052 2674 -6410 3376 6625 -6285 -1120 6876
973 6876 -423 -3336 -1008 -676 -3750 -3189 5673 183 -8939 4845 5090 -11087 -2490 7488 -1187
988 -1187 -2881 2436 738 -6327 -3804 6343 -2280 -8879 9249 6359 -12194 -1382 7847 -2966
$$ packed form
876b517K37N759o349L53M056k040k54j726K866K162p738L795N129q561L759N373
892D304p687K531M642l794q53n01K859Q88o112N274K775p960N312K008q579M617
908b76L702m286O35P2K536J06n968M584J678o060O119K43p096N737J275m375J198
925a76j001K541P08o193L660J453m570N182r03m958N451r46k685K080k303L998
941A338K545o966K393J996m090K929j116j252M533k653L74Q61n983O215M485q845
957c236K841N427m576m89L32R92R90j957M728k378r084R786L249j2910N165P996
973F876p299k913K328L32l074N61Q862n490r122J3784K45j6177Q597R978q675
988a187j694N317j698p065K523J0147q623o599J8128k890j8553J0812R229j0813
$$ plain form
1002 -2966 -2009 6910 3642 -5448 -817 7826 -4956 -7874 13741 7425 -10747 2553 7263 -6954
1016 -6954 -3315 7192 2675 -4743 2419 6923 -9840 -9969 11745 3252 -9598 6765 7299 -8319
1030 -8319 -3807 4113 -1056 -4385 5226 7743 -9812 -9063 7970 -2907 -10738 7446 6892 -6105
1044 -6105 -1592 1983 -4580 -5606 5457 9052 -5322 -3351 9072 -4727 -10311 6784 6017 -1270
1058 -1270 4286 3811 -3792 -5718 1978 5308 -3630 849 10227 -3128 -8744 1935 226 -1359 4812
1073 4812 4592 800 -3263 -1613 1028 -5533 -1263 9192 409 -5581 -391 -2963 -4253 -787 1840
1088 1840 3858 -797 -1100 1881 -6907 -5116 6843 2496 -1607 2704 877 -2169 -3907 -596 5043
1103 5043 436 1345 6687 -3904 -6671 3509 1120 -2686 2296 4575 1145 -5492 -2177 3892 -4018
$$ packed form
1002b966R57Q919l268r090M631Q643j2782k918K1615o316j8172J3300M710j4217
1016f954L639J0507m517p418P162M504j6763j29K1714q493j2850J6363N34j5618
1030h319M512P920n169l329R611K517j7555P49J7033j0877p831J8184n54j2997
1044f105M513L575o563j026J1063L595j4374J971J2423j3799n584J7095p67p287
1058a270N556m75p603j926P696L330q938M479R378j3355n616J0679j709j585O171
1073D812k20l792m063J650K641o561M270J0455q783n990N190k572j290L466K627
1088A840K018m655l03K981q788J791J1959m347m103M311j827l046j738L311N639
1103E043m607R09N342j0591k767J0180k389l806M982K279l430o637L315O069p910
$$ plain form
1118 -4018 -806 9636 -1145 -5994 4025 255 -6522 -475 5854 2069 -5161 786 3965 -8277
1132 -8277 -2869 9012 -2510 -4886 7117 1099 -7225 -1082 4856 665 -4182 4510 6062 -7467
1146 -7467 -1880 7952 -4417 -4540 8099 2193 -5808 -632 4103 -1553 -6056 4152 5683 -7547
1160 -7547 -637 7550 -6376 -5630 6669 842 -5095 1157 4819 -1804 -6021 4228 4018 -7409
1174 -7409 1655 7537 -6204 -3700 5567 -1376 -4466 1711 4338 -921 -3721 4437 3076 -6257 2582
1189 2582 6697 -4494 -989 5295 -1320 -3562 863 3013 -788 -3426 4067 2197 -6645 1577 4353
1204 4353 -5412 -1095 4008 -1866 -3237 -21 1748 -1563 -3251 4211 2084 -5159 2537 3323 -5077
1219 -5077 -82 3066 -1998 -1867 -314 725 -1437 -3121 3244 1458 -3761 3355 3138 -2974 1380
$$ packed form
1118d018L212J0442j0781m849J0019l770o777O047O329l785p230N947L179j2242
1132h277N408J1881j1522k376J2003o018q324O143N938m191m847Q692J552j3529
1146g467N587R832j2369j23J2639n906q001N176M735n656m503J0208J531j3230
1160g547O910Q187j3926P46J2299n827n937O252L662o623m217J0249k10j1427
1174g409R064N882j3741K504R267o943l090O177K627n259k800Q158j361r333Q839
1189B582M115j1191L505O284o615k242M425K150l801k638P493j870q842Q222K776
1204D353r765M317N103n874j371L216J769l311j688P462k127p243P696P86q400
1219e077M995L148n064J31J553J039k162j684O365j786n219P116k17o112M354
$$ plain form
1234 1380 2739 -541 274 369 1920 -4 -2511 3144 1224 -3406 3143 2394 -3027 951 1082 -1547
1250 -1547 -784 -888 724 -1001 -2885 2262 -9 -3416 2890 1175 -2321 1809 458 -1342 0
1265 0 -1279 247 -870 -2849 1246 -832 -2873 2232 173 -1216 2368 171 309 1441 -855 1498
1281 1498 686 -1735 2204 194 -1846 2417 -97 -772 1920 -504 248 1073 -1576 1004 -196 -2120
1297 -2120 1620 -592 -1632 2078 -690 -212 1989 -860 791 1065 -1575 898 -237 -2265 718
1312 718 -1400 -1861 746 -1836 -722 931 -1572 1008 946 -1271 2094 337 -1096 2273 -311 -933
1328 -933 1773 -778 77 1219 -1270 876 154 -1389 1381 -1136 -1400 1831 -1632 -960 1750 -1403
1344 -1403 65 1489 -991 1218 867 -1 1982 -696 31 2255 -1808 -393 1653 -2073 -29 876
$$ packed form
1234A380J359l280Q15R5J551j924k507N655j920m630O549p49n421L978J31k629
1250a547P63j04J612j725j884N147k271l407O306j715l496M130j351j800J342
1265@j279J526j117j979M095k078k041N105k059j389L584k197J38J132k296K353
1281A498q12k421L939k010k040M263k514o75K692k424P52Q25k649K580j200j924
1297b120L740k212j040L710k768M78K201k849J651K74k640K473j135k028K983
1312G18k118m61K607k582J114J653k503K580o2k217L365j757j433L369k584o22
1328i33K706k551Q55J142k489K146p22j543K770k517k64L231l463O72K710l153
1344a403J468J424k480K209l51q68J983k678P27K224m063J415K046l726K044R05
$$ plain form
1360 876 -1605 497 -82 -535 1023 -1384 316 2118 -1860 517 2030 -2147 429 1078 -1820 13
1376 13 -221 -632 0 -2085 374 785 -2931 600 1019 -2542 1345 1629 -1569 1056 1400 261 503
1393 503 -642 1317 867 -1800 1932 650 -2116 2316 516 -2565 1261 295 -1051 333 -687 637
1409 637 173 -1233 1450 -636 -1391 2970 -232 -1540 2782 70 -1288 831 -942 -694 -387 -844
1425 -844 379 -2028 -729 2655 -2015 -1204 3567 -905 -1174 2118 -729 -980 875 821 -307 -2224
1441 -2224 647 1577 -3978 -340 3931 -2148 -396 3532 -1952 -2578 1309 678 -1659 -938 3392 1586
1457 1586 -4018 1748 3620 -3323 1467 5427 -1906 -1386 3145 -4 -3352 -858 3787 -363 -4477
1472 -4477 2481 1330 -5877 1707 4771 -3220 -538 3897 -1618 -5284 -955 3034 -1759 -3123 4775
$$ packed form
1360H76k481K102n79m53J558k407J700J802l978K377J513m177K576O49k898J833
1376A3k34m11O32k085K459M11l716L531M19l561L887K84l198K625L44j139K42
1393E03j145J959m50k667L732j282k766M432j800l081L826r66j346J384j020J324
1409F37m64j406K683k086p55M361l202j308M322k712j358K119j773K48L07m57
1425h44J223k407J299L384m670Q11M771m472k69L292k847k51J855n4j128j917
1441b224K871R30n555L638M271o079J752L928n484o26L887o31k337P21M330j806
1457A586n604N766J872o943M790L960p333N20M531l149l348K494M645m150m114
1472d477O958j151p207P584L064p991K682M435n515l666M329L989m793j364P898
$$ plain form
1487 4775 542 -6726 1819 2445 -5247 997 6204 -400 -3718 888 2051 -3670 -2034 6436 1177
1502 1177 -3635 4995 2326 -5625 1935 6017 -570 -1537 2615 1113 -5126 -2735 4107 -1291 -3261
1517 -3261 5114 66 -6896 391 2438 -2227 -395 3855 2084 -3847 -2703 1753 -3570 -2935 5754
1532 5754 1336 -3591 2100 1062 -3608 -1270 2590 2635 -906 237 2770 -2884 -2564 4338 536 -1631
1548 -1631 3497 1489 -2307 -1390 526 1524 -650 50 2485 -2622 -3644 1001 -1457 -1654 2669 1944
1564 1944 82 -1220 -1487 634 -1663 -1007 3621 478 -1512 1464 -1046 -2582 -54 1232 1791 -231
1580 -231 116 2858 -1463 -2434 2852 268 -1868 1735 588 -1917 -996 917 1622 -1761 -50 3660
1596 3660 -2014 -3170 2805 -104 -2200 2346 1936 -1335 -1876 277 329 -3660 -253 4587 -1512 -2408
$$ packed form
1487D775m233p268Q545O26p692O244N207o604l318M606J163n721J636Q470n259
1502A177m812Q630k669p951P560M082o587r67M152j502o239K391O842n398j970
1517c261Q375n048o962P287K047m665J832M250j771n931J144M456n323O35Q689
1532E754m418m927N691j038m670K338L860M5l541J143K533n654L20O902l802k167
1548a631N128k008l796R17J916R98k174P00K435n107j022M645k458j97M323p25
1564A944j862j302k67K121k297O56M628l143j990K976k510j536K528J286N59k022
1580b31L47K742m321r71N286k584k136L603j147k505R21J913P05l383J711L710
1596C660n674j156N975k909k096M546m10l271n41K153N2l989L407M840o099q96
$$ plain form
1612 -2408 3649 -863 -3994 1007 1672 -1000 -655 2776 1702 -3737 -281 3796 -2941 -2088 4310 -337
1628 -337 -2905 1872 1831 -1415 -864 2547 1443 -3612 356 3749 -3048 -1133 4607 -457 -2492 1578
1644 1578 555 -2210 -1301 2419 1581 -2845 1061 2772 -4512 -2343 2523 -1937 -2248 2092 1169 -1389
1660 -1389 -1136 1727 541 -3159 1451 3251 -2744 -290 3260 -1622 -1742 1416 436 -1216 -829 1952
1676 1952 956 -2174 1992 3182 -2423 -3 2504 -1863 -1540 1217 849 -109 -470 1827 564 -3244
1692 -3244 457 1531 -2881 43 2430 -1296 -1134 130 -301 -1261 -1562 1710 1247 -1948 1763 2287
1708 2287 -2365 97 1535 -1708 -1011 183 257 -436 -1130 1895 956 -1947 1541 1639 -2155 572 1731
1725 1731 -610 -23 242 71 -1014 -2412 393 28 -2257 1862 2238 -1006 1102 1369 -735 -267 -32
$$ packed form
1612b408O057m512l131N001O65k672L45L431j074n439L456M077o737Q53O398m647
1628c37k568M777m1l246N51L411j104n055L968L393o797J915N740n064k035M070
1644A578j023k765R09L720q38m426L906J711p284K169M866m460l11M340r23k558
1660a389K53K863j186l700M610J800n995K454L550m882j20L158r80j652L87K781
1676A952r96l130M166J190n605K420K507m367L23K757l68r58l61K297j263l808
1692c244L701J074m412K924K387l726J62J264m31r60l01L272m63l195L711N24
1708B287m652K462J438l243O97J194P4o93o94L025r39k903L488R8l794K727J159
1725A731k341N87K65j71j085j398K805l65k285M119L76l244K108K67k104M68K35
$$ plain form
1742 -32 701 -76 -1386 1297 317 -2410 934 790 -1706 876 1068 -106 632 264 857 -82 -1707 784
1760 784 -284 -2474 908 426 -1322 808 312 -647 -533 -1178 94 -233 -1288 1605 583 -1570 1402
1777 1402 493 -1110 947 708 516 780 220 1367 -138 -1654 874 -604 -2107 1176 273 -769
1793 -769 1559 877 461 730 -193 857 -374 -1162 1341 -540 -1616 914 -1051 -1764 165 -905 -450
1810 -450 263 16 1257 169 -397 1434 -826 -1169 1245 -709 -789 1224 -181 47 432 -166 716 -610
1828 -610 -247 1433 -859 -145 1770 -1223 -588 1179 -930 -359 653 60 718 -42 566 1024 -1355
1845 -1355 -47 897 -2158 -383 1295 -1319 -181 781 -511 -110 -357 154 479 -857 981 1315 -1491
1862 -1491 737 1141 -1734 -26 666 -840 107 195 406 139 -849 885 155 -2054 1035 820 -1695
$$ packed form
1742c2P33p77j310K683r80k727L344j44k496K582J92j174P38l68N93r39j625K491
1760G84j068k190L382m82j748K130m96r59J14o45J272l27j055K893j022k153K972
1777A402r09j603K057k39j92K64n60J147j505j516K528j478j503L283r03j042
1793g69K328o82m16K69r23J050j231p88K503j881j076K530j965p13J929j070M55
1810d50P13k47J241j088n66J831k260l43K414j954q0K013j405K28L85n98Q82j326
1828f10L63J680k292P14J915k993O35J767k109N71J012n93O58p60O08M58k379
1845a355J308R44l055J775J678k614J138R62j292M01k47N11L25j336J838L34k806
1862a491K228M04k875J708O92j506R47Q8K11k67r88J734p30k209L089k15k515
$$ plain form
1879 -1695 934 997 -818 322 368 -296 -308 -521 1047 -267 -1358 1678 34 -1796 1174 -2 -1423
1896 -1423 1030 538 -342 291 304 728 -803 -845 1412 -823 -1418 1719 -593 -1433 1562 -154 -944 515
1914 515 370 355 -437 263 1507 -1067 -315 1811 -1557 -1231 1595 -1074 -1311 909 166 -393 -317 456
1932 456 684 -1289 755 2128 -1543 299 2276 -1604 -1186 1225 -721 -1068 -14 515 -381 -1531
1948 -1531 947 863 -2183 1386 2663 -1669 348 2219 -859 -841 763 401 -919 -1197 1092 -607
1964 -607 -3020 1285 1397 -2345 955 2272 -1245 -230 1256 455 -496 19 1687 -671 -2431 1561
1980 1561 262 -2718 1314 1575 -1997 -218 741 -662 -866 396 1885 -322 -1042 2191 -237 -2549
1996 -2549 1725 1191 -1396 932 1110 -865 -1200 -434 636 -1047 -967 2130 -438 -1728 1764 341
$$ packed form
1879a695K629O3j815J140M6o64j2k13J568j314j091L036j644j830K970j176j421
1896a423K453m92q80O33J3M24j531m2K257k235n95L137k312q40K995j716p90J459
1914E15j45j5p92P00J244k574P52K126l368L26K826k669k37K220p43n59P6P73
1932D56K28j973K044J373l671J842J977l880M18K411j946l47J054N29q96j150
1948a531K478q4l046L569J277m332K017J871l078J8J604l62j320k78K289j699
1964f07k413M305J12l742L300J317l517J015J486q01r51N15J668k358j760L992
1980A561j299k980M032K61l572J779R59j403k04J262J489k207p20L233k428k312
1996b549M274n34k587K328J78j975l35P66J070j683Q0L097k568j290L492j423
$$ plain form
2012 341 -1199 1422 892 -369 -369 -319 445 -1132 -941 1599 -618 -1551 1141 -393 -927 1158 724 772
2030 772 614 -168 597 -1041 -1311 1110 -244 -655 1186 -220 -568 221 -454 645 399 -36 1441 -104
2048 -104 -1397 897 -399 -1075 482 -241 -284 -287 -662 972 164 -632 1943 4 -1633 761 -492 -1470
2066 -1470 164 494 433 -398 -448 1315 -910 -1173 2419 416 -915 1759 366 -1531 -390 -79 -299
2083 -299 -1004 87 1874 -873 -671 2539 -146 -1183 1927 464 -1160 -103 487 -103 -1294 -60
2099 -60 1314 -1795 -1067 2020 -1155 -1424 2155 587 -741 684 511 -396 -1808 92 1336 -1528
2115 -1528 5 2849 -1184 -1264 1510 -806 -1749 144 570 -51 -964 709 962 -2122 -269 2309 -922
2132 -922 39 2711 272 -369 739 318 -348 -1386 216 457 -2341 -229 1737 -1088 230 2367
$$ packed form
2012C41j540K621n30j261%N0P64j577J91K540k217r33K692j534n34K085m34M8
2030G72j58p82P65j638k70K421j354m11J841j406l48P89o75J099k46m35J477j545
2048a04j293K294j296o76J557p23m3ll75J634q08p96K575j939j637K394j253r78
2066a470J634L30o1q31n0J763k225k63L592k003j331K674j393j897J141L11k20
2083b99p05J091J787k747K02L210k685j037L110j463j624J057N90n90j191J234
2099f0J374l109P28L087l175k69L579j568j328J425j73r07j412J900J244k864
2115a528J533K844m033q0K774k316r43J893M26o21r13J673K53l084J853K578l231
2132i22R61K672k439o41J108m21o66j038J602K41k798K112J966k825J318K137
$$ plain form
2148 2367 134 -111 372 166 29 -648 1033 1109 -1955 -660 3 -2989 -1448 986 -290 323 1049
2165 1049 641 -97 -1364 271 749 -1373 866 1523 -1408 -355 593 -825 -137 257 490 472 -829
2182 -829 901 1272 -956 1025 1412 -1297 -194 317 -606 212 383 1051 884 -1213 -132 -401 -2483
2199 -2483 -280 960 -694 515 682 -624 -466 -969 149 599 -717 1013 979 -1467 49 153 -1476
2216 -1476 -264 -224 -378 154 -311 1066 1171 -288 1387 1190 -1256 337 428 -754 571 432 196 51
2234 51 -1294 -129 -33 -1460 1027 1279 -353 1012 740 -716 -148 -501 -213 -54 -841 606 425 -1232
2252 -1232 620 321 -1371 219 -109 -737 303 15 638 504 -692 674 -197 -1541 750 521 -774
2269 -774 1325 693 -224 191 -637 -213 -396 -785 928 272 -830 1286 241 -1131 626 -169 -549 510
$$ packed form
2148B367k233k45M83k06j37o77J681P6l064J295O63k992J541K434j276O13P26
2165A049m08p38j267J635M78k122K239O57k931J053R48j418O88L94K33j8j301
2182h29J730L71k228J981L87k709J103N11r23Q18J71O68j67k097J081k69k082
2199b483K203J240j654J209J67j306J58n03J118M50j316J730l4k446J516J04j629
2216a476J212M0j54N32m65J377J05j459J675j97k446J593R1j182J325j39k36j45
2234E1j345J165R6j427K487K52j632J365k72j456N68l53K88J59p87J447j81j657
2252a232J852k99j692J590l28o28J040k88O23j34j196J366q71j344K291k29j295
2269g74K099o32r17M15q28M24j83l89J713o56j102K116j045j372J757p95l80J059
$$ plain form
2287 510 150 670 346 -230 992 -437 -1227 628 -670 -1156 1032 32 -177 455 -462 -140 -578 -684
2305 -684 724 -108 -19 1717 -83 -534 915 -783 -877 197 -487 92 120 -28 717 -622 -485 763
2323 763 -1114 -348 1215 -421 338 1170 -367 -52 -133 -748 -43 -773 32 930 -761 274 844 -1220
2341 -1220 -200 422 -1020 139 660 194 854 308 383 348 -1147 228 425 -1098 695 818 -824 305
2359 305 82 -728 -89 -210 340 615 -61 1151 432 -1038 541 -468 -1764 42 -361 -1037 331 -6
2377 -6 123 44 -447 686 60 -437 1626 490 -439 1271 -59 -1062 2 -648 -651 -4 77 1113 168
2396 168 108 1571 -375 -605 1217 -439 -620 1107 -150 -306 -2 -473 -439 -1081 -505 558 -735 2
2414 2 1364 -921 -566 837 -1017 -734 315 -57 281 250 811 1056 -684 376 872 -1367 -110 1052
$$ packed form
2287E10l60N20l24n76J222j429p90J855j298m86K188j000k09O32r17L22m38j06
2305f84J408q32Q9J736j800m51J449j698r4J074o84N79K8j48P45j339J37J248
2323G63j877P66J563j636P59Q32j537L15q1o15P05p30Q05Q98j691J035N70k064
2341a220J020O22j442J159N21m66O60n46P5l5j495J375J97j523J793J23j642J129
2359C05k23q10O39j21N50K75o76J212p19j470J579j009j296J806m03o76J368l37
2377fJ29p9m91J133o26m97K063j136r29J710j330j003J064o50lO47Q1J036r45
2396A68o0J463j946k30J822j656j81J727j257j56L04m71L4o42N76J063j293P37
2414BJ362k285L55J403j854K83J049l72L38l1N61K45j740J060M96k239J257J162
$$ plain form
2432 1052 -860 -6 825 -186 -274 -266 134 270 -450 1114 1164 -828 669 867 -1637 -424 228 -1091
2450 -1091 -378 -109 188 -84 -493 967 189 -1155 868 430 -1259 624 642 -937 86 111 -286 -399
2468 -399 -417 841 313 -399 1613 694 -1092 647 -215 -1385 27 66 -28 59 -94 566 -316 -593 1025
2487 1025 34 -593 1304 263 -744 334 -364 -512 -209 -307 305 -367 -258 995 -69 -34 1285 -238
2505 -238 -561 321 -777 -386 135 -199 515 6 -479 411 -709 -362 829 -133 555 792 -586 -55 -44
2524 -44 -1048 223 76 -226 600 76 51 430 -565 320 407 -715 648 338 -895 475 206 -419 418
2543 418 118 40 33 -585 362 106 -635 809 64 -1178 174 -163 -971 157 340 337 482 145 710 -311
2563 -311 -805 753 -197 -933 995 -84 -895 190 -147 -382 -48 276 1052 93 -47 1398 -304 -653
$$ packed form
2432A052j912Q54Q31j011q8QM00J36p20J564N0j992J497J98k504J213O52j319
2450a091P13K69K97k72m09J460p78j344K023m38j689J883J8j579J023K5l97j13
2468c99j8J258n28p12K012r19j786J739q62j170J412L9r4Q7j53O60q82k77J618
2487A025r91o27J897j041j007J078o98j48L03r8O12o72J09J253j064L5J319j523
2505b38l23Q82j098L91N21l34P14n09m85Q90j120L47J191r62O88K37j378N31J1
2524d4j004J271j47l02Q26n24k5L79r95Q85Q7j122J363l10j233J370k69o25Q37
2543D18l00p8po18R47k56p41J444p45j242J352l37q08J128J83lJ45l37N65j021
2563c11m94J558r50p36J928j079q11J085l37k35L34L24P76r59j40J445j702l49
$$ plain form
2581 -653 1226 12 -623 543 -124 -585 -451 -86 568 -424 -29 1154 -781 -906 1017 -358 -368 1066
2599 1066 270 -202 -497 -332 -70 -681 60 1313 -598 -414 701 -940 -798 669 82 204 158 159 168 -909
2619 -909 53 915 -506 212 1199 -678 -497 412 -273 148 166 320 333 -873 -162 620 -786 375 1314
2638 1314 -440 -297 199 -653 -316 -59 377 566 -491 -74 295 -1204 -152 763 -439 262 422 -396
2656 -396 -147 -409 -45 448 -414 372 566 -1010 -165 484 -465 239 542 -50 277 -385 -68 507 -458 565
2676 565 671 -585 -11 111 -705 85 257 27 362 -383 75 175 -650 343 699 -484 256 175 -624 45
2696 45 -221 -196 396 -332 109 280 -755 117 306 -540 399 129 -464 125 -374 -100 406 -447 219 484
2716 484 -544 321 437 -446 360 281 -47 206 -435 -96 88 -573 212 470 -551 413 328 -366 394 100
$$ packed form
2581f53J879j214o35J166o67m61J34L65O54r92L95J183j935j25J923j375j0J434
2599A066p96m72k95J65K62o11P41J253j911J84J115j641J42J467n87J22m6JRj077
2619i09R62Q62j421P18R87j877J81R09o85M21J8J54J3j206P11P82j406J161R39
2638A314j754J43M96q52L37K57M36J89j057M17L69j499J052R15j202P01J60q18
2656c96K49k62L64M93q62P86J94j576Q45O49r49P04L03n92L27o62L17N75r65J023
2676E65J06j256N74J22q16P90J72k30L35p45M58J00q25R93L56j183P40q1p99O69
2696D5k66K5N92p28M41J71j035Q72J89q46R39k70n93N89m99K74N06q53O66K65
2716D84j028Q65J16q83Q06p9l28K53o41L39J84o61P85K58j021R64q5o94P60k94
$$ plain form
2736 100 58 407 -186 149 208 -972 195 114 -769 316 236 -407 232 -8 -78 122 -266 337 104 -523 509
2757 509 201 -746 476 66 -518 441 -132 -231 170 -231 231 20 -521 379 -199 -697 553 62 -404 656
2777 656 75 -47 238 -173 251 45 -297 581 -295 -604 468 -279 -405 523 -48 9 362 -41 238 -111
2797 -111 -99 433 -435 -342 432 -581 -295 508 -395 16 410 -297 77 23 -121 385 -356 -140 397 -685
2817 -685 -36 411 -621 119 403 -359 275 221 7 296 -171 220 394 -563 186 272 -745 157 285 -623
2837 -623 157 219 -162 207 -179 208 159 -540 423 191 -774 473 175 -661 384 225 -234 195 31 117
2857 117 -65 -310 366 -194 -566 678 -85 -572 560 34 -399 321 35 165 -46 -173 452 -223 -423
2876 -423 603 -325 -692 645 -251 -427 397 -139 -30 5 6 220 -304 -109 515 -405 -212 868 -311 -208
$$ packed form
2736A00m2L49n93L35N9j180J167q1q83J085q0o43O39k40p0K00l88O03k33o27J032
2757E09l08r47J222m10n84R59n73r9M01m01M62k11n41R00n78m98J250m91m66J060
2777F56n81j22K85m11M24k06l42Q78q76l09J072p47j26R28n71N7L53m03K79l49
2797a11J2N32q68R3P74j013K86Q03r03M11L94p07L74n4j44N06p41K16N37j082
2817f85O49M47j032P40K84p62O34n4k14K89m67L91J74r57P49Q6j017R02J28r08
2837f23P80O2l81L69l86L87m9o99R63k32r65J247k98q36J045j59m59M29j64Q6
2857A17j82k45O76n60l72J244p63m87J132n26m33P20k86J30k11j27O25o75k00
2876d23J026r28l67J337q96j76Q24n36J09L5JK14n24J95O24r20J93J080j179J03
$$ plain form
2896 -208 563 -170 -92 193 39 235 -297 95 463 -791 -84 621 -727 -3 620 -325 -64 275 -124 119
2916 119 -314 208 225 -577 381 402 -875 175 486 -635 -31 314 -264 78 -55 271 129 -478 391 256
2936 256 -797 539 482 -552 386 299 -412 15 -40 -9 -57 -305 598 -62 -739 489 18 -728 558 228
2956 228 -449 168 92 -109 -45 -289 468 -10 -438 651 -171 -610 583 14 -368 359 -56 -279 54 -172
2976 -172 207 -198 -51 647 -299 -415 666 -317 -363 540 -42 8 253 -132 56 -344 -99 443 -448 -65
2996 -65 624 -476 -274 548 -303 -22 298 -61 89 -48 -57 265 -321 195 437 -634 38 345 -587 16
3016 16 236 -334 103 -46 -149 99 -397 213 403 -387 431 520 -507 205 220 -444 337 120 -2 198 -316
3037 -316 187 67 -570 374 267 -523 519 92 -570 192 -91 -97 293 -308 172 -124 -550 275 -20 -476
$$ packed form
2896b08P71p33P8K85j54J96n32L92L68j254P07P05j348P24O23r45K61L39l99K43
2916A19m33N22J7q02R58K1j277J050L11j121O04L45n78L42j33L26j42o07Q69j35
2936B56j053J336n7j034R38q7p11M27n5L1m8k48R03o60o77J228m71p46J286l30
2956B28o77O17p6k01O4k44P57m78m28J089q22m39J193n69l82P27m15k23L33k26
2976a72L79m05J47O98r46j16J081r83m6R03n82N0K45l85J88m00K45N42q91L83
2996f5O89j100K02Q22q51K81L20l59J50j37rL22n86N16K42j071O72L07r32O03
3016A6K20n70M37j49j03K48m96O10J90p90Q18Q9j027P12J5o64P81k17j22K00n14
3037c16N03j20o37R44j07p90J042m27o62P62k83oL90o01M80k96m26Q25k95m56
$$ plain form
3057 -476 583 -49 -423 239 -396 -326 122 -189 262 216 -254 404 -190 -347 684 -42 -80 703 -97 -139 117
3078 117 -206 332 109 -97 389 -358 -397 412 -447 -211 587 -221 -109 164 -362 109 -194 -126 388 -199 3
3099 3 379 -436 -128 498 -214 186 182 -240 27 -126 -199 349 -151 97 567 -437 2 218 -394 148 355
3120 355 -94 371 -59 -348 65 -469 -155 505 -280 138 307 -593 81 71 -181 545 121 -36 235 -329
3140 -329 -13 294 -68 334 303 -356 118 -102 -401 350 -76 4 481 -441 -28 -38 -474 250 153 -198 342
3161 342 -184 -569 120 -172 -2 389 -64 8 18 -437 118 -58 -161 629 84 -308 346 -426 -83 401 -38
3182 -38 431 314 -261 57 -262 -296 479 9 -16 485 -373 -200 62 -293 40 125 -285 306 -370 -457 251 -171
3204 -171 -12 292 -316 114 78 -399 125 119 -166 429 -87 -249 336 -526 55 491 -314 408 284 -365 225
$$ packed form
3057d76J059o32l74O62o35P0M48l11M51m6m70O58n94j57J031p26l8P83q00m2K56
3078A17l23N38k23k06M86p47l9Q09q59K36P98q08J12K73n26M71l03O8N14n87K02
3099CL76q15L08O26p12M00mm22K67j53p3N48n00K48M70j004M39K16o12N42K07
3120C55m49M65m30k89M13n34L14O60p85M18J69r00O74j0k52P26m24j57K71n64
3140c29L16L07l62M02l1o59M74k20k99P51m26Q0M77r22M13j0m36P24r7l51N40
3161C42n26l85O89k92J70L91m53P2J0m55N55j76j03P90n45l92O54p72L43M84m39
3182c8M69j17n75L18l19l4P75m70k5N01q58J73K62l55L33Q5m10N91o76q7P08m22
3204a71J59L04o08M30l6m77N24ok85N95n16j62N85q62N81M36q05P22j24o49N90
$$ plain form
3225 225 30 -114 596 -49 -73 186 -448 17 167 -350 367 7 -396 202 -221 -305 210 -168 -130 182 -369
3246 -369 132 40 -347 397 46 -401 375 -72 -202 360 -90 -39 276 -300 235 -97 -271 473 -217 -176 468
3267 468 -255 -207 420 -183 41 287 -163 190 -43 -179 316 -214 -86 473 -341 -184 376 -354 30 303
3287 303 -192 105 -81 -110 240 -355 -54 478 -282 17 479 -484 29 218 -181 124 -115 -98 71 -296 -38
3308 -38 193 -509 129 422 -588 95 197 -415 124 65 80 167 -303 248 189 -589 340 316 -498 334 202 -407
3330 -407 79 52 31 203 -266 240 42 -494 447 100 -590 356 108 -505 250 50 -163 176 -88 122 15
3351 15 -338 354 -103 -431 535 -87 -466 430 24 -212 221 -75 254 -97 -180 378 -299 -266 471 -250 -314
3372 -314 431 -219 -231 309 -87 28 -98 -57 263 -301 -24 494 -415 -63 536 -249 -52 431 -215 -32 127
$$ packed form
3225B25j95j44P10o45k4K59o34M65J50n17P17l60m03N98m23q4N15l78L8L12n51
3246c69N01r2l87P44l51m47P76m47j30N62m50N1L15n76N35l32j74P44o90M1O44
3267D68p23M8O27o03K24K46m50L53k33j36M95n30J28N59q14J57N60p30L84K73
3287C03m95K97j86k9L50n95L01N32p60K99M62r63N13J89l99L05k39J7J69l67K58
3308c8K31p02O38K93j010O83J02o12N39n9J5Q7m70N51n9p78R29k4q14Q32j32o09
3330d07M86k7k1J72m69N06j98n36R41l47o90R46k48o13P55k00k13L39k64K10j07
3351A5l53O92m57l28R66o22l79Q96m06k36M33k96L29l51q3N58o77L3P37p21o4
3372c14P45o50j2N40l96J15j26M1L20n64K77N18r09L52N99p85J97M83o46J83J59
$$ plain form
3393 127 -117 218 -279 115 427 -546 40 397 -514 27 422 -243 121 191 -134 138 -275 208 309 -469
3413 -469 201 267 -636 163 184 -472 146 158 -184 92 -192 161 188 -293 330 217 -601 422 240 -393 390
3434 390 168 -287 131 -56 129 -7 -250 350 -36 -408 512 27 -482 412 21 -316 255 6 149 -30
3454 -30 -126 291 -231 -404 467 -104 -272 518 -159 -343 260 -199 -131 19 -122 184 -235 -140 435 -307 -131
3475 -131 639 -260 -82 440 -201 -38 115 -164 127 -331 -112 354 -475 -32 524 -346 -116 442 -294 -109
3495 -109 144 -81 160 -164 -25 358 -348 22 256 -410 71 382 -281 60 51 -161 25 -183 132 365 -337
3516 -337 185 291 -360 118 197 -379 242 98 -128 223 -179 51 204 -381 191 177 -306 191 22 -337 225
3537 225 7 -233 262 -176 38 198 -260 47 176 -405 371 29 -195 257 -179 -110 81 -285 23 255
$$ packed form
3393A27k44L35m97L94L12r73N86L57r11N41L95o65L64P0l25K72m13M83J01p78
3413d69O70O6r03P99K1o56O18J2l42K76k84L53K7m81O23j13q18J023j82o33P83
3434C90k22m55M18j87J85j36k43O00l86l72R20m85n09Q94l91l37N71k49J43j79
3454c0r6M17n22j73Q71n71j68P90o77j84O03m59O8J50j41L06m19R5N75p42J76
3475a31P70q99J78N22o41J63J53k79K91m58K19M66q29M43N56q70K30N58p36J85
3495a09K53k25K41l24J39L83p06L70K34o66M81L11o63L41rk12J86k08L15K33p02
3516c37N22J06o51M78P9n76O21j44k26L51m02K30J53n85N72j4m83M97j69l59N62
3537B25k18k40M95m38K14J60m58L07J29n81P76l42k24M52m36O9J91l66L08K32
$$ plain form
3557 255 -386 141 94 -296 211 18 -70 360 -101 44 219 -359 187 237 -200 221 150 -290 -37 -142 -53 264
3579 264 -110 80 239 -337 18 180 -291 220 232 -98 245 -177 -110 125 -292 309 273 -372 96 76 -432
3600 -432 49 220 -9 200 -221 -10 37 -469 279 165 -310 363 139 -385 83 -50 -128 201 103 109 -49 -438
3622 -438 90 65 -425 450 369 -462 54 -37 -283 128 7 244 114 -283 262 -86 -606 390 198 -139 316
3643 316 51 -328 55 -90 245 38 -217 353 -202 -410 303 37 -193 391 136 -56 -17 -242 219 -107
3663 -107 -106 431 -8 -451 294 -111 -298 218 -53 10 -56 -83 162 -53 -181 531 71 -275 363 -160 -173 220
3685 220 -43 -95 -95 -328 87 -316 -243 434 55 -110 423 -259 -117 231 -123 10 -63 -152 253 -113 -212 316
3707 316 -110 -145 331 -113 -141 135 -211 163 63 -215 264 -157 -110 314 -117 -43 281 -160 -15 25 -232 67
$$ packed form
3557B55o41N27m7l90N07j93q8M30m61J45J75n78N46N0m37M21p1m40K53j05Q9L17
3579B64l74J90J59n76L55J62m71N11J2l30L43m22O7K35m17O01l6o45M68k0n08
3600d32M81J71k29K09m21K11M7n06P48j14m75O73k24n24M68j33p8L29r8Oj58l89
3622d38N28k5m90Q75q1q31N16r1k46M11j21K37j30l97N45l48n20R96j92l37M55
3643C16k65l79L83j45L35k07k55N70n55k08P13k66k30N84k55j92L9k25M61l26
3663a07JN37m39m43P45m05j87N16k71O3o6k7K45k15j28P12m60l46O38n23j3L93
3685B20k63n2%k33M15m03P3O77l79j65N33o82J42L48l54J33p3q9M05l66r9N28
3707C16m26l5M76m44k8K76l46L74j00k78M79m21M7M24m31P4L24m41J45M0k57K99
$$ plain form
3729 67 -69 -119 246 -80 -198 229 -205 -140 302 -229 36 55 -166 321 -158 -112 418 -11 -161 352 -200 -244
3751 -244 168 -29 42 35 -112 124 -189 -206 318 -240 -175 328 -142 -139 156 -104 62 -142 -20 230 -291 -75
3773 -75 248 -266 1 434 -137 -169 74 28 9 9 248 209 -322 133 429 -404 55 355 -232 -81 180 -75
3795 -75 -140 -95 79 235 -340 159 189 -390 70 319 -500 -58 164 -232 23 -157 -43 -11 -274 263 213 -368
3817 -368 258 270 -293 213 224 -217 152 -117 94 48 -272 287 48 -301 287 129 -313 230 69 -143 236
3838 236 3 -69 -37 -215 60 -66 -350 218 -221 -330 253 -81 -192 18 -32 -81 151 -27 221 114 -34
3859 -34 347 -112 -61 453 -196 -106 260 -196 -70 176 -124 75 -34 -77 261 -41 -9 408 -226 36 391 -322
3881 -322 -118 104 -308 -46 -63 -247 28 -114 16 154 -395 127 233 -276 140 179 -227 149 5 -19 -67
$$ packed form
3729F7j36n0L65l26j18M27m34O5M42n31K65J9k21M87m79M6N30m29j50N13n52m4
3751b44M12j97P1pj47K36l13j7N24n58O5N03m70LK95k60J66k04J22K50n21K16
3773g5L23n14K67M33n71l2K43m6j9%K39l9n31M55K96q33M59L00n87J51K61k55
3795g5o5M5J74J56n75M99L0n79M60K49q19M42K22l96K55j80J14L2k63N37n0n81
3817c68O26J2n63N06J1m41L69k69K11m6l20N59k39l49N88j58m42N43j61k12L79
3838B36k33p2L2j78K75j26k84N68m39j09N83l34j11K10n0m9K32j78K48j07j48
3859c4L81m59N1N14o49R0L66m56J26K46l00J99j09m3L38l02L2M17o34K62L55p13
3881c22K04K22m12K62j7j84K75j42J30J38n49N22J06n09M16L9m06L76j44k4m8
$$ plain form
3902 -67 -268 150 122 -211 137 166 -288 193 139 -292 19 115 72 92 -32 199 42 -240 246 -102 -287 152
3924 152 94 -215 160 79 -192 98 2 -54 110 -105 208 -32 -130 304 -50 -346 225 -46 -133 101 47 67 -52
3947 -52 -61 241 -141 -257 303 -255 -137 124 -24 -185 220 -41 -109 -36 -20 228 -153 36 336 -240 -70 224
3969 224 -199 -108 108 -37 15 -9 -123 181 -164 -88 285 -273 -135 190 -116 -83 184 -237 70 2 -91 103
3991 103 -54 -4 208 -122 -1 226 -201 -48 149 -106 1 -56 -37 103 -207 -68 272 -201 -24 265 -272
4012 -272 157 193 60 196 -107 -24 198 -228 -21 174 -253 163 -34 -182 -16 -11 -223 194 -51 23 357 -115
4034 -115 -9 277 -80 25 99 -157 -23 -69 -130 116 -115 -52 257 -146 -1 128 -27 49 186 127 134 -107 -1
4057 -1 2 -244 18 254 -210 -6 91 -323 -74 -92 -55 107 21 203 141 -329 90 264 -247 201 267 -199 -71
$$ packed form
3902f7k01M18k8l33L48K9m54M81n4m31L11R6m3K0j24K31j57k82M86l48j85M39
3924A52n8l09L75q1k71K90r6n6J64k15L13k40r8M34l54k96N71k71q7K34n4K0j19
3947e2rL02l82j16N60n58J18K61j48j61M05k61o8P3J6K48l81J89L00n76J70K94
3969B24m23R1K16j45N2k4j14L04l45P6L73n58J38L25l06L3K67m21L07o8r3J94
3991A03j57N0K12l30J21K27m27J53J97k55J07n7J9J40l10J39L40m73J77K89n37
4012b72M29L6j33J36l03Q3K22m26K07J95m27M16j97j48J66Nk12M17k45P4L34m72
4034a15J06K86l57J05P4k56J34m6o1K46k31O3L09m03J45J29j55P6J37n9Pk41J06
4057aLk46K62K36m64K04R7m14K49j8L7J62q6J82o2m70M19J74n11M48O6m66J28
$$ plain form
4080 -71 8 -29 -56 -155 164 181 -354 233 209 -342 134 221 25 25 77 -56 -57 -122 172 152 -347 191 204 -406 170
4105 170 246 -144 55 144 41 -196 -104 114 -39 -417 174 59 -450 97 179 -257 -11 95 -13 88 -158
4126 -158 308 0 -407 336 144 -291 125 116 -237 72 78 -11 -150 -208 137 -65 -294 330 65 -373 195 108
4148 108 -201 55 88 123 20 -84 340 -60 -232 344 -13 -361 104 -64 -180 -7 -39 13 19 -139 332 19
4170 19 -208 291 -95 -169 193 33 -172 39 -76 -10 -111 -109 179 -139 -255 353 -38 -178 115 -14 -26 19
4192 19 -99 212 -53 -135 248 -10 -201 235 -78 -216 110 -87 -51 -58 -58 155 -58 -82 373 -60 -166 314 -49
4215 -49 -43 122 15 -31 -63 -87 178 -265 -221 243 31 -170 357 141 -165 73 5 64 -87 72 219 -247 -315
4238 -315 252 -109 -296 164 17 -58 152 52 102 -161 -110 319 -191 -110 363 -270 -170 170 -22 -6 106 69
$$ packed form
4080g1P9l7k7r9L19J7n35N87k4n51M76Q7j96%N2j33jo5K94k0m99N38J3o10N76
4105A70P6l90J99Q9j03k37R2K18j53l78N91j15n09N47Q2m36K46J06j08J01k46
4126a58M66l08m07P43j92m35M16rl53L09Oq9j39n8L45k02k29O24k65m38N68q7
4148A08l09K56L3L5j03j04M24m00j72N76l57l48M65j68j16J73l2N2Oj58M71l13
4170A9k27M99l86p4L62j60k05K11j15O6j01KK88l18j16O08l91j40K93j29j2M5
4192A9j18L11k65q2L83k58j91M36l13j38L26j97L6p%K13k13k4M55m33j06M80l63
4215d9OJ65j07m6l2k4K65m43M4M64k12k01N27k16l06K38o8N9j51J59J47m66o8
4238c15N67l61j87M60j47p5K10j00N0k63N1M29n10Q1M73o33J00L40j92J6J12l7
$$ plain form
4260 69 63 -229 98 208 -261 -57 332 -229 -138 310 -75 -106 139 122 61 -103 11 164 -297 -43 403 -206
4282 -206 -95 247 -54 13 111 162 71 -125 150 72 -382 99 215 -282 121 209 -152 -42 71 -13 163 -10
4304 -10 142 90 -58 36 122 -217 41 62 -286 49 -50 -152 -17 -123 -6 98 -223 89 40 -128 166 102 -144
4327 -144 93 -15 -202 209 -96 -37 114 -220 22 -36 -188 113 17 -128 129 -124 -24 199 -57 43 156
4348 156 -45 80 123 -19 64 -103 -89 205 -139 -26 180 -105 4 85 -112 168 28 -87 65 -113 54
4369 54 98 -139 13 174 -80 -17 76 -196 -75 -72 -112 -21 -193 -22 180 -161 167 170 -111 48 189 -177 95
4392 95 -7 23 125 -59 82 -7 -206 95 49 -185 169 -27 -253 30 63 -165 53 -11 119 68 -56 108
4414 108 20 -208 183 44 -186 51 58 -22 100 94 32 -54 -137 160 47 -146 119 0 -206 182 -94 -21 96
$$ packed form
4260F9ok92L27J10m69K04L89n61R1M48l85l1K45j7o1j64J14J53m61K54M46o09
4282b06J11L42l01O7R8N1r1j96K75p8m54M81J16m97M03Q8l61J10J13q4J76j73
4304a0J52n2j48R4Q6l39K58K1l48L35r9j02J35j06J17J04l21L12m9j68K94o4k46
4327a44K37j08j87M11l05N9J51l34K42n8j52L01r6j45K57k53J00K23k56J00J13
4348A56k01J25M3j42Q3j67J4K94l44J13K06k85J09Q1j97K80j40j15J52j78J67
4369E4M4k37J52J61k54O3R3k72J21Lm0R1j72J71K02l41L28Lk81J59J41l66K72
4392I5j02L0J02j84J41q9j99L01m6k34L54j96k26K83L3k28K18o4J30n1j24J64
4414A08q8k28L91j39k30K37Pq0J22oo2q6q3K97j13j93K65j19k06L88k76P3J17
$$ plain form
4437 96 -143 -83 -93 37 239 -21 -43 151 0 -210 220 -68 -2 17 -103 11 -137 -83 31 -25 -51 223 33
4460 33 52 246 -52 -18 40 -79 46 36 -19 74 -215 -138 64 -113 -43 210 -51 35 126 -34 121 39 -27 78
4484 78 -43 -93 117 -107 -35 103 -78 106 16 16 115 -103 -69 106 -208 -14 225 -158 88 51 -20 99 49 -33
4508 -33 96 -47 -68 48 -23 -84 36 -92 31 85 -87 137 -25 -71 239 -82 6 150 -90 -110 22 -216 -3
4531 -3 -73 -99 109 -85 -21 107 -54 -63 198 -178 9 167 -87 -2 -63 -66 -8 -128 84 173 -109 -70 217 -129 -12
4556 -12 226 -110 4 -13 -26 17 -186 -78 128 -205 127 203 -28 -71 115 -160 -34 -41 78 -27 -42 111 174
4579 174 -221 99 201 -134 43 184 -49 -63 7 62 -14 -223 151 108 -184 152 172 -249 -6 229 33 -64
4601 -64 9 118 -50 -211 194 99 -169 100 152 -218 -22 173 21 110 118 77 4 -232 229 13 -170 93 100 -109
$$ packed form
4437I6k39O0j0J30K02k60k2J94j51k10M30k88O6J9j20J14j48N4J14n6k6K74j90
4460C3J9J94k98L4N8j19J25j0n5R3k89P7K02j77P0K53k61Q6R1j60J55q2o6J05
4484G8j21n0K10k24P2J38j81J84r0%R9k18L4J75l14J94K39l83K46l7p1J19n0q2
4508c3J29j43k1J16p1o1J20j28J23N4j72K24j62m6L10l21Q8J44k40k0J32k38K13
4531cp0k6K08j94O4J28j61rK61l76J87J58k54Q5o1lN8j20K12Q9k82L9K87l46J17
4556a2K38l36J14j7j3M3k03J08K06l33L32P6k31m3J86k75J26pJ19j05j5J53O3
4579A74l95L20J02l35J77J41k33j4P0N5p6k09L74m3k92L36K0m21K43K35j96r7
4601f4P3J09j68j61M05r5k68K69N2l70J96J95j52Q9Qm1p3k36M61k16j83K63Pk09
$$ plain form
4625 -109 -31 -16 -56 -57 -96 21 -19 -213 111 78 -217 134 -6 -47 121 107 9 -105 25 116 34 -76 157 -12
4649 -12 -311 44 86 -189 -89 77 -35 31 -59 66 -10 -38 186 63 -183 172 21 -203 99 -2 7 8 -104
4672 -104 136 -52 -127 114 47 -103 129 24 -195 75 23 176 -88 -74 249 -81 -142 226 -110 -176 134 84
4694 84 -45 9 -57 124 -29 -43 272 60 -132 186 -54 -238 109 171 -52 -1 90 83 -49 -73 142 -42 -91 135
4718 135 46 -225 -81 8 -11 -86 50 77 -80 -21 212 -81 -162 266 31 -82 127 31 -139 -1 -31 40 -204
4741 -204 23 189 -92 -226 263 -28 -155 121 46 121 -30 60 85 -1 93 246 -59 -158 63 -5 -109 78 57
4764 57 -26 1 -31 85 -152 -22 307 -133 23 252 -157 -2 69 91 -44 117 84 30 -98 -20 -29 -116 71 222
4788 222 -52 -4 15 -37 -19 18 -91 87 -44 87 106 -97 68 235 -21 -22 89 2 -37 -89 -86 71 -94 20
$$ packed form
4625a09P8J5m0jl9J17m0j94L24l3k95L51j40m1J68j4r8j14J30R1q2j10K33j69
4649a2k99L55M2k75J00J66j12O6r0J25p6k8K24j23k46L55j51k24L02j01RJj12
4672a04K40j88p5K41o7j50K32j05k19K70n2J53k64J4L23l30o1L68l36o6L10n0
4694H4j29N4o6J81j53j4L15k12j92L18k40j84L47O2k23N1R1pj32k4K15j84m9K26
4718A35q9k71J44Q9j9p5J36K7j57N9K33k93q1M28k35j13K09r6j70J38l0P1k44
4741b04K27J66k81j34M89k91j27K76p5P5j51R0K5q6R4J53l05r9K21o8j04J87k1
4764E7q3K7l2J16k37J30L29m40J56K29m09J55P1K2j35J61l3n4j28P8rq7J87J51
4788B22k74M8J9n2J8L7j09J78j31J31J9k03J65J67k56jJ11q7l9n2LJ57j65J14
$$ plain form
4812 20 21 75 74 100 0 83 73 -105 62 -21 59 17 28 37 61 70 -88 125 -1 36 -142 -64 97 -165 -86 44 -30
4839 -30 19 61 19 111 31 -6 25 -148 -108 35 -143 49 122 -183 -71 134 -114 -9 59 -32 -50 -39 14 -6 -150
4864 -150 25 131 -112 -170 62 -16 18 -13 -61 7 -169 1 41 -41 -81 37 -197 -60 67 -89 161 71 22 17
4888 17 -42 124 47 -17 151 144 -132 27 12 -143 -7 -25 -60 27 -62 42 4 -77 94 52 -28 13 -14 -55 53 70
4914 70 39 -59 -37 26 31 -40 79 -26 -57 15 -56 2 -67 -81 67 16 -29 -9 -39 -132 45 -49 -101 155 -7 -41 55 -76
4942 -76 -3 1 2 12 -60 39 -19 100 -20 74 42 88 131 62 -160 -67 9 -25 -80 -96 77 45 -9 66 -45 3 -46 -136 1
4971 1 -48 -54 -7 -138 -80 107 126 -14 26 -110 -50 -16 -160 37 19 -47 3 11 101 83 7 -130 94 44 40 -17 -91 26
4999 26 -90 -24 7 -71 -103 111 -25 -40 29 -27 -59 20 -79 -19 -95 -71 113 -118 8 89 23 -108 56 -130 116
$$ packed form
4812B0JN4jK6j00Q3j0j78J67q3Q0m2J1RK4Rj58K13j26L7j78P8J61k62P9J30p4
4839c0M9M2m2R2q0l7L1j73M0J43j78J92P3l05J12K05k48J05O8r1j8J1N3k0j44
4864a50J75J06k43n8K32p8L4l1m8O8j76J70M0q2m0J18k34J37J27j56K50r0m9n
4888A7n9J66p7o4J68pk76J59j5j55J36j8l5Q7q9J04l8q1J71m2q0M1k7m1J08J7
4914G0l1r8K2O3Np1J19j05l1P2p1N8o9j4J48n1m5K0l0r3J77r4n2K56j62l4R6j31
4942g6P3MJJ0p2R9n8J19j20R4l2M6M3o9k22R3P6l4n5j6J73l2n4P5j11M8m9r0J37
4971Am9oM7j31N8J87J9j40M0j36O0L4j44J97j8o6N0QR0j8p6j37K24n0mn7p4J17
4999B6j16O6L1p8l2K14j36j5O9n6l2P9r9O0p6K4J84k31J26Q1o6j31J64j86K46
$$ plain form
5024 116 48 92 101 -137 11 31 20 5 95 16 83 2 -102 32 1 107 -78 55 -49 115 -109 -88 -13 12 -46
5049 -46 -14 67 -13 32 43 129 -67 15 126 -63 -64 190 -22 14 12 34 -33 58 76 45 -7 -44 75 -64 7 111 -79
5076 -79 -20 41 -63 76 -86 -63 -4 17 73 105 -82 -15 115 -46 15 61 63 63 -20 32 -3 -18 143 152 -134 15 64
5103 64 -62 -33 39 82 -117 -34 47 81 -133 72 42 0 91 68 15 -94 30 113 -40 -26 41 3 -134 -47 -17 25
5129 25 24 47 21 -34 101 19 -111 -23 164 46 -131 57 95 -115 21 -28 -99 -127 1 1 -50 -2 125 -82 -87 153
5155 153 63 -107 116 2 32 -6 -30 66 44 5 175 -38 -109 36 49 -107 -14 -42 -86 -88 -26 55 -45 -26 60 -43
5181 -43 -74 -86 21 -16 25 70 16 -186 -2 38 -72 59 43 85 -80 81 60 -34 32 97 -27 -33 6 157 -75 -41
5207 -41 59 -53 -176 79 -66 -118 -70 94 99 4 111 -58 -29 -62 183 -107 -70 51 32 -18 104 -86 -82 23
$$ packed form
5024A16o8M4Rk38J48K0j1j5R0p9O7q1j04J34l1J06j85J33j04J64k24K1P5K5n8
5049d6L2Q1q0M5J1Q6j96Q2J11j89jK54k12L6kK2o7R1J8l1n2l7J19j39P1J04j90
5076g9N9O1j04J39j62K3N9K1N6L2j87O7J30j61O1M6K%q3N2l5j5J61Rk86J49M9
5103F4j26K9P2M3j99Q3Q1L4k14K05l0m2R1k3n3j09J24Q3j53J4O7l8j37Q7L0M2
5129B5jK3k6n5J35q2j30Q8J87j18j77J88L8k10J36m9p1k8J28%n1M8J27k07nK40
5155A53r0j70K23j14L0l8k4R6k2l9J70k13p1J45J3j56R3k8m4kO2Q1j00J9Q6j03
5181d3l1j2J07l7M1M5n4k02J84M0j10J31j6M2j65J61k1r4O6O5j24oL9J51k32L4
5207d1J00j12j23K55j45n2M8J64Nr5J07j69K9l3K45k90L7J21j9n0J22j90MJ05
$$ plain form
5231 23 -75 43 -125 -94 -43 16 -99 80 -10 -69 -7 43 48 -53 118 0 -18 25 111 -52 -83 186 81 -76 78
5256 78 -80 -81 20 55 3 35 -16 144 22 30 40 -11 -45 27 -50 56 -33 -83 100 10 -52 46 -75 -55 -13 -86 1 -52
5284 -52 17 108 -95 15 56 -31 28 13 -1 51 14 -23 31 -33 12 38 -12 24 79 -45 77 -7 41 22 36 -14 -13 46 45
5313 45 -1 -67 -15 132 -28 -90 -12 -80 -51 45 -59 51 -92 -35 29 -13 -84 55 -101 32 102 -164 18 58 61 -35
$$ packed form
5231B3r8J18j68L1N1N9j15J79r0n9O2N0Nj01J71j18j8M3Q6j63l1K69j05j57J54
5256G8j58jJ01L5n2L2n1J60j22QJ0n1l4P2p7J06q9n0J83r0o2R8j21K0M2p3Q7n3
5284e2O9R1k03J10M1q7N9j5j4N2l7l7N4o4M5K6n0L6N5j24J22q4M8j9J4n0JN9j
5313D5m6o6N2J47j60o2P8o8K9R6j04J10j43N7O4m2p1J39j56J33P0k66J82M0Lr6
$$ [...]
8191e7
##END NTUPLES=NMR FID
##END=
