##TITLE=1H_DE-80H_X3
 200.13MHz, d2o
 8 sc
 
 19ns.26.2.2025
##JCAMPDX= 6.0         $$ Bruker NMR JCAMP-DX V2.0
##DATA TYPE= NMR FID
##DATA CLASS= NTUPLES
##ORIGIN= UXNMR, Bruker Analytische Messtechnik GmbH
##OWNER= pz
$$ XWIN-NMR		Version 3.5
$$ Fri Jul 11 10:28:02 2025 Russian Standard Time (UT+4h)  Yarkov@DPX200
##.OBSERVE FREQUENCY= 200.1313
##.OBSERVE NUCLEUS= ^1H
##.DELAY= (6, 6)
##.ACQUISITION MODE= SIMULTANEOUS
##.ACQUISITION SCHEME= undefined
##.AVERAGES= 8
##.DIGITISER RES= 18
##SPECTROMETER/DATA SYSTEM= spect
##.PULSE SEQUENCE= zg30
##.SOLVENT NAME= CDCl3
##.SHIFT REFERENCE= (INTERNAL, CDCl3, 0, 14.3821)
##AUDIT TRAIL= $$ (NUMBER, WHEN, WHO, WHERE, WHAT)
$$ ##TITLE= Audit trail, XWIN-NMR		Version 3.5
$$ ##JCAMPDX= 5.01
$$ ##ORIGIN= Bruker BioSpin GmbH
$$ ##OWNER= Yarkov
$$ C:/Bruker/XWIN-NMR/data/yarkov2/nmr/H-C/1/audita.txt
$$ ##AUDIT TRAIL=  $$ (NUMBER, WHEN, WHO, WHERE, WHAT)
(   1,<2025-07-11 10:27:12.46 +0400>,<Yarkov>,<DPX200>,
      <created by zg, POWCHK disabled, PULCHK disabled
       configuration hash MD5:
       00 E9 B6 7A A2 85 ED C7 34 08 36 98 17 FE 4E 26
       data hash MD5: 16K
       31 1B C5 B8 41 B2 F7 1C 12 50 84 40 02 62 C2 31>)
$$ ##END=
$$ 
$$ hash MD5
$$ C8 74 CB C0 96 91 89 59 4E 3C DB D9 74 E9 72 89
##$RELAX= 
##$RELAX= 
##$RELAX= 
##$RELAX= 
##$RELAX= 
##$RELAX= 
$$ Bruker specific parameters
$$ --------------------------
##$DU= <C:/Bruker/XWIN-NMR>
##$EXPNO= 1
##$NAME= <H-C>
##$PROCNO= 1
##$TYPE= <nmr>
##$USER= <yarkov2>
##$AMP= (0..31)
100 100 100 100 100 100 100 100 100 100 100 100 100 100 100 100 100 100 
100 100 100 100 100 100 100 100 100 100 100 100 100 100 
##$AQSEQ= 0
##$AQ_mod= 1
##$AUNM= <au_zg>
##$AUTOPOS= <>
##$BF1= 200.13
##$BF2= 200.13
##$BF3= 200.13
##$BF4= 200.13
##$BF5= 200.13
##$BF6= 200.13
##$BF7= 200.13
##$BF8= 200.13
##$BYTORDA= 1
##$CFDGTYP= 0
##$CFRGTYP= 5
##$CHEMSTR= <none>
##$CNST= (0..31)
1 1 145 1 1 1 1 1 1 1 1 1 1 1 1 1 1 1 1 1 1 1 1 1 1 1 1 1 1 1 1 1 
##$CPDPRG= <>
##$CPDPRG1= <>
##$CPDPRG2= <>
##$CPDPRG3= <>
##$CPDPRG4= <mlev>
##$CPDPRG5= <mlev>
##$CPDPRG6= <mlev>
##$CPDPRG7= <mlev>
##$CPDPRG8= <mlev>
##$CPDPRGB= <>
##$CPDPRGT= <>
##$D= (0..31)
0 0.7 0 0 0 0 0 0 0 0 0 0.03 0 0 0 0 0 0 0 0 0 0 0 0 0 0 0 0 0 0 0 0 
##$DATE= 1752215231
##$DBL= (0..7)
120 120 120 120 120 120 120 120 
##$DBP= (0..7)
150 150 150 150 150 150 150 150 
##$DBP07= 0
##$DBPNAM0= <>
##$DBPNAM1= <>
##$DBPNAM2= <>
##$DBPNAM3= <>
##$DBPNAM4= <>
##$DBPNAM5= <>
##$DBPNAM6= <>
##$DBPNAM7= <>
##$DBPOAL= (0..7)
0.5 0.5 0.5 0.5 0.5 0.5 0.5 0.5 
##$DBPOFFS= (0..7)
0 0 0 0 0 0 0 0 
##$DE= 6
##$DECBNUC= <off>
##$DECIM= 32
##$DECNUC= <off>
##$DECSTAT= 4
##$DIGMOD= 1
##$DIGTYP= 9
##$DL= (0..7)
0 120 120 120 120 120 120 120 
##$DP= (0..7)
150 150 150 150 150 150 150 150 
##$DP07= 0
##$DPNAME0= <>
##$DPNAME1= <>
##$DPNAME2= <>
##$DPNAME3= <>
##$DPNAME4= <>
##$DPNAME5= <>
##$DPNAME6= <>
##$DPNAME7= <>
##$DPOAL= (0..7)
0.5 0.5 0.5 0.5 0.5 0.5 0.5 0.5 
##$DPOFFS= (0..7)
0 0 0 0 0 0 0 0 
##$DQDMODE= 0
##$DR= 18
##$DS= 0
$$ [...]
##$SUBNAM2= <"">
##$SUBNAM3= <"">
##$SUBNAM4= <"">
##$SUBNAM5= <"">
##$SUBNAM6= <"">
##$SUBNAM7= <"">
##$SUBNAM8= <"">
##$SUBNAM9= <"">
##$SW= 18.0517328524113
##$SWIBOX= (0..15)
0 0 2 0 0 0 0 0 0 0 0 0 0 0 0 0 
##$SW_h= 3612.71676300578
##$TD= 16384
##$TD0= 1
##$TE= 0
##$TE2= 300
##$TE3= 300
##$TEG= 300
##$TL= (0..7)
0 120 120 120 120 120 120 120 
##$TP= (0..7)
150 150 150 150 150 150 150 150 
##$TP07= 0
##$TPNAME0= <>
##$TPNAME1= <>
##$TPNAME2= <>
##$TPNAME3= <>
##$TPNAME4= <>
##$TPNAME5= <>
##$TPNAME6= <>
##$TPNAME7= <>
##$TPOAL= (0..7)
0.5 0.5 0.5 0.5 0.5 0.5 0.5 0.5 
##$TPOFFS= (0..7)
0 0 0 0 0 0 0 0 
##$TUNHIN= 0
##$TUNHOUT= 0
##$TUNXOUT= 0
##$USERA1= <user>
##$USERA2= <user>
##$USERA3= <user>
##$USERA4= <user>
##$USERA5= <user>
##$V9= 5
##$VALIST= <valist>
##$VCLIST= <CCCCCCCCCCCCCCC>
##$VD= 0
##$VDLIST= <DDDDDDDDDDDDDDD>
##$VPLIST= <PPPPPPPPPPPPPPP>
##$VTLIST= <TTTTTTTTTTTTTTT>
##$WBST= 1024
##$WBSW= 4
##$XGAIN= (0..3)
0 0 0 0 
##$XL= 0
##$YL= 0
##$YMAX_a= 138648
##$YMIN_a= -110826
##$ZGOPTNS= <>
##$ZL1= 120
##$ZL2= 120
##$ZL3= 120
##$ZL4= 120
##$ABSF1= 10
##$ABSF2= 0
##$ABSG= 5
##$ABSL= 3
##$ALPHA= 0
##$AQORDER= 0
##$ASSFAC= 0
##$ASSFACI= 0
##$ASSFACX= 0
##$ASSWID= 0
##$AUNMP= <proc_1d>
##$AZFE= 0.1
##$AZFW= 0.1
##$BCFW= 1
##$BC_mod= 2
##$BYTORDP= 1
##$COROFFS= 0
##$CY= 83.5205535888672
##$DATMOD= 1
##$DC= 2
##$DFILT= <>
##$DTYPP= 0
##$F1P= 10.8118882576601
##$F2P= -7.23987719738617
##$FCOR= 0.5
##$FTSIZE= 0
##$FT_mod= 4
##$GAMMA= 1
##$GB= 0.15
##$INTBC= 1
##$INTSCL= 1
##$ISEN= 128
##$LB= 0.25
##$LEV0= 0
##$LPBIN= 0
##$MAXI= 10000
##$MC2= 0
##$MEAN= 0
##$ME_mod= 0
##$MI= 1.114404
##$NCOEF= 0
##$NC_proc= 0
##$NLEV= 6
##$NOISF1= 3.799351
##$NOISF2= 2.8
##$NSP= 1
##$NTH_PI= 0
##$NZP= 0
##$OFFSET= 14.38212
##$PC= 1
##$PHC0= -1356.506
##$PHC1= 5.990923
##$PH_mod= 1
##$PKNL= yes
##$PPARMOD= 0
##$PSCAL= 0
##$PSIGN= 0
##$REVERSE= no
##$SF= 200.129724274929
##$SI= 16384
##$SIGF1= 3
##$SIGF2= 2
##$SINO= 400
##$SIOLD= 16384
##$SREGLST= <1H.CDCl3>
##$SSB= 0
##$STSI= 0
##$STSR= 0
##$SW_p= 3205.1282051282
##$SYMM= 0
##$S_DEV= 0
##$TDeff= 0
##$TDoff= 0
##$TI= <>
##$TILT= no
##$TM1= 0
##$TM2= 0
##$TOPLEV= 0
##$USERP1= <user>
##$USERP2= <user>
##$USERP3= <user>
##$USERP4= <user>
##$USERP5= <user>
##$WDW= 1
##$XDIM= 8192
##$YMAX_p= 0
##$YMIN_p= 0
$$ End of Bruker specific parameters
$$ ---------------------------------
##NTUPLES= NMR FID
##VAR_NAME=  TIME,          FID/REAL,        FID/IMAG
##SYMBOL=    X,             R,               I
##VAR_TYPE=  INDEPENDENT,   DEPENDENT,       DEPENDENT
##VAR_FORM=  AFFN,          ASDF,            ASDF
##VAR_DIM=   8192,          8192,            8192
##UNITS=     SECONDS,       ARBITRARY UNITS, ARBITRARY UNITS
##FACTOR=    0.0002768,     1,               1
##FIRST=     0,             0,               0
##LAST=      2.2672688,     0,               0
##MIN=       0,             -110826,         0
##MAX=       2.2672688,     138648,          0
$$ Real data points
##PAGE= N=1
##DATA TABLE= (X++(R..R)), XYDATA
0@%%%%%%%%%%%%%%%%%%%%%%%%%%%%%%%%%%jKkKj%JkKlMnPqRj0J0rRj0J0j0Qln
59eJ8l7O6j11J84l08N31r72J984n070K9272J13096j33647m5719R9901n9508q0368
76h0693M3739O4210l0713j8205R3983l7580j39575R1128P7350j12691K3597Q9059
88F3609n6104l9836L7769J8507m2867l044R3440m2430j30894P8869O3964r7038
100e6055K4911Q5063k5412l2118j456k129k6961N971R0195j0096p2181P2101N974
113E7807j13170K0841M9265k8888J0942K8154l766l9896j6593N8978k0657o2393
125e9376P2549K9189o5423J3351J7671p950J8581j1312n148m565k2942K7682j0152
138g845l6214N9101J6188n0740P773j176j2106J1813r39L2916J2575k7937L5245
$$ plain form
0 0 0 0 0 0 0 0 0 0 0 0 0 0 0 0 0 0 0 0 0 0 0 0 0 0 0 0 0 0 0 0 0 0 0 0 -1 1 -1 1 0 0 1 -1 1 -2 2 -3 4 -4 5 -5 5 -4 5 -5 5 -5 3 0 -5
59 -5 13 -24 42 -69 115 -193 338 -634 1350 -3720 25552 138648 5001 -40718 59183 -325 -80693
76 -80693 -36954 27256 -3457 -21662 72321 34741 -104834 -13706 63644 -49047 -25450 63609
88 63609 7505 -32331 5438 23945 -18922 -21966 71474 29044 -101850 -22981 40983 -56055
100 -56055 -31144 53919 28507 -3611 -5067 -7196 -34157 -28186 62009 51913 -20268 51833 57807
113 57807 -55363 -34522 14743 -14145 -3203 24951 21185 -18711 -35304 23674 3017 -59376
125 -59376 13173 42362 -23061 -9710 7961 11 18592 7280 2132 -2433 -25375 2307 -7845
138 -7845 -44059 15042 31230 -19510 -11737 -12913 -25019 -13206 -14145 18771 31346 3409 38654
151C8654n055o3070K4921K4599k1757N068k960J1234P350l7338J0573J1610k7783
164b3954L0400M693l7827L3280J7129k5490J403k531R566o596l2268L6140J2525
177A6470m0929L9668J7866n2462O054J4972j4314o220l884L1276P760l2345K8009
190A1921K234m0593L5847P563l8391L2005K0401k1553o782j782J4428j7888l1425
203c4015M1252J826m0486M1326J3928l7162J4207O695j1433j463q253K0353L142
216I917j8939K9704p583l2371L2327q408l4881K7947R921j2055J656j404J6105
229A1936j3426k5748L4439j649k7248L4932M614j9536J6238r192q329M098j6132
242a5003J0558K605j1669K6419q431j7196L0816j3114k1310K3084l611k734O018
$$ plain form
151 38654 33599 -29471 -4550 20049 -1708 3360 400 11634 18984 -18354 -7781 3829 -23954
164 -23954 6446 11139 -26688 6592 23721 -1769 -366 -2897 6669 73 -32195 3945 16470
177 16470 -24459 15209 33075 -19387 -13333 1639 -12675 -18895 -22779 8497 16257 -16088 11921
190 11921 14155 -26438 9409 16972 -21419 10586 30987 9434 2652 870 15298 -2590 -34015
203 -34015 7237 9063 -31423 9903 23831 -13331 876 7571 -3862 -5325 -13578 6775 9917
216 9917 -9022 20682 13099 -19272 13055 4647 -30234 -2287 7634 -4421 -2765 -4169 11936
229 11936 -1490 -27238 7201 5552 -21696 13236 17850 -1686 14552 5360 -2969 1129 -15003
242 -15003 -4445 -1840 -13509 12910 4479 -12717 18099 4985 -16325 6759 3148 414 6432
255F432r826J6641o662k5642K1844m081j7934K2599l555j246J8076j6876K067
268A837Q717k0642P639J061j0837K1735q286j0616K4218j3813j1546J3673j0643
281g503N689M293j3885K0436n84k0491J7450m027r702J4902r569N985J5759j9070
295c17N985O451k0463O410n434j0574J9976r709m828K3574j0166j575J0340j2555
309b885J1117P58j6720J8926k294j7544J2358r438n484J0432j5430R332J5541
322H669j5436J1289O829j2295J0492r625q634J7717j3408m497J7511j0519K791
335H84M842j2779J4006j979j5446J8564l058j0732J1955j0875o42Q369j6868Q504
349e255J0432j1912J2332J426o750J4904j3789q229J7811j4697n982J1900q049
$$ plain form
255 6432 -3394 13247 6585 -19057 2787 -1294 -19228 3371 -184 -1430 16646 -230 1837
268 1837 10554 -10088 -2449 -1388 -12225 9510 1224 -9392 14826 1013 -10533 3140 -7503
281 -7503 -1814 2479 -11406 9030 8446 -12045 5405 1378 -8324 6578 -2991 2994 18753 -317
295 -317 5668 12119 -8344 -1934 -7368 -17942 2034 -7675 -12503 11071 905 -670 9670 -2885
309 -2885 8232 8990 -7730 11196 8902 -8642 3716 -5722 -11206 -774 -16204 -6872 8669
322 8669 -6767 4522 11351 -944 9548 -77 -8711 9006 -4402 -8899 8612 -1907 884
335 884 5726 -7053 6953 4974 -10472 8092 5034 -5698 6257 -4618 -5260 3109 -13759 -5255
349 -5255 5177 -6735 5597 7023 273 15177 1388 -6841 10970 -3727 -9709 2191 -5858
362e858N748m50r633J6627n965j0941J9517p627n648J4818j2783L0Q935j5061
376h291M767M239o925J0865p077P8J9506j8971n414K1301j4778p267R256n787
390d498N040l543m858J4828r726k795J7661j4795O47J8403j6220p07J1080j2440
404a923o75n6j394O045j3696P136J8532k3781J32K3228j4628l909R075n824M231
419B493m162m021R064r818M729J1942k0600O465J6375j9028L031J2035r405K469
433A569j650j435L999j4156R385J5517k1163M048J6585j3287J266L029m776J2419
447A1350m574p210O237j0578L309O995j7359R038J1886j5665K164O62n072J1219
461B402m333O41J1637j4441P69J1342j5972J179J1878j782K512j1898l406J6066
$$ plain form
362 -5858 -110 -560 -10193 6434 469 -10472 9045 1418 -4230 10588 -2195 -2165 6770 -8291
376 -8291 -3524 715 -6210 4655 -2422 -2344 17162 -1809 -7223 14078 -700 -7967 1289 -4498
390 -4498 542 -3001 -7859 6969 -2757 -5552 12109 -2686 -2039 16364 144 -563 10517 -1923
404 -1923 -2598 -2654 -4048 1997 -11699 -4563 13969 -9812 -9680 13548 -1080 -4989 4086 -1738 2493
419 2493 -1669 -5690 3374 -6444 -1715 10227 -10373 -3908 12467 -6561 -3530 8505 -900 1569
433 1569 -81 -1516 2483 -11673 -2288 13229 -7934 -3886 12699 -588 678 3707 -1069 11350
447 11350 6776 -434 5803 -4775 -1466 5529 -11830 -2792 9094 -6571 -4407 -3745 -8817 2402
461 2402 -1931 -1290 10347 -4094 -3325 8017 -7955 -6776 5102 3320 5832 -6066 -9472 6594
475F594j2618m397J7796q488N0Q945j6457j85J2104J843K769q625N748J0986k3892
490g827M86K2649j5999k53J9179j6009j4615N169P484n74j3496J4908J8212k7099
504g785k218J9094j9001M221K4634j4462j1678J0510L850j4743j4838K4725J3757
517A6066l1996Q496K1546l1045j50L1417j0502j2216J5350R900j8094j9675K3626
530B723J2337k6151J6859J7408l4471L032K3895k2015r267K6213J1805k1765j6505
543a5902K4253M41l2393K2910K1869l1022N944K2017k3368j1665J9761J1146j3714
556B77j0793J9973m289k8345K1335J2102k7757J6993K0544k8629j0868J9908P998
569H449j4074m531K6844l147k9687J6498P333k5248J6917J8914j8408l696J0124
$$ plain form
475 6594 -6024 -10421 7375 -1113 -1063 7882 -8575 -8760 3344 5187 7956 -669 5079 16065 -7827
490 -7827 -7341 15308 -691 -944 18235 2226 -12389 -7220 264 -310 -13806 1102 19314 -7785
504 -7785 -10003 9091 -9910 -5689 18945 4483 -7195 3315 7165 -7578 -22416 2309 16066
517 16066 -15930 -7434 14112 -16933 -17083 14334 3832 -8384 6966 16866 -1228 -20903 2723
530 2723 15060 -11091 5768 23176 -11295 -8263 15632 -6383 -15650 10563 22368 603 -15902
543 -15902 8351 8792 -23601 -691 21178 -9844 -3900 18117 -5251 -16916 2845 13991 277
556 277 -10516 9457 5168 -23177 -1842 10260 -17497 -504 20040 -8589 -19457 451 8449
569 8449 -5625 -10156 16688 13541 -16146 352 7685 -17563 -646 18268 -140 -3836 6288
582F288j5j1603m715J9791r52j7472J7322n53k5008J6090J3330j6909l94J0342
596E542L092j1234j0839J8098M355j6464J2724K172j8624P935L871r130N436M721
610A655N047m309j2845J0562J398j3436J5408N513j4182Q100K959r056k327M65
624e048J2712q92j6446J3244O266j8097O825P000p713M600R1k957j441m569J1486
639E061N44j4239J4378L656j9839P902P478r604L919O480J209p726q575J4463
653E107k124j9071J7437R843j7562N053N856q367Q05K629M179l076n376J3764
667I097m486j6983J7369L721j9084R541P159j1197r89N369N857o758o311J7012
681I317m615j8784J6099M768j4922R589M919p569Q12M53J754m664l052J5089n623
$$ plain form
582 6288 6273 -5330 -10045 9746 8794 -8678 8644 8091 -16917 -827 12503 -4406 -4800 5542
596 5542 8634 -2600 -13439 4659 9014 -7450 5274 7446 -11178 -3243 628 -8502 -3066 1655
610 1655 6702 2393 -10452 110 1508 -11928 3480 8993 -5189 2911 5870 -3186 -5513 -5048
624 -5048 7664 6772 -9674 3570 9836 -8261 -1436 5564 -2149 2451 2542 -415 -1856 -6425 5061
639 5061 5605 -8634 5744 9400 -10439 -2537 4941 -4663 -744 5736 6945 -781 -9356 5107
653 5107 2983 -16088 1349 11192 -6370 -1317 4539 -3828 -3023 -394 3785 709 -4667 9097
667 9097 4611 -12372 4997 8718 -10366 -825 6334 -4863 -5852 -483 5374 -1384 -7695 9317
681 9317 4702 -14082 2017 6785 -8137 1452 6371 -1198 -386 67 1821 -2843 -5895 9194 3571
696C571j2712J7499j475j6740J0264M238p494P36K132N743n335o496J3727m022
710C636j2378J3014r29j0223Q869q91m393L640j942K152l302m089J1841n534q190
725h719J5537k825j0194Q380j019l565J126k503P015j466o509J0831k814p779
739d504R717m229m314Q347m903p28L889m862L586k565n084J0253m887o263J1922
754E375l207m921O086l797R54L80o312P365o72o890Q667k440m534P510n825j111
770c372O748o182K080L549m796N433k927n034R013n010m555R155l858p02L964
785C506n507M122P7p846P226o05n717P204l249j372O421p279J506N509p125L808
801F79J665m517O758l573m502Q298n431l073O354m680K307K272o343O853m49p638
$$ plain form
696 3571 -9141 8358 6883 -9857 407 4645 -2849 -2113 19 5762 427 -6069 7658 3636
710 3636 -8742 4272 3343 -6880 1989 1098 -3295 345 -1597 555 -2747 -6836 5005 -529 -8719
725 -8719 6818 3993 -6201 2179 1160 -2405 -1279 -3782 3233 1767 -4742 6089 3275 -4504
739 -4504 5213 984 -3330 5017 114 -614 3275 -1587 1999 -566 -5650 4603 -284 -6547 5375
754 5375 2168 -2753 3333 -464 490 870 -5442 1923 1251 -5639 3028 588 -3946 3564 -2261 -3372
770 -3372 3376 -2806 -726 2823 -1973 3460 533 -4501 4512 -498 -5053 4102 244 -458 3506
785 3506 -2001 2121 2198 -5648 1578 973 -4744 2460 -789 -2161 4260 -3019 -1513 3996 -3129 679
801 679 2344 -2173 4585 1012 -3490 4808 -623 -3696 2658 -2022 285 2557 -3786 3067 2618 -5020
817e020P238j493m110O285m613P42N398p734K661L162o377M774j010l860Q157
832D200m755l662Q313n316j791M596m588L824Q75n512P668j643n633P521l926
847A71k094O335o589J588N743p130K020J738m082M653m223j816Q978p008j893
862c609Q520o507m05M545n552L322K46l804O101l369j915O422p112J327O636r261
878d415K823O807p218J437J823j565L434o005R00P508q313J239O717p958K781
893eM002p321L426Q61l267M138l497Q61M324p897M141M289j0576N373N779p754
909c123K588J134j427L826n878J275O052o734L009K780p523O639J037p637O008
924B026k90l809M798m361O34M029n750M574J351p897O029O32n658N500k872o69
$$ plain form
817 -5020 2218 725 -3385 2900 -1713 -971 4427 -3307 -646 2516 -3861 913 -97 -3957 4200
832 4200 -555 -4217 4096 -1220 -3011 1585 -3003 821 1696 -3816 3852 2209 -3424 4097 171
847 171 -1923 4412 -2177 -589 5154 -1976 44 1782 -2300 2353 -1870 -3686 5292 -1716 -3609
862 -3609 4911 -1596 -2001 2544 -3008 314 560 -3244 2857 -512 -2427 3995 -3117 -1790 4846 -4415
878 -4415 -1592 5215 -2003 -566 1257 -308 3126 -2879 -1979 5529 -2784 -1545 5172 -2786 -5
893 -5 3997 -3324 102 963 -2304 1834 -1663 -802 3522 -4375 -234 4055 -6521 -1148 4631 -3123
909 -3123 -535 599 -828 2998 -2880 -1605 4447 -2287 722 3502 -4021 2618 3655 -3982 2026
924 2026 1736 -2073 2725 -1636 -1002 3027 -2723 1851 3202 -4695 1334 1966 -3692 1808 -1064 -1733
940a733O998p527j984O735l969J055M15k911O465l615m636P155m890q51Q697p462
956b058p25O862n180L68K011j579L521l332L41M657j0384K917J1390j1524k039
971d754J0741m731l702J005J303K829m418L232M297j2004M756R425j4543J607
985d957J3208p683m085M375J20k729l387Q662J928j4499Q908R814j8652J171J4724
1000F918o820l268N354j76l525k747P928l64j1193J2945O229k0642M286J3063
1014G988j1110j790R616J63o064k400Q899l675j2392J5774P165j9037M888R954
1028G979j2417p96P939o19k770N56O243p446j1022J6033L492j7269J0221R101
1042I225j4332j215O488j064j643J861Q329n148j1328J1589J600j3571J0431P076
$$ plain form
940 -1733 5265 -2262 -4246 2489 -1480 -425 -10 -2921 3544 -71 -4707 2448 -2442 -3293 5404 -2058
956 -2058 -2783 4079 -1101 -733 1278 -301 3220 -112 229 4886 -5498 -2581 8809 -2715 -4754
971 -4754 5987 1256 -2446 -1441 -138 2691 -1727 1505 5802 -6202 -1446 7979 -6564 -4957
985 -4957 8251 568 -3517 858 978 -1751 -5138 3524 5452 -9047 -139 9675 -8977 -7806 6918
1000 6918 98 -3170 2184 2008 -1517 -4264 3664 3300 -7893 5052 11281 -9361 -5075 7988
1014 7988 -3122 -4912 4704 4867 -1197 -3597 5302 1627 -10765 5009 12174 -6863 -1975 7979
1028 7979 -4438 -5234 2705 2086 -684 -128 6115 -1331 -12353 3680 7172 -10097 124 9225
1042 9225 -5107 -6322 166 -898 -2541 -680 7649 2501 -8827 2762 4362 -9209 1222 8298
1056H298r668J660R50m439l22J896P712k847q106J1157j416j4712Q605O862o074
1071d44K748L92k130j924m145O734Q55o489R770J27j1982M223J789l556M974J88
1087A130O32m10n821M958o22p284J1432L927j0547K503J542l284J26j551O638
1102C369J518q579N805L49j0708P929N203o504L205J292j994k072l555O657N24
1117B439o991R969j38j3355P265N155q620K018N087R74m431m858P947j261q894
1132g694J1283K448j1778O999L279q821J779M169J304l149k403P810m636r082
1146h492J2745M46j2134R278M668r542l23L850J897l982k334R656l701r216J1128
1161C944q60j0308R170K494p513K183K169k48l749j199R034m691p202J2245k032
$$ plain form
1056 8298 -1370 290 1240 -3199 -3521 -1625 6087 3240 -4866 6291 4875 -9837 -1232 5630 -444
1071 -444 2304 2696 566 -1358 -5503 1231 2086 -4403 5367 5494 -6488 -2265 -476 -4032 942 1130
1087 1130 1762 1352 -4469 489 -133 -7417 4015 7942 -2605 -102 1440 -1844 -1718 -3269 3369
1102 3369 4887 -3692 2113 2462 -8246 -317 4886 -1618 1587 2879 885 -1187 -4742 1915 2439
1117 2439 -4552 5417 5279 -8076 -811 4344 -4276 -2258 2829 3803 -628 -5486 2461 1200 -7694
1132 -7694 3589 6037 -5741 1258 4537 -4284 -2505 1664 2968 -181 -2584 5226 590 -8492
1146 -8492 4253 4699 -7435 1843 6511 -3031 -3354 496 2393 -1589 -3923 5733 2032 -7184 3944
1161 3944 3084 -7224 1946 4440 -3073 -890 1279 1031 -2718 -3917 5117 426 -6776 5469 3437
1176C437j0555Q493K397o057J610J489J882l355l244P954l280o185J0316k292
1190B610p366P816o82n196K805O33J139k903j953P658m922n850J0331k101o687
1205d668O971k77l357J325j430K910j769l432O962l408m786Q169l312m024P038
1220B912k109k154K237j686K599k512k897P693l750m825Q142k601l710M967j838
1235D68L55J041l394L919j574m010N984l020l300O795l857k170N145k871K26J341
1251A078k309L772k684l429O762l638l610O362k960j278L190l198K374P33l838
1266b673M525j266l395N362l539j661N545m197k32L948l351K061J49k882N009
1281C403k736l290O158l455k602M525l258O95J947l929L849L14m236M976j766
$$ plain form
1176 3437 -7118 1375 3772 -2285 -675 814 2696 -659 -3903 4051 771 -5414 4902 2610
1190 2610 -4756 3060 2378 -2818 -13 620 1759 -1144 -3097 4561 -361 -6211 4120 2019 -4668
1205 -4668 2303 2026 -1331 -6 -1436 1474 -295 -3727 3235 -173 -4959 3210 -102 -4126 2912
1220 2912 803 -1351 886 -800 1799 -713 -3610 4083 333 -4492 3650 1049 -2661 2306 468
1235 468 823 1864 -1530 2389 815 -3195 2789 -231 -3531 3264 -593 -2763 2382 -489 -263 1078
1251 1078 -1231 2541 -143 -3572 3190 -448 -4058 2304 -656 -1934 1256 -1942 432 1165 -2673
1266 -2673 1852 586 -2809 2553 -986 -2647 2898 -1299 -1531 2417 -934 1127 1276 -1606 3403
1281 3403 667 -2623 3535 80 -2522 2003 -1255 -560 1387 -2542 1307 1621 -2615 2361 595
1296E95k487M829m018o47M366m491Q13K310l536L254j080k745N547l088k678N778
1312B722l317j157L326l420K109P94l641M211n54k760M502k962j125M807m790
1327a255J5L931m303J118J238k663L342k002j714N351l993r26N175m358N00K954
1343B410m200K519P57l849L347j154j084L265m214J262M130n901J496L840m553
1358a929J959R98k343L147k105m98L607m367J158L376n300K474K358n522L550
1373E63R70m036K602o82m2J883l986K929K788n993L058K352m850L535K61l275
1389a923L604j461q68K211l194K011J024m522M353J83m753N183k85l890L724r72
1405D25m40J859l354K537J209m228L205q50l183N138k604k996N559k459j676K886
$$ plain form
1296 595 -1892 2937 -1081 -1728 2638 -1853 -1040 1270 -2266 988 -92 -2837 2710 -378 -3056 2722
1312 2722 -595 -1752 1574 -1846 263 1057 -2584 1627 1073 -1687 2815 -147 -1272 3535 -1255
1327 -1255 -1240 2691 -1612 -494 744 -1919 1423 -579 -2293 3058 -935 -1861 3314 -1044 -544 2410
1343 2410 -1790 729 1486 -2363 984 -170 -1254 2011 -2203 -941 3189 -2712 -1216 2624 -1929
1358 -1929 30 1028 -1315 1832 -273 -771 2836 -1531 -373 3003 -2297 177 2535 -2987 563
1373 563 1533 -2503 99 -583 -625 1258 -2728 201 2989 -3004 54 2406 -2444 1091 1352 -1923
1389 -1923 1681 220 -648 1563 -1631 380 1404 -3118 1235 1418 -3335 1848 1563 -2327 1397 425
1405 425 -15 1844 -1510 1027 2236 -1992 1213 363 -2820 2318 -286 -3282 2277 -182 -1858 1028
1421A028k168J266L82k441L654k058k346N674l299j929N322l456q06L380l500
1436a297N62K084j499J275k700L18M325o158j71P160m719q19N131l692o40J857
1452A017r89Q30k033J459L066o657J597N359o893J594O113n499r04L822r91j533
1468f42j630M098K122p587K817M777q144K376O140n542L96L998k711k522q88L899
1484I57M07n670N666K814r687L643N508p429J596O129j613l105q06L544r59n509
1500d514O444K466q224M500L013q056K772N331k495j300O20K074k726n186O876
1515A595J512o993O234K420q631J678L350j964K77O87L021j620n490M030k56n430
1531e580O713J842o111L336J403l411K90P35L456m82m231M406p43o217N307J739
$$ plain form
1421 1028 -1140 126 508 -1933 1721 -337 -2683 2991 -308 -2237 3085 -371 -1177 2203 -1297
1436 -1297 -735 1349 -150 1125 -1575 -1257 3068 -3090 -3261 3899 -820 -1639 3492 -200 -840 1017
1452 1017 28 858 -1175 284 3350 -3307 -1710 3649 -3244 -1650 4463 -1036 -1940 1882 891 -642
1468 -642 -2272 1826 3948 -3639 -822 3955 -4189 -1813 4327 -1215 -819 3179 468 -2054 -2942 957
1484 957 1364 -4306 1360 4174 -5513 -1870 3638 -3791 -2195 3934 2321 -784 -1590 1954 995 -4514
1500 -4514 1930 4396 -3828 672 3685 -4371 -1599 3732 1237 -63 557 2631 -95 -5281 1595
1515 1595 3107 -3886 2348 4768 -3863 -2185 1165 -799 -522 165 3186 1566 -3924 106 -150 -5580
1531 -5580 1133 2975 -3136 200 1603 -1808 -1518 -783 2673 2191 -2040 2366 1623 -4594 713 2452
1547B452m015K927J92k007J9k190L013J798l265L681l28n243L206j91k823L678
1563I04O21j65O5l546K332O73m821M453K169m411K023K58k154J023j054K629J155
1580B154m576L612J446n951L587K397l949J998O75k051l12j125L427k00m312N790
1596B610O76p554L722K814m813J657K556j13j366j995L594j305n138O407J274
1611C026o261M504J882n358J326K099p68j339m11M635k616m911O990R3p251M944
1627E84K527n163Q08J994K01j619o18M493k477m829O267q86o046N724J616m658
1643b082J843J363j079j925k87M847k457l628O927j139o172M764O48l852J588
1658f41J128M71j293j063L963k401l224O016j735m643N203k74l401K023O56J48
$$ plain form
1547 2452 -1563 1364 1556 -451 -432 -2622 391 2189 -1076 2605 2277 -2966 240 49 -2774 904
1563 904 1525 1360 1425 -2121 211 884 -3937 516 2685 -1726 297 555 -1599 -576 -1630 999 2154
1580 2154 -2422 1190 2636 -3315 272 2669 -1280 718 1393 -658 -970 -2095 1332 1132 -3180 2610
1596 2610 3286 -4268 -546 2268 -2545 -888 1668 1555 189 -1806 1788 483 -4655 1752 3026
1611 3026 -3235 1269 3151 -2207 -881 1218 450 -889 -1300 3335 719 -4192 2798 2891 -4360 584
1627 584 3111 -2052 -1244 750 951 -668 -1286 3207 730 -4099 2168 1282 -4764 960 2576 -2082
1643 -2082 -239 1124 45 -1880 -2167 2680 223 -3405 3522 2383 -3789 975 1623 -2229 -641
1658 -641 487 958 -335 -1398 2565 164 -3060 2956 1221 -3422 1781 1507 -1894 129 785 933
1674I33j543j052M203k439l246O090j054l830L877p10k467R53q45J117m49j287
1690a749L884k152k783M975k180l086M367m90j722J391n30J018j585j669M202
1705A891k081k907N162j408k530L245r94o13Q44j475J629q94j490M026j771j817
1721a183M487k244k275K973j436m59P14j097K284j910k350L630k096k278M222
1736I82j260p92K626j749M57N18k025K025j041j942L545k156j507L798k139p76
1752a436K172j470Q54M4j255L291j350j859L644k046j993K855j876J14J543j690
1768d58J651n4k240K490j730j455L517k319p02K952k067m27J349j560J454p58
1784c57j287L340j788j657L465k031j035K148k133O10J236j641J912k51j243K514
$$ plain form
1674 933 -610 -1662 2541 102 -3144 2946 1892 -1938 1939 1229 -1238 -285 -1130 -13 -462 -1749
1690 -1749 2135 -17 -2800 2175 -5 -3091 1276 786 -936 455 -75 943 -642 -2311 1891
1705 1891 -190 -3097 2065 657 -1873 1372 378 -235 609 -866 763 -131 -1621 2405 634 -1183
1721 -1183 3304 1060 -1215 1758 322 -137 577 -520 1764 -146 -2496 1134 -962 -3240 982
1736 982 -278 -1070 1556 -193 264 782 -1243 782 -259 -2201 1344 -812 -2319 1479 -660 -1436
1752 -1436 736 -734 120 164 -1091 2200 850 -1009 2635 589 -1404 1451 -425 -311 1232 -458
1768 -458 1193 1139 -1101 1389 -341 -1796 1721 -598 -1300 1652 -415 -842 507 -1053 401 -357
1784 -357 -1644 1696 -92 -1749 1716 -315 -1350 798 -1335 -725 511 -1130 782 531 -712 1802
1800A802k194q62L118k527l67K909k277L68Q83j515J543j051j065L075k088n38
1816g86L004k694K03J912l068J079Q33j927J624l97m28K129k571M39K535l302
1832a415R15K322k759J266P37k041J564r16r22J828j728N86J899k770J917J353
1848A836l596K136R65k549J621k69m51J453k018J007J148l039K083R85l054K661
1864I19J86k456K280o96j225J214j172J111L11k351L124J21l266L245j30k741
1880a526K618p53j037J566j456N75L50j874K101p40j999L640j223k087L632j147
1896F40j603J927j038L43M1j233K203j278j560L113j937j255L377k435q05K829
1912A329j729k05R24n51J228j552k60L024k973l31L751k956p49K805k257l68Q40
$$ plain form
1800 1802 -392 -1254 1864 -663 -1030 1879 -398 -30 853 -662 881 -170 -1235 1840 -248 -786
1816 -786 2218 -476 -273 1639 -1429 -350 483 -1444 180 -217 -645 1484 -1087 -648 1887 -1415
1832 -1415 -500 1822 -937 329 1066 -975 589 -327 -1249 579 -1149 -563 1336 -1434 483 1836
1848 1836 -1760 376 1341 -1208 413 144 -307 1146 -872 135 1283 -1756 327 1312 -1742 919
1864 919 1105 -1351 929 233 -992 222 -950 161 472 -1879 1245 1366 -1900 1345 1215 -1526
1880 -1526 1092 339 -698 868 -588 -13 337 -1537 564 -176 -2175 1465 242 -1845 1787 640
1896 640 -963 964 -74 269 310 -923 1280 2 -1558 1555 -382 -1637 1740 -695 -1500 1329
1912 1329 -400 -605 319 -232 996 -556 -816 2208 -765 -1096 2655 -301 -1050 1755 -502 -870 -30
1929c0q90J062j012L50J934l025J193K953l984Q80L428l234j99J686j264N8q04
1946h98O66J354l103J636K290m310J772L010l559Q65K069k092J28NO59K25k491
1963a774K590J177m850K449K494m047J345K242j985K63m7N23J08j910K648N32
1979A758l958L047R36m446K412J605k495R65M79L9m97j738K985K47l345L321Q32
1996B147m019K116N69k306J583rj23R4j407K062j10k683L680j22l220K873k35
2013H90k143J765m11K59M73k085J806k06k674K868J83j891K558j205j188J697
2029F96j663L68J485j672J768J00k402K185o01j502K192j049k39J211k234J171
2045a86J063k610J908J000k406J392J43n71J318j265Q33J066k982J313Q99l171
$$ plain form
1929 -30 -920 142 -870 -520 1414 -1611 -418 2535 -1449 -569 2859 -375 -574 1112 -152 -94 -898
1946 -898 -232 1122 -1981 -345 1945 -2365 -593 2417 -1142 -277 1792 -300 -172 -167 492 717 -1774
1963 -1774 816 1993 -2857 -408 2086 -1961 -616 1626 -359 -96 -143 380 488 -1422 1226 1758
1979 1758 -2200 847 1783 -2663 -251 1354 -1141 -176 303 342 -155 -1893 1092 1339 -2006 1315 2147
1996 2147 -1872 244 813 -1493 90 81 -42 52 -1355 707 597 -2086 1594 1472 -1748 1125 890
2013 890 -1253 512 101 360 833 -1252 554 348 -2326 542 725 -1166 1392 187 -1001 696
2029 696 -967 -599 886 -786 982 1082 -1320 865 264 -1238 954 -95 -334 877 -1357 -186
2045 -186 877 -1733 175 1175 -1231 161 304 -267 1051 -214 619 1685 -1297 16 915 -2256
2061b256K261J183k437J825J43j146L25j075J595M97k740K891P26m116K395J195
2077A266k932J431Q10m72L22j199J776p3k820K924J18l829K952P10k994J946J072
2094A008p33l1p16K064q21k926L902k1l765L072M28l254J135L99n15J75k44K117
2112A274n07k135L272r15l495L639n7k804K062L42q01m09o37K111r99k102L851
2129A690p00l040L426k54k304J873m68j84k45p82J872p98j701L692j230k750L128
2146A225q94k296J960o6L34N7q82K052j468k182L290n60k015L192p74j563J153
2163E63j314J22J43q21K466j018j556L326j474j768L114r24j291J006j049N92
2179A17l60j300K720j168j828K717j509j441K815n13J2J496j308L87q47j496K275
$$ plain form
2061 -2256 5 1188 -1249 576 719 -427 -102 -1177 418 915 -1825 1066 1792 -2324 71 1266
2077 1266 -1666 -235 575 103 425 -774 1002 929 -1891 1033 1151 -2678 274 984 -2010 -64 1008
2094 1008 275 244 -472 1592 771 -2155 1747 1726 -2039 1033 1461 -1793 -658 -259 -774 -599 -843 1274
2112 1274 767 -1368 1904 989 -2506 1133 1076 -1728 334 676 -125 -534 -1171 940 -59 -2161 1690
2129 1690 990 -2050 1376 1122 -1182 691 223 39 -206 -988 884 86 -1615 2077 847 -1903 1225
2146 1225 331 -1965 -5 -71 263 320 -562 1490 22 -2160 1130 570 -1445 1747 973 -590 563
2163 563 -751 -629 -486 -1307 1159 141 -1415 1911 437 -1331 1783 859 -432 574 -475 117
2179 117 -243 -1543 1177 9 -1819 898 -611 -2052 763 250 262 1758 450 837 -10 -1506 769
2196G69j027j198L233j507j556K075j109l89Q99p63J696n06j484K494j246j385
2212a004K424j540q00J633j313L23P51j006J483r54j355K106j619j139K980r33
2228C7o45J843j464K48R6j376K063n26j320K727j456j151J945j608k93J357j360
2245h83J167N2q50J891r90j157K318j829j108K366j374O3J184j186Q98m08j652
2262a498K054j186p92K647j364m78J978j851q1R31j518J205J32q69K064j498n13
2279f37K161k069m95J963j713M95R02j174J353n29j082J751j579l43K186j859
2295f69N05J892k113M95Q43j770Q92k75n20J709j430R3J817k427K94J442j992
2312a214R99R24j391J488l38p48J075j322J2J225k177J221J360k189J527M81j870
$$ plain form
2196 769 -258 -1456 1777 270 -1286 789 -320 -709 190 -573 1123 617 -867 1627 381 -1004
2212 -1004 1420 -120 -920 713 -600 -277 474 -532 951 -3 -1358 748 -871 -2010 970 37
2228 37 -608 1235 -229 19 115 -1261 802 276 -1044 1683 227 -924 1021 -587 -880 477 -883
2245 -883 284 336 -514 1377 387 -770 1548 -281 -1389 977 -397 -334 850 -336 562 154 -1498
2262 -1498 556 -630 -1422 1225 -139 -617 1361 -490 -571 360 -1158 47 179 -690 1374 -124 -637
2279 -637 1524 -545 -1040 923 -790 -295 607 -567 786 257 -825 926 -653 -996 1190 -669
2295 -669 -164 1728 -385 110 953 -817 75 -200 -720 989 -441 -348 1469 -958 -664 778 -1214
2312 -1214 -215 709 -682 806 468 -280 795 -527 -515 710 -1467 -246 1114 -1075 452 933 -937
2329i37J210m54m36J359j209P98J176k076R76K88k330J849N5j569J999j64q41
2346c06J087q93M49J83j608J691L04k103K200l67j846J733q86j078J487q24M74
2363c03Q28j073J372m99j475K266j082j583K627q53r31J545q65O7K37j238J296
2380C36m04p56K120j234q72K471j857p58J962j363J56R76p91J182r67p95J778
2397A184j923p73K203j808j44K130j467J55R56j161P65m12K3J466j737N10J868
2414A835k654J23J898k390L23J199q37P73m2K4J095j801N45J189k467J113J581
2431A507k662J245Q63j657N44J0j08N82j147J226R30k572J383J027k763J354O83
2448D45j600J059K78k14M95q25R86J61k249K035L27k468K069N62k010J196k29
$$ plain form
2329 -937 273 -181 -617 742 -467 331 1507 -569 407 695 -1635 214 269 -1300 699 535 -306
2346 -306 781 -112 337 520 -1088 603 907 -1196 1004 637 -1209 524 -362 -1440 47 -777 -303
2363 -303 525 -548 824 325 -1150 1116 34 -1549 1078 225 -706 839 -26 41 278 -960 336
2380 336 -68 -824 1296 62 -810 1661 -196 -954 1008 -355 -199 777 -14 1168 201 -594 1184
2397 1184 -739 -1512 691 -1117 -1261 869 -598 -443 513 -648 117 -295 -272 1194 -543 -33 1835
2414 1835 -819 -696 1202 -1188 -865 334 -503 270 228 252 1347 -454 91 1280 -1187 -74 1507
2431 1507 -1155 90 953 -704 -160 -150 -258 324 -823 403 1333 -1239 144 1171 -1592 -238 445
2448 445 -1155 -96 182 -32 463 -362 624 785 -1464 571 898 -1570 499 1061 -949 247 18
2465A8n00M01o82J154M07j615J904j76k285J953k79j752J866j41o54P82p60O88
2483C29m9j344K065m72j837K273n91j375J644n87m77R66j115N08L02j103J714
2500H51k96j074J899j357j125J747j098k70J327r61N62J27j339J351n21p01J763
2517H85r61j65J240j696K07J212j664R02N18j055J063l72k58J189j146L8J240
2534A177j826L88R69j856J172O63j430J117k27o00P95r95Q70R57j838J152Q34
2551A322k502J060M37j397J145k6l37O25r09N60L45j476J522M08j953J857J54
2568H35j776J202j16k84N10q00Q60O7j707J677K40k036J898J60j644J184k43m54
2586d27O01l42Q17m6j296J607o06j898K165kj444J450l76n89J93p27J118J9j063
$$ plain form
2465 18 -482 -81 -763 391 798 -817 1087 911 -1374 579 300 -1452 414 273 -381 401 -359 329
2483 329 280 -1064 1001 529 -1308 965 374 -1001 643 56 -421 545 -570 -62 240 -863 851
2500 851 555 -519 1380 23 -1102 645 -453 -723 604 -357 205 332 -1007 344 -177 -878 885
2517 885 -76 -241 999 -697 -490 722 -942 -40 478 -577 486 114 -144 1045 -101 -63 1177
2534 1177 -649 -261 708 -1148 24 687 -743 374 147 -453 342 -653 217 1174 -664 488 1322
2551 1322 -1180 -120 317 -1080 65 39 -298 327 -582 -22 323 -1153 369 777 -1176 681 835
2568 835 -941 261 145 -139 371 -429 431 498 -1209 468 708 -1328 570 730 -914 270 27 -427
2586 -427 174 -168 649 603 -693 914 308 -1590 575 573 -871 579 203 -386 -193 -920 198 217 -846
2605h46J916n15j629J796n16j092J560m67l79N63r74O81j65r08J903n41j279J881
2623I89j043r71J413l67J51M21r74Q69l74j320J758m12o57J694r50r10J048q45
2641d80K43O67p25J014m60j220J542p80q20J827p56l87O87q25K38M67r28J418
2659G22l14j066J404r62o94J600q09p5R46j031K67o2q47J378k37q55J780j016
2677A29q16J269q58Q1P48q53P13p2j221J322m26o36J372p56m54J120j120R9P83
2696D24j010Q98K1j144J387o80p23J639o11l84Q61r31L10K15j006J102k84r43
2714h59J572p55p81J449r21N0R00r39N34O7q26J030m92p30J621r05p43J460j097
2733c65P0P30p64N87q6p35J104n69p37J444q84l79J347j115k9R31q33M48Q3m79
$$ plain form
2605 -846 1070 555 -1074 722 206 -886 674 207 -172 391 -583 98 -67 -975 928 387 -892 989
2623 989 -54 -1025 388 21 172 593 -381 488 114 -1206 552 140 -517 1177 227 -683 365 -480
2641 -480 -237 430 -295 719 259 -961 581 -199 -1019 808 52 -335 352 -473 -235 232 -696 722
2659 722 408 -658 746 -216 -910 690 -119 -194 752 -279 -12 -74 -921 457 220 -635 1145 129
2677 129 -687 582 -276 -195 553 -300 413 341 -880 442 16 -620 752 -4 -458 662 -458 -359 424
2696 424 -586 312 333 -811 576 -104 -827 812 201 -183 678 -253 57 272 -734 368 84 -859
2714 -859 713 -42 -823 626 -295 -245 655 -284 250 317 -509 521 29 -701 920 15 -728 732 -365
2733 -365 -295 435 -329 258 172 -563 541 -28 -765 679 -205 -584 763 -352 -381 550 -283 165 248 -231
2753b31Q60q85m14J528j223k75J283j066K30N48p95Q69l7n95R85p66l48J144j327
2772e15J04J100j343L31P64j010O60L6m80Q30o97j2J047j323L77R24j520Q28L59
2791D60j221R51L7n49Q11n09j0O74j317O75O30j498R80L89j147Q51l6n59P12n94
2811b70J19N49q86O86L50j358J153p0j121J290k61o56Q49m27J85L26j067J077
2829D68j57j196J380l17j003J420m62p30J088n31r8M80n47O85m28p06J429p75
2847@j009J604p50p10J325o32j64O21n99O36j60o12J198q51n54J650j168m11J296
2866G10r57j36O08m60M85l63j70R72j016j31J451j437j5J292j357K07Q55p88M33
2885A83Lm14P42r37O3J188j549M43J130j402K09Q32j026N16J06l89Q46r07L10
$$ plain form
2753 -231 629 -256 -670 858 -365 -640 643 -423 -193 355 -440 429 392 -203 782 16 -332 812 -515
2772 -515 -411 689 -654 -323 441 -569 91 127 -353 477 -220 -232 815 -508 -131 793 -727 101 460
2791 460 -761 190 227 -322 489 -20 -30 644 -673 2 632 -866 114 503 -644 207 171 -388 324 -270
2811 -270 -151 398 -488 198 548 -810 343 273 -848 442 181 -475 374 -53 132 458 -609 468
2829 468 311 -885 495 178 -825 595 133 -597 491 -40 -138 342 -205 480 52 -654 775 0
2847 0 -1009 595 -155 -865 460 -172 -336 285 -314 322 162 -450 748 -103 -657 993 -175 -586 710
2866 710 -247 -383 225 -235 250 -113 -283 689 -327 -458 993 -444 -459 833 -524 -317 538 -250 183
2885 183 186 -228 514 -423 -360 828 -721 -278 852 -550 -341 491 -535 -19 87 -302 544 -363 -53
2904e3Q40j478O42R24j654O84P43j310P93P4l90L74o49M58M90j333R99N08j471
2923h09J102K78j300R22J13o65N72l34K14L01j018J005K7j324J429j7j301J208
2941D03k11m78M39l55K94K35q37J043k76j070J600n10j141J373l14p57R77o78
2959b63J57K51o26R28l45p75J208m48p29J379p19m23J034q18rM83o05O30l73m44
2979e07J215q46n99J529j063j89R86p92J95L19o86O43j31m44R95p85j48J108j264
2998d64R0J095j139K55N92q26M93k14k95R39p86K5R45j162L36Q26j370P03M10
3017D53q69O78j50k82M47q35L09P39j210P32O00j290O86K46q30Q16j44l26O75
3036D45o64K40M33j121R10L12j188R30J51j042Q75k55k60O87q72M59L95j079P07
$$ plain form
2904 -53 787 -691 -49 875 -779 -95 648 -662 131 205 -185 189 -460 -2 488 -845 154 662 -809
2923 -809 293 571 -729 193 306 -359 213 -121 93 394 -624 381 408 -916 513 496 -805 403
2941 403 192 -286 153 -202 92 327 -510 533 257 -813 787 277 -864 509 195 -562 415 -263
2959 -263 -106 145 -481 447 102 -673 535 87 -642 737 18 -405 629 -189 -198 285 -320 310 -63 -507
2979 -507 708 -138 -737 792 -271 -460 526 -266 -71 248 -438 205 74 -370 625 -160 -308 800 -464
2998 -464 -374 721 -418 -163 429 -397 96 -118 -413 526 -260 -235 710 -452 -116 710 -660 43 453
3017 453 -416 262 112 -170 277 -558 -249 490 -720 12 612 -678 8 254 -576 240 96 -230 445
3036 445 -219 21 454 -667 243 555 -633 297 448 -594 281 26 -234 453 -419 40 435 -644 63
3055F3L06j034J091j84o05Q51n48l14O80n05L61J69q42P52j33r53J135k58o24
3074e92J037n06k05N95o92M26L56q35P78q5p40R31l90n63J164p29j69O69q64M95
3094H1Lo55R06n3p36J059p05m92J058p22J49P00q58L96K27r81J084m36m83J096
3114F38o51l75P85p52l4P72o96N20K46r18Q12m05l92Q99m90j05Q26j245K29N33
3134A97p84P87N5n10O61n58l80J032q31K35P44r73L40L39r15O97J45n99R82m21
3154B43n77Q46j003L61O44q54N53K96j066P65k22m58Q85m03j36P58j050M3O44
3173B69r04Q67J25q79P86j88o39Q96m84R2N82p05K41K37r70Q37J79n57Q29m04
3193B10o29Q71p10K4Q28p59M20J80q73O66j58o72J068l92m44P59o41OL98p49N95
$$ plain form
3055 63 369 -665 426 242 -363 488 -60 -374 306 -199 162 331 -511 241 108 -845 290 32 -592
3074 -592 445 -61 -266 329 -363 63 419 -416 362 277 -463 468 78 -485 679 -50 -219 450 -414 81
3094 81 84 -571 335 282 -454 605 -100 -592 466 -256 -107 593 -265 131 358 -623 461 25 -458 638
3114 638 -13 -388 397 -355 -389 383 -313 207 453 -465 347 -58 -450 449 -41 -146 680 -565 -336 197
3134 197 -587 200 255 -255 406 -152 -532 500 -331 -96 648 -325 15 354 -561 136 281 -318 664 243
3154 243 -334 512 -491 -130 514 -340 213 509 -557 208 -14 -472 413 10 -126 632 -418 -375 269
3173 269 -635 232 357 -522 264 76 -563 333 -151 -59 523 -182 59 296 -674 163 342 -215 614 210
3193 210 -419 452 -258 -234 594 -165 255 435 -438 228 70 -602 466 74 -370 389 -252 -246 152 -597 -2
3214bL88r00Q39k99o13J068o07j68R50r76J47N20r24N09L60o73Q22l44n87Q85
3234C95n87J8Q19q59K14M48q29M62K20q15Q75l17l98P77q33K1Q15q79L05N41r17
3255e24O25M0n11P60m69k00Q77q97J86O41j052N67N84j226P40L5m65N18k69r5
3275a35N57q73L88N38j109Q91K08j076Q95n5o79P78l34j74M90o03M77L8j045J056
3295B33j4q58Q75mp20Q21l35r0M28o25M88J93j012J020k56p48J108m26n60Q45
3315C63m07k91M92m12L58J0o17R74k66p97J046m80l60R73p27o3O27p28L56K2l80
3336c07O62m61m76J136p57l65J025o36n1M56m98K12R3l53O79n19j19Q72q98p2
3356c77R55r80K95M86o65M04p8k98O10n60M3P97r54J52P16r44L43M79p97M85J07
$$ plain form
3214 -2 386 -514 325 26 -587 481 -126 -294 656 -320 -173 347 -577 -68 292 -381 441 97 -490 395
3234 395 -192 -174 645 -214 0 448 -381 81 301 -514 361 44 -354 423 -410 -389 426 -453 -148 393 -524
3255 -524 101 141 -370 390 -79 -279 598 -299 -113 528 -524 43 627 -599 141 176 -289 229 -40 -135
3275 -135 422 -451 -63 475 -634 257 465 -611 284 229 -450 328 -6 -180 310 -293 184 222 -823 233
3295 233 219 -639 236 232 -488 333 -2 -92 336 -289 199 392 -620 400 144 -604 504 78 -482 363
3315 363 -44 -335 157 -255 103 113 -504 470 204 -593 453 -27 -387 586 -141 -204 423 -305 51 73 -307
3336 -307 355 -106 -582 554 -203 -568 457 -179 -230 226 -272 -60 33 -320 359 -160 -279 593 -305 -377
3356 -377 578 -402 -107 379 -286 118 40 -258 352 -208 -165 632 -322 -170 546 -398 -55 424 -373 112 219
3377B19n03N04l73J3N97r01M32M94j087M67N85r27N45M8m14N09l92J61L86p95
3397d32N42L65j010P91K29j074P75Q5p62N90j96J06L62q95P71J62j016R75kq49
3417d83Q30j71m35M81k47j1J71l99M97j15p22Q93j54p87J057l77m70P55m19J9
3437h7L43n48M94j28m79Q26m03m48J013n82l78R40p07q8M11n00M14m7m92P71m14
3458h9l89J049o24l58Q90o47J1L58l91L64j30l38O41n10k36R87q80j00R01q03
3478b94J75M73o00M71k02l48P13n23p4P13p69o8P94p92K54L89o20M22n6j80N02
3499C80n95p6P52p87J69O62q60L71K78o80N71j22l25N88n84J18N03o64L12K46
3519B57p20N72K04p02O52j69l04N23n34J24M11o05K70L18q13O93Lp18Q85n04j29
$$ plain form
3377 219 -284 220 -153 -140 457 -444 -12 482 -605 -138 447 -480 65 113 -301 208 -184 -23 363 -432
3397 -432 110 475 -535 256 485 -589 186 271 -491 99 -97 9 371 -524 247 409 -607 368 366 -483
3417 -483 347 176 -259 222 -25 -36 135 -264 233 118 -604 289 135 -652 405 28 -442 313 -106 -87
3437 -87 256 -292 202 74 -405 421 18 -430 583 1 -377 563 -144 -232 179 -321 93 46 -446 325 -89
3458 -89 -478 571 -53 -411 479 -168 -157 201 -190 174 44 -294 347 -163 -399 588 -292 -392 509 -294
3478 -294 -119 354 -246 225 23 -325 388 -135 -209 504 -265 -333 461 -331 -77 312 -308 114 58 -122 380
3499 380 -215 -291 461 -326 -157 505 -355 16 294 -386 185 63 -262 326 -258 -140 363 -301 11 257
3519 257 -463 109 313 -389 263 94 -210 313 -221 -97 314 -291 -21 297 -516 177 180 -538 347 -157 -286
3540b86O91o76J48M16o55M29K13o23O22j76n61Q60m17j76O05p62J71M46n03L03
3560F9J16n08N25k52m72R31m96j86O44n83P4L47n35N01kl48N06m04l52Q52o98
3581b71J19O72p47Q4M39o49L76%k34O07n58P9M81q16J43O64n01J30L53m91K29
3602A09j32l13N54k20l9N37r53J04P78q62L23N64n61K83k55k74N34m15J88O24
3622E74q67K33N73r90L69L52l93L31k06j52L53n71J10P20o93L38M78r37L21K29
3642A72m16M44m2r1L04p29J59N91q86N77L28o52K59J19m50L73j69J45M17p61K55
3663e3M37p80M12L63p13M56J42m40K71k66J19L71n81J42L29o49M42J88n34N19
3683A75q2l09L98l09o2M80p11M51K74p10M53J77o20N75k00k09M79m27J07L92o18
$$ plain form
3540 -286 405 -271 -123 293 -362 67 280 -343 279 103 -458 402 -15 -191 414 -348 -177 269 -234 69
3560 69 185 -323 202 -50 -522 409 -87 -273 371 -212 -138 209 -326 175 173 -175 331 -73 -425 427 -271
3581 -271 -152 520 -227 -143 296 -353 23 23 -211 396 -162 -83 398 -418 -275 389 -112 18 371 -120 109
3602 109 -23 -336 218 -2 -41 496 -457 -353 425 -437 -114 450 -111 172 -83 -357 177 -238 -50 574
3622 574 -293 -60 513 -477 -108 244 -149 182 -24 -176 177 -394 -284 436 -257 81 559 -378 -57 172
3642 172 -244 200 158 67 371 -358 -199 392 -494 83 411 -241 18 137 -313 60 -109 36 453 -308 -53
3663 -53 384 -396 16 379 -334 122 264 -176 95 -171 -52 319 -262 -120 209 -440 2 190 -344 175
3683 175 93 -216 182 -127 -189 291 -420 31 305 -405 48 225 -395 180 -20 -229 250 -177 -70 322 -296
3704b96L59L74o73K98J58l72M63l06j47N70o00J27J94n60N07K04n50K89J42l68
3724a87L77l41k5M61o18L07L33p51L97K38n45M17J08m25L05k91K75K12n58L41
3744C0K20p72M80J87n00N58j14k49L63l68J19L48o52M54K49p80N24l5l25K92R5
3765A24k22K07l30K37K46o91O56J20p18N19P7n52M40l0k40L64k53J02N7m94N91
3786B10j20n96P41j62m87N67j88k57M68k71K60j10m68O55j9n87O24j53l95O65
3806C77m65j46L48k07R5Q3k66N04k32m44P83m19k97P78m06k65M48l67N8K11k92
3827a21L10k69j51M65m07j45N39m58n5N94m12J22K16l44L84j96l13N94m19J3M00
3848C47n14P6M90o34J48K30l57L74j62mL27m29J12M32n75J64L94o85L12J26k41
$$ plain form
3704 -296 63 437 -236 62 220 -152 311 5 -142 428 -172 -45 149 -411 96 300 -250 39 181 -187
3724 -187 190 -151 -176 285 -333 -26 307 -444 -47 191 -354 63 171 -254 51 -240 35 247 -311 30
3744 30 250 -522 -42 145 -355 203 89 -160 203 -165 -46 302 -350 104 353 -427 97 62 -263 29 124
3765 124 -98 109 -221 16 262 -429 227 347 -371 148 225 -327 113 83 -157 207 -46 56 113 -381 210
3786 210 90 -506 235 73 -414 153 -35 -292 176 -95 165 55 -413 242 223 -364 260 107 -288 377
3806 377 -88 -234 114 -93 2 85 -181 323 91 -353 430 11 -286 492 86 -179 269 -98 -40 171 -121
3827 -121 189 -80 -231 234 -173 -318 221 -237 -292 302 -110 12 228 -116 268 72 -241 353 -66 -53 347
3848 347 -167 -91 399 -235 -87 143 -214 160 -2 -6 321 -108 4 436 -139 25 419 -266 46 172 -69
3869f9J68o8k48L72l61K65K50o60M46J22o00N05J47o78N47k48l5K38k73K22J30
3890A72n10N16qn57N47R0n11M19j54j87K82k09J95k6l56M53rn28O55j82l24N43
3912C11k87l15L36k10R9K20m36N01j87m08P06l09m48P43k20k46L00k41K9J54k26
3933a34M10k85k67P03n22j50M79k96k29M87l26R6Q5j40K35k65j36N09l82l3N35
3954C74m51j3K67k06K02j21k69L99k37j32N53m04j61N42m83oL05k93J24Q8j52
3975g4K38l01N1M47n42K5M69m93Q3L38m45K76K2j99K61l03m8M27l98P2L61m81
3997b14J92L02n17M64o0l14M96m20r5L33l19J25K26n29M39j17j84M15j84k58L98
4018A79j38j78N67o69L18J10l94L56o0l86N28k05l29O02m79R2L46l90R1K25l53
$$ plain form
3869 -69 99 31 -217 155 -206 59 309 -351 95 217 -383 122 269 -409 138 -110 -145 93 -180 42 172
3890 172 -338 178 170 -387 160 250 -261 158 4 -183 99 -110 85 59 -297 156 147 -381 274 92 -232 311
3912 311 24 -291 45 -165 -66 154 -282 219 32 -376 330 21 -427 316 96 -150 150 -91 -62 92 -134
3933 -134 276 -9 -276 427 -95 -245 234 -62 -291 196 -130 -34 51 -89 146 -119 -255 254 -128 -161 374
3954 374 -77 -90 177 -29 173 52 -217 182 -55 -187 366 -38 -199 343 -140 -146 159 -134 -10 78 -74
3975 -74 164 -137 -86 361 -181 -156 313 -180 -97 241 -204 72 94 -105 156 -147 -195 232 -166 -94 267 -214
3997 -214 -22 280 -237 227 167 -147 349 -71 -166 167 -152 -27 199 -330 109 -8 -192 223 39 -219 179
4018 179 41 -137 430 -239 79 189 -205 151 91 -295 233 28 -301 301 -178 -86 260 -130 -39 186 -167
4039a67K94k8m02O33l12l36N74l91m4M51m25J08K00m34L82r8k92M46l06j43O10
4060C20l78j42N55m32P3J05j36K50k76P7K22m27L0N45n62L5M90m93QK68k46L34
4082B20k17j37M74n73l8N83n98J65M49m08R5O0k37M41m52J34M53p15J78M07n95
4103c11J49L33l89J38Pk7K37l26J74M97p63L20M74p99J24K95l66J99j00OL08m97
4125c17K19L36n63L11L97n12m7L76m26K09J50p9K27m23J87L28o83K59K83n14L18
4146C6J60l92J74r3J1L14m28K23L96p17K43L45n79L04K66m55K86k70P3L23m73
4167b53K35L69o98J64L98m94L45r3k4J85j70n5M37n79J92L15n89M34R3m48M10
4188A74o8j61R7j83J67J86n41K88L89n75L54J24m00K27j50k6K16l63K28K44n74
$$ plain form
4039 -167 127 99 -303 330 18 -318 256 -135 -179 272 -153 -45 155 -279 103 5 -287 159 -147 -290 320
4060 320 -58 -200 355 -77 -4 101 -35 215 -61 16 238 -189 -159 386 -176 -141 349 -144 -136 132 -114 220
4082 220 3 -134 340 -233 -271 312 -286 -121 328 -80 15 75 -162 279 -173 -39 414 -301 -123 284 -311
4103 -311 -162 171 -218 -80 -73 -100 137 -189 -15 482 -281 39 513 -286 -162 133 -233 -34 -134 -128 180 -317
4125 -317 -98 238 -325 -14 383 -129 -176 200 -226 -17 133 54 281 -142 45 373 -310 -51 232 -282 36
4146 36 196 -196 -22 -115 -104 210 -218 5 401 -316 -73 272 -307 -3 263 -192 94 -176 -103 220 -253
4167 -253 -18 351 -347 -183 215 -279 66 -27 -51 134 -36 -91 346 -233 -41 274 -315 119 212 -236 174
4188 174 106 -55 42 -141 26 212 -329 -41 348 -227 127 251 -149 78 -72 -98 118 -245 -17 227 -347
4209c47L52L20o76L37K75l71K03n4q2K01l93M24J35o00K70K46n02K24J71l09J35
4230d1j64K52K31n42L99J81p28M56K78p41L66J64k33J52j41J49J50n21M83J77
4250C27p27N84J36o20M47N9m23K94r1j2J08l39L32P0m91M69L3n10N00j4k44J85
4272G3j29L7J11l40N58o6n96N43p2m32L78m9k13K22j79J68Q0l45L89L4m18O35
4294C89j76m32M73j58k71K66l27L55P1m52M40k40l32N58j39j49M23l20L7L03m22
4315a03R7K16m11L47k7m95N15j81k05N67n69l3N03m04J78J68m09M05o6k66M05
4336B32l33RL84n03J49K11l71K22K41n68M09p1j50K91j46J6J87m84L52K44o16
4357b95L94K29n90L58p0k66L87j95j9J63k87K29J46o03N97o4m35M30r4r3Q2p0
$$ plain form
4209 -347 5 325 -351 -14 261 -110 93 39 -43 158 -235 189 324 -276 -6 240 -262 -38 133 -176 -41
4230 -41 -205 47 278 -264 135 316 -412 44 322 -419 -53 111 -122 30 -111 38 188 -333 150 327
4250 327 -400 184 320 -300 147 206 -217 77 -14 -26 82 -257 75 145 -346 123 156 -354 146 132 -112 73
4272 73 -56 -19 92 -248 310 244 -352 191 119 -313 65 16 -197 25 -154 14 94 -251 138 172 -246 389
4294 389 213 -219 254 96 -175 91 -236 119 190 -262 178 -62 -394 164 25 -124 299 -21 16 319 -103
4315 -103 -6 210 -201 146 119 -376 139 -42 -247 320 -249 -282 221 -183 -5 163 -246 159 93 -173 232
4336 232 -101 -92 292 -211 -62 149 -222 0 241 -327 82 11 -139 152 6 22 209 -275 77 321 -295
4357 -295 99 328 -262 96 26 -240 147 -48 -67 96 -191 38 184 -419 178 114 -321 109 15 -78 4 -66
4379f6J62P0l91L37j5m39N35j22l57N10j83k36L18k63R0J63k61L49q4l66N12k42
4401B1l60O37l26j22L07k50R3K70m94L09L3l53M91l03k24N48k88j14L21l25J25
4422dJ79l38K67r8j75M89m75j62N56l65q2M33m31K68J71m80M87k09k42N08l17
4443b0j62M57m25JL67k95L3K22l06K88j97r1L58l59r7L82m39J65K12l47K96Q8
4465A31l58L05j24p7L71l61Q5L08m58M7K86l25M11k50k59N43j91j66L93m70J49
4486a0J46l71L86K8l67K79k5j80M43m03l8M54n35J38J52l44J93k6k38M55q2k21
4508a66L64k37j82M49k13J6J50l41K66j92j06K44j73q2N35m17j37L85l82K07J82
4529A70o2L2j07k27M18l38j31N40m75p1M90m27J02J91j83K90k88j32M32m29m7
$$ plain form
4379 -66 96 166 -225 112 97 -342 193 71 -286 224 41 -195 123 -140 -50 113 -148 201 117 -249 263 21
4401 21 -339 298 -28 -150 157 -93 0 270 -224 85 118 -235 256 -47 -271 277 -11 -125 196 -129 -4
4422 -4 175 -163 104 6 -169 320 -155 -317 239 -126 -208 225 -206 62 233 -247 240 31 -211 297 -20
4443 -20 -182 275 -150 -149 218 -77 -44 178 -128 160 -37 -128 230 -129 -226 156 -283 -118 94 -253 43 131
4465 131 -227 78 -46 -123 248 -113 -28 280 -178 -131 155 -170 241 -9 -268 275 84 -82 311 -159 -10
4486 -10 136 -235 151 179 -188 91 66 -114 329 -74 -112 342 -193 -55 97 -247 -54 -80 -318 137 55 -166
4508 -166 198 -39 -221 228 15 31 181 -160 106 -86 -192 52 -121 -203 332 -85 -222 163 -219 -12 170
4529 170 108 140 33 -194 224 -114 -245 295 -180 -251 239 -188 -86 105 -78 212 -76 -208 224 -205 -252
4550b52N01l96J6M80m56m1K32j68L01l40J48J66l12n2L92n12J19L92k95R4O3q1
4572aJ31k59J33K81m93O8M91o01J9M51m03J61J6K1J9k52Q7M79p13L07N44q21J65
4595a70L76n38K84O6j23L78m90R2M27n25J66M41o06J14M22m05M5k8K0K55k84M6
4617c7K32n14J65M37n43K95K68m67Q5K2J75Q3l39J65L27o74K82L44o83K61K69
4638A53k90K45k06r9L01l29K45L14p06L18M67o55J83J33k3P3k05R8J40n04L60
4659A3K56p17L56L64m66J44QJO5o2J30J40m29J42L48o16K52K98l79J92J95j77
4681E8n8k85L51K64n59L58J95n30lM48m40J86j6Q1J35m70L24J67n99L90L49n78
4703b32J61K21l12M2Q8J17N8m83M93J58o08K88L42o11J77M47n12J79l5L8L8l25
$$ plain form
4550 -252 249 -147 -131 349 -107 -148 84 -84 217 -123 25 191 -121 -173 219 -293 -174 218 -77 17 80 -1
4572 -1 130 -129 4 285 -208 -140 351 -250 -231 220 -183 -22 -6 15 34 -218 -131 348 -365 -58 486 -335 -170
4595 -170 206 -332 -48 18 -105 273 -217 -125 302 -223 -57 384 -222 -108 314 -91 -46 -74 -54 201 -83 -37
4617 -37 195 -319 -154 283 -260 35 303 -164 -79 -57 118 201 -138 27 354 -320 -38 306 -377 -116 153
4638 153 -137 108 -98 -197 104 -225 20 334 -372 -54 413 -242 -59 74 51 124 -81 17 157 -347 13
4659 13 269 -448 -92 272 -194 -50 -42 -41 24 -38 92 232 -197 -55 293 -323 -71 227 -152 40 235 58
4681 58 0 -285 66 330 -229 129 324 -206 -209 239 -201 -15 -31 50 185 -285 39 206 -393 -3 346 -232
4703 -232 -71 150 -162 -120 -32 85 143 -340 153 311 -297 -9 333 -278 -101 346 -166 13 -22 16 54 -271
4725b71M93j2n82N09J35p27L99L19k88J30j59J50N0m06L88J20o91P13jo63N47
4746A53n0j61j0M9O4l5k80M40l1m47M13J40n41L29R7l32L70j92J64ol67L15J00
4769A82n52M10N6m16M74j37j61J57j38K54j2l41L44q1l57N03q5k62K86j42j7J55
4791A20k68Q3J95l29L75j08l35M34j75n9L35k59j8K96m42K26J72l66L33o4l13
4812a67K65j36k07L53k72N9K79l67K18J65m80M40R3l70J97qj52J03r7J54P7m63
4834c16L94J4n02N90q8k58L48j44j43J59j56J32J54m45M20k1l72M78q6k72K10
4855I6r8L1mk80L55j67k12M18J7l66L68o1k87L92k36J07kj61J82q8k05M01j56
4878D4k42L77k07q9L52k79J1K73l83K27k3k77L98j22k88M33j64j44K64k83J33
$$ plain form
4725 -271 222 210 -372 137 272 -455 -56 263 -25 105 -54 96 146 -260 128 248 -443 270 269 -394 153
4746 153 103 -58 -68 -19 45 10 -270 170 139 -308 105 245 -296 33 130 -202 168 -24 140 134 -233 82 182
4769 182 -370 40 96 -320 154 17 -144 13 -125 129 117 -224 120 39 -318 185 100 -162 124 -18 -35 120
4791 120 -148 -65 130 -199 176 68 -267 167 -8 -67 268 9 -9 287 -155 71 243 -123 210 146 -167
4812 -167 98 -38 -245 108 -164 -105 174 -193 25 190 -290 150 243 -127 70 62 -90 13 -84 70 147 -316
4834 -316 78 92 -410 180 92 -166 182 38 -105 54 -102 30 184 -261 159 138 -234 244 158 -114 96
4855 96 -2 29 25 -255 100 -67 -279 139 156 -210 158 97 -190 202 -34 73 71 -90 92 4 -201 200 44
4878 44 -198 179 -28 -117 235 -44 -33 240 -143 84 61 -216 182 60 -228 205 41 -103 161 -122 11
4899A1J45k22J87q1k76L27k02j97N19l41R2L26l81L1J94k98K20q1J4J42j56j75
4921b02L09k14P8K33m07J95R7j71J50j3k72L46j77j17L93m05R6J72k14K61l4k89
4943a85L30m3k74K73k34J04J71k93R5K48m37K62J33k61M23k05l46M68k93L1Q1
4964D8j04j5J53l42L50p2m07M79j84j8K45j70L4J44j81M0J15k17K64r4j41K23
4986A50j91j71M48k50mK46l25J26K6k70L99j86j84L66j07k11K78k78L4L07l99
5007a96K68k4j33J61o4r5K87l26m5K68j49k7O6q1J71q4j07L09k80j13N19m50N6
5030f9K54k61R6J47k47J60j51j9L19l92n2M19m57N5M96l31K3J87j74N1j16JL91
5053C30m82N5M37m00j17L84l16k5J16p5J64k00O4M13m99J23L54n28P5L17m08J34
$$ plain form
4899 11 156 -66 121 40 -236 91 -111 -308 211 -130 -38 288 -93 -62 132 -166 54 -27 -13 129 -27 -202
4921 -202 107 -107 -29 204 -203 -8 89 -82 68 55 -217 129 -48 -165 228 -177 -81 91 -123 138 104 -185
4943 -185 145 102 -172 101 -133 -29 142 -151 -56 192 -245 17 150 -111 312 107 -239 229 -64 -33 48
4964 48 -56 -71 82 -260 90 18 -389 90 -94 -112 133 -37 -3 141 -40 0 115 -102 162 68 -73 150
4986 150 -41 -212 236 -14 -18 228 -97 29 55 -215 184 -2 -186 180 73 -138 140 -138 -104 203 -196
5007 -196 72 48 -85 76 12 -83 204 -122 -167 101 -48 -75 -9 -90 81 -3 -110 199 -81 -194 325 -125 -69
5030 -69 185 -76 20 167 -80 80 -71 -90 229 -163 -215 204 -253 -198 298 -33 -10 177 3 54 -62 -61 330
5053 330 -152 -97 340 -60 -177 207 -109 -134 -18 -93 71 -129 -65 348 -151 -28 326 -202 -127 190 -218 -84
5075h4P4P1M5k30J13L61o03J12M99m66J07J21j60L1n9l4K55k74J71K32m70P3L45
5098B30l94J20K89m04J40r5J43P4k97K30J12m41K23L51o07J83L19k32P7j12N7
5119c4K11l95J44K97m48K15K55m72M3L19j98R0q1O3K79m99J90L18n37K17K88n05
5141b40K67J08k52J76k13K92J67n15K19J88n45K81K32m36L01p0L9M0k15K50M9
5162A23l41L09L00p36K61L04l93Q9O9M7J16k81L07m6m14M29K01m31L3L68m70N4
5184a02L8J28M8l09K93J29n78L95K62n94K35L45m26J45j0J2k2k77N23n7m49L77
5206A06J98n25K44K34l27L8J51l8k4l56M70rn54O27nm99L10J36k91J18%J04L6
5229A44l30K51J09n17M84R1n58L41J02k71J10P1M7J40l57K97l4m69M82L6m44K98
$$ plain form
5075 -84 -10 61 106 -124 -11 350 -253 -141 358 -108 -1 120 -40 -9 -68 -102 153 -121 50 282 -188 -115 230
5098 230 -164 -44 245 -159 -19 -114 29 103 -194 36 148 -293 -70 281 -326 -143 176 -56 21 -91 -34
5119 -34 177 -218 -74 223 -225 -10 245 -227 -184 135 -63 27 -54 9 288 -211 -21 297 -240 -23 265 -240
5141 -240 27 135 -117 59 -154 138 305 -210 9 197 -348 -67 165 -271 30 -40 -1 39 -176 74 123
5162 123 -218 91 391 -345 -84 220 -173 -84 -15 32 148 -133 174 128 -286 143 344 -87 -54 314 -156 -102
5184 -102 -64 64 112 -197 96 225 -353 42 304 -290 -55 290 -136 9 -1 11 -11 -288 235 178 -271 106
5206 106 304 -221 23 257 -70 -32 119 81 57 -299 171 162 -392 235 230 -269 41 177 -114 4 4 108 144
5229 144 -186 65 174 -343 141 232 -326 15 117 -154 -44 27 74 214 -143 154 120 -349 133 169 -275 23
5251B3J09k66K47j27J45r5k03K95l2m07L44Q9l02K62k1j09J08j25J61j1k71L68
5273A82qm98L27R1k83K82j36M6J16l48K36J1l20K97J86l09J94J4l20M01j68J15
5295A08O4l07K84m1n25N22L2l54L28O7l94J73j1Q7k2k56L21M2m46N11q1l52L23
5318G3j26n9J69j56J74Lk61M55k18l04O23k36l73L75j32p2J53l5P1l1j68L48k36
5341C7l10N62k31k99L99k10J4J81l77K87L4l34M38j02k50L28j93j89J98L3j8k8
5363c0o5J85n3k33M23k59j71M57k42j89L98l29O2R0j55J96n8j44K42j00k04L85
5385B06k93M5L02m10J79O6k47K97k9k86L45j79j48K81k91J05J65k62J24J97l47
5406a80J89l0j02K53k79JK23j27rJ65l34J40J53j91K03oj65J56m9j82L32k48J40
$$ plain form
5251 23 132 -134 113 -14 131 36 -167 128 96 -311 33 122 -180 82 61 -48 60 -65 96 85 -186 182
5273 182 174 -324 3 94 -189 93 -43 3 119 -229 7 18 -302 -5 181 -128 66 80 -240 161 -7 108
5295 108 172 -135 149 108 -417 105 137 -217 111 178 -216 -43 -54 33 11 -245 76 118 -328 183 102 -250 73
5318 73 -53 -112 57 -99 75 78 -183 272 54 -250 373 137 -236 139 7 -65 88 53 124 93 -75 273 37
5341 37 -273 289 58 -241 158 -52 -38 143 -234 53 87 -247 191 89 -161 167 -26 -215 -17 16 -2 -30
5363 -30 -95 90 37 -196 227 -32 -203 254 12 -177 221 -108 -46 44 -111 85 27 -117 125 25 -179 206
5385 206 -87 -42 260 -150 29 95 -152 145 116 -170 175 -4 -152 129 -162 -57 108 -154 -30 167 -180
5406 -180 9 -21 -123 130 -149 -148 75 -52 -61 104 -230 -90 63 -128 75 69 -96 60 11 -171 161 -87 53
5429E3J30m25L04R3k43L21j50k06K33k04N7K35l36J51J22k49K25j9k40K72j08
5450A6j95L50k11j0L12m17K83o2j57J99k2j75K97k30j03K50j19L6J07k08Q1M5
5472F7j34L25l43k3K88m7l63L97k73o0L03l00J74Ok41L12o1k48N10l80j5L04l22
5495a24L4L39k71J22p0j44L81k87k16N29k99r4L50m54K38P0j96J32j52j9M99n32
5517a64Q0K74l50K6L91l33l9J99o8k4N3j52L17l31K3M25n27P9K84l59J77Q3k59
5540a95L23k65J46J44k20N3K68m52J86K41m23J17P2j21J65j30L1J72l51K02L23
5561B86m35J69J74l10J59J9j89J51j18J03K52m50N0L81m39K33J13k47J12m2l2
5582f0K17k91R5J30l12K36J41n02L34J20k20R8K6J2J4o5J6J82l35P5L55n21J93
$$ plain form
5429 53 183 -242 62 155 -88 233 83 -123 110 -94 -37 198 -138 13 135 -114 111 92 -148 124 16
5450 16 -179 171 -40 -50 262 -155 128 66 -91 108 86 -89 208 -22 -125 125 6 42 149 -59 22 67
5472 67 -67 258 -85 -108 180 133 -230 167 -106 -166 137 -163 11 17 -224 88 27 -221 289 -91 -106 198 -124
5495 -124 -90 249 -22 100 30 -114 267 -20 -236 293 -6 -100 250 -204 34 104 -92 40 -112 -131 368 -164
5517 -164 -84 190 -160 -134 257 -76 -115 84 16 -8 45 -107 210 -121 -98 327 -200 -121 163 -196 -19 64 -195
5540 -195 128 -137 9 153 -67 -14 254 -198 -12 229 -194 -77 -5 -126 39 -91 -60 112 -239 -37 286
5561 286 -149 20 194 -116 43 62 -127 24 -94 9 261 -189 -139 242 -197 36 149 -98 14 -28 -60
5582 -60 157 -134 -39 91 -221 15 156 -346 -12 108 -112 -14 12 24 38 -27 -11 171 -164 -89 266 -255 -62
5605f2L52m83J69m5J58J59n28K71K77m26Q4L71n22J34K08k09Q7j69K02J77m28
5626b23K29J73o09M61J70m09J41J11k03J93k33K98J06n78M20J03l41J84K59m27
5646a75J85P2K4m6l09K97J01m29L36K37n64K06J93l57J57J09N4j08j37K37m0n10
5668d67N20K05m93K96J63k61oL4%M2j07K70n1n21M50J42n27M70K1l06N1Q2J1m2
5692b4k38M88r3l78L99M1o08L62L22l77J71k4L5j24k42L28O3l75M43Ol91K18N7
5715E9k05J25P8L8m7k47K90p1l51N22R0n12M01j59j32J87j71K32P2l15J46o6l15
5738c51L69K12m11L81j74l9p2m5L01j22k86M85k78l27K77Q1k04L37m7n5M0k94
5760b22K34Q1l33M90p0m81M43l8k52J95J8k5O9k01K46j52m46O11k9l23L10j50
$$ plain form
5605 -62 290 -193 -24 -69 89 248 -280 -9 268 -158 -74 297 -225 -91 117 -92 -5 -174 28 205 -223
5626 -223 6 179 -430 31 201 -208 -67 44 -159 34 -199 99 205 -373 47 150 -191 -7 252 -175
5646 -175 10 82 106 60 -249 48 149 -280 56 293 -271 -65 128 -229 -72 37 91 -17 -154 83 43 -467
5668 -467 53 258 -235 61 224 -37 -43 -9 -9 33 -74 196 145 -376 74 216 -311 159 180 -126 -75 7 18 -24
5692 -24 -262 226 133 -245 154 195 -413 -51 271 -106 65 41 76 -48 -290 38 101 -274 169 175 -216 2 59
5715 59 -146 -21 57 95 48 -199 91 20 -331 191 281 -231 170 11 -121 66 -105 127 199 -116 30 -36 -351
5738 -351 18 230 -181 200 26 -13 -85 -130 171 49 -237 248 -30 -357 -80 1 -203 134 87 32 72 -222
5760 -222 12 93 -240 250 180 -301 142 104 -148 47 65 40 109 -92 154 2 -444 167 138 -185 125 -25
5782b5k76K62qP0N5j89L13j99j76K41O1m15M02O9k47J52j14J20k12j29L69Lm86
5805c59N66j59l18L80K9j38J37j11l1J9j49K89p0k87L86j42j81L69k40k3P5j60
5827a18K00k31j5L76j54l10N15k05k25L63j66m2J46j90Q6j11M7J61k09r4M48k45
5849B7j85L15j83j6J35j58P0K7k00L71k52j35L71k83p1K13k41R1J73r7R8n7j69
5872a56K86j97j06L19k19N0K23k85p0K11k20K30m2j74K88j52p6K56l32J94J18
5893A46l36K71jk63K83j44L5K03k31o8K79r5n8J02k32J78j1j99L49k91j8J23p0
5916d8o1M00l92L2J99l11K81j68m1L71k05k55K41j08M6N3k29K50j4k01L13j82
5938b9q0K92k14j64M33k28n4K79m03K56N0l31L41j68n9J74k24jL40k29j14K35
$$ plain form
5782 -25 -301 -39 -47 23 78 -111 202 3 -173 68 129 -286 116 185 -62 90 -24 96 -116 -245 124 127 -359
5805 -359 207 48 -270 110 139 1 138 27 -4 15 -134 155 85 -202 184 42 -139 230 -10 -33 42 -118
5827 -118 82 -149 -164 212 58 -252 263 58 -167 196 30 -12 134 -56 30 -81 -34 127 -82 -176 272 27
5849 27 -158 157 -26 -42 93 -65 5 32 -168 203 -49 -184 187 -96 -167 46 -195 -104 69 -28 70 13 -156
5872 -156 130 -67 -173 146 -73 -23 200 -85 -155 56 -164 66 24 -150 138 -14 -90 166 -166 28 146
5893 146 -190 81 80 -183 100 -44 -9 194 -37 -105 174 79 21 123 -109 69 58 -141 208 -83 -101 22 -48
5916 -48 -109 291 -101 -69 130 -181 100 -68 -109 262 57 -198 43 -65 -19 34 -195 55 41 -160 153 -29
5938 -29 -109 183 -31 -195 238 10 -44 235 -168 88 138 -193 148 -20 -79 95 -129 -130 210 -19 -133 102
5960A02k24J81j17m5L16k99j01L10j49L0J33k20pJ64k02K29k7j11J43j99J6L21
5982B44l75R1K80l65N0K69k21J93j93m7K56k76O6K75l77J4K93l62J95P8j06K3
6004Ej02K5K19k46j9J83q2o4K18l10J33J75j93K23k86J13J36l14P6L83l96J02
6026b1K21l65L28j47n3J27n0j44J87k54J53K33l45N4K36l18K13l1p2J16j68Q1
6048a9R1l26J7L57k43J99R0k20N6J46j75J74j22o1K58m02K08J41l90K37J0j94
6070a68K02o1j1R0k95K14K77l64J53K40m41J24J47j88J65k4j31K45l30J92N5l56
6092b65L46J24l80J65J27j95J9M3J21j1k44J48K11m87K92J79k79J34o3p7N0r1
6114a33Q2J75k74K43J25m99K63J22k29J79O3j54J28k28J70L2l11M44j51j86K27
$$ plain form
5960 102 -122 59 -58 -103 213 -86 -187 123 -26 4 137 -83 -90 74 -128 101 74 -37 106 -93 -77 244
5982 244 -131 -40 240 -125 -75 194 -27 166 -27 -74 182 -94 -28 247 -130 -116 177 -185 10 88 -18 5
6004 5 -97 -72 147 -99 -118 65 -17 -81 137 -173 -40 135 -58 165 -121 -8 128 -186 -110 273 -123 -21
6026 -21 200 -165 163 16 -37 90 40 -104 83 -171 -18 215 -130 -76 160 -158 55 24 -48 68 -100 -19
6048 -19 72 -254 -237 120 -123 76 166 -54 2 148 -27 147 25 -36 222 -180 28 169 -221 16 26 -168
6070 -168 34 -27 -38 52 -243 -29 248 -116 37 277 -164 -40 107 -81 84 60 -71 174 -156 36 91 -265
6092 -265 81 205 -175 -10 117 -78 -59 -16 105 94 -150 -2 209 -278 14 193 -86 48 -15 -92 -42 -133
6114 -133 -51 124 -150 93 218 -281 -18 104 -125 54 117 -37 91 -137 33 65 -246 198 47 -139 88
6135H8K5l62J58J99j76J46k04J23K3k08K43N6j49O2J82m69K24J94r9Rq3J51j51
6158a8k17L44q4k96N37j44k28O6P7j35N8r0K96M5m03L35j06l17M00L6l17J84K9
6181E2o9K0j79K92j01j93L62q5m18M06J9k31K25O3k3l6k46L16j72k23N00p4l59
6204a54J59M5k92K40J5J66k32q6K86j02k57M13j97j81K22P0k79J64j06N1P7j67
6226a45L21k20j17L12l8l16K78m7j06J09Jo2J65k91L40j20k19K33q2k38K70M2
6248G0j97N6l3K02j25k04L74n1k93L16j10j63K56j20oj5L8J58j79k26M26j69k57
6271b52M06n9k70K37L3j53j9p4M38k17k07M36l22k73N85k50j63J21j22K53q5r8
6293e5K86k67k40N51l32p7K73j47k8M1p1P5o3k1K48l52KM47l45k17N05k23l9J20
$$ plain form
6135 88 113 -249 -91 108 -68 78 -126 -3 20 -188 55 111 -38 24 206 -263 -39 155 56 65 -18 133 -18
6158 -18 -235 109 25 -271 266 122 -106 -40 37 -98 -40 -130 166 211 -192 143 37 -280 120 156 -161 23 52
6181 52 -17 3 -176 116 15 -178 184 99 -319 87 106 -125 100 163 140 104 -142 174 2 -221 279 205 -154
6204 -154 5 50 -242 -2 13 179 -53 -139 147 45 -212 201 4 -177 45 115 -164 0 -106 -55 22 -145
6226 -145 176 -44 -161 151 113 -203 75 28 -78 31 32 -30 135 -156 184 64 -155 78 -4 -242 28 70
6248 70 -127 -71 -104 98 -27 -231 143 92 -201 115 5 -158 98 -22 -28 -43 -5 153 -26 -252 174 5 -252
6271 -252 154 95 -175 62 95 -58 -77 -151 287 70 -137 299 -23 -296 289 39 -124 -3 -125 128 43 -55
6293 -55 231 -36 -276 275 -57 -134 139 -8 -36 5 -66 9 -54 -75 173 -179 -177 270 -75 -292 213 -10 -49 71
6317G1q7J38j74n9L32l66o5M50l13r4K79j27l1K39l37J96l6q8K34k30l9L16j63
6340D6j59L22k39RJ49k94K55j63J8J34k54R8J56k38N4L33k07j12J63l14L87j32
6362A2q6K36k47r5L50l03J05K38l12J29J04k32L16k64r3L16k45K5J98m58J76K33
6384A03l16J95L1k79L05l4n1K71l04K6K23j72jJ23l08K66o8k22L91j82r9L27k78
6407e3M4R9k38J69K3o9J22qj78L12j95j03L12k19n6K27k25R0o9l0K90l71P1K47
6431A92k78M3Q7j06J41K7j46J78o2k38L12k28nK34l86J43K59k71N5J73k41J43
6453B6p3j09M08k55j34L57l72k0L82l02J3J92j75L4OJ4P9j30l7K35k42N0K47l24
6477a30J91J15k67K32j53m3J08j49R0J16l45K38Q2k81L00J7l16J68l8j03L25l41
$$ plain form
6317 71 -16 122 -52 -111 221 -145 -210 240 -73 -167 112 -15 -46 193 -144 52 16 -72 162 -68 -107 209 46
6340 46 -113 209 -30 -21 128 -166 89 -74 -56 78 -176 -78 78 -160 -106 227 20 -92 71 -243 144 12
6362 12 -74 162 -85 -180 170 -133 -28 210 -102 27 131 -101 215 -49 -142 174 -71 -46 152 -306 -130 103
6384 103 -213 -18 13 -266 39 5 -46 225 -79 -53 170 -2 -3 120 -188 78 10 -212 179 -3 -102 225 -53
6407 -53 -9 90 -148 21 44 -25 97 89 -89 223 28 -75 237 18 -38 189 -36 54 -15 -45 245 -126 -55 192
6431 192 -86 -43 44 -62 79 106 -40 138 76 -162 150 -78 -83 151 -235 -92 167 -104 -49 124 -117 26
6453 26 -47 -156 252 -3 -137 220 -152 -172 210 -92 -79 113 -62 -28 -22 -8 71 -59 -96 139 -103 -53 194 -130
6477 -130 61 176 -91 141 -12 -55 53 -96 -6 110 -235 3 85 -196 104 121 -195 -27 -65 -168 157 -184
6499a84J52R1k88J92Q4k42K35P9k66J63o7k0J72k02J12rk37K44J07k48K12L9k10
6522i1K88l15J9J64k38J52J41k73L29K5l29K11q7p9J82j50J40j0k54J68R4l32
6544b45K27N8j30J67k4o8K40k99Q9K41l46J07J13l09J01M1q8K99k55K9O2j07P0
6567b7J86l32J94J89l95L24n0k27K33r3k38L08k53K15J16m08K89m0j57K22J13
6588A69k57J69j60J43M9k47K20j08j85K83J00l50K59k9j01J64k27J38M9k15K73
6609A37j44k13L16mm36L82J57j73J08k07J17O1l95M51p3m12N25j38j84J71q0N8
6631B4Qr0K25j44j76K61r4k80N47j65k42K60p1j82N3QJ99k3k44K84j10m60N25
6654A13n5p3m6J14k00J20m0J78R6m01N07j83l14L67j64j17K23j01o9J68l68L09
$$ plain form
6499 -184 -32 59 -229 -37 47 -195 40 119 -147 16 -51 -71 101 -101 11 2 -235 9 116 -132 80 119 -91
6522 -91 197 -118 -99 65 -173 -21 120 -153 176 201 -128 83 -4 -83 99 -51 89 79 -175 -7 87 -245
6544 -245 -18 40 -90 77 53 -15 225 -74 15 256 -90 17 130 -179 -78 -37 -125 174 -81 -52 10 -97 -27
6567 -27 159 -173 21 210 -185 139 89 -138 95 2 -236 72 -181 34 150 -258 31 -9 -166 56 169
6588 169 -88 81 -79 64 113 -134 86 -22 -207 76 176 -174 85 56 -45 119 -108 30 79 -136 137
6609 137 -7 -220 96 92 -344 38 195 22 130 -77 40 101 -294 157 84 -328 197 59 -125 46 -34 24
6631 24 32 -58 167 23 -153 108 14 -266 281 116 -126 134 63 -119 -66 -58 141 118 -126 158 48 -412 113
6654 113 58 -15 -61 53 -147 -27 -67 111 207 -194 313 130 -184 183 19 -98 125 24 -45 123 -245 64
6676F4j02j27M23l53j03K79j2j35M6Q2%l9m6P5j85l6L61pm02L99j68j36J58k1
6700A5J1l5j44M31k67k68L95j50j84L49j67q5K17j64J54p8k65M02j13k10L96k80
6722d0m8K25j39o1j9J33n1q5j47M03r7k01L78k49k49K74q0k3J88o1J20j89j90
6745b08L37p8k13M80j92k10J52j96J35P6m3J29k08l9L21l30m1K68j89o4K46k49
6767a16J27j4j52M02l12M6K21l33p3M73l33K5R9q9P2j55N6J91j24j74L62k26j74
6790b01L67k29p3J44qOqJ6K51m33R7J91j66m6L97l47k22L23j62J89k28j6L71j92
6814B1j47L28k64l1K24k69J22J49k71K35k31p7M43l51j3J89r8LJ63k56M5Q8j49
6837a47K15j49n4L04j39j78L67l85J60J82k16P6J6j57Q0r0L6L32l61jQ1l5N9L7
$$ plain form
6676 64 -38 -165 258 -95 -198 81 69 -66 -20 62 62 23 -23 52 -133 -169 192 185 -217 182 14 -122 36 15
6700 15 26 -9 -153 278 11 -257 138 -12 -196 153 -14 -99 118 -46 108 30 -235 167 54 -156 240 -40
6722 -40 -88 137 -2 -63 -82 51 0 -85 -232 171 74 -127 251 2 -247 27 -53 -76 112 51 171 -18 -208
6745 -208 129 51 -162 318 126 -84 68 -128 7 83 40 169 -39 -78 243 -87 -128 140 -49 -113 133 -116
6767 -116 11 -3 -155 247 -65 -19 202 -131 -204 269 -64 -39 60 -29 43 -112 -56 135 11 -163 199 -27 -201
6790 -201 166 -63 -136 8 0 6 -2 14 265 -168 -71 120 -46 -92 305 -42 -264 59 -103 86 -142 -158 213 21
6814 21 -126 202 -62 -93 131 -138 -16 133 -138 97 -134 -211 232 -119 -132 57 -41 -38 125 -131 -86 2 -147
6837 -147 68 -81 -135 169 30 -148 219 -166 -6 176 -40 36 52 -105 -25 -115 -79 253 -108 -109 -28 -63 -4 33
6861C3j67K06r9l5J94k97J71J07k71J08P8j63J05J35p2N6m9j54K97k77K2K06k32
6884i8M7J04j92J25qL5J72k47O0J15j70kL21m41J20L16m90K48j02k3J62n3k5J25
6908I9j08n7K07j86n8K11k33J30Jp8J74j54OR0o4J68J28l42J40J2j96K35r3j62
6932a30L03j50PJ57l40K38P9k54R0R4k12J48l3j44K45k43K1J99j47R8Q0k93K39
6955E2M6l12L31j96k8K40j09o6J91k64K23q1p5P6L0j83K53j07m3K28l39Q0J80
6978A27l29K05J24l08J96Qj54K64j76k6R3j12j7J58k05L10j44j69K39o9j38J50
7000B7K2j04J97k23N5J14j97J60mk33J82Pj06K73k68O5J97l03J48R6j61J41j27
7023d2n3J63j82L6J55j86J23j2j56J24M3j81K15j5m7J59j72L7L4k83K95J52m00
$$ plain form
6861 33 -134 72 -27 -62 132 -165 6 113 -158 -50 28 -135 -30 105 33 89 40 -114 183 -94 -72 134 -98
6884 -98 -51 53 -139 -14 -22 13 185 -62 -2 113 -57 -59 262 -179 -59 257 -233 15 -87 -110 52 -1 -26 99
6908 99 -9 -66 141 -45 -103 108 -125 5 6 -72 102 -52 -46 44 -20 148 276 -66 74 86 -110 125 32 -130
6932 -130 173 23 30 187 -153 85 164 -90 0 94 -118 30 -3 -147 98 -145 -124 75 -72 26 106 -187 52
6955 52 98 -214 117 -79 -107 133 24 -42 149 -115 108 27 -48 28 58 -125 128 21 -22 206 -133 -53 127
6978 127 -202 3 127 -181 15 23 -131 133 -43 -69 24 -88 -105 53 -152 158 14 -155 84 15 -123 27
7000 27 49 -55 142 -81 -26 88 -109 51 47 -186 -4 3 -103 170 -98 -33 164 -139 9 105 -56 85 -42
7023 -42 -95 68 -114 -78 77 -109 14 2 -154 -30 13 -168 47 32 -15 144 -28 9 43 -240 55 207 -193
7046a93L08R1k04J15j67L1J48k65Q7J71l55K70M1k96L88j1l09K25q0p7Q2l2J67
7069A35j00j06J06P6k19J76L0k99K21j8q4J51k00J92L2k23K87j46k26L48k1k84
7091a72K35q3nO9j80J86l4j21J92j00j79L61j36j72K16n2p0Q5j07J31l8k55M17
7114A88j69k16K49n0j54K74j34k29J47L4J25n5j59M00j43l79M40j35j27K80k59
7135g2M2J9j02J32K7j75K86k29j55M00j88p8J85j21JO4j80J88j06j23M17k00j91
7158a59K56k32pK52Lp5qj12K76k20r8K83j26k96L95o4k26K76k01J66N9k38K27
7181A31k37j48L57j08o7K84j31j25J07j80J29J05k11L66l71J8J45j18p5K84n8
7202I7p2Q5j28R4j82rL28l00r3L95l08j50M61k16j36J59L0J68j86j96L06q6k97
$$ plain form
7046 -193 115 206 2 117 -50 -19 129 -136 -49 122 -233 37 78 -218 170 159 -150 75 -5 -82 0 -32 135
7069 135 35 -71 35 111 -108 68 98 -201 20 2 -82 69 -131 61 93 -130 157 11 -215 133 112 -172
7091 -172 63 -20 -25 44 -136 50 16 -105 87 -13 -192 169 33 -139 77 25 -45 40 -67 64 26 -229 188
7114 188 19 -197 52 2 -152 122 -12 -241 -94 -60 65 10 -149 251 108 -271 169 34 -93 187 -72
7135 -72 -30 -11 -113 19 46 -129 157 -72 -227 173 -15 -93 92 -29 -28 36 -144 44 -62 -185 232 32 -159
7158 -159 97 -135 -142 110 113 38 30 -82 194 -26 -124 159 33 -263 132 68 -158 118 -83 83 142 -96 131
7181 131 -106 -254 103 -5 -72 212 81 -44 63 -117 12 117 -94 272 -99 -81 64 -54 -129 155 97
7202 97 25 110 -18 76 -106 -115 213 -87 -180 215 -93 -243 218 2 -134 25 55 223 37 -159 147 61 -236
7225b36L75j65j23K10j20J3mq3K59n5j64K29k43Q0K11j94n0K57k39r9Q4J5J67
7248A25k15KL78m05LJ82j58l2K24k57J70j0j31J91j45Q6J86k97K5K41l27N9J63
7271E8N5j23q8qL30m57J92K13l35NK74j80q4L33k87J44mm5N2j45n6M19m56J56
7295c7K26l14N1J75k39J94j13m1K25k87K42P0k34M3K89k91l1K18j96J43m1j73
7317a21K22k33J27J91k41lK00k58J38O3j57J19j06M2J34k20j0L38l96J70O1j34
7339g4K10j77K3K21l08J38J12l14K1K70l62L26o5j73K49j32o1J68j52N6J47k42
7361a19R8K85m45Q1P9j20K55j39j01K56j82K4K37l74K42M3k90K30np0O5j13O4
7384AP7j42O8J03l02J90P5k39R5L2MJ46q3j54L65l28J47J46k53K02n1k76J39M3
$$ plain form
7225 -236 139 -26 -149 61 -59 -46 -50 -133 126 71 -93 136 -107 -27 184 -10 -60 197 -42 -141 -57 -42 125
7248 125 -90 -88 290 -115 -112 70 -88 -120 104 -153 17 7 -124 67 -78 8 194 -103 -78 163 -164 -105 58
7271 58 113 -10 -98 -106 224 -233 -41 172 -163 -158 116 -64 -148 185 -102 42 38 -7 45 -100 -156 263 -193 -37
7295 -37 189 -125 -74 101 -138 56 -57 -98 127 -160 82 152 -82 -39 250 -41 -72 146 -50 93 52 -121
7317 -121 101 -132 -5 186 -55 -58 142 -116 22 85 -72 47 -59 -17 117 -103 -113 225 -171 -1 60 -74
7339 -74 136 -41 -18 203 -105 33 145 -169 -148 122 -240 86 21 -152 97 -35 -96 72 -80 -24 123 -119
7361 -119 -21 264 -181 -100 -21 -141 114 -25 -126 130 -52 -28 209 -165 77 120 -170 60 55 -15 50 -63 1
7384 1 78 -64 4 107 -195 -5 70 -169 -74 -42 -38 108 25 -129 236 -92 55 201 -52 150 99 -177 -38 5
7408Ej38K54k56P3K06l11K15J26k83J64J8k63K79j79K0J20k50L27M1l83K42R7
7430A24k92L10k15L4K67k46o5J22j74J23J34k11J05P0k61K36m2q2J24m7Nj0j52
7453a43P0J57j99J21J36l80K62l3q2K93k54N6N9k44J44J22k22K32j09j06J63j28
7475h5m1K96k73K2M3QR6J4j55J91j15q7J13p8k5J58p3j9M6L7M3k3j79J57j06k9
7501f4J28k10nL26k83J05P3j77Q2J53k44K20mk00K97l44O6J30j58R6J49k92K87
7524A31m7k19K90r1j91K83j84r9J78j56J88o3j75K62m1k28L18p6k37K35k47J51
7546a8j1j03J24J04j22Q5Lr5J25j65j29L02p6K7P1j26R9q5j81J50Jj07J95j63
7570i5K6J99j83Q5l4j14L10k51j49M35j48k90L26j95k9K66j76Q1p8j25K69j86
$$ plain form
7408 5 -133 121 -135 -62 144 -167 48 174 -109 55 73 -190 89 -90 -70 50 -200 127 168 -215 27 124
7430 124 -168 142 -73 -39 228 -18 -83 39 -135 -12 122 -89 16 86 -175 61 19 -63 61 14 19 9 -143
7453 -143 -73 84 -115 6 142 -238 24 -9 -91 202 -52 4 63 -181 -37 85 -137 95 -14 -120 43 -85
7475 -85 -126 170 -103 -81 -38 -30 66 80 -75 116 1 -86 27 -51 -76 82 9 -10 36 73 116 93 -86 71 -35 -64
7501 -64 64 -146 -151 175 -108 -3 70 -107 -25 128 -116 104 100 -100 197 -147 -81 49 -109 -13 136 -156 131
7524 131 84 -135 155 64 -127 156 -28 -127 51 -105 83 20 -155 107 66 -162 156 80 -157 78 -169 -18
7546 -18 -29 -132 -8 96 -26 59 62 -33 92 -73 -202 100 24 51 122 -4 95 10 -171 -21 -20 -127 68 -95
7570 -95 -69 130 -53 32 -2 -116 194 -57 -206 229 81 -209 117 -78 -107 159 -17 64 -14 -139 130 -56
7592e6j29L59j88k23K45n8j10L05k03J99o9j35K89k06j20J99j06r3K38k50M8K2
7614d2RQ9j8r7J99k56j0K86k23jL18k30q3J12j87J59l6q1K93k13j36K13n7q3L34
7639B59l64J49M2k28K27j39p9L58j82p9K39k24oK4j6P4q0p7K22k25j27M65l03
7662g0m4K81k08L9M7j89K58j4k17L52k99n2L18k02m5K47l46R5N3j52K10j56J09
7685A5J45k06j42L53l15L5K73k59J00J59k66J46n7j28K27j26m8M18l46j42K97
7706A33l18J25N6n4J59j45K0J84k82n1K70j77r0L83k54J00P2j05P3j29n0J18k82
7729b44J86K76k52J3J51j82PQ8p0J23j66J22P9k89J31K63m23K22R3l02K13Qr7
7752e0J57j71N1J82k76J34J55m17J36J00j77J30n8R3J08k52J58K53m89K04O7j10
$$ plain form
7592 -56 -185 174 -14 -237 8 -50 -160 145 -58 141 72 -63 226 20 -100 99 -7 -100 138 -112 -64 -42
7614 -42 -33 56 38 -59 140 -116 -126 160 -63 -64 254 24 -59 53 -134 25 -11 -92 201 -12 -148 65 8 -75 259
7639 259 -105 44 86 -142 85 -54 -133 225 43 -36 203 -21 -27 -3 -19 55 -25 -102 120 -105 -232 233 -70
7662 -70 -114 167 -41 -2 45 -144 114 100 -117 235 -64 -116 202 0 -45 202 -144 -49 4 -148 62 -94 15
7685 15 160 -46 -188 165 -150 -115 158 -101 -1 158 -108 38 -19 -147 80 -46 -94 324 -22 -164 133
7706 133 -185 -60 -4 -58 101 -44 -24 160 -122 -173 97 -80 -170 213 -41 59 131 26 99 -30 -80 38 -244
7729 -244 -58 218 -34 -21 130 -52 -45 43 -27 96 -70 52 131 -158 -27 236 -187 35 128 -174 39 47 -50
7752 -50 107 -64 -13 169 -107 27 182 -235 -99 1 -176 -46 -104 -11 97 -155 3 256 -233 -29 38 -72
7774g2O1k9m6J18r0R8J32l01M3J34k11J51Q7k52K27Oj31J18j48K4J58k69J69K10
7798A87k66J38P5k67J75O8j44P5j12J36m2j31P6J18k30J43O7j82J88l8p8K85k92
7821e1kL52m67K32M4k39R1Q1r8lk4J15M0j66P3K92m10J85Q0k67Q6P5o7Q6k9j9
7847a0J47k86J27J55k36Q8M6p1J34j68l7J27r2LJ59j75K5J87k77K93m6k80K02
7870A5N5j14K01k56P5J05j68L2J56k82K38N2j87J54j48R3K7j40Q7K10k88J1J59
7893H7m05M54m4k27J28m8N3P7k38O7K14j86P6J22k75K26n2j31K55r3J8J9j18N6
7917C5J32l85L39l1o1J53k26j95K54j15L4J59k13J56o9j27J81J6r8J39j4k36J90
7940A8o5L3J06j12L0K1m8O5j00n5J98k12p9J38m1O9J37j94J56n4K2J75k24j62
$$ plain form
7774 -72 -11 -40 -86 32 -58 40 172 -129 -86 48 -163 -12 75 -177 50 56 -75 43 -105 -81 77 -192 -23 187
7798 187 -79 59 134 -133 42 110 -34 41 -71 65 23 -108 -32 86 -144 -1 66 -116 72 34 -44 241 -51
7821 -51 -53 299 -168 64 108 -131 -40 41 -57 -60 -84 31 71 -95 -22 270 -140 45 125 -142 -56 19 -48 38 9 -10
7847 -10 137 -149 -22 133 -103 -15 31 -40 94 -74 -111 16 -76 -73 86 -89 -64 123 -154 139 93 -187 15
7870 15 70 -44 157 -99 -24 81 -87 -55 101 -181 57 109 -78 76 -72 21 48 -92 -5 205 -83 -72 87
7893 87 -318 136 92 -135 -7 -55 -2 75 -163 -96 118 -68 8 130 -145 81 29 -102 153 60 78 97 -21 35
7917 35 167 -218 121 90 29 182 -44 -239 15 -100 -66 93 -120 36 -33 -160 21 37 -61 78 64 -172 18
7940 18 -47 -14 92 -20 10 31 -17 48 -52 -107 91 -121 -200 -62 -103 -34 103 -91 65 11 33 208 -16 -178
7964a78K88n4o7j8J4n9K30k47K0R1k58L33m5j79L36k09l6P9j73J89q6k22L76n0
7988G5k14K05j82m2L22k94J78P3k44J16Q2j55K23j93k0J53r3q4K52k38L6J64k04
8011h4J38j9j70J54m1p4R3j02PK79j66r7K0q6J98n7p0J63k9j82L42k11j10J86
8035H2j29j2N6j14J77q9p5L07j88k30L43j31L3K0j67J61kj77J97k4k01K63j81
8058h1q4K76k73J32J27k42J33Lj12J78Rj38K70l06k6K66j87r1K82j96J18qk03
8081a53K27m6p3J94k42J6L18l54J27J29j93Q3lj53K59j75m2J86j02o6J72k50J08
8104c3K17l71J12RM2j4K4l9J35r8Q1J08k37M1Q6j61R8N4n3J64j49r9K16k55J44
8129B2J02j72J04M1k06Q7L2j60K59Nj39K33k49M4J14k59J86j05K8R6j3j12J11
$$ plain form
7964 -178 110 56 -11 -29 -15 -74 156 -91 -71 20 -238 95 50 -129 207 -2 -38 41 -132 57 -29 -251 125 75
7988 75 -139 66 -116 -158 164 -130 48 121 -123 -7 75 -80 143 -50 -70 83 -10 -94 158 -80 -44 120 -84
8011 -84 54 35 -135 19 -22 -96 -3 -105 -98 181 15 -82 -62 -148 50 -7 -77 86 57 -125 217 6 -104 82
8035 82 -47 -59 -3 -117 60 -29 -104 203 15 -215 128 -3 30 50 -117 44 42 -135 62 38 -163 100 -81
8058 -81 -165 111 -162 -30 97 -145 -12 -9 -121 57 66 -72 198 -108 -134 132 -55 -146 136 -60 58 50 -153
8081 -153 74 28 -45 149 -93 -77 241 -113 14 143 -50 33 30 -123 136 -39 -81 105 3 -63 109 -141 -33
8104 -33 184 -187 -75 -66 -24 -38 -14 -53 82 -16 65 173 -64 -23 63 -98 0 54 1 165 16 -83 133 -122 22
8129 22 124 -48 56 97 -109 -22 10 -150 109 114 -25 208 -41 3 117 -142 44 -61 -33 63 50 -62 49
8152D9j61rJ00n7K2M4o6J80k18N4K18k23K9K38m72J41L81l51K15j23r1J50n6j31
8176a37J83j16R2K65l70m0K81k04q7K23q7J31j86p4J61
$$ plain form
8152 49 -112 -121 -21 -78 -56 -12 -78 102 -116 -62 156 -67 -38 200 -272 -131 250 -101 114 -9 -100 50 -6 -137
8176 -137 46 -70 22 287 -83 -123 158 -46 -133 90 3 134 -52 -126 35
8191C5
$$ Imaginary data points
##PAGE= N=2
##DATA TABLE= (X++(I..I)), XYDATA
0@%%%%%%%%%%%%qJ6j6J6j6K4l2L4m2N6o4P2q8J04j20J37j61J85k10K42k74L08
34A63l48L94m44M97n55O21o92P70q55R47j049J159j280J410j555J715j888K080
52A090k292K528k792L089l424L807m250M770n388O138p075Q277r882J2154j5634
67h884K1697l5250J20408j7992j48485J31093m6927q5526M1785P5677m0406l9895
79c2705N1198j332j27987P4731J21761j01437k4890J08542n4611o4324M3334K4266
91A6546l7544j3142O3283j4667j20946O6229J09963q9135j3845R5438l9047o2764
103c9631O095J0305k353J1050O6837M368q6615M2669M3867r9538J4593R0029k8962
116C2714j6347K1743k1848l8848j6765M5685L559o4208N3211N3883p3482j014
$$ plain form
0 0 0 0 0 0 0 0 0 0 0 0 0 0 -8 8 -8 8 -8 16 -16 18 -24 32 -32 40 -48 56 -64 73 -88 97 -113 129 -145 163
34 163 -185 209 -235 262 -293 328 -364 406 -449 498 -551 608 -672 738 -817 898 -990 1090
52 1090 -1202 1326 -1466 1623 -1801 2006 -2244 2526 -2862 3276 -3799 4478 -5404 6750 -8884
67 -8884 12813 -22437 97971 79979 -68506 62587 15660 -69866 -28081 47596 7190 -32705
79 -32705 18493 17161 -110826 -36095 85666 -15771 -40661 67881 13270 -51054 -7720 16546
91 16546 -20998 -34140 29143 14476 -106470 -40241 69722 -19413 -33258 62180 23133 -39631
103 -39631 -33536 -23231 -25584 -14534 52303 56671 -29944 12725 56592 -42946 -28353 61676 32714
116 32714 16367 38110 16262 -22586 -39351 6334 9893 -54315 -1104 52779 -20703 -21717
128b1717M6299j5248N410n726k0063M953j5745J5082J2781l5984L8415K9186o3868
141b6225k412K4648j3383J5461O492R347J1278l8719P123J3008n4920K1308N2933
154B5939k2740l51J2319q99R071k9147k663K8038k5537Q600J9130m1302J5961
167c581K8713l5368m092J0962J675N315k1518K3514L0319m2782J3554L0620n5616
180a8285o216L3641j4998n407N283J6848R874l7959P267J9909m0430J9818K9837
193A9182m0194J7840L2117l1101j0426P233Q071l509k5844L1790K2502m4855K2850
206E656K9268m6005K221K1136j7424K76L29J0190R895k4339J2717P282l7074K2686
220c186J5413l5859K5346K5247k2326k41R02L274n201k7839K3831J4612l5416
$$ plain form
128 -21717 24582 9334 14744 9018 -11045 -6092 -21837 -6755 6026 -29958 8457 37643 -26225
141 -26225 -28637 -3989 -17372 -1911 4581 13928 25206 -13513 -6390 6618 -48302 -26994 25939
154 25939 3199 2848 15167 14268 23339 -5808 -8471 19567 -5970 2630 21760 -19542 -3581
167 -3581 25132 -10236 -14328 -3366 -1691 3624 -17894 5620 35939 -6843 6711 37331 -18285
180 -18285 -24501 9140 -5858 -11265 -5982 10866 20740 -17219 -9952 9957 -30473 -10655 19182
193 19182 -21012 -3172 28945 -2156 -12582 -5349 2722 -787 -26631 5159 27661 -17194 5656
206 5656 34924 -11081 -8860 12276 -5148 -4872 -4543 5647 15542 -8797 3920 11202 -25872 -3186
220 -3186 12227 -23632 1714 26961 4635 4394 5296 8570 3369 -24470 -639 13973 -21443
233b1443K2012J7626l1922J0044M474j4897J2173m978M445J4437j4515J3088K673
246A3217k8088K1256K134k9827K3879R429j3711R605p110L249K746k7733J4077
259f877J1880k3721J8029Q876j3613J6186q330q920J7572j3784L32J4423j3529
272a476J0926L92k3107J6660m438k1800J8144M94k149J4620j0300J0356R632k5079
286g125R978P595j8998J1879j418p371J6199j5250n825J6670j6047K153J1188
299C628j1043J6257R27j6724J8483o024j6557J2757q302O94J1425j5820J2325
312B026J0291k1598J0219L487j2678J3083o973k131J8869j5400k192J3344j5698
325e351L528L273j2610J7395k151j3809J8559n810r612R827j1333N566Q734j6599
$$ plain form
233 -21443 569 18195 -13727 -3683 791 -14106 -1933 -6911 -2466 11971 -2544 10544 13217
246 13217 -14871 6385 8519 -21308 2571 12000 -1711 7894 784 4033 6779 -20954 -6877
259 -6877 5003 -18718 -689 8187 -5426 10760 2430 -6490 11082 -2702 -2370 12053 -1476
272 -1476 9450 9842 -13265 3395 -1043 -22843 -4699 -4205 -6354 8266 -2034 8322 17954 -7125
286 -7125 2853 10448 -8550 3329 1911 -5460 10739 -4511 -10336 6334 -9713 -7560 3628
299 3628 -7415 8842 9769 -6955 11528 5504 -11053 1704 -6598 -5904 5521 -10299 2026
312 2026 12317 -9281 938 4425 -8253 4830 -2143 -4274 14595 -805 -2997 10347 -5351
325 -5351 -1823 1450 -11160 6235 4084 -9725 8834 3024 -6588 3239 -8094 -2528 6206 -10393
339a0393J3969Q609j7088J0753j143r750J1683j1652j727J5777j4029J364Q422
352D795j2717R376k253j3270K0422k450j2473J7468l067l876N749j1971Q539K513
366F785j7600J4897J644j5356J4370n355r518J3739r942j922J2314p810N778J629
380C653p895J6486r705j4882K3401o319j5900J4773k091k558K362q528J0120k202
394G15j1671J6776o028r755K0843r531r924J6866p903m918Q287k555N112n717
408E97k161J8325j7167j1859K5717j0506j4922J3556m238j832K311o344R609j919
422h33l328J4924j3181l493K1903j5192p192J7076j0131n166L268n650M314o729
436i410J272J8534j6183n982K2429j0410o689J1192m683O610J009j2486P375k101
$$ plain form
339 -10393 3576 12185 -4903 5850 4707 -5043 6640 -5012 -6739 9038 -4991 -3627 4795
352 4795 -7922 1454 -799 -14069 6353 3903 -8570 8898 5831 1955 7704 -4267 4272 6785
366 6785 -10815 4082 5726 -9630 4740 -615 -10133 3606 -6336 -8258 4056 -3754 2024 3653
380 3653 -4242 12244 2539 -12343 11058 4739 -11161 3612 1521 -1037 1325 -7203 2917 715
394 715 -10956 5820 -208 -9963 10880 1349 -8575 8291 388 -4530 3757 1202 6314 597
408 597 -1564 16761 -406 -12265 13452 2946 -11976 1580 -2658 -4490 -2179 -8523 1086 -833
422 -833 -4161 10763 -2418 -5911 15992 800 -6392 10684 553 -4613 -1345 -6995 -2681 -9410
436 -9410 -8138 10396 -5787 -11769 10660 250 -6439 4753 70 6680 7689 -4797 2578 477
450D77k643J1931j1662M14J6504j5857n622Q734o491O723Q01p803R782q576o606
465i894J6109q826l657J7207l399m510n247o855J5073n401j2913J7229l952j1019
479a0055J0762r970l513J7861N76k596m561j258J1462j5475o828K7175r033j2227
493g680J9842j0585j7096J3005J0501k24r282N458J6732k3874j3633K5155r911
506a592p393K5025j1431j8258J3981O281j0375q052J9408J6904l0824n892K7763
519A5545k3150j1766L3879p038k2159J3518Q507j5849j4399K1421J9950k5572
531g113J383K3705k9075q212L2144j3239j4427K6970R335k3520j5391K1515J0750
544A4825k9547J1394K9688l0545r156K7666j7774j5468K4090J1284j4713j1214
$$ plain form
450 477 -2166 9765 -1897 -1483 15021 -836 -6458 2276 -4215 2508 3309 -4494 5288 -3288 -9894
465 -9894 6215 -2611 -6268 10939 7540 3030 -2217 -9072 6001 600 -12313 4916 964 -10055
479 -10055 707 -9263 -12776 5085 5661 3065 -1496 -2754 8708 -6767 -13595 13580 4547 -7680
493 -7680 12162 1577 -15519 -2514 7987 7763 -1519 3939 20671 -3203 -16836 8319 -1592
506 -1592 -8985 16040 4609 -13649 332 6613 -3762 -11814 7594 24498 -6326 -12218 15545
519 15545 -7605 -19371 14508 7470 -14689 -1171 7336 -8513 -22912 -1491 18459 -7113
531 -7113 -5730 17975 -11100 -19312 12832 -407 -14834 12136 21471 -2049 -17440 4075 14825
544 14825 -14722 -3328 26360 -4185 -13341 14325 -3449 -18917 5173 16457 1744 -9470
556i470J6140N076k5950J3282K2692k7789J746K3932k7385j6072K5019Q636j4646
569d789o195J9914J729l0735R859K0907k2069O916K3897k0359j0879J4106K14
582B516q926j949J6327M520k0513Q699R468k3918R489K0484j8608n640J3350J28
596E427q886p234J5371J0470j8595M320J0141j8724L571J2140j0277K309O180
609F213k363m054j1268O852R609j3026Q668J0931j7116J981Q296j0787p22M819
623a967P297J406j6141O797J2924j7665J252J4066r070j96L870n750R06j329O215
638B615M901j4553O991J0499j9105L355J5491r816R8P789l173o621o739J0413
652B145N053j8167J0432J5963j9990k059J2085q796j069N784P50j195o063Q017
$$ plain form
556 -9470 6670 11746 -14204 -922 21770 -6019 -4273 19659 -7726 -23798 1221 9857 -4789
569 -4789 -10984 8930 10659 -20076 -10217 10690 -11379 -4463 19434 -925 -11804 2302 2516
582 2516 -6410 -8359 7968 12488 -8025 674 10142 -13776 -4287 16197 -2411 -8051 5299 5427
596 5427 -3459 -10693 4678 15148 -3447 873 11014 -7710 -4139 8001 -2276 33 6213
609 6213 3850 -204 -11472 -4620 4989 -8037 631 11562 -5554 -3573 4723 -6064 -6786 -1967
623 -1967 5330 6736 -9405 -2608 10316 -7349 -6097 7969 -1101 -1297 2573 -3177 -2271 -3600 2615
638 2615 7516 -7037 -46 10453 -8652 -5297 10194 378 476 8265 5092 -1529 -8268 2145
652 2145 7198 -10969 -537 15426 -4564 -6623 5462 -3334 -4403 1381 2131 936 -5127 2890
666B890J744j7669J1750J1912k0331M104J3871j1715k354Q268K758m376p489J1535
680D898K202j9896J1414J3190j7049M003J0155j0369q79L232k00o99l403J0501
694G100J17j6139J2240O081j9516P043J0563j0217j96L914J562k631p904R787
708A804K139j5086R933O775j3020P068M769p811M022M99j290P22m618Q543L88
723D837j1613J1670K837j4712P051L996p115L074m73L097J887q332O646K473j1328
738f005P512K114q499P919r14n561N518l597p34K009o029P284P87r489J0036J528
754C879r502O231q6k871L808m765M094M154q467N599K603q356O345j175n237Q035
770D289l461k622O254n047J051J671p027O896M30q122Q695O0n829N469l783k17
$$ plain form
666 2890 4634 -13035 -1285 10627 -9704 -5600 8271 -3444 -5798 2470 5228 852 -6637 4898
680 4898 7100 -12796 -1382 11808 -5241 -1238 8917 -1452 -2331 901 701 2 -3401 7100
694 7100 7217 -8922 3318 9399 -10117 -3074 7489 -2728 -2924 990 2552 -79 -7983 1804
708 1804 3943 -11143 -1210 5565 -7455 -387 4382 -3429 593 1092 -198 524 -4094 4449 4837
723 4837 -6776 4894 7731 -6981 70 4066 -3049 25 -448 2649 4536 -3796 2850 5323 -6005
738 -6005 1507 3621 -4878 3041 2127 -3434 2084 -1513 -2247 -238 -6267 1017 1804 -7685 2351 3879
754 3879 -5623 608 522 -2349 1459 -3306 788 4942 -3525 2074 4677 -3679 2666 1491 -3746 4289
770 4289 828 -1794 4460 -587 464 2135 -4892 2004 2434 -5688 3007 3067 -2762 2707 -1076 -1293
786a293M008p595M223M371q219N196J199n720O201l653l205Q134n400k99N907
801C855n755L495J059p256P369p68o831P797j587k578M937n804K164L688q979
816e194M632L548p194N516m49l792O608n156j784O853n806J358L916n780N832
831C108l27p481P733j332n937O412k266n97M098o108L998K336q180N689J033o244
847d065O800k665l118P678n635j774N378m722K217M13m880Q249k994o543R135
862C474l187n127O996l894l7M068m737L842O06n303O416k810l622Q486o116k063
878c008R350o385k482N288k950J585k062k636Q194m974m000R056n900k130P368
893D314o613J70M981m616K660j33k775N217n113r40P518q568N41R343p985r87
$$ plain form
786 -1293 2715 -4880 -657 3714 -4505 691 1890 -3830 2371 -1282 -4487 3647 -1753 -2052 3855
801 3855 -1900 1595 2654 -4602 2767 1999 -4832 2965 1378 -1200 3737 -2067 97 3785 -5194
816 -5194 -562 2986 -4208 1308 859 -2933 3675 -1481 -3265 3588 -2218 -860 3056 -2724 3108
831 3108 2781 -4700 3033 1701 -4236 2176 -90 -687 3411 -2697 1301 3637 -4543 1146 2179 -4065
847 -4065 2735 70 -3048 4630 -1005 -2779 2599 -2123 94 507 -4373 3876 882 -5661 3474
862 3474 287 -4840 2156 -1738 -1775 2293 -2444 1398 2004 -3299 3117 307 -3315 5171 -945 -3008
878 -3008 6342 -43 -2525 2763 -187 1398 -664 -3300 4894 -80 -4080 4976 -924 -3054 4314
893 4314 -2299 -2129 2852 -1764 896 763 -2012 3205 -1908 -2848 4670 -3898 -3357 5986 -1999 -2986
909b986M854l441K431k279k200P492m679j757O318o652K141N600q622L280M173
924C673o373L749m22k917N550m080R2M570p583K911N224p176L591J731m349O189
940D380m088n404Q488j851k743L228l385L400J46p125O394j04n383P998m005n766
956e820Q389l256l316M877k110J715m32k822N458n451j666J2565q004p377J2474
971E224k599p444L823J495K113k395q99N511q084o61J2391j0277m412J5520o047
986C259q919O779Q71k695j352M853L989j2595K558J3483j5311m567J7985n391
1000B947r126O564L6l835j028N414L212j0053O295J0181j8382j220J8502q883
1014F24p010J1008l69p646j623O870R16j0875R935J1427j8943j257J5395j0190
$$ plain form
909 -2986 1868 -1573 858 -1421 -3621 3871 -808 -2565 3753 -2899 -758 4842 -3780 -500 3673
924 3673 -2700 1049 627 -2290 3260 -820 -728 3842 -3741 -830 4394 -2782 809 2540 -1809 4380
940 4380 292 -5112 3376 1525 -1218 2010 -1375 2025 2171 -4954 1440 1336 -4047 3951 -54 -5820
956 -5820 2569 -687 -4003 874 -1236 479 47 -2775 2683 -2768 -4434 8131 127 -7250 5224
971 5224 2625 -4819 -996 499 2612 217 -682 4829 -3255 -3916 8475 -1802 -6214 9306 3259
986 3259 -5660 1119 1990 -705 -2057 2796 6785 -5810 -3252 10231 -5080 -9647 8338 2947
1000 2947 -6179 385 421 -3414 -4442 972 4184 -5869 426 10607 -7775 -8995 9507 624
1014 624 -6386 4622 4253 -3393 -5016 1854 2770 -8105 1830 13257 -5686 -6943 8452 -1738
1028a738m580J1335r29m482j3L464l098r284J2185Q953j8001L456J3562j4450
1042c620m957J0869p01k768J223M065k926j1112Q724Q349j3444N593J1230j1931
1056a406k516N080m358O32L088L976j611r322O745M184j4265O488J2212q429j039
1071e41K700l857k63j409M601M106p653M480L952j2793K681P899m854L044J578
1086C671l574K79m712K518L945o824O952O536j2719j18O117l816R73R33K740K552
1102E453r248J470N247r610M615R285q315n22L722l772o50r34M441L582p745M499
1118A518M127j3173M194J0192q849m01O863j484m170l890N832L091r378O840O469
1133G781j3349K707Q055q994L81O791p33k619k689N051k26r609R267N847j3815
$$ plain form
1028 -1738 -6318 5017 4088 -394 -407 3057 -41 -9325 2860 11813 -6188 -2732 10830 -3620
1042 -3620 -8577 2292 1591 -1177 46 4111 1185 -9927 -1203 7146 -6298 -705 10525 -1406
1056 -1406 -3922 1158 -3200 -2568 520 4496 2885 -6437 308 4492 -9773 -3285 8927 498 -541
1071 -541 2159 -1698 -1961 -3370 1231 5337 -2316 2164 6116 -6677 -3996 3903 -951 2093 3671
1086 3671 97 376 -4336 -1818 2127 -4697 2255 8791 -3928 -4046 2071 -1745 -772 161 2901 5453
1102 5453 -3795 -2325 2922 -6688 -2073 7212 -1103 -1625 2097 -1675 -2325 -3259 1182 4764 -2981 1518
1118 1518 5645 -7528 -3334 6858 -1991 -2392 4471 2987 -1183 -5073 759 3850 -5528 1312 7781
1133 7781 -5568 -2861 5194 -3800 -3419 3372 2639 20 -2669 2382 2156 -7453 1814 7661 -6154
1148f154N167Q568j0702j488O417O29k858k891O785o2j0857Q089N028j1871O238
1163C8O753r503O78M445j641k209j453O558j052r470Q937K964j2662O492O726
1178E601q179P82L554m55j549l579N916N23q097P552K156r822O203L373p300L050
1194b71K609j109q73k849N416j052p957Q508J955r473N559L082n752K066M91P03
1210A053P44m255M406M16p157O365N68o957O202P14n143L393n06K22M54l707N607
1227B419j85p495O471J051o859M960P87k570K709k499J679K028n030M467P67n939
1243c239N648o61n560N539r65k761L304j852J669N63m639N508J73o490N834j65
1259A906m634L819j643o88K792l999K447J965m844M099l0m524N319j642l796N021
$$ plain form
1148 -6154 -987 7581 -3121 -4609 1808 2437 -421 -3312 3473 3411 -7446 643 5671 -6200 38
1163 38 6791 -2712 -2034 2411 770 -1439 -2892 3666 2614 -6856 2081 5045 -7617 -1125 5601
1178 5601 -2578 -1796 1758 1303 -246 -3825 2091 2614 -5483 2069 4225 -5597 606 3979 -3321 -271
1194 -271 2338 1229 356 -2493 2923 1871 -6086 2422 4377 -5096 463 3545 -2207 -141 350 1053
1210 1053 1797 -2458 1948 2364 -4793 1572 2140 -4817 1385 2099 -3044 349 -157 65 519 -3188 2419
1227 2419 2234 -5261 1210 2261 -4598 362 1149 -1421 1288 -1211 468 2496 -2534 1933 2700 -3239
1243 -3239 2409 1748 -3812 1727 762 -1999 1305 -547 1122 1685 -2954 2554 2727 -3763 2071 1906
1259 1906 -2728 1091 -552 -1240 1552 -2447 0 1965 -2879 1220 1190 -3334 1985 343 -3453 1568
1275A568k458q68K686l143L123Q59n035N603j4n082M879j047k388L212l360R48
1291e17K726n100L180J505m480M570o93l396N235k593j959M092l179O00J525l941
1307b425L826K2m882N358p07l831M208k006p67K797m020J937K136m551L536J43
1323G74l663N186k189k570N415k945j619L560l051J142O83l558M424j274l815
1338c500N702j936k562M813l108n9L338l956J690J501l083K970j772j796N156
1353C398m164j947N916l877r77L515l218J502L29k774L806k036j799N025l830
1368a131m13M586m816P67L772m688J498J551k146K030k360O1M391n275K07N034
1384C068m810R45L096m113K517R68k868K709j504m87L030m085J676K813n757K934
$$ plain form
1275 1568 -890 -1758 928 -2215 908 1767 -3268 2335 2321 -2761 2118 1071 -1317 1895 -1465 -517
1291 -517 2209 -2891 289 1794 -2686 1884 1191 -2205 3030 437 -1522 2570 -609 -9 1516 -2425
1307 -2425 1401 1423 -3459 1899 1192 -2639 1569 -437 -1204 1593 -2427 -490 1646 -2905 631 774
1323 774 -2889 2297 108 -2462 2953 8 -1611 1949 -1102 40 723 -2835 1589 315 -3500
1338 -3500 2202 266 -2296 2517 -591 -650 2688 -1268 422 1923 -1160 1810 38 -1758 3398
1353 3398 -766 -2713 3203 -674 -1651 1864 -1354 148 477 -2297 1509 -527 -2326 2699 -1131
1368 -1131 -1544 3042 -1774 -1007 2765 -1923 -425 1126 -1020 1010 -1350 -1289 3102 -2173 -1966 3068
1384 3068 -1742 -797 2299 -1814 703 1671 -1197 1512 8 -479 2551 -1534 142 2955 -2802 132
1400A32K287n686K637J507k496K304j639K14L132l935J226K360m099L612L04m934
1416c074M808q1m180L401p75r57K066k525J760O53l743M420m52m733N230j124
1432F94l489M315j680j509L701j507p2n99j435M179l598l071P419k674m554N712
1448A832k099k683L732n05Q1Jj39L314m501j463O713m720k338P158m257l721N381
1465A786p32k207J11K305K407o419k09O817o221j349Q064m506k802N185k393k599
1481b762J104L100J743n226K073M502q807J60Q354o185j572P406k150m129O24
1496a765L026J099m676L554M841q293O56O040p353J24P190l343k918J353J158
1511F93j088l894N043M219p628K180N030q796k10O469j965o99J515R78q31m785
$$ plain form
1400 132 2419 -3267 -630 877 -1619 685 -954 -740 2392 -1543 -317 2043 -2056 1556 1860 -3074
1416 -3074 1734 1653 -2527 874 99 -858 1208 -1317 443 1096 -2647 1773 1321 -3412 1818 694
1432 694 -2795 1520 -160 -1669 2032 525 453 -146 -1581 2598 -1000 -4071 3348 674 -3880 1832
1448 1832 -267 -2950 782 277 358 359 220 3534 -967 -2430 4283 -437 -2775 4383 126 -3595 1786
1465 1786 1054 -1153 -1042 1263 3670 -2749 -2958 3859 -2362 -3711 4353 -153 -2955 2230 -163 -2762
1481 -2762 -1658 1442 3185 -2041 32 4534 -4273 -4113 4241 -1944 -3516 3890 1740 -2389 -1765
1496 -1765 1261 2360 -2316 1238 6079 -2214 -1558 4482 -2871 -2747 4443 1100 -1818 -465 693
1511 693 -395 -4289 754 4973 -2655 -475 4555 -4241 -4451 2018 53 -646 869 1847 1016 -3769
1527c769K551L480n222L956L899p589J150L530m037K92K351J541J19m394K511
1542C69K268n905L512M346n589Q66J818l423M71k30J522K848l623Q90J810n408
1558c458K050K860l373K638J787k807L13k561R17L107l892K338M326n246l7K552
1574A514k758R24M56M40J773m306J078L587n477J654M550m410L78K298k669J11
1590h57K85J714J284m505K692L072p652J673N726m779M5L615j416j613j312K023
1606eJ055m609L915M072p050J708M524n808K46L779j440j127j67K863n25n539
1622d108N058L060p944K861N102n807l13L785q15j058o86K769l38n330M596K377
1638C209o659L916L878n983N00K753k086j249j35L644m66m991N210J450p338L390
$$ plain form
1527 -3769 -1218 2262 -2960 996 4895 -2694 -1544 1986 -2051 -1759 592 2133 2252 -2142 369
1542 369 2637 -3268 244 4590 -999 -133 1685 -1738 -1267 -1497 25 2873 -750 140 1950 -3458
1558 -3458 -1408 1452 -1921 717 2504 -303 10 -2551 -1634 1473 -2419 -81 4245 -1001 -1038 1514
1574 1514 -1244 -320 136 576 2349 -1957 -879 2708 -2769 -1115 3435 -975 -597 1701 -968 -857
1590 -857 -572 1142 2426 -2079 613 3685 -3967 -2294 3432 -1347 -1302 2313 897 -716 -2028 -5
1606 -5 1050 -3559 356 4428 -2622 -914 3610 -2198 -1952 1827 387 -740 -907 1956 1431 -4108
1622 -4108 950 4010 -3934 -1073 4029 -1778 -2091 1694 879 -179 -865 1904 1566 -3764 832 3209
1638 3209 -3450 466 4344 -1639 -1139 1614 -472 -1721 -1856 1788 1322 -3669 1541 2991 -4347 -957
1654i57L658m701J081K501r92p32j179K447j76m345M612J138n942M257K253m941
1670b018J744J837j399o33j121L093k69m172M875J397n751L342J323l944J295
1685d01O26j11O04j799K129l19m148L833N46m382M083J383l209J507J3l65p6k036
1703b122L129J34m275M188P54m249L213N26k249J536q88M48P90k275K810J47l602
1720a985L600l96l901L295L86j788J693o82P50j85l175K985K36l701L648N76k854
1737a498K488p90j112J529j783J002R14k558K659j1l280L669m81k784K916m65
1753D15p71J506j626J812J12l201K693l35l359K940r6j510K531j171j23J429k308
1770a062J629O18k612L138m62k799L075j244k069K100j082J19R94j876K566o0
$$ plain form
1654 -957 2701 -2000 -919 1582 590 -142 -1321 1126 950 -3395 1217 2355 -3587 670 2923 -2018
1670 -2018 -274 1563 164 -469 -1590 1503 1234 -2938 1937 3334 -2417 925 2248 -1696 -401
1685 -401 225 114 718 -1081 1048 729 -3419 414 960 -3422 661 2044 -1165 342 355 -10 -86 -2122
1703 -2122 1007 1141 -3134 1054 1808 -2441 772 1298 -951 585 -303 145 935 -1340 1470 1617 -1985
1720 -1985 1615 1219 -2682 613 999 -789 904 222 972 787 -2388 597 833 -2868 780 1356 -1498
1737 -1498 990 200 -912 617 -1166 -164 750 -1808 851 840 -2440 1229 748 -2036 880 415
1753 415 -356 1150 -476 1336 1448 -1753 940 605 -2754 186 90 -1420 1111 -60 -183 1246 -1062
1770 -1062 567 1185 -1427 1711 1249 -1550 1525 281 -1788 312 -770 -651 343 -1533 1033 973
1786I73k787L147l79k648K621r42q76K222j605N44R74k277J780m60k298L172r43
1803B18k255L514j523j351K000j647Q89O61j761K660k81k266K956j342j779K700
1819A393k060o20K441k029N42J094j584J741j138j152L140k039r86L433k224p07
1835g55K306k281N02N86j566J802n51r32K439k079j53K506l380M25K667k791O81
1852e74J325j293J302r14m72K228k390K83K547l179J183J791l245J329R08k258
1868a429J475j63k91J329k047J403J645l735J807J962l493J547J148k197J716
1883F77n54p86J192j592R32R08k525K489O17l425K972M66k942J980O4r14Q63r76
1901e54J168K57k628K632j20k745L138o47k409L113p22j572J833o62L50m53j206
$$ plain form
1786 973 -1814 1333 954 -1694 927 -15 -891 1331 -274 270 1244 -1033 747 287 -2011 1161 218
1803 218 -2037 1477 -46 -1397 603 -1044 -155 506 -1255 1405 1124 -1142 1814 472 -1307 1393
1819 1393 -667 -1287 1154 -875 -333 761 -823 918 -220 -1372 1768 -271 -1257 2176 -48 -755
1835 -755 1551 -730 -228 358 -1208 594 43 -889 1550 -529 -682 1824 -1556 -1131 1536 -1255 -574
1852 -574 751 -542 760 -154 -626 1602 -788 -505 2042 -1137 46 1837 -1408 -79 829 -1429
1868 -1429 46 -117 -408 921 -1126 277 1922 -1813 -6 1956 -1537 10 1158 -1039 677
1883 677 123 -663 529 -1063 -131 777 -1748 741 1358 -2067 905 1371 -1571 409 473 -441 422 -554
1901 -554 614 871 -1757 875 755 -1990 1148 501 -1908 1205 483 -1089 744 82 432 -21 -1227
1918a227K644j352k044L802j629k474L514j096j633K173p15L37j4o97J798j885
1934d98q02L577k906j347M413k603j947L000q83n80K99J42J423k161j98L472l426
1951a025k96M291l210j096L176k006r54J183k22M91j786J045K251m175O98M472
1967B837l701l62L647k144o54R12j98M47j524R01J720m215J170L080m319J035
1983a368L510k804J59J433p43J5j044J573J482l791J709K175m391R44K454k679
1999a366J021J186j269P28j048Q88J035k710K111J527l946J646J708k848J308
2014b9Q56q50P79j432M19J179k644J769J719k871J503L10k370J799j92p37K134
2031A342j353K28J071k581J221J025k241J749J63j593J594j404k55K444k444N01
$$ plain form
1918 -1227 1417 65 -1979 1823 194 -2280 1234 138 -1495 678 -37 300 286 -411 1387 -498
1934 -498 -1300 2277 -629 -1976 2437 -166 -2113 887 4 -576 -277 -135 1288 -873 -1071 2401 -1025
1951 -1025 -1321 2970 -240 -1336 1840 -166 -1120 63 -159 332 -1454 -409 1842 -2333 -1635 2837
1967 2837 -864 -1226 2421 277 -377 535 337 784 -740 161 1881 -2334 -1164 1916 -2403 -1368
1983 -1368 2142 -662 -503 930 187 202 -842 731 2213 -1578 131 2306 -2085 -1141 1313 -1366
1999 -1366 -345 841 -428 300 -748 140 1175 -1535 576 2103 -1843 -197 1511 -1337 -29
2014 -29 827 -23 756 -676 -257 922 -1722 47 1766 -1105 398 708 -1662 137 -55 -792 1342
2031 1342 -11 217 1288 -1293 -72 953 -1288 461 624 -969 625 -779 -1034 1410 -1034 -533
2047e33K443k830N51J374j589J126l59n25J456k321q9K607k718J081K572k796
2063e50M56J397j932L15n1M52J264k532J032K085l999R76L073l138N87J995j264
2080A66M1m70M96Q09k611J419J799l983J601K639l509J054K096j422k75l80R40
2097D10J99k724K517J719m272J790K148l638Q11J814j054O67J47Q65J82k949K132
2114G64Q28m207K716J843l744J489J516j649K0j22J221L62k511K723P95l944K288
2131C88J278l354J307Q47j455O57o81J101M01k134K417L93l566K431R66l029K056
2148B3J139q39M84r67P02J09k425K624R86k993K334J44k868J270K9o17J172o00
2166b93J387K59k480K397J60k974K680J09k669J310l95k37N44j317J684K73k669
$$ plain form
2047 -533 1910 -920 -369 1005 -584 542 183 -342 1114 -1207 -1296 1311 -1407 -326 2246 -550
2063 -550 -94 1303 -629 -314 -365 87 1351 -1181 -149 1936 -2063 -1087 1986 -1152 -565 1430 166
2080 166 207 -263 233 1042 -1569 -150 1649 -2334 -733 1906 -1603 -549 1547 125 -150 -530 410
2097 410 609 -2115 402 2121 -2151 -361 1787 -1851 -1040 774 -280 387 534 1399 1581 -1368 764
2114 764 1592 -2615 101 1944 -1800 -311 1205 -444 -424 -546 675 1037 -1474 1249 2044 -1900 388
2131 388 1666 -1688 -381 466 -989 -332 -1013 88 489 -1645 772 1165 -2401 30 996 -2033 23
2148 23 1162 323 807 -160 542 651 -1774 850 1836 -1157 1177 1321 -1547 -277 -248 -865 307 -293
2166 -293 1094 1353 -1127 1270 1430 -1544 1136 1245 -1424 -114 -509 -746 -202 -1519 165 438 -2231
2183b231K262L89k097K685M82j632J244j028p75M10j340J860N66k077K550n2k875
2200a659K180O7j402J736n73L84L43k020J617K24k397K230rk184K076m37o30J430
2218I76j126L81R5j959J783q1j983K899m0j951J761q60q87J013j060J359N86k076
2236a170K012j28k442K198l15j317J911p15j63J142j228Q76J29k078J956m20k072
2253a824K531k10j276J783q95j97N15j589J502L58j669K346m15j923J882j079
2269a60j237J868j098L30R04j200J288k59j798K293q34j918K668o74r97J760q74
2286F2L4N48j638J259k03j313K340q83q99K137j604q77J709j511L05R84r94J570
2304A026p30j038K113j665j019K433j467j90J902j619L64N42j561R59l69r12J820
$$ plain form
2183 -2231 31 420 -1677 1008 1490 -142 1102 74 -701 -291 -1631 229 795 -1282 1268 1216 -1659
2200 -1659 521 588 -814 922 349 733 1076 -944 673 897 -1500 730 721 -1463 613 176 -454 976
2218 976 -150 231 326 -1633 150 69 -1914 985 945 -1006 755 -105 -992 21 -1039 320 906 -1170
2236 -1170 842 714 -1728 470 155 -1162 749 34 -129 1013 -215 661 790 -1288 668 248 -1824
2253 -1824 707 497 -779 1004 109 -88 427 -1162 340 698 -971 1375 960 -963 919 -160
2269 -160 -1397 471 -627 -297 607 -593 695 436 -1362 931 97 -1821 847 173 -824 936 62
2286 62 96 644 -994 265 62 -1251 1089 206 -693 1444 -160 -1037 672 -839 -534 450 -544 1026
2304 1026 296 -742 1371 -294 -1313 1120 -347 -537 1365 -254 110 652 -909 50 -319 -1231 589
2321E89j272J17K092k019J63J701k091M40R83j112J077k37p12J421j851j59J438
2338E68k153R94J446k038J567R94j961J098k64q00J074j201P15J235k292J073
2354E5Q31k515J316N42j648J708N5o91J219r50L08L60j889J658L86k162K356K87
2372A226j992J468k63j009R40j090N96O42j339J528j6j990K091p02j764K378m95
2389B09q49J566p49l1M0j377J515p70j412K579p33j340K638j160r60J602j005
$$ plain form
2321 589 -683 -566 1526 -493 -330 1371 -720 -280 703 -409 668 431 -281 1140 -711 -870 568
2338 568 -1585 -591 855 -1183 384 1378 -583 515 251 -549 525 -676 39 1274 -1018 55
2354 55 886 -1629 -313 229 -1419 289 344 -347 872 -78 230 590 -1299 359 745 -1417 939 1226
2372 1226 -766 702 439 -570 370 -720 -124 518 -821 707 691 -1299 792 90 -1674 704 209
2389 209 -640 926 177 146 186 -1191 324 -446 -1858 721 -12 -1352 1286 126 -834 768 -237
$$ [...]
8191e
##END NTUPLES=NMR FID
##END=
