##TITLE=1H_DE-80H_X3
 200.13MHz, d2o
 8 sc
 
 19ns.26.2.2025
##JCAMPDX= 6.0         $$ Bruker NMR JCAMP-DX V2.0
##DATA TYPE= NMR FID
##DATA CLASS= NTUPLES
##ORIGIN= UXNMR, Bruker Analytische Messtechnik GmbH
##OWNER= pz
$$ XWIN-NMR		Version 3.5
$$ Thu Jul 10 10:03:24 2025 Russian Standard Time (UT+4h)  Yarkov@DPX200
##.OBSERVE FREQUENCY= 200.1313
##.OBSERVE NUCLEUS= ^1H
##.DELAY= (6, 6)
##.ACQUISITION MODE= SIMULTANEOUS
##.ACQUISITION SCHEME= undefined
##.AVERAGES= 8
##.DIGITISER RES= 18
##SPECTROMETER/DATA SYSTEM= spect
##.PULSE SEQUENCE= zg30
##.SOLVENT NAME= CDCl3
##.SHIFT REFERENCE= (INTERNAL, CDCl3, 0, 14.3821)
##AUDIT TRAIL= $$ (NUMBER, WHEN, WHO, WHERE, WHAT)
$$ ##TITLE= Audit trail, XWIN-NMR		Version 3.5
$$ ##JCAMPDX= 5.01
$$ ##ORIGIN= Bruker BioSpin GmbH
$$ ##OWNER= Yarkov
$$ C:/Bruker/XWIN-NMR/data/yarkov2/nmr/H-C/1/audita.txt
$$ ##AUDIT TRAIL=  $$ (NUMBER, WHEN, WHO, WHERE, WHAT)
(   1,<2025-07-10 10:02:26.26 +0400>,<Yarkov>,<DPX200>,
      <created by zg, POWCHK disabled, PULCHK disabled
       configuration hash MD5:
       00 E9 B6 7A A2 85 ED C7 34 08 36 98 17 FE 4E 26
       data hash MD5: 16K
       37 C4 6F 9C DE 32 23 D8 21 52 AA 45 7A F6 F6 3B>)
$$ ##END=
$$ 
$$ hash MD5
$$ 18 09 36 62 BF 5E 2A 0A DB 02 79 38 6A 51 4D 2C
##$RELAX= 
##$RELAX= 
##$RELAX= 
##$RELAX= 
##$RELAX= 
##$RELAX= 
$$ Bruker specific parameters
$$ --------------------------
##$DU= <C:/Bruker/XWIN-NMR>
##$EXPNO= 1
##$NAME= <H-C>
##$PROCNO= 1
##$TYPE= <nmr>
##$USER= <yarkov2>
##$AMP= (0..31)
100 100 100 100 100 100 100 100 100 100 100 100 100 100 100 100 100 100 
100 100 100 100 100 100 100 100 100 100 100 100 100 100 
##$AQSEQ= 0
##$AQ_mod= 1
##$AUNM= <au_zg>
##$AUTOPOS= <>
##$BF1= 200.13
##$BF2= 200.13
##$BF3= 200.13
##$BF4= 200.13
##$BF5= 200.13
##$BF6= 200.13
##$BF7= 200.13
##$BF8= 200.13
##$BYTORDA= 1
##$CFDGTYP= 0
##$CFRGTYP= 5
##$CHEMSTR= <none>
##$CNST= (0..31)
1 1 145 1 1 1 1 1 1 1 1 1 1 1 1 1 1 1 1 1 1 1 1 1 1 1 1 1 1 1 1 1 
##$CPDPRG= <>
##$CPDPRG1= <>
##$CPDPRG2= <>
##$CPDPRG3= <>
##$CPDPRG4= <mlev>
##$CPDPRG5= <mlev>
##$CPDPRG6= <mlev>
##$CPDPRG7= <mlev>
##$CPDPRG8= <mlev>
##$CPDPRGB= <>
##$CPDPRGT= <>
##$D= (0..31)
0 0.7 0 0 0 0 0 0 0 0 0 0.03 0 0 0 0 0 0 0 0 0 0 0 0 0 0 0 0 0 0 0 0 
##$DATE= 1752127345
##$DBL= (0..7)
120 120 120 120 120 120 120 120 
##$DBP= (0..7)
150 150 150 150 150 150 150 150 
##$DBP07= 0
##$DBPNAM0= <>
##$DBPNAM1= <>
##$DBPNAM2= <>
##$DBPNAM3= <>
##$DBPNAM4= <>
##$DBPNAM5= <>
##$DBPNAM6= <>
##$DBPNAM7= <>
##$DBPOAL= (0..7)
0.5 0.5 0.5 0.5 0.5 0.5 0.5 0.5 
##$DBPOFFS= (0..7)
0 0 0 0 0 0 0 0 
##$DE= 6
##$DECBNUC= <off>
##$DECIM= 32
##$DECNUC= <off>
##$DECSTAT= 4
##$DIGMOD= 1
##$DIGTYP= 9
##$DL= (0..7)
0 120 120 120 120 120 120 120 
##$DP= (0..7)
150 150 150 150 150 150 150 150 
##$DP07= 0
##$DPNAME0= <>
##$DPNAME1= <>
##$DPNAME2= <>
##$DPNAME3= <>
##$DPNAME4= <>
##$DPNAME5= <>
##$DPNAME6= <>
##$DPNAME7= <>
##$DPOAL= (0..7)
0.5 0.5 0.5 0.5 0.5 0.5 0.5 0.5 
##$DPOFFS= (0..7)
0 0 0 0 0 0 0 0 
##$DQDMODE= 0
##$DR= 18
##$DS= 0
$$ [...]
##$SUBNAM2= <"">
##$SUBNAM3= <"">
##$SUBNAM4= <"">
##$SUBNAM5= <"">
##$SUBNAM6= <"">
##$SUBNAM7= <"">
##$SUBNAM8= <"">
##$SUBNAM9= <"">
##$SW= 18.0517328524113
##$SWIBOX= (0..15)
0 0 2 0 0 0 0 0 0 0 0 0 0 0 0 0 
##$SW_h= 3612.71676300578
##$TD= 16384
##$TD0= 1
##$TE= 0
##$TE2= 300
##$TE3= 300
##$TEG= 300
##$TL= (0..7)
0 120 120 120 120 120 120 120 
##$TP= (0..7)
150 150 150 150 150 150 150 150 
##$TP07= 0
##$TPNAME0= <>
##$TPNAME1= <>
##$TPNAME2= <>
##$TPNAME3= <>
##$TPNAME4= <>
##$TPNAME5= <>
##$TPNAME6= <>
##$TPNAME7= <>
##$TPOAL= (0..7)
0.5 0.5 0.5 0.5 0.5 0.5 0.5 0.5 
##$TPOFFS= (0..7)
0 0 0 0 0 0 0 0 
##$TUNHIN= 0
##$TUNHOUT= 0
##$TUNXOUT= 0
##$USERA1= <user>
##$USERA2= <user>
##$USERA3= <user>
##$USERA4= <user>
##$USERA5= <user>
##$V9= 5
##$VALIST= <valist>
##$VCLIST= <CCCCCCCCCCCCCCC>
##$VD= 0
##$VDLIST= <DDDDDDDDDDDDDDD>
##$VPLIST= <PPPPPPPPPPPPPPP>
##$VTLIST= <TTTTTTTTTTTTTTT>
##$WBST= 1024
##$WBSW= 4
##$XGAIN= (0..3)
0 0 0 0 
##$XL= 0
##$YL= 0
##$YMAX_a= 168928
##$YMIN_a= -162131
##$ZGOPTNS= <>
##$ZL1= 120
##$ZL2= 120
##$ZL3= 120
##$ZL4= 120
##$ABSF1= 10
##$ABSF2= 0
##$ABSG= 5
##$ABSL= 3
##$ALPHA= 0
##$AQORDER= 0
##$ASSFAC= 0
##$ASSFACI= 0
##$ASSFACX= 0
##$ASSWID= 0
##$AUNMP= <proc_1d>
##$AZFE= 0.1
##$AZFW= 0.1
##$BCFW= 1
##$BC_mod= 2
##$BYTORDP= 1
##$COROFFS= 0
##$CY= 83.5205535888672
##$DATMOD= 1
##$DC= 2
##$DFILT= <>
##$DTYPP= 0
##$F1P= 10.8118882576601
##$F2P= -7.23987719738617
##$FCOR= 0.5
##$FTSIZE= 0
##$FT_mod= 4
##$GAMMA= 1
##$GB= 0.15
##$INTBC= 1
##$INTSCL= 1
##$ISEN= 128
##$LB= 0.25
##$LEV0= 0
##$LPBIN= 0
##$MAXI= 10000
##$MC2= 0
##$MEAN= 0
##$ME_mod= 0
##$MI= 1.114404
##$NCOEF= 0
##$NC_proc= 0
##$NLEV= 6
##$NOISF1= 3.799351
##$NOISF2= 2.8
##$NSP= 1
##$NTH_PI= 0
##$NZP= 0
##$OFFSET= 14.38212
##$PC= 1
##$PHC0= -1356.506
##$PHC1= 5.990923
##$PH_mod= 1
##$PKNL= yes
##$PPARMOD= 0
##$PSCAL= 0
##$PSIGN= 0
##$REVERSE= no
##$SF= 200.129724274929
##$SI= 16384
##$SIGF1= 3
##$SIGF2= 2
##$SINO= 400
##$SIOLD= 16384
##$SREGLST= <1H.CDCl3>
##$SSB= 0
##$STSI= 0
##$STSR= 0
##$SW_p= 3205.1282051282
##$SYMM= 0
##$S_DEV= 0
##$TDeff= 0
##$TDoff= 0
##$TI= <>
##$TILT= no
##$TM1= 0
##$TM2= 0
##$TOPLEV= 0
##$USERP1= <user>
##$USERP2= <user>
##$USERP3= <user>
##$USERP4= <user>
##$USERP5= <user>
##$WDW= 1
##$XDIM= 8192
##$YMAX_p= 0
##$YMIN_p= 0
$$ End of Bruker specific parameters
$$ ---------------------------------
##NTUPLES= NMR FID
##VAR_NAME=  TIME,          FID/REAL,        FID/IMAG
##SYMBOL=    X,             R,               I
##VAR_TYPE=  INDEPENDENT,   DEPENDENT,       DEPENDENT
##VAR_FORM=  AFFN,          ASDF,            ASDF
##VAR_DIM=   8192,          8192,            8192
##UNITS=     SECONDS,       ARBITRARY UNITS, ARBITRARY UNITS
##FACTOR=    0.0002768,     1,               1
##FIRST=     0,             0,               0
##LAST=      2.2672688,     0,               0
##MIN=       0,             -162131,         0
##MAX=       2.2672688,     168928,          0
$$ Real data points
##PAGE= N=1
##DATA TABLE= (X++(R..R)), XYDATA
0@%%%%%%%%%%%%%%%%%%%%%%%%%%%%%%%%KmMnQj0J0j3J6j7J9k4K9l0L3l9M5m8N3
51B9n9O2o7P3p8Q2q5Q5q1P3n6K0M4j62L91q65K009n636L4084J39065k14323r8356
73a43751K16733k0644j52979Q6405Q6040r6214k2018O4773q811r339J7106l8871
85b1570M549N1775l1581k1741M1325k8588k2116N2406j1706l6314L3509m203l0720
98b4975L4956R786m1679J7150K2673l7994J7843M5135o4221k2496R1531k7094
110B0615p6487P8652K1471r9402L9878P6604p5630k8810P3917j9124m8562M9740
122A2862J5570n6131J3509L6380k5011O73J2603k7392J9721K0839m6865J8607
134d635M4773o4372j3320Q5136k9000p4109O2755L9597q2162L587Q3729m3233
$$ y = [0, 0, 0, 0, 0, 0, 0, 0, 0, 0, 0, 0, 0, 0, 0, 0, 0, 0, 0, 0, 0, 0, 0, 0, 0, 0, 0, 0, 0, 0, 0, 0, 0, 2, -2, 2, -3, 5, -5, 5, -8, 8, -9, 10, -14, 15, -15, 18, -21, 24, -24, 29, -30, 32, -35, 38, -40, 42, -43, 42, -39, 34, -22, -2, 42, -120, 271, -594, 1415, -4221, 29863, 168928, -45395, -143751, 72982, 52338, -100641, -14236, 71804, -24410, -46428, 18345, 9534, 195, 17301, -21570, -17021, 34754, 3173, -18568, 22757, -5831, -27947, 24459, 12753, -23561, 9948, 5745, -24975, 9981, 19767, -21912, -4762, 17911, -20083, -2240, 42895, -21326, -43822, 47709, 20615, -55872, 22780, 44251, -55151, -15273, 61331, -14299, -43109, 30808, 11684, -36878, 12862, 28432, -27699, -14190, 22190, -2821, -2148, 10455, -16937, 2784, 23623, -23242, -4635, 40138, -24234, -37554, 47582, 18582, -55527, 7228, 46825, -35337, -31750, 51979, 8746]
146H746o4455O6448L0023o0340J914L3799j1015r103j489N804J8094k1374k4696
159b7644L7133J9380m3313j0330L9808n71l0850J0486J7086j1872l277j207L088
172b083K3436k0936l3394M7522J9369o2559R822N6774l7095l7098N0492J3226
184B7476n1677Q542M0789k7221j8068L4670p904k5407K3175O921j8859O536O656
197E629n691m68j316L955L781j0526j259J2827j964j3499L755J3049r255q971
211i953J6411j178j5293J0822N284j0568N664K106n329M592l323r27R329r421
225a784q838J6813M305j9861j40K0813o980k0068J6042J3845j9867l046J2745
238C979n88Q73p492o922K1259L08k7446J1896K2853k1052j5143K4608P473k5973
$$ y = [8746, -55709, 10739, 40762, -19578, -17664, 16135, 5120, -3983, -5472, 332, 18426, -2948, -27644, 9489, 28869, -14444, -24774, 15034, 14463, -16387, -5901, 11185, -687, -3964, -5171, -2083, 21353, 417, -32977, 14545, 33914, -28645, -18823, 37951, 856, -36242, 14250, 27476, -24201, -15659, 25130, -2091, -20159, 14511, 6607, -18800, 4375, 11296, -7563, -1027, 5629, -62, -530, -1846, 2109, 5890, -4636, -5895, 6932, 4968, -8531, -4776, 8273, -982, -9953, 6458, 5280, -10013, 809, 6093, -4475, 1189, 3295, -2034, 2558, -765, -1692, 7637, -1784, -10622, 6191, 10496, -9365, -9505, 11308, 4328, -15740, 302, 14147, -5720, -8766, 3979, 3391, 4264, -3228, -10150, 11109, 11417, -16029, -4133, 18720, -2332, -17475, 7133, 14606, -11367]
252a1367M2K3548q082j5312J0182O383l667m874k973J4301l9k2984J3469K1107
266A9734k6615q355K9808o191k4453J5408J4178k0457j600J8547j2236p148J9664
279A0284j0445j3071K4147m727k1429K0404O570k2081Q766J1520j4615J790J0833
292G946j1714k551J5864r440j2937K0737k87k3569J7732J2065k6326Q749J8161
305A4430k2296J654K0432j7846o386K2407r616j6043K0693K412k5187J3831J9557
318A8042k8770k922L1400j7159j8461K7302j542k0113J3906M584j0963P754j251
331A807r068J3781J727k0986J0405K0024k4252r762L2910j0146k8687K8664R414
344A5831l3128J3647J9697k5403K207K1139j7910o111K2256r136j6457K0195L580
$$ y = [-11367, -11325, 12223, 4141, -11171, -989, 5394, 1727, -3147, -6120, 8181, 8142, -14842, -1373, 19734, -6881, -15236, 14572, 8381, -16072, -664, 13514, -6943, -8543, 10004, -2232, -9380, 10284, -161, -13232, 10915, 6188, -15241, 5163, 11733, -10348, -1582, 9938, -4677, -2887, 7946, -3768, -6319, 9545, 105, -12832, 7905, 7618, -15951, 1781, 13846, -12480, -3731, 14430, -7866, -6212, 14220, -3626, -10012, 12395, 2779, -13264, 7429, 9841, -15346, -1515, 18042, -10728, -13650, 17750, 591, -17870, 9432, 7890, -12223, 1683, 6267, -4696, 3058, 1807, -7261, 6520, 8247, -12739, -2334, 17690, -6562, -16324, 16586, 6440, -22247, 6417, 15831, -17297, -3650, 16047, -9356, -7149, 13990, -3920, -10031, 12225, 3089, -13368, 6827, 10407]
357A0407k3664J2424J5391k3420J304K0401j7011m513J8951j3046o196J9593j1061
370d40j1394K1469l428k0256J7050J1498k5226L232K4334j9107j2418K7678p806
383E186k2101K3825L345k5373J5363J2664k3628M898J9115j6360p859J9919l490
396E504j5728J2195O532j4940N251Q569j2304L942P132j2688O005R391j7208L082
410e265J7352j5479p568K0395m926j6958J5386Q484k0814M288J8752j6870o963
423a0186K1825r712j4384K0424j413j8741J3872P260j6985M477J1809j0697m055
436f506J2088l373q664R270J231r631P969K915j1748P519O091j3326M105R639
450G579j1176r46R885n614m890P641m73o733N595L457r010L163Q490j0059j449
$$ y = [10407, -13257, -833, 14558, -8862, -7558, 12843, -4168, -8681, 10270, -2776, -8972, 10621, -440, -11834, 9635, 6207, -14049, 3001, 14499, -10727, -7495, 16839, -2268, -14686, 12992, 5186, -16915, 6910, 10255, -15118, 245, 12909, -10719, -5821, 13294, -3066, -10925, 8994, 5504, -10224, 1971, 8503, -6437, -1186, 7383, -4921, -979, 6153, -6535, -530, 8861, -8347, -5265, 12087, -3392, -10960, 9435, 4509, -12449, 2937, 11421, -9393, -5105, 13647, -3223, -10186, 11639, 1927, -12457, 7967, 6554, -12187, 1685, 8945, -8040, -3563, 8246, -2451, -6506, 5582, 2209, -6455, 2815, 4046, -5585, 2384, 5299, -6449, 1070, 7161, -6165, -2060, 7579, -3597, -4543, 5342, -272, -5162, 2479, 2006, -4727, 868, 4325, -4685, -1522, 6968, -3091, -4540]
465d540J2156p515o476J1309k098p821O030J380m698K111J185k678J123J823k996
480a705L83M586m310k995Q793k540q208Q584K174r449M733M754p287J45N067k326
496C99k771K260J546l089O62L076l598l00M528l120j283M060k195j100K260p74
512E61l23m58l68K411k162k038L908r70k769K581N37k531O19K066l48k580K275
529D11K089m380J446M005n114L4M846l852j168L347j989n57J292j172M32P74j080
546f36m17J334O50k347O85L524l443j264N019l074k160M856k742k119M706k951
562c79k527N298j612m536M329K083n532P71O093m630l976Q840j416q545P875K566
578D702r682N202N049q830J540O375n845j811O319k582m465N781R59p697M733
$$ y = [-4540, 7616, 101, -6375, 4934, 2836, -4985, 1045, 2425, -2273, -162, 1023, -1655, -532, 1291, -1705, -1322, 3264, -1046, -4041, 4752, 2212, -5996, 2588, 4762, -4687, 46, 4800, -2487, -2342, 2725, 399, -2372, -112, 1434, -1655, -993, 2083, -1515, -1815, 2713, -407, -1690, 2370, 175, -925, 1335, 561, 238, -220, -588, 1823, -339, -2377, 1531, 561, -2208, 373, 910, -1621, -1002, 1064, 716, -1864, 411, 2500, -1880, -434, 3571, -1543, -1509, 3337, -515, -1683, 1664, -325, -882, 410, -762, -330, 444, -636, -1053, 281, 931, -1416, -731, 2793, -650, -1914, 3105, 31, -2129, 2727, -15, -2134, 2572, -379, -2906, 2392, 780, -3756, 573, 2656, -2876, -2105, 3988, -642, -4618, 4222, 2806, -5739, 2136, 4702, -4980, 222, 5271, -3559, -2019, 4356, -1489, -3300, 3019, 437, -4028, 1753, 2712, -4985, -252]
593b52N652r321J380Q839q113k391R744n163m935Q140j719n733N338Q42n955L243
609d04M044o405M7P073n621l698R891l685p517J0037J20r945P635L648r763L510
625a033O508p528j348P538m025m948P665l29q223O895L557j0564N013P518j1176
640d480J055J0686q691l672J0449l647p045P774J381q439L902N542p932jQ435
655E317p147l272J0744n176p180J0965r46r473P975L086r381L353O757p135j917
670c430P522l329n491P430j34p868O757K341r213N311N117r737L047P758q497
685b416j449R061m308n785P421J240p994M009N232q143K96P862o863k082Q889
700D970n682m604R523k722p215P998J660q323L609N863o564j854P632k996n761
$$ y = [-252, 5400, -3921, -2541, 6298, -1815, -4206, 5538, 375, -4560, 3580, 1861, -3872, 1466, 2308, -3647, -404, 3640, -2765, -2718, 4355, -1266, -4964, 4927, 1242, -6275, 3762, 3882, -6063, 1572, 5220, -4543, -1033, 5475, -2053, -3401, 4137, 112, -4836, 2829, 2500, -5723, 1172, 4729, -5835, -822, 6696, -4480, -3425, 7261, -1430, -5102, 5347, 1700, -5345, 2429, 3810, -4629, -727, 4815, -3117, -3118, 5317, -1830, -5102, 5642, 466, -6714, 4251, 3305, -6168, 1807, 4893, -4488, -1135, 5622, -1513, -3430, 4092, 763, -4728, 2702, 2568, -5300, 1457, 3798, -5415, -104, 5013, -4724, -1677, 6081, -2416, -3865, 5196, 888, -4897, 2524, 3764, -4230, -221, 5011, -3132, -2836, 5026, -1837, -3919, 4970, -712, -5316, 4207, 1485, -5730, 2268, 3928, -4395, -786, 5077, -1487, -3341, 4291, 1295, -4466]
715d466O743N01o966M994K182o804M064K735o473K785L965n527N32N103l607k793
731c032N348m0n654L766L685o733J136N707o117p43O505m730k361O103k784l454
747c398N344k88m768L231L311n138o69O044l218m223O542l59o286M760K047n641
763b709K059K591l239M51J847j511m59J449l73j041J700K30k566K091J724l968
779a724J131L333l705k70L224k448p68K045r39n95R60l76k91L21O60j162j31K327
797A592j784j258L450j360k504L174j43k567J726M42j307J88L36K43o79k76J257
814E30r60k26J475j352MJ651j400J01J064j019N6N73m50O4n68O79N09k040J041
833b68J457k601Q09K050k166k69J868m95r36M58J002p42q32J719n04j777K152
$$ y = [-4466, 2277, 2778, -4188, 806, 2988, -3816, 248, 2983, -3490, -705, 3260, -2267, -1735, 3368, -239, -3032, 2316, 2276, -3378, 388, 4073, -2660, -1524, 4183, -1934, -2677, 3828, -902, -3263, 2840, 56, -3398, 1946, 1658, -3110, 121, 3432, -1706, -2375, 3669, 451, -3772, 2770, 2411, -3875, 885, 2932, -2709, -650, 1941, -1298, -847, 1000, -511, -970, 479, 106, -935, 765, 995, -1571, 520, 2244, -1724, -593, 2740, -965, -1235, 1989, -459, -1227, 818, -121, -716, 244, -132, -423, -102, 558, -604, -735, 1592, -192, -1450, 2000, 640, -1864, 1310, 1167, -1400, 326, 768, -539, -351, -15, 228, -451, -727, 530, -430, -656, 819, -533, -529, 1122, -278, -177, 887, -132, -76, 497, 47, 111, -457, 222, 731, -1309, -268, 1189, -1412, -603, 1447, -719, -988, 880, 385, -551, -93, 909, 167, -665, 1054, 550, -1227, 925]
850I25l34j960K209m86j939K483n48j975J942L01j453N84J063p14r01J357N42
867A096k197J374J223k758J506J265l348J652K112l663P97K906k768q82K950p39
883E26k375K001J797l194K66L537l019j462M711k633k560M550j452l341L797J48
899A297l563K233J771l074j39L328j681k492L766qm031L522J363m861K744K700
915B875m734J016L181l384j06K733j983j293K690l57k662K349J635m094J495L929
931C290n032k83N703m006k384N565k007l720M408J16m135K241K359l577k12M021
947B347k751k230M924j295m446M983Q92n553L578K455n015J344L383l458o55L245
963A748j642k039K828K14l532K542K072m584J461M033m796j2M948l862j635M834
$$ y = [925, 591, -1369, 840, 354, -1585, 898, 350, -1625, 317, 618, -835, -251, 812, 98, -803, 554, 1096, -1101, 273, 1496, -1262, 244, 1509, -1839, -187, 1925, -1738, -941, 1965, -803, -1685, 1265, 526, -1849, 152, 1949, -1245, -979, 2558, -461, -1923, 2788, 155, -2405, 2145, 693, -2648, 1149, 1297, -2266, -33, 1738, -1336, -1475, 1853, 172, -2320, 1446, 1438, -2593, 929, 2292, -2569, 175, 2875, -1859, -843, 2338, -1046, -1152, 1581, -402, -1695, 995, 638, -2024, 325, 1960, -2134, -639, 3290, -1742, -2025, 3678, -328, -2712, 2853, 846, -2874, 1534, 1650, -2485, -244, 2115, -1462, -1674, 2347, -404, -2634, 2290, 995, -3451, 1532, 2424, -3129, 449, 2904, -2111, -767, 2616, -842, -1497, 1748, 106, -1933, 895, 1109, -2423, 119, 2191, -2393, -932, 3101, -1695, -1707, 3241, -621, -2256, 2578]
979B578j933k840L488K69l455J647K336l381k42L824k697k297M938j495l842M658
995A556n5m275L589J244m010J890K269l284l5L225j839k506L522M17m279K394
1011a77K563m627J353L417m067K02L597k842j000L344j425j838K453M00k766J202
1027b11K184k846o18L439k213j956L820j175k695L501n83k629K726M76k801J575
1043fJ539k005m88K355o87k240K331N68l254K027J567l644J465K245l045L03K354
1060A385j756q02J941k07j395Q49J057j588q5K024j556q80K274j139j345K136
1076I13j038j045K080r77j129J717Jj211L44R64l28j056J179K98j500J314L64
1093H90j913J284Q64k455J297J254j940Q8J180o08n69M24P88q24l05J443q83j125
$$ y = [2578, 645, -2195, 1293, 1562, -1893, -246, 2090, -1291, -1533, 2291, -406, -2703, 2235, 740, -3102, 1556, 1501, -2774, 815, 2059, -1951, -61, 2208, -1076, -1111, 2114, 275, -2231, 1291, 1708, -2571, -177, 2386, -2241, -888, 2529, -1538, -1336, 2261, -581, -1581, 1763, 338, -1500, 953, 1353, -1413, -211, 1973, -873, -1491, 1948, -265, -2221, 1599, 424, -2271, 1230, 647, -1982, 744, 1220, -1581, -6, 1533, -472, -960, 1395, 708, -1532, 799, 1367, -1887, 140, 1707, -1937, -472, 1773, -1272, -969, 1385, -371, -1173, 768, 561, -834, 15, 1072, -516, -601, 1423, -133, -1013, 1261, 122, -1223, 913, -125, -1170, 910, -67, -1196, 521, 522, -689, -345, 619, 291, -765, 414, 712, -788, 526, 890, -1023, 261, 1125, -1330, -33, 1221, -719, -631, 549, -59, -628, -204, 584, -240, -545, 898, 15, -1110]
1111a110K163n00j499J529p5q95P36r7l86K02j31K54p57K91R01j333R8J416j234
1130d27m0J256r00R0N55o34J86L02n38J33q2N21r9j108R92lj016J172k41j157
1150a038J594k57j261J470m4r22O35L24o80k6O65j37j155J088O38k105P64J901
1168A454k495mK360j866m41J955j020o77J412j68j268N12J534j601q32K336p03
1185D88k030K429k83k223K082L35k240J514P40j680N75Q89p61l48J194k47j335
1202i01J379O63k281J181J763k885N82K010k335j1K045j873l20K073r83j436J669
1219C40O98j834K82K129k020o32K616j666j500L168j087k356K956k58k587J990
1235B39R52k292M23J759j331j110K375l12k319K287J048l361J442K077k954O56
$$ y = [-1110, 1053, 553, -946, 583, 508, -387, 349, 252, -134, 68, -63, 191, -566, -275, 626, -707, -609, 807, -427, -467, 789, -111, -21, 534, -100, 86, 388, -150, -17, -99, 422, 323, -785, 207, 204, -812, 360, 119, -1038, 556, 299, -962, 508, 464, -458, 177, 501, -179, -205, 460, 323, -832, 256, 894, -1211, -447, 1454, -1041, -1045, 1315, -551, -992, 963, -57, -734, 678, 510, -758, -246, 1288, -313, -1145, 1191, 488, -1542, 887, 604, -1619, 463, 798, -1442, 72, 812, -868, -293, 596, -165, -513, 681, 434, -901, 478, 1141, -1140, 41, 1804, -1081, -499, 1511, -824, -835, 1210, -663, -983, 1090, 107, -1329, 340, 1038, -796, -514, 1615, -405, -1037, 1579, -87, -1587, 1581, 494, -1862, 1094, 836, -1751, 239, 1191, -1101, -678, 1081, -250, -1360, 1015, 703, -1616, 671, 1719, -1642, -200, 1877, -1077, -421]
1251d21K138k633l4K427j690j113J919J03j870P83J613j914j37K227j726o65K612
1268A619j766j147K882j392j697K509l31j965J645N53j968M48J838j604j082K668
1284A210o07k557K628P32l069K030J377l158J028K224k588k75K280j124j394J618
1300C55N33k138P83J733k151L2K209k002o68K852j689j009K322p79j323J524j17
1317D67j054N12R10j236k90J631j022j022J909l57j789J984K03k268J831Q28k355
1334a118J202J080j619NJ377p36r58J112M32j778R19J197k225L83K154k252m20
1351a245K394j183r57J712l49j017Q36M84r59k6J122p20p76J306j70j487J457
1368D22L1j422J178L43j402R19L02q54K82N62k81k31K87L27o31J91N62j137M68
$$ y = [-421, 1717, -916, -950, 1477, -213, -1326, 593, 696, -1174, -391, 1222, -692, -829, 1398, -328, -993, 1619, -147, -1294, 1588, 196, -1501, 1008, 677, -1288, 357, 910, -1058, -610, 1228, -376, -1458, 1210, 603, -1954, 674, 1406, -1663, 367, 1744, -1414, -386, 1838, -750, -1025, 1255, 131, -1263, 355, 888, -1250, -467, 1266, -885, -853, 1356, -646, -1314, 1538, -151, -1160, 1162, 383, -940, 584, 467, -587, -75, 835, -401, -691, 940, -82, -1104, 805, 448, -1341, 643, 846, -1422, 409, 1237, -1118, 84, 1164, -455, -450, 927, 191, -767, 345, 777, -1001, -82, 1115, -1110, -727, 1427, -825, -1245, 1149, -34, -991, 721, 372, -645, 191, 675, -284, -310, 812, 92, -684, 622, 452, -1035, 422, 453, -969, 209, 552, -850, 69, 371, -483, -201, 361, 80, -151, 136, 463, -168, 23, 585, -552, -84]
1387h4R62j457J01J274j396Q2J092q07j93O65Pm12M0N91m59m73J115k96j047J331
1407F36k05j180J105N3r25O47R5o97J57L62Ql18K14N66p95j3J088j041p1J121
1427H07q46k15Q57o33k57L99j14j43lJ73l5l20L27J47p47Q45K05j046Q43K91j037
1448e02O33M70q23K13K98k78j77J97K73p12J57P38q55L1J040j092j54J415r06
1467c4o07J271m74o07P73J40p49JP29m80o57J128k24j114J224K62j573J141N30
1486F80j487P84O82j045K05Q46o81l04N59K56q49L04Q53j343M6J453j381l59J759
1505I78j324l84J391o53p37J126l5p78M57N98q42j55J078n81j051J564k59j536
1523a143J663J3j621J161N93j479M80R01r25m2R38l75p84Q82N34j482O48J107
$$ y = [-84, 878, -579, -478, 796, -600, -518, 574, -233, -426, 239, 246, -166, -126, 465, 6, -467, 648, 352, -695, 636, 431, -749, 356, 409, -516, 131, 226, -471, -314, 48, 56, -262, -48, 518, -277, -290, 798, -243, -314, 807, -39, -254, 603, -30, -287, 112, -2, -145, -148, 25, -10, -330, -3, 144, -603, 242, 447, -599, 244, 535, -502, 131, 601, -222, -9, 289, 11, -166, 31, 304, -408, -251, 487, -368, -337, 703, -389, -543, 872, -34, -641, 630, 156, -451, 322, 462, -287, -286, 443, -37, -694, 434, 210, -904, 320, 582, -991, 150, 680, -807, -23, 659, -386, -181, 665, -16, -320, 239, 495, -354, -50, 803, -540, -494, 959, -422, -781, 978, -346, -730, 661, 8, -729, 397, 362, -416, 41, 639, -203, -358, 720, 139, -912, 652, 393, -1143, 520, 533, -1088, 73, 666, -813, -333, 568, -357, -399, 539, 164, -620, 262, 796, -686, -38, 1069]
1541A069j703L61J449j727j09J612j219n02J305m29p87R05K69r03J58J074j058
1558b35m61J567p01j184J904m83j433J604Q8j751J198N34j304K76R55q35m06J152
1576D85q6j317J132O05j580P26J101j798N34J377j682M4J316r35n09R98l11p74
1594f74O85M56r34m0J194r02m31J535q44r47J684n64j107J460j98r67P14M37j043
1613d86J59Q40n91o59J063k8j224J241M15j539P24J154j634L78J141j271K9Q14
1631E26l61p40Q00J74q34J85R04q99l35J184p98n01J351n53p38J062j75n81O82
1650C53r8n27L19L07k63l92N88j74o77P55P2j062Q66L42j029O33N24j012N56L23
1670D04n00m4M48k69k68K35M23q08R1R56r77k58J134o79n49J125m87n04P90j31
$$ y = [1069, -634, -273, 1176, -551, -660, 952, -267, -769, 536, 107, -680, 225, 494, -409, -251, 823, -235, -696, 871, 170, -1014, 890, 407, -1026, 578, 666, -1085, 113, 647, -657, -381, 574, -261, -667, 485, 399, -918, 214, 819, -761, -35, 1066, -732, -198, 1179, -503, -459, 857, -78, -587, 411, 100, -674, 11, 467, -467, -507, 687, -215, -646, 889, 45, -902, 782, 218, -889, 571, 373, -594, 120, 557, -486, -327, 513, -78, -737, 326, 298, -926, 315, 730, -809, -85, 1069, -565, -187, 954, -317, -288, 526, 165, -575, 225, 399, -435, -250, 654, -245, -580, 604, -194, -695, 656, 103, -635, 427, 252, -329, 353, 255, -272, 47, 354, 91, -301, 287, 113, -564, 191, 263, -799, 67, 409, -620, 13, 537, -475, 81, 404, -96, -140, 308, 39, -229, 6, 429, -379, -288, 668, -309, -567, 567, -112, -661, 464, -23, -527, 263, 132]
1690A32m05L24L61m61k55N55k0p11N78L69q97M46M38r20L09N65o91J44K92j23
1710C0j19J27J07j02k07M78k75l15P23l72m03P72m61l24O96n02j75M20j83j17
1730b02J47J04n9j27K51N4n09N25K31p65M52M47r69L80L36n74K29M50m00l88K93
1751i4L35l73j09O34m88l32R99m36o04R31j26p88Q85j95m82L65K17n61n0L88J8
1772A34n50L15M95r36M22N87q27M20L40p45L87N18o92P5L16k20j77K35J53m90
1792b40J59N02p11r4Q96p35m58J170m39n73J001k87p05P17J76o02J04M90l33m88
1812d50P34k9r66R03K34j118O81N69j068J62Q56p65l6P05k93k78K40L06m97PM88
1833C85n95j06Q26o93j55Q05p46l11J096o39l38O23L7m94M38K28n38JP17m43o08
$$ y = [132, -273, 51, 412, -49, -304, 251, 231, -480, 98, 467, -430, 16, 454, -466, -157, 408, -283, -139, 153, 30, -89, 38, 145, 43, -164, 314, 39, -276, 447, 75, -328, 444, -17, -341, 355, -147, -322, 98, -85, -202, -55, 49, -10, -137, 114, 168, -341, 184, 415, -350, 102, 549, -420, -40, 296, -278, -49, 401, 1, -387, -94, 241, -132, -241, 393, -95, -427, 572, 136, -468, 463, 337, -451, 434, 239, -243, 122, 339, -222, -272, 116, 134, -416, -101, 394, -542, -120, 467, -360, 60, 400, -345, 42, 560, -132, -57, 259, 39, -138, 97, 250, -240, -81, 421, -290, -384, 512, -223, -681, 489, 50, -523, 478, 191, -514, 203, 379, -223, -119, 371, 38, -450, 284, 255, -711, 192, 426, -692, -11, 558, -510, -348, 508, -257, -293, 412, 119, -159, 81, 387, -110, -103, 385, -210, -316, 510, -183, -338, 467, -279, -590, 506, -133, -471, 152, 189, -305, 133, 361, -177, -176, 541, 98, -510]
1854e10P87l1q21R19Q0j363J077N81j423N99O84q32j84P56j83n47N68M29j003
1873d17K85R40j093k06J229p59m27R95m97n89P00m1n63M38K65l59j93N99k08m49
1893c50P69k07o18P20R2q91P00J87r79P07J39p01K68M04n72nN13Mn47L85L94p34
1915c22K92P26j109K49R81q58k83Q99o89l17O77j08m56K85L01l57k90O24k57n77
1935e89J014p7q82P68J52q62O65K22p27K43L29l09j69K32O5l26K23L52p09K19
1955a66N22p51J60O71n85J6N15m32p3K67j78j38K17P5k77l0M18l76j87O36l36
1976c2l99P65l49m46P82j17o18N79O4l74R9K90j44m11L93K49p14K48N38p67J62
1997b02O27o61k1N94m75M3K93p8k24J00J58k3k80M14p6o66O16p3m91N71mm49M38
$$ y = [-510, 277, 246, -575, 344, 424, -939, 138, 719, -704, -105, 579, -253, -437, 319, 136, -411, 157, 586, -417, -132, 808, -285, -491, 738, -21, -448, 547, 50, -539, 161, 120, -443, -5, 260, -99, -292, 307, 99, -350, 419, 212, -406, 314, 406, -485, 215, 402, -577, 130, 269, -432, -164, 240, -332, -337, 176, 180, -367, 18, 412, -322, -30, 696, -413, -164, 817, -41, -324, 575, -114, -431, 246, 138, -318, -33, 268, -89, -379, 245, -12, -589, 425, 348, -534, 234, 386, -476, 189, 411, -316, -73, 256, -53, -222, 10, 75, -251, -28, 324, -385, -166, 356, -395, -235, 436, -149, -133, 382, -50, -123, 144, -34, -172, 45, 120, -157, -187, 231, -145, -332, 304, -32, -431, 334, -15, -461, 321, 204, -414, 165, 229, -145, -46, 244, 100, -311, 82, 331, -383, -135, 403, -364, -202, 425, -236, -257, 337, -138, -95, 198, 120, -104, -4, 154, 131, -149, 265, 189, -477, 139, 66, -425, 146, 142, -307, 131]
2020A31km55M33j13K3m9l7J66o7rK31m54J25M76o97K30M24p06J23M56m16K6K04
2043D3k10rJ58J78k25q6L29j11l43O86j72o12O52n5o28N41j18k90L09o9n3k7q
2066a20K91m50K75M36n69L1O16p04O1N59o44O3M98m13j19K72Qj43n4K36j09k47
2088b26M45j88l89O00j22m78P85j88n72N33L4n25L52K08m41M7K69n9m79L81K37
2109B24n71J39O24p47K63O79q89M3O15n28r5M94k93j30K92L21n53j48N30j95m93
2130d18P59k26p22Q95j90o17O96O0m87M70J4l48J95J58l8m20K61J48n14L59J60
2151A95n79K71N40p90J56O68q05J69M37k77q0K26Mk40l9M45l01k73O37k82m59
2172c77P24l64n35P75q7m45L91Q7m39M41M5j73j66L20L1l87L44R1o16N97J84q43
$$ y = [131, 129, -326, 107, -6, 17, -32, -69, 97, 30, 21, 252, -202, -77, 399, -298, -68, 356, -350, -227, 229, -187, -161, 43, -167, -176, -18, 160, -65, -151, 178, 67, -276, 410, 238, -374, 278, 223, -405, 136, 18, -272, 37, -32, -85, -112, -120, 171, -279, -4, 432, -137, -106, 510, -194, -133, 426, -218, -155, 343, -70, -189, 83, 91, -52, -106, 130, 21, -226, 219, 31, -358, 242, 120, -358, 427, 239, -333, 200, 234, -291, 61, 269, -172, -125, 144, 85, -394, -13, 224, -347, -208, 416, -331, -68, 611, -278, -235, 380, -148, -243, 251, -42, -172, 120, 441, -112, -260, 270, 75, -418, 341, 115, -607, 288, 98, -519, 177, 237, -250, 220, 234, -114, 81, 239, 201, -219, 42, 190, -324, 35, 195, -384, -113, 427, -363, -207, 461, -344, -175, 262, -15, -95, 131, 135, -105, -144, 301, 0, -273, 364, 82, -377, 347, -17, -552, 223, 136, -309, 82, 169, -270, 171, 216, 43, -123, 197, 228, -159, 185, 276, -340, 257, 441, -402]
2194d02M00K70n88J89L72m22qL25k4k65J70K05l37P3M68m95k55P98l76m12O19
2215C05k96m05O53j98k99K46L0j72M3J38r0k19M16K17o75M72J93o90L49K99n83
2236b66J83K12k62J65Nj41k8R6J57l11J23L78m23k30Q03m33k66O23l52l14N65
2257B84k98k04M57j08j87r9J42M8l27M09K5n29M76K18o60L36K33l53K70J81m23
2278a09J09J31j16k5k1J6k1p1K16l46P0M30l00q3L54k92j03M61l71o3L94k01q8
2301b9J08l3J45l18J83J22l62K73n5m15M39Q6n76L66K97l67J59J24j36r7K59O3
2323B36k86j3K66l93r6N31m05j64N04k71j01L98k24j55K30ml2l5J00O9l52L74
2345A77J27n43L64J65o47L64J52m30K74J27k15O9J12nm4o6R9o0k08N19k48k20
$$ y = [-402, -2, 268, -320, -131, 241, -181, -189, 136, 112, -153, 17, 222, -115, -42, 426, -69, -324, 474, 98, -314, 305, 9, -396, 257, 59, -240, 6, 36, -136, -93, 45, -45, -264, 152, 369, -306, 166, 359, -331, 18, 317, -266, -83, 129, -133, 32, 37, -104, -132, -36, 121, -190, -67, 311, -112, -342, 461, 28, -238, 385, 33, -281, 284, -14, -218, 239, 131, -56, -155, -13, 35, -292, 117, 142, -387, 89, 307, -353, -17, 216, -137, 133, 314, -109, 0, 131, 15, -10, -31, -15, -36, -107, 109, -237, -167, 263, -37, -120, 234, -58, -161, 300, -71, -134, 260, 59, -29, 79, 46, 191, -127, 56, 178, -184, 89, 34, -381, 58, 144, -432, -66, 231, -136, 23, 147, 11, -86, 173, 236, -50, -63, 203, -190, -286, 245, -160, -324, 180, -91, -192, 206, -18, -173, 57, 53, 21, -14, 86, 155, -197, 177, 304, -239, 125, 290, -357, 7, 159, -271, 3, 130, -85, -16, 96, 91, 47, -19, 80, 20, -188, 331, 83, -137]
2367a37L90m14P2N01n54j14M80l20r2L70j84j36R9J55j19k33L97Ll62L94L4n47
2389c17N30J26p05M30J45n03J56K64k78j52K87J75k14j28N13m68j95P37l86l08
2409b91O55k66l72M78q5j36M4m6L4j15M3J02k83J94J76l28L02p2k24L17J7m13
2431b69L56J60m39L64j0k56J29O8k05j72K67J51l79J36L29m65j4O85n28j90O02
2452C20k88j17L66j04k71KM10k66k14K87j24l40M34R4n09L49J09m05L39J39k93
2473h2J37N9j65J29NL2j54r0L39l40N0K70l63n9L83l45K0M60m51ML67k92N3K27
2497A94j01j39m3L05j05k71K90o3l29N32k19l84M80o4l93K93N9k47J36J18m4j25
2519a20J29K83m52J18L67m12j5L49l38M9K59l70l2K94l08O2K12j06L1J6O3j35
$$ y = [-137, 253, -161, -89, 412, -142, -256, 224, -96, -188, 182, -2, -138, -39, 116, -3, -236, 161, 164, -198, 196, 230, -317, 213, 339, -366, 64, 209, -294, -138, 126, -152, -304, -17, 158, -56, -184, 329, -139, -334, 403, 17, -291, 364, 98, -274, 204, 119, -17, 27, -19, 15, -100, -57, 45, -238, -44, 132, -196, 106, 34, -190, 127, 144, -269, 87, 247, -192, 172, 162, -94, 35, 103, -102, -274, -7, 144, -235, -99, 230, -235, -249, 436, -92, -282, 320, 32, -85, 281, 177, -94, -92, 318, 52, -162, 125, 1, -339, 95, 189, -320, 29, 138, -267, 72, 211, -82, 55, 114, -51, 78, 83, 115, -39, -129, 210, -130, -80, 190, -173, -232, 151, -194, -174, 286, -165, -161, 206, -86, -33, 194, 93, -46, -89, 216, 111, -160, 130, 67, -262, 270, 51, -333, 147, 83, -310, -17, 42, -205, -69, 49, 5, -120, 9, 292, -160, -42, 325, -87, -102, 247, -91, -42, 217, -153, -185, 109, -199, -137, 75, -31, 0, 16, 79, -56]
2541e6o2L09j86j93L90q6l81M22j17l44N21j67l02K77o5j31O0J27J5k33J84J95
2563A77k88J08J98m79L10K04l50L2K92j89p9Q2p0j05K5J60Kk66M35j53l05L63
2585A04N0l28K71L8l48K93J45k88J77n2q5j14J06J22k20Q7J71l97L16J02l90K26
2607a4J57l98L99R7l81L33j35o0nO0Nj09r2K66k10q4L09j90k04N54l01k45L84
2630A36j32j58K77r0M2r2k2J91j78n5J20j90pM04n05K11K62k49J4R4J3j07J07
2653H6JK6j15Q1J1k31K77r2j73K50j23k39L19m4j61J78j57QJ49M8j49O5N6Mj77
2678a02J76R6l69J92J91l65J65K94m76Q3K61k81M2J46p1k34J87J47k53O2K53J6
2700A60k46L34k99j01L71j68j12J01j00k5K89k33q1P7J08J9k39J53J50k40K2K35
$$ y = [-56, -118, 191, 5, -188, 202, 116, -265, 157, 40, -304, 217, 50, -252, 25, -40, -171, -111, 16, 31, -202, -18, 177, -111, -3, 195, -284, 26, 230, -120, -88, 204, 15, -64, 18, -52, -157, -132, 28, 30, -236, 199, 46, -259, 104, 154, -174, 97, 135, -213, 80, 225, -63, 114, 62, -23, -137, -31, 91, -129, -42, 129, -268, 48, 150, -240, -14, 143, -255, 144, 241, -140, 193, 58, -2, -7, 53, 58, -51, -143, 123, -87, -171, 138, -52, -256, 298, -3, -248, 136, 4, -154, 123, 33, 75, -17, -39, 152, -26, -81, 39, -151, -158, 246, -259, -48, 214, -35, -21, 73, 86, -21, 86, 87, 113, -2, 79, 90, -141, 136, 44, -129, 121, -2, -241, 78, 34, -127, 51, -106, -98, 51, 99, -50, 15, 71, 75, -102, 74, 170, -199, -7, 184, -181, -16, 278, -198, -115, 146, -135, -93, 53, -18, -252, -65, 82, -171, -109, 144, 160, -86, 248, -51, -152, 219, 51, -61, 40, -60, -85, 204, -29, -110, -33, 75, 94, -145, 8, 158, -82, -60, 175]
2722A75l59J57L33l51mJ94k06J8kJ0k5M9J54j34j40L54l08p7L75k02j83M54k60
2745B2j65K93j72j11J73K5j46L2J53kl27K80J12l52K19J25m04L30K08m82K18J95
2767B24l14J53J0j54L2J13p3j79J18J64p9r8J83j24k61M24k32o1L60j81j30K01
2789I6L3j88Q8R6nk30J06O9l51L76p0k27J56J31l68L40J17k75J13P2l4K2M4n2
2813E9j15K2Q4q9j15L54j91j52K37p3j48L41k81n8L01k79J40om0m6QQ0l1j47L39
2838A94j05k27K07M1m57M47k0l59L50p2j12J08J14k8j17J24L5k13n3L64k50j34
2860a63L03j38l5Q7p9q7K23k02L8Q4j65K33p5j22J10n9K05o0k41K29m9j65K26
2883I8q1p3K01j02o9J50j61j2n7J48J2n4Q7J31k95J00K43l59J8L01k62M6J12r0
$$ y = [175, -184, -27, 306, -45, -49, 145, -61, -43, -45, -35, -60, -11, 143, 9, -131, 223, -85, -162, 213, 11, -172, 282, 22, -143, 150, -22, -133, 40, 65, -81, -49, 104, 102, -225, 55, 167, -185, 34, 159, -245, 85, 293, -189, 29, 224, -90, 63, 73, -81, -49, 64, -9, -188, -70, 94, 15, -83, 100, -24, -285, 139, -93, -154, 206, 25, -105, 96, 129, -59, 29, 125, 120, -110, -4, 65, -286, 90, 20, -207, -51, 80, -288, 52, 169, -106, 7, 79, 45, 67, 111, 59, -56, -34, 50, -39, -154, 200, 9, -143, 94, 21, -127, 214, -67, -125, 176, -103, 37, 31, -9, -55, -47, 33, 2, -145, 194, 89, -138, 69, 110, -347, 100, 80, -279, 71, -1, -113, -5, 109, 81, -36, 88, 123, -90, -143, 221, -29, -163, 140, 2, -33, 54, -25, -112, 111, -91, -53, 31, -134, 99, 24, -98, 12, -47, 158, 98, -143, 86, 37, -128, 98, 17, -56, 145, 43, -26, 124, -37, -49, -106, 42, 54, 0, 87, 218, -77, 23, 266, -93, -75, 226, -36, 10, 122, 32]
2907C2j10Q0J44k52J01J6K7j21P7J66l92L04N2k37j1P0J0J33p1j32O8L9lK9n3
2932c4J01n2j59J89j47J07J26k39M3K76l06JK79k05%P9n8n1nN6J17k39J45O3j33
2957d6J29j12r5J69Nj45J57Pj45L2R1n6N4o3J69k43L2J60k36L7K71k10j13K69
2981A18l23M0J99r9n2L04k21O2J5q7K05j16qK44l86J43J18l19J72K1j14QJ6o2
3005a22L9N4O8J17j22l6J2m4J28j42M0J20l01J71J75k84jJ50k42J22J17n6m7J19
3029C5L3p0L2j5J15k01J88q9j78K46J51l83K04L5j38O2Pp5o3MK50o6j67J94k36
3054a25J1K70r6o0J25k19J9J88j60k5K23k38J17J1j03O5p7P2O8j50K91j52k21
3077a66L25r0k00K27L7k57Q8J9m9P2J03q2j24J84n8j51lL31k79J2J93k14J13R0
$$ y = [32, -78, 2, 146, -106, -5, 11, 38, -83, -6, 160, -232, 72, 124, -113, -124, -54, -44, 89, 18, -114, -46, -7, -10, 19, -34, 67, 15, -144, 45, -102, 5, 131, -108, -65, 211, -95, -94, 185, -20, -20, 59, 1, -50, -55, 1, 118, -121, 24, 87, -46, 83, -29, -124, 45, 50, -95, 62, 69, -76, -44, 47, -9, 45, -18, 151, -92, -60, 100, -136, -99, 172, -38, -151, 118, -205, -165, 34, -65, -117, 187, -34, 28, 43, -44, 161, 45, 37, 281, -105, 38, 156, -163, 9, 30, -84, -76, -60, -122, -83, -29, 39, 156, 34, -2, 10, -34, 94, -48, -8, 112, -189, -18, 157, -127, -128, 22, -220, -98, 19, -37, -84, 35, 68, -2, 30, 15, 130, -71, 117, 28, -150, 96, 247, -136, 68, 103, -35, 27, 34, -41, -104, -100, 150, 84, -83, 111, -125, -114, 156, 60, 0, 125, -94, -75, 113, -47, -72, 151, -87, 30, 41, -62, 3, -74, -2, 66, -84, 207, 55, -166, 159, 69, -131, 96, 133, -124, -36, -17, -66, 6, 109, 27, -97, 87, 29, -122, -125, 206, -73, -61, 132, -82, 31, 121]
3101A21p4O5J1j85jN7O9r7J2n3P1j47K41q5k22K20Q8j02J66k8l11K69J7j45R9
3126E6K4j10Q0j9n3j77J42K04k86J11K01l95N8K49k89J80J29j13J10j54M9pj03
3149a13J64j15k7J66K7j91J28o9j04K46j13p7j6R9r9P9J27n2j3P9O4k21N7J14
3173A40k05N9M3j13P6J18j76R7j46LJ95k14J78J4k11Q2J24r4M8O9k80L79j47j84
3197a45J97j32O4J12m8j13j4k5R4N7k5O6j50O2K16l12J36J16k61K2J84k12R2O0
3221D1p0N8L3j27l2l8J87m3j54K81j27j76K37l1j17J54j10PJ50j89P0M8j08O5
3245Io7P7Q1j35L7m1l8P3R0k10J93o1j96K39j4q8Q4k7p0J90r9L0o6j17Q5M8j39
3272a32J79q9j35K62j25j3J92r9l2Q4q1J14j76Q6P7j09p6J02j17N0K11k98P9J81
$$ y = [121, 47, 112, 123, -62, -63, -6, 63, -34, -22, -75, -4, -151, 90, 5, -217, 3, 91, -11, 155, 127, -184, 85, 102, -43, 56, 80, -30, 50, 31, -22, -199, -57, 147, -139, -28, 173, -222, -164, 85, -204, -24, 105, -8, 102, -52, -3, -10, -113, 51, -64, -91, 75, 102, -89, 39, -30, -134, 112, -1, -78, -94, 5, -94, -15, 112, 60, 47, 126, 190, -31, 26, 140, -65, -6, 37, -76, 0, 118, -58, 39, -107, -104, 91, -123, 55, 69, -142, -60, 64, -30, 18, 87, -193, 186, 39, -145, 52, -80, -16, 96, 48, -65, -79, -104, -10, 47, 22, 88, -62, 0, 216, -96, 40, 156, -105, -83, 101, -111, -19, 41, -29, 29, 62, -65, -97, -135, 52, 9, -145, 136, 9, -167, 70, 39, -78, 76, -34, -27, 123, -66, 4, 52, -56, 9, -58, 19, 100, -35, 2, -39, -77, -4, 86, -124, 69, 8, -188, 51, 37, -51, 33, 6, -64, 126, 27, 57, -9, -126, -41, 7, -132, 47, -42, -177, 85, -40, -53, 139, 40, 8, 92, 11, 125, -51, 35, 112, 3, -73, 29, -88, -38, 173, -125, -46, 135]
3296A35k06P4R8L8r1j28O1q8J35J34j21o2Q5r7j42L28j22j66K16q7J2Q4k1k0o3
3321a4M3Mm0n7J36j42L7M6p8J45N0j60J51l2l17J96J00l20J96%o7J82k07K29r6
3346a5J0O7Lj36R5nr7K33r5j64J96r3k9P7p3r6R3k1O7o5J17p7K3k1N7j44J55N9
3374A21k46P2J04j93P0O5k8M0l2L4j0p5R1k7p6J93j95L7J51m8j08K44k26j2J74
3399A20j27k4K0p3J20j05J92q1k8M1M7k20K41l6k49K18P1k50J54L5k3n7j8j0L2
3424a0o4J19oj70J51q6M9Q0k06J21O6o2q0J70m5mj04O9L9o8o5J43j38O5J95j91
3450c2J37o8m7M5m7LR4j82J60O3k8j0j42P2p7l8J7R7o4l4J93k62J24R1q7J1j0
3477b1j19Q9l8QR2K4L4r4l4J69j05p9O1P0j51J61o2q9L5O4J45k84J52m8J30j20
$$ y = [135, -71, 3, 101, 139, 48, -80, -19, -107, 28, 162, 41, -21, 64, -33, -175, 153, 31, -135, 81, -6, 6, 90, 69, 49, -14, 29, 33, -7, -64, 72, -70, -33, 13, -65, 80, 130, -30, 121, 89, -228, -32, 68, -252, -56, -56, -123, 59, -148, 81, -15, -5, 62, 65, -71, 24, 19, -78, 155, 60, -104, 92, -1, -30, 47, -26, -122, -29, -50, 17, -48, 69, -8, 15, -6, 51, -93, 62, 121, -125, -53, 51, -142, -72, -7, -35, 5, -27, 7, -3, -78, 13, -14, -90, 103, -92, -55, 96, 48, -60, 184, -42, -54, 120, -7, -31, -11, -84, 36, -69, 123, 42, 14, 55, 102, -118, 123, 87, -162, 56, 127, -123, 31, 66, 43, -14, -32, -42, -10, -74, 45, 39, -131, 20, -66, -17, 63, -143, -22, 44, -18, -98, 72, 27, 23, -81, -12, 27, -41, -106, 37, -101, -36, 159, -32, 105, 37, -10, 35, -12, -9, 85, -97, 63, 126, 98, 88, -54, 18, -59, -97, -80, 17, -47, -81, 112, -150, -26, 65, -22, -11, -21, -140, -51, -89, -81, 11, 35, 69, -25, -59, 110, 5, -74, -13, 57, -94, 67, 5, -84, -49, 15, 160, -124, 28, -20, 110, -10]
3503a0J00r7j74L02q2r4P5o8Q9nq1J14n3m7J19qj61J23k5pN2j06J11l7n4Q2j2
3530D6mm8Np9J02J5o5k9L9Q9pl8J06r3j19J24j27J05L0q4N3M8j45J08m3J03P1
3557A63j91N3k0o8Q3J2j44J26j0k1o0K18j34j3Q4k13J06m6Q4J3r7O3J40r5qN9
3583H4r1M0k2j14K70k72J42oq4N0O3j23P7K15k62M3k0n9JK4Q6j00p3J58L6k15
3609a52J94n1j9J33j22o4J5Mj4N5jJ21k07Q1P8n1l1J30j32q2J71p2L9L0k9p9j1
3636f6L2L2J03j41J85j09q0J30j81J06j45K08j00j7nJ26j14p6K48j35p5K13j89
3659e0L3l9oJ63n8m0J12j07L3Jr3jQ4r7k2J40j75J17J1m7O0j28J68k3j36K49n0
3686I9p4n1K1P4p2oq4qO6M2q1n2P2N4K0m9l4N9j2K9r1J62j55K65j97p0J52r7k4
$$ y = [-10, 90, -7, -181, 121, 39, -55, 20, -48, 41, 36, -45, 69, 16, -31, 88, 80, -81, 42, 17, 10, 62, -44, 67, 30, -24, 58, 46, 42, -6, -1, -80, 22, 37, -28, -57, -18, 71, 64, 26, 132, 39, -80, 44, -83, 22, 52, -32, 21, 69, -76, 32, -11, 92, 163, -28, 25, 5, -63, 20, 32, -112, 14, 4, -17, -77, 141, 7, -6, 78, -135, -29, -75, 9, 22, -75, -12, 128, 33, 25, 84, -7, 33, 11, -103, 167, -105, 37, 31, -53, -3, 60, -63, 14, 229, -33, 10, -10, -69, -68, -44, 42, -58, -131, 27, 63, -152, 42, -9, -28, 105, -17, -81, -66, -62, -76, -21, -22, 99, -108, -27, 51, 0, -31, 99, -33, -115, 56, -16, 23, 53, 24, -55, -66, -34, -2, 101, -40, 145, 36, -44, 86, -95, 11, -134, 74, -26, -43, -48, 78, -36, -112, 136, 1, -74, 139, -50, -17, -56, -62, 101, 43, 3, 115, 8, 41, 42, -51, -52, 32, -65, -87, 53, -122, -5, 6, -41, 19, -109, 59, 36, -100, 149, 99, 25, -26, -5, 69, -3, -9, -93, -101, -35, 7, -74, -126, -54, 0, 20, -29, -63, -4, -16, 13, -78, 84, -71, 194, -3, -73, 79, -18, -42]
3715d2Q3o5l3J06n9L9n2o5R9q9m7J65j68L7K20p6n2M4m3L2r9M5J1k9k9R8j29J8
3743h0J74j59J42J8r2J24oj31KR0p6n5Q7Q4N6k49J14k0p5J33j32m8m7J47J7Q3
3769A01q2J4j1j6O9p5n9L8r7NJ67q5lJ51j88L1O4r7J13Rj72K02K5j14J19p3m6
3796a0j3O9n7K5q2J07r4J3P2m3K0l3L3j9N6l0L6q0L1j17J51j4m1o9M8J36q1K3
3824C7l3o9J8o4o0J33O6l8N4j09Q0kloJ5k8J38n0j95J04O3j17J16K6j24Q2j27
3851i3L3M0k9K4J01J4o8j9j34N6P8L8l5J5J2L4k04J62m1J06r9p1J5Q1o5O6oj5
3879dP3J2l8k2OM1o9J23q1L6p3N8j67J03M8p2J63p3j06J2P9n3n3O8K0j8l6K2J84
3908A83j93O4j33J15o5R5j10nO0l0Q0n8n6J04Q9j30L3k1Po1k1R9k2Q4j23n9J10
$$ y = [-42, 41, -24, -57, 49, -10, 29, -23, -88, 11, -78, -125, 40, -128, -91, 129, 53, 1, 45, 2, 34, -65, -20, -9, -38, -67, 31, -98, -80, 94, -65, 77, 95, 3, 127, 121, -10, -8, 82, 6, -49, 38, 122, 178, -71, 43, 23, -52, 81, -51, -99, -146, 1, 18, 101, 19, 33, 22, 6, 75, 0, -59, -21, -118, -113, 54, -31, -34, 117, -71, -40, 24, -73, 40, 49, -123, 79, 104, -10, 109, 36, -10, -23, 46, -11, 14, -68, 39, -55, -42, 30, -13, 7, -26, 7, -12, 44, 14, 50, -30, 1, -116, 35, 21, -20, -89, -41, 95, 14, 37, 4, -65, -47, -111, -171, -38, 28, -10, 44, -65, 15, 13, 10, 4, 19, -9, 129, 79, -116, -12, 51, -66, 50, 76, -48, 34, -93, -60, -20, -49, -25, 76, 90, 22, 3, -131, -75, 3, 41, 6, 21, 33, 67, -137, 25, -16, 90, -9, -80, -65, 16, -49, 17, 11, -4, 69, 81, 43, 21, 27, 68, -1, 122, 41, 77, 4, 62, -105, -2, 46, -26, 137, 64, -42, -30, 49, -4, -57, 11, 31, 13, -23, -1, 183, -10, 54, -79, 36, -29, 66, -44, -49, 11, -19, 61, 3, -53, 51, 140, 10, 43, 22, 29, -32, -53, 46, 24, 108, -15, -74, 36]
3935C6j15l4J01J03q4O2K3q2P5p3q0N4r7R4m8K8k2J31n8l6P6n5O7p5Qn1R2m4l
3964glJ26j2k75O5J66Jq9M2j8R3q9P5k0m8m3L3k8R9j5j21P3l7P0p8mK9nnJ07j25
3995d3L3R2m9n7R4j33J61o1q6K0R4j6p5P4j00P5J8P9q5j03J57l8j39K14p5L4k13
4022a28R5qnJ3Jq4J14q8J7l4J07P2j76J65n6o1J79j18m2j4m1QJ96k08J56p3p9
4049i2O0k2L7k1K3j2L4j25J50L7m1R7j03j6nPj7q0P2N2l0K0nq1k5J06n4o2J80
4078H4o6o3Q6o4r8K31n9l7N0k0J2n4L6M3j8n1j6M8n5J1MP9l1n2O0m0n0J55j83
4107e8J34l3j95J51O0n9J23k21Q5O5J2n0N0j11K0L3n5N3MJ1K5k3J15o9j49J11
4133B9j1j14J16K6m7J01ll5j4M5rp7r7J04K8J7r2m3N6P2l5L3j52J50j7L6p9K5
$$ y = [36, -79, -113, -12, 91, 7, 69, 92, 10, 85, 12, -68, -14, -111, -17, -65, -37, -59, 72, 14, -22, 54, -1, 66, -9, -1, -52, 40, -4, -7, -10, 116, 104, -171, -106, 60, 61, -28, 14, -4, 89, 0, 75, 55, 7, -36, -3, -31, 68, 53, -68, 5, -32, 38, -40, -44, -15, -20, -25, 82, -43, -10, 82, 33, -24, 70, -63, 98, 37, -49, -29, 65, 49, -26, 48, -52, 23, 41, 120, 35, -68, 89, 51, -88, 126, 51, 85, -128, -33, -41, -46, -33, -32, -116, -2, -90, -73, -107, 0, 72, -104, 61, 5, -56, 123, 5, -37, -51, -92, -84, 112, -96, 60, -13, -92, -32, -54, -17, -38, -15, -27, 7, -118, 32, 69, 28, 125, 22, 6, 1, 8, -9, -89, -17, 35, 5, 25, 20, -61, -86, 20, -34, -96, 84, 18, -45, 41, -23, -121, 110, 51, 14, 64, 44, 56, 2, 38, 81, 63, 12, -4, 44, -11, 0, 4, 83, 52, 0, 60, 20, -30, 125, -58, 76, 43, -152, -1, 59, 0, 123, -98, -13, 52, 64, 14, 64, -47, -27, 6, -49, 4, 8, 19, 44, 21, 136, 67, -82, 29, 18, -96, 20, 46, -1, 100, 97, 62, 48, 93, 84, 7, -90, 14, 42, 59, -33, -76, -20, 52, 17, 50, -102, 48, 31, 67, -12, 13]
4161A3Nr0N2l1k0R2Po9R4j51J13K9o2M9Noj2P5n5J26j88j6R9j2q4M1k1M5K3j47
4191i6K76j43qm2l8J38l7j02nN7p8j2J00m5m0J91j68M3O4j2j15p0J24l4L7J15
4217A00q5l8%l2R6L9j11mJ25j28O9no4J05j13O4k5O0M4o2j06J14K3r3JJ58k28
4244i6K00o1r9R3m3j35J34r9J31n1k4J25j04OK5n9J18M9j54N3O4j09Q9k8M7p8
4270fnL5M7j01p3Q9P0%k0P7n5r6N1ol7J18j01l0l8N3k4R1MJ00j29o1J9l8K3NQ8
4301E0q3P3lj1q0J2R0N1j19J6O4moo0m5J25p9l2J63l9n7k8K9k4J5n0K3J40k74
4330a43P8J14q3P4j13J00j20J39mj40J12j9pk6J63r3j51R1m3Q7Q7l5M4n3j40J66
4356H5j52J15JJ5l7J66k98L0J22j32J18q3l0J00K6k0K4k7j05J41k3p5N5K4j3j04
$$ y = [13, 18, -72, -20, -51, -71, 21, 28, -41, 53, -98, 15, 44, -18, 31, 36, 30, 18, 93, 38, 164, -24, -40, 59, 47, -37, 4, -17, 28, 51, -96, 180, 37, 29, -13, -51, 87, 50, -52, -57, 0, -78, -90, 10, -35, -75, 116, -52, -9, 55, 43, -72, -142, -18, -52, -15, 100, 15, -23, -23, -55, 41, 80, -31, -35, 90, -38, 31, 26, -38, 67, -46, 18, -7, 53, 97, 35, -71, 43, 66, -27, -26, 132, -96, 104, 43, -56, 37, -6, -141, -7, -106, 25, -26, -50, 75, -29, -23, 2, -57, 61, 110, -44, 9, 73, -36, 53, 25, 72, -6, -11, 24, 71, -30, -103, -14, 56, 56, 36, 113, 58, -38, 13, 7, -30, 88, -13, -43, -81, -28, -52, 39, 43, 143, 14, -47, -28, -66, -43, -38, 50, -33, 40, 37, 26, -54, -42, 48, 99, -20, -4, 60, 56, 50, -10, -55, 70, -9, -41, 122, 83, 26, -2, 27, 3, 18, -32, -9, 131, -143, -65, 49, -34, 40, -73, 27, -93, 46, 42, -98, 14, -5, -12, -38, 125, 32, -119, -28, -71, 16, 103, 68, 112, 59, -81, 85, -67, 48, 49, 64, 27, 193, -105, -75, 47, -85, 33, -50, -80, 20, 46, 26, 50, 23, -82, 59, 36, -39, 16, 40, 27, -77]
4382g7lP7PK4K0l8J1O1j60J30Oj43O0l1N3j1m2J47r7O7j7L4k0OL2j09R9p0J3l7
4412ho7L1J19j68Q6J1j0l7L3r6K0P3M0rk1p4J16k2K4N1j64R2RJ2n8PPO6j05J14
4442G2o3m6J20n0R4j10P9j17O8J50j82O8j36QL3L0p1J25j33Q0l2n4J05mm2oq7
4469a01J73j00K8j09K77j32M9j48O1J16q1j07P1j9p7O9l5J82k18J32K6m8j40K23
4493I2j21O1q7L7Q2o1j0n0J8o1j0R8N9j9n7MM6kkK6j29J05J4o4J8j4M3K8o3P1
4523E2nN0j15R2j24J12j1j14N9NL0m5N4j16J90k45J21k1J31p1k9kRj9m3L4L0j21
4551a12J69o0L2r0j5R8m1J61q8j40l2R7M5p2O6j1l9P2j5N1j11K8L1m7J10j75R1
4578Ck9O5o8L4j9kj16KJ25o8M0LL0o2KJ09j1lj6K8j9M3j75Q0K7M0q3L7k6M8ln6
$$ y = [-77, -80, -3, 4, 28, 48, 10, 21, 82, -78, 52, 58, -85, -25, -56, -3, -14, -56, 91, -6, 61, 44, 78, 58, 64, 96, -13, 86, 16, 29, -8, -75, -44, 75, -93, -7, 4, -6, -43, -10, -106, -86, -13, 27, 18, -3, -77, 39, 17, 41, 92, -72, 20, 29, 41, -17, -10, -3, 63, -42, 72, 9, -37, 83, 33, 127, 17, 96, -21, 47, 197, 15, 83, -53, -45, -12, 18, -53, 72, -61, 19, -13, -67, 38, 34, -8, -14, -101, 72, -28, 0, -109, 168, 36, 85, -63, -2, 114, 33, -74, -3, -22, -99, -30, -65, 117, -101, 31, 57, 9, -131, 92, -29, 32, -55, -18, 64, 3, -7, -57, -39, -100, -110, -12, 47, 28, -29, -25, 21, 19, 17, 43, -86, 19, 33, -31, -13, -27, 16, 44, -19, 52, 47, 97, -18, 74, -50, 62, 51, -63, -4, 1, 31, -14, 40, -76, 114, -131, -10, -31, 100, 29, 0, -2, 7, -12, -55, -21, 9, -112, 57, -3, 29, -61, -76, 22, -19, 142, 54, -86, -118, -21, 24, -48, 18, 7, -32, 40, 25, 76, -35, -7, 24, -23, 87, -88, 3, -26, 39, -29, 5, -14, -16, -132, -130, -5, -73, -33, -30, 0, -62, -60, 49, 38, 35, 19, 47, 28, 71, -104, -24, 3, 43, -40, -3, -29, 19, 16, -40]
4610d0l7K4J13q0k8J77j05P0n2M1o1p0oP6Qj4k0p0O4j67J52j9O3k1lJ06j62Q7
4638B6K0q5m1N5N8J29j93j8R3j31J40p3M3j03m9Q1J37j59m6J69p4J28j33K6J15
4663A15n7q6pOJ6K7j02R5j66K9Q5P7l8P5j22n2Q3RP7j15N9K8qP0j50N7K4Q5j4
4692A00n0j52M7J90j93M5R8q4m3O7q5J00K1Qo2l3k8J19M3j38J17j23M5Q9m2J8
4718G4j44M3kk6P3l8%J6N7k04J41rN3Lj0o4R7j17l2N9M8J3l1n9J4R6o9j04J54
4747C2j12J63o8o0J36j21J08p9k2O2l1j76J35J8Q8j19kJ16j40O5J6j00l9J44l0
4772a6L7J2k5R7Qq6O8j01O9j44M6M0K4k7j05L6O4J0P5j19j1M8L6m6m4l8J75m7
4800C6m8L3j31K2O1j4J50k21P0QP7j2L2o2l0N3p5N0o2N5M5M7r8q6P2jJ8m7K9J05
$$ y = [-40, -77, -53, 60, -20, -48, 129, 24, 94, 42, 83, 22, -48, -54, 22, 30, 16, -4, -74, -10, -177, -25, -44, 19, -2, -5, 101, -61, 26, 46, -39, -80, -25, 33, 162, -31, -49, 44, -87, 53, -20, 23, -80, -129, -48, 89, -70, -116, 53, -21, 107, -26, 0, 115, 58, -28, -35, -29, -13, 14, -88, 7, -159, -130, -45, 32, -6, 69, -53, -105, -22, -13, 64, -51, 8, 36, 28, 98, -52, 5, 29, 114, 100, 50, -102, -55, 135, -58, -13, 85, 1, -42, 25, -60, 40, 61, 69, 7, -26, -54, 65, 108, -30, 87, -36, 9, 98, 56, 74, -70, -27, -29, -55, 18, -20, -20, -4, 53, -151, -10, -19, 34, 37, 27, -37, 60, -57, -89, -30, 18, 31, 0, -59, -45, 51, -18, -122, 32, -80, 83, 15, -45, 91, -30, 78, -1, -23, 39, 8, -168, -33, -15, 73, -46, -48, 68, -72, -7, 9, -91, -130, 14, -16, 21, 33, 8, 105, 113, 27, 95, -6, 63, -81, -35, 5, 29, 2, -103, -67, -3, 7, 82, -37, -48, 0, 36, -10, -54, -92, 83, 36, -12, 21, -110, -88, -27, -41, 109, -112, -42, -34, 43, 31, 63, 1, -29, 24, -51, -1, -63, -8, 37, 84, -14, -100, -28, -29, -11, -58, -29, 76]
4830G6r8P1m1J32p0l8q1R7K7n2r4M0lL4j42J57j8j22K30m4Mr6kL3j8MO3lj23O8
4860in5K2J17Lj11J41o1k1j5N4L5k09J35K5m0M3j86M2J38j56J56r7J92r1J4l1
4886C5j07n0R8K04j36L4p6Q9j54J0Q2L2j07N2J3J07p9j07O4o7l2J07r0RP9K1j13
4913h2M4O7K6l3n4J26r9J15k05J27j9p5M1P4o1RN9r8N6k2o0o2Q2J38j23J3O7p7
4941b6k7J12n7m2nM5L5%j01J42l7Mj9K1M1j55j0N2n9J34j29N0O6n4M9j67J59n1
4969b9N3j03pO1M5q2L6k0N2q1LJ49j50J13j36K8J04k8J18r5j17K4j%J38M0r1q
4997A6LJ09j16jl1J06p5j09J87j24J22oj25O6J6m6m0N1l4K4J8L9o1K7q7J58j32
5024d5k7P2k4L0j1mJ42j97J18k5n5J30k20Q8M7Q7j09p6rP4J26j12m8J46j29N2
$$ y = [76, -22, 49, 8, 140, 70, 32, -49, 48, 75, 23, -71, -31, -34, 0, -142, 15, -3, -125, 105, 61, 65, -31, -33, 0, -18, -14, 49, 46, -77, -9, -64, -42, 75, 78, -33, 108, 47, 26, 11, 65, 100, -109, 26, 51, 11, 54, -132, -90, 48, -108, 48, -49, 143, 52, 66, 35, -72, -122, -24, 180, 44, 78, 2, 91, -63, -53, 29, 61, -46, 6, 19, 126, 47, -60, 4, -63, -95, 12, -78, -69, 10, 31, -82, -38, 29, 55, 22, -32, 94, -5, 110, -95, 32, 13, -62, -21, 53, -8, 1, 60, -38, 18, -4, -64, -126, -44, 94, -29, -16, 51, -26, -53, 59, 2, -40, -45, 0, 35, 35, -66, 76, 39, 43, 24, 45, 86, -69, -79, -27, -86, 48, -81, -31, 35, -19, 30, -137, 22, -29, 24, -79, -86, -25, 20, -62, -26, -46, 6, -75, -72, 77, -73, 40, -96, -68, 36, 8, 126, 31, -86, -62, -63, -63, 75, 115, 24, 16, 19, 128, 12, 11, -20, 86, 11, -98, 89, -35, 87, 81, -44, 22, 38, -8, -48, 3, -31, -7, 11, 50, -11, 16, -71, 87, -45, -72, 0, -24, 6, -5, -9, 133, -64, 54, 29, -26, 104, -116, -28, 19, 106, -3, -79, -88, -14, 112, 0, -48, 98, -31, 21]
5050B1O4q4j7J70k44N3R1K5j24o7R4N4j08QQ6k4N0j35O8P2M2j51mk9J00N5k7r6
5078e7P6M0l2j16R5n8j6J46j45J23n4lj19J89j48P5J12k39K3J82m5m1k3N0o6j8
5104f9K9lj2J4J8L9m2l3j3J28q8ML5j67K37K7j75J40p1O8m5l5ML9j7N5o6Rj5M1
5134C6l5j05J74r0M6k6j35J46k6J16m0r3J03m4j13Q6j9MR1j54L3J15o9QO2j50
5160g9K1KO9J03j49R0j3l6q7J02%J1o8O6j21J51j8o0J22j67K16j92n9J8K3QN8
5187A1m8k0j9J07N1j37j13J62O0j2n2j36Q5N4%kMJN8k09J15L5L6O9j91J66j68
5214i3K7J02r6Q3p2j2KR3J46j61o2L6n3O2M0m1P5n0q9jQ5L3q8Q3L3j11n0P7K0
5243A8Ro6J46o9l4L2J9q7N3M6k4K2l0k8K5j8P0M8j96L5J11j37L3Ql5jP2N7j80
$$ y = [21, 85, 1, -16, 154, -90, -37, 54, 79, -45, -112, -18, 36, -72, -64, 22, -2, 48, -87, -19, 53, 95, -56, -60, -89, 11, 66, 39, -57, 19, 59, 27, -89, 6, -52, -68, 78, -67, 56, 2, -1, -120, 69, -79, -4, 108, -131, -108, 74, 29, -12, -35, 15, -51, -69, -40, -43, -55, -41, -23, 16, -26, -59, -72, 56, -32, -28, 7, -160, 77, 104, -71, 69, -2, 66, 21, -14, -10, 29, 12, 67, 1, 10, -5, 36, 1, -104, 70, -20, 26, 0, -135, 11, -15, 101, 61, -32, 71, 27, -86, 0, -19, -15, 76, -78, -45, 70, 1, 9, 71, -79, -58, -56, 13, 116, -33, 57, 44, 8, -79, 23, 23, 34, -34, 32, -89, 62, 44, -16, 106, -61, 155, -37, -96, -78, -55, -47, 11, -37, -57, -76, 31, 82, -55, -168, -6, 54, 42, -10, -146, -61, -7, -7, -9, -5, -4, 54, -155, -40, -5, 31, 100, -91, 75, -93, -66, 36, -60, 23, -49, -61, -59, 34, 180, 19, -43, -7, -60, 2, 42, 1, 76, 26, -63, -64, 21, 54, -34, 49, 82, -29, -79, -2, 18, 27, -39, 107, 38, 4, 36, 55, -32, 21, 67, 43, 65, 35, 7, 32, 14, 84, 132, -64, -29, 82, -55, -22, -14, -49, -50, 22, 79, -101]
5272a01R1m1J6M8J7K0m7O2j0Oq5k6NL0Om9j00J73q3J97jj01N0q4N1q9J4R8q1R5
5302H1m9qkr7Q7om8J50o2o9Okk3o5J39j0ql6m8O6J3k7R7n4p5O5r0J02QK4m8m7
5334c6k6J16r2Km3J15j6R1j55lJ39p6Po5M4J6j09L7J36M2j03q3n3J06n2N6L1M
5362C0j05N2P0r7Q8K9pj18l4P9QL8m8r1N5N0Q7o5J8j07M2J00j02J18j29M8L3j9
5390B3m4lj07J89j62J72m0j00J00K3k3o9n7J7J22r7kM3Q0o3n0N9j7o4K4N5M1K3
5418G3k6j6qL4o1n4O4J04p9l5n1m0J69k0m7l3jQ1l5R7k28J86j26O1N7j25J71j78
5446f6J04o0L2KNN2j6L2j56l9J82qO0j62M0M7m4j5J14r3q6J54j63J56o8j6M6K8
5474F2JP1j69QrQoJ9M6q2k0M7J4o0Q2N4r8l9J24o7Q1o6m4J17k16J85j6m2k2Qm3
$$ y = [-101, -10, -51, -35, 13, 30, 50, 3, 65, 55, 61, -24, -50, -45, -15, -9, -58, -158, 15, -68, 129, 128, 27, 77, -7, 44, -45, -31, 67, -14, 81, 32, 24, 22, -75, 12, 6, -42, 108, 46, -23, -17, -19, -42, -107, 32, 22, 14, -22, -70, -4, 9, -18, 79, 25, -50, 15, -75, 27, 35, 59, 11, -36, -62, 54, -38, -36, -79, 36, 20, 111, -44, -47, 92, 16, 23, -42, 2, 18, -91, -54, 82, 124, 21, -62, -115, -9, -61, -5, 26, 30, -75, -23, 47, -50, 38, 67, 60, -58, -92, -13, -5, 33, -15, -106, -51, -1, 86, 21, 39, -68, -26, 74, -28, 90, -39, 9, 42, 23, -21, -24, -131, 58, -104, 68, 28, -72, 28, 51, 28, -41, -98, -81, 41, -56, -58, -15, 65, 2, -48, 11, -6, -70, -46, 9, 50, 73, 47, 31, 23, 57, -4, -58, 6, 110, 31, -4, -55, -95, 74, 54, 7, -26, -27, 54, 19, 116, -112, 74, -52, 9, 66, -59, 112, -66, 38, -22, 10, 12, 17, 69, 53, 85, -71, -110, 72, 64, 124, -38, 2, 49, 5, -10, 104, 11, -75, 79, -84, 72, 4, -12, 34, 62, 63, 134, -35, -27, -36, -28, -34, -15, 31, -51, -71, -24, -10, -70, 12, 66, -32, -71, 53, -14, 67, 1, -43, 74, -142, 43, 27, -15, -37, -29, -72]
5505g2J29o3mnl3p4N9J68p5K8r6j0M3l3kJ42k38J18J0q0J20j33Q2Q9p4Q6Qj66
5533g6o4J86j9j8k0O0j75N8J38J7k0M5j63o8J36k8P8J7o0l6j1N6qL8o8J1Lj3O0
5562E6k7ml8N7%p5R7p1J6m7M8K6J4L5p5L9m9O5Nj40Q3p0K04o7q4Q9n2m7J7J3l9
5593b1j7M3n1K9K0N2m3j41J87j81J56j09J05Pk7J5N5l5L0j24L6J3k9l7J39j08
5619c6qK3N3l4j69K37q9j11J99j3r1Rm0M0K4J1k1O5l6r8P3L6p9R7O2n7p0l2O5
5648A0j42J56m2j0k4Q0l8l6R5j38Q0q0J40j03P2j01J25o6L3l7M9p9l3J20K8Mp3
5675a0J0J0pJ1j3j04Q2J13j45N9K6j02J2k0N5N9K9j46O7L5r6J03n1n9R2p9N0l3
5703e2N8j5j1l4K8J6J44q3P0k26K26j52L6Pp5R8m3om2J27K8n9Lj11Q3N9Mj58J70
$$ y = [-72, 57, -6, -10, -15, -48, -122, -63, 105, 30, 58, -38, -48, -5, -38, -40, 102, -136, -18, -8, -88, 32, -101, -19, 70, -4, 82, 90, -76, -140, 46, 27, 9, -11, 49, -126, -68, 70, 87, 67, 112, -51, -119, 17, -11, 67, 84, 24, -12, -23, 33, 25, 63, -5, 6, 9, -4, 56, 29, 25, -13, 44, 44, -31, 66, -5, 11, -36, 12, 38, 52, 87, 12, 51, 2, 67, 72, -68, 15, -55, 149, 82, -2, 87, 35, -12, 5, 18, -21, -38, 5, -46, -17, 3, 55, 12, -129, 58, -123, 33, -76, 29, 36, 9, 24, 79, 44, 74, -50, -14, -1, -30, -67, 72, -36, -44, -21, 32, -2, -171, 66, -23, -134, 65, 52, -39, -30, -70, -30, -6, 5, -16, 49, 13, -85, -12, 24, -55, 42, 104, 47, -23, -55, 10, -132, 24, -18, -28, -52, 28, -10, -46, 49, -89, -9, -89, 51, -52, 20, -81, 44, -22, 11, -26, 23, -56, -89, 31, 59, 63, -10, 0, 10, 3, 14, 1, -103, -21, 92, -53, 6, 32, -70, -58, -78, -23, 36, 65, -81, -14, 21, -75, 28, -23, -82, 10, -69, -19, -52, 6, -9, -20, -54, -26, -10, 134, 51, 121, -105, 121, -31, 5, 12, -63, 35, -8, -14, -56, 71, 99, 40, 43, -68, 15, 74, 78, -80, 90]
5732I0n7j57K28j02j46P8j5J56j35J38Lj44O9j24J40k5N7j7L9k4n5k7j6K2j7m0
5758h1N2M9L9m9k2R9l3k6q0o8J48P0o5j01R8n1L2j12Q1J42j92nlj3J2j9L6QR2
5787C8n1l3Lj7N8O5j04O3O4j28M8j3p4J24r9J39q8k5l0KJ16k6m2m7J29j6p1O8
5815E3n4J9Nn9R3q7p6P7j8P0j03M9J4K1pn7J83j16K6l2l7M9LJ27j72N0N1j06M9
5844A5l8l9R2j3J8o7L6l0N4n1n0P8N1m3P6j15kM6Q5q5r5R0p4R3o9m9N1j9Q3o5
5874c6L6r8J28J3j84J11P5k00L10m7j22P2q8p3R4K5kj29J15J09j03j3M5n5P8J3
5900G4L5j10j02Q3m2O9j05J85q5L7pJ9n2j%j42J04j5J02j19K9M1K9o3M4o1J44
5927I1j40Q6Jq3L0Qo4J86j89J1J01p3J28n1k7k7J6N0n5K4j6M1j20J68j12N6K3
$$ y = [90, 33, -124, 104, 2, -144, -66, -81, 75, -60, 78, 81, -63, 6, -118, 22, -3, 54, 37, 76, 52, -3, -30, -46, -24, -41, -81, -29, 20, 59, 10, -12, 87, 54, 28, -52, -120, 28, 98, 33, -68, 30, -21, 11, -101, -20, 122, -70, -75, -78, -91, -79, -98, -62, -54, 38, -13, -46, -43, -60, -2, 63, -41, 22, 86, -42, 6, -7, -81, 43, -56, 83, -5, -30, -60, -58, 58, 32, -10, -57, 72, 56, -15, 53, -1, 18, 23, -36, 57, -30, -106, -29, -47, 23, -80, -31, -17, 4, -3, -60, 123, 7, 33, 1, -36, 13, 16, 143, -29, 21, 72, -34, 15, -23, -62, 30, 17, 35, -32, 4, -26, 28, -23, -73, 5, 56, 13, 89, -26, -28, 18, 103, 18, -77, 13, -61, 32, -37, -86, -35, -54, 29, -36, 0, -98, 30, 43, -141, -30, 45, -155, 155, 108, -14, 58, -30, -103, -9, 16, 14, -115, 0, 109, 6, -7, 38, -17, 61, 74, 109, -1, -103, -20, -62, 7, -98, 87, 2, 39, 32, 51, -1, -2, -2, -144, -40, -55, 47, -72, -43, -2, 27, -36, 8, -53, 91, -49, 37, 38, -45, -15, -7, -71, 115, -74, -63, 38, -35, 93, 42, 15, -12, 4, 54, -1, 23, 7, 48, -72, 96, -16, 40, 63]
5954F3j18j0Q8k1n1lL2J9p1J72j92J10K0J8j15P1n6Q7kr0Q1j87J80qk1L8l3L1
5982C2p6J16l7kn3r4J54K1k3m0O5p4N7l4l7l0n1Q2l0L3k7M8N9o9O0m7No9K6J72
6012A37j99O2l2l8O3mK4M4j36O1K6k5m6R3j1j11J86k2N1j61j7L0J11j01j1J22
6038I6p2j5P5m8o5N4p8P2J4q5M8mo5M0oMO9j5n2n7K0M8Q4j22J33j7M6j41J5j1
6068c5J17r3Ok2M3kn6Q2l0M6kl8m4P8j60K4K1J6Lj17J27j4Q5m1m7N9J06p5J2%
6098D9m1L6n6L3J8k3j4N6j29R3o7N2n5J92j26k1L5M7j36N5j0jN6n2P7p5R9j70
6126g8J80j78P9p5n2J25J21j59l2Q3Q0p1M5j38lNR3k2m2J9J42j64q7J59k0MJ8
6153C2j1p5J09q1n9J9J78j58J6lM6L9j13L4L1j73mJ56K2M7l6J5l4P6j44L3R4p4
$$ y = [63, -55, -65, 23, 2, -49, -52, -20, -1, -72, 100, -92, 18, 38, 56, -59, 12, -44, 43, 41, -49, 32, -155, 25, 17, -4, 34, 1, 32, -44, 72, 35, 33, -20, -114, 40, 61, 38, -2, 63, -11, 46, 12, -25, -55, -106, -24, -54, -21, -48, 0, 59, -10, 50, 3, 8, -61, -35, 137, -62, 0, -32, -70, -7, -11, 13, 57, -79, -18, 8, -17, -63, 30, 19, -92, 94, 72, 123, -38, -55, -25, 86, -15, -26, 96, 24, 9, 84, 36, -29, 25, -53, 19, 33, -52, -4, -8, -73, -33, -39, -35, 34, 19, -33, -90, -70, -22, 62, -60, 73, 56, 102, -39, -24, -35, 82, -11, -5, -27, 16, 14, -42, 40, 10, 56, 54, 16, -28, 50, -110, -86, -65, -49, -46, -163, -36, -50, 35, -6, -53, 6, 112, 37, 49, 49, 8, 44, -12, 21, 39, 16, 2, 58, -71, 22, -45, 7, -48, 144, 18, -3, 32, 79, -57, -2, -12, -13, 43, -9, 68, -7, 92, -78, 102, -76, 3, -72, -124, 1, 122, -37, -69, 14, 94, 23, 68, -70, -73, -68, 25, 3, -39, -20, 122, -42, -129, 30, 10, 14, 32, 21, -54, 55, -26, -85, -66, 112, -46, -30, -33, 13, 52, -61, -27, 4, -169, -173, -17, 5, 52, 16, 31, -3, 73, -71, -38, 56, -18]
6181a8j6O4j7mM4m9J3km4n5P8k1M4j22J86j35N7P5o0K9l1j9N2n0q3J74r7K7l6
6210a6o6J7P6N8p3K6n8q2J96j07OO8j68J46j2l1j30K21j22J41j63O2JJ01l0l5
6236B6p4N5po0K3O8LK4KNq1qK4%l3JL8J03j14NM0J4j57R4P1o9M7M4q1PK4J3q9
6269d2M3J09n9L9m6j16J11k7l0M2l6o2P6J4m1n4P6j26K09r8J7Q8r9l0q8J79n7
6296hq3o1Q0Q6k9k4R5J4j69K09p2r6O5l7J3j11J06k1mr2K56q9M4r5J07j9o9Q8
6324H4j9m3Q7j05Nj0l0J07j73Q8J5m9J27p0OJ4nK9k5m3l1P6j48J45j18R5l9K0
6352a0M1JN6Kj45l0O9J5m5KoQ9Qj12K1J03k7M6n4n3L5j20J60j6n5N4M1j05j7p8
6382a30J42N6mj43J15N0j28n2L3J02K5m1n6O8Ql5n5j0J13j33J27N6o6J4o0oR8
$$ y = [-18, -34, 30, 13, 9, 53, 4, 17, 15, -29, -84, -6, -27, 17, -105, 81, -54, 3, 78, 18, 47, 16, -3, 49, -1, -84, 90, -7, 20, -16, -82, -65, 11, 69, -4, 22, -36, -118, 78, -29, -23, 45, -123, 23, 11, -20, -150, 71, -51, 90, -73, -11, -10, 91, 61, 26, -48, 7, 0, -60, -37, 31, 34, 58, 60, 65, -16, -24, 0, 0, -33, -32, 6, 109, -5, 0, 40, 54, -103, -9, 62, -7, 40, 84, 3, 10, 34, 47, -42, 1, 110, 51, 90, 44, -72, 39, 12, -18, 24, -12, -74, 2, 16, -25, -79, -3, -129, 80, -18, -1, 87, -12, -42, -130, 49, -8, -91, -152, -72, 14, -15, -39, 56, 70, -99, 110, 38, -58, 7, -30, -17, -128, -22, -43, -47, -139, 117, 28, 72, -23, 84, 65, -4, 84, 65, 22, 109, 4, 9, -1, -31, 76, -97, -9, 6, -43, 84, 14, 20, 34, 29, 58, 33, -10, -41, 35, -113, 32, -86, 9, -30, -10, 31, 32, 88, 90, -55, -85, -16, -1, -46, -44, -50, 39, 47, -65, -44, 59, 32, 78, 24, -29, 6, -114, 46, 30, -25, 29, 70, -35, -52, -130, 12, 68, 64, -79, 36, 86, -42, -94, -61, 41, 66, 25, -31, 37, 45, 10, -45, -55, 58, -75, 52, 108, 42, 56, -4, -10, 88]
6409H8l3j02M6q7J59mj31N0p9J46p8O6n1m1J07m9k7k4O1n0LJ39j20R5r6k3J4M3
6437B2j08P6K6J33r2K3k2m5L0O0q7m8P5K5n5j5m4O9N9j25R7k9J42p3n1p4L4M2
6465D5j04j0R5K5j08J03m1j04J08J5P9j36R3L7o2n9l0M4J5k3l8R4l1M9K3r3N4
6492D0K5j23k6J17L3q9P4q9N6N7o6q1R7k1p9J28j17j9R8o9p6J50L4o3J2r1N9J33
6520A04j06L1J6n3K0p0P1K4ql3j7J87k03P3p9M7rJj2N3O7j35M3NM1o5J56j50L3
6549C2n7KP6j47Q5K0o3N1q2J16L4J9k7k6j7O4o4L4J2n8M5K3j05O8o1O2o7l8J7
6578e2M2R0j57Q3l5K3no4L9N7Q6j89R0N0j49M3k6J18o9J8l6l8k0N0P8jj2k4R9
6607H9q0j7j8J01j3o7M7q6N7J05q3q3K6k0L5M0o7J27j00r5J02Q0Nr3l1M8r3R4
$$ y = [88, 55, -47, -1, -88, 71, 67, -64, -14, -93, 53, -25, 41, -10, -51, 56, 7, -20, -44, 17, -33, -30, 109, -11, 84, -12, -35, -21, 22, -86, -10, 16, 149, 57, 80, 58, 13, 43, 103, 16, -32, 43, 68, 13, -2, -46, 23, 82, -43, 54, 25, 167, 94, 43, -31, 3, 45, -59, -69, 26, 51, -57, 46, 5, -99, 9, 24, 103, -33, 60, 97, 35, -24, -54, -10, 5, -18, -56, 38, 7, 56, 79, -14, 40, 65, -58, -84, 33, 66, -23, 51, -38, 18, 75, 9, -72, 25, 4, -75, 53, -64, -83, 15, -54, -130, 20, 54, -9, 3, -88, -29, 104, -2, 29, 45, -8, 12, -58, 13, 37, 29, -4, -21, 166, -37, 36, -43, 4, -5, -4, -16, 37, 104, -31, 12, 17, 58, -7, 149, -1, 32, -25, -23, 53, -94, -9, 11, -52, -1, -83, 33, 67, 86, 59, 33, 16, 80, 16, 50, 62, 4, 49, 72, -33, 35, -26, 36, -31, -69, -52, -10, 80, -77, 6, -29, -6, -11, -75, -36, 21, 107, -82, 8, 58, -91, -48, -74, 44, -25, -7, -43, -81, -101, -51, 27, 26, 14, -10, 89, 9, -8, -26, 75, 62, -5, 42, -44, 13, 118, 35, -48, -22, -42, -7, 33, -34, 93, -7, -102, 0, 80, 85, -8, -39, 9, -84, 10]
6635A0Nn9n4N8R7o4q4J62r9M5n9N5m1K5m0l2j14J26J90q8rJ7N0j23K1k2N3K3l9
6664A0o7m7M7R3r6L7r6J14j8L8L7j60J46J5l3r3N3l0MK0L0Ll8o3J21L9l7J3q2
6693d0N2L3M1j01PpM4m4Q4j9L8j00J00j13P7M2j46N8j48J41J0M0Oj63J45Jj29
6720i1Q7qp5K3Q2r9P1l3R3q6P4o0m1j1j7J2J92j05q2J18l9l1J00k4L5j71Q3l5
6748c8m5K01q3k2K6j25J02P3r4J8r0J29k0l9j9K2r4L8lM7M1j40J47M9j61Q9J9
6775B8k1p0R8j20M2J44p9n7L1O4j4J7j30K3J25q9k1J0p0J19N5j98K12p3O9q1Q1
6802I5j73J1J43j31j16J25P7J3j00P7n9J4k6O0N2q4l9L1J03j79J75j33q0K3J12
6827iL5L6r7J1R5j21j00J34J10p8N2m7L9m7o8J22j37J0J33j80J54p2K6K8K9L6
$$ y = [10, 15, -44, -98, -40, 57, -7, -91, 71, -28, 17, -42, 13, -28, -3, -43, -75, -189, -63, 127, 39, 30, 47, 97, -26, -5, -27, 26, 49, 10, -57, -104, -57, 36, -60, -23, -119, -5, -23, 15, 52, -108, 38, 53, 20, -73, -20, -50, -46, -26, 4, 7, -31, -94, 27, 66, 29, 42, -40, 12, 45, 86, -15, -8, -15, 29, -15, 69, 50, 88, -12, 88, -25, 52, 94, -52, 6, -142, -1, 9, 49, 55, -108, 37, 38, -91, -4, -12, -87, -64, 18, -81, -10, -43, 50, -36, 38, -22, -63, -74, -91, -79, 113, 8, -74, 44, 5, -26, 74, 50, 85, -86, -3, -38, -83, 118, 35, 13, 39, -86, 16, 89, -5, 13, -77, 52, 32, -7, -26, -4, -98, -60, -63, -16, 25, -115, 32, 81, -80, 9, 28, 7, -63, 35, -85, -43, 101, 22, -35, -4, 60, 46, 63, -67, -44, 81, -8, -29, -19, -89, 30, 85, -113, 99, 26, 95, 14, 95, -78, -67, 76, -55, -171, -46, 31, 44, -56, 21, -38, -24, -50, 10, 62, -22, -61, -30, 73, -106, 69, -64, -144, -121, -9, 26, 62, -35, -24, 71, -50, -150, -16, 94, 16, 68, 21, 60, 13, -55, 67, -70, -60, 73, -107, 47, -25, 1, 29, 58, 94]
6853I4j79Q3M0n0j5R2o6PQ6n6L2n4o2J28j07O5j21J01n4J15j74J65k4j6r5P3p
6880AP0k7J2n4l8k8J8R4Pl7K3J29j12n0j4O1j69jR4Q5p3K7Mq5K01j35K9j26J1
6909h3N2K5J11l3k0L0j04K5J3l7K0p2N7J19m7p5P5r5rl4J32m8r7L8L1K6j02J27
6937B5Oj11J63n8n4o6J46l4K5o4Qk6l7J36j31J40j8K4j6j9o8j8L7N0j2NM0n3M8
6966F8n2m3M5n6O4n9J2o6K9rk9R9n8L7q4R9L4j0%j9k3Q1n7j3K9J3j9K1j8m7l4
6997f5R6r7N0k9J35o3Jk5N1k1j31J41q5J46m6J7q5l6P1l5LP2l3O6j68l4M5M9J7
7026Gp4O5P6n3k7J34j70J2l4k8P1M0Ol1O6N3r9K8m7j9oM2J11k33J28m0J5j00O4
7055d3L2j53J68N6r8lJ05k7mn0mj5Q1O1NLj60Kj27J77M2j15N1m5R8K6j02J20r7
$$ y = [94, -85, -2, 38, -12, -27, 65, -1, 6, 92, 36, 68, 14, -48, 80, -27, 38, -83, 18, -36, 79, -95, 70, 46, 30, -65, 8, 1, 71, 44, 56, 2, -36, -64, -46, 48, 55, 18, 41, 170, 58, 8, -6, 55, -114, -115, -21, 64, -9, 18, 22, -63, 138, 3, 32, -94, -83, -31, -6, 105, 72, 52, 82, -22, 3, 16, -21, -1, -73, -16, 103, 56, -19, 56, -39, -48, -82, 50, 2, -95, -57, -26, 0, -102, 25, 31, -80, 83, 25, -29, -95, 51, 17, 42, -22, -14, -40, -77, 59, -72, 68, 50, 74, 58, 39, -29, -47, -10, 40, 28, 33, 73, 20, 68, 16, -27, 18, -38, 26, -33, -21, -87, -58, -67, -96, 3, -55, -18, -102, -3, 31, 21, 21, 2, -21, 60, 3, -10, 19, 32, 13, 34, 16, -31, -65, 31, -66, -16, -45, 90, 27, 28, 3, 54, 33, -98, 43, -42, 104, 58, 75, -10, -46, 25, -10, -7, 65, 32, 98, -70, -104, -59, -10, 7, -67, -2, 74, 21, -6, 128, -42, -30, -64, -92, -21, 19, 25, -6, 60, 113, 14, 42, -5, -24, -30, 12, 123, -110, 18, -22, -7, -107, -43, -11, -164, 4, 60, -38, -41, 64, 37, 33, -17, -21, -36, 45, 106, 111, 114, -46, -44, -171, 6, 48, -67, -16, -61, 37, 63, -39, 81, -16]
7084a6J47l8j7l3k8m1k2L6l0J34p7j9j19J44Pp5j7O8mm1N9n2P5m2l1O6j40P6P7
7113D7j34J27nj9o5qJ21Oo1o5Q2p7L8k8L9Qj5P8k4o5L9rj9K9m6l1q9J25k9Q6r4
7144e8L0N3J8J36j38j21N8m9Q5j1m2j4O0k4m5J7mL2k6Q6M1k5qL7j00n2J71m0p3
7173fJ26j38J7L6J4P9q3q0J47q0M0j51L7j4L0p4J38n2n2Q8o8j5P1L3o6M5O0o2
7201B0p9N9Kk6Q3j8J5n2m1O5l5K1J09r2k6O6j19LP8O0p8L4n7rm5NP2j0jj3p1Q5
7233EO6p0jJ1O3j97J07P8j69K01r5P4N7k12J52p6l5R2R1j10L7O0j61m0K11j62
7259b3l0k3R5L5l4k0M4J5q2M1j00Q3R0nK8n4o3L8j72K22n1j9q0L9N6j74K33q4
7287Ej09K1J84j29J58j62L4Q8j28R6M7q4k9j9L3K7k8l4k7K04p1j7j43J36p7M0
$$ y = [-16, 131, 93, 76, 43, 15, -26, -48, -12, -42, 92, 15, -4, -123, 21, 28, -47, -64, 4, 0, -41, 18, -34, 41, -1, -32, 34, -106, -30, 47, -87, 40, 35, 16, -49, -57, 64, 70, 9, -56, 26, -51, -13, -41, -2, 6, -9, 69, 45, -20, 19, 10, -9, 20, -26, -57, -146, -21, -50, 36, -58, -28, 25, 43, 179, 41, -80, -22, -71, 14, 3, -39, -53, 7, -17, -62, -45, -49, -17, -43, 43, 84, 59, 51, 88, -12, -64, 107, 67, -6, 120, -18, -1, 35, 49, 128, 45, -35, 112, 32, 72, -79, -42, -56, -26, -100, 38, -14, -66, 22, -46, -61, 10, 43, -23, 22, 82, 20, -59, 0, 2, -24, 59, 41, 56, 4, -37, 28, -7, 14, 123, 31, 5, 71, -48, -45, 33, 93, 15, 49, -8, -17, -62, -57, 15, 5, 4, -9, -80, 5, 71, 1, 0, 11, 74, -123, -16, 62, -107, 94, -1, 73, 130, -82, 70, -6, -41, 51, 142, 32, 69, 129, -32, -72, 139, -23, -53, -76, 19, 54, 20, 0, 44, 59, -23, 18, -82, 1, 91, 86, 114, 60, -3, 35, -137, 85, 34, 15, -65, -26, 30, -144, 89, 5, -104, -83, 101, -28, 130, -32, 2, 90, -38, 58, 105, 21, -8, -27, 6, 33, 5, -29, -56, 148, 77, 60, -83, 53, -24, 16]
7313A6J23j54nJ22m8j05MN2o1l6J26L6J2j28J03o8K9j2k4J78p8l8n8p1M5Qm1J03
7341C0mj4q1J15j22J18k8M6q5jO9o4r7J00NML4j46Q5K5n8J19K1n8OJm7O9J0j44
7371i2J14J7q9N7QK8j80J89j02J1O5Ok8N5j6J5j02O0m3RJ01Jl7j92K10nj34Q2
7399Hj23J09Q2j62L4p2K00k6q6J23q6N5k0j27J22L9k0m7O9m2J1mrn3K0J9N0Nm8
7428B1K0Om2J08j02J04m9rj65O5OJ58j06j30K38q2J2p9M5r8N8p3O2l4J13q0M3
7455A0m9j2J3O3m8N5m5j2O7k6J1m5Q0r9m2J40j1p7O2M9j10O0QQ0k55J39o8P7L
7484A8K8M0k07J09Oo2J66r3K4P8n2p5M9p6J41j41M0Mm0L3R4j01J0j3j6J8o6J76
7512I2j03r5J85m5m0J9j5K8k5L5j40Q6ON1r6R0n8J4k7l5J60j20N9K4m6P3j07N2
$$ y = [16, 139, -15, -20, 102, 54, -51, -47, 5, -56, -92, 34, 70, 82, -46, 57, -11, 18, 6, -18, 160, 82, 44, -14, -85, -40, -32, -73, 30, 26, 12, -69, 46, -76, 42, 14, 60, -25, -26, 43, -21, -118, -18, -13, -9, 25, -121, -36, -11, -69, 50, 71, 13, 19, 20, -27, 42, 52, -92, 22, 39, -50, 7, 15, 43, -137, 52, -50, -39, 26, 32, 4, 59, 43, 58, -44, 16, -27, -18, 83, 84, 47, -145, 65, 60, -74, 8, -115, -6, 76, -86, -52, -124, 76, 50, -36, 87, 1, 56, 36, -91, 31, 70, 50, 3, 72, 30, 41, 37, 28, -25, -5, 14, 64, 69, 21, 41, 47, 5, 113, 11, 115, 66, 57, -108, -43, -37, 121, 15, -115, 123, 41, 53, -26, 19, -79, -21, -94, -32, -66, 47, -33, 10, -39, -51, -38, 25, -23, 32, -13, -25, 42, 16, 27, -18, 62, -37, -79, 61, 50, -27, 35, 84, -26, 34, 42, 122, -133, 6, -62, 15, 18, 46, 86, -121, -12, -6, -68, 98, 5, 29, 107, 55, -20, 29, -47, 94, -47, -7, -3, -43, -10, 84, -17, -7, -20, -36, -18, -84, 92, -11, -106, 79, 34, -6, 13, -2, 26, 1, 36, -104, -18, -12, 39, -57, 33, -25, -11, -38, -73, 87, -33, 26, 50, 4, 77, -30, 22]
7540B2j0R1k35J57n0n1J21j20N6J31p9l8P3N7j10%r4J60j40J11l0p1O9j2J2k2
7566bk2J42q4n0j53J62m6j8J14k1M5mp1m6R4m8J24j89J16p9LJ26q0q4J41l6K6
7593F0j20O0%jO8p1P3j29M0j1o8J35o0JO7j08RM7j5l5O9PN%J4j46P5LJ14j03m4
7624f4L3J5j3k3l7MP8L8K1J2j14O4P6j03Q1rpq8L1j5n2J01P5mJ1j20L4q9J20m
7654E2n3JJ0k8J16r4j23j0N2j2R1Pp5R0r4J65kj33K7m6R4m9K7J2l5M5j39K8M9
7683b7J23j91J48p1J08mj0j9Qq0L9J6j37J26j4K6p2r0J11N2m2J04j60j7J58l9
7709D6Q1j00mj3p9J5J5J43l2j71J16q1J20j48l5J50L9j03M6J62p5o4o0J11j46
7734f7K1OMM6J2l6Q0j05J16n1L2Mk4O5j61M8j4K4L2l6j03J01m0M9n4Q7m8K4r4
$$ y = [22, 12, 103, -132, 25, -25, -76, 45, -75, -19, 112, 33, -5, 68, 125, 15, 15, -79, 81, -59, 52, 22, -49, 20, 8, 20, -2, -24, 118, 34, -16, -169, -7, -53, -71, 43, 22, 67, 63, -8, -54, 40, -8, 116, -73, 43, -36, -33, 93, 13, -71, 70, 34, 60, -60, 0, 0, -1, 67, -4, 69, -60, -20, -31, -99, 36, -24, -23, 44, -64, -55, -8, -23, -58, 11, 18, 23, 23, 37, -109, -34, -31, 83, -20, -64, -31, -16, -29, -52, -89, -85, -7, 31, 52, 64, -50, 14, 90, -13, 68, 59, 52, -36, -5, -20, -72, 29, 104, 100, 111, -9, 25, -64, 56, 52, -1, 0, 10, -18, 98, 4, -119, -129, -77, -89, 2, 9, -66, 24, -70, 95, 93, -40, -13, -59, 35, -14, 13, 25, -10, 35, -104, -76, -27, 96, -95, 53, -18, 90, 86, 76, 57, 65, -15, 24, 40, -97, 29, 15, 41, -31, -121, -10, 42, 0, 104, -56, -73, 85, 46, 127, 27, 23, 10, -69, -54, -39, 104, 72, -99, 17, -64, 56, -92, -127, 23, 62, -41, 5, 167, 92, 28, -32, 79, -67, -46, -40, -36, 10, 22, -14, 66, -39, 77, 26, 58, 62, 38, 103, -58, -10, -24, 0, 32, -4, -107, -6, -46, 3, -51, 36, -12, 12, -82]
7763h2J30j6k3K8rj31R6N8j93K8K7Q3nK2j2J8r0J44p5j2k9N9lk9O9j41J98j08
7791BL8j4l6n0M3O1l0K1o7R9K8lj56J15k02J86P1j52Q8pJ2p7o5N9Q7q2Q6l6nN
7821A9J0J28j49j5OJ9l8L4O1l1jn1L5j8k6K7J4p5%k4R8n5L8JP8j23J05q7L0P7
7851H7o4j12J00Jq3l1O1J03m5M4j75R4N7onm2J7j32J31j4m6Q3n5O5k4l1L2o7j08
7880a65J96j40R3Jj32J34O6K7r0L5o1J8L0J3o4P3l7N9l9N4j3m3p1l8R0K3Knl4
7909a8m3J60j00j1Q2r3q8P2J17L0j60o7J26k2k6O1qk5r4J6k1J85j40Q4RM3j20
7936e1N6M7j38R3Q4p3omJ67k30Pm6J52n0j7q1J4P8k01K33n7J2L5ol5k0J22j23
7964c8N6j15P2N8m7JP5j38O5L8o6K9o0R2j06R3M1N3j18rJ43r8j03Q6l4P9n9J8
$$ y = [-82, 48, 32, 9, 37, 28, -103, -7, 51, -142, -114, -87, -4, -9, 13, 1, 19, -71, 73, -2, -14, -43, 16, 13, -16, 53, -88, 110, 2, 40, 26, -10, -60, -17, 44, 14, 35, -32, 67, 95, 92, -64, 51, -151, 35, 106, -46, 42, 35, 47, -30, -95, -36, 51, -31, 55, 19, 14, 19, 29, 157, 8, -7, -1, 18, -20, 14, 75, 44, 43, -8, 27, 9, -17, 10, 24, -51, -51, -75, 23, -32, 6, 7, 85, -38, 67, -20, 10, 87, 23, -89, 11, 12, -71, -102, -41, 62, 17, 61, -114, -20, 37, 31, 26, -16, 1, -131, 0, -14, -60, 23, -32, 33, 9, -22, 10, -57, -165, 31, -109, -16, -15, -147, -13, 53, 80, -10, 25, -36, -18, 12, 25, -39, 34, -3, 56, 17, 71, 58, 15, -56, -94, -4, 19, 21, 16, -18, -61, 99, -1, -12, 70, -23, -111, -39, 78, 108, -52, -119, 7, -15, -41, 20, 12, -13, -107, -91, -112, 73, -67, 17, 26, 69, -51, 5, 52, -86, 7, 91, 18, 12, 8, 175, -55, -48, -94, 58, 8, -9, -90, -76, 2, -199, 34, -23, -11, 24, 18, -17, -37, 85, -38, 18, -97, -25, 33, -14, -13, 62, -76, -11, 27, -39, -10, -70, 22, -84, 9, 50, 103, -15, -24, 119, 21, -82, 4, -30, 49, -10, 8]
7992HM0p1k9R1j23M4k8j7R6J50j49o2M7m8O9kRKrl7J4p1R1m9O4p9L7k4j2J6K3
8023im1L1J11j85M7J08m2Jj8q7N7j2J44j72N4r1R2Q6q6N9j63J2L0J73j3j19Q1
8050D8l9n3J51q4J5L6j35oJ16o6Qp4J04J0K7p1K8J3r8Q2k0M2L5k17J85j2o2l6
8078g3J24j33N8R0k2j22l1K7J32o7Oj4K5J5p4M1m8L5P3n3oK5N3m5k2%M2N8L4k26
8108i8J22P7j69Q9l0j06J8OJ7R6j17J90r6n0M0R3r3L5k4p6Q8o8L8N7j67J11o2
8135g9O8j38J74J0n3l5R0J24j76Q7K9q9m3O0N0j3n3rr2qJ26Lm2k8n0J90r4j23
8163a14J74K0p4m4m3Q8M5o9k3M8j4j5j5Q4j16P0j25M8m4j2J65R7j98R0k7n2J07
8190E1J04
$$ y = [8, 48, -23, -52, 39, -84, -40, -68, -85, 11, 161, 12, -50, -3, -51, 18, 16, 25, 27, 18, -19, -5, -76, 15, -34, 30, -49, -12, -36, -48, -32, -9, -50, -19, 92, -93, -46, 62, 20, 21, 3, -84, -27, -39, 105, -67, -13, -104, -12, 74, -12, 47, -116, -104, -74, 99, 86, -33, 48, 9, -44, 107, 23, 38, 74, -61, -67, 49, -17, -9, -83, 21, 31, 58, -13, 15, 28, -70, 12, -8, 34, 69, -148, 37, 25, -37, -73, 51, -82, -24, 66, 44, -78, -109, -82, 50, -17, -11, -25, 0, 15, -59, -18, -66, -31, 42, -11, -17, 8, 61, 16, -6, -6, 36, 94, 128, -98, 24, 101, -68, 21, -9, -115, -97, -91, -74, 22, -95, 95, -1, -51, -11, 82, -11, 24, 0, -76, 12, -56, -18, 39, -128, -17, -79, -11, -149, 25, 35, -18, -53, 37, 161, -15, 72, 101, 12, -31, 29, 79, 66, 13, 4, -88, -96, 30, 33, -9, -37, -87, 103, 9, -114, 60, 80, 6, -38, -81, 7, 52, -17, -40, 8, -6, -21, -36, 48, -68, 2, -123, -75, -119, -131, 34, 131, -67, 23, -4, -56, 51, 155]
8191A55
$$ Imaginary data points
##PAGE= N=2
##DATA TABLE= (X++(I..I)), XYDATA
0@%%%%%%%%%%%%qJ6j6J6j8K6l2M0m8N6p2Q0q8J04j27J51j71J95k24K56k92L32
34A76l76M24m76N33n97O67p42Q26r17J015j123J243j371J512j669J839k025K231
52A170k459K709k989L307l668M080m557N114n775O579p583Q871j0588J3018j6734
67i505K3173l7375J23935p1214j91145K44887J2924j78956M7015J26271j06890
78a6880m5291P8808Q479m2173K1414k0350m521M8838j5369m3141M2830n604l2909
91b5869M4196O672n0562K6226J5403l4473K0547K2182m2762M185L4379k8353m827
104a3056M4907m1878l7147Q1938O75q9757N5380N2450r3974J0680R3231o2751
116F98n4356P8656L311o3558L6806L1770n6497n4M9426k2176j8513K2316j7059
$$ y = [0, 0, 0, 0, 0, 0, 0, 0, 0, 0, 0, 0, 0, -8, 8, -8, 8, -10, 16, -16, 24, -24, 32, -40, 40, -48, 56, -71, 80, -91, 104, -120, 136, -156, 176, -200, 224, -252, 281, -316, 351, -391, 435, -482, 533, -590, 653, -718, 794, -875, 964, -1061, 1170, -1289, 1420, -1569, 1738, -1930, 2150, -2407, 2707, -3068, 3511, -4072, 4799, -5789, 7229, -9505, 13668, -23707, 100228, 29014, -162131, 82756, 95680, -83276, -36261, 90010, -16880, -62171, 16637, 25116, -17057, 4357, -15993, -20514, 28324, 12955, -30186, 12644, 7040, -25869, 18327, 24999, -25563, 663, 16066, -18407, 2140, 24322, -18440, -14255, 20124, -8229, -13056, 31851, -10027, -47174, 34764, 35439, -54318, 1062, 53512, -40462, -29782, 63449, 698, -53658, 24998, 28309, -35249, 1557, 33327, -23170, -23224, 26202, 4026, -14487, 7829, -9230]
129i230K644K9493l5455l603N0367m2738l1610P8929p923q3545M7133N8615p4663
142b1586j8775Q5128k4974p6894N8006M8060o6941j2032M8467r283j9327O668
154c483M790J0706j2004k2840L0152K3068m1784j5382M2279M781l6270N619K4103
167A3735j3106r468P293P91J2420r583l1006L4660K9759n7093n541O2520k4682
180A0699m7926M5466K5104n2518k316M7484j8998l0961L2662M513l2333J7713
192a411J6579k3139J549J3025p565j831K411J491L819p400k674J2151p01j3437
206g133K585J3368o333j2039J3008M059j7376O848J0921j2126J248O891o880K615
220c44J751l967P447l990r664J3933O505j8884k427K0188l196k1093J1242J7598
$$ y = [-9230, -6586, 22907, -12548, -16151, 34216, -8522, -40132, 38797, 30874, -52671, -5538, 53077, -21586, -40361, 44767, 19793, -57101, 905, 48965, -17976, -30008, 18459, 9176, -10151, -3483, 1307, 12013, 9, -22831, 7321, 30389, -11395, -26777, 15502, 20283, -15987, -10368, 13735, 629, -8839, -1546, -755, 11665, 2082, -28924, 5736, 35495, -21598, -27139, 35381, 10699, -37227, 8239, 33343, -19175, -21491, 25993, 6995, -23966, 8696, 13209, -19124, -1411, 15168, -7971, -6422, 6603, -962, -2793, -382, 1109, 4928, -2472, -5146, 7005, 6304, -7133, -4548, 8820, 2487, -9552, 3456, 7515, -9861, -3013, 7908, -4218, -2970, 3921, -2959, -344, 1407, -2560, 4887, 897, -8767, 5166, 11671, -7213, -9640, 10548, 7352, -13741, -2499, 15099]
234A5099j9279q512J7503k2n744k122n117J4651N309k5493N949K6252j6925j9051
248a7502K3324J0912k5527l961K5253m635k0355J0032J0258p815m353l88Q911
261D154L177j9409O291K3928k0796j5383K9969O15k7782J1687J9536j8620q228
274a0861K0134n787j4320J7205j614j8379J8756M736k4793J3855J4882k2892K178
287f900J7975j2766m546J3661p155p136J4525l367j5570J5435P221k4030Q903
300c750J9507k4013j994K4231j7173q792K3663j0873j4069K1969j783k0004J6005
313B924R881k4054N672K3796k2297j2459L1897p827k7032K4259Q312k5886R553
326c261J2687j4376K948N521r466Q209O364j8156M099K1774j7421j6251K9771
$$ y = [15099, -4180, -12692, 4811, 4789, -955, -3077, -8194, 6457, 11766, -13727, -7778, 18474, 1549, -17502, 5822, 16734, -8793, -12754, 12499, 7864, -12491, -2459, 7799, -16, -4369, -4757, 4154, 7331, -12078, -5787, 18141, -2655, -18038, 11931, 12546, -15236, -3549, 15987, -2633, -10861, 9273, 3486, -10834, 6371, 4757, -13622, 5134, 9870, -14923, -1068, 13814, -9078, -6900, 11075, -1691, -6237, 7424, 269, -6867, 7658, 4291, -11279, 4156, 11377, -12653, -3750, 15757, -8256, -10250, 13981, -3192, -11984, 11679, 806, -13263, 8706, 6923, -13081, 2924, 12805, -11249, -5577, 18219, -4078, -16537, 15360, 7533, -19499, 4760, 13072, -12814, -3261, 9426, -4950, -2002, 3519, -5947, 2262, 8626, -9530, -5431, 16343, -1078, -17329, 12442]
339A2442M54l3060K0321K0471l3580K296K8279k1618q981K5073j1313j4195K1698
352H287j683k0234J5594J0774k2813M236K1197j8795p797K3642j0154j3835J9912
365H331n138j4133J8014k847j7033J7550M362k2208J0869J6864k1824m321K6119
378A4605j1308j9582K4779K878k6922J6956J3704k6889O625K0307k1436l771K2422
391A2368j1716j3928J9168K077j8594Q404J2003j4518l05J3173r975k478J1233
404F912r559j001J2714j2724m017J8725j0050j3383J8832J240j9757J0662J3235
417A1829j8701k208K1097j0926j3774K0867j340j9402J6372O915k1272Q746J3458
430A1661j6990q92J4865q540q127J1790K57j0922O695N380j0175L682P238j0753
$$ y = [12442, 12896, -20164, 157, 20628, -12952, -10656, 17623, -3995, -12976, 12097, 784, -13411, 8287, 6604, -13630, 1964, 12738, -10075, -5839, 15358, -3437, -11234, 12408, 2254, -11581, 8331, 3193, -10940, 7074, 4227, -12806, 4744, 9106, -13102, -2233, 14631, -7193, -11514, 14605, 3297, -16285, 8494, 11372, -15550, 1406, 15110, -11779, -5154, 15153, -6283, -10054, 12368, 652, -13276, 5892, 7969, -10625, -2221, 9782, -4736, -5041, 8132, -1843, -4321, 6912, -2647, -3648, 9066, -3658, -7675, 11050, 1000, -12383, 6449, 7689, -12068, -1406, 11829, -6872, -9080, 12017, 1091, -12683, 8184, 6844, -12558, 3814, 10729, -10543, -1797, 11661, -5329, -6221, 8644, 104, -8023, 3767, 4024, -6898, -203, 5177, -4998, -1316, 5922, -4831]
444d831K543J0315j1600r88J2639q532n669J1421k871p958P145J918p633L084
458a017N398p573n57R500o856n394J2209l303r854J0314K283j0194M944M493n976
473a583P45K960k670j86K189k227r92L728k035m350O760P93r189N979N761r658
489c975J750P611o605j973O487j672l809K198K079k870n92L211k368k036M454
504A890j563l218M096n87k640K746j11j011N68m77J839p53k785L409N56l880K028
521A07J533k887J41J962m08k396J137K851l467m60M728l642j902N704k310k934
537b243M038p56k166K126p96m93J112j141m87Q67O41j878k82L237j953k825M947
554A948p90m137M803l95l928M395m97l968M505K22n307L233L100n067q81N898
$$ y = [-4831, -2288, 8027, -3573, -4561, 8078, -454, -6123, 5298, 2427, -5531, 1614, 3532, -4101, -1017, 4381, -3192, -3749, 5751, -1105, -6499, 5710, 2407, -7447, 2867, 5150, -5044, -100, 4393, -1583, -838, 2122, -548, -734, 1455, -772, -1764, 1964, -71, -4421, 2339, 3132, -6057, -78, 5683, -3975, -2225, 5386, -1219, -3192, 3295, 1623, -2186, 12, 2091, -779, -1371, 1840, -528, -2564, 1890, 327, -2891, 1205, 618, -2022, 724, 613, -398, 170, -307, 1532, 779, -2006, 1403, 1959, -1921, 107, 1640, -1247, -1106, 856, 448, -1948, -811, 2040, -1427, -1887, 2841, -801, -2703, 3001, 691, -2243, 1795, 1039, -1127, 999, 203, -290, 822, -319, -806, 61, 702, -1176, -1458, 1779, -174, -2999, 1948, 1158, -2979, 1824, 1429, -2499, 1896, 1399, -2569, 1936, 2158, -3149, 84, 3184, -1883, -2764, 3134]
570C134k510n525O937J669r238M902O354r568J548Q124p658j669Q206m255m141
585c690O495o27n703M258K750p045J667P132p405k571R841m976o088R924j633
600B329p822P562J581p344L995L258o066J500N130n259k333P253k919o354Q439
615B950J94r680P508M197j0852M393P402r425J98Q583n791l900Q042j594o643
630d418O057K538q612L450O532r526N56R981q896l537J1776n168p504J0309Jr020
646e481O169M389q446J313P507o359l171Q872l873o723R698q55j0004Q616L462
661E114j1179N084O608r422O54Q525n575m386P727p62o647N574K888q199L475
676e21N731q784J198P834q208j245R549o418m786R566j743p665O380L645p963
$$ y = [3134, 624, -4901, 2036, 3705, -5533, -631, 5723, -3845, -2297, 5827, -1831, -3500, 4706, 451, -3690, 2805, 2178, -3525, 733, 3483, -3562, -1895, 5237, -2168, -4739, 5102, 126, -5962, 3962, 2329, -5493, 2069, 3650, -3694, 301, 3559, -2507, -1007, 4123, -1136, -3469, 3784, 865, -5489, 2950, 3144, -6536, 972, 5169, -5683, -1290, 6112, -3313, -3115, 5468, -323, -4223, 3819, 2225, -4418, 1639, 4177, -4435, -985, 5547, -3979, -3423, 6558, -2338, -5875, 5901, 733, -6771, 3538, 3539, -5481, 688, 5077, -3369, -2056, 5451, -908, -4079, 4793, 920, -5803, 3895, 3040, -6964, 1652, 5114, -6065, -981, 5627, -3795, -3141, 5384, -191, -4577, 3150, 2388, -4259, 1315, 4203, -3996, -521, 5210, -3574, -2376, 5458, -2750, -3995, 5554, -864, -5650, 3916, 2173, -5492, 888, 4533, -3430]
691c430J489P069o328k699Q517l783n454Q466j998p597Q237J039r111N817M554
706D788q666J204P434n242l966P467l07p193N220L457p439K550M764o400J004
721a325N174n865k9N757m863j802N686k297l975M654J473n568J953N148n671j423
737b973P042m028l454O959k472m862N960n14n103M284J673n415J868M126m320
752a229j990N816r93n472N053K325p014K905M756n883K27M358l084j005K408j323
768a45r33J415P0j341Q39Q26k227Q87K466l076l56M148k663j881L986j498j967
785a450K514m82j287J081q4p52L31L89p84m50J756q02j953K821K48l144K619J139
803A710l041J206J563j653J1O20R0n83m74J092l46j199J497p28q83J733p37p28
$$ y = [-3430, -1941, 5128, -1200, -3899, 4618, 835, -4619, 3847, 1849, -5748, 2489, 3528, -5583, 234, 4788, -3878, -2674, 4760, -482, -4448, 3019, 2712, -4481, 739, 4196, -3243, -693, 4071, -2329, -1325, 3849, -2016, -2045, 3712, -1151, -2953, 2733, 436, -3539, 1115, 2588, -2980, -1027, 4121, -1550, -2973, 4069, 41, -3413, 3546, 1074, -3788, 2172, 1658, -3445, 839, 2512, -2903, -1035, 3091, -1229, -3219, 2597, 1604, -3868, 1185, 3510, -3504, -599, 4157, -1726, -1499, 2859, -225, -1230, 1178, -145, -1078, 337, 407, -934, -95, 731, -1496, -609, 1857, -1219, -1575, 2573, -90, -1971, 2015, 517, -1450, 1064, 582, -705, 376, 292, -460, -129, 260, -524, -974, 782, -20, -1973, 848, 1096, -2048, 571, 1710, -1331, -125, 1438, -215, -204, 416, 506, -77, -551, 541, 195, -1004, 493, -235, -1118, 615, -122, -850]
821h50J480o39m88R55k78l2j77J87Q18j536N1K055k219l85K544j753j202K178
839G09m86j215O02Q80l85j000J250M74j862J432P47k182J352P59k161J593N67
856A074k596J405J261k038J51J522p84j099J172R07j939M86K114k335k4K574k791
873i40J50L037k998p28L616k168j844K920j25k705J337K178k530r77L749j768
889B04k665M221m86l977L962P81m486K994J867m140J207K542k643j068L046o75
905F84k880K566J349m029J855L065m619Q46M163m059o57M268k649j604L403j107
921E95k193K226O10k931J323K298l464r6M301l364k315N658j923m165N234K14
937B008m840L455J932m448J215L243l052j433L733j179l411L849O59n006L243
$$ y = [-850, 630, -9, -497, 458, 180, 148, -29, 158, 976, -560, -509, 1546, -673, -1058, 1486, -267, -1469, 709, 223, -992, -390, 490, 105, -895, 355, 829, -1033, 399, 1146, -1036, 316, 1075, -1086, 507, 1074, -1522, -117, 1144, -894, -743, 779, -5, -1104, 68, 975, -964, -478, 1636, -699, -723, 1851, -940, -790, 2247, -751, -1479, 2137, -31, -1875, 1045, 920, -1785, -448, 1730, -800, -1777, 1972, 204, -2461, 1760, 1274, -2703, 1259, 2040, -2446, 548, 2415, -1725, -518, 2024, -619, -1687, 1359, 684, -2196, 370, 1719, -2310, -455, 2610, -2009, -1163, 3000, -1059, -1716, 2552, -97, -1701, 1702, 595, -1598, 628, 1238, -1693, -370, 1928, -1536, -1632, 2669, -695, -3010, 2648, 725, -3440, 1794, 2008, -2832, 623, 2555, -1893, -678, 2565, -487, -1920, 1813, 634, -2777, 1072, 1731, -3275, -32]
952c2L003n737J546M496m748m41M544k692j875L483m87k778K225J235l406J066
968e98L092l888n56M713l395k284N535k229l549M923l70l998L078J693l636Q21
984f48K870k566j432L837j164l665M196M04m805L238K047m889J876L179m246O08
1000a160L400k801j124L286o67l001K700J607l925P66L625l687p92M263k915j713
1016b138M175j984k399L536m44k631K202J128k533L42K540j775j734L379o91l017
1032b044L210K22l566K631J087l419J750J566k867P71K059j938j013K525r0k481
1048a597J650J780k982P73K590l115j96L218k477j166L085j417j792K167N8j575
1064i96O67J169j154o60J976q07j392K184j26k225K045K14j984J782j34j650J339
$$ y = [-32, 2971, -2766, -1220, 3276, -1472, -1913, 2631, -61, -1936, 1547, 1060, -1718, 507, 1742, -1664, -598, 2494, -1394, -1950, 2763, -632, -2916, 2619, 390, -3159, 1764, 1394, -2604, 474, 2167, -1469, -648, 2222, -344, -1776, 2061, 897, -2768, 1428, 1832, -2973, 265, 2312, -2577, -701, 2478, -1768, -1160, 2240, -561, -1685, 1601, 934, -2067, 633, 2240, -1685, -919, 2706, -981, -1773, 2490, -425, -2138, 2037, 53, -2346, 1190, 746, -1885, 317, 1445, -1088, -746, 1794, 19, -1715, 1664, 973, -2044, 1166, 1388, -2178, 453, 1540, -1879, -129, 1437, -1430, -659, 1400, -538, -1551, 974, 884, -1597, 53, 1833, -1149, -376, 2214, -901, -1097, 2121, -356, -1522, 1563, 146, -1646, 521, 579, -996, -329, 840, -314, -974, 1002, 195, -1197, 987, 861, -1364, 681, 895, -1089, 693, 559, -1091, 248]
1081B48L96j491K00J041l14q64O57Q70j528M47J308j745O30J573k095Q1J975j626
1099b37n92J550l86q48L37O92o22p72J279o3j564J580L66j841J175R52j419L78
1117c5O03o80K34M7k4k19k72J129j018n15J374o65q87J300m61m82P99m55M7N50
1137C70n19K7K44J36J98p28N25L98j209O83L96j411J045M34j616P72R86j589O60
1156a98O08p63N5O90p3q97N97J098j654j95K347j837j112K687j154j509K005m88
1174B07j164J237K50j494N62J277q92j126K002J45k419J670J047k590J386J365
1190A463k542Q21J499j925q6J452p26o89J076J71j394P32J228k014L13K388k292
1207e25m81K620j714j133K598j191j304K076n32j758J285J081j810j08J881j005
$$ y = [248, 644, -847, -647, 394, 80, -784, -127, 743, -785, -338, 970, -775, -145, 1428, -667, -586, 1389, -237, -829, 721, 335, -513, -176, 516, -106, -878, 401, 338, -1226, 354, 720, -1121, 54, 1006, -413, -35, 568, -112, 122, 169, 145, -74, -346, 783, -235, -750, 624, -41, -928, 372, -89, -571, 228, -227, -180, 370, -149, -122, 122, 258, 456, -272, 253, 651, -558, 125, 521, -890, 155, 589, -1027, -255, 731, -858, -198, 410, -353, -298, 392, 319, -578, 19, 1117, -537, -732, 1615, -222, -1334, 1353, 199, -1310, 695, 207, -957, 280, 530, -964, -402, 875, -17, -1143, 859, 1004, -1415, 255, 1302, -1288, 98, 1463, -1079, -258, 1241, -684, -770, 682, -44, -733, 343, 514, -880, -148, 1080, -934, -621, 1767, -525, -1006, 1614, -100, -1233, 1365, 174, -1130, 946, 414, -1344, -59, 1022, -788, -896, 985, -20]
1223b0j504K451l61k109K579J62k946K231J065k940J329J702k353l16K070r34
1239A06j429J804N16k682J477J902k905Q3L003k460n17K875j855j163K615j017
1255C53j755K015N42k028L32J657j532q52K270p97j626K326m86k174K724j9k565
1272a615K062Q05k458J191J261j817m5J910j044j678K067L41k781J678J837l179
1288a465P87K428k925m0L070k056j252K668o33j789J487R49k013R2K046j740q64
1305a250K408j106j639K763o83k242K338L23k025J214P51j374N37Q38r12o19J452
1322G74m29j307J480M28k156J245J108k459J049J441k187L79J820j637m44J595
1338G00k18j309Q52R45j600K92J653j624o87K334j330j485K508p24j577J534K87
$$ y = [-20, -1524, 927, 566, -1543, 1036, 1198, -1748, 483, 1548, -1392, -63, 1639, -714, -1030, 1040, 106, -1323, 481, 997, -1685, -208, 1694, -1211, -1128, 1875, -585, -1102, 1773, -82, -1245, 1370, 353, -1402, 613, 1155, -873, -541, 1116, -416, -1268, 1002, 205, -1421, 905, 419, -1755, 969, 950, -1615, 447, 1252, -1206, -15, 1246, -571, -616, 1294, 250, -1428, 639, 980, -1801, -123, 1714, -1465, -678, 1750, -1175, -1215, 1855, -201, -1453, 1215, 582, -1207, 280, 1229, -784, -692, 1354, -386, -1250, 1158, 52, -1587, 1176, 493, -1749, 589, 912, -1113, 101, 852, -522, 15, 853, -59, -678, 774, 345, -962, 518, 946, -1210, 35, 1143, -1316, -267, 1174, -1013, -634, 1186, -451, -895, 700, 482, -827, 25, 970, -630, -338, 1315, -309, -996, 1338, 8, -1477, 1031, 307, -1270, 264, 551]
1355E51j425O98O86p11l05J063k09j126J160M46j641R43Q97j891Q80Q91j641M93
1373b41P18q56n0O96l32k15K77M15n14j46Q75q37r3J116r67m87J604q75p73J323
1393F38o33p07Q64N7n37M6L59j01n50Q01K18j111P49O96j382N77P72j163L71P23
1413F87j000p1O00j61k85qN59n92l64J132n17o56J236m15p52J057k20n30N27J08
1433C35m43J06J02Q4l78K32M05j066M88O13j210M99Q49j111J84R30p68K6N77l37
1453A17j25K12J91m16k49P83m95n15R69n08p54J296m15j054J291p2r23O82M32
1472D47o97L9O43k39n71O51K86j151N96P80j546N35J125j578K80J066j027k01
1490e62R37k88o46N98M91j035K70R05q33l59J477q90r48J707n56j147J402l03
$$ y = [551, -874, -176, 510, -201, -506, 557, 348, -778, 382, 828, -813, 130, 1027, -864, 16, 907, -734, -241, 477, -379, -429, 267, -65, -280, -3, 412, -102, -248, 627, -210, -303, 813, -154, -641, 963, 88, -685, 638, 5, -702, 162, 219, -318, -272, 87, -14, -564, 237, 455, -656, 93, 789, -593, -16, 756, -407, -36, 687, -313, -384, 216, 55, -230, -238, 321, -271, -635, 497, -20, -676, 560, 145, -607, 450, 230, -300, 227, 335, -108, -2, 100, 184, -194, 38, 443, -623, -135, 478, -732, -233, 616, -495, -311, 619, -149, -123, 454, 117, -8, 204, 395, -21, -270, 513, 18, -497, 472, -36, -790, 506, 91, -963, 328, 256, -667, 15, 447, -250, -211, 432, 193, -378, 273, 559, -592, 4, 784, -762, -227, 898, -680, -400, 666, -361, -562, 375, 87, -559, 39, 530, -505, -235, 670, -163, -522, 955, 65, -883, 824, 268, -879, 523, 220]
1508B20j101J037K31r20K67P17o38k70J037k80j176J327L16j791J163R90j937
1525h08N48J197j519J88J090q75m38R12j8q64M38Q35j178k2J552j368l93J848
1543A125j081r91J875p21j068J436j48j210P30N86r74q3J104p16o80J310n9j507
1561a072J354N58j811J160Q56j834N80J137j220j66J106n28p70Q93J46j167N24
1578b54J093j411N4J425j161m83J639r73p85J620l69r85Q69K07r70L69O36o68
1596a47n00J147m54r11J380k29j370J383L66j511J017N08j408P95P37j011r5R16
1614F13m38p95Q89L26j425O29J009j449J76J337j287k84J506p87o55J269l57p60
1632d83O09M62q78Q4Q53o80o71J180k79j114J224J2j229J044K56j039P09L14n49
$$ y = [220, -881, 156, 387, -533, -266, 451, -187, -457, 580, 300, -876, 451, 767, -1024, 139, 1129, -808, -260, 937, -582, -394, 696, -179, -617, 295, 277, -587, -149, 686, -492, -514, 1038, -330, -723, 1125, 44, -947, 928, 207, -861, 575, 427, -783, -53, 533, -441, -524, 580, -136, -816, 494, 435, -1072, 282, 840, -971, 189, 1045, -789, -209, 928, -292, -458, 648, 120, -650, 243, 389, -778, -254, 839, -572, -518, 907, -254, -737, 902, -71, -856, 764, 395, -590, 279, 486, -484, -115, 521, -147, -647, 500, 46, -865, 515, 286, -1084, 299, 665, -846, 171, 679, -729, 66, 803, -208, -303, 613, 175, -620, 269, 595, -830, -201, 808, -641, -465, 872, -415, -699, 807, 20, -635, 634, 277, -483, 126, 588, -290, -206, 647, -33, -704, 476, 197, -917, 307, 319, -910, 134, 390, -649, 60, 374, -175]
1651a75Q1M13j56l78K53L92p52M23L97j050L68R12j247J82R22j076o0J072p49
1670b28j97P09nm94K45L17l97j51P80m76o43J002j88q77R35n1j001R19J23o21
1690b99mM47j84l44M51K42o63L28O54q85J03P64p96j53Q69o40j60N03k72j39J27
1711e1J49k61r1M33j63m50O34K9p03Q01k0p19O45p9m35M70k9m81L29pqj56J53
1734a0J94m04P5O40p79R0Q00q22j2P74o04k05O71k29m80L30R0k09j65M91m67j99
1756d30O42n7q96R69J23j031P85K52o47L80K45l11j38K04J45n07J34M89n87p4
1776c10O81p28K1P76o84j32Q18n83q1M69j26k14K11K9k43n8M82k68m72Q29l39
1797G8p20R52k2j031Q24K90j006O34M53p84J04O71k39n10M90L38r55L47P86j084
$$ y = [-175, -94, 319, 163, -215, 38, 430, -322, 101, 498, -552, -184, 728, -519, -337, 585, -491, -551, 521, -228, -425, 284, 279, -215, 30, 347, -50, -201, 579, 103, -540, 462, 274, -603, 332, 281, -720, 199, 322, -299, -303, 144, -40, -384, 67, 309, -354, -26, 628, -257, -154, 610, -186, -339, 530, -110, -270, 233, -39, -178, -51, 98, -163, -254, 179, 16, -434, 200, 229, -474, 327, 307, -412, 233, 154, -281, 189, 160, -321, 8, 1, -7, -163, -10, 184, -220, -145, 495, -284, -194, 606, -216, -228, 546, -58, -263, 408, 179, -301, 29, 119, -90, -255, 236, -231, -430, 212, 155, -741, 228, 351, -680, 105, 357, -290, 90, 335, 24, -114, 90, 235, -272, -138, 351, -236, -310, 371, -357, -336, 440, -244, -376, 442, -141, -222, 247, 121, -93, 118, 147, -96, -154, 328, 60, -412, 417, 78, -642, 310, 288, -743, 81, 371, -635, -1, 452, -332, -228, 443, 204, -306, 184, 522, -433, -86, 700, -384]
1817c84O0J079j021l04J023n47m57Q15q6m58L05L09l75k24P56m13n22R92m65n90
1837e07R90k18q07Q42r1o89N56J26m87K52K39m39j06N99p0o29O42L48j103O66
1857A14O98j319M54Q43j083o7J022q81l38Q46j52o03K83O52p57j33J089o09o57
1876e98J326m28r01J045r0q98Q57R6p31K33M16l38l13N18p3o06N58L16q11M38
1896A6M15q94N13N80r69J98N49o74J04L81k35k00K96R3n83L18M40o66RQ28q29
1917c10n6J011o59n29R58k20o56Q79Nq59L34M39k51o20P56m7q67P58L48r59M96
1938d9M30r23L65O02o22M7M50l48q3K39J42k11k30M23m74q1O00l10l73P54l51
1959cm59P02l46k11N77k05k72L09M4l38J32L73k16l83M74o3n79O85R7q66O41K77
$$ y = [-384, -324, 755, -266, -570, 453, -94, -551, 264, 178, -280, 25, 334, -41, -265, 491, 78, -444, 548, 83, -507, 483, 265, -542, 300, 209, -480, 76, 202, -285, -33, 206, -233, -339, 260, 190, -439, 203, 551, -552, 114, 812, -507, -53, 790, -293, -360, 662, -219, -557, 289, 137, -466, -183, 469, -288, -421, 668, 59, -598, 728, 300, -601, 444, 354, -544, 313, 409, -322, -89, 327, -11, -324, 194, 121, -485, 73, 389, -422, 16, 431, -463, 50, 630, -339, -141, 408, -266, -162, 219, -16, -216, 80, 173, -410, -92, 348, -318, -309, 519, -310, -366, 645, -14, -543, 415, 195, -461, 418, 423, -436, -102, 337, 86, -534, 222, 175, -692, 66, 414, -545, -49, 381, -542, -177, 425, -197, -150, 300, -48, -131, 108, 250, 39, -191, 232, -242, -323, 277, -33, -406, 348, -3, -462, 240, -106, -317, 260, 55, -217, 92, 136, -202, -70, 303, 87, -296, 178, 115, -464, 221, 318, -548, 93, 370]
1981C70q93M75L82n00J29K88p1k00L7K55m07J3O39p01j29P69m47m62P83m44k19
2002c33M58l8k65J37O4J17k89J90J68m70L15K43n20K37K42o07K65K57m97J76J91
2023D1k21J76j8R8q3o0K81k55k15O10l63k92P02m31k69P49m14k65L69j22j51K05
2045G2k1j82j71K81J60n74M85J40o52O66J78p53L89M53n66R6J44k52M6j7K59l31
2067a50o0M30m31j48P01l45l19P05m50k47O07j97k51L02m9j91J3N7J19k09J77
2088F4R9n71N07K52q68M93L17p43M80K99n57J85K72k77k5J34J32l33J46L04n96
2109b86j6P75o37j62P79o37k92P72k42l64O42k21k96K53J47k05j30L62n5o08O62
2130B41Q0p69N06K39r27N68K77o39L73K56l17j16L80j34k05K98R6m52J02O36q13
$$ y = [370, -523, -48, 334, -166, -37, 251, 180, -20, 17, 272, -135, -122, 517, -184, -313, 456, 9, -453, 330, -114, -333, 125, 87, -178, -41, 23, 140, -149, 41, 209, -261, 54, 297, -223, 14, 256, -351, -86, 171, -326, -150, 41, -180, -4, -22, 76, -7, -67, 214, -41, -256, 354, -9, -301, 401, -30, -299, 450, 36, -229, 140, 18, -133, 72, 51, -131, -302, -21, 139, -435, 50, 190, -462, 204, 382, -371, 18, 471, -95, 1, 145, -107, -61, -78, 181, -150, -210, 220, -211, -359, 342, -3, -322, 383, -67, -314, 293, 96, -155, 147, 98, -93, -80, -23, 96, -113, 64, 163, -408, 99, 351, -517, -24, 293, -450, 30, 329, -228, -43, 229, -48, -73, 61, 193, -140, 6, 310, -286, -302, 473, -164, -326, 453, -184, -476, 296, 54, -310, 332, 111, -185, 68, 215, 10, -120, 242, 187, -421, 241, 321, -448, 58, 297, -630, -62, 215, -424, -51, 205, -112, -228, 152, 18, -187, 111, 207, -245, -143, 493, -320]
2151c20k5Q61p73n9P84n81k99P44l70j96K35J69k24k7L26k37l97O39j82l99N63
2172B32R8p92O64O6o49M29P5l71K52L1k48k0M04P4m43J48M28o30J36O07p99J20
2194a88Q01p42j70P27m74j75L87j46k06R9J80j73j00M84k38n21Q19q6o81O90k6
2215B61n99M85L8l68J53J84l02J4J75Jk94R6M30n06M6M57m96J12N21p57K17L84
2237B52l89L5L17l32J21K9M1j52k62N77k01l94O30k23n01P56k63m29O87j41m16
2258b58M07J15l68J17J47p1k60J19K93n93K56M81o52L9N12m81N1N15m76j01L85
2279A77j88kk0Q7L0k17K22l6l00L35J5l86L10n8k35M16j01k43L66p2j25R9l6q
2303C0j24R7K03l05J00J44m28K78L91p64K41M21m99J77Q5k00N9M6J46j11j64L14
$$ y = [-320, -345, 516, -257, -316, 468, -113, -412, 332, -38, -234, 1, 170, -54, -81, 245, 8, -389, 250, 68, -331, 232, 330, -462, 202, 268, -381, 48, 123, -248, 4, 35, -213, -233, 171, 245, -198, -50, 378, -252, -116, 491, -308, -188, 613, -129, -299, 428, -46, -221, 166, 20, -186, -87, 93, -80, -180, 304, 66, -455, 364, 278, -403, 287, 261, -338, 147, 185, -183, -30, 154, -148, -134, 41, 42, -252, -156, 274, -232, -186, 271, -225, -113, 408, -349, -132, 252, -137, -102, 215, -117, 4, 33, 74, -78, -340, 237, 36, -358, 272, 49, -452, 304, 41, -388, 299, 158, -258, 149, 264, -104, 13, 160, 89, -171, -52, 241, -352, -96, 385, -267, -228, 284, -197, -146, 369, -107, -208, 177, -11, -13, -33, 54, 84, -133, 89, 53, -247, 88, 103, -283, 27, -31, -266, 150, 49, -194, 172, 100, -25, 74, 38, 30, -94, 3, 206, -99, 1, 145, -283, -5, 386, -378, -137, 284, -215, -38, 47, -153, -94, -48, 98, -13, -177, 137]
2325A37j01k67L66P1l93K65J19l72K64m0k80J86PRm1L3J6r0J29J55k93P1L78m91
2349a62M2M64n92J67L10l22J22p0j8ol1L4J7r2K22L4l79M03m2l04M67j93l84O61
2373C48k68k37K96j66j93K73m3rj10J34M6k69K74K01m95K00M03n84J28M26m17
2394f2k7L51j70k43M5L17k66j75M58k24m63N99n4m99O54j04l03L27Kk57K01p1
2416C6r8R6r9J90r0o3L35l39j05K71l28J88J95m71K77L02m96Q6K85l29O6L36k15
2439C0j17J26J79l93oM33l31k16N45k85m85Q83l05l97N09m2k32J6K41k9k35K14
2461A03J77n89M07J83n26Q4N65n68O2K89k39QJ37k39K7J03PN8k1R9k01Q8J95j86
2485B3j54L58k59j69N39m22j70M00k10j91K92qj81N9J66o6j85M49j68l15L02J59
$$ y = [137, 36, -231, 135, 206, -187, 78, 197, -175, 89, 49, -231, -45, -38, -29, -70, -37, -21, -111, 18, 173, -120, -49, 329, -162, -120, 344, -248, -81, 229, -93, 29, -41, -59, -65, -96, -62, -45, -137, 85, 119, -260, 143, 101, -203, 264, 71, -313, 348, 80, -157, 139, -27, -220, 53, 10, 1, -109, 25, 71, -198, 76, 277, -218, -18, 385, -199, -71, 355, -62, -89, 262, 92, -151, -106, 211, -55, -230, 228, 4, -459, 140, 86, -413, 241, 137, -166, 161, 163, -94, 107, 36, -62, 34, -65, 125, 35, -28, 307, -32, -137, 134, -194, -6, 189, -282, -5, 297, -199, -113, 172, -157, -91, 245, 30, -87, 39, 218, -175, -181, 252, -79, -295, 250, -35, -520, 363, 58, -339, 170, 128, -104, -88, 153, 124, -111, 103, 280, -309, 98, 281, -245, -161, 404, -164, -102, 187, -52, -44, 93, -146, -119, -16, -9, 49, 28, 127, -74, 14, 209, 23, -131, 227, -32, -201, 338, -84, -254, 146, -64, -255, 37, 29, -152, -93, 73, 7, -178, 271, 103, -212, 90, 249]
2507B49n42L81L23o08J20L51m96R3K36r8q6O4J24j90m9M31l27k38O62l39j80M25
2529C06l22j22L72k52j13K32q3r5J4K8J00j58R4P1l13L50K25n71L62J14l78K79
2551A40N2m01K96R2j52M8j02L7j29L2J62k23m5M37n85J52N57n42O5L97k11j12
2573c5J36r4k4J0oJ80k38K7J72l89K71J78m38K80J46l49K21L3j59J6J58M3l2j39
2597c2J01j22l1J86l62M8M35l43pL18k76m1K23j62m3J62j78N4K6J45j56j5J95
2620A25o1k53L00L7l98M06Ol66K00N1k35J33J17q4K9J0J56l08L7L68l80M2K35
2643A67k99m1L12k50p1L46k50L1P1p5J5j3J04Q6k39J45J6q7K16p2k89K19K4k45
2667a79K67j3k48J56J35k14M5M7L6j16L0J97k46j05L63j62qK09l47J30L39l40
$$ y = [249, -293, 88, 411, -197, -77, 274, -222, -129, 107, 9, -77, -13, 111, -79, -128, 303, -24, -262, 400, 61, -119, 306, -16, -138, 234, -18, -131, 101, 18, -77, -63, -35, 65, -93, 1, 72, -241, 109, 334, -237, 125, 239, -139, 140, 192, -209, 87, 179, 27, 75, -27, 10, -119, -87, 75, -148, -193, 244, -341, -189, 368, -174, -109, 288, 77, -35, 101, 7, -17, -7, -13, 167, -71, -44, 128, -261, 10, 188, -250, 30, 176, -173, 48, 81, -78, -62, 96, 139, 107, -32, 69, -53, -84, 102, -260, -212, 223, -120, -127, 191, -85, -126, 97, -65, -108, 54, -124, -70, -44, 101, -55, -70, 125, 64, -189, 111, 148, -250, 156, 162, -204, -4, 47, -188, -55, 62, -22, 7, 17, 173, -135, -98, 270, -110, -68, 167, -132, -173, 139, -111, -182, 164, -86, -55, 16, -59, -44, -57, 47, 133, -106, 39, 55, -32, 184, 112, -177, 42, 66, -179, 88, 75, -173, -17, 118, -96, -51, -4, 32, -84, -54, 143, -103, -208, 155, -7, -15, 194, -153, -23, 316, -24]
2689b4j18K24q3j16J39j16J59j35Q7P5k64K07J02l71K73J83l88K75j4k23J37M4
2711E3j45R4J60j70j15J66L4k03k3M09m74K16K20l41j3M04k79j1J72p3p8R5j08
2734a0L5r1J36j5k30L48r8l04L35Ml73L70P5l24K45j9j23Q9J9q3n1J19J11l10
2758a45R4K65l39O4K90l88r8L81q8j58K23j74R8l9R7q8l2Q2q3j48J83p2k32M61
2782A54j62k67L32N9l92L49J46l22N7J20N9j51PJ08k77K44J06j90q2K58l09P9
2804g4L23l39j6J88j37NN1OJ00j31J54J5k79K35K5k57K40q6n3J91j49j22J75j33
2828f8j37K32K1j26MR3k9K5LJ63l41K63J73m85K26J58l13J69J84k40M3L5n7j31
2852a35M2J64m5o7J81j8k47J88j5k50L70j22j65J75l8j27P8o1J27Nk17J68j24
$$ y = [-24, -142, 82, -1, -117, 22, -94, 65, -70, 17, 92, -172, 35, 137, -234, 39, 222, -166, 109, 95, -128, 9, 53, -92, 2, 162, -8, -123, 43, 77, -126, -149, 260, -214, 2, 222, -119, -132, 272, -7, -18, 154, 81, 3, 98, -10, 25, -66, 70, 55, -175, 173, 75, -229, 106, 110, -263, 107, 182, -142, 103, 84, -39, 50, 69, -14, -65, 54, 165, -145, -51, 214, -125, -61, 229, -159, -257, 124, 36, -122, 101, -73, 25, -14, 83, -5, -37, 45, -38, -186, -3, -75, -307, 154, -8, -275, 57, 116, -276, 73, 219, -103, -46, 74, 133, -18, -11, 97, -180, 64, 170, -20, -102, 156, -153, -74, 249, -90, -106, 82, -55, -50, 1, 7, 107, -24, 130, 145, -134, 101, 126, -131, 109, 23, -30, 161, 12, -110, 65, -68, -205, 27, 48, -78, -74, 19, -10, 15, 18, 181, -160, 103, 276, -209, 17, 175, -138, 31, 215, -25, 18, 53, -4, -135, -93, 71, 26, -41, 140, 122, -125, 63, 48, -202, 168, 46, -119, 56, 18, -109, -31, -92, 35, 40, -177, -9, -133]
2875a33J52P1j49O4Q7j85J95m5k45J49J19k54L29M5k33O4jj4k9p8Q0j06l4L11
2899A60k04r1K67j38m5J16j5j74J39K3j68J23j35J29j10R1J45k94J11J07j88O4
2921h7J02r2K9K6M6k2oN2K2r5p6J77k87L67p0j96J86pk85L77k78n2K89r9p2P0
2947A9m1L7M9p4J35j64j9J12j89J20J07k13P8K49l70O4J62k29K39k2j51L2N8J9
2971HO4k12L53k32k8L22j84j35Q5K3k62K31l9p2Q2o2jk2K0P0j91K40J25l84J75
2996b6J37k04R1J26k74R4P4j20Q1ql3R6j76J27n9N9J4j5l8K88l25j8L14k48r8
3021a41K51n6k27K53p7j11M5M8m8j53L07Lk89J10K93m16J86K22k15R0R0k84J43
3044B4np5j2J4J44j00j27J58p3j97K61n8n4J72j23j9J80q3l7P9k1j00j0J07o5
$$ y = [-133, 19, 90, -59, 5, 92, -93, 102, 57, -188, -39, 80, -174, 155, 200, -33, 31, 30, 16, -13, -91, -11, -117, -151, 160, -44, -135, 132, -6, -51, 65, 50, -124, 15, 38, -130, -7, -142, -13, -123, -32, 113, -181, -70, 37, -151, -87, 15, -77, -48, -22, 24, 2, -4, 48, 70, -25, -101, 76, -211, 156, 86, -110, 76, 69, -216, 161, -117, -169, 120, 21, -51, 19, -22, 15, 64, -10, 125, -39, -58, 54, -135, -15, 92, -121, -43, 206, -164, -100, 62, -167, 72, 50, -101, -69, -11, 8, 72, -140, 213, -19, -47, 275, 91, -44, 41, 64, -198, 33, -6, -78, 4, -58, -59, -81, -61, 9, -182, 58, 183, -201, -26, 111, -93, -2, 124, -150, -56, 18, -102, -21, -29, -62, 34, -142, -15, -74, -15, -1, -16, -54, 234, -91, -109, 205, -43, -141, 110, 54, -173, 80, 3, -108, -63, -15, -63, -216, 91, 94, -195, -85, 208, -208, -22, 200, -15, 75, 165, -119, 24, 19, -56, -68, -54, 90, -10, -137, 21, -52, -249, 12, -46, -100, 72, -51, -70, 110, 27, -10, 69, 48, -52, -62, 45, -20]
3069b0l1L1n1L7j3L3k26K58r3l8J92O0k93J61J84k07j8K0n3lN7K11k93m8K68k14
3095h9j08L06j32j43K66q8n5J59j11PM2m3N2j30J96Lk34K40k6k44J48K4j65L7
3119h8J00j18J50q3J8P8n2j1M9j40J48l5m2K03k70K1J73j95l0K91l11R6R6j24
3143g6L7J8m7J09q7P2j4j29J63N2l06K28O8k13J25L8j32Q4Rq1N9J4K6K7k3Jk1
3170Aq3K18j26j26J78lj72K51j46%J01j25K1J62j98J0O3j34J17m2O2M9j81K07
3194A04j06k7J97o7j54J18n1j70K63J3j20n3K1j34J06j17K68j35n2J47j17oK34
3217A62j64n0J92j25Om4o4QQ0J25m3j44L4J33k64K53j4k20K08J6j14J50q7k8N4
3242F0j15Q6l7l4N1m3qP6j33Q3J89j32j42J52j28J05N8j13K8l7J5Q1q3j0K6O5
$$ y = [-20, -51, -20, -71, -34, -47, -14, -240, 18, -75, -113, 79, 139, -154, 7, 191, -16, -34, -14, -67, -70, -13, 198, -95, -143, 125, -89, -197, 109, -23, -166, 100, 12, -43, 116, 5, 12, 54, 11, 63, -67, 129, 132, -102, 138, 112, -132, 16, 40, -125, -88, 12, -106, 44, -39, -21, 57, 5, -6, 43, -97, 51, 16, -26, 177, -93, -72, 101, -94, -124, 167, -144, -48, 48, -76, -39, -21, -68, 41, -46, 26, 12, -117, 46, 98, -208, 20, 88, -125, 0, 38, -94, -10, -1, -82, -23, -9, 17, 44, 21, 22, 1, -82, 136, 10, -116, 62, 59, -113, 138, -8, -8, 93, -32, -11, 151, -47, -37, 26, -108, 9, -33, 29, 78, -103, 104, -2, -29, 168, 101, -53, 65, 14, -156, 107, 120, 0, -53, -32, -166, -60, -177, 91, -44, -96, 51, -66, -72, 162, -2, -52, 140, 15, 21, -23, -87, -79, 1, 126, 83, -61, -27, 106, -158, 95, 81, -139, 69, 85, -29, 121, 34, 6, 60, -55, 31, -6, -40, 11, -32, -40, 36, -97, -14, 175, 43, -99, 53, -75, 30, 88, -25, 3, -34, -19, 62, -21, -31, -5, 60]
3268F0k1M3q7K8K0j70J06N1j00J34Kr1R8q2K9K4j1L8m0r1K51k10l9J93k08m1K17
3295A03l00J14K02k06p3J69J0q4M9j12J34j14J85p1j31K68j08q6J08o2j39J95
3317E1j08m6J01j8p4R6p9O2kj2j7o4P5J32o9j25J55j61N5R1j95R5R4m7p4M8k6
3344f2J15j45J23k6j72J71m3r4K14j8j51R8p6m6K03p4J3J3l7Q5j00r5J36j07L3
3369d2K14k56l5K10j68n1K80k15R5k1j4n8J40j58J23j67R1P0k17K46r3p6P4J8
3393a0m3J51p2r1J84j87R2L7q7M3j73J93nr7N0O5j96R4N1m1J9J64k17J19L5j32
3419e4o7J91m9K4N7j28N9l3M9j42o0L08o5k04K25j06j41J58%j87K74r7m4RK8O0
3445F5nk1J6j48J49n9K2m7J39k7k09J71k02J82L7n3L0K0m8J2k9R7q4l7P3j51m9
$$ y = [60, 39, 82, -5, 23, 43, -127, -21, 30, -70, 64, 66, -25, 73, -9, 20, 44, 33, 71, 31, -60, 191, -19, -58, 135, -73, -114, 103, -197, -83, 119, -87, -160, 9, 19, -65, -16, -128, 6, -108, 77, 6, -125, 143, 35, -51, 57, -5, -144, 51, -57, -103, -2, -20, -94, 2, -77, -15, -17, -29, -46, -110, -35, 97, 28, -97, 58, -103, -48, 43, -152, -57, 37, -10, -84, -36, -62, 53, -92, 31, 5, -167, 4, -39, -133, 81, 63, -88, 10, -66, -112, 91, 17, 30, 43, 6, 91, -9, -104, 32, -75, -42, 172, -84, -119, 91, -77, -128, 152, -63, 32, 11, -3, -61, 79, -79, 44, -123, -32, 38, -179, 67, -26, -102, -28, -10, -53, 98, 26, -65, 119, -68, 24, 61, -26, 17, -156, 37, 32, -65, -15, 50, -146, -52, -1, -42, -23, 141, -76, 43, 78, -54, -121, 70, 21, 45, 102, -26, 33, 0, 49, -93, -153, 155, 90, -114, 111, 5, -136, 22, 22, -165, 109, 12, -32, -23, 5, 65, 60, 39, 55, -93, 56, -3, 19, -28, 111, 84, -125, 46, -156, 26, 63, 10, 40, 60, 12, 24, -5, 92, 8, -29, 44, -107, -156]
3472a56L14k31PJ36j46QJ50m1j69J15n1R8k5N7J06k05J2J85k86J13j5K0M0q3N2
3497EJ5j08J93j04o1M8M9p0R4j6r9J98j20N2K0r4K9o0o8J41n1p9J11p3R6l4ml4
3525b4M8q5r2K33k21J92o6o0K72j63j37K20o3j28J22j57J08K3o5R9j50l2J95j42
3549g3J5J11j6p5Lj02J04J5l1J25k2p6Q4l9M9k5o9K3nj45J20Q7j88J65P0k16K31
3576A20l6m4n5K2j5J4J3N3l4j4M1j77JJ46j13j1Q2j06P9J21j50J6J00j22M6J03
3602H0n3n6m2Q2M4K3j08J93k94J02K8r1J86j05J4j1o9KJ30m2O9o5p4M5k5PJ4P1
3630E5l6n8N2jk5j04O0Q6P6j51KJ01p8n8O3J32r0P0j79k0R9J2l4O5J4k29K08J6
3658D8j61R5m7J80j27J5K08k04m1O2j19J24n6J28p8l4j1O3j15K09j77l8J14Ko3
$$ y = [-156, 158, -73, -66, 70, -76, -68, 82, 41, -128, -13, -64, 34, 9, 66, 172, -33, -21, 164, -122, -9, -24, -4, 36, -47, 5, 20, -88, 105, 1, -60, -12, 37, -33, 61, 45, -54, 144, 24, 76, 96, 2, 31, -29, -97, 44, -7, -86, 25, -48, 48, 14, 10, -24, 24, -61, -153, 80, -141, 51, -15, -75, 197, 34, -103, 117, 54, -74, 48, -109, -1, 22, -43, 56, -94, -126, 69, -73, -58, 53, 37, -38, -35, -137, -33, -18, -49, 76, 54, -22, 62, 23, 72, 47, -22, 1, -4, -149, -29, 58, -130, 35, 105, -111, 120, 84, 40, -15, 7, -8, 6, 19, 72, 38, 24, 65, -112, -111, 35, -78, -89, -7, -113, -34, 87, -63, -47, 53, -69, -23, 80, 27, -29, -71, 11, 55, 78, -30, 163, -131, -29, -1, -92, 94, -11, 3, -8, -77, -75, 55, 13, 82, 17, -57, -12, -37, -30, -16, 55, 19, -39, 13, 12, -13, -117, -57, 29, 105, -46, -44, 57, -21, -79, -16, 116, 26, 96, -83, -103, -4, 8, -26, 39, 53, -176, 32, 48, -113, -18, -65, 115, -12, 3, 211, 7, -34, 28, -91, 33, -23, 105, 27, -7, -18, 45, -70, 139, -38, -76, 38, 40, -23]
3683b3k4R4k66L17j35l1N7N5o8M2o4O4K1k6J34j39p1J16r0j1J32j69K4N6j1J78
3709A62j19j55P9N0r8J19L1j39J02o2p0J39j63J58j70P3J25l7pj2L3j26O6J42
3733A21j76R2l5O4j03K2O5No0k6L0n5J32p6j23J78q6J0J10j19kJ10j4pp5m4J90
3760A28j38j3l4J0N9p1O0Q4r3N2O4k00N0J85j78M6P8j02J02q5NJ00j12%K6k4m
3787eJ84k44J77r0j42J55m2K5O6j10j4L5j1L6J4j67J33J02j90J68j39jJ2R6l2
3812A6M3j68P0J36j94K8J11q8M0k8O7j3j0l7J7m2Q9q6K5K0K7n2O8n1n5J11j01
3839e7P3o3N9m3N9n6J22o1j14J85o6N6j20Q3Nj04L0P5J4J9m6j53M1O5p0J54k4
3866F3o1O6K5k7j5lPp4N2l7L1oJmL9m6j1r8K04j94J32%p5j0O3k8J26j08k9J54
$$ y = [-23, -47, 47, -219, 98, -37, -68, -11, 44, -24, 18, -46, 18, 39, 13, 147, 8, -63, 53, -37, -48, 84, -85, -61, -5, -16, 162, 43, -112, -33, 17, -81, 38, 69, -70, 32, -30, -100, 39, -124, 34, -136, -63, 62, 25, 18, 6, 39, -87, -21, 121, -55, 37, 2, 66, -37, -15, 50, 55, -5, -31, -1, -56, 76, 0, -123, 55, -31, -21, 89, -30, -32, 78, 64, 57, -18, -62, 128, -10, -23, -57, -47, 12, -59, 1, 85, -8, 44, 108, -92, -42, 143, -35, 11, 89, -13, 89, 4, 9, 109, -3, -3, 23, -1, -5, 179, -65, 112, 22, -120, 35, -7, 18, 84, -26, -40, -5, -16, 20, 34, -133, 0, 102, -88, 80, -59, -60, -48, 48, 16, 59, -109, -39, 97, -97, -69, 42, -46, -6, -34, 33, 20, 10, -27, -10, -52, 37, -49, -24, -4, 23, -29, 39, -12, -67, 44, -57, 16, -47, 12, -31, 28, -28, 94, 33, -81, 104, 38, 94, -26, 57, 62, -42, -12, 63, 77, 96, 50, -103, -62, 3, -67, 87, 63, 2, 68, 93, 66, 51, 48, 55, -19, 33, -4, 27, 21, 22, 18, 57, 11, 0, -98, 106, -88, 44, 44, -31, -41, 22, -6, 120, 12, -17, 137]
3896A37j35n9J63j10r0O5K4R5P4k42KJ62j92Q7J54j14k3P1r0R5n3K3q8j06Q5N
3922f0NJ08rp7J0j06O8Q2Q8l5l7j11O9lq0J00K5K0n0m1p5J52k7n1R0j53R4m9M1
3951a2O0m9Rj2J01j46R4l4O1q4%J12j75R1q6J03j79Q9L3R4o2p4J30k5Kl8Q6p2
3979A7M6k29J82K2o1K7n6J12j1N1j14l5J55k02J23j13kR4K2m0L8o8J7mR1p5pO7
4007D7J40j99Q7r6n9L3K1K7N0m6qO0j05K5kL6mO0o8O8m6p0k4k5R6O9k8m8m7jJ35
4038G8j13kL1l4N4o9qL9Q8o9n1K00j11o2N9P5j29N5q0p9Q7J64j94m7K91j37n1
4065a5L2k1J3K2n0J05r0N0m8jj05J08l2l1J02m2j6o4J15r6R8%n2L5oR2n5p9R1
4094F0M0j63J62j06OJ6q4M2r0n1J90j01P5MJ05j68P1L7j00MM1j4O9r1O4Nj7P5
$$ y = [137, 2, -57, 106, -4, -94, -29, -5, 90, 164, -78, -76, 86, -106, -19, 135, 21, -2, 69, -21, 74, 21, 44, -44, -150, -65, -60, -55, 53, 44, -33, -23, -129, -61, 21, 109, 74, 37, -74, -5, -8, -88, 12, 37, 57, 7, -34, -109, 43, 16, -35, 55, -98, -4, -53, -12, 48, -1, 8, -4, 97, -49, 45, 11, 72, -12, -12, 100, -75, 16, -70, 33, -146, -57, -24, 70, 8, -66, 64, 39, 41, 3, 89, 17, 63, -166, 16, 38, -23, 4, -52, 60, 49, 100, -14, -49, 106, -96, 27, -86, -88, 6, 28, -12, 26, -42, -25, -29, 62, -13, -20, 47, 187, -12, 75, -21, -80, -47, -26, 1, 51, 5, -3, 57, -48, -23, -25, 11, 7, 67, -1, 67, 21, -49, -73, -98, -2, 67, 39, -9, -56, -57, 78, -35, -37, -6, -40, 14, -55, -63, -24, 64, -5, -56, 144, 33, -29, 30, 105, -24, 31, -49, -128, -41, 123, -71, -118, 173, 36, -15, 17, -4, 9, 31, -19, 86, -4, 46, -2, -3, -108, 0, -32, -63, 39, -3, -19, -83, 32, -64, 34, 34, -18, 17, 11, 103, 48, -31, 60, 100, -63, 99, -7, -1, 15, -69, -27, -117, -168, 22, -79, -4, 0, 105, -63, 8, 45, -55, -51, -10, -24, 45, -46, 18, 23, 6, 81]
4122H1j45L5KL0k7M2p6Q6n2P5J36j71L3o5r3J38L7m3M4n3p3K4J00o6q3N1l7N3
4150a7n4kP2m5m4N9K3r1M9k7P7k0P9j18P5j2k1j33R2J53q0P6j19N6k1k2J45pj18
4179Ej08O5p8K07m5n8P5k5n5L2m8l4J20q6O6k19P1J22o1L1j8O9m5O7k3m0K1j2
4207dN6j97J03J29j00K8J3q9R0l8M1n1L9O7m6j26R5J1o9J61j25rj14J74Q5r6j17
4234h9N9L6n9K1R9j52J54n8m1Plk0J04j2n3p2R7j9K2o5J65k70J44k5K0j3M2m6
4262b7j7R4o8NJ00j23J17J28k30N4J09j67J3J03j62J41j53J63j11jO2l4N4q9m8
$$ y = [81, -64, -29, -27, 3, -24, 18, -58, 28, -24, 51, 187, 16, 49, -16, -109, 29, 66, 23, 67, 14, -59, -35, 65, -1, -84, -33, -70, -17, -71, -73, -1, -46, -90, -31, -8, -99, -50, -77, 0, -20, 59, -59, 16, 4, -17, -150, -58, 95, 15, 91, -28, 28, 7, -15, 130, 123, 5, -103, -38, -116, 91, 46, -12, 63, 38, -17, 15, -33, -67, 53, -33, 33, -186, -115, 7, -54, -23, -41, 28, -17, 50, 27, -13, 8, -4, 52, -145, -42, 87, -13, 15, 28, -61, 29, -9, 32, -19, 20, 87, 41, -85, 10, 21, -48, 113, -12, -21, -135, 39, 124, 28, -89, -30, 6, -53, -32, 67, -85, 69, 11, -30, -23, -26, -46, 58, 46, -7, -79, 18, -1, 21, -44, 121, -149, -5, -30, -10, -23, 19, -27, -44, 50, -18, -13, 87, -36, 81, 209, -21, 33, 142, -25, -12, 91, -71, 70, -83, 80, -31, -32, 30, -4, 50, -39, -87]
$$ [...]
8191F
##END NTUPLES=NMR FID
##END=
