##TITLE=1H_DE-80H_X3
 200.13MHz, d2o
 8 sc
 
 19ns.26.2.2025
##JCAMPDX= 6.0         $$ Bruker NMR JCAMP-DX V2.0
##DATA TYPE= NMR FID
##DATA CLASS= NTUPLES
##ORIGIN= UXNMR, Bruker Analytische Messtechnik GmbH
##OWNER= pz
$$ XWIN-NMR		Version 3.5
$$ Mon Jul  7 11:12:56 2025 Russian Standard Time (UT+4h)  Yarkov@DPX200
##.OBSERVE FREQUENCY= 200.1313
##.OBSERVE NUCLEUS= ^1H
##.DELAY= (6, 6)
##.ACQUISITION MODE= SIMULTANEOUS
##.ACQUISITION SCHEME= undefined
##.AVERAGES= 8
##.DIGITISER RES= 18
##SPECTROMETER/DATA SYSTEM= spect
##.PULSE SEQUENCE= zg30
##.SOLVENT NAME= CDCl3
##.SHIFT REFERENCE= (INTERNAL, CDCl3, 0, 14.3821)
##AUDIT TRAIL= $$ (NUMBER, WHEN, WHO, WHERE, WHAT)
$$ ##TITLE= Audit trail, XWIN-NMR		Version 3.5
$$ ##JCAMPDX= 5.01
$$ ##ORIGIN= Bruker BioSpin GmbH
$$ ##OWNER= Yarkov
$$ C:/Bruker/XWIN-NMR/data/yarkov2/nmr/H-C/1/audita.txt
$$ ##AUDIT TRAIL=  $$ (NUMBER, WHEN, WHO, WHERE, WHAT)
(   1,<2025-07-07 11:12:16.34 +0400>,<Yarkov>,<DPX200>,
      <created by zg, POWCHK disabled, PULCHK disabled
       configuration hash MD5:
       00 E9 B6 7A A2 85 ED C7 34 08 36 98 17 FE 4E 26
       data hash MD5: 16K
       61 A5 9B F0 3C BD 82 DB 56 DB 83 1D B1 D0 F6 95>)
$$ ##END=
$$ 
$$ hash MD5
$$ 5B 57 1B DB C3 63 E5 3C 41 19 59 01 C5 34 04 25
##$RELAX= 
##$RELAX= 
##$RELAX= 
##$RELAX= 
##$RELAX= 
##$RELAX= 
$$ Bruker specific parameters
$$ --------------------------
##$DU= <C:/Bruker/XWIN-NMR>
##$EXPNO= 1
##$NAME= <H-C>
##$PROCNO= 1
##$TYPE= <nmr>
##$USER= <yarkov2>
##$AMP= (0..31)
100 100 100 100 100 100 100 100 100 100 100 100 100 100 100 100 100 100 
100 100 100 100 100 100 100 100 100 100 100 100 100 100 
##$AQSEQ= 0
##$AQ_mod= 1
##$AUNM= <au_zg>
##$AUTOPOS= <>
##$BF1= 200.13
##$BF2= 200.13
##$BF3= 200.13
##$BF4= 200.13
##$BF5= 200.13
##$BF6= 200.13
##$BF7= 200.13
##$BF8= 200.13
##$BYTORDA= 1
##$CFDGTYP= 0
##$CFRGTYP= 5
##$CHEMSTR= <none>
##$CNST= (0..31)
1 1 145 1 1 1 1 1 1 1 1 1 1 1 1 1 1 1 1 1 1 1 1 1 1 1 1 1 1 1 1 1 
##$CPDPRG= <>
##$CPDPRG1= <>
##$CPDPRG2= <>
##$CPDPRG3= <>
##$CPDPRG4= <mlev>
##$CPDPRG5= <mlev>
##$CPDPRG6= <mlev>
##$CPDPRG7= <mlev>
##$CPDPRG8= <mlev>
##$CPDPRGB= <>
##$CPDPRGT= <>
##$D= (0..31)
0 0.7 0 0 0 0 0 0 0 0 0 0.03 0 0 0 0 0 0 0 0 0 0 0 0 0 0 0 0 0 0 0 0 
##$DATE= 1751872335
##$DBL= (0..7)
120 120 120 120 120 120 120 120 
##$DBP= (0..7)
150 150 150 150 150 150 150 150 
##$DBP07= 0
##$DBPNAM0= <>
##$DBPNAM1= <>
##$DBPNAM2= <>
##$DBPNAM3= <>
##$DBPNAM4= <>
##$DBPNAM5= <>
##$DBPNAM6= <>
##$DBPNAM7= <>
##$DBPOAL= (0..7)
0.5 0.5 0.5 0.5 0.5 0.5 0.5 0.5 
##$DBPOFFS= (0..7)
0 0 0 0 0 0 0 0 
##$DE= 6
##$DECBNUC= <off>
##$DECIM= 32
##$DECNUC= <off>
##$DECSTAT= 4
##$DIGMOD= 1
##$DIGTYP= 9
##$DL= (0..7)
0 120 120 120 120 120 120 120 
##$DP= (0..7)
150 150 150 150 150 150 150 150 
##$DP07= 0
##$DPNAME0= <>
##$DPNAME1= <>
##$DPNAME2= <>
##$DPNAME3= <>
##$DPNAME4= <>
##$DPNAME5= <>
##$DPNAME6= <>
##$DPNAME7= <>
##$DPOAL= (0..7)
0.5 0.5 0.5 0.5 0.5 0.5 0.5 0.5 
##$DPOFFS= (0..7)
0 0 0 0 0 0 0 0 
##$DQDMODE= 0
##$DR= 18
##$DS= 0
$$ [...]
##$SUBNAM2= <"">
##$SUBNAM3= <"">
##$SUBNAM4= <"">
##$SUBNAM5= <"">
##$SUBNAM6= <"">
##$SUBNAM7= <"">
##$SUBNAM8= <"">
##$SUBNAM9= <"">
##$SW= 18.0517328524113
##$SWIBOX= (0..15)
0 0 2 0 0 0 0 0 0 0 0 0 0 0 0 0 
##$SW_h= 3612.71676300578
##$TD= 16384
##$TD0= 1
##$TE= 0
##$TE2= 300
##$TE3= 300
##$TEG= 300
##$TL= (0..7)
0 120 120 120 120 120 120 120 
##$TP= (0..7)
150 150 150 150 150 150 150 150 
##$TP07= 0
##$TPNAME0= <>
##$TPNAME1= <>
##$TPNAME2= <>
##$TPNAME3= <>
##$TPNAME4= <>
##$TPNAME5= <>
##$TPNAME6= <>
##$TPNAME7= <>
##$TPOAL= (0..7)
0.5 0.5 0.5 0.5 0.5 0.5 0.5 0.5 
##$TPOFFS= (0..7)
0 0 0 0 0 0 0 0 
##$TUNHIN= 0
##$TUNHOUT= 0
##$TUNXOUT= 0
##$USERA1= <user>
##$USERA2= <user>
##$USERA3= <user>
##$USERA4= <user>
##$USERA5= <user>
##$V9= 5
##$VALIST= <valist>
##$VCLIST= <CCCCCCCCCCCCCCC>
##$VD= 0
##$VDLIST= <DDDDDDDDDDDDDDD>
##$VPLIST= <PPPPPPPPPPPPPPP>
##$VTLIST= <TTTTTTTTTTTTTTT>
##$WBST= 1024
##$WBSW= 4
##$XGAIN= (0..3)
0 0 0 0 
##$XL= 0
##$YL= 0
##$YMAX_a= 148227
##$YMIN_a= -115890
##$ZGOPTNS= <>
##$ZL1= 120
##$ZL2= 120
##$ZL3= 120
##$ZL4= 120
##$ABSF1= 10
##$ABSF2= 0
##$ABSG= 5
##$ABSL= 3
##$ALPHA= 0
##$AQORDER= 0
##$ASSFAC= 0
##$ASSFACI= 0
##$ASSFACX= 0
##$ASSWID= 0
##$AUNMP= <proc_1d>
##$AZFE= 0.1
##$AZFW= 0.1
##$BCFW= 1
##$BC_mod= 2
##$BYTORDP= 1
##$COROFFS= 0
##$CY= 83.5205535888672
##$DATMOD= 1
##$DC= 2
##$DFILT= <>
##$DTYPP= 0
##$F1P= 10.8118882576601
##$F2P= -7.23987719738617
##$FCOR= 0.5
##$FTSIZE= 0
##$FT_mod= 4
##$GAMMA= 1
##$GB= 0.15
##$INTBC= 1
##$INTSCL= 1
##$ISEN= 128
##$LB= 0.25
##$LEV0= 0
##$LPBIN= 0
##$MAXI= 10000
##$MC2= 0
##$MEAN= 0
##$ME_mod= 0
##$MI= 1.114404
##$NCOEF= 0
##$NC_proc= 0
##$NLEV= 6
##$NOISF1= 3.799351
##$NOISF2= 2.8
##$NSP= 1
##$NTH_PI= 0
##$NZP= 0
##$OFFSET= 14.38212
##$PC= 1
##$PHC0= -1355.951
##$PHC1= 7.64948
##$PH_mod= 1
##$PKNL= yes
##$PPARMOD= 0
##$PSCAL= 0
##$PSIGN= 0
##$REVERSE= no
##$SF= 200.129724274929
##$SI= 16384
##$SIGF1= 3
##$SIGF2= 2
##$SINO= 400
##$SIOLD= 16384
##$SREGLST= <1H.CDCl3>
##$SSB= 0
##$STSI= 0
##$STSR= 0
##$SW_p= 3205.1282051282
##$SYMM= 0
##$S_DEV= 0
##$TDeff= 0
##$TDoff= 0
##$TI= <>
##$TILT= no
##$TM1= 0
##$TM2= 0
##$TOPLEV= 0
##$USERP1= <user>
##$USERP2= <user>
##$USERP3= <user>
##$USERP4= <user>
##$USERP5= <user>
##$WDW= 1
##$XDIM= 8192
##$YMAX_p= 0
##$YMIN_p= 0
$$ End of Bruker specific parameters
$$ ---------------------------------
##NTUPLES= NMR FID
##VAR_NAME=  TIME,          FID/REAL,        FID/IMAG
##SYMBOL=    X,             R,               I
##VAR_TYPE=  INDEPENDENT,   DEPENDENT,       DEPENDENT
##VAR_FORM=  AFFN,          ASDF,            ASDF
##VAR_DIM=   8192,          8192,            8192
##UNITS=     SECONDS,       ARBITRARY UNITS, ARBITRARY UNITS
##FACTOR=    0.0002768,     1,               1
##FIRST=     0,             0,               0
##LAST=      2.2672688,     0,               0
##MIN=       0,             -115890,         0
##MAX=       2.2672688,     148227,          0
$$ Real data points
##PAGE= N=1
##DATA TABLE= (X++(R..R)), XYDATA
$$ [...]
$$ plain form
840 858 79 494 105 -415 97 -312 -523 10 -675 -396 58 -497 118 371 -12 589 370 180 682 106
860 106 43 202 -612 -477 -515 -1084 -478 -385 -704 112 55 164 871 670 689 1003 402 522 535 -166 210 30
882 30 -604 -237 -752 -935 -397 -675 -289 50 -178 275 458 118 568 283 154 480 -49 -134 126 -330 -161
903 -161 136 -476 -92 -66 -471 64 -76 27 449 114 148 489 -59 235 268 -154 150 -52 -386 61 -256
924 -256 -280 63 -328 -223 -42 -245 120 322 15 517 462 218 668 259 165 469 -231 -90 -26 -499 -230 -243
946 -243 -580 -118 -234 -417 33 -212 -45 503 227 349 419 16 499 182 -180 198 -265 -440 -25 -366 -164
967 -164 117 -256 10 108 -139 196 138 -29 303 46 -31 214 -244 -12 60 -117 -119 -68 -453 -85 -122 -251 195
990 195 -98 -42 205 -87 158 253 -82 406 236 -158 336 -57 -65 194 -202 -129 48 -406 -174 -44 -236 67
$$ packed form
840H58p79M15l89n20N12m09k11N33o85K79M54n55O15K53l83O01k19j90N02n76
860A06o3J59q14J35l8n69O06R3l19Q16n7J09P07k01J9L14o01J20J3p01L76j80
882C0o34L67n15j83N38k78L86L39k28M53J83l40M50k85j29L26n29q5K60m56J69
903a61K97o12L84K6m05N35j40J03M22l35L4L41n48K94L3m22L04k02l34M47l17
924b56k4L43l91J05J81k03L65K02l07N02n5k44M50m09r4L04p00J41O4m73K69j3
946b43l37M62j16j83M50k45J67N48k76J22P0m03M83l17l62L78m63j75M15l41K02
967a64K81l73K66R8k47L35n8j67L32k57p7K45m58K32P2j77kN1l85L68l7j29M46
990A95k93N6K47k92K45R5l35M88j70l94M94l93qK59l96P3J77m54K32J30j92L03
$$ plain form
1012 67 -20 -218 213 2 137 372 112 313 356 -91 177 -35 -273 104 -212 -265 -189 -431 -342 -21 -266 -3
1034 -3 301 54 334 282 96 285 180 25 180 -231 -200 -74 -427 -162 -120 -317 -18 -163 -58 226 114 164
1056 164 352 12 90 235 49 7 -40 -92 -83 -174 -263 -57 -235 -158 56 -161 17 148 61 242 -44 -66 201 52
1080 52 -43 132 -72 -109 43 -222 -73 -6 -258 80 -46 -124 60 9 39 131 37 126 112 -77 254 -10 -15 151
1104 151 -59 -99 -14 -137 -170 -30 -158 43 41 -55 199 69 -67 128 77 52 41 -9 10 61 -102 -14 -53 -131 7
1129 7 -128 -140 187 51 86 257 -8 29 128 -119 55 45 -145 68 23 -108 -135 -108 -83 124 -80 40 94 -206
1153 -206 137 6 -79 84 179 68 115 -59 67 61 -7 4 115 -47 146 -3 -40 13 -54 -98 51 -147 -145 -70 -80
1178 -80 16 5 -54 117 60 57 186 81 -147 186 -114 -136 20 -112 -80 116 -68 60 73 -64 57 -8 -27 -6
$$ packed form
1012F7q7j98M31k11J35K35k60K01M3m47K68k12k38L77l16n3P6k42Q9L21k45K63
1034cL04k47K80n2j86J89j05j55J55m11L1J26l53K65M2j97K99j45J05K84j12N0
1056A64J88l40P8J45j86m2m7n2Rr1q9K06j78P7K14k17J78J31q7J81k86k2K67j49
1080E2r5J75k04l7J52k65J49O7k52L38j26p8J84n1L0R2r4Q9j4j89L31k64nJ66
1104A51k10m0Q5j23l3J40j28K01kr6K54j30j36J95n1k5j1n0J9N1j63Q8l9p8J38
1129Gj35j2L27j36L5J71k65L7R9k47J74j0j90K13m5j31k7K7K5K07k04J20N4l00
1153b06L43j31q5J63R5j11M7j74J26oo8J1J11j62J93j49l7N3o7m4J49j98KP5j0
1178h0R6j1n9J71n7lJ29j05k28L33l00k2J56j32L2J96j84J28J3j37J21o5j9K1
$$ plain form
1202 -6 -134 87 101 -75 137 -95 28 29 -175 -183 16 -132 -36 129 -100 220 13 31 119 55 -26 141 -82 1
1226 1 89 -79 120 75 -36 44 21 -169 -45 -100 -54 58 -63 -29 135 -131 -125 136 -133 158 32 19 132 78
1250 78 57 45 -101 21 -44 -57 -64 60 -33 13 28 33 136 -1 27 102 -65 -60 169 -37 -9 -42 -62 142 -40 -123 -22
1277 -22 10 17 54 -7 -18 141 -78 65 66 18 164 0 -35 128 -43 -133 76 -107 -120 -131 -66 -154 -82 -41 49 27 46
1304 46 145 13 99 132 92 23 -29 -99 71 45 96 -13 -109 -25 31 0 -86 127 -11 142 -8 -139 122 -32 -6
1329 -6 21 -229 47 -7 -21 27 14 -118 -10 51 29 89 -10 32 72 21 114 123 -90 -17 -9 -90 64 -120 -122 -45 -115 -67 11
1358 11 -96 -66 -25 1 182 -127 4 180 70 61 4 15 84 -4 -87 -4 -12 -220 -106 -12 5 110 -16 146 27
1383 27 99 70 84 -30 35 72 -131 -52 -104 30 -15 -83 20 -30 -174 84 109 35 51 49 -21 121 49 95 53 -4 20
$$ packed form
1202fj28K21J4j76K12k32J23Jk04qJ99j48R6J65k29L20k07J8Q8o4q1J67k23Q3
1226AQ8j68J99m5j11Q0k3j90J24n5M6J12j21L4J64k66OK61k69K91j26j3J13n4
1250G8k1j2j46J22o5j3pJ24r3M6J5NJ03j37K8P5j67NK29k06K8l3k0K04j82q3J01
1277b2L2PL7o1j1J59k19J43Jm8J46j64l5J63j71r0K09j83j3j1O5q8P2M1R0k2J9
1304D6R9j32Q6L3m0o9n2p0J70k6N1j09r6Q4N6l1q6K13j38J53j50j31K61j54K6
1329fK7k50K76n4j4M8j3j32J08O1k2O0r9M2M0n1R3Rk13P3Qq1J54j84kP7p0M8P8
1358A1j07L0M1K6J81l09J31J76j10rn7J1O9q8q3Q3qk08J14R4J7J05j26J62j19
1383B7P2k9J4j14O5L7k03P9n2J34m5o8J03n0j44K58K5p4J6kp0J42p2M6m2n7K4
$$ plain form
1410 20 -22 -73 28 -97 35 19 -87 -73 26 16 -11 87 87 137 87 9 -3 20 18 19 -31 10 113 -98 -66 47 -44 -98
1438 -98 26 -49 77 -18 26 52 32 64 86 71 44 42 -8 -42 -97 -60 -11 41 -82 67 -55 21 -66 -61 76 62 -22 36
1466 36 -108 -10 -36 53 -29 50 -75 15 27 -41 29 -26 31 99 -61 -60 24 -3 15 -28 132 -112 -21 -140 -26 24 2
1493 2 38 -16 -95 25 -142 44 61 53 -3 -5 104 24 -54 -26 28 86 -51 -8 -43 23 70 -139 -10 21 35 -29 -22 1 81
1522 81 -22 -74 54 -108 21 41 -110 55 6 -54 11 107 -40 53 -7 -27 59 -41 51 -74 -33 17 -11 80 24 -23
1548 -23 29 113 -60 64 -8 46 -72 -5 24 53 2 -74 21 13 -40 -6 -82 -54 20 -8 26 -51 -57 14 -42 -107 109 25 41
1577 41 -81 -73 -74 38 -79 59 38 -77 -24 -134 23 -2 39 -14 -78 30 30 28 63 -35 37 -8 -60 -12 83 -15 -44 -26
1605 -26 32 32 -6 60 -5 13 3 44 -3 6 48 -84 -107 5 -12 72 -115 -4 -1 24 -13 -58 -63 50 -49 -5 -69 -54 102
$$ packed form
1410B0m2n1J01j25J32j6j06J4R9j0k7R8%N0n0p8j2K3kJn0M1J03k11L2J13r1n4
1438i8J24p5J26r5M4K6k0L2K2j5k7kn0l4n5L7M9N2j23J49j22P6q7NJ37j4q4N8
1466C6j44R8k6Q9q2P9j25R0J2o8P0n5N7O8j60JQ4k7J8m3J60k44R1j19J14N0k2
1493BL6n4p9J20j67J86J7qn6kJ09q0p8K8N4N8j37M3l5O6M7k09J29L1J4o4PK3Q0
1522H1j03n2J28j62J29K0j51J65m9o0O5R6j47R3o0k0Q6j00R2j25M1N0k8R1n6m7
1548b3N2Q4j73J24p2N4j18O7K9K9n1p6R5qn3L4p6K8P4k8L4p7oP1n6o5K16q4J6
1577D1j22QjJ12j17J38k1j15N3j10J57k5M1n3o4J08%kL5r8P2m5n2M8R5r8k9J8
1605b6N8%l8O6o5J8j0M1m7RM2j32k3J12j7Q4j87J11LK5l7m5nJ13r9M4o4J5J56
$$ plain form
1634 102 -56 69 20 29 45 -21 -11 -44 -106 10 46 -20 -48 -42 -58 -125 -54 37 128 -18 36 -50 -82 -114 -59 46 -132 61
1662 61 -190 -7 15 0 105 -44 18 14 -72 -42 59 28 -34 -125 86 -63 -58 19 -76 19 53 -29 33 17 33 92 41 4
1690 4 -32 -66 -46 44 1 -2 32 -60 -41 33 -29 -1 27 -53 41 -54 -64 -23 -23 -9 168 -56 37 45 27 -15 -50 -87 -91 -5 28 -2
1722 -2 -67 91 126 7 36 -81 -38 3 -95 -14 -15 47 -49 56 119 41 20 -4 -10 78 -50 -56 16 12 30 27 -57 139 42 -28
1752 -28 18 41 -19 18 -55 -25 -63 14 107 35 32 -58 -65 41 -36 133 -164 24 29 29 58 -31 -100 -83 21 53 -8 73 -123
1781 -123 105 -12 -83 -25 6 -6 -42 18 -21 27 12 35 -43 39 -13 48 7 -19 1 127 -45 68 -6 -42 -31 34 48
1808 48 27 39 32 -36 -31 -44 -82 -110 118 35 -68 41 68 22 92 28 -13 6 31 -142 -28 -103 -8 -37 136 -17 -36 -77
1836 -77 24 -12 101 27 -37 66 41 156 44 115 18 -51 16 -32 18 5 68 -54 -6 45 74 16 -39 -121 26 -16 -75
$$ packed form
1634A02j58J25m9RJ6o6J0l3o2J16L6o6k8Oj6o7P1R1R1j46N4q6l2l2N5J05j78J93
1662F1k51J83K2j5J05j49O2mq6L0J01l1o2r1K11j49NP7r5R5L4q2O2j6J6N9n1l7
1690Dl6l4K0R0m3lL4r2J9P4o2K8K8q0R4r5j0M1%J4J77k24R3Qj8m2l5l7mQ6L3l0
1722bo5J58L5j19K9j17M3M1r8Q1jO2r6J05O3p8k1k4oQ8j28oP2mJ8lq4J96r7p0
1752b8M6K3o0L7p3L0l8P7R3p2lr0pJ06p7J69k97J88N%K9q9o9J7J04L2o1Q1j96
1781a23K28j17p1N8L1j2l6O0l9M8j5K3p8Q2n2O1m1k6K0J26j72J13p4l6J1O5J4
1808D8k1J2po8Nj3l8k8K28q3j03J09K7m6P0o4m1J9K5j73J14p5R5k9J73j53j9m1
1836g7J01l6J13p4o4J03k5J15j12P1r7o9O7m8N0j3O3j22M8N1K9n8n5q2J47m2n9
$$ plain form
1863 -75 -30 6 92 -106 82 8 -41 -7 -34 23 73 -45 26 -51 -87 7 4 45 -67 10 -67 28 43 4 -33 -41 129 -1
1891 -1 76 32 -2 -17 -22 -26 58 -44 -25 -3 -210 74 -9 81 -58 -74 6 -103 99 6 43 -174 14 -62 9 -25 -130
1918 -130 25 -57 28 28 70 61 14 -17 45 27 22 -16 102 -61 106 -91 -13 24 -32 -54 65 -38 -82 -27 -14 117 -128
1945 -128 -11 57 9 16 89 -65 27 37 12 24 4 -57 -41 12 -53 -26 -15 -33 -74 26 -9 13 -151 0 54 53 68 86
1973 86 -50 5 13 21 42 -61 51 13 -3 -22 -62 -11 -6 -41 32 36 -20 52 -56 91 -16 -88 -37 -17 -42 77 -6 23 9
2002 9 14 -94 75 66 126 74 -20 83 -35 -33 18 13 59 -45 41 67 31 21 -7 4 -21 -32 -37 63 16 30 5 -29 -58 4
2032 4 11 -17 -2 -77 17 15 -5 -6 -66 15 -19 -115 31 21 48 -47 -37 -124 -43 -38 99 20 -53 -12 -51 72 -50 -8 -6 50 -79
2063 -79 68 -80 -97 31 20 66 -23 -3 42 4 -24 -73 18 8 -100 21 -71 -147 16 40 -50 75 81 3 27 -29 -26 -95
$$ packed form
1863g5M5L6Q6j98J88p4m9L4k7N7N0j18P1p7l6R4lM1j12P7p7R5J5l9l7qJ70j30
1891aP7m4l4j5nmQ4j02J9K2k07K84q3R0j39j6Q0j09K02r3L7k17J88p6P1l4j05
1918a30J55q2Q5%M2rm7l1O2j8nl8J18j63J67j97P8L7n6k2J19j03m4N5J3J31k45
1945a28J17O8m8PP3j54R2J0k5J2k0o1J6N3o5K7J1j8m1J00l5K2j64J51N4jJ5J8
1973H6j36N5QQK1j03J12l8j6j9m0N1Nl5P3Mn6P2j08J47j07p2N1K0k5J19q3K9j4
2002INj08J69rO0n2r4J03j18KN1nM6j04Q6K6l6j0k8J1k5j1nJ00m7J4k5l4k9O2
2032DPk8J5p5R4kk0jo0Q1l4r6J46j0K7r5J0q7Q1NJ37p9p3M1l9J23j22M2KN6j29
2063g9J47j48j7J28j1M6q9K0M5l8k8m9R1j0j08J21r2p6J63K4r0J25Op8K4n6Lo9
$$ plain form
2091 -95 77 119 -127 -88 62 -46 22 19 -80 7 -33 -35 24 23 40 -39 -24 -66 -78 26 -37 115 0 -8 20 -145 110 -38
2119 -38 104 -48 36 -25 -53 -14 -54 17 3 -22 -25 -38 38 -6 -84 -54 -37 -122 -75 14 -47 -76 -199 24 -85 -8 -35 23
2147 23 -8 -116 79 81 37 89 -73 -21 42 -62 -56 -63 -82 -26 -6 -4 -87 4 59 50 -82 -4 -12 -94 93 -25 55 74 40 -49
2177 -49 126 14 55 9 -33 31 40 -83 76 -4 -95 83 81 -68 74 -155 20 29 8 29 -24 -47 -47 -12 -56 16 69 20
2205 20 108 16 18 105 94 90 62 -45 -31 -86 -60 22 -131 -9 -6 -94 -10 -46 15 -122 12 9 -31 -72 19 64 16 121 94
2234 94 -10 -70 -30 4 -21 66 49 -47 18 35 16 9 19 19 40 -34 -22 115 37 32 11 81 4 77 -85 -9 29 117 -62 33
2264 33 129 -40 -52 17 62 -30 -50 -14 16 -52 55 -52 -37 66 60 -6 16 114 142 11 22 -151 -66 45 20 38 6
2291 6 -29 59 27 -40 82 -49 -34 31 -54 -132 157 55 21 22 50 -44 32 10 -8 5 -33 74 104 54 10 -82 44 149
$$ packed form
2091i5J72M2k46L9J50j08O8lr9Q7m0kN9jJ7p9J5m2j2J04o3J52j15qK8j65K55j48
2119c8J42j52Q4o1k8L9m0P1j4k5lj3P6m4p8L0J7q5M7Q9o1k9j23K23j09P7k7N8
2147B3l1j08J95Km4N2j62N2O3j04Opj9N6K0Kq3R1N5rj32P8qq2J87j18Q0J9l4q9
2177d9J75j12M1m6m2O4Rj23J59q0r1J78kj49J42k29J75Rk1K1n3k3%L5m4P2N3m9
2205B0Q8r2KQ7j1mk8j07J4n5K6Q2j53J22Lq8Q4l6O1j37J34lm0m1R1M5m8J05k7
2234I4j04o0M0L4k5Q7j7r6O5J7j9pJ0%K1p4J2J37p8nk1P0p7P3j62P6L8Q8j79R5
2264C3R6j69j2O9M5r2k0L6L0o8J07j07J5J03oo6K2R8K8j31J1j73Q5J11k5J8l2
2291Fl5Q8l2o7J22j31J5O5q5p8K89j02l4JK8r4P6k2j8J3l8J07L0n0m4r2J26J05
$$ plain form
2319 149 139 -13 113 78 -55 56 -1 105 -8 46 -80 1 32 49 39 22 -54 55 23 -11 -37 -84 20 -49 -50 -5
2345 -5 -151 22 -60 -17 68 -88 -42 -41 10 6 -1 51 -32 -1 16 6 77 -106 72 -52 -23 110 4 77 41 11 30 -46
2373 -46 -32 61 74 -8 -14 -21 -25 -16 -69 -41 -44 6 -9 -6 19 56 -7 -45 -4 -12 -13 40 12 -62 74 11 13 -61 -23 -41 -44 -59 60 -26
2407 -26 -63 108 -20 13 8 70 32 24 -14 84 97 -16 -148 30 23 -76 0 -7 29 -39 -6 -9 83 -86 -103 -18 -5 -20 18 -94
2437 -94 -14 -39 -10 -64 53 -62 -68 21 -79 52 -71 -32 -35 -23 -52 15 -3 -6 60 53 11 2 45 7 68 160 47 -21 -66 66
2467 66 8 91 52 -15 -1 -12 3 -52 109 19 121 4 -54 53 -46 -18 -23 -9 4 38 102 -40 -47 88 -46 -22 20 39
2495 39 29 -3 -11 -28 -45 -54 -76 12 -16 -94 9 61 -12 -51 -73 0 -86 -72 48 -52 -61 15 -33 46 2 6 -9 57 -54 -44
2525 -44 14 44 30 32 25 -7 -17 34 151 -91 -37 66 -22 -9 -22 16 -65 4 63 -72 30 -21 98 14 3 -55 93 87
$$ packed form
2319A49j0j52J26l5j33J11n7J06j13N4j26Q1L1J7j0j7p6J09l2l4k6m7J04o9jM5
2345ej46J73q2M3Q5j56M6JN1mpN2q3L1J7j0P1j83J78j24K9J33j06P3l6l0J9p6
2373d6J4R3J3q2opmRn3K8lN0j5LK5L7o3l8M1qjN3k8p4J36o3Kp4L8j8lj5J19q6
2407b6l7J71j28L3nO2l8ql8R8J3j13j32J78pr9P6pL6o8L3lR2j69j7Q5J3j5L8j12
2437i4Q0k5K9n4J17j15oQ9j00J31j23L9lJ2k9O7j8lO6pm2rM3l8O1R2j13o8m5J32
2467F6n8Q3l9o7J4j1J5n5J61r0J02j17n8J07r9K8nJ4J3L4O4j42pJ35j34K4M2J9
2495C9j0l2qj7j7rk2Q8k8p8J03N2p3l9k2P3q6J4J20j00rP6m8P9m4Mj5O6j11J0
2525d4N8L0j4Kpl2j0N1J17k42N4J03q8J3j3L8q1O9N9j35J02n1J19q4j1n8J48o
$$ plain form
2553 87 -68 -59 63 8 -81 103 91 22 -10 -41 46 74 17 -71 -12 -46 -23 91 -32 60 -32 -65 -75 47 -101 46 -19
2580 -19 -48 -65 19 74 -52 80 60 19 -53 -13 -5 27 -97 2 -28 -76 -2 -20 7 -80 76 -13 70 4 -22 65 32 -143
2608 -143 -45 95 74 104 66 -135 18 -83 -6 -25 33 91 75 68 -75 6 -145 39 5 -96 61 84 -54 24 -62
2633 -62 78 31 9 -34 26 -47 16 27 -57 -6 5 11 115 -44 -144 -65 55 71 -88 -89 4 -54 72 -23 -35 -2 -52 39
2661 39 -87 83 -28 -21 4 2 57 -83 -15 10 38 -73 -11 34 -59 -32 51 3 3 83 -14 56 61 65 35 118 91 -29 188
2690 188 40 18 37 -18 78 -94 43 -43 47 -76 49 4 0 34 34 -41 -28 7 -84 32 42 32 -55 -114 10 -34 -75
2717 -75 67 -108 5 -45 3 36 65 21 28 44 24 -72 -14 28 -72 -32 -38 64 20 -12 -62 -90 69 83 -17 41 -14 -43
2745 -43 -59 5 46 14 -50 19 50 48 15 -36 23 82 -8 -2 -14 55 -91 43 81 52 -28 -21 96 20 -40 -2 -8 -11 -4 108 19
$$ packed form
2553H7j55RJ22n5q9J84j2o9l2l1Q7K8n7q8N9l4K3J14j23R2r2l3j0J22j48J47o5
2580a9k9j7Q4N5j26J32k0m1p2M0QL2j24R9l0m8P4j8K7q7J56q9Q3o6k6Q7l3j75
2608a43R8J40k1L0l8k01J53j01P7j9N8N8j6pj43Q1j51J84l4j01J57K3j38P8q6
2633f2J40m7k2m3O0p3O3J1q4N1J1OJ04j59j00P9J20J6j59jR3n8J26r5j2L3n0R1
2661C9j26J70j11PK5kN5j40O8K5K8j11O2M5r3K7Q3m8%Q0r7P0NMl0Q3k7j20K17
2690A88j48k2J9n5R6j72J37q6R0j23J25m5mL4%p5J3L5r1J16J0j0q7n9J24m4m1
2717g5J42j75J13n0M8L3K9m4PJ6k0r6N8M2j00M0oJ02m4l2n0k8J59J4j00N8n5k9
2745d3j6O4M1l2o4O9L1kl3n1N9N9r0Oj2O9j46J34L8k9q0PJ17p6o0L8olPJ12q9
$$ plain form
2776 19 -66 30 23 90 -16 -12 7 -34 -115 85 98 -73 152 -69 1 9 -6 52 -30 -6 79 -23 -11 -23 16 6 -25 -23 -17 -49
2806 -49 92 -31 -46 81 18 -35 66 34 -36 78 53 -62 37 100 14 97 89 -46 -39 6 92 40 49 -155 36 -60 -83
2833 -83 24 -53 5 22 -22 36 62 7 -76 8 -34 -43 28 -99 -2 5 20 -12 -53 -18 -20 113 64 82 -15 -47 -27 39 -62 16
2863 16 55 -102 39 10 -34 -96 64 107 -39 70 12 59 188 -45 35 -59 -46 -41 -51 35 -15 8 9 8 -12 -21 57 112 -92
2892 -92 43 -68 12 9 15 -78 73 -4 -6 1 7 -45 -91 42 -21 -42 20 99 -43 21 -39 -60 20 -33 -30 48 62 -1 -70 9 -71
2923 -71 -77 25 -32 -53 32 47 -105 25 5 -73 -97 56 65 -38 117 -36 52 90 -113 -110 -42 23 84 -55 92 -48
2949 -48 8 -36 7 16 -71 -18 47 -13 73 7 -34 -11 -59 -24 12 51 37 37 -58 -8 -38 1 13 72 12 20 -4 -26 -53 30 50 59
2981 59 -83 15 15 9 -24 11 -89 -145 -54 -33 -8 -15 28 -42 30 -106 -111 -31 -67 12 -28 -70 -44 92 -95 40 59 65 43 61
$$ packed form
2776A9q5R6pO7j06MJ9m1q1K00J3j71K25k21P0Qj5N8q2K4Q5j02J2j2L9j0l1KOl2
2806d9J41j23j5J27o3n3J01l2p0J14k5j15R9O3q6Q3qj35PM5Q6n2Rk04J91r6k3
2833h3J07p7N8J7m4N8K6n5q3Q4m2rP1j27R7PJ5l2m1L5kJ33m9J8r7l2K0O6j01P8
2863A6L9j57J41k9m4o2J60M3j46J09n8M7J29k33Q0r4J3Nj0Q6n0K3Jjk0rP8N5k04
2892i2J35j11Q0lOr3J51p7kPOn2m6J33o3k1O2P9j42O4o0k1Q0n3LP8J4o3o9P9q0
2923g1oJ02n7k1Q5J5j52J30k0p8k4J53Rj03J55j53Q8L8k03LO8O5O1j39J47j40
2949d8N6m4M3Rq7N3O5o0Q6o6m1K3m8L5L6L9j4%r5N0l0L9J2N9o0Qk4k2k7Q3K0R
2981E9j42R8%ol3L5j00n6R1K1K5pM3p0P2j36nQ0l6P9m0m2K6J36j87J35J9Ok2J8
$$ plain form
3011 61 -27 -108 -86 48 39 -40 4 -57 70 85 -49 -2 16 86 41 84 45 -4 54 138 -81 11 3 4 26 -8 28 32 40 23 5
3042 5 132 4 5 125 16 -23 25 26 -65 0 -22 126 47 -60 -92 -49 -7 8 -98 -16 32 142 -55 19 56 -25 -70
3069 -70 -53 -59 80 42 -31 32 27 -22 -30 -56 50 59 88 108 -108 -66 -8 -44 -14 -51 101 -1 -66 -124 106 28 -102 201
3097 201 26 -132 -46 58 46 -5 -78 185 61 -81 28 -65 108 4 -40 22 23 41 106 68 23 35 32 24 11 -10 -6
3124 -6 96 -17 0 -89 60 -7 30 -6 -28 14 34 50 -63 -2 60 -28 59 -33 -59 -23 56 179 35 72 -52 -53 53
3151 53 -33 -9 59 -76 77 -4 -29 -119 6 179 69 -11 39 22 32 -45 1 183 -53 -7 55 61 153 -91 2 -69 -88
3178 -88 -81 -10 77 -35 93 -55 103 -77 86 -31 -19 142 64 -11 -65 -6 -61 -69 -48 194 -69 2 -29 -76 -83 13 43
3205 43 25 -45 14 -16 -10 63 -11 -7 -72 39 27 34 -77 -59 -64 -71 104 38 68 41 -15 90 -3 12 -130 9 -108 -3 -21
$$ packed form
3011F1q8q1K2J34rp9M4o1J27J5j34M7J8P0m5M3l9m9N8Q4k19R2qJK2l4L6MQj7j8
3042EJ27j28JJ20j09l9M8Jr1O5k2J48p9j07l2M3M2J5j06Q2M8J10j97P4L7q1m5
3069g0J7oJ39l8p3O3nm9qk6J06RK9K0k16M2N8l6L0l7J52j02o5n8K30p8j30L03
3097B01j75j58Q6J04j2n1p3K63j24j42J09r3J73j04m4O2JJ8O5l8m5J2lqj3k1M
3124fJ02j13J7q9J49o7L7l6k2M2K0J6j13O1O2q8Q7r2k6L6P9J23j44L7j24jJ06
3151E3q6K4O8j35J53q1k5r0J25J73j10q0N0j7J0p7M6J82k36M6O2OR2k44R3p1j9
3178h8PP1Q7j12J28j48J58j80J63j17J2J61p8p5n4N9n5qK1K42k63P1l1m7pR6L0
3205D3j8p0N9l0OP3p4Mo5J11j2Pj11J8npJ75o6L0k7n6J05r3J5j42J39j17J05j8
$$ plain form
3234 -21 8 8 -74 78 3 -55 21 -10 -96 70 31 -54 -11 3 8 -51 66 48 68 111 8 54 5 -40 -2 -21 116 -25
3262 -25 133 17 5 -64 18 91 -3 -13 -70 -7 -94 51 -16 9 -23 -34 -34 -15 78 68 0 13 -8 -33 93 -34 5 -58
3290 -58 -58 -63 -7 -35 -75 64 -1 -72 88 -111 -55 21 -9 36 45 51 -28 157 -40 -1 126 -35 48 -55 -138 -22 -48 64
3318 64 15 -25 -23 44 -75 -3 -66 -39 -69 -23 10 53 -10 -46 -23 15 -55 47 108 -31 -42 13 1 53 -37 -165 -10 58
3346 58 67 46 -13 24 51 1 64 -103 -62 10 137 -47 57 -48 -40 60 6 32 -84 65 7 -8 16 59 -89 60
3372 60 40 -37 45 -4 11 5 -19 29 17 -13 -42 -82 -43 27 -67 67 11 -123 -22 60 -43 19 -53 2 6 -22 91 106 -10
3401 -10 -42 68 46 -48 -90 -120 22 -9 2 -27 14 -109 -10 32 -23 -95 -18 60 67 87 18 -97 -30 78 50 -17 40 20
3429 20 -50 -14 -9 45 55 -26 60 -37 -52 16 67 -7 -57 0 -66 -18 27 55 -53 -5 -89 -8 56 39 -41 27 -15 31 -83 -4
$$ packed form
3234b1K9%q2J52p5n8P6l1q6J66l9q5M3J4Nn9J17j8K0M3j03M6m9m5L8j9J37j41
3262b5J58j16j2o9Q2P3r4j0n7O3q7J45o7K5l2j1%J9R3j0o8J3k1k5J26j27L9o3
3290e8%nN6k8m0J39o5p1J60j99N6P6l0M5ROp9J85j97L9J27j61Q3j03q3J16k6J12
3318F4m9m0KO7j19P2o3K7l0M6L3M3o3l6K3L8p0J02O1j39j1N5j2N2r0j28J55O8
3346E8Rk1n9L7K7n0O3j67M1P2J27j84J04j05QJ00n4K6j16J49n8j5K4M3j48J49
3372F0k0p7Q2m9J5ok4M8j2l0k9m0L9P0r4J34n6j34J01Q2j03O2p2N5Mk8J13J5j16
3401a0l2J10k2r4m2l0J42l1J1k9M1j23R9M2n5p2P7P8PK0o9j15O7J08k8o7N7k0
3429B0p0L6NN4J0q1Q6r7j5O8N1p4n0N7o6M8M5K8j08M8q4Q1O4j7q0O8m2M6j14P9
$$ plain form
3459 -4 13 -3 -14 0 70 -43 -33 -51 -66 -98 17 16 -108 91 -10 -62 -1 -85 11 -26 16 77 -33 -43 165 -3 -9 5
3487 5 -75 -33 56 67 -82 -9 -10 46 33 -130 63 103 19 -21 -72 -37 -76 27 25 -106 -52 30 189 -49 88 63 -24 -1
3515 -1 -78 -83 3 -114 -35 12 119 103 -104 -40 91 4 -21 7 -30 97 47 -56 -24 -61 7 51 5 23 35 -110 -25 101
3543 101 21 -103 73 0 -9 -93 30 67 -2 0 -45 -5 49 -11 9 82 -151 -48 -72 25 -177 -60 84 99 -45 114
3569 114 60 28 11 -69 -28 23 -61 -28 46 3 29 -9 51 -124 -73 -74 50 46 51 38 39 -21 -34 44 -30 125 86 -33 -109 -39
3599 -39 0 -12 66 20 -94 82 54 133 -43 40 30 -1 46 -13 64 -68 -63 17 160 -88 -47 -22 6 -1 45 -42 15 -33
3627 -33 -2 -38 -19 29 28 -33 36 111 -21 -37 -66 -93 -47 -18 -34 -5 70 -32 -22 -69 78 -148 44 52 -127 21 -25 19
3655 19 -51 7 -67 106 87 56 -32 27 -53 108 -19 -62 -29 -24 70 32 -64 -34 50 -40 -27 20 73 -116 24 -102 6
$$ packed form
3459dJ7j6j1J4P0j13J0j8j5l2J15jj24J99j01n2O1q4R6l7M2O1j10j0K08j68oJ4
3487Eq0M2Q9J1j49P3jN6j3j63J93M0q4m0n1L5l9J03kj31N4Q2J59k38J37k5q7K3
3515ap7nQ6j17P9M7J07j6k07O4J31q7k5K8l7J27n0j03L2l7O8M4m6J8J2j45Q5J26
3543A01q0j24J76p3rq4J23L7o9Km5M0N4o0K0P3k33J03k4R7k02J17J44J5j44J59
3569A14n4l2j7q0M1N1q4L3P4m3K6l8O0j75N1jJ24mNj3Jo0j3P8p4J55l9j19p6P0
3599c9L9j2P8m6j14J76k8P9j76Q3j0l1M7n9P7j32NQ0J43k48M1K5K8pM6q7N7m8
3627c3L1l6J9M8jo1O9P5j32j6k9k7M6K9j6K9P5j02J0m7J47k26J92Qj79J48m6M4
3655A9p0N8p4J73j9l1q8N9q0J61j27m3L3NR4l8r6L0Q4r0J3M7N3j89J40j26J08
$$ plain form
3682 6 -96 31 -91 -34 -119 -30 73 104 76 -47 -24 21 74 53 -6 53 22 -11 -8 -13 -66 83 22 -45 34 77 -127 73
3710 73 69 65 -59 -102 -55 -41 21 -78 79 -39 69 60 -56 103 125 -38 55 -1 -38 71 24 6 -74 -25 -149 9 23
3737 23 -77 -81 64 12 -95 -26 40 15 15 -4 -41 22 -56 37 126 71 35 81 56 27 33 157 -70 77 42 8 6 -93 -47
3766 -47 91 14 -55 -69 -78 4 -115 -117 39 -44 -34 37 49 3 -36 -67 -22 -5 33 -66 22 21 -14 -37 -82 -39 56 -42 -37 122
3796 122 -93 -41 -4 -69 61 34 21 -188 88 -45 39 62 -97 89 72 -84 -38 64 19 134 -7 39 69 -64
3820 -64 -3 32 -4 -20 55 -7 -81 -6 31 -67 -59 -97 2 36 23 76 22 7 68 -88 -27 97 -87 -1 -24 78 -43 45
3848 45 32 39 -33 -52 84 -17 -78 -89 -85 21 -5 -31 37 30 -143 9 58 34 143 -75 26 -30 109 -75 18 42 63
3875 63 -42 -37 -67 41 -44 82 -42 -9 46 49 10 -26 67 162 11 -99 -45 24 48 -22 60 -53 -58 23 14 69 -15 -74 23
$$ packed form
3682Fj02J27j22N7q5Q9J03L1k8j23K3M5N3k1n9N9l1l3Lnn3J49o1o7P9M3k04K00
3710G3mmj24m3M7J4O2r9J57j18J08rj16J59K2j63R3n6l7J09m7j8q0M9j24J58J4
3737B3j00mJ45n2j07O9O6k5%j9l7O3p8R3Q9n5l6M6k5k9OJ24k27J47l5l4kr9M6
3766d7J38p7o9j4rQ2j19kJ56q3J0P1J2m6l9l1M5J7L8r9Q8jl5k3m5M3R5r8NJ59
3796A22k15N2L7o5J30k7j3k09K76j33Q4K3j59J86j7j56M6J02m5J15j41M6L0j33
3820f4O1L5l6j6P5o2p4P5L7r8Ql8R9L4j3N3n4j5O1j56O1J24j84Q6k3J02j21Q8
3848D5j3Pp2j9J36j01o1j1MJ06k6k6O8pj73J52M9k4J09k18J01n6J39j84R3K4K1
3875F3j05Nl0J08q5J26j24L3N5Ll9l6R3R5j51j10N4O9K4p0Q2j13nQ1rN5q4n9R7
$$ plain form
3904 23 -10 10 -79 58 21 5 97 80 -91 41 90 -49 92 43 -1 109 -54 -9 -40 21 39 -61 21 20 -85 71
3930 71 47 89 -54 37 87 -109 84 35 -60 -38 9 49 33 35 36 -4 5 -54 -53 -6 48 -89 -42 11 -98 -100 -54 35 14 -41
3960 -41 -102 46 1 -145 -35 91 -31 -61 85 30 -50 -112 5 -52 87 9 20 82 -16 -106 -129 -94 -5 -34 -17 -101
3986 -101 7 -12 1 24 -29 -51 -17 7 4 -10 72 -79 -7 92 -46 65 8 -30 2 7 -80 1 -2 -9 -7 122 -8 -31 33
4015 33 -160 -97 79 56 -4 -18 -23 26 59 16 68 14 38 23 -33 24 170 -84 97 -43 -45 -57 -35 -64 -37 -39 62 34
4043 34 5 88 44 -72 -97 61 75 -56 -148 6 5 -26 5 -6 30 80 8 30 117 -24 -24 -40 111 -42 -5 -55 10 -40
4071 -40 -5 -126 -37 -79 56 83 35 22 -11 -131 104 135 52 -49 -46 58 -34 31 49 -64 10 -34 -38 -35 27 -59 61 62
4099 62 69 -22 -4 14 -63 38 -83 39 -44 57 -73 -63 61 -5 -84 15 -53 -54 54 64 37 30 50 33 -19 -35 -52 24
$$ packed form
3904B3l3K0q9J37l7j6R2j7j71J32M9j39J41m9m4J10j63M5l1O1J8j00Q2jj05J56
3930G1k4M2j43R1N0j96J93m9r5K2M7M0j6KJm0Rn9JM7N4j37M7N3j09kM6Q9k1n5
3960d1o1J48m5j46J10J26j22l0J46n5q0o2J17n7J39p8J1O2r8r0k3L5Q9k9J7q4
3986a01J08j9J3K3n3k2L4K4lj4Q2j51P2R9j38J11n7l8L2Nq7Q1lpKJ29j30k3O4
4015C3j93O3J76k3o0j4nM9L3m3N2n4K4j5n6N7J46k54J81j40kj2K2k9K7kJ01k8
4043C4k9Q3m4j16k5J58J4j31r2J54jl1L1j1L6N0p2K2Q7j41%j6J51j53L7n0O5n0
4071d0L5j21Q9m2J35K7m8j3l3j20K35L1q3j01LJ04r2O5J8j13P4m4mLO2q6J20J
4099F2Pr1J8J8p7J01j21J22q3J01j30J0J24o6p9R9o8jJ08J0k7pK0j7n2j6j7P6
$$ plain form
4127 24 92 -130 10 -5 123 83 -50 119 -73 -178 69 12 -12 -42 85 72 -60 39 -33 -8 -148 103 -81 11
4151 11 -28 30 131 29 -3 23 -45 -88 -5 -13 6 41 31 65 -8 47 -46 15 33 28 -35 -19 103 -46 -2 41 -71 -9 -70
4180 -70 60 -77 24 -44 18 29 -89 -66 -22 18 11 143 75 -131 76 84 47 81 38 -6 21 21 14 -45 -8 23 80 46 5
4209 5 -37 -64 32 -19 -5 119 45 82 -53 -44 -11 -3 -78 -8 6 91 -46 -34 23 1 74 57 87 -23 -8 13 -26 -50 -35 -52
4239 -52 -47 98 24 29 -15 87 -17 27 -9 -40 87 25 -24 -34 9 46 -62 -58 -136 36 -42 55 -73 -1 -11 -94 141 -54
4267 -54 104 -85 2 -22 -112 -40 -30 31 -52 5 10 -40 -8 -111 -38 -37 -9 27 102 75 26 -1 -4 79 -97 18 -19 87 51
4296 51 45 -36 -130 2 94 -43 67 29 -14 114 5 -10 63 -37 5 -27 24 -35 -104 13 21 12 58 123 16 19 -9 38
4324 38 -72 20 59 -27 27 -46 32 -55 34 3 -71 -47 51 -3 18 -134 -29 94 -107 -59 10 -43 -56 -31 10 18 -63 -33
$$ packed form
4127B4O8k22J40j5J28m0j33J69j92j05K47n7k4l0J27j3j32R9p2K5j40K51j84R2
4151A1l9N8J01j02l2K6o8m3Q3qJ9L5j0L4p3N5r3O1J8no3J6J22j49M4M3j12O2o1
4180g0J30j37J01o8O2J1j18K3M4M0pJ32o8k06K07Ql7L4m3m4K7%pn9L7L1N7l4m1
4209Em2k7R6n1J4J24p4L7j35RL3Qp5P0J4Q5j37J2N7k2P3j7L0j10J5K1l9k4J5j7
4239e2NJ45p4Nm4J02j04M4l6l1J27o2m9j0M3L7j08Mp8J72p8R7j28P2j0q3K35j95
4267e4J58j89Q7k4r0P2J0O1q3N7Nn0L2j03P3JK8L6P5k7m9k7lQ3j76J15l7J06l6
4296E1oq1r4J32R2j37J10l8m3J28j09j5P3j00M2l2N1n9o9J17QrM6O5j07Lk8M7
4324C8j10R2L9q6N4p3P8q7Q9l1p4K4R8n4K1j52J05J23k01M8O9n3j3K5M1Qq1L0
$$ plain form
4352 -33 38 73 -61 50 67 -20 29 94 -19 -53 -40 42 -5 -16 -33 31 22 -23 -59 19 11 103 42 -28 64 -12 -21 -113 -40 33
4382 33 10 10 -29 60 27 -91 41 57 101 37 -35 -33 -2 -103 8 -48 96 67 131 146 148 -111 66 59 5 84 -76 10
4410 10 -26 -23 22 -64 76 -78 52 15 105 19 -19 102 22 -83 25 96 39 42 -94 -79 -11 -19 -12 104 -70 12 26 -52
4438 -52 68 30 53 19 -56 -27 -47 29 61 5 -29 -114 106 -12 -30 96 89 7 -9 -20 -96 72 19 78 83 10 -66 41
4466 41 117 46 25 -9 62 -93 75 37 -13 -71 0 -61 10 69 91 -80 -30 -22 19 -88 104 2 -30 110 11 -27 81
4493 81 94 -57 64 -83 21 109 -12 88 -106 19 -80 -16 56 -59 -17 -9 27 28 -66 -20 -186 25 158 -27 68
4518 68 89 27 114 -37 -65 -14 -18 43 15 75 70 17 67 108 -91 -69 -24 91 -77 -29 91 -90 -8 -15 -29 75 46 -8
4546 -8 -107 -62 -49 5 27 -59 -96 30 -18 23 81 58 -40 142 54 39 -44 127 42 -7 -64 -34 -65 -3 93 -29 -60 6 -17
$$ packed form
4352c3P1L5j34J11J7q7M9O5j13l4J3Q2m7j1j7O4rm5l6P8qR2o1p0R2p6rr2P3P3
4382C3k3%l9Q9l3j18J32J6M4o4p2KL1j01J11n6J44k9O4J5Kk59J77pn4P9j60Q6
4410A0l6LM5q6J40j54J30l7R0q6l8J21q0j05J08P1n7Lj36J5O8qPJ16j74Q2J4p8
4438e2J20l8K3l4p5K9k0P6L2n6l4q5K20j18j8J26pq2j6j1p6J68n3N9Np3p6J07
4466D1P6p1k1l4P1j55J68l8n0n8P1o1P1N9K2j71N0QM1j07J92j02l2J40r9l8J08
4493H1J3j51J21j47J04Q8j21J00j94J25r9O4P2j15M2QL6Jr4M6j66K11J33j85R5
4518F8K1o2Q7j51k8N1mO1k8O0nn3N0M1j99K2M5J15j68M8J20j81Q2pj4J04k9n4
4546hr9M5J3N4K2q6l7J26m8M1N8k3r8J82q8j5q3J71q5m9n7L0l1O2R6j22l1O6k3
$$ plain form
4575 -17 55 108 -73 63 -30 5 28 37 -39 -121 45 67 20 59 125 67 -75 69 -41 31 3 3 -14 77 109 -52 -7 -55
4603 -55 53 79 -36 -101 78 -90 -9 -149 2 81 90 84 21 29 -106 -12 -141 15 13 -82 2 -64 -37 78 -27 22 36
4630 36 -53 -9 -78 62 55 -5 85 59 38 -12 59 48 129 45 155 66 -36 -34 -92 -29 -24 102 -59 -17 4 43 -17 -34 98
4659 98 -40 -15 39 173 79 -113 15 3 140 -46 80 -53 -90 -42 -16 -17 -7 -21 -63 38 8 -51 80 68 123 -62
4685 -62 20 -27 -25 -45 18 -122 -11 0 1 -31 45 -6 -24 -56 -108 -40 -46 -20 -32 -71 -42 44 -91 -11 25 -25 -33 -100 3 129
4715 129 -29 79 -30 -36 -89 -91 -12 30 67 69 25 -3 -13 50 19 -65 -30 30 84 0 -115 29 -27 -62 -13 -130 137 -24
4743 -24 -26 -24 -12 46 64 -74 17 54 -9 -34 -87 -69 -21 28 55 -62 70 168 -58 20 53 -17 -1 58 -89 67 -26 -13
4771 -13 56 15 -132 -11 95 -24 -22 -9 80 86 29 74 -20 -8 -66 -17 -120 3 -32 23 82 -116 -119 14 161 39 -13
$$ packed form
4575a7P2N3j81J36r3L5K3Rp6q2J66K2m7L9O6n8j42J44j10P2k8%j7R1L2j61M5m8
4603e5J08K6j15o5J79j68Q1j40J51P9Roo3Qj35R4j29J56kr5Q4o6K7J15j05M9J4
4630C6q9M4o9J40po0R0k6k1n0P1j1Q1q4J10q9j02Kn8O3NJ26j61M2K1L9o0j7J32
4659I8j38K5N4J34r4j92J28j2J37j86J26j33l7M8K6jJ0j4m2J01l0n9J31j2N5j85
4685f2Q2m7Kk0O3j40J11J1Jl2P6n1j8l2n2O8oK6j2l9K9Q6j35Q0L6n0qo7J03J26
4715A29j58J08j09on3kP9M2L7Km4k8j0O3l1q4L5O0N4q4j15J44n6l5M9j17K67j61
4743b4kKJ2N8J8j38R1L7o3k5n3J8M8M9K7j17J32R8k26P8L3p0J6N9j47J56r3J3
4771a3O9m1j47J21J06j19KJ3Q9On7M5r4J2n8M9j03J23l5N5N9j98lJ33J47j22n2
$$ plain form
4798 -13 -54 13 -28 13 -52 -40 24 9 16 -23 55 -56 -19 26 -57 -25 19 154 43 54 43 -116 -119 -26 -56 139 0 -38
4826 -38 119 97 20 -37 -5 58 2 -34 -73 70 -37 -91 157 -2 45 -54 -14 5 53 60 14 18 -2 129 57 -48 89
4853 89 22 45 23 43 -88 0 51 18 1 6 -15 -57 -44 -59 4 28 65 -30 21 24 54 94 -74 52 -23 -42 -50 -10 -86 -2
4883 -2 24 -22 47 149 -7 -61 -62 85 93 -160 -81 126 90 123 151 -46 2 2 49 10 -90 101 -69 -88 -38 43 55 -21
4911 -21 62 18 14 29 44 -22 33 -51 -40 -87 -53 8 -10 -36 -68 94 -56 39 -12 -30 -38 -17 -26 -62 -15 -40 -73 -42 47 -6 12
4942 12 4 -11 -24 -55 -61 45 -70 16 4 -22 1 72 9 -15 -7 70 -106 -48 25 47 17 -1 59 -47 -16 -19 -55 -113 60 114
4972 114 -122 -43 -17 -37 -8 28 45 -35 74 -2 36 6 -61 53 -61 60 21 -24 60 94 124 7 -89 -10 -57 54
4998 54 26 -25 -22 29 -49 -72 11 30 7 75 -37 -3 15 13 39 63 -21 23 45 97 62 -81 -23 -65 2 -55 -23 114 -13
$$ packed form
4798a3m1O7m1M1o5J2O4j5Pl9P8j11L7M5q3L2M4J35j11J1j1j59lR3l0J95j39l8
4826c8J57k2p7n7L2O3n6l6l9J43j07n4K48j59M7r9M0J9M8Pm6Mk0J31p2j05J37
4853H9o7K3k2K0j31Q8N1l3j7Nk1m2J3j5O3K4L7r5N1LL0M0j68J26p5j9qM0p6Q4
4883bK6m6O9J02j56n4jJ47Qk53P9K07l6L3K8j97M8%M7l9j00J91j70j9N0Q1J2p6
4911b1Q3m4mJ5J5o6N5q4J1m7L4O1j8k6l2J62j50R5n1j8qK1rl6M7k5l3L1Q9n3J8
4942A2qj5j3l1oJ06j15Q6j2k6K3P1o3k4QP7j76N8P3K2l0j8O0j06L1ll6n8J73N4
4972A14k36P9K6k0K9L6J7q0J09p6L8l0o7J14j14J21l9m5Q4L4L0j17r6P9m7J11
4998E4k8n1LN1p8k3Q3J9k3O8j12L4J8kK6K4q4M4K2N2l5j43N8m2O7n7L2J37j27
$$ plain form
5027 -13 -50 -27 32 8 -86 -47 -109 -49 103 8 -18 116 -50 -18 -20 -36 -11 -31 -62 92 73 28 174 -105 -57 19 -26 74
5055 74 138 -19 38 -26 7 -58 -8 -87 -33 20 75 6 -71 -20 -29 -162 12 -11 -15 7 -20 55 -9 -55 35 -97 42 -105
5083 -105 20 -58 35 120 -23 -54 -12 67 138 82 49 80 17 75 -64 8 41 -43 36 102 0 -54 2 97 -44 134 107
5110 107 -22 -22 -50 25 -48 -7 69 -55 -9 111 -28 -22 21 73 -7 16 28 -11 -2 2 -80 -22 16 14 -1 -56 20 32 68 69 -2
5141 -2 37 -92 -12 76 17 -6 123 -20 -60 0 -58 59 41 28 55 44 -102 120 37 -19 -13 -37 -68 -47 -45 34 -42 13 45
5170 45 -67 -22 -18 79 -67 -1 10 -8 15 11 -77 -37 -99 14 -53 36 85 11 -32 60 60 5 -23 49 -98 106 65 -73 72
5199 72 88 -47 -45 -1 -64 -5 -46 -49 40 25 75 60 44 -6 6 125 -35 39 7 56 -52 -63 -12 67 -65 20 -1 -57 20
5228 20 28 92 74 82 -35 -92 65 108 92 17 -37 -96 -79 16 -152 53 -90 17 -43 62 21 -12 99 114 -26 -15 63
$$ packed form
5027a3l7K3N9k4r4L9o2O0J52r5k6J34j66L2kj6K5k0l1J54j9m5J46k79M8P6m5J00
5055G4O4j57N7o4L3o5N0p9N4N3N5o9p7N1rj33J74k3mK2k7P5o4m6R0j32J39j47
5083a05J25p8R3Q5j43l1M2P9P1n6l3L1o3N8j39P2L3q4P9O6j02n4N6R5j41J78k7
5110A07j29%k8P5p3M1P6j24M6J20j39OM3N2q0K3J2l9RMq2N8L8kj5n5P6J2L6Jp1
5141bL9j29Q0Q8n9k3J29j43m0O0n8J17j8j3K7j1j46K22q3n6Ok4l1K1KP9p6N5L2
5170D5j12M5MR7j46O6J1j8K3mq8M0o2J13o7Q9M9p4m3R2%n5k8P2j47K04m1j38J45
5199G2J6j35KM4o3N9m1lQ9j5N0j5j6n0J2J19j60P4l2M9j08j1N1P9j32Q5k1n6P7
5228B0QO4j8Qj17n7J57M3j6p5n4n9J7R5j68K05j43J07o0J05m1l3J11J5j40J1P8
$$ plain form
5255 63 -17 55 28 97 56 67 -47 -26 72 63 77 -17 55 -15 101 -57 -37 30 -91 -69 -3 -15 -156 22 -87 26 62
5282 62 44 48 -15 -30 -12 -8 30 -33 -85 21 -11 -40 -97 10 -31 34 9 99 -62 27 13 92 75 -51 71 47 115 -116
5310 -116 48 62 12 -12 10 -15 -77 36 150 78 35 -31 -5 -11 -3 -90 -9 112 -87 -27 47 37 -10 -69 -58 9 79 48
5338 48 -30 -5 -53 -14 10 65 -20 -60 -9 30 30 -45 -20 45 16 -74 -87 41 -36 7 -9 65 -28 -49 -54 -129 65 38 -42 -15
5368 -15 73 -58 5 86 11 127 -93 -10 86 53 89 -20 72 52 -150 -20 9 53 140 33 -43 -91 104 124 37 18
5394 18 28 20 -71 44 -20 28 16 -77 -70 -190 2 70 -56 77 -7 -33 -11 26 -70 -25 5 73 -100 -2 9 14 35 134 106
5423 106 1 18 -70 44 -75 -89 -4 -3 -8 59 -21 21 -55 17 36 50 17 22 38 -46 24 -83 24 5 45 -11 -72 114
5451 114 -165 24 3 79 -19 17 -31 -16 45 -53 83 2 54 -47 -33 91 0 4 -37 -8 37 -102 10 41 -7 -72 -92
$$ packed form
5255F3q0P2k7O9m1J1j14K1R8rJ4r4P2p0J16j58K0O7j21K2O6j2j41J78j09J13L6
5282F2j8Mo3j5J8ML8o3n2J06l2k9n7J07m1O5k5R0j61Q9j4P9j7j26J22k4O8k31
5310a16J64J4n0k4K2k5o2J13J14p2m3o6K6oQq7Q1J21j99O0P4j0m7n9J1O7P0l1
5338D8p8K5m8L9K4N5q5m0N1L9%p5K5O5k9r0j3J28p7M3j6P4r3k1np5J94k7q0K7
5368a5Q8j31O3Q1p5J16k20Q3R6l3L6j09R2k0k02J30K9M4Q7j07p6m8J95K0q7j9
5394A8J0qr1J15o4M8j2r3Pj20J92O8j26J33q4k6K2L7r6M5L0O8j73R8J1NK1R9k8
5423A06j05J7q8J14j19j4Q5JnO7q0M2p6P2J9J4l3NJ6q4P0j07J07j9M0n6o1J86
5451A14k79J89k1P6r8L6m8J5O1r8J36q1N2j01J4J24r1Mm1K9M5j39J12L1m8o5k0
$$ plain form
5478 -92 93 16 74 10 -72 -8 115 3 7 -94 -26 -33 -11 -5 3 -63 7 -37 -57 -88 17 67 40 76 23 -33 197 77 -70
5507 -70 -36 -44 49 -70 42 -36 -10 45 -38 8 79 49 -37 -68 -104 -9 -44 7 -18 42 49 -8 40 -46 -55 -77 -4 14 -29 42 -31
5538 -31 14 149 -59 -13 -3 29 -41 -30 67 63 23 -69 37 -13 -99 34 -103 -44 63 -8 -64 0 10 28 23 61 -10 -28
5566 -28 15 -75 -37 -161 0 56 -152 40 -8 38 60 29 12 11 7 -42 -34 11 9 -19 -47 -4 27 124 18 -94 54 57 71
5595 71 -54 -28 -40 31 -61 -3 -113 35 41 -31 -70 -102 11 -102 43 75 -11 -71 -39 -17 -2 99 -81 31 -18 -24 70
5622 70 -9 14 16 9 10 -27 41 68 -39 127 -35 -43 -56 17 45 -50 1 -116 -37 -60 108 -21 -34 -78 78 14 -12 -33 54
5651 54 -13 -34 17 -80 -35 -94 -58 16 55 -145 7 -39 12 8 19 46 -33 -28 33 -41 -74 -60 -35 42 28 2 65 17 35 -61
5681 -61 86 29 96 27 -46 -98 -67 -112 2 81 -28 -11 -15 50 -31 -34 15 35 67 -100 4 -26 -5 -50 -134 -128 -63 -79 -25
$$ packed form
5478i2J85p7N8o4q2O4J23j12Mj01O8pK2OQo6P0m4k0l1J05N0k7L6n3n6K30j20j47
5507g0L4qR3j19J12p8K6N5q3M6P1l0q6l1l6R5l5N1k5O0Pn7M8q6rk2P3J8m3P1p3
5538c1M5J35k08M6J0L2p0J1R7mm0r2J06n0q6J33j37N9J07p1n6O4J0J8nL8p1j8
5566b8M3r0L8j24J61N6k08J92m8M6K2l1j7jmm9QM5kk8k8M3L1R7j06j12J48LJ4
5595G1j25K6j2P1r2N8j10J48Op2l9l2J13j13J45L2q6o0L2K2J5J01j80J12m9oR4
5622G0p9K3KpJl7O8K7j07J66j62qj3P3K8r5N1j17P9k3J68j29j3m4J56o4k6k1Q7
5651E4o7k1N1r7M5n9L6P4L9k00J52m6N1mJ1K7p9NO1p4l3J4K5P7j4k6O3m8J8r6
5681f1J47n7O7o9p3n2L1m5J14P9j09J7mO5q1lM9K0L2j67J04l0K1m5q4OO5j6N4
$$ plain form
5710 -25 22 101 -39 -36 31 -26 0 -132 -1 8 80 -81 35 -68 -38 -42 -15 92 10 65 -13 -46 -47 -41 6 -99 21 55
5738 55 -76 -64 12 2 31 52 36 -98 134 19 47 55 -68 -50 -92 -6 -47 39 -41 146 -68 -16 19 20 -25 -58 -52 41
5766 41 64 69 -50 -27 44 10 -77 20 43 -76 -14 29 75 35 -58 85 41 26 -11 -19 15 -35 85 36 25 65 -89 131
5794 131 68 71 -30 -21 30 104 -36 -3 40 -69 69 -68 -37 24 31 -57 43 26 39 4 -97 -3 53 -142 96 37 -80
5821 -80 63 73 61 5 65 192 -47 -14 7 62 -11 26 -7 65 94 36 -35 -59 -66 32 -95 60 -64 -29 118 24 6
5848 6 44 105 70 27 -7 32 81 70 46 -11 33 19 51 -10 64 -55 -36 2 9 14 -15 42 -96 -84 15 -94 70 66 2 -41
5878 -41 31 -64 93 -75 135 13 -26 61 68 47 -64 -32 -7 -26 -18 -23 -39 -22 1 30 6 18 34 88 15 116 -42 60
5906 60 1 -7 109 -56 -14 11 -33 -34 -27 138 5 2 60 -117 28 108 21 77 12 43 116 -18 -39 -37 13 -43 -64 -68 -76 129
$$ packed form
5710b5M7P9j40LO7n7K6j32J31RP2j61J16j03L0mK7J07q2N5p8l3jOM7j05J20L4
5738E5j31J2P6j0K9K1j6j34K32j15K8Qj23J8m2Q6m1Q6q0J87k14N2L5Jm5l3OR3
5766D1K3Nj19K3P1l4q7R7K3j19O2M3M6m0r3J43m4j5l7qL4n0J20m9j1M0j54K20
5794A31o3Lj01RN1P4j40L3M3j09J38j37L1O1Pq8J00j7J3l5j01R4N6j95K38n9j17
5821h0J43J0j2n6O0J27k39L3K1N5p3L7l3P2K9n8p1k4pR8j27J55j24L5J47r4j8
5848FL8O1l5m3l4L9M9j1k4n7M4j4L2o1P4j19J9L8PNk9N7j38J2R9j09J64mo4m3
5878d1P2r5J57j68K10j22l9Q7Pk1j11L2K5j9Qnj6J7K3K9k4J2J6N4p3J01j58J02
5906F0n9qJ16j65M2K5m4jPJ65j33lN8j77J45Q0q7N6o5L1P3j34k1KN0n6k1mqK05
$$ plain form
5936 129 -45 15 -14 75 -50 44 -14 -59 6 -66 36 16 -44 -63 -14 33 -42 15 -43 43 -8 33 -96 84 -61 -24 -7
5963 -7 -31 83 79 39 -41 107 -11 -63 -1 74 -43 47 -60 -10 5 30 -60 26 -13 43 58 -34 -31 -35 65 30 136 34
5991 34 -48 22 37 5 -142 137 -31 -35 -36 -51 -145 93 -12 64 117 53 -94 26 -9 37 126 31 77 12 -70 -75 -14 104
6019 104 -26 56 65 -34 11 17 13 -46 -55 76 50 11 8 45 -5 -90 32 6 -116 -3 -66 -78 62 91 26 155 60 -114
6047 -114 41 -38 44 6 -36 2 -43 45 27 -9 57 -8 34 6 -86 -73 -50 41 -37 39 39 46 -42 -19 27 56 82 21 94 -29
6077 -29 7 -76 -26 -47 11 93 -25 66 -132 18 116 17 -36 -53 18 102 -50 32 14 -57 1 156 74 111 68 -9 -13 26
6105 26 40 123 -96 -79 -29 -40 -1 21 8 25 -38 -26 45 -24 -79 38 26 26 66 -38 -41 35 -10 -71 -8 -109 5 23 -1
6134 -1 18 116 -47 -30 70 -56 98 -88 -41 -16 -9 -56 22 -44 -8 73 0 -49 13 -11 -1 47 18 78 -83 134 -46
$$ packed form
5936A29j74O0k9Q9j25R4n8m5O5p2J02k0o0j9M9M7p5N7n8Q6n1M1j29J80j45L7J7
5963gk4J14mm0q0J48j18n2O2P5j17R0j07N0J5K5r0Q6l9N6J5r2LmJ00l5J06j02
5991C4q2P0J5l2j47K79j68mjj5r4K38j05P6N3o4j47J20l5M6Q9r5M6o5q2nO1J18
6019A04j30Q2Rr9M5Omn9rJ31k6l9lL7n0q5J22k6j22J13o3j2J40K9o5J29r5j74
6047a14J55p9Q2l8m2L8m5Q8j8l6O6o5M2k8r2J3K3R1p8P6%Pq8K3M6K9K6o1P3j23
6077b9L6q3N0k1N8Q2j18R1j98J50R8r9n3j7P1Q4j52Q2j8p1N8J55q2L7m3p7mL9
6105B6J4Q3k19J7N0j1L9K2j3J7o3J2P1o9n5J17j2%M0j04lP6m5o1O3j01J14J8k4
6134aJ9R8j63J7J00j26J54j86M7K5Pm7P8o6L6Q1p3m9O2k4J0M8k9O0j61K17j80
$$ plain form
6161 -46 -67 34 62 -34 -58 -34 -9 89 31 10 -42 38 71 20 -108 -9 51 -32 -51 -51 7 -114 98 -33 -71 73 -30
6188 -30 -4 -21 85 -6 3 -16 -52 -29 51 7 -51 50 -7 -50 145 35 -4 93 -10 40 -1 -1 21 -50 89 1 9 61 40
6217 40 18 94 70 49 100 185 47 60 18 3 121 -147 10 -36 -69 180 -81 -21 -36 90 -12 -11 -30 2 -7 64 -32
6244 -32 -39 0 -21 -90 16 -49 -94 65 6 -62 -95 -51 -82 38 51 28 77 20 -59 41 3 90 12 -22 5 -6 -63 43
6272 43 -3 -43 -21 50 -72 -95 -4 -4 -7 -48 -53 83 4 0 38 40 -50 -51 28 112 -8 -34 -13 9 52 -35 52 -109 129 89 80
6303 80 13 99 -88 -31 -42 -25 24 125 -45 -96 -73 71 7 -168 -69 0 -12 -78 -68 8 -59 89 67 -49 -13 -106 -82
6330 -82 37 43 90 55 39 -20 37 -45 -65 1 0 -129 -66 140 122 -55 -33 -75 -117 -60 -36 -89 44 -59 50 -15 26 62
6358 62 69 41 -48 -48 -10 88 31 -60 -96 -25 -78 -17 -25 49 115 96 48 65 87 75 52 13 -176 -155 -11 -29 4 -129 -20 -21
$$ packed form
6161d6k1J01K8r6k4K4K5R8n8k1n2Q0L3n1j28R9O0q3j9%N8j21K12j31l8J44j03
6188c0K6j7J06r1Rj9l6K3Q0m4n8J01n7m3J95j10l9R7j03N0m1%K2p1J39q8QN2k1
6217D0k2P6k4k1N1Q5j38J3m2j5J18k68J57m6l3K49k61O0j5J26j02Jj9L2rP1r6
6244c2pL9k1o9J06o5m5J59n9o8l3M4l1J20J3k3M9n7p9J00l8Q7p8l4K7j1n7J06
6272D3m6m0K2P1j22k3R1%lm1nJ36p9mL8Kr0jP9Q4j20k6K1K2M3q7Q7j61K38m0r
6303H0o7Q6j87N7j1J7M9J01j70n1K3J44o4j75R9O9j2o6J0P6o7J48k2j16L6r3K4
6330h2J19OM7l5j6n9N7q2k0O6jj29O3K06j8j77K2m2m2N7K4n3J33j03J09o5M1L6
6358F2Pk8q9%L8R8n7r1l6P1n3O1qP4O6j9m8J7K2j2k3l9j89K1J44j8L3j33J09j
$$ plain form
6388 -21 123 123 -15 10 7 41 -11 5 -54 57 54 96 -21 -50 67 28 37 70 -16 60 5 102 -32 0 -44 -17 59 110 -141
6417 -141 15 -106 62 -27 -120 53 81 10 -13 -31 50 -46 13 -14 -79 -46 -45 92 -16 70 -20 -33 -73 46 80 -39
6443 -39 72 -19 -20 -39 -4 -99 20 -52 42 -34 113 -74 -50 12 55 176 12 0 64 41 122 28 25 0 74 -6 -50 -118
6471 -118 34 35 53 -114 13 37 -25 30 -24 -65 -68 -1 -61 93 54 111 36 70 39 21 10 40 35 1 -12 2 39 -40 50
6500 50 -33 -61 -38 -96 53 9 -47 -94 -4 46 -55 7 89 -49 -45 -103 -61 18 64 -22 -14 83 61 101 -7 -48 80 -24
6528 -24 44 80 -32 -6 49 54 -7 17 -114 25 12 19 16 43 60 -43 105 -40 33 -41 26 90 77 36 -21 -49 39 -44 -37
6557 -37 -87 -35 120 -35 48 9 -51 -13 -35 58 38 17 100 -20 5 -69 65 -103 50 73 -62 -23 69 5 94 31 -92
6584 -92 -24 -37 -82 112 -95 -1 46 -65 -36 -16 65 93 15 45 54 157 95 -39 25 32 59 -65 34 55 -15 -36 54 76
$$ packed form
6388b1J44%j38K5lL4n2J6n9J11lM2j17k9J17l9RL3q6P6n5R7j34L2m4K7P6N1k51
6417a41J56j21J68q9r3J73K8p1k3j8Q1r6N9k7o5L3JJ37j08Q6r0j3m0J19L4j19
6443c9J11r1jj9L5r5J19p2R4p6J47j87K4O2M3J21j64j2O4k3Q1r4lk5P4q0m4o8
6471a18J52JJ8j67J27K4o2N5n4m1lO7o0J54l9N7p5L4l1j8j1L0nl4j3J4L7p9R0
6500E0q3k8K3n8J49m4n6m7R0N0j01O2Q2j38Mn8M2P9M6q6QR7k2M0j08m1J28j04
6528b4O8L6j12K6N5No1K4j31J39j3PlK7J7j03J48j45P3p4O7O4j3m1n7k8Q8q3P
6557c7n0N2J55j55Q3l9o0L8k2R3k0k1Q3j20K5p4J34j68J53K3j35L9R2o4Q9o3j23
6584i2O8j3m5J94k07R4M7j11K9K0Q1K8p8L0RJ03o2j34O4PK7j24R9K1p0k1R0K2
$$ plain form
6612 76 -48 78 -51 -56 -10 52 52 -66 -39 43 10 -156 133 -31 4 57 10 23 -86 -23 -56 -128 -38 39 -11 -43 -68
6639 -68 76 -26 8 2 -67 -132 31 5 29 70 -68 -74 42 -55 -43 45 77 13 -87 -54 57 109 -79 -63 -102 27 -45
6666 -45 -28 102 20 14 11 -41 115 13 -39 -46 18 51 -34 -6 -23 58 -1 -72 17 -7 13 -24 54 -12 105 -43 -54 6 115
6695 115 27 43 -92 -12 -25 -85 -25 22 -1 -12 40 -33 107 -58 37 -9 19 16 30 61 7 -19 63 -93 16 10 74 -21
6723 -21 63 -26 -2 -47 -5 53 16 17 59 -63 -30 -21 1 -111 -89 -98 18 -9 -84 -56 -3 -8 0 7 -58 61 16 -20 49 -84 49
6754 49 44 56 -22 84 40 141 10 -73 -10 78 -46 31 -38 -103 39 -61 -19 -61 -57 -65 7 -57 -47 133 -73 -69 -18 113
6782 113 -6 -86 57 28 -24 -13 6 -14 -89 -42 67 -95 -52 10 40 8 -135 18 -68 -20 -31 -44 47 64 -16 -100 32
6809 32 93 -50 -71 77 -111 13 -69 15 -41 15 31 22 -19 -45 34 -6 -45 41 172 2 38 21 -93 4 -20 -64 -14
$$ packed form
6612G6j24J26j29nM6O2%j18K7Q2l3j66K89j64L5N3m7J3j09O3l3p2R0P7n0l2k5
6639f8J44j02L4oo9o5J63k6K4M1j38oJ16r7J2Q8L2o4j00L3J11N2j88J6l9J29p2
6666d5J7J30q2oln2J56j02n2pO4L3q5K8j7Q1n9p1Q9k4K0l7P8o6J17j48j1O0J09
6695A15q8J6j35Q0j3o0O0M7k3j1N2p3J40j65R5m6K8lJ4L1n4k6Q2j56J09oO4r5
6723b1Q4q9K4m5M2N8l7JM2j22L3RK2j12K2rJ16k7p5K8N3nQPo5J19m5l6O9j33J33
6754D9nJ2p8J06m4J01j31q3O3Q8j24P7o9o5J42j00M2m2MqP2o4J0J80k06MN1J31
6782A13j19q0J43k9n2J1J9k0p5M7J09j62M3O2L0l2j43J53q6M8j1j3R1J7q0q4J32
6809C2O1j43k1J48j88J24q2Q4n6N6J6rm1k6P9m0l9Q6J31j70L6j7j14R7k4m4N0
$$ plain form
6836 -14 -15 65 -126 -31 -80 -192 -14 2 48 -2 15 -27 27 38 -55 76 95 -86 -138 -149 23 17 80 25 -32 -7 -3 -22 57
6865 57 4 76 -19 22 29 79 10 -93 -44 -94 17 75 -25 -40 23 22 10 -24 20 3 -1 -6 -19 -30 -5 24 14 -34 45 4 82
6896 82 147 -15 62 38 -15 -32 -76 -5 79 30 37 32 -8 -94 -4 -55 -35 -58 67 31 77 -20 -50 -56 -56 35 -24 52 100 -95 37
6927 37 -84 21 -47 -50 128 39 -113 -41 -129 34 -66 -101 9 32 -34 56 -104 -37 -54 5 -37 24 -44 82 6 -45
6953 -45 60 82 -57 -84 -93 -29 -47 -60 -55 -28 4 4 -34 18 17 12 62 -76 -77 -107 -60 120 -99 44 18 -93 75 31 -25
6982 -25 -56 108 -46 -63 -14 -33 -9 129 -103 65 53 65 -15 -129 12 71 -82 -62 -69 -109 -9 118 -46 18 -10
7007 -10 -31 -21 -16 4 48 110 -67 19 5 -71 34 -11 -22 31 -15 11 102 -3 -19 -27 54 -4 -7 49 -1 60 17 24 17 -1 67
7038 67 -3 5 55 -24 -35 -137 43 63 91 -66 -41 -30 -51 -14 116 -65 -59 -100 -14 14 19 -51 -58 66 -29 68 -27 -31 -22 157
$$ packed form
6836a4jQ0j91R5m9j12J78J6M6n0J7m2N4J1r3J31J9j81n2j1J72oO3n5n7K5Mj9P9
6865E7n3P2r5M1PN0o9j03M9n0J11N8j00j5O3jj2l4M4j7mnj3j1K5K9j0m8P9m1P8
6896H2O5j62P7k4n3j7m4P1Q4m9Pnm0q6R0n1K0k3J25l6M6r7l0o%R1n9P6M8j95J32
6927C7j21J05o8lJ78q9j52P2q8J63j00l5J10K3o6R0j60O7j7N9m2O1o8J26p6n1
6953d5J05K2j39k7rO4j8j3NK7L2%l8N2jnN0j38jl0M7J80k19J43k6j11J68m4n6
6982b5l1J64j54j7M9j9K4J38k32J68j2J2q0j14J41N9j53K0pm0J00J27j64O4k8
7007a0k1J0NK0M4O2j77Q6j4p6J05m5j1N3m6K6R1j05j6qQ1n8lN6n0O1m3Ppj8O8
7038F7p0QN0p9j1j02J80K0K8j57K5J1k1L7J30j81Om1Q6K8Np0pJ24r5R7r5mRJ79
$$ plain form
7068 157 98 -22 -99 -61 51 -17 56 -14 -61 60 34 22 -36 26 3 63 110 -26 95 -9 20 -18 52 122 -54 -52 19
7095 19 27 32 140 4 8 28 -37 3 -18 -37 26 5 -99 48 88 7 29 5 -94 67 28 -16 13 28 60 -62 79 -82
7123 -82 -143 81 83 22 -75 -43 1 8 25 -28 -17 56 105 42 60 -9 24 1 -19 -89 86 -57 72 -22 -22 57 -59 -35 21
7152 21 35 -2 3 -5 -78 -149 -53 34 -46 -5 83 57 116 -79 -37 23 48 -8 -61 -23 12 69 86 -16 6 109 -15 -51 -39
7181 -39 -131 -52 -99 -112 -24 -99 50 -12 -2 -59 -41 -66 -64 -14 -46 -46 -27 -78 35 8 -99 -50 -36 171 -25 -99 -25 100
7209 100 -34 84 37 -44 35 -33 -26 48 120 -6 10 27 34 102 77 -35 -38 -2 -78 -18 -66 -25 36 -65 26 30 -66 -64 116
7238 116 61 -28 16 -94 -16 21 -70 48 -21 -141 107 -45 51 46 99 -99 33 43 2 -30 -55 -6 -68 147 -64 77
7264 77 -22 -30 97 -51 -37 20 43 -143 -73 29 -99 19 -61 -33 -146 -72 28 36 9 12 41 7 23 20 29 31 74 13 91
$$ packed form
7068A57n9j20p7L8J12o8P3p0m7J21k6j2n8O2k3O0M7j36J21j04K9l8P0P0j76KP1
7095A9QNJ08j36MK0o5M0k1j9O3k1j04J47M0q1K2k4r9J61l9m4K9J5L2j22J41j61
7123h2o1K24Ko1r7L2M4PJ7n3J1P3M9o3J8o9L3k3k0p0J75j43J29r4%P9j16K4N6
7152B1J4l7Nqp3p1R6Q7q0M1Q8k6N9j95M2O0K5n6n3L8L5N7J7j02K2J03j24l6J2
7181c9r2P9m7j3Q8p5J49o2J0n7J8k5KN0l2%J9n1J13k7j07M9J4K07j96p4P4J25
7209A00j34J18m7q1P9o8PP4P2j26J6J7PO8k5j12lL6p6O0m8M1O1j01R1Mr6KJ80
7238A16n5q9M4j10P8L7r1J18o9j20K48j52R6nN3j98J32J0m1l2k5M9o2K15k11J41
7264G7r9qJ27j48J4N7K3j86P0J02j28J18q0K8j13P4J00Qk7LK9l4J6lRKM3o1P8
$$ plain form
7293 91 -8 86 -102 6 -19 -94 83 -14 46 40 -83 69 -16 -54 32 58 20 -1 57 51 79 7 -98 7 -109 -46 -17
7320 -17 -44 64 40 59 77 -32 -49 109 102 -78 0 -48 -10 15 47 0 35 86 -31 115 2 29 -72 48 -84 -43
7346 -43 24 -11 4 -155 93 -23 2 -28 -125 -85 -100 72 -4 -21 -48 -3 -85 1 17 -38 79 104 2 -98 -112 45
7372 45 -20 -11 78 -60 -110 63 -39 53 -73 -50 3 10 61 26 61 53 -102 57 51 17 -43 7 47 26 -30 3 4 -61 46
7401 46 -122 33 -66 -18 -62 5 42 -58 20 -9 125 8 23 57 -21 20 73 13 47 -31 31 -43 -61 6 14 36 -53 -23
7429 -23 29 -23 -77 -23 -8 -71 -38 -48 -4 -40 43 6 57 -50 29 8 38 -85 20 44 -70 -39 -60 38 24 -46 -13 42
7457 42 -29 -59 -8 46 -58 70 -17 115 -2 -34 124 -114 32 18 58 3 52 36 -13 96 -76 28 50 -10 -6 -81
7483 -81 81 20 -65 46 0 -30 64 24 38 10 -57 29 -11 26 -45 73 60 -132 -31 -6 -56 65 65 -37 -80 7 -63
$$ packed form
7293I1r9R4j88J08k5p5J77r7O0oj23J52q5l8Q6K6l8k1N8oK8p2j05J05j16O3K9
7320a7k7J08k4J9J8j09j7J58pj80P8m8L8K5L2m7L5N1j17J46j13K7j01J20j32M1
7346d3O7l5J5j59K48j16K5l0r7M0j5J72p6j7k7M5q2Q6J6n5J17K5j02j00j4J57
7372D5o5RQ9j38n0J73j02R2j26K3N3PN1l5L5qj55J59ol4o0N0M0k1n6L3Jo5J07
7401D6j68J55r9M8m4O7L7j00P8k9J34j17J5L4p8M1N3o0L4p8O2p4j8O7QK2q9L0
7429b3N2n2n4N4J5o3L3j0M4l6Q3l7N1j07P9k1L0j23J05K4j14L1k1R8j4p0L3N5
7457D2p1l0N1N4j04J28q7J32j17l2J58k38J46j4M0n5M9j6m9J09j72J04K2o0Mp5
7483h1J62o1q5J11m6l0R4m0J4k8o7Q6m0L7p1J18j3j92J01K5n0J21%j02m3Q7p0
$$ plain form
7510 -63 -59 -43 47 131 -132 39 52 12 24 25 11 80 19 11 -39 -57 12 35 -52 22 77 -66 68 -93 -26 42 -24 98 48
7539 48 -38 -127 62 114 -36 13 49 -3 22 -144 -42 29 46 -33 -48 135 -151 -122 7 63 112 9 -63 52 -121
7564 -121 -17 38 17 -72 -41 -56 83 14 -9 22 66 -84 32 -25 71 43 -68 -10 -63 124 -45 -112 -82 -73 68 39
7590 39 -53 37 -35 -109 -1 -60 -25 86 51 -27 11 101 31 87 38 8 37 -49 -17 -90 -28 43 23 -24 26 92 32 -35 -22
7619 -22 117 -18 125 -100 -48 58 85 31 -88 -27 75 38 -49 55 -48 118 -2 39 14 -67 -163 -11 -43 -42 -71
7644 -71 44 29 12 -22 -13 84 72 -54 -67 -21 24 44 -72 31 40 -36 -33 -6 -17 80 -77 -85 23 -127 -39 -100 73 44
7672 44 10 71 -28 -18 48 -2 13 10 -15 -119 -55 135 16 6 53 -12 22 109 7 39 36 0 139 55 -70 4 -96 10
7700 10 -46 -65 12 119 -49 76 -27 37 50 43 194 14 83 -57 -42 49 105 16 29 2 113 16 3 -19 106 32
$$ packed form
7510f3MJ6R0Q4k63J71J3m0J2Jj4O9o1qn0j8O9K3q7P4N5j43J34j61O7O8o6J22n0
7539D8q6q9J89N2j50M9L6n2K5j66J02P1J7p9j5J83k86K9J29N6M9j03p2J15j73
7564a21J04N5k1q9L1j5J39o9k3L1M4j50J16n7R6k8j11N8n3J87j69o7L0RJ41k9
7590C9r2R0p2p4J08n9L5J11l5p8L8R0p0N6m9l0K9q6L2p3O2P1k0m7N0O6o0o7J3
7619b2J39j35J43k25N2J06K7n4j19O1J02l7q7J04j03J66j20M1k5q1r6J52l2Jk9
7644g1J15j5j7l4RR7j2j26j3M6M5K0j16J03Rp6LK7j1R7j57qJ08j50Q8o1J73k9
7672D4l4O1r9J0O6n0J5lk5j04O4J90j19j0M7o5L4Q7j02L2ll6J39q4j25P4j00J06
7700A0n6j9P7J07j68J25j03O4J3pJ51j80O9j40J5R1N6q9J3k7J11r7j3k2J25p4
$$ plain form
7726 32 -15 39 32 63 25 98 50 42 104 -32 67 182 25 9 52 -15 26 110 -68 37 80 -14 3 82 -27 -42 117 -20
7754 -20 -49 16 -117 64 25 47 122 5 12 2 55 -19 -21 -59 -79 12 68 23 2 34 90 -34 -36 43 116 -78 -138 30 -25
7783 -25 29 57 81 -85 18 16 -76 -67 61 40 34 -82 2 -45 -10 -105 -132 -26 -5 6 59 -4 26 38 -54 -34 -106 95 48
7812 48 63 -29 70 21 59 3 11 -28 -56 4 20 -43 8 -41 -104 5 73 -99 42 -14 -42 43 -59 -10 42 6 -7 -31 -90
7841 -90 -55 29 -60 -9 65 -12 -25 21 -75 -57 5 -61 -55 15 79 -78 42 25 25 60 34 18 44 15 -30 -22 -142 17 7 117
7871 117 103 -78 -4 55 -9 -12 7 -23 -26 -33 -15 152 56 42 70 -33 102 -84 -79 -44 1 62 27 3 29 57 4 9 -119
7900 -119 -34 32 19 -60 23 55 -48 10 92 31 -31 -6 -50 -6 28 -35 32 76 118 40 41 73 -105 -58 -107 19 -37 -38 -22
7929 -22 8 -64 5 53 -92 157 103 27 9 63 48 73 -96 -20 19 28 35 -63 27 -44 -43 -44 -9 70 -39 -3 -4 36 94 17 -81
$$ packed form
7726C2m7N4pL1l8P3m8qO2j36R9J15j57j6M3o7M1Q4j78J05M3r4J7P9j09j5J59j37
7754b0k9O5j33J81l9K2P5j17Pj0N3p4kl8k0R1N6m5k1L2N6j24kP9P3j94o0J68n5
7783b5N4K8K4j66J03kr2RJ28k1oj16Q4m7L5r5k7J06K1J1N3o3L0J2r2K0p2K01m7
7812D8J5r2R9m9L8n6Ql9k8O0J6o3N1m9o3J09O8j72J41n6k8Q5j02M9N2l6j3k4n9
7841i0L5Q4q9N1P4p7j3M6r6J8O2o6OP0O4j57J20j7%L5k6j6K6k9m5Qj20J59j0J10
7871A17j4j81P4N9o4lJ9l0lpJ8J67r6j4K8j03J35j86NL5M5O1l5k4K6K8n3Nj28
7900a19Q5O6j3p9Q3L2j03N8Q2o1o2K5m4M4L4o3O7M4M2p8JL2j78M7m9J26n6jJ6
7929b2L0p2O9M8j45K49n4p6j8N4j5K5j69P6L9RPr8R0p1JjL5P9j09L6jM0N8p7r8
$$ plain form
7960 -81 8 -5 51 -37 102 -108 23 29 33 -1 -45 2 -31 -43 9 61 -46 71 112 9 -31 11 17 167 -50 35 -115
7987 -115 97 82 -25 -34 -112 -54 -53 -32 -19 89 -97 -5 -75 19 81 75 -8 6 -58 73 -57 -70 116 79 -33 68 4
8014 4 8 -78 -105 -16 -5 -68 48 14 16 31 -30 -25 142 80 53 6 -12 -111 -100 74 -36 -5 -15 103 16 136 13 -83 18
8043 18 17 9 -33 -11 -27 -117 -24 -119 39 56 51 38 8 -140 35 127 24 -31 -96 34 -22 -8 94 -60 25 41 50 -27 66
8072 66 -42 -95 0 -94 47 12 -58 -23 -37 49 5 -26 8 -56 -57 -12 58 -12 -8 93 114 -1 -39 22 -119 2 0 -65 -50
8101 -50 -136 -22 -73 66 -65 8 -120 99 80 -12 -17 42 -6 -46 -53 -115 38 -51 -49 -40 -18 64 31 -58 77 81 6 60 -56
8130 -56 -53 55 19 77 -44 -27 -89 -49 -25 -66 -88 -70 -42 51 11 -127 2 26 -19 -49 -36 -105 96 61 10 139 28
8157 28 48 34 -37 35 -64 -20 -2 -22 -15 28 -111 68 -14 66 12 -72 55 20 -26 57 -35 33 -1 41 -47 -19 6 -58 -10
$$ packed form
7960h1Q9j3N6q8J39k10J31OMl4m4M7l3j2N2N2j07J17M1j03m0M2OJ50k17Q5j50
7987a15K12j5j07rp8N8JK1J3J08j86R2p0R4O2oq3J4o4J31j30j3J86l7j12J01o4
8014DMq6k7Q9J1o3J16l4KJ5o1NJ67o2k7m7j8r9J1J74j10L1j0J18q7J20j23r6J01
8043A8jqm2K2j6r0R3r5J58J7nj3l0j48J75R2j03n5o5J30n6J4J02j54Q5J6Rp7R3
8072F6j08n3R5r4J41l5p0L5j4Q6m4l1L4o4jM5P0p0MJ01K1j15l8O1j41J21ko5J5
8101e0q6J14n1J39j31P3j28K19j9r2nN9m8m0po2J53q9KRK2Q2l3q9J35Mp5N4j16
8130e6LJ08l6N8j21J7o2M0K4m1k2J8K8R3m0j38J29K4m5l0J3o9K01l5n1J29j11
8157B8K0j4p1P2r9M4J8k0PM3j39J79q2Q0n4q4J27l5m6Q3r2O8l4M2q8K8K5o4M8
$$ plain form
8186 -10 16 -9 -2 45 -5
$$ packed form
8186a0K6k5PM7n0
8191e
$$ Imaginary data points
##PAGE= N=2
##DATA TABLE= (X++(I..I)), XYDATA
$$ plain form
0 0 0 0 0 0 0 0 0 0 0 0 0 0 0 8 -8 8 -8 8 -16 16 -16 24 -24 32 -35 40 -48 56 -64 73 -86 97 -112 124 -139
35 -139 161 -178 201 -224 250 -276 308 -341 378 -418 462 -510 563 -620 683 -752 829 -912 1009
54 1009 -1113 1234 -1370 1526 -1707 1921 -2177 2493 -2893 3413 -4125 5165 -6832 9949 -17861
69 -17861 85441 148227 81598 78356 -9923 -11028 -33104 -79133 -69374 -85046 -115890 -72285 -78142
82 -78142 -47374 10043 -3909 13300 45006 25581 67213 81635 57971 75025 38129 -13051
94 -13051 -16706 -60549 -59035 -27900 -51587 -33795 -14523 -32493 7868 22885 15925 51550 35197
107 35197 15612 30576 5568 20400 45843 13410 13870 -1755 -47777 -36987 -47990 -60830
119 -60830 -25209 -33033 -32983 -7625 -20792 5603 36011 20849 41153 39597 14884 37758 29553
$$ packed form
0@%%%%%%%%%%%%%Qj6J6j6J6k4L2l2M0m8N6o7P5q8J04j20J37j59J83k09K36k63
35a39L00l39L79m25M74n26N84o49P19p96Q80r72J073j183J303j435J581j741J921
54A009k122K347k604K896l233L628m098M670n386O306p538R290j1997J6781k7810
69a7861J03302O2786o6629l242q8279j105k2076m6029R759j5672l0844M3605n857
82g8142L0768N7417j3952J7209L1706j9425M1632J4422k3664J7054l6896n1180
94a3051l655m3843J514L1135k3687J7792J9272j7970M0361J5017o960L5625j6353
107C5197j9585J4964k5008J4832K5443l2433M60j5625m6022J0790j1003j2840
119f0830L5621p824N0K5358j3167K6395L0408j5162K0304j556k4713K2874q205
$$ plain form
132 29553 21644 48354 23890 4621 -2915 -45806 -43774 -35121 -52803 -28377 -24914 -34192 -2207
145 -2207 -2436 4866 39975 28384 26853 29758 257 10484 17489 297 15584 1953 -21729
158 -21729 -12599 -33677 -35634 -8004 -14380 -958 13679 -925 19388 28794 18103 35190 21275
171 21275 1532 6579 -18826 -22638 -4208 -17206 -9283 -6940 -29786 -17066 -14474 -19675 6218
184 6218 5059 5027 22654 7608 12792 29443 15496 22079 17399 -8664 -1891 -8008 -16887 2176
198 2176 -5070 -7755 1642 -18912 -16666 -4853 -14271 980 4166 -8396 6319 3457 -117 17744
212 17744 10011 8760 14478 -6564 -4907 1760 -7641 6338 5179 -8348 1210 -8106 -13400 1537
226 1537 -4918 551 9899 -4412 2273 8291 573 14134 10142 -2351 4599 -8708 -14385 -3281
$$ packed form
132B9553p909K6710k4464j9269p536m2891K032Q653j7682K4426L463r278L1985
145b207k29P302L5109j1591j531K905k9501J0227P005j7192J5287j3631k3682
158b1729R130k1078j957K7630o376J3422J4637j4604K0313R406j0691J7087j3915
171B1275j9743N047k5405l812J8430j2998P923K343k2846J2720K592n201K5893
184F218j159l2J7627j5046N184J6651j3947O583m680k6063O773o117q879J9063
198B176p246k685R397k0554K246J1813r418J5251L186j2562J4715k862l574J7861
212A7744p733j251N718k1042J657O667r401J3979j159j3527R558r316n294J4937
226A537o455N469R348j4311O685O018p718J3561l992j2493O950j3307n677J1104
$$ plain form
240 -3281 -11276 -4682 2478 -11575 -4735 -1916 -7383 8830 8160 3768 15234 5515 3298 12379 2640
255 2640 7618 9483 -7194 -4394 -8003 -16030 -3201 -6130 -8252 2408 -6746 -5898 2890 -3669 6010
270 6010 10542 -64 6023 2506 -3462 7306 2187 155 7581 -3597 -4090 214 -7637 1377 4051
285 4051 -4852 1819 -2430 -7028 3002 -1699 -772 7011 -2365 -714 2277 -4830 4445 5945 -951
300 -951 5337 -568 -5032 2362 -4404 -3102 3005 -6037 -3435 -1620 -7618 2668 4534 585 8390
315 8390 2910 303 6829 -307 2167 6700 -2127 50 -1325 -8962 -1657 -3418 -7080 -262 -5517
330 -5517 -5614 1454 -3029 2811 8801 3166 7437 5482 -1208 4911 1687 -1447 3776 -2905 -3738 -270
346 -270 -7064 -3108 -296 -5649 -702 -2224 -5783 2393 1180 1756 8560 3239 3782 5804 -1811 1549
$$ packed form
240c281p995O594P160j4053O840K819n467J6213o70m392J1466r719k217R081r739
255B640M978J865j6677K800l609q027J2829k929k122J0660r154Q48Q788o559R679
270F010M532j0606O087l517n968J0768n119k032P426j1178m93M304p851R014K674
285D051q903O671m249m598J0030m701R27P783r376J651K991p107R275J500o896
300i51O288n905m464P394o766J302O107r042K602J815n998J0286J866l949P805
315H390n480k607O526p136K474M533q827K177j375p637P305j761l662O818n255
330e517r7P068m483N840N990n635M271j955o690O119l224l134N223o681q33L468
346b70o794L956K812n353M947j522l559Q176j213N76O804n321N43K022p615L360
$$ plain form
362 1549 2333 -3078 1323 -2032 -5935 -345 -4248 -4464 433 -4759 -2344 416 -3899 2489 5332 3100
378 3100 8957 5720 1956 5457 -535 -1788 796 -5249 -3412 -2545 -7630 -2765 -2304 -4110 1485 -1154
394 -1154 -1617 4096 1157 3817 8064 3798 6371 5309 -1508 380 -2568 -6079 -2504 -6076 -6258 -1339
410 -1339 -4273 -1091 2520 -544 3517 3559 -241 4023 2804 1649 5758 1521 794 2278 -3630 -2882
426 -2882 -2305 -6319 -2218 -2168 -4167 1118 158 320 4407 715 1189 3023 -1213 1123 1960 -728 3192
443 3192 1876 -1002 1913 -1751 -2937 -400 -4109 -2623 -264 -3005 519 1276 -697 3136 1545
458 1545 -598 2492 -226 323 3215 33 1722 2653 -1346 158 -1483 -4493 -1639 -3656 -4094 -83
474 -83 -1596 535 3571 1037 3376 4021 744 2694 1301 -834 2032 -730 -1438 357 -3220 -2552
$$ packed form
362A549P84n411M401l355l903N590l903k16M897n192K415K760m315O388K843k232
378C100N857l237l764L501n992j253K584o045J837Q67n085M865M61j806N595k639
394a154m63N713k939K660M247m266K573j062o817J888k948l511L575l572j82M919
410a339k934L182L611l064M061M2l800M264j219j155M109m237p27J484n908P48
426b882N77m014M101N0j999N285r60J62M087l692M74J834m236K336Q37k688L920
443C192j316k878K915l664j186K537l709J486K359k741L524P57j973L833j591
458A545k143L090k718N49K892l182J689R31l999J504j641l010K854k017m38M011
474h3j513K131L036k534K339O45l277J950j393k135K866k762p08J795l577O68
$$ plain form
490 -2552 -1777 -4872 -2170 -1067 -2002 1974 2015 2041 5299 2737 2251 3138 -735 -366 -133 -3366 -1286 -1131
508 -1131 -2723 89 -1206 -1584 815 -1317 -458 1551 -227 1987 2662 341 2337 1242 -918 613
524 613 -1532 -2152 -70 -1938 -696 1017 -801 1217 1042 -1270 712 -610 -1752 528 -694 -87
540 -87 2093 199 1294 1804 -288 1316 516 -1441 482 -959 -1582 575 -1333 -1024 225 -2029 -941
557 -941 -382 -1485 1271 1330 759 3150 1719 1256 2246 -261 -428 -114 -2550 -1380 -1325 -2353 -77 -467
575 -467 -893 1217 -231 -87 1477 -220 1092 1950 187 1416 760 -734 592 -623 -1421 -27 -1635
592 -1635 -1192 177 -940 526 1143 -476 717 107 -1001 553 -298 -223 1297 -105 581 1280 -369
609 -369 841 804 -828 269 -662 -1564 -130 -1048 -787 451 -1076 -238 172 -984 871 1209 546 2062
$$ packed form
490b552P75l095K702J103r35L976M1K6L258k562m86Q87l873L69K33l233K080J55
508a131j592K812j295l78K399k132Q59K009j778K214O75k321J996j095k160J531
524F13k145o20K082j868J242J713j818K018j75k312J982j322j142K280j222O07
540h7K180j894J095N10k092J604q00j957J923j441o23K157j908L09J249k254J088
557i41N59j103K756N9n71K391j431m63R90k507j67L14k436J170N5j028K276l90
575d67m26K110j448J44J564j697J312Q58j763J229o56j494J326j215p98J394j608
592a635M43J369j117J466O17j619J193o10j108J554q51P5J520j402O86O99j649
609c69J210l7j632J097r31r02J434r18K61J238j527Q38M10j156J855L38o63J516
$$ plain form
627 2062 1167 533 1532 -59 -194 164 -1780 -1279 -1330 -2488 -889 -594 -921 827 363 452 1722 769 1170
646 1170 2030 652 1209 664 -921 -29 -946 -1750 -679 -1753 -1842 -687 -1407 -152 799 143 1454 1219
664 1219 336 1443 734 381 1199 -100 -131 288 -1254 -490 -314 -1366 -205 -609 -1282 216 -295 97
682 97 1239 290 614 1114 -146 662 768 -234 746 -102 -753 10 -954 -822 -26 -1046 -669 -152 -1103
701 -1103 125 510 241 1473 945 632 1331 425 471 796 -351 -32 -258 -1702 -954 -1178 -1570 -397 -918
720 -918 -751 282 -294 423 1316 747 1471 1495 307 937 372 -175 407 -499 -847 -534 -1480 -1020 -364 -932
740 -932 103 253 -165 849 454 457 1361 561 514 798 -398 -186 -207 -930 -267 -747 -1297 -455 -1050 -816 405
761 405 43 606 1066 476 1026 1038 446 1210 533 -170 215 -647 -1036 -428 -1251 -857 -665 -1443 -563 -434 -491
$$ packed form
627B062q95o34R99j591j35L58j944N01n1j158J599K95l27J748m64Q9J270r53M01
646A170Q60j378N57n45j585Q92r17q04J071j074q9J155p20J255R51o56J311k35
664A219q83J107p09l53Q18j299l1M19j542P64J76j052J161m04o73J498n11L92
682I7J142r49L24N00j260Q08J06j002R80q48o51P63r64J32P96j020L77N17r51
701a103J228L85k69J232n28l13O99r06M6L25j147L19k26j444P48k24l92J173n21
720i18J67J033n76P17Q93n69P24K4j188O30n65n47N82r06l48L13r46M60O56n68
740i32J035J50m18J014l95LR04q00m7K84j196K12k1p23O63m80n50Q42n95K34J221
761D05l62N63M60n90N50J2n92P64o77p03L85q62l89O08q23L94J92p78Q80J29n7
$$ plain form
782 -491 764 587 536 1353 622 758 1288 219 584 418 -628 -147 -639 -992 -250 -662 -819 -63 -596 -185
802 -185 369 -9 828 971 338 825 422 69 525 -276 -401 -255 -1138 -655 -397 -947 -136 -64 -276 385 221
823 221 213 921 648 980 1171 308 467 381 -432 -75 -574 -1063 -638 -1284 -1203 -371 -645 -91 432 57 610 729
845 729 304 1010 595 457 700 -44 -187 8 -656 -424 -231 -740 -362 -208 -431 401 174 253 721 123 237
866 237 270 -261 121 108 -586 -20 -442 -647 -26 -277 -299 267 -161 161 293 17 482 454 101 477 30 -203
888 -203 266 -152 -66 280 -248 -136 -60 -330 60 -152 -327 4 -418 -323 137 -246 39 417 -83 251 370
909 370 -90 357 176 84 416 -158 -112 171 -375 -73 73 -591 -113 -82 -458 14 -53 -46 432 74 -11 261 -160
932 -160 152 250 -268 199 115 -201 222 1 -106 260 -217 -58 128 -234 151 290 -8 247 55 -186 277
$$ packed form
782d91J255j77n1Q17p31J36N30j069L65j66j046M81m92l53P42m12j57P56n33M11
802a85N54l78Q37J43o33M87m03l53M56q01j25J46q83M83K58n50Q11P2k12O61j64
823B21qP08k73L32J91q63J59q6q13L57m99m89M25o46Q1Q32k74N54N23l75N53J19
845G29m25P06m15j38K43p44j43J95o64K32J93n09L78J54k23Q32k27P9M68n98J14
866B37L3n31L82j3o94N66m22k05O21k51k2N66m28L22J32k76M65k8l53L76m47k33
888b03M69m18Q6L46n28J12P6k70L90k12j75L31m22R5M60l83K85L78n00L34J19
909C70m60M47j81r2L32n74M6K83n46L02J46o64M78L1l76M72o7PM78l58q5K72m21
932a60L12R8n18M67q4l16M23k21j07L66m77J59J86l62L85J39k98K55j92k41M63
$$ plain form
953 277 -147 -88 125 -150 -220 155 -305 -88 -15 -303 110 -93 -178 172 -163 -16 375 -20 271 207 27 240
975 240 96 -162 238 -66 -197 -13 -334 -189 12 -323 -72 16 -246 176 71 49 307 136 113 417 -93
996 -93 -2 124 -310 -59 -78 -255 118 33 -93 199 -72 52 327 6 132 205 -61 85 31 -307 95 -114
1018 -114 -243 -7 -311 -123 161 -135 31 190 -60 207 -17 -158 182 -102 -52 234 -4 -30 90 -148 -47
1039 -47 105 -180 67 -27 -95 84 -153 -171 111 -288 22 99 -176 108 138 40 274 127 29 297 -72 12 104
1062 104 -204 66 11 -424 -20 -94 -262 81 -122 -20 123 -63 149 209 41 254 11 -40 265 -124 -211 46
1084 46 -124 -32 -24 -249 -125 148 -28 208 159 -59 226 55 11 226 -51 -31 137 -163 -166 -63 -267 -55 -140
1107 -140 -166 65 -148 72 148 -148 87 225 -50 192 200 -85 234 23 -132 161 -131 -235 1 -204 -113 16
$$ packed form
953B77m24N9K13k75p0L75m60K17P3k88M13k03q5L50l35J47L91l95K91o4j80K13
975B40j44k58M00l04j31J84l21J45K01l35K51Q8k62M22j05k2K58j71k3L04n10
996i3R1J26m34K51j9j77L73q5j26K92k71J24K75l21J26P3k66J46n4l38M02k09
1018a14j29K36l04J88K84k96J66J59k50K67k24j41L40k84N0K86k38k6J20k38J01
1039d7J52k85K47r4o8J79k37j8K82l99L10P7k75K84L0r8K34j47r8K68l69Q4R2
1062A04l08K70n5m35M04p4j68L43k03J02J43j86K12O0j68K13k43n1L05l89q7K57
1084D6j70R2Qk25J24K73j76K36m9k18K85j71m4K15k77K0J68l00lJ03k04K12q5
1107a40k6K31k13K20P6k96K35J38k75K42Qk85L19k11j55K93k92j04K36k05R1J29
$$ plain form
1129 16 -231 -35 -13 -95 386 194 141 197 103 156 116 25 68 -34 -183 -50 -171 -188 -11 -157 -164 91 -147 133
1153 133 178 21 170 120 65 138 13 39 159 -204 -131 -11 -320 -192 -102 -60 47 52 13 207 69 99 279 -53
1177 -53 11 87 -91 -19 -27 -184 -61 -192 -110 -56 -78 -64 254 -51 -7 124 13 72 8 121 61 4 26 52 -42 -46 -1
1204 -1 -181 -83 -31 -140 19 -83 -53 14 -7 53 86 -64 80 165 -33 57 142 -56 26 -80 -135 55 -54 -88 0
1229 0 23 117 42 -72 50 94 -113 204 147 -113 71 -37 44 -153 -194 -101 -47 -122 -81 -100 -227 53 33 -20 109
1254 109 30 73 46 -93 143 27 -83 58 -11 -123 137 -36 -23 -46 -194 -62 42 -94 130 25 59 63 23
1277 23 -24 67 -84 -57 85 -116 -12 -98 -59 42 31 -100 131 11 -20 26 -10 79 85 -35 121 15 -125 -77 -73
1302 -73 -123 1 -138 -70 -28 -62 -28 73 -48 -40 16 26 57 -57 -26 67 -1 8 22 -46 37 60 21 -32 -8 17 83 22 28
$$ packed form
1129A6k47J96K2q2M81j92n3N6r4N3m0r1M3j02j49J33j21j7J77j46pK55k38K80
1153A33M5j57J49n0n5P3j25K6J20l63P3J20l09J28R0M2J07Nl9J94j38L0J80l32
1177e3O4P6j78P2qj57J23j31Q2N4k2J4L18l05M4J31j11N9o4J13o0n7K2K6r4mM5
1204aj80R8N2j09J59j02L0O7k1O0L3j50J44Q5j98R0Q5j98Q2j06n5J90j09l4Q8
1229@K3R4p5j14J22M4k07L17n7k60J84j08Q1j97m1R3N4p5M1j9j27K80k0n3J29
1254A09p9M3k7j39K36j16j10J41o9j12K60j73J3k3j48J32J04j36K24j05L4Mm0
1277B3m7R1j51K7J42k01J04q6L9J01j1j31K31j20l1M6l6Q9Oj20J56j06j40M8M
1302g3n0J24j39O8M2l4L4J01j21QN6J0L1j14L1R3o8RJ4o8Q3K3l9n3K4K5O6o1O
$$ plain form
1331 28 14 7 19 12 -60 4 -33 -17 88 92 19 -29 37 -96 78 -43 -3 -120 -73 59 45 -92 70 2 -33 80 -91
1358 -91 96 51 68 -77 80 -57 -76 -76 66 -65 59 -14 -30 11 3 14 1 -15 6 26 27 -8 -10 10 74 -16 37 -109
1386 -109 -137 0 -57 21 59 75 62 -35 -44 29 -30 -120 -68 -44 -39 37 23 26 77 59 145 143 36 -7 -56 13 -67 -154 45 -13
1416 -13 -6 2 -10 -8 72 7 15 77 14 19 -26 -119 46 -9 33 45 -19 -45 56 -33 -12 -63 -132 62 123 -121 -47 23 29 75 -35
1447 -35 -13 -5 -132 16 114 32 55 -10 -57 11 6 -54 56 -75 46 26 13 65 -19 116 3 15 -113 1 79 16 -7
1474 -7 -15 -84 -54 -25 -42 -24 -72 4 18 6 -69 -14 -95 149 -76 43 -15 -1 -11 100 -31 -43 -19 -130 -46 114 -40
1501 -40 -64 -3 31 100 95 36 3 11 -44 32 9 -36 -16 13 -31 77 11 -46 -32 101 145 78 48 83 77 -8 -104 -3 -18 -7
1531 -7 24 48 -39 72 25 -16 15 28 -78 42 -44 -5 -63 18 50 5 35 -14 -7 -65 -92 4 76 -48 43 53 -79 -200
$$ packed form
1331B8j4pJ2pp2O4l7J6J05Mp3m8O6j33J74j21M0j17M7J32j4j37J62o8l5J13j71
1358i1J87m5J7j45J57j37j9%J42j31J24p3j6M1qJ1j3j6K1K0Jl5kK0O4r0N3j46
1386a09k8J37n7P8L8J6j3r7rP3n9r0N2K4NP6j4LN1j8Q6kj07m3m9O9q0q7J99n8
1416a3PQj2KQ0o5QO2o3Nm5r3J65n5M2J2o4k6J01q9K1n1o9J94O1k44P4P0OM6j10
1447c5K2Qj27J48R8q2K3o5m7O8no0J10j31J21k0j3N2q4J35j13J2j28J14P8o3k3
1474gqo9L0K9j7J8m8P6J4j2p5N5q1K44k25J19n8J4j0J11j31j2K4j11Q4J60j54
1501d0k4O1L4O9nn9l3Qn5P6k3m5K0K9m4J08o6n7J4J33M4o7l0L5oq5r6J01j5J1
1531gL1K4q7J11m7m1L1J3j06J20q6L9n8Q1L2m5L0m9Pn8k7R6P2j24R1J0j32j21
$$ plain form
1559 -200 11 -26 7 -25 -103 44 52 -26 133 25 -72 38 31 -53 -90 -6 52 -2 -49 -62 39 -85 -6 -42 11 -46 -90
1586 -90 -17 45 -6 26 105 10 -57 92 21 -43 54 -38 9 -63 -51 -1 9 95 19 -80 -46 48 -42 42 0 -22 -106 -60 40
1615 40 -64 69 -144 -6 8 39 3 96 -52 18 11 -32 81 -3 -44 -42 -38 -112 -31 96 -155 -6 9 78 34 -43 20
1642 20 -42 -23 -21 78 -35 -28 71 -37 -22 67 -37 64 32 -3 31 65 -121 -8 -49 -44 -17 -10 18 25 -19 30 31 -86 43
1671 43 -21 4 -92 48 -78 32 33 -65 -40 155 110 57 81 7 -26 -52 -64 -13 -24 33 -8 124 -29 -116 -37 -168 -39
1698 -39 -60 -59 -192 -5 3 61 -95 -46 32 4 6 -22 34 8 -64 -61 -15 49 -17 203 0 -72 -97 -12 -76 75 -42 28 10
1727 10 -145 25 -35 -65 -10 -100 -73 71 -31 -5 24 -66 57 -11 -75 127 2 70 1 46 24 3 -46 46 56 12 -18
1754 -18 6 -60 -2 12 -23 32 22 -55 -86 69 -83 -1 74 61 -101 -13 6 1 -103 -14 -71 -34 -130 58 69 77 32 62 108
$$ packed form
1559b00K11l7L3l2p8J47Qp8J59j08r7J10pq4l7Q4N8n4m7j3J01j24P9l6N3n7m4
1586i0P3O2n1L2P9r5o7J49p1o4R7r2M7p2J2N0J0Q6p6r9L4R4r0Q4m2k2q4M6J00
1615D0j04J33k13J38J4L1l6R3j48P0pm3J13q4m1KMp4Q1J27k51J49J5O9m4p7O3
1642B0o2J9KR9j13PR9j08J5Q9j04J01l2l5L4L4j86J13m1NK7PK8Pm4M9Jj17J29
1671D3o4K5r6J40j26J10Jr8K5J95m5n3K4p4l3k6j2N1j1N7m1J32j53q7P9j31J29
1698c9k1Jj33J87QN8j56M9P8k8Kk8N6k6p2LM6O4o6K20k03p2k5Q5o4J51j17P0j8
1727A0j55J70o0l0N5r0K7J44j02K6K9r0J23o8o4K02j25O8o9M5k2k1m9R2J0m4l0
1754a8K4o6N8J4l5N5j0p7l1J55j52Q2P5j3j62Q8J9nj04Q9n7L7r6J88J1Qm5L0M6
$$ plain form
1783 108 -58 -45 -27 25 3 -20 47 -50 -45 32 15 41 68 55 75 26 -67 34 7 -65 18 -11 -37 -130 -60 -34 -32 14 -71 -2
1813 -2 -142 54 -39 -36 -31 101 -101 37 1 -54 97 -45 -108 84 31 -120 -50 -14 68 -50 -76 -45 -6 -151 -17 -19
1839 -19 4 102 -108 -10 -5 51 -37 -89 22 -54 -21 -1 22 -57 48 -5 -46 -2 7 -27 97 100 38 -22 16 94 -90 -53 -18
1868 -18 -75 99 47 10 -19 45 -64 -52 -74 23 67 12 1 74 -25 -63 63 116 -13 -12 -140 24 38 -61 -9 -30 50 42
1896 42 -29 -21 71 9 51 -134 -2 39 163 -38 -89 -10 -34 6 46 81 -24 -38 -58 -34 36 -55 19 -10 -109 47 -2 43
1924 43 25 61 -42 -33 -102 -25 34 -19 61 31 -76 -85 94 -19 -64 -5 -7 -50 116 46 -81 -104 106 -83 -53 -8 -22 94
1952 94 -137 -93 52 61 -14 1 -15 1 15 -42 -16 94 54 81 84 -34 5 -81 -123 79 5 99 -95 -35 -23 109 56 -31
1980 -31 110 -22 -7 -52 -34 21 -72 7 -80 12 83 -49 -125 -34 -14 -66 109 -1 41 -119 21 9 -3 23 39 -112
$$ packed form
1783A08j66J3J8N2k2k3O7r7NP7j7K6K7j3K0m9r3J01k7p2Q3k9k6r3P0K6KM6q5O9
1813bj40J96r3LNJ32k02J38l6n5J51j42o3J92n3j51P0L6Q2j18k6L1L9j45J34k
1839a9K3R8k10R8NN6q8n2J11p6L3K0K3p9J05n3m1M4Rl4J24Lo2o0L8P8j84L7L5
1868a8n7J74n2l7k9O4j09J2k2R7M4n5j1P3r9l8J26N3j29Jj28J64J4r9N2k1Q0q
1896D2p1QR2o2M2j85J32M1J24k01n1P9k4M0M0L5j05j4k0K4P0r1P4k9r9J56m9M5
1924D3j8L6j03Ro9P7N9n3Q0l0j07rJ79j13m5N9km3J66p0j27k3K10j89L0M5j4J16
1952I4k31M4J45Rp5J5j6J6J4n7K6J10m0K7Lj18L9q6m2K02p4R4j94O0J2J32n3q7
1980c1J41j32J5m5J8N5r3P9q7R2P1j32p6R1K0n2J75j10M2j60J40j2j2K6J6j51
$$ plain form
2006 -112 29 -43 -31 66 -49 -27 -4 -126 -17 -56 22 58 54 -39 -53 -82 -1 16 -78 -9 -65 13 84 22 -33 62 -60 88
2034 88 68 -18 52 34 -59 25 17 74 54 -12 -36 -60 64 -72 -83 5 -49 -4 14 -5 43 -65 70 -70 -22 77 -89 24
2062 24 -34 -42 -45 51 66 35 60 127 92 3 -70 59 -39 136 23 -83 107 3 33 83 -79 -19 -90 -57 21 -120 33
2089 33 -68 -57 34 -60 -16 66 19 40 6 58 39 -1 17 51 -66 3 33 -100 55 119 66 -27 -30 -105 -78 -6 -76 -28 61
2118 61 115 22 -60 34 -19 15 -48 -89 -83 -20 -65 3 19 27 45 -42 -32 -32 -27 -20 -31 34 -52 40 8 -27 -48 94 79 75 -129 -8
2150 -8 -51 -8 -63 -13 40 14 -54 31 -42 49 -41 -137 -45 -60 35 -8 -20 -86 95 49 -17 126 -79 64 11 28 98 4 -62
2179 -62 -52 42 -18 -14 -54 12 -6 116 -24 8 -2 17 -23 95 90 -27 29 -46 -29 30 -17 -46 -34 68 -19 -20 54 -55 54
2208 54 59 36 -29 -20 74 -24 24 121 49 -135 -3 44 -2 -2 22 32 -19 30 -9 42 -14 14 -12 23 -30 18 14 -10 46 16 48
$$ packed form
2006a12J41p2J2R7j15K2K3j22J09l9P8L6mr3j4k9Q1J7r4O9n6P8P1o2n5R5j22J48
2034H8k0q6P0j8r3Q4qN7k0o6k4k4J24j36j1Q8n4M5J8j9M8j08J35j40M8R9j66J13
2062B4n8qlR6J5l1K5O7l5q9p3J29r8J75j13j06J90j04L0N0j62O0p1L3P8j41J53
2089C3j01J1R1r4M4Q2m7K1l4N2j9m0J8L4j17O9L0j33J55O4n3r3lp5K7P2p0M8Q9
2118F1N4r3q2R4n3L4o3m1OO3m5O8J6QJ8q7J0%NPj1O5q6R2l2l5k1J42j5mk04J21
2150hm3M3n5N0N3k6o8Q5p3R1r0r6R2j5R5m3j2o6J81m6o6J43k05J43n3J7P0r4o6
2179f2J0R4o0Mm0O6j8J22j40L2j0J9m0J18nj17N6p5J7N9m7k9J2J02q7jP4j09J09
2208E4Nk3o5RR4r8M8R7p2j84J32M7m6%K4J0n1M9l9N1n6K8k6L5n3M8mk4N6l0L2
$$ plain form
2239 48 -44 -33 -26 -38 -5 22 -194 39 -71 -40 77 133 43 -43 -120 -5 20 -136 -4 2 92 -3 -137 -18 -4 39 -40
2266 -40 -51 12 40 -98 93 -59 -49 -26 -67 2 80 -88 -13 77 -119 -59 0 47 74 -32 -1 17 -60 14 67 -96 104
2293 104 -79 -96 -9 -25 -21 -35 55 -2 26 56 -52 19 -37 70 185 -15 4 -18 -49 47 -14 62 -60 -33 44 -26 -5
2320 -5 30 14 26 -95 47 15 -40 -37 -99 -50 57 -11 -35 -42 54 123 20 39 42 -58 16 -7 -62 72 68 42 66 -8 -33 99
2350 99 73 25 86 -86 -8 -50 27 25 -7 -6 -29 -53 -56 1 -73 42 62 -42 -27 46 49 71 189 -20 33 53 117 -33 114
2379 114 -22 -116 -67 -58 -123 -116 -28 -59 28 -35 3 34 -73 61 92 -37 -129 77 5 29 66 35 27 -59 -50 -107 90 -56
2407 -56 42 49 48 -40 34 27 69 -61 -41 -93 36 41 23 -41 12 43 11 52 -15 81 -11 -15 -35 54 1 55 46 60 -15 -48 -39 -12 151
2440 151 -18 -55 -8 70 4 2 33 -62 -97 -48 25 -104 -5 24 -35 -91 -52 -63 -17 64 103 52 -49 14 -65 -48 -61 -23 0
$$ packed form
2239D8r2J1Pj2L3K7k16K33j10L1J17N6r0q6p7J15K5j56J32OR0r5j34J19J4M3p9
2266d0j1O3K8j38J91j52J0K3m1O9P8j68P5R0j96O0N9M7K7j06L1J8p7P4N3j63K00
2293A04j83j7Q7j6Mj4R0n7K8L0j08P1n6J07J15k00J9k2l1R6o1P6j22K7P7p0K1
2320eL5j6J2j21J42l2n5Lo2M9J07o8k4pR6O9j03J9Lj00P4k3n5J34mk6K4p4k5J32
2350I9k6m8O1j72P8m2P7kl2Jk3k4lN7p4J15K0j04J5P3LK2J18k09N3K0O4j50J47
2379A14j36r4M9Ro5PQ8l1Q7o3L8L1j07J34L1j29r2K06p2K4L7l1qq6Rn7J97j46
2407e6R8Pjq8P4pM2j30K0n2J29Nj8o4N3L1l2M1o7R6r2mk0Q9n3N4rJ4p5l3RK7J63
2440A51j69l7M7P8o6kL1r5l5M9P3j29R9K9n9n6L9j1M6Q1L9n1j01O3p9J7j3L8K3
$$ plain form
2469 0 34 63 40 -12 -51 -5 138 23 -29 27 -57 -6 49 73 -63 32 79 -87 -71 24 115 -7 -34 0 15 -135 37
2496 37 69 -19 59 -38 -18 -117 -79 -7 -10 -68 -10 -83 77 -6 24 -50 32 -12 -46 -64 -92 86 24 40 138 6 19 149 116
2525 116 61 -67 98 122 24 -158 -17 33 -133 68 -10 14 -24 40 15 -56 -60 46 30 10 106 60 -2 -48 -66 110
2551 110 -84 -89 -28 25 -97 -13 -62 37 19 -45 -79 -99 -77 88 -34 62 -44 -34 -46 -59 7 -104 -66 45 4 -66 -57
2578 -57 76 8 23 -9 33 -9 -44 -17 1 -18 -30 49 -36 88 -43 -3 1 74 30 -25 -24 126 21 -80 76 -40 13
2605 13 -27 -22 -15 -8 -45 -114 86 15 -11 65 -19 -29 -51 79 84 -9 129 14 45 43 -37 -107 -23 116 1 17 -97 -23 29
2634 29 13 6 51 38 54 8 -18 43 -75 -16 36 6 2 23 17 68 -93 25 42 53 -74 -62 27 -96 -14 46 71 -99 51
2663 51 -27 -84 -91 25 -70 60 -51 26 -63 139 -106 19 18 -124 -38 -38 -34 -67 9 4 -95 -19 -60 -14 20 82 60 -34 31
$$ packed form
2469@L4K9k3n2l9M6J43j15n2N6q4N1N5K4j36R5M7j66J6R5R1j22k7L4J5j50J72
2496C7L2q8P8r7K0r9L8P2ln8N8p3J60q3L0p4Q2m4l4j8k8J78o2J6R8j32J3J30l3
2525A16n5j28J65K4r8j82J41N0j66K01p8K4l8O4k5p1mJ06j6k0R6m6o2m6j8J76
2551A10j94nO1N3j22Q4m9R9j8o4l4k0K2J65j22R6j06J0j2j3O6j11L8J11m1p0R
2578e7J33o8J5l2M2m2l5K7J8j9j2P9q5J24j31M0MP3m4n5JJ50j05j01J56j16N3
2605A3m0NPPl7o9K00p1k6P6q4j0k2J30Nr3J38j15L1kq0p0Q4J39j15J6j14P4N2
2634B9j6pM5j3J6m6k6O1j18N9N2l0mK1oN1j61J18J7J1j27J2Q9j23Q2O0K5j70J50
2663E1p8n7pJ16r5J30j11P7q9K02k45J25jj42Q6%Ml3P6nr9P6m1M6L4O2k2r4O5
$$ plain form
2692 31 -71 16 -43 -60 -30 25 -26 84 34 -22 88 -44 0 29 -10 -16 22 20 -5 -75 77 6 16 -52 -58 -1 -138 29
2720 29 -25 32 36 -88 14 -35 22 14 35 62 117 43 -24 1 11 108 11 -21 54 43 4 -23 -17 99 -115 -13 99 -21
2748 -21 65 3 78 -83 -43 -6 -13 -33 -47 -26 8 19 32 -49 -40 20 -31 -23 58 22 12 -66 -10 -13 -28 -2 -39 36 -85 -117 -76
2779 -76 -5 25 34 32 -21 -37 -4 -1 -9 23 54 -60 91 71 -49 27 77 -35 -65 45 -45 -22 84 73 -60 60 45 198
2807 198 -10 14 -49 6 12 -27 -151 -101 32 3 53 -66 -63 58 17 52 -39 1 -9 11 -12 -89 -13 86 -51 -72 -63 -173
2835 -173 -69 59 110 90 -34 -21 72 -25 -136 -17 -1 65 -12 57 -38 -170 27 34 13 -60 -44 15 14 20 -54 -16 -75 10
2863 10 12 73 24 20 -117 172 30 38 33 -40 -95 -42 29 -48 4 6 36 50 -46 -11 -19 -75 -19 67 -41 75 60 -34 -102 -90 36
2894 36 -86 30 50 62 -62 73 -86 82 46 49 24 -62 -55 -89 33 13 -31 -3 -13 17 -75 71 -32 -39 108 35 64
$$ packed form
2692C1j02Q7n9j7L0N5n1J10n0n6J10j32M4K9l9oL8kk5p0J52p1J0o8oN7j37J67
2720B9n4N7Mj24J02m9N7qK1K7N5p4o7K5J0R7r7l2P5j1l9k7OJ16k14J02J12j20
2748b1Q6o2P5j61M0L7pk0j4K1L4J1J3q1RO0n1QQ1l6j0p8N6lj5K6l7P5j21l2M1
2779g6P1L0Rkn3j6L3LqL2L1j14J51k0j20P6N0j12l0J10r0K3J06j1j33J20j5J53
2807A98k08K4o3N5Ol9j24N0J33k9N0j19LJ21m1L5r1M0j0K0k3p7P6R9j37k1Rj10
2835a73J04J28N1k0j24J3R3r7j11J19J6O6p7O9r5j32J97Pk1p3J6N9jOp4L8n9Q5
2863A0KO1m9mj37K89j42Qnp3n5N3P1p7N2KL0J4r6L5qn6N6Q6j08J16j5r4o8J2J26
2894C6j22J16K0J2j24J35j59J68l6Lk5q6Pl4J22k0m4K8j0L0r2J46j03pJ47p3K9
$$ plain form
2921 64 -5 -19 0 -22 -133 -15 -44 -110 51 13 57 -32 82 10 -14 6 -59 -1 -79 -37 9 33 98 18 -4 -136 -60 25
2949 25 -64 -13 -1 -9 36 13 58 116 -59 -48 -26 -40 66 66 31 -75 -10 45 -128 44 67 -139 60 177 -23 19 -6
2976 -6 6 -60 -18 -83 -50 -110 -44 -45 -141 32 -123 139 23 -10 95 35 -20 99 3 7 68 1 63 -47 85 24 16 67
3004 67 -3 72 64 -81 -67 22 147 -17 -12 58 33 -29 -9 1 -35 82 -17 -13 -36 9 6 44 -45 62 53 27 -15 -25 -12 18
3034 18 -63 -144 -13 -77 -59 23 42 -13 24 88 42 21 -64 15 127 30 -165 -9 -30 -46 -22 3 62 -43 -54 52 91
3061 91 64 -132 87 5 24 59 -11 39 65 47 -1 19 -42 16 -17 -11 -42 -105 -24 23 15 17 -21 -62 -87 -66 39 -190 -101 11
3091 11 53 64 5 34 43 -48 -31 -76 -78 53 91 -6 60 -11 -70 -97 -10 -19 32 17 12 44 3 93 -6 1 15 0 -16 81 -3 -43
3123 -43 -77 44 29 -26 -61 29 -46 32 88 38 100 -27 -3 14 -71 -52 -5 13 40 -35 112 0 -98 -45 -13 17 43 0
$$ packed form
2921F4o9j4J9k2j11J18k9o6J61l8M4q9J14p2k4K0o5N8p8M2M6K4O5q0k2j32P6Q5
2949B5q9N1J2qM5k3M5N8j75J1K2j4J06%l5j06O5N5j73J72K3k06J99J17k00M2k5
2976fJ2o6M2o5L3o0O6jr6J73j55K62j16l3J05o0n5J19r6MO1o7O2j10J32o1qN1
3004F7p0P5qj45J4Q9J25j64NP0k5o2K0J0l6J17r9Mk3M5lL8q9J07rk6m2j0J3L0
3034A8q1q1J31o4J8Q2J9n5L7O4m6k1q5P9J12r7j95J56k1j6K4K5N9j05j1J06L9
3061I1k7j96K19q2J9L5p0N0K6j8m8K0o1N8l3Ol1o3Q1M7qKl8m1k5K1J05k29Q9J12
3091A1M2J1n9K9Rr1J7m5kJ31L8r7O6p1n9k7Q7rN1j5nL2m1R0r9PJ4j5j6R7q4m0
3123d3l4J21j5n5l5R0p5P8N6n0O2j27K4J7q5J9M7J8K7p5J47j12r8N3L2L0K6m3
$$ plain form
3151 0 -39 54 14 -6 -71 -14 -30 91 50 -61 -29 162 29 -32 -33 -116 36 16 22 63 11 4 11 75 85 -70 -45 13 56 -59
3181 -59 -30 -25 -81 -16 29 3 -61 -23 1 -15 35 7 71 -99 -90 93 16 -102 -39 56 -2 55 -113 -27 -24 53 41 -33 -17 -20
3211 -20 -79 67 40 -90 31 -53 -36 -1 53 -30 66 -34 -21 -156 62 -27 7 79 10 38 35 50 -13 17 -37 -3 90 68
3239 68 -84 -12 65 -103 6 161 -13 -54 57 51 28 25 -15 -10 33 -103 -34 -85 23 0 -44 29 12 -29 -24 91 9 -180
3267 -180 -21 -19 -17 -97 7 -69 -126 -23 -68 51 -74 -78 -25 -78 -46 35 80 -145 -31 -2 -19 -20 -21 -31 -150 11 52 54
3295 54 150 -63 -43 -16 17 53 -70 -34 22 -13 73 42 -134 -23 42 -6 16 0 -86 -125 45 -23 19 61 -110 75 -19
3322 -19 -87 -11 -4 70 3 30 51 -43 -84 -120 45 -9 85 6 -16 24 20 -2 54 -11 -14 -92 -75 -38 -8 108 -76 -85 -33 -19 -103
3353 -103 -103 34 -99 56 11 34 -45 34 62 -25 8 -194 21 -51 -2 22 44 116 57 27 -73 28 76 0 -76 81
$$ packed form
3151@l9R3m0k0o5N7j6J21m1j11L2J91j33o1jq3J52k0OM1n2pPO4J0j55K5N8M3j15
3181e9K9Nn6O5M5k6o4L8K4j6N0k8O4j70RJ83p7j18O3R5n8N7j68Q6LP7j2p4J6l
3211b0n9J46k7j30J21q4J7L5N4q3R6j00J3j35K18q9L4P2o9K8lJ5o3L0n4L4R3k2
3239F8j52P2P7j68J09J55j74m1J11ok3lm0NM3j36O9n1J08k3m4P3j7m1NJ15q2j89
3267a80J59KKq0J04p6n7J03m5J19j25mN3n3L2Q1M5k25J14K9j7jjj0j19J61M1K
3295E4R6k13K0K7L3L6j23L6N6l5Q6l1j76J11O5m8K2j6q6l9J70o8M2M2j71J85r4
3322a9o8P6PP4o7K7K1r4m1l6J65n4R4p9k2M0mk2N6o5lp8J7L7L0J16j84rN2J4q4
3353a03%J37j33J55m5K3p9P9K8q7L3k02K15p2M9K4K2P2n9l0j00J01M8p6p6J57
$$ plain form
3379 81 25 30 -36 11 2 27 75 -70 6 -59 51 -54 6 -20 -37 -19 -29 33 -33 61 -55 -1 -29 26 -5 28 -50 -79 51
3408 51 -5 65 -30 20 -58 43 -21 -40 -21 -11 92 118 -1 115 -125 31 -72 -68 39 26 -63 -60 -14 81 54 -78 115
3435 115 -20 57 -58 93 122 -22 23 76 -53 18 -18 -27 -97 35 40 7 22 -39 -26 -28 4 42 -18 5 -57 -123 -49 -7
3463 -7 -42 40 112 -6 57 55 53 -19 -16 6 -39 75 13 -52 -14 -93 -32 91 22 68 -13 -13 -3 61 -81 -18 32 12 65 26 -60
3494 -60 -19 -13 62 -113 33 -89 -140 10 22 -24 -169 -14 -90 25 25 25 31 53 -62 -54 -22 -40 52 -117 -22 29 152 4
3522 4 -22 64 42 -45 -78 14 -13 -18 -63 -24 -87 36 26 12 -36 -3 9 14 -75 -36 49 21 70 -128 -21 71 -24 -37 8 76
3552 76 -2 75 -122 -24 -19 -76 -117 77 30 -24 -4 18 69 52 -67 -7 -50 -77 -46 17 -37 8 20 116 -41 -15 16 -51 41
3581 41 16 -52 -12 -60 -4 76 -22 -72 49 -69 53 -32 -3 1 -50 91 -3 -12 -46 -93 48 12 66 92 -70 40 70 -25
$$ packed form
3379H1n6No6M7rK5M8j45P6o5J10j05O0k6j7J8j0O2o6R4j16N4k8N5l1L3p8k9J30
3408E1n6P0r5N0p8J01o4j9J9J0J03K6j19J16k40J56j03MJ07j3q9LM6R5k7j32J93
3435A15j35P7j15J51K9j44M5N3j29P1l6rp0J32Nl3J5o1J3kL2L8o0K3o2o6P4M2
3463gl5Q2P2j18O3kkp2LK2m5J14o2o5L8p9O1J23o9M6q1%J0O4j42O3N0k0N3l9q6
3494f0M1OP5j75J46j22n1J50J2m6j45J55p6J15%%OK2j15QL2j8R2j69R5N1J23j48
3522Dk6Q6k2q7l3R2k7nm5L9o3J23j0j4m8L3J2Nq9L9Q5k8M9j98J07R2r5j3M5O8
3552G6p8P7j97R8Nn7m1J94m7n4K0K2N1j7j19O0m3k7L1O3n4M5J2R6j57K6L1o7R2
3581D1k5o8M0m8N6Q0r8n0J21j18J22q5K9Mn1J41r4rl4m7J41l6N4K6j62J10L0r5
$$ plain form
3609 -25 8 112 -1 53 99 46 35 46 13 101 46 93 -76 43 -9 79 -57 -114 50 84 46 8 1 -11 42 -49 3 -107
3637 -107 51 111 85 38 24 -39 53 49 -16 34 -63 89 -61 -15 38 -12 -41 -104 -39 53 18 -10 -18 62 32 117 -51 94
3665 94 11 19 -4 -8 -38 74 -24 -34 -48 -88 -168 -82 -76 64 7 -56 -22 -45 -36 -79 -12 49 116 21 155 -40 -54 -17 -92 71
3695 71 -69 78 27 162 -3 -13 -67 -21 -115 -92 -60 10 2 -9 -45 -39 -18 -65 -12 -104 38 52 43 30 -82 -63 -37 23 8
3724 8 -10 22 -28 32 -121 69 22 36 48 3 -71 0 -100 -89 34 29 -45 117 -27 -36 30 116 -24 5 19 12 -91 -97 -25
3753 -25 4 -142 18 43 -93 96 34 -78 -60 -69 7 -63 -108 -68 -35 -10 -84 15 -11 -14 -75 -68 17 -117 75 -71 -10 -14
3781 -14 149 -27 80 -30 -146 -7 -22 69 55 57 11 32 23 56 7 -41 44 22 14 -75 13 -40 -30 108 -57 66 -22
3808 -22 -47 -41 30 42 -35 -42 -26 -89 -59 -1 -78 -106 -93 37 -2 25 -63 -59 5 -53 -5 -29 -32 -2 -1 -30 -1 -26 -115 21 -36 -11
$$ packed form
3609b5L3J04j13N4M6n3j1J1l3Q8n5M7j69J19n2Q8j36n7J64L4l8l8pj2N3r1N2j10
3637a07J58O0k6m7j4o3R2mo5N0r7J52j50M6N3n0k9o3O5R2l5k8qQ0l0Q5j68J45
3665I4q3Qk3ml0J12r8j0j4m0q0Q6OJ40n7o3L4k3Rm3O7O1O7r5J34j95j4L7p5J63
3695G1j40J47n1J35j65j0n4M6r4K3L2P0qj1l6OK1m7N3r2J42J4rj3j12J9K6O0j5
3724Hj8L2n0O0j53J90m7J4J2m5p4P1j00J1J23np4J62j44rO6Q6j40K9J4pj03oP2
3753b5K9j46J60K5j36J89o2j12J8rP6p0m5M0L3K5p4R9k6lo1PQ5j34J92j46O1m
3781a4J63j76J07j10j16J39j5R1j4Km6K1rL3m9m8Q5k2qq9Q8n3J0J38j65J23q8
3808b2k5OP1J2p7pJ6o3L0N8p7k8J3J30l9K7q8MO4n8M8k4lL0Jk9K9k5q9J36n7K5
$$ plain form
3840 -11 2 110 27 28 104 58 32 -75 41 -15 82 75 -56 -12 -74 58 108 -42 58 11 -33 139 -26 -81 -108 -27 19
3867 19 17 6 -2 -29 -36 -83 19 23 86 -78 46 23 72 -55 -44 14 112 -19 47 -35 47 -18 15 46 -17 97 -5 -27 -37
3896 -37 -71 68 -68 -42 46 -71 -61 36 72 -5 8 -34 142 -17 67 -77 -111 -37 -39 -65 -23 -73 -69 23 -70 16 73 -31
3924 -31 -24 15 66 -56 37 -53 -8 29 152 28 7 -76 73 29 -69 -22 -12 -3 -25 -11 21 37 2 16 -43 -79 -27 6 57
3953 57 61 -24 -40 -67 -45 -42 11 -40 63 -22 37 35 74 -66 -65 -54 9 -42 -27 84 -101 23 28 -32 -25 -36 -32 -20 -21 20 24 -59
3985 -59 86 31 83 -70 23 -9 70 73 -32 -29 -25 15 -60 58 28 -5 29 97 -49 52 64 33 45 -90 -63 33 25 1 9
4014 9 33 -91 -52 -69 -50 -91 -6 9 -101 -85 21 75 -44 8 -53 112 14 57 11 -15 -6 -14 39 -127 76 -42 -71 76
4042 76 -82 20 -62 56 86 -114 -50 69 9 48 38 -1 46 167 8 -60 -24 -46 -19 -32 -100 81 61 31 42 -104
$$ packed form
3840a1J3J08q3JP6m6k6j07J16n6R7pj31M4o2J32N0j50J00m7m4J72j65n5k7Q1M6
3867A9kj1qk7pm7J02MO3j64J24k3M9j27J1N8R8j31O6q2Q2o5L3L1o3J14j02k2j0
3896c7l4J39j36K6Q8j17J0R7L6p7J3m2J76j59Q4j44l4P4kk6M2n0MR2r3Q6N7j04
3924c1PL9N1j22R3r0M5L7J23j24k1q3J49m4r8M7J0Rk2J4L2J6l5J4n9l6N2L3N1
3953E7Mq5j6k7K2LN3n1J03q5N9kL9j40JJ1O3n1J5J11j85J24No0Pj1MJ2jM1Mq3
3985e9J45n5N2j53R3l2P9Lj05LMM0p5J18l0l3L4O8j46J01J2l1J2j35K7R6qk4Q
4014IK4j24L9j7J9m1Q5J5j10J6J06N4j19N2o1J65r8M3m6k6RqN3j66K03j18k9J47
4042G6j58J02q2J18L0k00O4J19o0L9j0l9M7J21j59o8L6k2K7j3o8J81k0l0J1j46
$$ plain form
4068 -104 11 -46 27 -37 39 -58 -9 -62 35 25 12 60 24 -88 -33 -119 39 -77 -41 86 35 -77 10 -77 33 -22
4094 -22 67 -15 -28 -7 -19 -57 -36 -100 -61 31 18 105 -3 84 45 -72 37 -66 -58 41 53 0 19 165 -45 20 141
4121 141 -44 -87 -17 4 -25 22 -16 -109 7 111 -37 -20 -24 -43 -18 -45 -63 -16 -82 90 49 22 40 77 -69 36 -32
4148 -32 24 -48 -107 69 34 51 -64 -159 15 54 -58 -73 -1 71 51 38 -107 -116 64 -55 109 30 -65 11 -122 -85
4174 -85 55 -64 -23 46 -36 12 0 106 -16 37 -3 27 14 -179 -26 -79 12 -24 67 -103 70 119 27 88 100 51
4200 51 -43 -21 2 2 55 -95 -28 -54 45 -6 76 10 -84 11 -99 30 59 71 -39 -7 -89 21 -100 -19 -13 -64 25 -83
4228 -83 -13 -2 72 33 -61 -4 -101 -103 86 28 -103 3 -30 -85 23 50 -90 15 -43 33 -73 -133 100 -31 -28 -5 7
4255 7 97 11 -2 63 24 70 -38 -50 28 -169 38 -7 75 16 6 -8 -10 94 33 18 -52 -140 32 -48 -25 73 18 -10 -29
$$ packed form
4068a04J15n7P3o4P6r7M9n3R7j0j3M8l6j12N5q6J58j16L6J27n1j12Q7q7J10n5
4094b2Q9q2j3K1j2l8K1o4L9R2j3Q7j08Q7l9j17J09j03QR9J2n3J9J46k10O5J21
4121A41j85m3P0K1k9M7l8r3J16J04j48J7mj9K5k7j8M7o6J72m1k7J8L7j46J05o8
4148c2N6p2n9J76l5J7j15r5J74L9j12j5P2P2k0j3j45rJ80j19J64p9r5P6j33L7
4174h5J40j19M1O9q2M8j2J06j22N3m0L0j3j93J53n3R1l6R1j70J73M9r2O1J2m9
4200E1r4K2K3%N3j50O7k6R9n1Q2o6r4R5j10J29K9J2j10L2q2J10j21Q1On1Q9j08
4228h3P0J1P4l9r4N7r7kJ89n8j31J06l3n5J08K7j40J05n8P6j06o0K33j31LK3J2
4255GR0q6j3O5l9M6j08j2P8j97K07m5Q2n9j0j4kJ04o1j5p0q8J72q0K3R8n5k8j9
$$ plain form
4284 -29 -29 -45 -17 -23 24 92 -78 1 -50 56 89 31 -121 -67 83 75 -102 -58 32 -90 -57 92 19 -16 -56 -104 -39 -113
4312 -113 -33 -54 -5 -65 -71 -118 -16 16 -49 46 72 -13 107 -11 68 -7 -131 12 -71 -96 -16 39 89 47 23 -121 -38
4339 -38 -41 -64 -3 -50 -91 -34 -27 -50 1 110 -15 11 -5 -12 1 9 81 -12 -44 -55 -43 -20 83 4 -133 14 -45 35 52 71
4369 71 7 -53 -80 -12 -96 42 -98 6 -58 -13 -12 -22 -26 -4 -80 49 -62 -74 2 -54 40 20 4 -12 79 40 -52 46 -94
4398 -94 -31 56 -76 -95 20 -1 7 -65 -16 -39 14 -107 -37 -56 -1 16 -30 -11 60 15 14 -77 74 15 -120 26 13 3
4426 3 -12 -14 53 -46 -5 -53 39 -39 86 90 -13 5 -53 -168 39 -27 -17 89 -6 51 13 64 49 -113 -51 -5 13 -2 -45
4455 -45 -29 -75 -20 -82 55 21 -48 22 -85 50 -26 -67 -4 -88 3 11 43 -37 -12 69 -41 59 36 54 88 -23 -6 -38
4483 -38 4 65 -84 -2 -1 -5 -38 -38 -54 25 -5 -73 -76 26 17 -21 55 -63 -24 -78 -43 56 -53 22 -30 58 -7 25 40 23 -73
$$ packed form
4284b9%j6K8oM7O8j70P9n1J06L3n8j52N4J50qj77M4R0j22L3J49p3l5m0m8O5p4
4312a13Q0k1M9o0om7J02L2o5R5K6q5J20j18P9p5j24J43q3k5Q0N5N0m2k4j44Q3
4339c8lk3O1m7m1N7Pk3N1J09j25K6j6pJ3QP2r3l2j1J2K3J03p9j37J47n9Q0J7J9
4369G1o4o0k7O8q4J38j40J04o4M5Jj0mK2p6J29j11j2P6n6R4k0j6j6R1l9r2R8j40
4398i4O3Q7j32j9J15k1Qp2M9k3N3j21P0j9N5J7m6J9P1m5jr1J51n9j35J46j3j0
4426Cj5kO7r9M1m8R2p8J25Mj03J8n8j15K07o6J0J06r5N7l8N1j5j62O2M6J8j5m3
4455d5J6m6N5o2J37l4o9P0j07J35p6m1O3q4R1QL2q0K5Q1j10J00k3J8L4j11J7l2
4483c8M2O1j49Q2Jml3%j6P9l0o8lJ02rl8P6j18L9n4L5R9j09P5n2Q8o5L2J5j7r6
$$ plain form
4514 -73 -16 -4 114 -1 73 89 -57 8 130 16 -67 -21 22 26 10 7 48 -2 -24 13 -72 -31 -5 20 -22 11 23 47 82
4543 82 3 -33 37 52 -23 -9 64 -52 60 -88 71 -71 -101 -85 -68 -27 1 64 -79 27 -37 12 -65 74 13 34
4569 34 -11 99 43 -29 117 36 18 -27 16 -105 -50 -58 11 -134 118 59 -6 6 -82 117 -44 2 15 -71 117 30 95
4596 95 -115 96 38 118 -34 -1 84 -5 -21 -21 -3 -34 -3 47 -40 -87 1 -3 -113 14 31 4 -52 -87 -52 45 35 -7 78
4625 78 -103 2 -96 -69 3 -64 62 21 19 -11 -59 -30 9 50 5 -15 -14 104 22 -26 3 -83 -33 39 -46 -55 22 79 88 72
4655 72 -48 -36 7 -32 42 -43 29 -74 22 -68 1 -10 -56 27 -89 -61 -73 -11 58 -13 90 -1 36 -60 52 19 27 51
4683 51 35 -36 -2 -123 30 -102 -174 13 12 -25 49 26 62 -27 -11 62 51 22 -14 -22 26 -8 -39 16 37 -40 -8 -34 -40 58
4713 58 -107 74 14 4 16 28 -37 -78 -108 -72 36 14 49 49 -9 94 -44 34 10 -1 7 68 -11 30 8 -26 -93 -50 -5
$$ packed form
4514g3N7J2J18j15P4J6j46O5J22j14q3M6M3Mj6lM1n0k2L7q5M1K6K5m2L3J2K4L5
4543H2p9l6P0J5p5J4P3j16J12j48J59j42l0J6J7M1K8O3j43J06o4M9p7J39o1K1
4569C4m5J10n6p2J46q1j8m5M3j21N5qO9j45K52n9o5J2q8J99j61M6J3q6J88q7O5
4596I5k10K11n8Q0j52L3Q5q9j6%J8l1L1N0q7m7Q8mj10J27J7k7n6l5L5R7j0m2Q5
4625G8j81J05r8K7P2o7J26m1kl0m8K9L9M1m5k0JJ18q2m8K9q6N0P2q5rP7N7Rj6
4655G2j20J2M3l9P4q5P2j03R6r0O9j1m6Q3j16K8j2O2O9p1J03r1L7r6J12l3QK4
4683E1j6p1L4j21J53j32p2J87jl7P4k3L6q9J6P3j1k9l6qM8l4l1N5K1p7L2k6oR8
4713E8j65J81o0j0J2J2o5m1l0L6J08k2L5%n8J03j38P8k4j1QO1p9M1k2l4o7M3M5
$$ plain form
4742 -5 -83 67 -3 -38 90 -59 64 61 93 -11 27 11 -53 29 -50 -46 -43 19 -126 -5 4 -44 -23 -36 21 116 15 58 24
4771 24 68 113 -10 -95 90 12 5 -57 -14 -61 -53 -8 116 68 19 -109 -151 41 -44 73 -42 142 -88 -12 49 -17 -51
4798 -51 71 -11 -63 80 15 -35 39 37 -97 -34 16 -42 -22 -15 3 -25 19 58 9 30 37 -35 -91 -22 91 -10 33 -60 -46
4827 -46 125 12 41 -45 55 72 -69 -43 -112 -6 -65 70 -81 31 -62 24 -29 -19 -34 -79 40 103 137 -10 -25
4852 -25 -111 -23 -17 56 8 -41 93 -14 14 -27 -36 -55 -1 70 -3 38 17 18 98 97 33 -3 34 32 14 -19 -3 6 -60 -70 -65 -96 39
4885 39 -100 67 77 34 5 84 -21 -31 -5 -72 4 14 16 -77 87 73 14 108 -39 75 -36 -31 -56 -64 3 -57 -31 -29 24
4914 24 -54 -91 -47 -95 -135 18 10 -89 -1 -8 3 -70 15 94 -72 -11 73 -25 47 -66 86 44 -46 -16 18 -28 70 28 33 4
4944 4 -52 24 -26 22 -4 -1 52 -25 -28 16 15 47 12 11 116 22 -17 -129 -15 -30 -17 49 83 -89 -11 58 6 -17 58 -19 7
$$ packed form
4742ep8J50p0l5J28j49J23lL2j04L8j6o4Q2p9MLO2j45J21Rm8K1j3N7R5j01M3l4
4771B4M4M5j23q5J85p8po2M3m7QM5J24m8m9j28m2J92q5J17j15J84k30P6O1o6l4
4798e1J22q2n2J43o5n0P4kj34O3N0n8K0PJ8k8M4L9m9K1Pp2n6O9J13j01M3r3J4
4827d6J71j13K9q6J00J7j41K6o9J06n9J35j51J12r3Q6n3J0j5m5J19O3L4j47j5
4852b5q6Q8OP3m8m9J34j07K8m1rj9N4P1p3M1k1JQ0jo4l6L7kj8l3J6Ro6j0Nl1J35
4885C9j39J67J0m3k9P9j05j0K6o7P6J0Kr3J64j4n9R4j47J14j11Nk5qO7o0K6KN3
4914B4p8l7M4m8m0J53qr9Q8pJ1p3Q5P9j66O1Q4r8P2j13J52m2r0L0L4m6R8m2Nk9
4944Dn6P6n0M8k6LN3p7lM4jL2l5jJ05r4l9j12J14j5J3O6L4j72P8O9n2k3P5p7K6
$$ plain form
4975 7 -24 -12 -9 -77 -47 25 -22 0 -15 -22 -5 31 66 -35 -60 -4 17 -97 9 -61 -25 -115 -21 -58 11 -107 -16 -95 -95 -9
5005 -9 48 -50 60 -31 58 89 32 -55 -8 -11 -20 -6 11 81 15 -38 -50 14 -36 103 -100 80 -48 48 -77 44 2 20
5033 20 7 -21 30 -49 52 -140 -23 -151 -5 -58 72 63 -6 -52 -52 52 -40 32 -24 -43 -42 56 61 -48 32 47 -95 55
5061 55 -85 116 29 -42 -90 39 22 7 11 -94 -25 20 5 30 -34 -99 -21 -84 31 -47 30 18 47 -69 5 4 -79 69
5089 69 -36 -55 -68 5 148 -69 25 16 -36 61 20 -30 51 21 -43 15 90 -101 -68 -82 16 62 -88 51 23 8 -140
5116 -140 -166 -19 75 -43 19 8 4 -14 32 -11 9 14 -25 39 -10 1 38 -36 -60 9 -22 16 -55 71 -14 -135 22 -43
5144 -43 -38 -25 50 3 -26 -78 -67 20 21 14 45 55 -27 76 30 -9 25 33 81 30 -52 -66 0 47 -15 -87 -52 26 -70 -20 23 -8
5176 -8 30 5 -50 0 -13 52 -29 63 2 9 9 53 59 -145 93 -58 23 -22 30 -2 22 18 -131 82 -143 43 -73 -102 36
$$ packed form
4975Gl1J2Lo8L0P2m7K2j5pJ7L6L5j01k5N6K1j14J06p0L6r0R4l7O9j18R1p9%Q6
5005iN7r8J10r1Q9L1n7q7M7lrJ4J7P0o6n3j2O4n0J39k03J80j28R6j25J21m2J8
5033B0j3k8N1p9J01j92J17j28J46n3J30ro9m6%J04r2P2n6j9JR8Nj09Q0J5j42J50
5061E5j40K01q7p1m8J29j7j5Mj05O9M5j5K5o4o5P8o3J15p8P7j2K9j16P4jq3J48
5089F9j05j9j3P3J43k17R4rn2R7m1n0Q1l0o4N8P5j91L3j4R8M6j50J39k8j5j48
5116a40k6J47R4j18O2j1mj8M6m3K0Nl9O4m9J1L7p4k4O9l1L8p1J26q5j21J57o5
5144d3NJ3P5m7k9n2J1Q7JpL1J0q2J03m6l9L4QM8n1q2j4O6M7o2p2L5P8r6N0M3l1
5176hL8k5n5N0j3O5q1R2o1P%M4Ok04K38j51Q1m5N2l2K4mj49K13k25J86j16k9J38
$$ plain form
5205 36 58 -8 -78 -91 19 40 12 52 41 -103 39 71 -82 69 -79 -68 47 -66 33 -20 10 -57 -2 31 23 56 16
5232 16 78 26 -110 17 -46 -57 -85 26 15 -47 -72 -157 68 -118 -51 -108 -79 68 26 37 -19 8 -19 -62 -20 17 -25
5259 -25 -45 -44 -151 -89 92 62 -55 8 -20 -11 -47 -94 -30 20 9 -28 58 39 -48 75 106 -75 -69 22 -78 -52 17 92 24
5288 24 119 -48 -32 -27 -43 15 35 -6 23 59 -8 7 -38 38 11 -16 -14 39 80 -62 81 -28 49 -64 -107 151 -4 -30
5316 -30 3 61 -39 -14 -73 -33 15 -13 -71 -73 -29 63 117 55 189 -163 -24 -25 4 48 -24 -100 19 -17 -35 13 -8 -35 21
5345 21 24 10 -110 9 33 7 -69 4 96 59 81 -124 146 -9 -70 -81 -68 -55 -79 42 -88 -5 -1 -19 -2 -19 -35 18
5373 18 -26 -87 -21 -68 -20 -12 -15 -100 30 -77 -25 41 68 -17 -48 -43 33 -29 -8 22 -51 -18 -76 44 3 -65 33 -66 125 -22
5403 -22 -14 35 -69 -48 -26 12 44 16 33 126 -135 112 -105 -32 15 -20 -90 -30 -28 18 49 -13 -37 -69 -56 -44 1 -46 -53 -16
$$ packed form
5205C6K2o6p0j3J10K1k8M0j1j44J42L2j53J51j48J1J15j13R9n3L0o7N5L3qL3m0
5232A6O2n2j36J27o3j1k8J11j1o2k5q5K25j86O7n7K9J47m2J1n6K7k7m3M2L7m2
5259b5k0Jj07O2J81l0j17O3k8Rl6m7O4N0j1l7Q6j9q7J23L1j81OR1j00K6O9P5o8
5288B4R5j67J6Nj6N8K0m1K9L6o7J5m5P6k7k7KN3M1j42J43j09P7j13m3K58j55k6
5316c0L3N8j00K5n9M0M8k8n8kM4R2N4o2J34l52J39jK9M4p2p6J19l6j8M8k1k7N6
5345B1Lj4j20J19K4k6p6P3R2l7K2k05K70j55o1j1J3J3k4J21j30Q3Mj8J7j7j6N3
5373A8m4o1O6m7M8Qlq5J30j07N2O6K7q5l1NP6o2K1L0p3L3n8J20m1o8R8r9J91j47
5403b2QM9j04K1K2L8L2k8J7R3k61K47k17P3M7l5p0O0KM6L1o2k4l2J3J2M5m7pL7
$$ plain form
5433 -16 -34 69 -14 -68 -28 -39 15 -34 -62 39 83 14 99 -47 -25 -15 113 -48 -6 3 54 37 -58 -48 31 -8 1 54 -29
5462 -29 -1 87 84 94 -32 3 -38 -5 86 -94 34 55 127 -17 64 -18 -97 -37 -16 42 98 6 -46 -31 71 -18 4 23
5490 23 21 2 -79 -52 6 -7 -34 -8 -41 154 42 107 25 -85 41 -12 24 -47 1 -36 34 145 80 -48 -64 -71 -66 -115 38
5519 38 -26 32 -1 -31 -10 -1 29 64 -44 -24 29 -47 -22 31 80 -58 25 12 67 24 28 25 2 -33 -35 22 20 -71 -25 90 -32
5550 -32 -34 -47 -24 -18 -14 -4 19 -136 -44 55 17 43 -45 9 113 -34 35 -77 27 -92 4 -5 -59 27 -32 -33 28 -126 49
5579 49 -50 -115 -51 -4 61 14 -66 95 -31 -80 -51 -3 10 -30 -85 -40 -17 -32 -60 106 118 -23 39 56 -46 -53 -15 38
5607 38 80 32 131 42 40 -113 35 101 54 -71 -12 -2 43 -38 -65 -39 -42 -38 -118 -1 -101 -72 -103 -28 59 54 -45 84 13
5636 13 -82 46 49 -104 54 -76 82 -79 70 57 -48 80 39 -38 51 -9 31 58 193 79 -36 74 14 68
$$ packed form
5433a6j8J03q3n4M0j1N4m9k8J01M4o9Q5j46K2J0J28j61M2RN1j7r5J0P9l9RN3q3
5462b9K8Q8lJ0j26L5m1L3R1j80J28K1P2j44Q1q2p9O0K1N8N6r2n2J5J02q9K2J9
5490B3kj9q1K7N8j3k7K6l3J95j12O5q2j10J26n3L6p1M8l7P0J11o5j28j6pNm9J53
5519C8o4N8l3l0K1RL0L5j08K0N3p6K5N3M9j38Q3j3N5m3Mlk3l5kN7kr1M6J15j22
5550c2kj3K3OMJ0K3j55R2R9l8K6q8N4J04j47O9j12J04j19R6rn4Q6n9jO1j54J75
5579D9r9o5O4M7O5m7q0J61j26m9K9M8J3m0n5M5K3j5k8J66J2j41O2J7j02pL8N3
5607C8M2m8R9q9kj53J48O6m7j25N9J0M5q1k7K6lMq0J17j00K9l1P5Q7nr9J29p1
5636A3r5J28Lj53J58j30J58j61J49j3j05J28m1p7Q9o0M0K7J35j14j15J10o0N4
$$ plain form
5660 68 -11 -42 -59 -42 121 32 64 77 -23 -33 18 78 56 -34 19 21 -62 82 16 -22 -97 -25 -51 94 19 55 25 -81
5688 -81 -27 9 -58 -87 173 -27 12 31 -23 -56 -37 -75 -21 68 -10 -89 -60 -3 -32 -58 -73 25 33 118 -66 -100 -73 -10 56
5717 56 -14 -22 38 52 -63 -61 9 -40 19 43 -59 -74 -84 60 -49 37 34 -13 43 12 -61 -77 61 52 38 -25 15 -89 101
5746 101 7 -41 32 -61 -32 59 -24 -2 -5 -47 -53 -32 70 -22 -9 14 -30 -30 -59 37 10 -14 -65 33 -97 -25 -15 13 29 -103
5776 -103 29 33 -68 -50 -64 56 18 26 -78 -2 76 -1 58 -114 -99 20 -41 13 2 -94 3 11 -71 31 30 -114 -47 -74
5804 -74 38 -6 36 24 18 -85 -30 50 -30 -62 6 44 26 -28 -2 49 -26 -87 11 12 4 -37 9 63 43 13 -99 14 -22 -8
5834 -8 11 31 29 -76 7 46 -17 24 65 21 -93 5 43 1 69 -58 86 -45 -67 -49 93 2 -111 -56 -97 17 35
5861 35 -8 -25 -94 -13 97 -40 -122 -75 13 -15 0 -2 72 7 -15 -3 37 111 -48 -20 24 -47 62 29 -81 9 45 -29
$$ packed form
5660F8p9l1j7J7J63q9L2J3j00j0N1O0k2r0N3Kq3J44o6l8p5P2k6J45p5L6l0j06
5688h1N4L6o7k9K60k00L9J9n4l3J9l8N4Q9p8p9K9N7k9k6j5R8QQ5j84l4K7O3O6
5717E6p0qO0J4j15KP0m9N9K4j02j5j0J44j09Q6lm7N6l1p3j6J38rj4o3M0j04J90
5746A01r4m8P3r3K9R1q3K2lm2oK1J02r2J3K3m4%k9R6k7k4n1R8j30P2J0K8J6j32
5776a03J32Mj01J8j4J20l8Qj04P6P8p7N9j72J5J19o1N4j1r6R7Qq2J02jj44O7k7
5804g4J12m4M2j2oj03N5Q0q0l2O8L8j8n4K6N1p5o1R8Jqm1M6N4k0l0j12J13l6J4
5834hJ9K0kj05Q3L9o3M1M1m4j14R8L8m2O8j27J44j31k2J8J42r1j13N5m1J14J8
5861C5m3j7o9Q1J10j37q2M7Q8k8J5kP4o5k2J2M0P4j59K8M4p1J09l3j10R0L6p4
$$ plain form
5889 -29 -16 17 -128 77 63 18 -78 -77 -71 -86 56 26 14 -94 35 -10 -13 -3 -41 56 47 24 -112 16 -30 -46 -12 21 33
5918 33 -19 -123 -4 68 -72 68 -16 60 -87 -142 27 34 21 117 -73 -79 -43 48 -9 25 34 -12 -11 -36 95 -6 14 -55
5946 -55 -117 -49 -16 58 -5 54 16 -16 96 2 13 72 -85 45 4 31 -18 -68 -10 -18 51 -29 -20 81 -17 29 -11 -106 -46
5975 -46 -17 -8 -19 -173 96 -3 -23 -68 -96 49 -33 -27 62 -85 124 -55 -11 -112 -62 -135 -129 0 -1 32 -71 43 7
6002 7 -10 -2 -28 3 -141 176 -16 35 34 8 97 37 30 -18 -123 5 16 75 -18 28 -10 104 31 72 -57 35 -12 -19 40
6031 40 87 7 7 2 56 -38 19 -55 55 39 -34 26 -10 40 58 -66 -52 49 -20 -76 -9 9 18 -30 -1 -48 -21 -21 -57 77
6061 77 -55 -2 -113 -16 -128 -33 52 -76 30 117 -76 -34 -51 48 73 -46 97 5 -12 -21 -59 43 34 -133 44 -7
6087 -7 -82 110 -49 -7 -21 13 25 -1 -11 18 12 75 -43 0 48 -61 53 -4 82 -24 27 64 -60 -90 25 35 -122
$$ packed form
5889b9J3L3j45K05j4m5r6JOj5J42l0j2j08J29m5lJ0l8R7rk3j36J28m6j6L4L3J2
5918C3n2j04J19P2j40J40q4P6j47n5J69Pj3R6j90oL6R1n7L4Rm6Jk5J31j01K0o9
5946e5o2O8L3P4o3N9l8l2J12r4J1N9j57J30m1K7m9n0N8qO9q0RJ01r8M6m0r5O0
5975d6K9Rj1j54K69r9k0m5k8J45q2OQ9j47K09j79M4j01N0p3OJ29jL3j03J14l6
6002Gj7Qk6L1j44L17j92N1jk6Q9o0pm8j05J28J1N9r3M6l8J14p3M1j29R2m7pN9
6031D0M7q0%nN4r4N7p4J10j6p3O0l6N0J8j24J4J01o9n6O7J8Rm8K9m7K7%l6J34
6061G7j32N3j11R7j12R5Q5j28J06Q7j93M2j7R9K5j19J43r2j7rl8J02rj67J77n1
6087gp5J92j59M2j4L4J2k6j0K9oO3j18M3M8j09J14n7Q6j06N1L7j24l0J15J0j57
$$ plain form
6114 -122 47 -31 -7 7 48 -79 28 51 -67 60 22 -28 27 24 -63 53 -13 -19 0 41 20 56 -119 -13 -12 -28 13
6141 13 -1 -118 63 -5 -23 -36 -67 74 77 -117 26 13 71 -72 10 -14 67 -70 -132 41 15 75 99 51 30 -129
6167 -129 -68 -47 -23 -92 -10 70 25 -49 13 -18 103 33 -89 75 -74 39 -1 32 -21 -1 -11 -13 -8 -43 32 -112 -51 -92
6195 -92 48 -56 19 -61 55 -61 -32 -33 -51 -39 -106 96 100 57 12 -32 -41 3 -51 29 3 -9 19 69 22 94 -110 -39 25
6224 25 29 107 -4 102 8 71 47 -24 -82 60 7 -72 19 -11 -43 -53 -44 110 22 -96 -1 -53 -16 57 -11 28 -101 -52
6252 -52 5 -30 -49 -62 99 -55 -20 85 81 -110 -34 -18 -55 13 65 -28 11 13 -47 61 3 3 -13 -25 -33 42 -42 -4 131
6281 131 -19 -57 -77 145 -44 35 45 17 32 -39 -36 122 -18 -66 22 -36 -61 -15 -127 1 -76 -11 63 10 -71 -42 -76
6308 -76 44 -29 -20 -56 -18 79 50 -29 -56 -29 47 28 -16 -47 53 -98 -14 -57 -33 37 11 43 -99 88 6 53 61 -42
$$ packed form
6114a22J69p8K4J4M1j27J07K3j18J27l8n0N5lq7J16o6oJ9M1k1L6j75J06Jj6M1
6141A3j4j17J81o8j8j3l1J41Lj94J43j3N8j43Q2k4Q1j37o2J73k6O0K4m8k1j59
6167a29O1K1K4o9Q2Q0m5p4O2l1J21p0j22J64j49J13m0L3n3K0j0kNl5P5j44O1m1
6195i2J40j04P5q0J16j16K9jj8J2o7K02Mm3m5m4rM4n4Q0k6j2K8N0m7P2k04P1O4
6224B5MP8j11J06r4O3k4p1n8J42n3p9R1l0l2j0RJ54q8j18R5n2L7P3o8L9j29M9
6252e2N7l5j9j3J61j54L5J05mj91P6J6l7O8N2r3L9Ko0J08n8%j6j2qP5q4L8J35
6281A31j50l8k0K22j89P9J0k8J5p1LJ58j40m8Q8n8k5M6j12J28p7O5P4n3q1K9l4
6308g6J20p3Rl6L8R7k9p9k7K7P6j9m4l1J00j51Q4m3K4P0k6L2j42J87q2M7Qj03
$$ plain form
6336 -42 -96 38 -15 55 3 33 -65 2 10 90 -60 -90 104 53 30 -77 -11 14 32 -31 -28 -9 24 107 -83 -78 56 -71
6364 -71 -42 -6 17 14 -29 2 54 -68 2 72 -65 39 20 -46 53 -60 -11 66 41 -16 -38 -49 -34 72 1 -66 -50 -73
6392 -73 -44 90 5 2 -48 45 66 63 75 34 -101 40 16 -48 68 -14 22 -39 15 18 -54 -50 -6 -6 -106 -32 -59 -41 -52 -26
6422 -26 -55 -19 -117 -77 143 26 35 36 -51 7 33 61 106 94 33 87 -22 55 -79 -40 -73 5 -59 -55 75 3 46 -4 -62
6451 -62 49 139 -13 -89 33 10 65 8 -74 -18 -3 -35 18 37 -78 -49 -57 -75 -25 102 47 35 -56 -23 -75 0 32 30 18
6480 18 37 -77 -58 138 -117 23 -52 -70 23 -29 -13 -4 61 -61 16 -48 1 -42 63 -55 -31 -7 -12 -35 37 35 -31 -25 -51
6509 -51 94 -40 -39 -27 1 79 85 -21 32 -53 60 -185 87 2 -58 35 8 47 30 -20 -81 95 20 36 -11 0 -56 -63
6537 -63 -63 20 -72 131 12 10 -50 82 6 -63 -31 -100 3 -54 42 -95 12 -46 -32 19 -16 1 -161 10 3 -64 -37 -36
$$ packed form
6336d2n4J34n3P0n2L0r8O7QQ0j50l0J94n1k3j07O6K5J8o3LJ9L3Q3j90NJ34j27
6364g1K9L6K3lm3L1N2j22P0P0j37J04j9o6R9j13M9P7k5n7k2j1J5J06p1o7J6k3
6392g3K9J34q5ln0R3K1lJ2m1j35J41k4o4J16q2L6o1N4Lp2MM4%j00P4k7J8j1K6
6422b6k9L6r8M0K20j17RJq7N8K6K8M5j2o1N4j09P7j34L9l3P8o4MJ30p2M3n0n8
6451f2J11R0j52p6J22k3N5n7q2N6J5l2N3J9j15K9qj8N0J27n5j2r1L3n2P5L2kj2
6480A8J9j14J9J96k55J40p5j8R3n2J6RO5j22P7o4M9m3J05j18K4K4nk3P2ko6Ok6
6509e1J45j34JJ2K8P8Oj06N3q5J13k45K72q5o0R3k7L9j7n0o1J76p5J6m7J1n6p
6537f3%Q3r2K03j19ko0J32p6o9L2o9J03n7R6j37J07n8J4N1l5J7j62J71po7K7J
$$ plain form
6565 -36 52 132 22 25 -8 -49 32 113 25 34 -64 18 -13 20 11 101 112 -39 90 -26 -13 -24 45 -21 33 -101 -138 22 -83
6594 -83 -42 47 4 -24 36 78 67 -36 82 -10 14 104 -26 56 7 -38 71 -2 11 -24 110 65 8 2 -93 43 37 -55
6622 -55 40 -43 62 -62 12 99 -35 50 -32 42 -58 14 -27 40 10 -14 179 -15 94 -100 48 -84 -56 -42 -56
6647 -56 65 -49 23 -88 -32 -6 -5 24 -56 82 -66 -62 26 -50 -104 73 52 -56 56 42 25 -6 -115 54 18 -2
6673 -2 25 -72 15 37 -92 -3 -22 -5 -90 25 -45 54 62 -56 34 -59 22 0 23 7 -183 78 10 7 0 66 6 53 -68
6702 -68 -69 -19 -48 -43 31 -20 -65 -26 19 -32 76 -1 2 -7 -33 37 -30 -62 -87 -58 21 58 71 22 -23 -45 -12 -22 -66 17 77 -44
6734 -44 64 67 77 62 -34 17 9 102 -117 27 59 -6 30 58 -7 -133 -37 -9 -35 -172 -56 -22 53 32 -40 31 -88 56
6762 56 -101 -38 38 -28 70 119 71 15 -67 -20 -19 5 -11 -56 13 -15 -107 -120 6 63 -89 -92 60 -11 -53 -12 28 129 41
$$ packed form
6565c6Q8Q0j10Ll3m1Q1Q1q8Rr8Q2l1L3rR0J1j51J29j16J3j1O9o6N4j34l7J60j05
6594h3M1Q9m3k8O0M2j1j03J18r2K4R0j30Q2m9m5J09p3J3l5J34m5n7or5J36or2
6622e5R5q3J05j24P4Q7j34Q5q2P4j00P2m1O7l0k4J93j94J09j94J48j32K8J4j4
6647e6J21j14P2j11N6K6JK9q0J38j48MQ8p6n4J77k1j08J12j4j7l1j09J69l6k0
6673bK7r7Q7K2j29Q9j9J7q5J15p0R9Qj18R0r3Q1k2K3j6j90K61o8lpO6o0M7j21
6702f8jN0k9NP4n1m5L9M5n1J08p7Lrk6P0o7l2k5K9P9L7J3m9m5k2L3j0m4Q3O0j21
6734d4J08LJ0j5r6N1qR3k19J44L2o5L6K8o5j26R6K8k6j37J16L4P5k1p2P1j19J44
6762E6j57O3P6o6R8M9m8n6q2M7JK4j6m5O9k8r2j3J26N7j52lJ52p1m2M1M0J01q8
$$ plain form
6791 41 -104 59 17 16 -2 20 6 83 -40 -58 -104 -20 -56 111 -146 -66 91 -43 11 -27 6 88 78 41 -13 -2 -20
6818 -20 -57 34 24 79 -101 42 -85 -54 -68 6 116 -59 -1 27 -172 -111 20 -54 1 31 -79 28 -19 46 -49 -14
6844 -14 -35 -44 -23 -80 37 -164 -95 -108 -26 22 -22 37 -5 38 101 0 -57 -112 -43 65 56 53 -75 97 -15 9 -1 15
6872 15 59 -71 5 -56 73 -123 -102 -65 92 -47 -13 -53 -76 -32 -43 -25 71 -45 86 -78 -81 -36 81 153 28 1
6898 1 -40 0 4 -15 93 -4 -46 80 -27 -9 53 -17 -22 24 34 -72 -46 -67 48 -70 23 47 23 120 -32 -27 13 28 15
6927 15 -53 10 -24 16 -40 53 2 -2 27 81 11 -72 -13 -9 -77 -56 44 11 46 -11 -59 90 -43 -152 1 34 -48 -52 -75
6956 -75 47 -7 -23 49 83 -11 -22 -43 19 10 -28 48 -11 113 28 -33 26 34 -75 68 23 -45 -30 27 10 -16 25 -2 -64
6985 -64 -44 31 -21 89 21 -17 -48 36 -48 -150 87 -89 70 17 -20 -19 43 -51 -11 -10 -19 17 34 37 64 -34 -13 75 30 149
$$ packed form
6791D1j45J63m2jj8K2j4P7j23j8m6Q4l6J67k57Q0J57j34N4l8L3Q2j0l7n4J1j8
6818b0l7R1j0N5j80J43j27L1j4P4J10j75N8K8j99O1J31p4N5L0j10J07m7O5r5L5
6844a4k1rK1n7J17k01O9j3Q2M8m4N9m2M3O3j01n7n5O9J08rlj28J72j12K4j0J6
6872A5M4j30P6o1J29j96K1L7J57j39L4m0k3M4j1J8R6j16J31j64lM5J17P2j25k7
6898Am1M0Mj9J08r7m2J26j07J8O2p0nM6J0j06K6k1J15j18R3K4k4R7j52NM0J5j3
6927A5o8O3l4M0n6R3n1mK9N4p0q3N9Mo8K1J00l3L5n7m8J49j33j09J53L3q2mk3
6956g5J22n4j6P2L4r4j1k1O2rl8P6n9J24q5o1N9Qj09J43m5o8J5N7j7k6M1k7o2
6985f4K0P5n2J10o8l8l1Q4q4j02K37j76J59n3l7JO2r4M0JrL6J7LK7r8K1Q8m5J19
$$ plain form
7015 149 -6 -7 -75 -105 -43 1 59 42 -2 -15 24 -78 -49 36 137 -33 53 87 1 -60 59 21 -37 83 4 112 83
7042 83 -107 -76 -64 -44 -41 66 16 -56 88 48 42 33 7 109 59 -16 10 -140 -43 -30 30 22 -103 14 -5 -46 38 27 76
7071 76 -52 -3 5 -18 -40 6 -68 74 17 76 62 -33 46 63 -28 50 22 -19 -61 47 125 -43 142 -15 38 -88 4
7098 4 -64 41 -11 -26 36 -20 -52 -36 93 54 101 -98 -73 -74 -59 -7 -15 -9 -52 -103 36 14 29 12 19 -138 4 -77 51
7127 51 -41 166 -63 -83 -27 -32 53 10 55 84 68 70 -64 90 8 15 80 59 -46 -56 -26 27 -9 -204 5 -95 -19 -56
7155 -56 -36 -40 -60 -48 -29 55 68 37 30 77 27 19 72 -129 -35 48 -31 23 -2 -8 -44 -73 4 97 -36 -54 129 -114 -53 -15
7185 -15 2 -83 110 1 -82 20 -63 -13 75 50 -14 30 75 -35 29 -19 40 -143 23 -102 -99 -16 -92 -68 26 -93 -123
$$ packed form
7015A49j55jo8l0O2M4N8j7m4j3L9j02K9Q5J01j70Q6L4q6o1J19l8n8J20p9J08k9
7042H3j90L1J2K0LJ07n0p2J44m0ork6J02n0p5K6j50R7J3O0qj25J17j9m1Q4j1M9
7071G6j28M9Qk3k2M6p4J42n7N9j4r5P9J7r1P8k8m1m2J08P8j68J85j57N3j26R2
7098Do8J05n2j5O2n6l2J6J29l9M7j99K5jJ5N2qOm3n1J39k2J5j7Pj57J42q1J28
7127E1r2K07k29k0N6nQ5m3M5K9j6Kj34J54q2PO5k1j05j0L0N3l6j95K09j00P6l7
7155e6K0mk0J2J9Q4J3l1pM7n0qN3k01R4Q3p9N4k5ol6k9P7R3j33j8J83k43O1L8
7185a5J7q5J93j09q3J02q3N0Q8k5o4M4M5j10O4m8N9j83J66j25LQ3p6K4R4j19l0
$$ [...]
8190B5n
8191B0
##END NTUPLES=NMR FID
##END=
