##TITLE=1H_DE-80H_X3
 200.13MHz, d2o
 8 sc
 
 19ns.26.2.2025
##JCAMPDX= 6.0         $$ Bruker NMR JCAMP-DX V2.0
##DATA TYPE= NMR FID
##DATA CLASS= NTUPLES
##ORIGIN= UXNMR, Bruker Analytische Messtechnik GmbH
##OWNER= pz
$$ XWIN-NMR		Version 3.5
$$ Mon Jul  7 11:07:11 2025 Russian Standard Time (UT+4h)  Yarkov@DPX200
##.OBSERVE FREQUENCY= 200.1313
##.OBSERVE NUCLEUS= ^1H
##.DELAY= (6, 6)
##.ACQUISITION MODE= SIMULTANEOUS
##.ACQUISITION SCHEME= undefined
##.AVERAGES= 8
##.DIGITISER RES= 18
##SPECTROMETER/DATA SYSTEM= spect
##.PULSE SEQUENCE= zg30
##.SOLVENT NAME= CDCl3
##.SHIFT REFERENCE= (INTERNAL, CDCl3, 0, 14.3821)
##AUDIT TRAIL= $$ (NUMBER, WHEN, WHO, WHERE, WHAT)
$$ ##TITLE= Audit trail, XWIN-NMR		Version 3.5
$$ ##JCAMPDX= 5.01
$$ ##ORIGIN= Bruker BioSpin GmbH
$$ ##OWNER= Yarkov
$$ C:/Bruker/XWIN-NMR/data/yarkov2/nmr/H-C/1/audita.txt
$$ ##AUDIT TRAIL=  $$ (NUMBER, WHEN, WHO, WHERE, WHAT)
(   1,<2025-07-07 11:06:19.90 +0400>,<Yarkov>,<DPX200>,
      <created by zg, POWCHK disabled, PULCHK disabled
       configuration hash MD5:
       00 E9 B6 7A A2 85 ED C7 34 08 36 98 17 FE 4E 26
       data hash MD5: 16K
       3B 66 3A 57 F0 DB D0 AD A5 EA 6E E7 BC 3F 7D 67>)
$$ ##END=
$$ 
$$ hash MD5
$$ FF AC CE 73 B7 36 A6 D7 23 FB 0D 90 DA 05 C4 FD
##$RELAX= 
##$RELAX= 
##$RELAX= 
##$RELAX= 
##$RELAX= 
##$RELAX= 
$$ Bruker specific parameters
$$ --------------------------
##$DU= <C:/Bruker/XWIN-NMR>
##$EXPNO= 1
##$NAME= <H-C>
##$PROCNO= 1
##$TYPE= <nmr>
##$USER= <yarkov2>
##$AMP= (0..31)
100 100 100 100 100 100 100 100 100 100 100 100 100 100 100 100 100 100 
100 100 100 100 100 100 100 100 100 100 100 100 100 100 
##$AQSEQ= 0
##$AQ_mod= 1
##$AUNM= <au_zg>
##$AUTOPOS= <>
##$BF1= 200.13
##$BF2= 200.13
##$BF3= 200.13
##$BF4= 200.13
##$BF5= 200.13
##$BF6= 200.13
##$BF7= 200.13
##$BF8= 200.13
##$BYTORDA= 1
##$CFDGTYP= 0
##$CFRGTYP= 5
##$CHEMSTR= <none>
##$CNST= (0..31)
1 1 145 1 1 1 1 1 1 1 1 1 1 1 1 1 1 1 1 1 1 1 1 1 1 1 1 1 1 1 1 1 
##$CPDPRG= <>
##$CPDPRG1= <>
##$CPDPRG2= <>
##$CPDPRG3= <>
##$CPDPRG4= <mlev>
##$CPDPRG5= <mlev>
##$CPDPRG6= <mlev>
##$CPDPRG7= <mlev>
##$CPDPRG8= <mlev>
##$CPDPRGB= <>
##$CPDPRGT= <>
##$D= (0..31)
0 0.7 0 0 0 0 0 0 0 0 0 0.03 0 0 0 0 0 0 0 0 0 0 0 0 0 0 0 0 0 0 0 0 
##$DATE= 1751871979
##$DBL= (0..7)
120 120 120 120 120 120 120 120 
##$DBP= (0..7)
150 150 150 150 150 150 150 150 
##$DBP07= 0
##$DBPNAM0= <>
##$DBPNAM1= <>
##$DBPNAM2= <>
##$DBPNAM3= <>
##$DBPNAM4= <>
##$DBPNAM5= <>
##$DBPNAM6= <>
##$DBPNAM7= <>
##$DBPOAL= (0..7)
0.5 0.5 0.5 0.5 0.5 0.5 0.5 0.5 
##$DBPOFFS= (0..7)
0 0 0 0 0 0 0 0 
##$DE= 6
##$DECBNUC= <off>
##$DECIM= 32
##$DECNUC= <off>
##$DECSTAT= 4
##$DIGMOD= 1
##$DIGTYP= 9
##$DL= (0..7)
0 120 120 120 120 120 120 120 
##$DP= (0..7)
150 150 150 150 150 150 150 150 
##$DP07= 0
##$DPNAME0= <>
##$DPNAME1= <>
##$DPNAME2= <>
##$DPNAME3= <>
##$DPNAME4= <>
##$DPNAME5= <>
##$DPNAME6= <>
##$DPNAME7= <>
##$DPOAL= (0..7)
0.5 0.5 0.5 0.5 0.5 0.5 0.5 0.5 
##$DPOFFS= (0..7)
0 0 0 0 0 0 0 0 
##$DQDMODE= 0
##$DR= 18
##$DS= 0
$$ [...]
##$SUBNAM2= <"">
##$SUBNAM3= <"">
##$SUBNAM4= <"">
##$SUBNAM5= <"">
##$SUBNAM6= <"">
##$SUBNAM7= <"">
##$SUBNAM8= <"">
##$SUBNAM9= <"">
##$SW= 18.0517328524113
##$SWIBOX= (0..15)
0 0 2 0 0 0 0 0 0 0 0 0 0 0 0 0 
##$SW_h= 3612.71676300578
##$TD= 16384
##$TD0= 1
##$TE= 0
##$TE2= 300
##$TE3= 300
##$TEG= 300
##$TL= (0..7)
0 120 120 120 120 120 120 120 
##$TP= (0..7)
150 150 150 150 150 150 150 150 
##$TP07= 0
##$TPNAME0= <>
##$TPNAME1= <>
##$TPNAME2= <>
##$TPNAME3= <>
##$TPNAME4= <>
##$TPNAME5= <>
##$TPNAME6= <>
##$TPNAME7= <>
##$TPOAL= (0..7)
0.5 0.5 0.5 0.5 0.5 0.5 0.5 0.5 
##$TPOFFS= (0..7)
0 0 0 0 0 0 0 0 
##$TUNHIN= 0
##$TUNHOUT= 0
##$TUNXOUT= 0
##$USERA1= <user>
##$USERA2= <user>
##$USERA3= <user>
##$USERA4= <user>
##$USERA5= <user>
##$V9= 5
##$VALIST= <valist>
##$VCLIST= <CCCCCCCCCCCCCCC>
##$VD= 0
##$VDLIST= <DDDDDDDDDDDDDDD>
##$VPLIST= <PPPPPPPPPPPPPPP>
##$VTLIST= <TTTTTTTTTTTTTTT>
##$WBST= 1024
##$WBSW= 4
##$XGAIN= (0..3)
0 0 0 0 
##$XL= 0
##$YL= 0
##$YMAX_a= 295159
##$YMIN_a= -216919
##$ZGOPTNS= <>
##$ZL1= 120
##$ZL2= 120
##$ZL3= 120
##$ZL4= 120
##$ABSF1= 10
##$ABSF2= 0
##$ABSG= 5
##$ABSL= 3
##$ALPHA= 0
##$AQORDER= 0
##$ASSFAC= 0
##$ASSFACI= 0
##$ASSFACX= 0
##$ASSWID= 0
##$AUNMP= <proc_1d>
##$AZFE= 0.1
##$AZFW= 0.1
##$BCFW= 1
##$BC_mod= 2
##$BYTORDP= 1
##$COROFFS= 0
##$CY= 83.5205535888672
##$DATMOD= 1
##$DC= 2
##$DFILT= <>
##$DTYPP= 0
##$F1P= 10.8118882576601
##$F2P= -7.23987719738617
##$FCOR= 0.5
##$FTSIZE= 0
##$FT_mod= 4
##$GAMMA= 1
##$GB= 0.15
##$INTBC= 1
##$INTSCL= 1
##$ISEN= 128
##$LB= 0.25
##$LEV0= 0
##$LPBIN= 0
##$MAXI= 10000
##$MC2= 0
##$MEAN= 0
##$ME_mod= 0
##$MI= 1.114404
##$NCOEF= 0
##$NC_proc= 0
##$NLEV= 6
##$NOISF1= 3.799351
##$NOISF2= 2.8
##$NSP= 1
##$NTH_PI= 0
##$NZP= 0
##$OFFSET= 14.38212
##$PC= 1
##$PHC0= -1355.951
##$PHC1= 7.64948
##$PH_mod= 1
##$PKNL= yes
##$PPARMOD= 0
##$PSCAL= 0
##$PSIGN= 0
##$REVERSE= no
##$SF= 200.129724274929
##$SI= 16384
##$SIGF1= 3
##$SIGF2= 2
##$SINO= 400
##$SIOLD= 16384
##$SREGLST= <1H.CDCl3>
##$SSB= 0
##$STSI= 0
##$STSR= 0
##$SW_p= 3205.1282051282
##$SYMM= 0
##$S_DEV= 0
##$TDeff= 0
##$TDoff= 0
##$TI= <>
##$TILT= no
##$TM1= 0
##$TM2= 0
##$TOPLEV= 0
##$USERP1= <user>
##$USERP2= <user>
##$USERP3= <user>
##$USERP4= <user>
##$USERP5= <user>
##$WDW= 1
##$XDIM= 8192
##$YMAX_p= 0
##$YMIN_p= 0
$$ End of Bruker specific parameters
$$ ---------------------------------
##NTUPLES= NMR FID
##VAR_NAME=  TIME,          FID/REAL,        FID/IMAG
##SYMBOL=    X,             R,               I
##VAR_TYPE=  INDEPENDENT,   DEPENDENT,       DEPENDENT
##VAR_FORM=  AFFN,          ASDF,            ASDF
##VAR_DIM=   8192,          8192,            8192
##UNITS=     SECONDS,       ARBITRARY UNITS, ARBITRARY UNITS
##FACTOR=    0.0002768,     1,               1
##FIRST=     0,             0,               0
##LAST=      2.2672688,     0,               0
##MIN=       0,             -216919,         0
##MAX=       2.2672688,     295159,          0
$$ Real data points
##PAGE= N=1
##DATA TABLE= (X++(R..R)), XYDATA
$$ [...]
1294A969J667n34j769J040j862j339Q12k147nQ41j597J388P19r95K188k04k01
1311b9K206j005N07J373k015N51j73k543R81j108j547J584j119K98J858r88J150
1328a9J219j392J538q5j149J615p67m85J520j552P9P37k064O59l05j874J248m41
1346a518n80J958r68L59J506j237J038P14j416J645j91q17J708j122n16J011k157
1363e83j23M1k238J027J19q32K126M4k3K300o88M73J117j800P60n4j834J034j023
1382a57j314J204j610n37J054j636J078J037o13K222O34j09J957n95n89R41k128
1399H39k69J4k377N97k13j099J626m69m98J458r34N65J676r65J436Q72j165J349
1417B443m82j388J034j653r93M93j850M29Q37r86J703K97o15J571o54k23J584
$$ y = [1969, 3636, 3102, 1333, 2373, 511, -828, -16, -2163, -2168, -1327, -2924, -1536, -817, -1812, 376, 172, -29, 2177, 1172, 1679, 3052, 1037, 1588, 1415, -1128, -147, -1255, -2802, -1218, -2337, -2039, -181, -1169, -19, 1200, -192, 1346, 1261, 112, 1727, 960, 475, 1995, 443, 522, 1259, -805, -146, -451, -2325, -1077, -1518, -2098, -140, -1108, -749, 757, -480, 558, 1272, -144, 1501, 1310, 493, 2201, 1079, 563, 1574, -583, -706, -665, -2903, -1876, -1757, -2589, -463, -419, -442, 1858, 1170, 1643, 2760, 960, 1720, 1666, -168, 866, -157, -1471, -267, -1877, -2414, -1360, -2996, -1918, -881, -1494, 728, 1362, 1253, 3210, 2615, 2026, 2967, 839, 570, 584, -1793, -1196, -1409, -2508, -882, -1351, -1849, -391, -1325, -760, 916, -49, 1387, 2259, 1094, 2443, 1961, 573, 1607, -46, -1039, -546, -2396, -1967, -1130, -2116, -413, -116, -731, 840, 186, -37, 1547]
1434A547j188N38J051j526Q81q8j331Q85j045j200Q00j442J9J336p71J211Q28
1451E05q70J458j72p62J538r07k64J149j388K19L44j457P51m11j590P34j024k84
1469b431J649m86J101J522r96J149L54r90J193p78r03P73j520m59P52j408O74
1486h04K54j329R64k21n11J829J4M25J421j063L06M19j374O08m95j320P20j157
1504a314o70J369p10O87J182j234R77pp37J514M1l74J109j179l60P25j464K86
1522a59L92j443N91l66q84J500m52L24J246j024J00O92j126J095L74p03J279p81
1540F55p63R63r09K12P32j435K59r8j305J419J68m16J295r03j98Q60q42M68Q83
1559A045j119P44m85j023Q80n24q8J061j095n8N25j054J211N05m35J283p10o30
$$ y = [1547, 359, 897, 1948, 422, 1303, 1215, -116, 769, -276, -1476, -676, -2118, -2099, -763, -1534, -323, 505, -365, 1093, 921, 159, 1697, 790, 526, 1675, 287, 506, 850, -607, 144, -267, -1857, -1123, -2147, -2431, -782, -1268, -167, 1355, 359, 1508, 1862, 872, 2065, 1287, 384, 1157, -363, -822, -70, -1478, -804, -550, -1879, -915, -1136, -1647, 182, 196, 621, 2042, 979, 1285, 1704, 330, 938, 443, -877, -157, -1314, -1984, -615, -1325, -638, 544, -690, 287, 280, -457, 1057, 1098, 724, 1833, 654, 294, 1019, -445, -159, 233, -1210, -619, -985, -1869, -369, -821, -497, 749, -275, -175, 517, -609, 486, 860, 157, 1436, 655, -108, 855, -54, 158, 890, -545, -286, -384, -1689, -270, -102, -518, 777, -126, -324, 536, -306, 162, 1045, -74, 670, 185, -838, 42, -482, -570, 491, -604, -662, -137, -1191, 20, 525, 90, 1373, 663, 33]
1577C3R21r09K80P70j158L07q4j378R22j14k65J105o55m66O66j058P68O51o76
1596c40P91l42r22R42k71P9J288p56O8L42j321O89M11p48J103o27r46O55r40J13
1616g32J046p92M45rj039P78J48j15J357n74n04M90j177K90O69q42Q60j68r25
1635g94O98k68n2J347o01j3M82j129M75L60m06J132l53q18L09j084j61Q64q24
1654h36M59R0j164P95j1r5J317j35m09N67r38L83P06l55J071j42q57K55q42n45
1674f86Q90p41L5K89j094N48N33l53J345J28o66N07j040j61R71n88O34P9j212
1693e82K31m22n31J086l40j03P42q46M68J026k48J227J99r07J58q88p01O12n56
1712c75K4L91j038O9L0n54J116K00l18O51o31J8J251k72Q32L18j082m4o48r29
$$ y = [33, 954, 45, 325, 1095, -63, 244, 160, -1218, -296, -410, -675, 430, -225, -691, -25, -1083, -315, 336, -340, 451, 109, -813, 129, -142, -63, 1225, 469, 537, 879, -442, 247, 658, -90, 1013, 386, -560, 95, -845, -732, 314, -478, -33, -42, -1081, -303, -155, -270, 1087, 513, 9, 499, -678, -388, 281, -561, 299, 131, -794, -96, -364, -416, 931, 330, 317, 799, -330, 145, 505, 99, 1231, 878, 60, 369, -715, -876, -12, -836, -377, -287, -1451, -656, -667, -762, 555, 420, 11, 578, -360, 23, 729, 374, 1445, 1303, 446, 701, -141, -686, 204, -537, -502, -213, -1307, -759, -226, -579, 766, 894, 228, 735, -305, -466, 505, -83, 551, 630, -582, -351, -773, -1304, -218, -558, -661, 81, -765, -297, 729, 481, 1708, 1907, 1000, 1158, 270, -431, 181, -375, -351, 40, -998, -929, -899, -1453, -337, -137, -455, 196, -435, -417, 834, 562, 1394, 1712, 630, 586, -62, -991]
1732i91P14k33k35P21p70J08O33l67Q23N17p49L47m44n51J036l22M59O41j349
1751a2j88n19r36Q22R1j82Q14n38r3J202k89Q03N57q37J44n14o95R02j25P1M85
1772I63j002k54j07r43N79K79m81P60k98o2J059j99N53O34q83k2n62p09N21J54
1792b0k13P41o51p03L45o00O03M28l17O09Rm95J120J55MP52j015n16l11j105L88
1813g92K37l24O11k93l35M42j75M23Q69o67L82M5m55P08L58j96O50q73q27j81
1833c93r15K10O52l12N50J08m96O57o2L08P03n95o6O8p43N27L25l31N74n96o85
1854e12pn51mQ07p3L03L02n25P33K9q1Q02n86n85J21o69J19N62l25O12l56p20
1876f04K21n61K05P51k44J15M11n21M98K67r6O01m70o72K02p15J93M41j47K49
$$ y = [-991, -277, -510, -745, -24, -794, -686, -53, -420, 403, 920, 171, 518, 74, -477, 559, 237, 696, 1337, -12, -200, -719, -1655, -833, -742, -924, -110, -648, -741, 461, 172, 975, 1532, 695, 839, 325, -370, 532, 407, 478, 963, -39, -293, -400, -1343, -764, -485, -966, -206, -504, -566, 493, 294, 847, 1481, 598, 576, 14, -695, -174, -20, -233, 508, -143, -846, -501, -1101, -498, -70, -387, 222, 231, -264, 856, 1011, 1015, 1767, 752, 236, -75, -1180, -792, -555, -879, -268, -561, -896, -454, -629, -206, 663, -4, 378, 423, -32, 676, 1034, 838, 1488, 615, -212, -393, -1308, -1098, -446, -758, -208, -100, -596, 61, -1, 307, 1010, 415, 349, 417, -326, 201, 526, 195, 769, 173, -512, -519, -1070, -1074, -267, -340, -37, 265, -260, 473, 502, 421, 1223, 637, 52, 173, -496, -377, 185, -140, 472, 116, -604, -383, -944, -739, 12, -232, -117, 294, -227, 271, 538, 442, 1043, 573, -99, 103, -612, -419, 22, -125, 124]
1896A24J80q55J80j71j77Q78k64JM66n43L59O59m05M96k13q27K4m46k35O55k40
1917c54L65J37n94J31K14j76P30M2l93K83m07O1N89m50L49j76q49J08k81l42P32
1938b81R1R8M28n49J35M90k68N06ko87L69n81j01O21k28J18J79o97O9k34j01N59
1960f6O8k14N47n86J21L60m28M95J71o64L41k52j82O19p4m4L27o42l4K4m14N47
1982B0K9k55K88k10k09N41j00K21K54m78K8l1l92N19j53j70K69o54l5J67k49L30
2004b70M86k93L09j43j76O43k32R8K76n54j1j61l70L06J61m19M43l71l19M91k49
2025c55L18M60m94K14O5m75M57J2o8M25n47j10K17m33K85K09l58M39l24l81M75
2046C1j65O0M32m68J00K23m59L06J54k47M86l59l19K71l22J41K24m67K95j34n47
$$ y = [124, 304, -551, -371, -542, -719, 159, -105, -104, 362, -181, 178, 837, 432, 928, 715, -112, -88, -534, -769, -114, -354, 11, 148, -446, -315, -101, -277, 453, 495, 102, 385, -22, 39, 628, 178, 527, 351, -498, -390, -671, -1013, -281, -190, -92, 336, -213, -78, 412, 144, 650, 648, -39, 330, -251, -352, 269, 41, 159, 338, -359, -290, -524, -625, -66, 2, -212, 335, -251, -130, 230, -198, 297, 468, -196, 145, -107, -289, 330, 256, 212, 539, -103, -137, -113, -527, 20, 49, -206, 82, -128, -337, 204, 104, 325, 579, 101, 129, 98, -294, 225, 72, -98, 171, -483, -518, -351, -600, -270, 216, -77, 232, 89, -87, 556, 324, 422, 698, 144, 133, -28, -398, -92, 69, -350, 93, -278, -597, -106, -355, -37, 423, -71, 143, 208, -267, 190, 202, 134, 559, 12, -98, 119, -314, -29, 180, -178, 261, -63, -444, 31, -134, -74, 358, -110, -10, 213, -246, 60, 214, -33, 453, 94, -225, 46, -276, -135, 89, -378, -83, -217, -764]
2067g64N49q3R9O71j69j35L92m84J46K17m79M00k65m48M70l49q9M77m91j2J17
2088b30l69L84L25j62O25l74o5K85l64NK24n27K86Qn25L85J4j79N07l45k5L05
2110A88n53L67J33k12N27l3k51K27l94q0K88m39O7J64n77L66J35j54M12j81k81
2131b81L56m15Q3M42k95M40J89l14L09k65j87K57m10j07K11n34J26K80k94N58
2151A49j24l33M14j60k38N69l53J83K90l12K27J12m77K71k42m26L51l33N2M77
2171I7k38K07L51m51L53q7l12L77l60J36L00m01J19K0l08K60k14l79K32k60R1
2192d67N54k20J23K75j20K01lm46L66j75j96L99m21K76K07l73J16ln15J39J2j89
2214d60M43j65J34M08k42J52J88m81R6Q0l50K60l3j27K92m15R7K57n07R8J43l46
$$ y = [-764, -215, -298, -199, 472, 303, 168, 560, 76, 222, 439, -40, 360, 95, -353, 117, -232, -321, 156, -335, -347, -230, -599, -215, 110, -52, 573, 199, 134, 419, 55, 60, 284, -243, 43, 51, -474, -89, -75, -254, 253, -92, -117, 188, -365, 2, 135, -77, 450, 417, 166, 393, -1, -81, 207, -232, -165, -1, -578, -212, -77, -231, 181, 0, -281, 75, -340, -257, 185, -110, 330, 519, 205, 514, 249, 62, 319, -91, -198, 13, -521, -395, -115, -409, 149, 25, -308, 106, -54, -292, 277, -76, 107, 397, 85, 312, 424, -53, 218, -24, -450, -99, -432, -380, 97, -141, 66, 417, -34, 319, 232, -80, 297, -63, 73, 373, -28, 91, 111, -197, 63, -151, -530, -298, -558, -467, 87, -133, -10, 265, 145, 346, 343, -103, 263, 88, -108, 291, -130, 146, 353, -20, 96, 93, -422, -283, -271, -460, -17, -182, -48, 360, 118, 270, 458, -23, 73, 153, -197, 63, 30, -97, 195, -220, -123, 134, -373, -275, -132, -478]
2236d78N42m3P4M77j74RK58n70o1J51n89K63j39j09L20j90k9L54l08K19l6k56
2258c15M49j3p8N36k09q0J68m21j44J56n64K21L0k74M09N6o5L89k35J01K39m54
2280i8J61O4j98L70n6j80K69l18j36J04l01PK28k24K39J27j87L47M5k71M00l63
2302B9J9L6l11K80J87l03L04j92k49K49l89o9M10l68K75J96k66M79o4j59L80l60
2324A14j42J40k40J26J25j98K55j21l82L09k91N1K54j22N1K47k18L04M5j21K10
2345C96k91k57K29l20P2J79j16J76L1l21L73k43k7L12l35J45K41l08J61J63k79
2366a9L08j38l70K56l17K8K00J5L3J50k78J77P2k06J86j3l12L45k95P8L42k27
2388A5K15n3k88J02j38n3L23k41k5K68k84N5K32k26J73O2l51K88j42m2K94j61
$$ y = [-478, 64, 21, 95, 572, 398, 407, 665, 95, 34, 185, -404, -141, -280, -389, -69, -259, -288, 66, -242, -23, -59, -315, 134, 121, 43, 579, 370, 290, 458, 37, -107, 49, -515, -294, -264, -538, -129, -73, -138, 251, 16, 117, 356, -98, 63, 127, -71, 299, 243, 63, 332, 14, -122, -18, -319, -312, -84, -308, -69, 58, -129, 218, 263, -8, 392, 29, 48, 84, -227, 53, 240, -63, 241, 49, -200, 49, -340, -409, 1, -367, -92, 104, -162, 317, 253, 94, 474, 114, -28, 112, -128, -2, 123, -75, 180, 59, -323, -14, -305, -254, 0, -122, -71, 176, -42, 262, 307, 186, 396, 105, -152, 77, -243, -171, 8, -108, 68, 99, -222, 151, -92, -119, 193, -142, 3, 244, -64, 97, 260, -19, 289, 151, -219, 37, -280, -252, -52, -37, -4, 146, -132, 45, 117, -89, 97, 84, -228, 117, -178, -100, 242, 15, 230, 177, -111, -9, -147, -200, 123, -118, -143, 125, -159, -104, 128, -98, 75, 137, -214, 74, -68, -110, 184, 23]
2410B3P8R2l26J02j2k56L89k8r6J22k36M4K92k23J87Q8n11K46Jj17K74j11o5N1
2434Hk17m9L36k95K75J76k94J34j32j69M62k13M0J56l79J47q1n6L04n4j69L22
2456B52m98K54J23j77P8R6k37P8o6n4J48K2J5K13m03J5J83j35K01J00j25J08l51
2479a60j03M13k42J91K20l78J30j98j48L60L7k26L31k03k40K57k34J85J62k54
2499a00P5n1j30K40l5J22J47k95M5j2k39K57R3j66J39j34j95L09j67N8J64l06
2521a81J98j04j94L28pK1K85k14j16k7k32R8K17j87J7P0m42M42N7J27K54l54l5
2544B1J30j79P4K77k22J22j15k74J64k11o4L86k94J26l0k92L15P0l0J96n8p2J8
2567E8j23J33J36k61L02k03k67K82j17k07L91k92L8L2j52K91Q5l2L58j04l04J36
$$ y = [23, 101, 193, -133, -31, -43, -299, 90, 62, -34, 88, -148, -104, 188, -35, 152, 240, -271, -25, -24, -141, 133, 22, -43, 8, -209, -258, 78, -217, 58, 234, -60, 74, -58, -227, 235, 22, 62, 218, -161, -14, -95, -151, 153, 99, -70, 252, -246, 8, 131, -46, 32, 128, -109, -31, -97, -151, -3, 19, 34, 247, -156, -141, 42, -93, 108, 208, 83, 191, -160, -263, 150, -92, 99, 319, -59, 71, -127, -275, 85, 122, -104, 227, 24, -216, 41, -193, -8, 154, -100, -25, -76, -206, 34, -1, 121, 268, -27, 18, 6, -233, 24, 117, -49, 90, -44, -239, 70, -97, -39, 125, -181, 17, -87, -281, 47, 40, 61, 346, 132, 16, -11, -243, -145, 72, -115, -98, -28, -470, -28, 29, 156, 410, 56, 21, 151, -28, 46, 323, 101, 223, 108, -166, -2, -213, -277, 109, -185, -59, -89, -381, -66, 4, -26, 170, 112, 40, 58, -65, 68, 204, -57, 245, 42, -225, 57, -60, -267, 124, -168, -130, -98, -250, 41, 126, 94, 452, 348, 44, 180]
2589A80l44J23K12j77O8J47n21K38r4j5K00q4j91K74k11J88K55j67L49k15l25
2610a10K42k15j94L72j92O1J3k96K87k4j18K96j6j52J64j68O7K87l04J82K29l82
2632B9k9j56k31M59k52q8J13q3N9L14j16J49k0k03J76j34J9K80k4j68m3k94P3
2655a70N2j81L15k24r3L19k57J93K30j08K21lk68n0K0j78L03j34J1K46l70q5K00
2678a1k73K00M7j37J67j01n6L50n1J49J0k19k2J1q6J17r8j51J62j63j2Q4l1O2
2702e2O4k62K60j37P7L37p3j34K51l14m2P0k53J27N6n5P3j25k0J31j9R8J01l07
2726a48J65J46l03K60J00j08N6j51k58J88k10J17P9j25J28pj46J62K54k12J35
2747A22j96J31N3j32K63J6j43P7j71q6P3j71M6J07j35N0Q3k00K18Pj39K92q9k75
$$ y = [180, -164, -41, 171, -6, 62, 209, -312, -74, -168, -183, 17, -67, -258, 16, -195, -7, 248, 81, 430, 215, -110, 132, -83, -277, 95, -97, -36, -23, -319, -32, -56, -174, 122, 106, -46, 118, -50, 17, 304, 0, 182, 411, 29, 0, -156, -387, 72, -180, -268, -155, -238, -179, 135, 19, 168, 148, -55, 121, -13, 6, 286, 262, 94, 51, -243, -170, -118, -299, 16, -208, -301, 18, -239, -46, 184, 76, 297, 294, 26, -24, -4, -182, 121, -13, -2, 244, -126, -211, -11, -284, -84, -37, -174, -7, -108, -164, 186, 135, 284, 294, 75, 53, 64, -22, 95, -3, -154, 8, -155, -167, -83, -114, -52, 12, -250, 10, -127, -50, 287, 214, 80, 331, 17, -25, 45, -208, -81, -25, -80, -7, -132, -152, -21, -40, 58, 159, -148, 17, 163, -140, 120, 220, 112, 168, 17, -241, -53, -263, -146, -67, -192, -64, -71, -217, -55, 199, -13, 122, -74, 57, 110, -22, 241, 257, 114, 191, 20, -66, 7, -164, -118, -11, -146, -96, -13, -213, 5, 12, -127, 165, 76, -199]
2771a99K28j8J5K23k61J96j77j07J36j06j38L11k16j34L00j84R0L42k68R0j0j16
2793cP0m8q9J72j10J2q1j10J88k2j57M1m5L8J76j12J23J23j34J64q0j61J58K0
2817A33j60K16j29j27qj20J47Nn4O0k1p5Q5L3k0J33m5J52j3j97K88k70n5K22k08
2842b8l8N8j20k2J65j99J32j02l2K16p%J22p4M5R0k22J19k8j79J06l8j61J22j54
2867b29J3J57k1J08m1j67K40P4j02J50r0k8R5l5j70J68k45J35Q4j65l8J3q4J53
2891b5O4j03J03j49J25M4n7J72q6r8R9j58Q6n3p0m6J97k68M1k8OK76j01o4J94
2916A01k5p8J86j13L1J63k92O2r0m3J69j98N8J10k93N9J45r6J29l5lJ61p0p3J47
2941A12j02J72o9j83J54j02j59M3K9QJ14J0j95R8k2J17M6m1N5l5j5J37r8j61K41
$$ y = [-199, 29, 11, 26, 249, -12, 184, 7, -100, 36, -70, -208, 103, -113, -247, 53, -131, -41, 301, 33, 123, 113, -3, 67, 19, -70, 102, -8, 4, -77, -187, 1, -21, -178, -137, -182, -144, 32, -80, 43, 166, 32, 196, 116, -45, 113, 133, -27, 189, 60, -67, -75, -195, -48, -43, -97, -37, -58, -133, -48, -15, -35, 98, 53, 205, 192, -5, 283, 13, -42, 180, -28, -66, -8, -128, -150, 15, -184, -52, -154, -186, 30, 23, 23, 145, 71, 116, 206, -16, 103, 75, -104, 2, -36, -197, -75, -229, -216, -59, -80, 28, -13, -180, 60, 134, 32, 182, 92, 64, 159, 124, -46, 122, -123, 12, 96, -69, -107, -94, -178, -25, 39, -64, 39, -110, 15, 59, 2, 174, 88, -10, 89, -69, 17, -36, -106, -152, 45, -223, -182, -210, -204, 72, -29, -93, 101, 76, -2, 184, 71, 102, 265, -27, 35, -55, -98, 71, -127, -69, 41, -252, -193, -48, -144, -15, -50, -53, 108, 38, -35, 112, 10, 182, 113, -70, 84, -18, -177, -134, -105, -97, 17, 27, -168, -70, -92, 25, 71, 30, 85, 50, 35, 172, 74, -87, 154]
2966A54p7j69L8p5J51j17k4J07r8J86L3j50O6J13j80K04r0n5l6l4J13o2n2qL5
2991b7j33R3L2m0R3M6j13R0m1L8J18j44M7m3j1Q2q3o9K21k45J6O9j67J54R5j44
3017f6K0J1k7K01q0j58K38j64J37m2j41O0O9j39KLq8K84k02p1K15p5J01J7j60
3042e5K58Rj26N3m0p6O4j61N5o7o0K06j72l5K19j52O9Q6q7K1J22k07K22l5j07
3067DJ11n7k7j11ML0O0r1j1J58m2j11P3p8K15l2n1P0j82J23J14j21J7j9k06J51
3093ik1j08J20M8j11J70l1L3p7j38J48J15p1N6j92J55n7%L8j8r1J93k30n5J52
3118A9k35R6J58j05M4L9pJ23m5o3P3j9l1M2j53R8O3j80J50k8j80J63k8J8OM2m
3145E6j8j50N4Q4kq2J6P4L0o6j08Q3q5J10l3P5p0M3p6J18j25O9l1N0n1M4k1O5
$$ y = [154, 77, -92, -54, -129, 22, -95, -119, -12, -110, 76, 109, -41, 25, 138, -42, 162, 72, 17, -19, -53, 60, -2, -54, -62, -27, -160, -67, -35, -75, 18, 64, -49, 41, 0, 38, 156, 12, 59, 16, 5, 87, 4, -65, 156, -89, -73, -4, -171, -17, 78, -66, -46, -35, -62, 139, 59, -99, 139, -25, 112, 70, -71, -11, 58, -81, -79, -76, -164, 120, -82, -153, 62, -13, 88, 105, -55, 203, 212, 86, 139, 99, 23, 87, -74, -19, -86, -146, 60, -112, -147, 72, -80, -11, 75, -12, 9, 131, -76, 146, 111, 4, 115, 58, 31, -80, -76, -46, 14, -77, -88, 70, 28, -83, -10, -88, 127, 95, 44, 114, -68, 55, 169, 48, 65, 46, -160, -9, -30, -138, -18, 30, -81, 89, 58, 91, 14, -124, 24, 139, 68, 124, -68, 87, 30, 30, 68, 50, -41, 152, -78, -133, 19, -216, -120, 38, -67, -23, 16, 9, 132, 87, 24, 97, 78, 47, 89, -64, 34, 97, -83, 67, 39, -141, 22, -6, 12, 18, 60, 56, 38, -112, -58, 26, 24, -58, -42, 32, 62, -4, -112, -29, -114, -4, -37, 38, -32, 11, -65, 53, -72, -3, -34, 16, -35, 9, -12, 53]
3173E3on8K3n6p7K23o0j24O4mm6J37j75K05o8p9J36j66K7M3J1L2K4r2R6j35M9
3200b3P6r0nL0l1N6P3j83R4Q6q6j9Lj25K71j05j8J10j58J82j27j92J66M3J6m0
3226Dj8k1j5jP4j30N0J77q6j42J84m6q0KK2M2P8q5Mq8m1J6O3M6O3j79j0J06k0
3255c1J40p2n6P8J0m8O0j72K5J78k05N8%r6R4k00J71M2K9m0o9J48j63J92j32Q5
3281B6N2q2J1N3o8o6O4K9q6M0pN0Om1j1PJ9K6k7k3%r1R6o7JJ73j50K03j31p6Q6
3312A6l9j50K17j98J45j2rJ56j43q9K75k38J6R6q3m3M5n5O5P9j68P0q3Q5LJ9L2
3339IJ1mk5J6J43k06P3M7k2j91R5R9r7j1K13j41r3K01j74N8j24J00pr8J00j2K4
3366a6P9P8m8j25l3J24j7p4jRqN2J1n9KMK1R8o1J8L6j25K2J8o4J00m8p0k6K05
$$ y = [53, 47, -11, 12, -44, -121, 102, 42, -82, -18, -22, -68, 69, -106, 99, 31, -48, 88, -78, -51, -8, 3, 35, 59, -33, 63, -72, -23, 53, -37, -42, -12, -43, 13, 86, -97, -3, 83, -3, -22, -19, -144, 127, 22, 4, 114, -44, 138, 11, -181, -15, 28, 44, 4, -14, -35, -50, -51, 23, -107, -57, 120, 34, -108, 76, 30, -50, -48, -26, 16, 94, 9, 13, -75, -116, -100, -37, 9, 72, -107, -117, -11, -31, 109, 37, -19, 59, 69, 21, 81, -91, -66, 112, -93, -35, -35, -131, -37, -237, -66, -24, 5, -35, -104, 44, -119, 73, -59, 26, 78, -4, 7, 60, -8, -74, -10, 19, -67, -27, -34, 16, 22, -19, -30, -23, -4, 22, -5, -28, -28, -119, -23, -90, -89, 84, -66, 137, 6, -70, 16, -23, -173, 44, -154, -9, -21, -30, 126, -17, -106, 169, -69, -53, 43, -40, -83, -38, -93, -28, 51, -117, -47, -130, -45, -42, -23, 9, 20, 16, -9, 7, 150, -56, 17, 64, 42, -149, -54, 45, -52, -63, 150, 9, -84, 117, -57, 1, -123, -23, -30, -128, -28, -40, -16, 63, 141, 93, -32, -65, 59, 42, -32, -33, -24, -32, 20, 31, -28, -26, -22, -1, 97, 36, 54, 90, -35, -13, 5, -59, 41, -7, -77, -103, 102]
3396A02j63J03j07n7J26p2J27r6l3R7M2j65J69o2R8rj36J24r2j12L7p5P9N3j47
3421a69L2K00j10K03j10j26N1n6O4J01m3J23j96L9L8m4K1PJ6j96K23p1KQ6j78
3446i3J33J03r3pM1q9K8K0MK4r8o4K2NN5oj17R1M0l7OJ21l5M8l0m9Rj13P1P0j01
3477d1km2k3N6l2j1N5K3j4Q9m9J8Q1J8M5r8K4k6j73j8R9l2qk4L1L2r3P4K06j82
3507a7RL3LN3n6nL5Rr0j3q9J06r7N2J12k37J06K15j48Q7Q8j32o7Q9j05R7L3j38
3535f7P3mj01J03j05J01p6j63J43J63j68K56k8n9O3j39J07pk33N0J49j97J86O4
3559A11j88Pn5J66Oj16O2mp5O2m5P6J20j34P2K5j70k9K53k15k3N0jkO0j36J48
3586B5o8M6o1k1N4Q2n4L0Q1j42J59q9j15J34j50P7M9o9p5Q6j89J59l2M9P4j58
$$ y = [102, -61, 42, -65, -122, 4, -68, 59, -37, -70, 27, 69, -96, 73, 11, 109, 100, -36, 88, -4, -116, -79, -154, -75, -22, -169, -137, 63, -47, 156, 46, -80, -29, -85, -21, 80, 37, 160, -36, 3, 41, -3, 18, 25, 41, -155, 68, -3, -1, 85, -93, 40, 143, 50, 43, 84, -5, 23, 43, 47, 71, -27, -91, -69, -64, -9, -15, -132, -41, -1, -38, -32, 89, 54, 102, 72, 23, 32, -81, -10, 60, -41, -43, -85, -108, -52, -84, -95, -40, -17, -31, 58, 9, 27, 108, 126, 171, 73, 97, 71, -102, -120, -21, -53, -61, -85, -54, -22, -115, -41, 165, -17, -8, 25, 28, 81, 25, 20, 55, 64, -26, -39, -128, -22, -119, -67, 45, -192, -86, 129, -19, 68, 156, 24, -43, 46, -59, 38, 71, -67, 6, 2, -99, 4, -101, 0, -76, -239, -96, 67, -101, 155, 127, 68, 131, -8, 99, 92, -141, -91, 58, -139, 47, 111, -77, -70, -125, 41, 47, -69, -7, -11, -86, -24, -69, 7, 127, -7, 65, 90, -80, -109, 144, -71, -94, -44, -45, -47, 13, -123, 25, -43, 3, -58, -79, -25, 57, 3, 33, 114, -28, 131, 42, -73, 61, -89, -12, 37, -32, -107, -21, -210, -51, -83, -34, 40, -118]
3612a18J39K5r5P0Pp6R4m3k16L95k57l8J82j21J0l3JJ15M6j59L8rm5J51m4M6N1
3639A16k07J38R1j49J6J50j39j08L3L3j5O7n3R6j02J21J6k12J79K8r8J09j89J28
3663D9Q7j84J37j08j72J25l9R2N6n4Q8j40nR3m8M4L4L9p8M1K2j51P8k3j5m8K9
3690e1p8J42p8Q1j5O8m4j01J33j07jJ98j66n2J45j49J76j1p4jK8k30K16k05J23
3715e3K6N9q0P0p5mN7q6J14J5j41K6P2p2J07o7K0MQ6j96M5j08K43j28J27N6j70
3742e3M8P5j54R5j4k6l4Q5p0jO3n7J58j05l6P1r2J12O9k52K59j77L1p6M2L2J11
3769A04j62J5m4N8J17k5o1J35j71q0K19j04J00Pr7j8L6j06J60p7j12J80q9J5l0
3794c0O1m6N9j16K4P5j47J09N4J4Q3j62L7rj31J54Lp6Nn3n5K01j2j6pq2j2Qj6
$$ y = [-118, 21, 46, -49, 21, 28, -48, 46, 3, -213, 182, -75, -113, 69, -52, -42, -75, -74, 41, 87, -72, -34, -43, -88, 63, 19, 65, 116, -91, 47, 138, -11, 5, 155, 16, -92, -59, -26, -41, 26, -27, 69, -33, 88, 104, -108, 71, 99, 1, 110, -79, 49, 136, -48, 89, -19, -191, -66, -105, -13, 43, -11, 77, -63, -68, 25, -23, 21, 55, 94, 16, 57, 79, -72, 6, -17, -32, -80, -51, -129, 13, -65, 16, 1, 69, 25, -76, 57, -50, -51, 147, -19, -71, 74, -75, 101, 90, 16, 15, 43, -187, 29, -176, -53, -27, 32, -48, 22, -53, -57, 0, -86, 28, 43, -98, -72, 0, -72, 35, -32, -12, -8, 78, -118, -73, -181, 62, -66, 61, 117, -53, -5, 70, -84, 11, -3, -29, -63, 22, -48, -49, 14, -43, 115, 10, -26, 45, -47, 65, 134, -118, 141, -36, -5, -81, -39, -7, 104, -58, -43, -87, -29, 88, 63, 2, 137, -34, -114, 105, 1, 101, 108, 11, -7, 29, -77, 83, 6, -106, 74, -15, 0, -30, 31, -15, 44, -72, -48, 27, -120, -11, 43, 57, 140, -22, 15, 6, -125, 29, 32, -44, -39, -92, -147, 54, 42, 26, 19, -63, -75, -67, -83]
3823h3J0P8j7nl0j2J00j78J1k1K41m7p3P7o4Kq5J80n9l7O8j34N8K02j92J04l8
3850E6j05J09q5r9K01r8K5R6j17N8L7j84J72n4j46J64j09J02M1j19J30j00M4N
3874B4j71J4K21j65K1J38j82J33O2j31J09r0O9Q4j84L7O0J1l7N6q6QJ01j44M0
3899br3M8O9j1L0o1J8o2m4M1R3l0o9J71j35P4L4j61O4J6L4n2K8p2J16J28k15J89
3927A46p5QJ9j25J18j05KP9j30NN7O1qN9j99K2K5l1j3rJ51k0K6j60J79n7j95J33
3955c7j8O1j4n0k7P8R4Qj37J7P7k32J09Q8K1j7k6L8J2n0O9j0j69Q3j2k8J17j6
3983B9l0j8m1k8P8p3P6K7L7o3n6Q1M3j62L7qo0R0P9j38J81n0qmq5OJ34j91J05
4012a2J0MN9o9J4j4k2n3M3R9j51M7m1Q7l0p1K09j15q4L7J4J6P8q5n0MJ54p1j10
$$ y = [-83, -73, 5, -12, -17, -47, -59, 41, -137, -126, -147, 94, 47, -26, 51, -13, -11, -96, 84, 25, -12, 56, -78, -20, 182, -10, 94, 56, -49, 60, -25, -124, 77, -21, 4, 100, -17, 41, 78, -106, 66, 12, -134, 30, -79, 23, 64, -55, 75, -25, 19, 24, -147, -133, 88, -77, -56, 82, -100, 33, 95, -36, 73, -17, 52, 136, -48, -11, 49, 60, 23, 79, -7, 1, 102, -42, -2, -95, -47, 22, 11, 41, -20, -2, -64, -108, -67, 26, -4, -73, 98, -37, 37, 71, -90, -26, -10, 24, -28, 0, -72, 44, 172, -43, 146, 71, 79, 98, -27, 91, -14, -12, 67, -63, -58, -1, 60, 52, 111, -88, -66, -41, -72, -85, -94, 57, 37, 63, -97, 82, 25, -170, -37, -55, 6, -8, -58, -85, -7, 87, 95, -42, -25, 52, -180, -71, 17, 38, 21, -5, 33, 45, -5, 64, 54, -115, -32, -44, -72, 45, 29, -1, -19, -60, -88, -10, -83, -7, 20, 57, -6, -62, 19, 62, -100, -63, -71, -131, -41, 38, -100, 81, 31, 23, 19, -66, -60, 74, -117, -12, -2, 2, 61, -8, 6, -8, -30, -83, -40, 59, -92, -45, -86, 1, -29, -100, 109, -6, -90, -53, -39, -23, 55, -30, -80, -76, 78, 7, -103]
4041a03l4J70n8m7L9M1l6R3r0j9jm4O4M2j22R4j3OJ47j04P2m3j72J04R1j45lN
4069f6L2J03j20O8j2p7J11o3j06J01J20j28K8o8P8J33n0j03o5N7OO8j00KP8J8
4095D5j07m4J80P1k18P1j0k3L1R9k18R2J05p9j8k8K6j9pK9Jm6kO8j65K12o7J01
4123H0p8k9J5K5rp6J91j37m0J01r1J88j12jm1k6Q4r8P0O0j00n4K12j51R9j05K8
4150Ej3J5L6J08p5oj10O6N0o8PL8p0j16J43L2j30J24j3j08J01o2L0J05p6J02l2
4177H3k24J09o3J1J77r3K0L1n7P0O0l1q7l0N1J03k14R1J6o1jk8n6K24j02nKo8
4205g2J41K1n8m2J27k04K21j36j56K24j13L5L9m2Rln4K08l4j89J60j51l1J88k39
4230a51J57P3k5j03O4l4mJ0j4J09j46p5M4O4qJ25KR4j41n4l8J44m8M9j72R1L6
$$ y = [-103, -137, 33, -25, -72, -33, 8, -28, 65, -25, -44, -45, -89, -25, 17, -105, -11, -24, -18, 129, 25, 97, 54, -118, -14, 77, -68, -71, -66, -34, 69, -51, 17, 5, -72, 39, -24, -130, -29, 91, -37, -9, -77, 1, 134, 84, -19, -84, -27, -21, 47, -53, -51, 27, 45, -62, -106, 74, 145, -73, -2, -12, -35, -4, 95, -123, -31, 74, -5, -23, -51, -25, -44, -51, -22, -21, -67, -69, -1, -166, 46, -21, 80, 2, -27, -12, 13, 4, -72, 119, -18, -58, 43, -48, 140, 28, 27, -14, -40, 44, -54, 16, 76, -24, -78, 134, -17, 82, -23, 5, -8, 7, 43, 151, 76, 70, -40, 26, 76, 8, 15, 53, -17, -133, 10, 42, -88, 36, 23, -85, 16, -46, -16, 89, 13, 115, 83, -141, -32, -95, -84, 93, 0, 20, 51, -6, 64, 124, 93, 6, -24, 27, 130, -84, 7, 23, -38, -39, -67, -123, 101, -1, -6, -4, -72, 69, 90, 32, -10, 117, -87, 134, -2, -158, 66, -47, -12, 27, -15, -6, -9, -63, 145, 111, -78, 82, -69, -100, 88, -151, 6, 79, 54, -49, 15, -19, -23, -13, -27, 82, -64, -139, -95, -31, -39, 86, 88, 182, 41, -13, -51, 93, 45, 94, -78, 13, 49]
4257D9j27P2M0j67K25j11l0M5j1R6N2k01J03oj01J17l8J04kj99L2K0J36j40O7
4282B5q5J23n3j02J39j05P5J2j8j2j7K3p1O5p6J10l7l7O2r2J03r4J29l6J10q6
4308E5j50J78j96J40r6J73k9k2Qp3m9Q3l1j22J06n5J40k4m7J02q1j17J85J3j40
4333d9P9N3p5j22P8K4m0J8J14n9pj12O0K31K3m4j45N5o0m9K5R8K6j70kJ47k15
4360a18P8P4j29J57j00J8o9LM6P7pl3N4Nj29J9M7q4J72q3rm8K7p7J38L0j71J35
4388B3j00RR0K2M0j15K8lj8j0M3Mk6l4J04K2r9R4j5r9K4k4L5J5j07K19o2m6P6
4417I0k23Q6L7q8KJ34o3R9n3qM9j2m0j1N4j91J21j26K0L06k13J42o2l4k1O3Q1
4444A39j91N7j33J07o3R6K3j30m2K43j78k8J13j9p5j23K21p7O0j26J82j41N9k8
$$ y = [49, -78, -6, 34, -133, 92, -19, -49, -4, -15, 81, 133, -68, 35, 29, -72, 45, 7, 111, 109, -90, -58, -38, 98, -42, 25, -60, 63, 10, -92, 47, -58, 17, 29, 11, -1, -18, 5, -66, -1, -77, 33, -4, -41, 21, -71, 32, -62, 67, 31, 141, 55, -95, 83, -113, 27, -69, 104, 75, 53, 61, -12, -61, 22, -9, -131, -25, -80, 60, 36, -11, 91, 10, -107, 78, 91, -49, 30, 83, 8, -114, -36, -12, -52, -34, 80, 21, 14, -98, -38, 193, 216, 172, 27, 82, 22, -27, -2, 96, 122, -48, -50, 97, -118, -40, 34, -95, 62, -38, -20, -89, -86, -40, 37, 30, -3, 51, 56, -73, -54, -7, -91, 81, -2, -11, -59, -32, -109, 29, 59, -112, 23, -77, -68, 22, 44, 84, -31, -3, -6, -24, -34, 9, 13, -13, -47, 57, 79, -20, 74, 59, -40, -16, -40, -5, 10, -97, 122, 60, 14, 90, -133, -47, -10, -98, -96, 38, -25, 74, 21, 13, 62, 50, 10, -1, 53, -138, -17, -143, -123, 183, -30, 112, 50, 16, -5, 58, 139, -52, 5, -128, -21, -84, 12, 35, -95, -137, 106, -72, -100, 13, -6, -81, -204, 17, -60, 0, -126, 56, -85, -26, -54]
4468e4l1J33l8o0J07j38J08nl1pl3P6j19Q7Q1p7qQ8o9J3%K7j5J3j30Q9K0j51J72
4497D8m3o1J60j21mM9M4j6N7k41K7J20j38J47l4o8K0K4q7J45p6L0o5J32j01L5
4523a7k8R2Km3R9j39L3j25N6J17o0l7J36j68K20j14J09j38J12o6O1j04m0O6m8
4548b4o1J5O5L4L2o5LL1j0M4m8M1m8J5r8N1N5o4k5R6j00O7m0LKm2J3R3k5r5q7
4579a72J24rP7j25J10k1J01r1p0J23l8l5j6ok8J34q8Q9Pp5J45o0j16J44j47J52
4605A09r9O3Mq3k1J01j25K9M3j88K19K4j12J13K6or1K4j09J03m0mL8j11P3n4K3
4632e1M2qj68K27p6r7R5n2J22M1r5j0Q0p8PJ7K0m4k8K8L8O7p0ql2Q6ln2o8J7K0
4663c3N6P0j18P3j80K43j60J34p4o5OJ0K8J6j17J09L2o4m2l3J38j14J38K5Rj12
$$ y = [-54, -85, 48, 10, -50, 57, -81, 27, 22, -9, -16, -49, 27, -92, -5, 76, -1, -9, 79, 10, 23, 23, 50, 35, 48, -82, 7, 27, -124, 48, 5, -56, 104, -17, -21, 28, 72, 56, 113, -128, -101, 19, -119, 28, -6, -74, -54, -30, -117, 28, -48, -18, -83, 49, -52, -17, -45, 47, 49, 6, 105, -34, -1, -126, -70, 47, -13, -50, 86, -82, 138, 24, 133, -5, 107, 41, 102, -2, -42, 24, -24, -85, -70, -5, 29, 61, -4, -1, 30, 20, 64, 16, 57, 9, 24, -74, -23, 32, -32, -57, 39, -61, 6, -34, -31, -29, -71, -58, 35, 10, -85, -172, -48, -57, 20, -105, 5, -16, 85, -6, -76, 47, 9, -26, -42, -48, -76, 58, -30, 59, 66, -9, 136, 76, -40, 104, -43, 109, 10, 73, 77, -6, -27, 74, -51, -22, 21, -167, 52, 76, -36, 77, 103, 97, 6, 30, -79, 24, -16, -20, 18, -93, -20, -74, -51, -9, -17, -185, 42, -34, -131, -36, -88, 34, 75, -20, -30, 50, -28, -21, -4, 16, -28, -56, -28, 10, 77, 7, -1, -33, 53, 50, -2, -70, -53, -33, 23, 93, -25, 48, -132, 111, -49, 85, 11, -54, -48, -38, -10, 6, -111, -2, 30, -34, -76, -109, 29, -85, 53, 78, 87, -25]
4689b5QN4L1j50j6J22j7Q3j00L6j08k2J00M7o2l1N6KM8j07PM6j18J6K8L5P3j6
4717B0r5J20j29M2o5J36O8m7j15K1J67p0K6rq4k4J21p6k3J9l1N4l4q7J32l2j0
4744ep5P6p4J40j2r9l4O8K2M9n8q9J2J12P3j34O8p1O4M7j12K5l3ON5j4n7Q4p8
4773d4M8Q2r3j16K41j18q1Q1o1K03j35k7K3n2Q1%L8j67K41j97Q2j17N2mn5O6o8
4800i7O9J4J08n3J5o0L1k6p2K7R6j80J51l9m2J20n6j67J46R4k5n5K7j17Q1K4l5
4827b1MJ4J05j47L7j1m1nO3q0R6l9l6nkL1nR9oj8Q6q3J30j98Q8j60oQ9qP4K7p5
4859cL3O8j13R5m3Pl1o3k4J24q7K9L2q0J19j14n6O6o6J7J48r0J37k12L1J09L8
4886G1j29k0L4o1O5J7n2M3p2Q6J5o6K51j47p1L4n8K4J32j26K2R2j05JPKL5r7L2
$$ y = [-25, -17, 37, 68, -82, -98, 24, 7, 90, -10, 26, -82, -104, -4, 43, -19, -50, 6, 8, 56, -51, -44, 2, -116, -100, -72, -37, 36, 20, -75, 45, -84, -42, -107, 29, 97, 50, -65, -44, 123, 53, 79, 70, -14, -38, 83, 7, -16, 3, -28, 26, -8, -95, 37, 5, -5, -80, -4, -78, 62, 50, -49, -83, -15, 7, 56, -2, -91, -79, 33, 106, -28, 40, -31, 33, 80, -32, -7, -40, -34, 21, 7, -50, 34, -44, 4, 86, -7, -123, 118, 0, -81, 0, -61, 142, 7, -20, 3, -49, 32, 32, 70, -97, 144, -53, 29, -88, -36, -40, -95, -29, -97, -28, -14, 94, 41, 56, -4, 27, 1, -71, -44, 52, -128, 23, -16, -58, 62, 6, -161, -15, 79, 54, -1, 26, -91, -10, 14, -21, -17, -3, 102, -45, -8, -19, -60, -65, -2, -82, 14, -25, -61, -66, -68, -37, -42, 57, 51, 33, 119, 36, 166, -32, 56, -104, -110, -21, -29, 45, 72, -3, 30, 98, -15, 80, 37, 44, 13, -50, -74, 50, -37, -8, 24, -56, 63, -51, -107, -41, -107, -90, 58, -32, 105, -107, -76, 33, 71, -58, -78, -44, -105, -40, -23, -75, -32, -104, -18, -3, -69, 182, 35, -36, -2, -60, -36, 96, -30, -8, 84, -21, -20, -13, -11, 24, -73, -41]
4915d1J69k12j3P3m4K2J4o3P1O0L2r5O9Rj5p2M4P2j70J95j37L4n6R8J9o6J11r6
4943A2J5j6L2P9j39J04o7QQ6o7l8N2K9r1M8p5J15k4j09O2m0m8M8JM2N7j35P1J7
4972B9l6L4j18J04Ojm3O5n9K7j3L8j2n1k3L4N6K3l1r6O9P9q1Q4j18j7K7K0M1j59
5002a22J27j91J26J6Q8m6p2J24m5q3J21j23P7J24p0j02J16j10N1j5m3P6pl9R3
5027G1Kj66Rl8J9O2Q6j3j8o3R1q1K0R1j07k1L9Q5k1j29L8N4j27J23P0j41O9N7
5055F1p9J6K0n6kP7m4O0j41J1J96r6p1K8Q7j7l6k2K8j40J31K5q4Q3p0O1j33K43
5083A36r6j17R4Kq4M3M8k4o0KN8k9j8M2KOP2J5j86M4J7R0n0P6j14o8K10j35P2
5112D8q8Q9Oj11L0R7r1R0j20J6K1q1J52JJ6o4J0RK7lp5m9k2M3J42m7n9L2m1K0
$$ y = [-41, 128, -84, -97, -24, -68, -46, -32, -95, -24, 36, 68, -27, 42, 51, 36, -36, 8, 80, -90, 105, -32, 2, -54, 44, 63, -3, 108, 12, 27, 11, 43, 122, -17, 87, 20, 28, 114, 47, 9, 61, 90, -1, 47, -28, 87, 63, -46, 16, -24, -72, -24, -23, 19, 76, -59, 12, 29, -7, 27, -91, 13, 19, 18, -25, 40, -19, 8, -5, 33, 21, -30, -53, -19, 37, 60, 29, -67, 2, 81, 0, 84, -34, -51, -24, -4, 37, -122, 5, -186, -60, -44, 44, -2, -74, 50, 5, -78, 43, -80, -3, 121, 51, -51, 65, -45, 6, -9, -52, 24, 17, -22, 71, 73, -93, -84, -122, -103, -41, 45, 32, 14, -49, 42, -39, -19, 72, -35, -56, -17, 68, 47, -82, -44, 10, -117, 6, 76, -65, 4, 61, -18, -2, 18, -38, -40, 37, -7, 53, -88, -77, 119, 23, -48, -20, 67, 50, 14, -8, 20, -120, 11, 36, -48, 35, -35, 26, -107, 136, 40, -77, 17, 19, -65, -22, 26, 2, -58, -56, 2, -27, -45, -3, -1, 5, 77, 92, -94, -50, -33, 57, 7, 83, -31, -99, 111, -24, 48, -40, 49, 55, -56, -26, 71, -20, 70, -50, -34, -13, -94, 58, 59, 75, 11, 21, 30, 57, 54, -21, -70, -92, -49, 93, 46, -13, 19, -22, -2]
5142bK8j8l4J58j39o5J49j55L2P6p6R2L1j01M3m2j2M8j4p1Q9n8N1k6k4J7n1L1
5170d3k1m7J54Mj34J14m7Q4j53J73j11M6L2k3K1n5%O9l5m4K5k1lk4N2j3k6n2l
5199h1P0O8j20J38j25j27J55K3O0m3k2m0J09o5p6K8J3k3P9q8M9Oo5O5M5J1KQ6
5227A32j53oj55K53m4J1q5P8k1l1m2N4J34j22l7J13m2r8J43n0Q0j06K7r9J53l0
5253E7Nk08J12O9j00J5mM7Q2j17mJ22j4j77J11J02j22M6j5j94K26r1L7r9J46r
5279B3l1n7O1N0j17rJ42j7q6M7m4O7m1Jj1J8m6l3J55k4j34qJ34M9j4j24j5M1j3
5308c6k2J4KM7mk6Nn3P4J01p8KJ20l34K54oj56O3M4M7m6N0r5J24j40N0p3J58j33
5337d7k5R0Oj36R6K8j13Q4J13q6n4J05l7J6K1k07J85j5L2o7O4K1k2k8j1MN9q1
$$ y = [-2, 26, 8, -26, 132, -7, -72, 77, -78, -46, 30, -46, 46, 77, -24, 19, -23, -35, 13, -1, -72, 17, -41, 10, -16, -40, -23, -74, -43, -64, -111, 43, 47, -87, 27, -20, 64, -89, 84, -27, 19, 51, 28, 49, -6, -6, 63, 28, -16, 9, -12, -15, -39, 13, 0, -26, -78, -81, -11, 57, -63, 75, -50, -177, -22, 1, 61, 18, -4, -44, 65, 0, -76, -48, -35, -58, 21, -67, -18, -12, -77, -12, 33, 44, 46, 132, -21, -27, -182, 71, 27, 38, -47, 31, 10, -21, -63, -9, 125, 3, -34, 79, 37, -61, 82, 32, 112, 6, 33, -66, 87, 57, 62, -146, -34, 35, -65, -50, -54, -7, 75, -42, -46, 76, 62, -115, -4, 98, -24, 22, 7, -187, 39, -52, -15, -114, 32, 23, -8, -65, -4, 46, -71, -80, 62, 45, -41, 6, -38, 29, -12, -11, -22, -4, -50, -83, 72, 48, -86, -94, 40, 89, 75, -49, -64, -23, -36, -58, -44, -42, 5, 1, -25, -20, -73, 1, 102, 24, 26, 146, -188, 66, 60, -96, -33, 11, 58, 12, 62, -33, 91, -49, 1, -72, 86, -47, -72, 18, 24, -112, -16, 12, -101, -17, 96, 10, -44, 61, 24, 40, 61, -146, 39, 24, 56, -11, 53, 74, 52, 24, 13, 17, 76, -5]
5365eO3j07J93j90J56j07P7M5j70O8L3o9J3M5j9q8J34j47Q8k2M1Jm6o0O4Qj10
5392a11J27j08N2M6j15P7K2O7M7j12J20k02j0K15Q2k18J4Nn5O2j05J84j9j05J27
5417H7m6l9P7Rj41N5k0RK2k5m2k0o9J60n4m4J48j17J23l9rj31K13j15M2Nr6J05
5445D8l3j1l6N9o1K6R8p5n8O4R0j48J09Q2j06j13R1Q4j71M7K3j61K31j11n8J7
5471g3Q7N5j64R7J3j04lJ53r7k5Q8m7L7n6K4n3L1K6O3j71K30j7j03Ok9K9J50j25
5499B2R1j27j1J7P1k9kj24J8K8N1l8R1j40J30j22J51l1m7M3p1K7n3P1q5J35J2
5526G8j80R8M1o0O4j5O3p6J4n5J0R9j25J11l0n6Q9j37Q7P9j51M5P2o6N0n9o1R0
5554A9K6j02L7N1l2N6q5R2j50R6J9p3j1P2k4j7K6M2K8j10L1N4j09J36j06N2Rj4
$$ y = [-5, 58, -49, 144, -46, 110, 3, 80, 125, -45, 23, 56, -13, 0, 45, 26, -62, 72, -75, 13, -9, 32, 33, -13, -73, -9, -1, -111, 16, -92, -40, 6, -109, -32, -10, 57, 104, -8, 112, -90, -100, 115, 197, -21, -7, -2, -57, 5, -100, 84, 65, -40, 87, 41, 2, 79, 88, -53, 2, -18, -9, 13, -12, -54, -74, -143, 17, -37, -81, 67, -50, 73, 34, 25, -106, 107, -8, 34, 39, -57, 48, 15, 4, -32, 27, -34, -8, 90, 15, -43, 21, 111, -37, 72, 154, 48, -65, 26, 110, -61, -14, 9, -152, 79, -32, -90, -73, 14, 69, -95, 2, 15, -89, -92, 61, -36, -61, 27, -20, 17, -39, -15, -68, -37, -11, 52, -119, 111, 94, -9, -3, -32, -3, 147, 22, 113, -14, -25, -8, 63, 34, 32, -92, -74, -46, 5, -33, 58, -82, 48, -74, 77, 46, -1, 42, -29, -2, -55, 16, -69, 66, 78, -102, -4, 37, -23, 41, 26, 89, 13, 27, -28, -18, 81, -44, 67, 37, -19, 70, -67, 20, 99, -52, -7, 65, -1, 49, -10, -71, 19, 45, -57, -20, 31, -1, 55, -30, 62, -88, 8, 27, -46, -57, 15, -9, -26, 0, 42, 70, -40, -9, 45, -64, 72, -34, 18, 27, 13]
5582A3k0R1j08M2L3j64P9O9j15J05l4k6N0m1P3j23L4n0J55j44J65j44r1J44j27
5607a34J15Pm0J20n8m3J29k6j22J52q8O4k4m8l9K8J4J14r8j19J76p3pl7L0K4J2
5634B9j26K0K1J19m1mN9j52L8P1K4n3l7R4n1M6q2QN6j30N3qJ12p0l3j1J03n3J13
5663A15j9j02lM3k2J40j15p0K6M2j05M8j15J05J40j22L1m3M9j4n0M8k5M1p1J23
5689G5q8l1R1q7K4n1P3m8L2Q8k9L6q9O7J7j31K7N2P2K6j07n1J09r5l1J2J9qJ06
5718H0k4r8k1m0O8O3Mo4m5R3j24J88J9k03Q6R0q9P6p2l1kJ12N1r6Q1j28J27p1
5746C0m1k7j0M2Ol0O0jOM6p6m8m2J67j33q2K4K7J4k7O8j6jK2q4k6L6O9R9j07J17
5777H2j19oj0J56j63N4RNN9p1j20J85m8j12J97j80J34n6N0o5kR5q8M6r5M8r6J15
$$ y = [13, -7, 84, -24, 18, 51, -113, -34, 35, -80, 25, -9, -35, 15, -26, 47, -76, -42, -92, 63, -81, 84, -60, -151, -7, -134, -19, -12, -52, 68, 10, -33, 96, 70, -52, 100, 12, 76, 52, 4, -35, -7, 7, 121, 23, -96, 80, 7, 0, -37, -7, 17, 29, -97, -77, -56, 63, 22, 18, 77, -75, -37, 34, 58, 5, -32, 62, 11, 57, -25, -17, 39, -91, -38, -46, 66, -4, -37, -48, 55, 2, 115, 96, -6, -9, 34, 12, 152, 37, -33, -7, 35, -70, -22, -137, -32, 108, -14, 17, -26, 23, 9, -41, 7, -18, 23, -48, 75, -13, -44, 47, -40, -16, -67, 6, -42, -10, 78, 49, 85, -4, 63, 80, -51, -24, 28, 100, 126, 19, -32, 77, -18, -49, -37, -18, -26, 80, 56, -42, -63, -103, -35, 28, 32, -32, -77, 16, -108, 80, 99, -104, -18, 72, -17, 59, -13, -44, -46, 66, 117, 21, 102, -26, 101, 30, -11, -38, -48, -6, 0, -30, 30, 29, 35, 81, 5, -43, -85, 82, -51, -133, -109, -82, -68, -95, -27, -43, -44, -22, -106, -132, -96, -27, 72, -35, 82, -37, -43, -53, 103, -60, -6, 3, 8, 67, -4, -124, 61, 13, -99, 98, -82, 52, -4, 46, -19, -21, 74, -14, 32, -63, -15, -111, 4]
5805DJ1l8O0k24J15M2n8J6J6N9O5r4q3N6J8M7n2Oo2J49j13N9P9o0k7R0o8j4j00
5834a01J30o2N1O9r1PP6m9k3L9L4j41j52J98l5J26n7q0K1R9o1J75k14P3p7N2j36
5861a29J77r6l4K6K8Q3pj11Q3o4M8l9J41o8p5J6P8o1k8M7l6po8k8J80o7K8j5p1
5890f9R1r4O5Pj7q5R4QO8k7q9m3o5P6J96n1qM2j94J06k9J25Kj25ql7L1R0K7j05
5920a8L6Kp6P8p3N1M1K0j26L3KL3M1Jn3q0J33k27L87j69p1J25j51L2l9RK2R6j52
5949i3J10m6M1j2J51j53J28j78M5K3qpr3J66L1j74J47j20m6P3P3J1j09K8j2P0
5975D6r1k8K0M7m4rJJ13j05J20q1J15j9j11R2Jj74J44j25K32r2m5L8K8n1l4l0
6002d2J7M2O6m6m4J20j76J34j12N1J9n6o1M6q3N8M1KJ37o2k17J86o0q5K07n2l0
$$ y = [4, 15, -23, 37, -187, -72, -30, -88, -72, -56, 3, 68, -26, -109, -53, -35, 12, -40, -34, -96, 53, -60, -1, 78, 18, -9, 81, 13, -1, -101, 29, -33, 18, 87, -4, 3, 79, 30, 7, 46, 80, -61, -213, -15, -50, 76, 19, -61, -40, 59, -2, 173, -41, 32, -45, 7, -129, 48, -48, -82, -56, -28, 55, 48, -63, 20, -44, 4, -35, 106, 38, -37, -21, 57, -4, -32, 15, -21, -28, -96, -124, 56, -11, 17, 2, -69, 22, -72, -7, 0, -17, -102, -8, 0, 68, 41, -48, -91, -156, -80, 116, 65, 57, 99, -95, 11, -18, 107, 109, -16, -24, -61, -30, 60, 87, -18, 18, 20, -56, 22, -51, 0, 41, 61, -65, -32, -30, 3, 44, 45, -8, -88, 45, -182, 205, 36, -35, 90, -61, -29, -68, -59, -37, 59, -93, 17, -29, 12, 0, 151, -2, 126, -52, -7, 16, 8, 1, -92, 74, 105, -69, 78, -42, -88, -15, 58, 69, -40, -12, -24, 46, -45, -73, -53, -6, -50, -59, -58, 55, -50, 70, -11, 104, 85, -26, 66, 67, -107, 37, -88, 144, 52, 7, 45, 73, 22, -12, -42, -25, 17, 83, 37, -7, 113, -63, 71, -41, 10, 29, -27, -88, -42, -125, -67, -26, -24, 113, 51, -166, 20, -40, -125, 82, 30, 0]
6029@M7j40M5R4j31J29r5P3K0Lq3R5mk4K9j14R4m2ml4J61o0jj0N5j09MQ7j6j43
6059g4J04p6kJ03j35K2Q9m5L1qq5O3k5L7M5o6j11P4R7n7p3J23j17J06J11j65p
6086d1k8J22l9J0j5J0j54J37PKJ11j83O6l8oL4m5k6J58r6MP8k16J17r6J7J33p6
6114e3M2O4j5q9P0P4o0rJ5P3j22J5M0p4M8j0p0J52j49m7N5Q8m2k4P5p0k4J3k5
6143e9L9n6J31r2n2J59j36k0K25q6m8J63p4r4J23k26J03k1pM6r6J53n4k4j5M4
6169B6L1O5j31j37J49J4k9j1l4O3j06Q8J02l5l9n1J7L8m3L6j00J15j12L6J28j29
6195d9j4J3N4O0q0n8J05l4l2J04j51J62rj24N3j6N2r3O2n7L0J8M8M1j39Q5l8N5
6223D8p5L3O4o0m4j1J05j4q1KJ4M6j08J1Q3r2M9J3n0P3q4P2N3j03K8J7j27K00
$$ y = [0, 47, -93, -48, 46, -85, 44, -51, 22, 42, 45, -38, 57, 53, 29, 58, -56, 38, -4, -8, -42, 119, 59, 58, 48, 103, -6, -2, 85, 69, -74, 30, -46, -48, 55, -80, -58, 31, -14, 17, 9, -76, -13, -38, -1, 44, -22, -133, -59, 38, -19, -92, 31, -86, 20, 131, -34, -41, -69, 53, 14, 24, 9, 19, -135, 2, 9, 11, 122, -61, 5, -33, -39, -5, -50, -76, 82, -14, -10, 68, -148, -31, -127, -110, 23, -53, -11, 53, 38, -51, 19, 93, 33, 24, 39, 112, -10, 5, 45, -29, 19, 9, -61, 91, -58, -105, -50, 38, -4, -28, 47, -23, -47, -34, -59, -20, -76, 55, -37, -89, 70, -66, -86, 139, 53, 5, 168, 94, 0, 123, -103, 0, -21, -28, 18, -78, 75, 21, -3, -18, 26, 57, 122, -9, -146, 3, 17, -12, -23, -57, 6, -100, -12, 90, 55, 16, -35, -18, 20, -23, 13, -87, 28, -84, -48, 80, -49, -63, -50, 4, 64, -16, -74, 31, -3, -35, 69, -82, 80, 71, -53, 0, -16, 36, -57, 5, -52, -22, -4, 44, 85, -54, 31, -7, 48, -27, 6, 70, 10, -34, -45, 60, 46, -35, -33, -19, 27, -81, -70, 13, -79, -30, -17, -67, 6, -78, -6, 47, -56, -28, -11, -138, 62]
6251F2q1L4p7J2j3J11j4jo8N5N6m8j1k32K19j9Oj0l0M2q4O5L4k7P7o9J21j48P3
6280C5K1k0Nn8p8J15p1l1R2l8M4K8j6J0r6R7J5j36J99j03m5Q5J1l4k2m3m0J00
6308B6K6On1o6J23k13K16p9j17O9j6J57o9j01J57j9j1o1M9k7k7k6K3K7L6j00J48
6335H0q7o2J76p7J04j68j7J01q6L5jO8Qo6n6J7J7K5M4l2j69N0M8R1j06J8J02j62
6363a05J12K7L0j40M7Np6P1K5N3j26Q8M2K5j33J86j67%J7O5o4K1j8M3Km4J04j38
6391d8N1Kk7N9r0M1p0m2J23m8J12PL8n2j5q6J37p4m8l3Q0m9Ol5P8q8l8N2J12j24
6421f9J26j00R0M0j86K5m4J85r1K5k4R3k0r1L1k7O9n1J18p3Rj7j0RO2n2r4J39
6449G2qo3L3o9J2N5rM8j39J24n%K7k4r1M3rO2j9n5L4J08j78O2Mm1J8l9L9K35j63
$$ y = [62, -19, 15, -62, -50, -63, 48, 34, 33, -35, 20, 76, 28, 17, -215, 4, -15, -9, -19, -49, -7, -91, -26, 8, -19, 58, -11, 110, -38, 35, 56, 36, 41, -17, -95, 20, -51, -82, 10, -28, 16, 44, 28, 38, -58, 39, 54, -82, 117, 14, -31, 54, 65, 31, 9, -34, -74, 26, 52, 58, 7, -59, 64, -149, 67, -12, -129, -60, -76, 81, 12, -89, 68, 49, 38, -23, 26, -1, -28, -54, -31, -4, 32, -68, 80, -7, -69, 107, 30, 134, -34, -51, 50, -36, -1, -2, 66, 74, 8, -48, -31, -14, 11, 55, 23, -146, -96, -48, 43, -63, -45, 57, -105, 7, 34, 64, -76, -29, -24, -100, -29, -4, 49, -77, 11, 53, 78, -55, 131, -36, -36, -19, 46, -18, 3, -15, 28, 30, -14, 90, -48, 3, 5, -22, 37, -53, -12, -82, -124, -1, -49, 63, 70, 108, 56, 41, -45, 92, 18, -30, -63, 17, -32, -26, -61, 17, -71, -109, -57, 55, -69, 57, -43, 47, 87, -99, -74, -118, 67, -24, 1, -23, 70, 50, -41, -10, -37, 32, -19, 99, 26, 35, 18, 8, 17, 79, 27, -67, 72, 64, 1, 34, -35, -23, 32, 23, 71, -68, 56, 51, 51, 78, 54, -37, 6, -3, 59, 40, -15, 19, 127, -51, 11, 15, -26, -8, -47, -8, 227, 64]
6480F4qj74K8J29j53K02j14O6j39m7J38l4o6P6J29j40q7J30M6k0o2m3R7k4K4o8
6506e0J08q2M2Om5N3N6j06Pn1K1O2J6p2J42j27R6j91J51q3Q9R9p2m9p6j3j9J26
6534C8l9M8p6M1L4pQ6j98J00O6j03O5q9M2l6l1J46o6O4j61K1N5ln1M3Q8j33m9
6562a05O2jK4L6np2n9P2L1J0O1j62nK22j39L4R5j77J88j25k8J19Qj32R1Qj2k7
6590A2m5J0Lq5L3J59r0J42j32O4p3J03j27pj1O6l6m6l9J76m7j23J04l9M8m7J8
6617iK6m7R4j3L7n3l2n8J87j94%J52j84J66p5M2q0J53j55oJ52j10L7L3r3J09j12
6644c3q1J13L0j10M1O9O5n6l5l7O8j23N8J15p3N5K7J7q7j15J08m2P3k9o9J78q7
6671D0P6j7j57J30j17J19r6K2qM7k07Q6J17o8q8M1J30n7r6O5J62k16M6j4P8k7
$$ y = [64, 56, -118, -90, 39, -114, 88, -26, 40, -99, -146, -8, -42, -108, -32, 97, -43, -130, 0, 46, 26, -36, -79, 18, -6, 18, -50, 58, -24, 18, 24, -21, 32, 88, -18, -11, -62, -41, 21, 37, -35, 107, -20, 76, -115, 36, -47, 42, 141, 69, 20, -56, -69, -88, 38, -1, 47, -29, 12, 46, 39, 125, -73, 27, 93, -10, 55, -34, 8, -28, -59, 87, 21, 85, -76, -55, 0, -3, -54, -11, 77, -56, -105, -43, -44, -20, 16, 11, -61, -120, -48, -17, -7, 54, -108, -113, 109, -30, 4, 99, -78, 110, -15, -43, 76, 84, -48, 43, 51, 39, 12, -33, -23, -20, -105, -72, 87, -3, 139, 7, 71, -2, 101, -26, -33, -44, 22, -14, -60, -99, 77, 30, -93, 11, -28, 20, -27, -9, 17, -30, 64, 51, 88, 35, 3, -55, 132, -62, -62, 90, -94, 72, -3, 39, -41, 112, -43, -49, 103, -7, 30, 63, -30, 79, -33, -114, -1, 29, -81, -40, 29, 94, 38, 3, -34, 34, -89, -31, 84, 11, 66, 93, 110, 23, -92, 16, -26, 47, 18, -51, 127, 40, 116, 99, -58, 72, -45, 74, -22, 0, -8, 39, -168, -82, 35, -33, -121, -80, 50, -7, -103, -38, 124, -92, -46, -60, 18, -9]
6697iJ9n1o1K22j68J2jQm6R8K3k4n2J85j06j55J82pq0J51j04j2n0m7M9Q6o0L2
6725C4l8j09J10j36J41L2r9k2O1j4J43j41p7J24M3j80O0L1JNjQ9L1j44R1m1R3
6752H7j41J11j8L7o0j12P3J09qm4nr1N9O8k3r2R4K0j17m0J05o8J2Q7p8jQ1j13
6780f8n3J16L2L1r1j1j4p5J60m0O4L0L5o9%m7O4j0n7M4l2k3L1p3J6O1m8NK2j7
6810a7J9o1P6O9q7o8N4R6j04J8j01J5R1l6k4P3QOJn4J79k42J84l2m2%J02l3j00
6839a0O2n6M3J07p2j6r1P9J7j90J88o6L2m9M4N2j54R9j7J3n7O9nl0L0M7l5j12
6867g8P5L4J12j87O9j18J64r1rN7p4j6qJ41m4J1m1M5j13M4J28k68J18N4j93L35
6893A47r4n3j8O3p4Q3k2l3l1K43j33m1l4K3L6j95J33q8J43j27Nm5N7j9P4o3L6
$$ y = [-9, 10, -41, -102, 120, -48, -36, -37, -29, -75, 23, 46, 22, -30, 155, 49, -106, 76, 69, -11, 140, 36, 24, -26, -73, -24, 62, 2, 34, -4, -113, -3, -139, 2, 34, -65, -87, -26, -40, 103, -38, -115, 9, 52, -128, -68, -37, -36, -31, -32, 57, 88, -56, 35, -6, 87, -54, 57, 39, 76, 16, -96, -23, 86, 78, 34, 29, -62, -3, 65, 42, -50, 44, 64, -53, -93, 12, -56, -44, 43, -35, -36, 45, -68, -121, -5, 27, 58, -33, -44, -58, -133, 27, -13, 51, 81, 116, 47, 47, 0, 64, 54, -3, 41, 9, -14, 17, -56, -40, 21, -27, -22, 0, -17, 2, -59, 17, 86, -1, -69, -15, 81, -23, -5, -106, -91, 0, -36, -60, 13, 21, 27, 28, -26, 153, -89, 95, 63, 21, 21, 123, 90, -10, 52, -4, 39, 146, 74, 58, -33, 46, 63, -127, 61, -5, 27, -22, 22, 74, -80, 19, 2, 15, -42, 27, 22, -8, 22, 69, 34, -78, -3, 31, 143, -44, 25, -93, 71, -20, -29, 28, -46, -62, -70, 71, 27, 38, -3, 42, -71, -27, 101, -167, -49, 5, -188, 147, 53, 0, -18, 45, -29, 54, 32, -1, -32, 211, 78, 37, 3, 26, 62, -133, 0, -88, 55, -72, -67, -112, -55, -74, 0, -63, -27]
6920b7K8m8M8r9J26n1L6lJ4j07J54j87J77j3m1KK6j53J17o9R3P2p9J9o9p1J35
6947C0j3k3k4R8N8o2l6o%n5J01k15P8j6P0rM6j17J82j41N2J4O8q1O1J16k28J16
6975F4m5K4K4l5Kj1J6N1K1j44P6J05k30j0M0k0K2oK4M0k0Ojk7L3Rj0ql0n3R6J37
7007A40m9l7o6L4l2k7j0N2o8J18k5or0J03j3k8O8j5j72J59m3m4k7Q5J2p9k2jj6
7036i9K6J21K0o2jK7j12j8l9J83m3O2o6o8KM1n5J52O7j41Q3j6j32K8J02m5k4Q
7064Ak0L8J8j24J11r6K4P9RK6r7O1k2j7JL8j37M3RN1n0O0l5p3J52r8M8J0m2J26
7094I4j54J15l9Q1M4k29J05mN2m4RK3r6M6jj2J5Q4l3n0J6J04j43q5L3J26p4l0
7122d7jP2J29j94J1mjM3l2m8O5P1r9k5Q9m0N9N3n3m2j7P0o4j06J24N0o0Ol1l0
$$ y = [-27, 1, -47, 1, -98, 28, -23, 13, 10, 24, -83, 71, -116, 61, 48, 7, 9, 35, -118, -1, -70, 23, 95, 16, 35, -34, -105, 30, 17, -6, -30, 68, 126, 64, 28, 22, 22, -33, 68, -147, -69, -85, -15, -24, 22, -95, 87, -54, -2, 12, 80, -1, 60, 176, -52, 64, 19, 43, 67, 32, 34, 23, 39, 90, 111, -33, 43, 148, -82, -92, -52, -72, -50, -56, -32, 8, -12, -6, -7, -34, -1, 8, -2, -10, -40, -93, 3, 140, 91, 54, -12, 22, -10, -37, -47, 5, -63, 55, 30, 24, -66, 37, 24, -4, 64, 49, -123, 36, -7, -51, -78, 7, 19, -60, -82, -83, -99, -73, 48, 68, 6, 5, 32, -80, -98, -137, 46, 3, 65, -1, -69, -67, -26, -81, 71, 138, -3, 80, 64, -68, -40, 62, 17, -7, 1, -19, 19, 37, -87, 24, -72, -48, 31, 40, 66, -31, 30, 8, -9, -8, 30, -107, -64, -55, -4, -54, 6, -29, -102, 50, -48, 0, 10, -32, 94, -60, 55, 16, 97, 141, -88, 17, 13, 65, 21, 30, 53, -43, 3, 2, -10, 5, 89, 56, 6, 22, 126, -17, -102, -69, 57, -17, -47, -48, 24, 153, -41, -30, -34, -35, 8, -24, -72, -7, 64, -35, -60, 29, -11, 48, 101, 48, 6, -11, 59, -5, -111, 13, 63, 3, 9, -22, -52]
7152e2K2P8q1k2L0r8J84j03K1MO2P7j40Pj18K5Q0j05O3j4K5N5j12Q2J0O3L6q6
7180g%k4M8m1p6J81k5k1j06N3p0P1R6j22L0o3J10m6O6K9Oj03MR4j21mjpM8j6J8
7211AJ3l5N5o4L1o4O8qK8RJ9lj3J1R2k46R2J8mq0M8J42j68l7J54L4j81K41j26
7240B7j5J6l8m7RM3l9p8O3KL6J40n9r6J21n9qj70J52N2j02P4j7l7K3K6Q4j25k9
7269e1J13q3N8M8j33J04j38Q1j6O8q4N7L1p8Q0m4m3m6L3L1p2O5n1R5l8K2J5Qm8
7298a6m1J29j32m2P8Q2r5m2Q2j0n4O3J16j05Jp8J4J3J07r4M0o7RJ8N6n2j8M2l
7327Al0n7J21J0j18J0Q8q9j7J72n6j07J20k7K6p9J3K8m0J5J09j46R2m3k3rJ9n
7355b2k5k0LJ13K9j76O9l2m6J65k1Nj12O7j43J87k0l7M8l1m4R6p0L1q2R7l3J2
$$ y = [-52, -30, 48, -33, -55, -25, -123, 61, -42, -21, -17, 45, 122, -18, -11, -129, -104, -24, -129, -66, -80, -55, 0, -112, -30, -20, 43, 79, -7, -7, -31, 17, -24, -100, 81, 56, 35, -71, -18, -88, -17, 79, -43, -13, -76, 34, -12, 54, 83, 89, -14, -10, 84, -37, -41, -42, -49, -1, -17, 1, 14, -21, 34, -30, 1, -63, 5, -3, 25, 34, 53, 50, 37, 48, 140, -106, -14, 4, 0, -80, -32, 110, -58, -95, 59, 93, -88, 153, 27, 12, 28, -10, -57, -48, -5, -44, -122, -59, -57, -21, 119, 60, -36, 85, 26, 18, -152, 0, 52, -50, 24, 7, -30, -7, 19, 103, -22, -51, 62, -21, 37, 85, -48, 56, -82, -1, -17, 51, -33, 24, 55, -23, 57, 13, -30, -76, -43, -12, -84, -19, -70, 25, -13, 9, 24, 32, -16, -57, 72, -60, -102, -24, 58, -37, -79, 3, -7, -61, 2, 118, 13, 14, -64, -50, -37, 70, -24, 16, -51, -42, -24, 32, -20, -38, 4, 1, -29, -86, 35, 45, -73, -63, 25, -64, -81, 91, 35, -72, 48, 21, 47, -32, -19, 9, -31, -16, 93, -53, 39, -4, -27, -36, -17, -22, -47, -67, -64, 49, 78, -98, -29, -61, -107, 58, 37, 42, -70, -3, -146, 41, 21, -16, 32, 1, -43, 53, -17, 14, -68, 29, -4, 8]
7383Hj40J4J42k4pJ4j22J73K8j46O4j37K10j28k4J82m7j05L8j3O0j12J43m5p5
7408d9N8n8m0Q9p7J13j41P5M1P6n6j03J62k41J79qj16J19j06O7k2N5j51J21J27
7433A14j74O4j6m5k3N6L2k3M7L3M8Lj43R9j47Q1K9o5J2K7q5P2l6K4ON0m0r8M1
7462e7L7OJ19j41nJ0o4P0N1Rk2qo4N6K4l7n0J40k1m8n4M0Q7Jl6mp5LK4O3l8l6
7494b0M7r8O6K8K1l5j37R0K2O6j73J92j01mP9M6n2l9J7O9J8k15J80m5o3J51r3
7521A7n2QQ5O5j01l6l9R2j07P6M4m4rk1j9J05k09J80k00R2J81p9j6K3q5O6j36
7548a19O5OPN8k0P5K7j73r2J81rjr5J06J7k8M6l4k5j0L4M3n3n8Q8qO0q9l4M6p7
7579f6R0J13l7j65J05o3k1m7R4K9O7p1K4l8r1J08j10O1k3oJ10k8l8RO7n5L2L6
$$ y = [8, -132, -118, 24, 0, -7, 7, -115, 58, 86, -60, 4, -133, 77, -51, -75, 107, 60, -45, -7, -20, 40, -72, 71, 26, -49, 9, -49, -89, 0, -77, 36, -105, -30, 11, 87, 31, -72, 90, -151, 28, 20, -96, 23, -83, -16, -38, 17, -134, -13, 114, -60, 4, -12, -57, -80, -24, 8, -15, 32, 65, 113, 116, -27, 72, -75, 6, 35, -30, -18, 9, -76, -4, -40, -16, -10, 40, 0, -98, -57, -20, -14, 105, -36, -41, -31, -95, -25, 26, 35, 13, 5, -59, -3, 21, -16, -66, 74, 53, 5, -49, -9, 78, 79, 43, 39, -36, -33, -9, 54, 16, -20, 27, -71, -5, 23, 44, 9, -128, -38, -16, 50, -123, 69, -32, -36, 43, 89, 37, -2, 15, 84, 102, -113, 67, 22, -41, 110, 17, -35, -27, 58, 123, 22, -14, -53, 39, -68, 8, 52, 8, -1, -22, -41, 64, -145, 35, -165, -73, 108, 29, 13, 36, -49, 17, -119, -54, -48, -41, 17, -3, 72, 99, -74, -166, 15, 6, 5, -90, 16, 33, 5, 51, 17, -8, -18, 16, 59, 6, -52, 36, 28, 88, -1, -35, 11, -66, 24, 137, 100, -65, 40, -23, -44, -91, 3, 32, 99, 28, 52, 14, -77, 31, -79, -18, -41, -47, 63, 35, -3, 6, 73, 18, 50, 86]
7607H6p7l1j4O0q3q9J61Q5N4j18l7K4j16J26n3j05N5J6J33j21K7L2l3P2p4OQ8
7634G4p0m4mJ7J32j17L7J0j24J50k5K5j24N0L0j26J37l1Jj07j9J10K5M7K3j21
7660d4K5J54q1o3j8l9k3R6j2p6R6j06Q4n7L2N6L2j24Q2q8R8r6J48p9J05j28j0
7687c6J43p0Pp7R3p7qM0l9k6L8k39K90%j7j21J41m3l7OQ5J8j22n3J00j9l1LK8
7716b3N6l6Q3n7k7Rj04j2J53n1o1J3O9KQk3o6R9J33j81qJ15j87R7k6Q0o0L1k7
7745aK0K2l9Jq5L4N7m9Q2r3J17l4l2j4j2o8J07kJ11j41O4L0J7k1k7l9L9rJ9r9
7775d5Ok5R6J7q8J74j20J5l8j4Ln8Q0N0r0O3M7Jj70RJ34k9r7P9n0k6J18k0m9L0
7805Cqm0J27l9qj7l9J29j52l0J02K4o2L8jn9N3l6LQ9n0o2R4n8NP3j89P9j17J55
$$ y = [86, 9, -22, -36, 24, -59, -148, 13, 98, 152, 34, -3, 21, -95, 31, -22, -127, -72, -56, 77, -44, -17, 15, -18, 54, -20, -14, 74, 4, -40, -44, -27, 105, -12, 25, 35, -89, 61, 36, 61, -63, -13, 17, -109, 28, -3, -2, -109, -128, -18, 7, 54, 77, -44, -19, 135, 54, -9, -27, -66, -89, 7, -5, -81, 15, -91, -7, -64, -32, 24, 56, -68, 14, -74, 24, -72, 76, -3, 102, -26, -36, 107, 37, 44, -33, 60, -17, -25, 15, -24, -50, -12, -251, 39, 39, 22, -99, 42, -1, -38, -32, 53, 71, -51, -104, -4, -23, -54, -51, -23, 33, -3, 80, 23, -4, 5, -99, -111, 42, -9, -70, -57, 12, 14, 22, -1, -67, 32, 165, -16, -24, 91, -96, 1, -25, 55, -5, 26, -1, 19, 41, 2, 3, -82, -48, 9, -40, 42, -51, 66, 32, 0, -14, -26, -94, 13, 11, 122, -19, 45, 75, 92, 71, 44, 5, 44, 35, 54, -45, -39, -64, 32, 49, -39, 135, 15, 30, -8, -22, -19, -77, 3, 53, -37, 26, 73, 74, -96, -87, 47, 18, -79, 0, -50, -76, 42, 22, -27, 3, -5, -45, 82, 43, 35, 18, -21, 108, -44, -74, 28, 52, -10, 28, 27, -32, 21, -15, -12, 77, 27, -35, 59, 1, 6, 79, -110, -31, -148, 7]
7835GK3j07J11p0J08j63J69k1r9K0l3Q0p0k7M1Jk2N1K7k4m0J08N2j17j3O7j17
7862e8P1o6nJ20j11J01L8n3j39O7J1Q1j20J06p3Q6j00j9J06j38J37m0j7o3Q1r5
7888i2J11k8l9N1J3n3J38k6o9P4n4l7P3j85J72j35L0K08j72N1m8K9J00o4K6k6
7914D8n4q8R0m1L1N7j07N2n9k3K2J30k5r8KN0L9k9j70K13r3R2j02J37o0k4n8P
7942f1Q2q9Pk6J80o1K7p9m9K0RO8K6oj01Q4n1p5J14R5j35l7L0k0J11k08J28j11
7970a28J74j06L7J9J8m9J5L4l8r9O6o3J55L1j64R6qN4Pr5R2op1k1R5l9k4M2k5
7999aL7o7j9n8rJ46n0O5lp0o5J11K8j03J28m8q2J09r6PJ09j04Q0p4R6r9R2j15
8027e5O4l7KR7l9Nn5J22j62P3J6r0MJ09j75P7j7O0j09J00jp8N7N1q7J40o0n2p
$$ y = [7, 30, -77, 34, -36, 72, -91, 78, 57, -42, -22, -55, 25, -45, -72, -31, -30, -52, -1, 26, 2, -38, 70, 122, 5, -8, 59, -58, 13, -53, -58, 62, -49, 52, 90, 37, -102, -35, -24, 57, -63, 43, -30, 56, -44, -63, 43, -95, 42, 2, -15, -78, 3, -92, 19, -9, -48, 3, 16, -37, 101, 75, 6, 80, 26, -11, 62, -123, 49, -86, -56, 152, -20, 31, -17, 12, 112, 48, 74, 48, -6, -94, -4, -45, -14, 43, -64, -12, -71, -94, -72, 58, 33, -65, -63, -13, 26, -3, -173, 40, -53, 39, -63, 74, 14, -10, -68, -61, 21, -68, -61, -87, 93, 32, 59, -20, -69, -49, -40, 28, 54, 48, -53, 31, -20, -95, 19, 114, -21, -58, -28, -48, 63, -145, -17, -128, 46, -60, -23, -4, 14, -35, -20, 14, -24, -123, -57, -120, 35, 66, -98, -2, -10, 44, 51, -44, 48, 42, -29, -50, 45, 6, -18, 24, -1, 36, -31, -50, -108, -117, 29, -21, 44, 41, -29, -94, 17, 45, -58, 70, 22, -60, 49, -47, -40, 69, -35, 45, -29, 67, -32, 60, -55, 9, -28, -26, 71, 32, 37, -18, 104, -58, 15, 31, -59, -55, 54, -121, -44, -61, -1, -110, -10, -11, -89, -32, 19, -68, 72, 12, -40, -47]
8056d7J5K7J66r8j00K0l8J11jp5K17k96J9J28K9r4n0J9P5rJ6q1J11n3l2Q9q3N7
8084D2p7M5p0K13j59p9LN8L9l5j04Q2R3n7L6j06J03o7M9k3k6J00K0m3n3J33o0
8111E7m1m4m0J5K5J2k1j0Q7Rj03J45j61J36kk2K9j37lj6J14j5j5r4K14j01K1j03
8139f4P6j06J65j04L7l0M6Np8J22j47N3k6J1M4r1K6M0J18p3l4j7l9J29k8p0J48
8166A13j53k6N8j09J56Jn8pl5J58n5j17M4K0l1P0j36O3PJ48n8n3J4j53M7
$$ y = [-47, -32, -5, 161, 63, -37, -17, -55, 56, 55, -20, 197, -99, -80, 48, 77, -17, -67, -48, 27, 18, 34, -47, 64, 11, -21, 68, -15, 42, -35, 10, -60, 153, -6, -85, -82, -24, 15, -20, -124, -42, 51, -6, 30, -76, 27, -40, 9, -14, -40, 60, 80, 37, -16, 117, 57, 16, -28, -68, -53, -28, -16, -37, -47, 40, 49, -54, 91, -70, 66, 64, 42, 71, -66, -69, -85, 29, 14, -1, -95, 119, 18, 39, -64, 12, -94, 71, -33, 4, -26, 20, 25, -53, 69, -78, -25, -51, -40, 4, -87, -61, -21, 97, 24, -10, -27, -66, 63, 35, -35, 113, -40, -66, -8, -117, 39, 40, -18, -25, -60, 98, 43, -74, -30, -10, -41, 29, -107, -44, -37, 111, 53, 0, 14, -139, -92]
8191i2
$$ Imaginary data points
##PAGE= N=2
##DATA TABLE= (X++(I..I)), XYDATA
0@%%%%%%%%%%%Qj6J6j6J8k6L2m0M8n6P2q1R0j09J32j53J77k07K34k67L05l46L94
34B09m43M99n63O32p06P89q79R77j086J203j332J472j625J794j976K174k396K643
52A386k912L211l547L925m353M839n402O064o857P818r014J0560j2637J5595k0185
67a1509K8357m7417J78697J47031j17522l7033j37542k3120n0075o0010j3857
78a44000l4453l8466N2186N318O0450Q1487J5113L9880L2294j7071O2918L0319
90A45975J350J8454o9401q2091m1127q1884j1211J4920k2347L5632J8368l617
102g6979O6469L2246L6602O4408j6421j3565p089n1112J8043J8485k2357J1829
114F0559m8637p0211j5702m8566r235L2589j4955K5393K5990q862N6573M1078
$$ y = [0, 0, 0, 0, 0, 0, 0, 0, 0, 0, 0, 0, 8, -8, 8, -8, 10, -16, 16, -24, 24, -32, 40, -41, 49, -60, 72, -81, 96, -111, 123, -144, 161, -185, 209, -234, 265, -298, 334, -372, 417, -462, 515, -571, 632, -700, 772, -853, 941, -1035, 1139, -1257, 1386, -1526, 1685, -1862, 2063, -2290, 2549, -2853, 3211, -3646, 4172, -4842, 5718, -6919, 8676, -11509, 16848, -30569, 148128, 295159, 177637, 140604, 3062, -20058, -70133, -130143, -144000, -178453, -216919, -164733, -159415, -98965, -17478, -2365, 37515, 69809, 52738, 115656, 145975, 147325, 165779, 96378, 14287, -26840, -108724, -119935, -105015, -127362, -91730, -73362, -76979, -10510, 21736, 58338, 122746, 106325, 92760, 85671, 34559, 52602, 71087, 48730, 60559, 11922, -58289, -73991, -122557, -131792, -99203, -114158, -88765, -62775, -71637, -15064, 26014]
126B6014K4053O0596j0502k4531L515l9546J0458L0264k2607N235l0701o6642
138c4394j1493l4689j9961L1553j4077Q584L0083r252M5780N1405J6425M6273
150A06237j0211m4059q529m2850j3898K1809k7984m499r954m8204P034M316l90
163g1182N1337J3103J0747L8212m263K8701M4161n419J3154k4102o9422k6359
175a332m3469l0572J9328j7762l316J4821k3684K0887L0654P287M9088J6541r589
188B8882K2038j4020K061L3077j4254k519j4454n9119j5218j4965j7895L3751
200c2635M243J043K7554j2581J1628L0817n242K2598K886l4806q66k0283j5702
213b1346K6642r536o190L204l7669l437R837p106L4851J5380m874K3597r280j453
$$ y = [26014, 50067, 110663, 100161, 75630, 79145, 39599, 50057, 80321, 57714, 62949, 32248, -34394, -45887, -80576, -100537, -68984, -83061, -74477, -44394, -53646, -7866, 43539, 59964, 106237, 96026, 51967, 43438, 588, -13310, 8499, -19485, -23984, -33938, -82142, -75108, -70792, -71182, -19845, -6742, 4005, 42217, 37954, 66655, 110816, 105397, 118551, 94449, 25027, -1332, -44801, -75373, -56045, -73807, -77123, -62302, -85986, -65099, -34445, -27158, 21930, 38471, 28882, 50920, 36900, 38961, 72038, 57784, 55265, 40811, -18308, -33526, -48491, -66386, -32635, -28392, -27349, 205, -12376, -748, 30069, 24827, 47425, 50311, 15505, 14639, -5644, -21346, 5296, -4240, -10430, -7226, -44895, -48332, -38495, -45601, -10750, 4630, -244, 23353, 14073, 12620]
227A2620K7737p901Q055M355l7728o409q905j6449K7224O33r120J0569k6818o935
241b9072J5518j0885K0408J3160j7155J2422p070j0595K6372k359J452J1507k9446
254e743o072M214j3673K4205Q680j2387J2841j5603r735J9907p291J1125J5214
267B5682k0738L222l665j6963K0038M41p776J0295k4362j1346R789j1499J7115
280i767J4164j2798J2280m686j0042K2092j122L446J5995k0276n420m75j9348
293a5957J3518N336j1197J1746j3355j0316J7412n148J1431J7818j4166N509j143
306A1488j6652J4608j129p231J1551j9691j2579L946j6251J1447J4501p727J5097
319A378O16p190K1271P37L493J5122j7290n552j737k1669O260J965j1381J1102
$$ y = [12620, 40357, 32456, 40511, 44866, 7138, 729, -8176, -24625, 2599, 3232, -5888, 4681, -22137, -29072, -13554, -24439, -4031, 9129, -8026, 4396, -2674, -13269, 13103, 10744, 12196, 23703, -5743, -11815, -7601, -21274, 2931, 11611, -776, 12065, -3538, -13273, 6634, -657, 10468, 25682, 4944, 8166, 4501, -12462, 7576, 8017, 241, 10536, -13826, -25172, -15383, -26882, -9767, 4397, -8401, 3879, -807, -10849, 11243, 10121, 13567, 29562, 9286, 3866, 3391, -15957, -2439, 2897, -8300, 3446, -9909, -20225, -2813, -7961, 3470, 21288, 7122, 12631, 11488, -5164, 9444, 8315, 1084, 12635, -7056, -19635, -15689, -31940, -20493, -5992, -13719, 1378, 1994, -5196, 16075, 16812, 20305, 35427, 18137, 12585, 10848, -10821, -4561, -2596, -13977, -2875]
333b875j0454j2202J0834p395Q462J9173o395J0521N778j0196J5648J275p047
346A5127R356j7238j3899J38j8893L571J0126p603J3542J094r705J4575j219K625
360A597J7616q346J303O474j3267Q543L094j1992O811j2253j6527L600j3457Q41
374b5963J5173m680J1250P930r206J2787K418m193J3802q232n369P766j1755M196
388E924P434j1728M701n941j7453L384q875l410J5877k699P188J2468o586J0663
402A0947P246o913R661n930j0564O407j0277k285Q131j1518J107q17j6837L076
416a8566k348m690J6792K599N172J6534k891P766R084j0765K647o446j7287J800
430e99r758p541R488p078J371P222j0752N518N175m266J5409M596j92J4321l403
$$ y = [-2875, -13329, -25531, -14697, -22092, -13630, 5543, -852, 9669, 15447, 5251, 20899, 22174, 15127, 24483, 7245, -6654, -6516, -25409, -21838, -11712, -19315, -5773, -4679, -14384, 191, -1028, 1597, 19213, 10867, 12170, 18644, 5377, 13920, 17014, 5022, 11833, -420, -16947, -13347, -26804, -25963, -10790, -15470, -4220, 3710, -5496, 7291, 9709, 5516, 19318, 11086, 5717, 13483, 1728, 5924, 13358, 1630, 6331, 390, -17063, -13679, -22554, -25964, -10087, -12786, -5598, 6870, 284, 10947, 18193, 11280, 20941, 15011, 4447, 10854, 577, -1708, 6423, -5095, -3988, -4805, -21642, -18566, -20914, -25604, -8812, -6213, -1041, 15493, 12602, 20368, 29452, 18687, 21334, 14888, -2399, -599, -10357, -17898, -8410, -15488, -14117, -6895, -17647, -12129, -6954, -11220, 4189, 8785, 8593, 22914, 19511]
445A9511k44O672j3987m724n202j8429P0m070o958J3051J063L469J3793m567L942
460C390P852p062P360K229p794Q294l538n575O003j1424n916O64j3899J262K755
475a5399n035J3734O184J545J3902l011j319O194j0674p87P61j1426M923J92o514
490f730Q028m986m755O375q606L24O072n742R490P039k377J0793j433n506N187
505A3173j0211n266K022j0398L298M405n903Q222K11m854P896n059k931O415o433
520e413M401P714m342Q269J816o606M939p636q258K903q759R5O250n975O142M066
536c94m351Q634r21m000P232m850N74P767m961M243L421q674J872o166j1247K442
552i379o281j966Q590l150O247R650j406R614L928n484N628n267o331L853q332
$$ y = [19511, 19267, 25939, 11952, 7228, 2026, -16403, -16333, -20403, -27361, -14310, -13247, -9778, 4015, -552, 3390, 11242, 4180, 11540, 13769, 5975, 14269, 10731, 5156, 11159, -265, -6181, -5517, -19416, -18154, -15399, -20434, -6700, -516, 1029, 14931, 11920, 10601, 16795, 6121, 5334, 6095, -5331, -408, -216, -6730, 1298, -3688, -8443, -2068, -10674, -10350, -4278, -10020, -530, 6509, 4132, 14925, 13492, 7986, 13173, 2962, -2304, -282, -10680, -7382, -2977, -8880, -658, -447, -5301, 2595, -2464, -5395, 1020, -5413, -1012, 6702, 2360, 10629, 12445, 5839, 10778, 3142, -5116, -2213, -10972, -10877, -4627, -10602, -4460, -394, -4745, 3889, 2968, -1032, 6200, 1350, 1924, 9691, 4730, 8973, 12394, 3720, 5592, -574, -11821, -9379, -15660, -17626, -9036, -12186, -5939, 3711, 2305, 11919, 15847, 10363, 15991, 10724, 4393, 8246, -86]
567h6j888K913r879k0k155q985N753R40L43J1999J519N003J1482j574N075K735
583B3175r957p85p554j2398L17p036l360O493m386K466N842l514Q600O204o01
598C506R786Q3k029O643n446k089R36j1588l452m455j1266K718m19n30J1194Q77
614e531K765R000k379N121O047n068L721k110p369L434m940m196L621p853k647
629h384L85q468L331L592j364R791J651r02P584k151J812O080n491J191k7q191
645D39K741j974m742M645m981m050J960p243J533N404j727P863L699k060P495
660I002j4n7O490n277k359l68j0134j211j488o779M000k503m390M874k811K988
676a0037R987J019P575O018l074N268M1m404L235p111p137j777j1189l231R56
$$ y = [-86, -1974, 939, -8940, -8960, -11115, -20100, -14347, -13407, -13064, -1065, 454, 5457, 16939, 15365, 20440, 23175, 13218, 12433, 4879, -7519, -7202, -14238, -17598, -11105, -15491, -13025, -7183, -10697, -2097, 4107, 3506, 13292, 13375, 11346, 17989, 12543, 10454, 11390, -198, -3650, -8105, -19371, -16653, -17072, -17602, -6408, -5531, -2766, 6234, 3855, 8976, 15023, 9955, 13676, 11566, 4197, 7631, 2691, -1505, 2116, -5737, -8384, -7999, -16467, -13136, -9544, -10908, -1117, 534, -368, 7216, 5065, 6877, 12957, 7466, 8657, 8630, 439, 3180, 1206, -3536, 1109, -3872, -7922, -5962, -13205, -11672, -6268, -7995, -132, 3567, 1507, 9002, 8988, 8931, 15421, 10144, 7785, 7417, -2717, -3928, -5416, -12195, -8195, -10698, -15088, -10214, -13025, -10037, -50, 969, 8544, 14562, 11488, 16756, 16797, 12393, 15628, 8517, 1380, -397, -11586, -14817, -13861]
691a3861m885N383L078k026P769J885K942J0613M69K430L289p237o55j649p891
706c46J072m549o832J529n302n81O793N0O600O568j983N464J671j922O143k702
722A1673l895M10r009l391J35o378K373P23m336M309r80o42P924K41L105N335
738G597m546J841J969l713N093l91m234K650n299l061L035m358J544K039n405
753e239J927j087l582N691L5k00M730l925O68M045k414M489K296m631K162l834
769A131m993K817l929n03L405m543J574K598k021O864L122o64N225l014j827L141
785H383m235N08P17p050m66l312o337L002j396k97N730j968J882N259j160N921
801E181L827k815L047l033m510K554l413o26L100m797M46O61m502L765R21j859
$$ y = [-13861, -18746, -13363, -10285, -12311, -4542, -2657, 285, 10898, 11367, 13797, 17086, 9849, 9194, 7545, -346, 726, -3823, -10655, -9126, -14428, -15009, -8216, -8166, -1566, 5002, 3019, 8483, 10154, 8232, 14375, 11673, 7778, 8188, -821, -4212, -4077, -10455, -8082, -7359, -11695, -7386, -8366, -9008, -1084, -843, 2262, 7597, 3051, 4892, 6861, 3148, 8241, 7850, 3616, 6266, 967, -2094, 941, -3417, -1873, 166, -5239, -3312, -4399, -7981, -2290, -2255, -2455, 2275, -1650, -982, 3063, 649, 5138, 7434, 2803, 4965, 1131, -3862, -1045, -4974, -5477, -2072, -6615, -5041, -2443, -4464, 2400, 5522, 4858, 10083, 7069, 5242, 8383, 4148, 4656, 5373, -1677, -2143, -5455, -11792, -8790, -10186, -10483, -4753, -6721, -4839, 420, -740, 5181, 9008, 6193, 9240, 6207, 1697, 4251, 838, 212, 3312, -1485, -1039, -378, -4880, -1115, -194, -2053]
817b053M530k680j857L351l121J784K983m548J372j125m505L798n21k65N333k187
833B89J10K474m214K215J621l422K953j776l297M010j322J323M886l029R53J006
849D780m901K374j21l023L345l294k901J671m651L54K703l456K614M94k448N084
865a376J609J227O201j462J69J908m740Q70M34l926K099k080m061K044l144n65
881d793L734l117J045J691l357L674J821p32M782j199j782K109m443n42J601m054
897c562J924L9l710L083o07l41N249j498M70K896k986K475K425k061L328j015
913F109l587J223m262k605J569m128K11R13l952K748J357q64N213m5m90L834k261
930I83J214L514k403K439N07l844J527k560l086K423l131r69J876l661J666K404
$$ y = [-2053, 2477, -203, -2060, 1291, -1830, -46, 2937, -1611, -239, -1364, -5869, -2071, -2592, -2857, 2476, 289, 399, 2873, -1341, 874, 2495, -927, 2026, 250, -3047, 963, -359, 964, 5850, 2821, 3774, 4780, -121, 2253, 2132, -891, 2454, -840, -3741, -2070, -6721, -6367, -3664, -7120, -4506, -4012, -6460, -1376, 233, 1460, 7661, 6199, 6368, 8276, 3536, 4406, 4840, 914, 3013, 933, -3128, -1084, -4228, -4793, -1059, -4176, -3131, -1440, -4797, -1123, 698, -34, 4748, 3549, 1767, 3876, -567, -1109, 492, -3562, -1638, -1599, -5309, -2226, -2833, -3174, 2075, 577, 1047, 3943, 957, 3432, 5857, 3796, 7124, 6109, 2522, 3745, -517, -3122, -1553, -5681, -5470, -4557, -8509, -5761, -4404, -5268, -55, -100, -590, 3244, 983, 2197, 5711, 3308, 5747, 6254, 2410, 3937, 1377, -1709, 714, -2417, -3386, -1510, -5171, -3505, -1101]
946a101j670M132N34k022L173j887q49L083k767Q10J200m281P62q56l431K627
962b543j169j291L210j922J463M136j063L513K141k395K574j275k695K282l049
977A917j688J223m772m14P5l580K569J85j782L821n48O09M823q72K252K568l054
994C332J541o40l645J841k077k513K087l313n43K129k437K339J962j993L192J46
1010A408q25L736j327k52K226l658k37K1m264J473p41k574K575j565p26L453j256
1027b533J718K991k114K664R99j951L099q15j611K082l024j171O30l696M62N13
1043a757l117K283n38j419L498o16N45L523j934J464J716k431K298k41k421J935
1059B788k229k073J591l201r5J832k721J875J198j721L583L18l35L358j589J36
$$ y = [-1101, -2771, 1361, 1895, -127, 3046, 1159, 310, 3393, 626, 1436, 2636, -1645, -883, -1739, -5170, -2543, -3712, -5003, -1793, -3715, -2252, 1884, 821, 4334, 6475, 4080, 6654, 5379, 2684, 4966, 1917, 229, 1452, -3320, -3734, -3659, -7239, -4670, -4485, -6267, -2446, -2994, -2385, 2438, 1566, 3818, 6386, 3332, 4873, 4233, 588, 2429, 352, -2161, -74, -3387, -3930, -1801, -4238, -1899, 63, -1930, 1262, 1408, 583, 4319, 2992, 2740, 4966, 1308, 1071, 1092, -3172, -1699, -2440, -5014, -2439, -4004, -4730, -1277, -2533, -815, 2176, 62, 2726, 3725, 1774, 4873, 4058, 2447, 4529, 1505, 334, 964, -2732, -2270, -1757, -4874, -2591, -3129, -4548, -1050, -1666, -1121, 2402, 468, 1932, 3648, 1217, 3515, 3274, 853, 2788, 559, -1514, 77, -3124, -3219, -1387, -4108, -2233, -1035, -2756, 827, 1145, 810, 4168, 2579, 2715]
1075B715J859k976M44K09l527J198j333k773J969j911l42K686j590J678K499j592
1091g87L133J100j516K816j153j550J836l096p78P23l473O86k7k425K353m41p64
1108c363L401r17O70K893j698J519J232k475J776p57k437J761k350j382J679k689
1124c137M88J478k160K184Q15j277L018m18l97K637j504O1J455k789O45K67k811
1141a445J544j216j868K110j725nK316j798J542J630j752K293L88j300K476j284
1157A906r78J650k661j07Q35k785J160k65k189K102n42o49K740j159P73K482j707
1174F06J497Q72k041J883r19j948J512k190q76J365k449N92R69k057K120N40p85
1191a309K825l21N8K146j696n0J094k792Q26o83k590J323j064j234K383j299O00
$$ y = [2715, 4574, 1598, 2042, 2251, -1276, -78, -1411, -4184, -2215, -4126, -4468, -1782, -3372, -1694, 805, -787, 2346, 3446, 1930, 4746, 3593, 2043, 3879, 783, 5, 728, -2745, -2059, -2086, -4511, -2158, -2599, -3363, 38, -879, -209, 2684, 986, 2505, 3737, 1262, 3038, 2281, -156, 1605, -745, -2127, -448, -3137, -2649, -1171, -3331, -1147, -332, -1609, 1409, 991, 594, 3231, 1727, 1788, 3243, 454, 1099, 1366, -1445, 99, -1117, -2985, -875, -2600, -2605, -289, -2087, -545, 1085, -667, 1626, 2014, 714, 3190, 1906, 928, 2578, -83, -190, 645, -2140, -980, -1245, -3434, -1332, -1874, -2523, 217, -942, -169, 2313, 606, 2103, 2975, 934, 2817, 1898, -50, 1462, -728, -1604, -239, -2688, -2096, -1127, -3184, -1064, -524, -1309, 1516, 1195, 1253, 3399, 1703, 1653, 2747, -45, 781, 98, -2492, -1169, -2233, -3467, -1084, -2383, -1783]
1208a783K237j384J816J529j477K301j26j441J536k127j194Q11k737J11N44k414
1224c798J571L61r57K984r6K7K503j478O00J031k141J056o9k390J197j319j343
1241b261J748j453Q5J792j775J468J438j268K175J37j241J673j565r10J138k244
1257a063L18R36k002J200K1j342K149n84p92J898j644L84J420j740J433P77j496
1274a27J849o93j115J731j582k60J372j999N98N01j838J410m06j403J745j142
1290a359k57K089j019J078J518j484J593j60j955J310j321j380J252j848JJ318
1306f24j404J354J037j262J974j75p55K120j204p9J394j893K23J81k482P48n20
1323a367j571J631n86k27K283o38J123J628j625J241l8j918J205r40j232J458
$$ y = [-1783, 454, -930, 886, 2415, 938, 3239, 3113, 1672, 3208, 1081, -113, 698, -2039, -1928, -1384, -3798, -2227, -1866, -2823, 161, 65, 92, 2595, 1117, 1717, 2748, 607, 1663, 1594, -796, 401, -918, -2261, -513, -1966, -1881, -89, -1864, -396, 1042, -226, 1949, 2086, 845, 2518, 953, 43, 1181, -1063, -745, 191, -1811, -611, -590, -1932, 217, -367, -1159, 739, -905, -521, 899, -841, 592, 1369, -127, 1722, 1029, -86, 1645, 63, -197, 1175, -824, -226, 275, -1563, -153, -559, -1962, -217, -1359, -1616, 473, -546, 532, 2050, 566, 2159, 1999, 44, 1354, 33, -1347, -95, -1943, -1942, -624, -2028, -674, 363, -899, 1075, 900, 145, 2265, 1061, 982, 2376, 483, 706, 887, -1595, -847, -1367, -2938, -1307, -1893, -2120, 163, -475, 648, 2276, 651, 1892, 1854, -64, 1141, 201, -1031, 427]
1339D27j223r5J234j512Q17O10j532J658j44p94K088q99k42J176j821J85L42j979
1357a704R55j93r86J912l24o4J935j053K18J044j798M92Q1j570J383o25q05J647
1375E45j102q8J471j645O71O47j338J512J43q84J746j068o75J067j949j28N86
1392d89j497J263K57r28K045l39l49J563j356Q1Q51j691R28L66j276J583l96r84
1410c68J245j527m95J097j389P68P37j306J468K49q03J593p78n80J110j547M15
1427a11Q27j260J269K11j280R18p91j053J138j193J58R13j017J175Q33o84J443
1444A496j02j059J191j293m16J033j325M52O20j670Q44n50j066J447m81k59J570
1461D32j064J093J218p81J131R9j568O28j347j030Q84j125O4R48j351P16O46q74
$$ y = [427, -796, -891, 343, -1169, -352, 258, -1274, 384, 240, -554, 1534, 635, 393, 1569, -252, -67, 275, -1704, -749, -942, -1928, -16, -340, -404, 1531, 478, 696, 1740, -58, 434, 515, -1055, 328, -297, -1102, 545, -557, -645, 826, -819, -148, 499, -839, 673, 816, -68, 1678, 610, -65, 1002, -947, -1075, -489, -1986, -723, -466, -1394, 651, 312, -37, 1526, 170, 251, 1102, -589, 339, 705, -571, 1012, 616, -368, 877, -650, -1145, -48, -1437, -669, 68, -1238, 230, 479, -324, 1269, 491, -89, 1021, -526, -111, 716, -544, 725, 936, -344, 574, -217, -1270, -132, -1325, -1167, -254, -1271, -96, 737, 53, 1496, 1394, 335, 1526, 233, -183, 850, -475, -23, 597, -1073, -229, -779, -1845, -398, -879, -1138, 432, -632, 461, 1679, 898, 2029, 2128, 560, 1188, -159, -1189, -305, -1430, -1366, -418, -1769, -1053, -407, -1281]
1479a281J603J62n26J440q72P8J282r72M18K47j828K68n96j396J154n15j91J465
1497f0r25L60J078p74J021M91j027R21o94o61J266p65J29O84j622K37o2j355J097
1516f61M0m98J432p72oJ369o18Q09O52j326N77j73j221J172n38n27R07j533m36
1535a351M26j204Q97O73o54J128k0l04J534k15L95J061j271L0p5j549P03j80r99
1554i75R77j131n54R31p47N69J268q07J028K50r09J342k91k67J008j299n34M1
1572a00j410O27L74p34Q67l13o92J310m10N09J422p32M69K27j120P92Q9o97Q42
1591A320j089j015M86j330K60R30j101Q96j12r04J132J67J61J593m48lN79j317
1609B05N92L48q82P11o18j193M83q62M3J295q56L07L95r59Q90N47j21J391l59
$$ y = [-1281, 322, 484, -42, 1398, 526, 604, 1886, 914, 1332, 1579, -249, 19, -577, -1973, -819, -1334, -1525, -60, -985, -625, 453, -321, 700, 1191, 164, 1085, 391, -270, 996, 231, 360, 1044, -578, -341, -403, -1758, -661, -621, -1119, 313, -459, -465, 904, 286, 1095, 1747, 421, 998, 825, -396, 776, 238, -289, 618, -915, -1351, -925, -2129, -1232, -559, -1213, -85, -105, -409, 1125, 910, 1305, 2366, 1095, 1125, 1050, -499, 204, 24, -975, 2, -1129, -1683, -752, -1499, -930, 338, -469, 559, 809, -100, 1242, 951, 684, 1692, 393, -141, -100, -1510, -883, -509, -1243, -376, -689, -1381, -71, -481, 28, 1450, 718, 1187, 1414, 294, 1086, 1175, 478, 1320, 231, -784, -298, -1628, -1368, -438, -1539, -643, -755, -1659, -527, -360, -199, 1394, 946, 943, 1522, 205, 797, 1145, 263, 974, 356, -837, -354, -1216, -1173, 122, -734, -427, -32, -991, -101, 446, 325, 1716, 1357]
1628A357q19M33j198n8N59j133M98j25j494Q10o7J34J449k59J10P04j162O71Q37
1647A247l72R76k57j100M14j111l24P21r68l9J85j180M93M40j40J494j29l24N63
1666E89q77J55R70n46P21R8j065M29o61n02R06p21l1L32j055N18O97o9J219R2
1686A199o24M30q11m04Q87n95L10K67j371K10k69p45J074l82k90P37p95K71J294
1705C93j29J297M26q59K74o67p94Q07n85j67J84j048k2J81n10R35J45n90O83o92
1725g38n3J397k47Q21N78j254j3l29r92N45k49l22N98q46J54P93l02R87N26q51
1745B03M84n10l38Q59r3K54N35j205k13j44j048N24R1m73N66n56j05J159k06Q82
1765F66O75q83J23l31o82Q43L4o7O22q61l86J76q54N11K39o54M98o9m73J046J82
$$ y = [1357, 538, 971, -227, -285, 274, -859, -361, -486, -1980, -1170, -1237, -1103, 346, 87, 197, 901, -261, 410, 1247, 875, 1851, 1594, 494, 908, -203, -527, 194, -774, -813, -628, -1808, -1315, -875, -1015, 479, 350, 26, 589, -288, -133, 837, 291, 1012, 1110, 45, 474, -187, -689, 217, -504, -535, -203, -1258, -740, -43, -112, 1107, 1199, 575, 1005, 194, -210, 677, 82, 392, 659, -712, -502, -771, -1516, -442, -824, -1114, -377, -1172, -901, 393, 264, 1561, 1987, 1128, 1402, 735, -59, 748, 163, -4, 180, -868, -890, -709, -1219, -284, -139, -729, -46, -738, -791, 606, 359, 1180, 1758, 504, 491, 162, -830, -285, -534, -856, -258, -1104, -950, -157, -459, 528, 1054, 203, 687, 177, -161, 698, 605, 859, 1394, 189, -24, -168, -1216, -692, -601, -1074, -508, -1064, -1169, -10, -216, 666, 1341, 458, 581, 250, -432, 411, 445, 378, 1000, 139, -247, -71, -925, -414, -175, -829, -331, -400, -873, 173, 355]
1786C55M44O56q53k42r5j060O33K58l45O25m68n77L47n62M44O11p22L28M0m10
1806e93J012K19J91Q28r07k96j52q91K14K82m97N18l16m66M99m9o5J010p20P8
1826a01Q6n25P48N58n1O77n44r28J19q29R3M05m04M99j8m99P15j4J63P70m72l81
1848F7J62p27N09M90l45O28l57p38J55p08Q5P46l31K04J12m57O11K21jO27n26
1869D27n35K04p32K72N95l06O04l1r21K50l02n9P55m43P2K40n32L25N23l02O94
1890G98j97q35K64m33j3O25k30L19J58n65L7j48j94P31m97k88L88n41L56O52j97
1911A90L98O1p63K32l50k16P05k14M0K93p91K20J79k77N53Jn73L04l54J4P30p2
1933C10L10J68r45Q7k20k50O41j42j22L53n52j6N20l29L88K16n47K29l84j26Q77
$$ y = [355, 799, 1455, 602, 360, 265, -795, -162, 96, -249, 376, -92, -669, -322, -884, -440, 171, -551, -223, -183, -593, 419, 638, 829, 1657, 750, 454, 302, -589, -375, -93, -590, -72, -388, -854, -355, -404, -469, 541, -179, -101, -15, -540, 208, 766, 715, 1392, 848, -80, 39, -790, -697, -292, -696, -197, -215, -714, 1, -13, 150, 920, 448, 67, 229, -498, 11, 501, 156, 784, 427, -311, -156, -864, -779, -33, -364, -160, -48, -505, 106, 327, 326, 953, 427, -108, 96, -636, -364, 231, -75, 529, 498, -423, -173, -475, -534, 221, -222, -150, 90, -442, -117, 406, 104, 798, 601, -234, 30, -403, -416, 209, -21, 298, 456, -109, -72, -220, -414, 317, -180, -468, -80, -621, -265, 387, 190, 588, 649, -114, 118, -232, -448, 257, 43, 83, 376, -415, -195, -16, -293, 260, 261, -312, -8, -362, -348, 382, 310, 620, 788, -157, -70, -290, -540, 101, -41, -163, 190, -362, -378, 142, -187, 201, 417, -130, 99, -285, -411, 466]
1954D66l23J80L70o85l8R2l72P15j78k21L35n91k83N25l75L81J80o64J93l8k29
1975e60Q37j0N4L64n76K1J87n42M29J6n71M29n67k54O04n6J96M26m97J45J64l91
1997a52O75O9j56J76o14l93K78n43K36M58o68K69K2l02P41J9LO70m82l5J69l88
2019E2L66J46m24J70m14l64L53l18J43M21n45K14J26n65O37J57p4M78m08k02L91
2040C40l50J75K64n24K08j52n15L28o1PM43l60J4J91l20L29L26j24L20j51l07
2061H1K93l16J04K78q31J62o4n40K64J20j37O39k16l0L87j50K78L75l57K63l9
2082E64p39M32j87j85L16m44k41K07n27L23L51k19O10l1k76M48j96o1L86m26O0
2103A65J2m16K30r5j94M11l05k34L61m74L58L37j94L09J11k41L33j12k47L97n34
$$ y = [466, 143, 323, 693, 8, -30, 62, -310, 405, 227, 6, 341, -250, -533, -8, -383, -2, 178, -486, -293, -331, -560, 277, 267, 321, 685, 109, 130, 317, -225, 204, 220, -351, 78, -489, -743, -139, -195, 1, 427, -70, 75, 239, -152, 523, 592, 436, 612, -2, -395, -117, -660, -424, 34, -634, -365, -343, -645, 96, 115, 118, 788, 306, 271, 440, 52, 418, 564, 140, 310, -104, -468, -115, -433, -290, 131, -414, -200, -74, -639, -2, 155, 81, 559, 151, -51, 340, -10, 165, 429, -95, 113, -39, -554, -226, -287, -280, 163, -197, -183, 8, -312, 17, 343, 219, 539, 388, 81, 374, 58, 162, 440, -391, -229, -293, -833, -569, -449, -586, 53, -163, -193, 194, 44, 322, 697, 340, 603, 564, -175, 257, 70, -115, 201, -243, -484, -277, -804, -481, -130, -349, 261, 230, -46, 402, 206, 145, 531, 105, 165, 177, -239, -9, -104, -298, 113, -192, -426, -65, -539, -181, 156, -38, 271, 382, 141, 474, 362, 115, 512, -22]
2124b2K3Q8o44L63J07l55M34o4l43M28l71n4M18k04L57K70j79K68n6j46K18m24
2146A12l36L56n32J39K67m08M31O0m31M11j27k17M08k97J61K77j95J45M6k59J52
2167A63r0l42J93l92q0M52k25L47L06l18K22j24j78M38k72n7M17m00J55J56m38
2188f7K57J4o47L27k15j71L69p6J59L13k99K31n2l03L09r7l59N23k46Q7K62l36
2210a7K50On17J95r0k33L30j33J2M03k00K10K24m74K25j22m22M60q4j17L75k72
2232Io6L12n00J26r1l12L17m4k9N31j98J62L49m04K5L2m84K21O6k15J05Oq6K99
2256A31l55J20Q0l66K39N8j11L50J98j29L74m81K1J0m04J35J95m75L96mk76N28
2278B34l08JK42m15K13pk00M08J19l25M78j74k38J57l69q3K64l20J58J53k48M11
$$ y = [-22, 1, 89, -555, -192, -85, -440, -6, -70, -413, 15, -356, -410, 8, -196, 161, 431, 252, 520, 464, 318, 536, 112, -224, 132, -400, -261, 6, -402, 29, 89, -342, 69, -58, -275, 133, -164, -3, 274, 79, 224, 270, 11, 163, 73, -269, -76, -468, -548, -96, -321, 26, 332, 14, 236, 112, -66, 372, 100, 43, 460, 60, 215, 371, -67, 190, 204, -443, -116, -331, -502, -133, -209, -50, 263, -36, 195, 143, -160, 149, 52, -307, 216, -30, 57, 319, -17, 233, 239, -278, -83, -173, -406, -76, -209, -197, 206, 6, 216, 440, -34, 191, 69, -353, 107, 23, -94, 281, 9, -57, 255, -245, -119, -210, -522, -205, -249, -278, 253, 55, 217, 566, 162, 187, 219, -265, -44, 22, -193, -88, -82, -168, 131, -224, -104, -24, -390, -151, -93, -204, 146, 344, 215, 589, 108, 129, 139, -265, -130, 65, -410, -14, -18, -294, 234, -74, -73, 169, -246, -33, -40, -240, 168, 287, -38, 440, 266, 28, 185, -184, -267, -3, -323, -165, -12, -260, 151]
2300A51j39k3K69l34j11K58k27J66J83j61L60j2l65J38k57j10K47l89O6K23k16
2321b83L21Q5j26L49l16j24K36k95J06L98m79L14j0k34J80k25j72K11l17R0J58
2342a33j59L94P1k13L62p9l27K43l03m7L71k80J94J43n62M30j40k08L64k79j21
2363b79K47j04L5M12l35K89j44k70K04j85p0L60j71n6J78l70K13Q6k33K57j32
2384f8j80K40j61K5L81j94J53J07l61K30j18j84L16k40o1J10j06K3J35j23O1P1
2406E6k91Q4J16j04M53k20K2P0k65JJ73k37K30j2j86O4p6o6L15j47Q7J97l03J65
2430A26j01o7K94j03j80K06l68j4K47k77K79O9l17J97j64j36L68j20P5K56m10
2451a40L9J62k46K23J69l03L05k49j61L62j87P9J29l38Q6Q4l81L66k0K9R6j65
$$ y = [151, 12, -11, 258, -76, -187, 71, -156, 10, 193, 32, 392, 380, 15, 153, -104, -214, 33, -356, -290, -67, -283, 38, 123, -3, 346, 30, -94, 142, -153, -47, 351, -128, 186, 176, -58, 122, -103, -275, -64, -381, -291, -133, -292, 102, 173, -40, 322, 243, -84, 159, -144, -191, 180, -100, 94, 237, -325, 105, -35, -243, 121, -158, -279, -32, -136, -101, 311, -24, 265, 121, -149, 55, -130, -200, 160, -11, -67, 111, -259, -46, 40, -193, 64, -68, -248, -8, -169, -144, 237, 43, 196, 303, -58, 172, 54, -130, 186, -54, -115, -5, -111, -88, 47, -76, -15, 56, -235, -151, -35, -139, 314, 94, 116, 186, -79, -78, 95, -142, 88, 76, -110, -46, -122, -188, 127, -20, 67, 264, -39, 126, 25, -42, 252, 149, -31, 175, -193, -207, 40, -237, 42, 111, -206, -9, -173, -309, 59, -61, 14, 270, -140, -101, 61, -185, 38, 207, -96, 209, -40, -201, 161, -26, 53, 182, -156, -70, 14, -367, -1, -21, 8, 104, -61]
2473f1l2J81l58L62R4l26K08l6k92M49l09J47K82n59K63j1j32K60rj49K22k45
2495e1n1K02j84R1K78m75J23j7k73K59J48j14K05j84j13L13k09J10J07k22K11
2516A54k28j41K84k69J18K87k40j17Q5k12K24J05P0K30k63j15J57j45L2J37j84
2537c1K1j05l47L26k3J32K10j16j34J28j68K63J35j80K25j63j78P4j62J34R0k37
2559a06PL5l08K49J03LK08j40j56K95l36K69J56k18J56r8k81K10m4p5K40k26j55
2582b12J8k50J81L40j61K94j02j77R0O6o4J88j45J78j94k02R1Q1j48K03j84j58
2604b67J60j78K19K82o5L17j54k36J15m6j70K70l14J00k2k11j8J96k23L06j54
2625i3j43J81o0PM26j60J24J52l66P6k6k46K00j54k52K09k40R2K47p1J31J69l44
$$ y = [-61, -93, 88, -270, 92, 186, -140, 68, 32, -260, 189, -120, 27, 309, -250, 13, 2, -130, 130, 121, -28, 194, -51, -102, 100, -84, 7, 285, -190, -67, -84, -357, -98, 50, -64, 141, -43, -156, 157, -52, 58, 165, -57, 154, -74, -215, 69, -200, -82, 205, -35, -152, -67, -279, -55, 50, 120, 350, 87, -28, 129, -16, 16, 153, -31, -10, -115, -462, -136, -159, -27, 183, 67, -67, 61, -107, 156, 291, 111, 336, 173, -5, 69, -93, 41, 131, -106, -99, -64, -372, -123, -20, -17, 191, 51, -105, 190, -146, 123, 279, 61, 217, 119, -162, 48, 4, -71, 169, -57, -212, -194, -444, -263, 77, -84, 210, 108, -69, 21, 87, 23, 211, 66, 244, 50, -152, -61, 20, -128, 75, -109, -267, -107, -285, -66, 216, 151, 468, 314, 78, 193, 147, -23, 247, -67, 33, 11, -200, -218, -22, -245, 61, -93, -236, -55, -115, -108, 318, 158, 282, 434, 68, 144, 118, -128, 72, -82, -334, -125, -365, -273, -26, -97, 34, 203, -141]
2648a41O0P0j02L19Pm0K18m44J02Q5l60K34j34k42K80j30J2K52j8J22J01k87J09
2671G3l0M9nJ61q0J23l10j09J81k08qN9j51P5M2p0K84n8O4J58j94QO9p7J61J7
2697B24k20J61L9k19k0k14R9P5j92J14m0k3M21L0j6P9k10N1O7l81J99J29k82r2
2721b21R4j00K05k7MJ76j84M8J0M5J54O3j80K16k02r5P0k28R0N5k86J09K4m1K18
2746A7o7J00R5k25l5J36j30R9K27r3P6k4k02J83j01j26K22k92R1l8k09L49K2j41
2770f6J86p7j13J80k41R8J33L0n8o2o7J14p8r8J07q6j44K11j82K17J69k58K48
2793A63mq0J06k67J07J10l1j14J18j67Q5j3p4pJj03R5j10K63m7nj03N1j14K75
2818A35k2m6J33k07RQ2l6p0K73l84K19j05q1J08j59JK00j04J59k2j60nJ19N6J23
$$ y = [-141, -81, -11, -113, 206, 213, 173, 391, -53, 49, 134, -226, 8, -126, -368, -88, -218, -206, 46, 28, 150, 251, -36, 73, 43, 92, 87, 248, 168, 291, -19, -128, 53, -155, -163, -104, -255, -180, -138, -208, 76, 18, 82, 240, 46, 54, 123, 46, 207, 224, 4, 165, 204, -15, -35, -249, -150, -75, -267, -153, -193, -216, 205, 235, 219, 298, 88, 139, 206, -175, 24, 153, -129, -221, -127, -227, -22, -49, -45, 131, -53, -5, 5, 50, 204, 267, 87, 303, 101, 6, 76, -152, -62, -7, -293, -184, -160, -201, 17, -50, 50, 145, -80, -115, 21, -109, -10, 217, 124, 200, 176, -26, 157, 56, -70, 152, -140, -49, -87, -296, 53, 75, -66, 120, 43, -70, 110, -131, -33, 100, 130, 72, 10, -57, 57, -21, -119, -12, -98, -242, -31, -213, 4, 173, -85, 163, 159, 79, 185, -82, 25, 135, 104, -10, 108, -59, 26, 13, -61, -68, -67, -170, -75, -185, 78, 31, 26, -77, -26, -140, 135, 113, 67, 200, -7, 2, 84, 48, -22, 251, -133, 86, -19, -100, 8, -151, -150, 50, -54, 105, 83, -77, -82, 37, 93, 216]
2843B16j20j72J85r2l5N6j96J09K8j00J5pM7J24M1p9K56j88J06n1q5k6j0j38K36
2868A20p3j17J8j17K3K10k37K12J1j96L28j01n9K07k09N3Mo3P2l4j38J54j59j43
2892b34K46k04j8L24k68Q8N3j5K5J47p4l7M3j59K32k13J63j5k42O1j71J02J6J70
2916B0k41L35k07n4K26j38K27k1j74J68M5j64J61k20p8P7q6L5K1j46Q7Q5%L4o
2941a4P1P2p9M6MJr5P7j39K06j96J09l3j78L6R3j49J69m8PJ30o2qJ96n9j14P6
2968A19r2J8O0k14J61j83k1P6N4k5J80j29j67K59j11J28k2j23K56j86k4J64j58
2991B0m6J40k10J40k9j42J30q9K1K6r4k3K00j50J16P3m5Q9q2k8J23j31j8J02j31
3016c8m7P7k54K26k0r4K14J7N4n9M9k21K22j90J17J19j96l8k4m9J89k36MJ35j2
$$ y = [216, 96, -76, 109, 17, -18, 38, -158, -49, -21, -121, -106, -113, -66, 58, 99, 20, 276, 88, 194, 143, 58, 32, 22, -116, 120, 47, -70, -52, -169, -146, 64, -173, 39, 50, -146, 182, 81, 22, 229, 20, 73, 77, 14, 86, 52, -86, 68, -91, -234, 12, -192, -210, 114, -154, -66, -13, -28, -3, 144, 70, 33, 76, -83, 149, -64, 99, 84, -158, -97, -268, -166, -150, 20, -221, 114, -93, -147, 79, -59, 168, 147, -27, 141, 186, 22, 183, -37, -115, -38, -124, -89, -68, -214, -127, -42, -42, -8, -14, 57, 129, 50, 96, 100, 101, 6, 83, -56, 150, -46, 63, 30, -148, -112, -19, -168, 1, -47, -40, 90, 28, 20, 216, 157, 43, 119, 27, 45, 105, -109, 52, -131, -152, -76, -22, -47, 133, 4, -163, 96, -15, 113, 91, -32, 224, 38, 14, 178, 20, -26, 114, -96, 44, 15, -127, 3, -86, -65, -39, -133, -156, 44, -106, 10, 83, 38, 127, 45, 17, 140, 9, -9, 93, -38, -85, -8, -262, -36, -56, -150, 64, 81, 135, 76, 125, -96, 126, -64, 53, 172, -24, -62, -86, -135, 54, -182, -178, -43, -55]
3041e5l2J23J9J7m3J4J11j49J35n0p7m0J00j31Q4l6l4J06r8o2N9qj28K71l2j7
3067D7O9k01J09K1m4J31j67M1j50J08P3Jj06J0O4j59J29l6P0K1Nj7N5j2R6p6j42
3094f0K42l16JK44r5l9L1k8p3M3n5K35j36n1J76j26Q1J56j57J1R5k19N8M4k06
3119a44J11l5j15J49k6n0L8PL0R4o1L5L4l6Q2j01kJ02p3Jn5j27L4K4N8O3n4L2
3147A5oL0rL7n9N4Qj13JN3o3P6o2nK2oO8j04q1K30j43J0J42q5k8L8q6M9P0j9o
3178B8p2J63J4j67o5J52j80R4Ok8J3K4r5J66OnK5m4N1j1j31J14Kp3N0r1r0K96
3206A52k42J43J0k3J7K0l9J0P9k28J25K6j66J66j80J23K9m0J5n9rJ52o7LQ9q0
3232B6N0oo2l5m5l8J69j26n5J25J5m5J10O0p4m1q7N8lq3J29r8P5L1j3j14J05r5
$$ y = [-55, -87, 36, 55, 72, 29, 43, 154, 5, 140, 90, 13, -27, 73, -58, 26, -10, -44, 62, -36, -98, -39, -47, -175, 96, 64, 47, 116, -85, 24, 45, 1, 132, -35, 6, -144, -36, 37, 38, -68, -58, 6, -153, -24, -60, 10, 31, 36, 19, 74, 62, 158, 82, -60, 182, -134, -133, 111, 16, -23, 8, -20, -93, -50, -105, 130, -6, -57, 119, -7, 74, 230, 73, 84, 179, -40, 18, 62, -144, -33, -68, -183, -34, -60, -110, -72, -65, -35, 59, -2, 33, 67, 31, 113, 12, 10, 112, 39, 40, -15, -142, -108, -84, -26, 37, -17, 15, 9, 39, 30, 67, 8, 62, 70, -43, -42, 11, -52, 24, -38, -43, -21, -27, 41, -63, -144, 86, -57, -47, 95, 10, -18, 20, -66, -17, 53, 34, 28, -44, 119, 133, -34, -99, 53, -127, -33, -27, -55, -42, -18, -113, 53, 59, 54, 79, 35, 86, 75, -56, 58, 60, -13, 37, -54, -144, 152, -90, 53, 63, 40, 57, 77, 38, 48, 127, -101, 24, 50, -116, 50, -130, -7, 22, -18, -3, -62, -71, 81, 14, 17, 106, 26, 76, 70, 8, -27, -72, -110, 59, -67, -122, 3, 18, -27, 83, 143, 69, 28, -59, -1, -4, -87, 42, -56, 19, 50, 37, -77, 28, -67]
3260f7J91j47n6J29J9j12J27k6p6J35k13P8l3QO2m6J00L4j63J23L3Jj72Q3j49
3285a37K27k5p0L9p6J10l5p2M1K7o3K7q0R2j8ML0R5k20P8R6j23J77j63P2l1r2
3312i0J38%p2K8J59k21R3j34R4K0J67r8m7k9R8j5k03J76k7m8nK2j5Q7j56l9J91
3339G4j53K2R0J5k4k8P1L7q3k8J09j18j5J5K1r5R1j4%Q4j30R3l7N6J4k71J59N0
3367Ej30K20n1J0P4r4L5L0j19L5M4j16L7k2P6M4n6j39J55j99K13m4k4L9L8j36
3393g5J03r2n2J78K9l3kk01P8J00j60J79n7qK1r3LJ82l4jj3j9ooo4J04o0rNj0
3423a3m0M1j26j2J42K3J49j00l7L9J2q7K03k99K35k06j5J16j10L1J43k24J33M6
3447D4p4R3O9q8lnl7R3j62J29N4j19l3P8q2O6l8K6O8j82O6m8J30n8P2m3J00pj20
$$ y = [-67, 124, -23, -79, 50, 69, -43, 84, 58, -18, 117, -96, -18, -51, -43, 19, -27, 73, 107, -56, 67, 100, 101, -71, 12, -137, 90, 65, -5, 34, -42, 68, 33, -39, 2, 29, -34, -7, -87, 5, -13, -9, 21, 116, -104, -26, 70, -53, 124, -39, 33, 2, -90, 48, 48, -24, 4, 163, -58, 35, -99, -5, 15, 182, 84, 37, 8, 106, 91, -112, 64, 37, -11, -16, 6, -9, 78, -78, -117, 74, -79, -57, 33, 48, 24, -4, 67, 104, 21, -7, 102, -16, -31, -16, 5, -90, 1, -13, -13, 71, -59, 34, -3, 53, 67, -204, -45, 5, -125, 95, 44, 54, 128, 34, 69, 99, -20, 15, 59, -57, -20, -42, 34, 78, 22, -117, 38, -161, 52, 8, -16, 23, 61, -75, 28, -64, -116, 62, 91, 58, 56, -145, -67, 33, -127, 52, -5, -13, 8, -85, -82, 100, 66, 65, 52, 33, 27, 21, -43, 61, 1, -8, -3, -13, -53, -12, -138, -150, -8, 15, 164, 64, 27, 66, 78, -9, 194, -105, 130, -76, -91, 25, -85, -54, 89, -135, -2, 44, -30, 63, 132, 44, 41, 36, -1, 92, -70, 59, 113, -6, -39, 39, -43, 23, -15, 11, 79, -103, -37, -85, 45, -13, 59, 16, 116, 109, -11]
3476a1M7n3K2J47r7n3J2r3J34k7j34L2k6l2J36r2K8J73l1l2M6k8J7j02l8k0pp1
3504a53N3J66r4r8j2J30M7j64R5O2l6J50j03L4j6o3m8R7m1O1p4q1RJ28r0K6J7
3531Bq3O2o5lJ41o7J92j57M3n5kM5l6j08K0l4KM1P7K1J33m0j05l1q7P4K4pK9n5
3561b9J0J02j42Q3q4n1N6K4j61K05p0K0L4jK5J18o1J0n8r8J08J01j84K8K3l8j8
3588d8M3l1jj07J86l3K4J15p1j36M1J44q8P4j16J26q1j18O1m0JJ39p6n1mlq2J62
3616C0j47K32j25m0J03K0n6Pl0J4L9j54k5J43m7Q7o1k01K21j18J52O3k00N9M9
3641A5j03J05q0Q3Np3m7R9o0j29J43n5N9J71j24L2j08r8K14L8j7r9P2q2J26j16
3667b9Q4J1j33o4P9o3MJ06o4P8k4o2J14j14J65r3j0J56j36m9J05j54J28k3Oq4
$$ y = [-11, 36, -17, 5, 152, 55, 2, 14, -79, 55, 28, -106, -74, -100, -132, 4, -88, -60, 113, 82, 50, 96, 68, 85, -17, -55, -75, -82, -153, -100, 66, -28, -126, -138, -8, 39, -125, -30, 32, -4, 146, 43, 77, 61, -2, -50, 47, 6, 67, -7, -88, -79, 49, -41, -15, 2, -81, -19, -84, -87, 54, -13, 179, 22, 65, 10, 8, 53, 17, -91, -71, -105, -103, -62, 15, 36, 169, 129, 24, -7, -94, -20, 4, -3, 26, -29, -19, 83, -59, 24, -60, -111, -55, -31, -192, 13, -57, -37, -3, -4, 21, 139, 78, 88, 30, -68, 40, 141, -43, -15, 8, -30, -48, -5, -36, -37, -144, 42, 9, 33, 148, 77, -59, -18, 126, 38, 112, -4, 122, 41, -77, -16, -56, -55, 84, 8, -43, -47, -50, -132, 30, -117, 115, -10, -50, 53, 73, 17, 24, -6, 8, 47, -107, -132, 11, -36, 51, -10, -211, 10, -108, 44, 107, -93, -34, 15, -88, 17, -63, 20, 25, -48, -95, 4, -56, -185, -42, -97, -38, 133, 9, 41, -67, -165, 49, 87, 70, -29, 43, -39, 87, -29, 55, 66, -67, -131, -52, -115, -111, -5, -69, 9, -15, -77, 37, -77, 88, -5, -15, 141, 5, -44, 61, -93, 35, 12, 18, -66]
3693f6Q8r9J52J6n7j0j51J96n1m0NM6p6R2l7Q1j4o2P6j08r4M7O5j71K12nj97K40
3721G8O5k74J62Q1p4K7Qq5J00q7qJ62j89J22q5l6L8o4J52n7q0J07p8m0J29n6n1
3748c3J89j83n9P9n3P6qj09J01J5m0J23j21j25K45j10O5J6j79K27r7K8nK2n8L4
3774D0j75M7J06j87J38ROP9n9K3N3o7M1l8j36J05Q2p1O4n9j01J22o4R3O5k11J64
3801F9m8j4M8k0k9J84k41j1J05j49J41Lmj07J33j23L2l8J0J45j81J31l3j28J61
3826C6k4rK6N5m5K6j28J48j2j32J23j1j07P1o0n0K18j47J96j42pRJ25k09P1m1
3852b0KJ21j50n6J19l0O5n5rK5M5q6m8j3J57kL1j26M3J8o4J10j75J47l8j54K27
3879H4j72J54j17MN7J6j80K03p0o8J44q4M1L1mj20J54p6R7L9j82P0l9j14J05l4
$$ y = [-66, 22, -77, 75, 91, 34, 24, -127, 69, 18, -22, -17, 29, -47, 45, 8, 89, 75, 13, 89, -19, -113, -66, -1, -172, 40, 35, -162, 78, 143, -131, 31, 112, 38, 65, 73, -12, 88, 1, -7, 155, -34, 88, 3, -33, 5, -59, 93, 36, -44, 63, -15, -55, 74, 18, -33, 156, -27, -86, -7, -60, 16, 8, -101, 0, 15, -25, 98, -23, -148, 97, -13, 52, 68, -111, 116, 19, 47, 42, 64, 6, 40, -135, -88, 18, -169, -31, -22, -16, 63, 4, 27, 80, 13, 54, 16, -120, -15, 67, -4, 60, 1, -100, 22, -42, 51, 116, -95, 69, 21, 7, 55, 35, 6, 190, -51, -62, 43, -106, 35, 38, 34, -73, 60, -63, -31, -69, -59, 86, -95, 36, 3, -125, 36, 12, 3, 29, 84, 39, 65, -63, 85, 73, -59, 64, 53, -54, 17, -43, -93, 125, -22, 174, 32, 25, 34, 159, -50, 21, -20, -18, 103, -47, -103, 16, -14, 51, -4, -13, 12, 57, -29, -77, -90, 67, 65, 96, -30, 13, 31, -33, 77, -98, 49, 11, -143, 84, -88, 66, -51, -47, 10, 26, -154, 49, -21, -89, 55, -29, 12, 43, 39, -81, 73, -3, 94, 133, -49, 21, -18, -132, -27, -61]
3905f1k2M0j44K67l9j66J24j1M5O2q1qJ10k25O8J06p0o9L3mJ25j14J07k3j5PM9
3932I1j05k6R4q0j9M4m8J17m8Q7n3l1ML9j94J16j3%J25n0r8J47m4j11M5N2M0j51
3960g0n9O8J06lJ26j56ojl1n7P7j11J95j20K0Lj6M0N6l6%K7p5J27p5j29J16Mj14
3989i4J15n1R4L7j42J02p4L9J79k93j8K30k03j4R5O4o1P1p7Q7r0JR8J9j28QL7
4016C1j2kO8j11O9J9l9j9k6Nj20K03j25MJ55j09K5j5m9pL0l0k8J44j00J19k9j83
4044a32K46j52J2j1j10J24J05j01K3k1l4J1J79k56P6l2j1J89j42J60q2O7j0m3
4068E5k22K35o1oN6j15J05L7j53j09K27j09Q8m8l9J39n1J5N4l7o4J9j31J50n0
4093a5p7K06n0p2r6L3k0Q2j5M3l5j88J19Q5p2R5K9n7J66k75Q4P1o8l5J75q8k1
$$ y = [-61, -83, -43, -187, 80, 41, -125, -1, -12, 33, 95, 14, 6, 116, -109, -41, 65, -5, -74, -41, -45, 80, -34, 73, 50, 35, 42, 91, -14, -40, 54, -26, -45, -1, -49, 68, 20, 107, 54, 23, 27, 66, -128, -12, -25, -25, 100, 50, -48, 99, 55, -56, -11, 41, 81, -70, -129, -61, 45, 42, 168, 12, 6, 5, -26, -83, -6, -117, 78, -42, -22, -19, -35, 5, 61, 25, 25, 52, -23, 104, 29, -100, 16, 20, -94, 21, -30, 64, 101, -41, 61, -13, 26, 205, -88, -106, 124, -79, -93, 2, 66, 5, 76, -1, 86, -4, -3, 95, 114, -14, -6, 31, 19, 17, 85, -26, 43, 62, 23, 4, -22, -17, -137, 66, -59, -55, 100, -9, 16, 1, -48, -55, -25, -55, -83, 61, -39, 80, 51, -132, 114, -38, -26, -37, -147, -23, 82, -19, 4, -17, -51, -40, 139, -117, -41, -73, -84, 105, -37, 123, 41, 108, 98, 55, -167, 68, 7, 1, 57, -58, 47, 84, -69, -178, 49, -60, 28, -20, -59, 80, 29, 44, 98, 61, -3, 16, -115, 35, -15, -92, 114, 64, -8, -104, -71, -91, -9, -24, 19, -16, -204, -85, 0, -72, 23, 52, -5, 161, -114, -30, 41, -27, -62, 113, 25, 4]
4120Dj2l4N5n9O6O2j50J51q1k0k3J58j07O6j07j5L6l3N9J55j31n8j2k0J17j12
4146d5m1N4K8J9R2r2P6p7l3M1n8o9R1J1j4Oq9J12P6j42K72j97j33P3L5o6J36m9
4174A7L4j03R2o7m8M0R8oq4M9Qj09J16o1l2R4M7o2l9r8J32n3L2L6n5J0m2N4J16
4203A16j37m4J65j40M2J16j75J59q0j6M5j40J37j09K05j17O8j49M9p1O7N7o2n9
4227g3LJ14j61K14j93J84o1m0K1K6ll2lm6J11r4J36j74PR6K3N4k3j05nR5j36P2
4255GK8p9J14q0KQ0Q7q6n4J38j53j7L5k2R1j28N7J44k74K31j09jL5j17M4n3j1
4282i1P0L3r9PJ14j28P7n4l0L3M3Q0m8N5km2o5N5J9j02O6J24j10J2J0k2Kp6J88
4311A19j66M1P8m7N8k9K4L6J3j87J73j24k6n0k7O4N6m3J32j06j3l3J6N5p0N7L8
$$ y = [4, -8, -42, 13, -46, 20, 82, -68, 83, 2, -18, -41, 117, 10, 76, -31, -46, -10, -43, 16, 171, 40, -18, -30, -50, 67, -45, -86, -32, -4, 15, 107, 15, 91, 14, -19, 22, -36, -105, -14, -3, -17, -11, -100, 12, 88, -54, 218, 21, -112, -39, -4, -70, 66, 17, 51, -52, 40, -27, -75, -35, 63, 57, -27, 22, 30, -79, 37, -24, -56, 38, 85, 23, -16, -114, 18, -35, -3, 33, -22, -12, -54, 0, 116, -21, -65, 100, -40, 2, 118, -57, 102, 22, 6, 51, -89, 48, -61, 144, 27, 95, -54, -5, -76, -9, 48, -14, -73, -70, 44, -117, 97, -96, 88, 27, -13, 8, 34, 31, -1, -4, -50, 61, -33, 103, -71, -64, 32, 55, 109, 86, -19, -24, 71, -65, 7, 35, -44, 70, -10, -8, 72, 159, 73, 19, 157, 4, -13, 22, 0, 91, -37, 20, 164, -110, 121, 12, 11, 46, -71, -27, -80, -91, -21, 12, -87, -80, 34, -94, -17, -71, -101, -68, -25, 55, 7, 62, 60, 18, -47, 8, 27, -75, -9, 115, 5, 17, 27, 5, 7, -69, 119, -47, -6, 72, 25, 83, 54, 78, 114, 127, -60, 113, -11, -37, -87, -114, -50, 6, -37, 95, -11, -24, -57, -41, 14, -56, 1, 39]
4338C9L7j40OJ54k28O0J03p4o3J4QJ23K3r9P9j03J68j18J3K6k9l5j0N0k5K03j96
4365a4L3j12M6pn5l3J37r8J79p4O9j57M4pm0J20o7k8J50m4L1k7q3K0k3K1r0Q9
4393b0L7k9L3l0%J0p8R8QO2j59Q6l2o7J24O3r1Q7r9p0O1JO2m7o5L8L6j2%p5K4
4424d4P6p3mK9rJ50j69J42j67J8L0q4J41j38O9j28J51P4J7nm5r1O9mr7O5l8O3
4452bo8j1M8j79J10J01l1L4J0k6q7M4L1O4l2p7R9o0O2L3q9M9N2j01P2l9p0KK9
4481c2l1J43j09o2J03L2r7L9j7O6M2j25m2J10l3M8j3j3K1qj9l0RJ17m3p6R3j2
4509F1Qm1l7jj44M8J23q5n4J23L7j7O4q6m6Q8l1Q9j56Q1n5L0O8m7M9p9j01Q0N4
4538B3o6%O8J4p8j1k1J15m2o0n4K7J43q4J4O4ML8q1J6n4l9Q8K3J4o9k1M6L2r0
$$ y = [39, 76, -64, -58, 96, -132, -72, 31, -43, -106, -92, -84, 39, 62, -37, 42, -61, 107, -11, 2, 28, -1, -36, -46, 4, -21, 182, -14, 19, -93, -47, -54, -109, -142, -5, -103, 76, 2, 71, -86, -42, -49, -89, 31, -36, -64, 86, 42, 73, 46, -37, -17, -40, -19, -109, -20, 17, -12, 21, -9, -9, 1, -77, 21, 29, 91, -68, 18, -14, -81, 43, 106, 15, 102, 3, -67, -6, -5, 57, 10, -55, -17, 19, 7, 7, -68, -44, 32, -41, -45, -16, -25, 125, -44, 98, -69, -51, -21, -105, 36, -102, -33, -161, -10, 64, 81, 76, 31, -60, 9, 5, -92, -27, -65, -2, -70, -81, -33, -212, -102, -1, -32, 2, 12, -14, -101, -57, -26, 38, 6, -71, 28, -32, 30, 63, -26, 23, 75, -26, 46, 7, -63, -61, -32, -63, 80, -29, -91, 12, 44, -53, -14, -31, 35, 77, -48, -90, 20, -13, 35, 22, 9, 30, 22, 3, -27, -18, 99, 56, -20, 73, 61, 69, 28, -9, -10, -154, -106, 17, -68, -122, 1, 38, 21, 85, -1, -47, 41, 10, 99, -57, 24, -31, -1, 67, 20, 69, -10, -111, -31, 23, -43, -43, 25, 39, -39, -50, -71, 44, 2, -58, -112, -85, 58, -26, -12, 52, 56, 94, 13, 29, -25, -64, 24, 47, 61, -8, -29, 17, 49, -41]
4568d1J13j59P9Q0r8j8oP6m4Q2o4L1q2Q1j38J65J7l9m6lqp5J9l7J46j97J44L0
4596Hk3J39p8ro5N4m7O5j5o2M5q1p0R4O7J9r1P3oj8P2j09J8L1o5J20j72M5N6O4
4626E9kj7o9J28j73M1M6q5J11P4j81R6j0J1Pn1Jj7N5O7j26R9p4q1N4M3j55P5J63
4655H9j87M4O0M1k3l9m4J18j54J60p8j04K13n5n8L7l6J7M5n2k7K7Mn8K1OO9n4
4683a8L0Jm6j3J6mK0R5l1o2J55r6q5L1N3l8L8J6j4j7J7j01j2J83p4n1N7l5j4J05
4713A06j99O6K7k2Q5o4lnjK4k1PK6J0k0O2J4n5j71O1J72j94J2R1n8RK00j41j0
4742HL6r8J5P6m9jr8N6nN2P9r0k8L6P3p9M1Ml6p5O9O2r1L6o3m4J32L0O2j78q0
4773a48J04L3l9Q4p0N2Nj3q4R6j12P6M5k7K1N3q5q8R3L6q8JJ58o0m8K9m4k9N8
$$ y = [-41, 72, -87, -8, 72, -26, -44, -50, 26, -18, 64, 0, 31, -51, 30, -108, 57, 74, 35, -11, -14, -22, -97, -78, -115, 31, -166, -22, 8, -15, 124, 46, 37, -28, 26, -21, 44, 29, -33, 12, -69, -139, -45, 22, 41, -50, 23, 17, -1, 71, -38, -20, 11, -54, 66, -106, -61, -5, 59, 57, 40, -29, 99, -74, -33, 13, -72, 39, 113, -68, 28, 18, 29, 36, -15, -14, -31, 24, 91, -35, 64, -10, -91, -37, 6, -149, -74, 89, -98, -54, 6, 47, 24, -15, -59, 59, -95, 65, -13, -117, 96, 41, -17, 20, -16, 1, 46, -6, -33, -6, -2, -60, -39, -33, 36, -18, 12, 13, -33, -46, -30, -34, -14, 81, 50, -12, 143, 47, -38, -7, 46, 8, 46, 62, 48, 31, 48, -53, -65, 118, 44, -7, 50, 15, 1, 106, -93, -27, 0, -22, 63, -1, -4, -9, -10, 14, -7, 0, 26, 36, 16, 78, 92, 37, -134, -73, 99, -95, -83, 8, -50, -41, 159, 18, 8, 44, -54, -39, 37, -12, -13, -111, -55, -60, -8, 71, -19, -47, -11, 62, -17, 24, 28, -8, -83, -14, 48, -43, -7, -70, -114, 18, 48, 110, -68, -148, -44, -11, -50, 34, -36, 16, 21, 8, -76, 20, -92, -16, 29, 2, 23, 76, -9, -97, -4, 32, -56, -55, 103, 43, -5, 24, -20, -49, 9]
4802Io6J41ok7o1K5k4j3J00j32O4j18R9P0k2j35L0q0J14j0M0K1j24J82n7n4N7
4829B3OJ0R2q7qm4R2j55J1j1Q8J1Q1J6j45j29J32R4r5p2Q6J2Km0j02R8l9Q6n9
4858d6jM8Pmm8rm6J53q3J8l7p2K56j12r1K07q4o6R6j28R4n7o7J34r6O2P4j69Q5
4887A8M7Qn7j22J2K29o5o9M2j87K23o3%l1K6j7l6J22p3k6L5o9N8lK4j2P5j19o4
4916i4J97p6N5k3O7j59J07j02j06J98Ko8l7R1O5p7L6J3j42n4L7O2L4j16K0J6J12
4943E8p4o1Q5m3j6P5J7k5j6M1L2j68P8M5M1J2N5k50J70J0j13N1N6jj10O3q3N2
4971a9K4M8L1q1k5Nj8J61j70p0J67q2O2q5J09j4K8k4J1n2n1P6j26J79j08LK2K2
4999B3m3Q6j6k05J79k5K2j4p0Rp6J43N0j05N6O8l5l9L4j83J93J07p4p4K5r3K9
$$ y = [9, -57, 84, 78, 51, -10, 15, -9, -22, 78, -54, 10, -108, -9, 61, 39, -96, -66, -146, -32, -42, -2, 19, -105, 77, 20, -34, 23, 29, 39, 131, 44, 36, -8, 84, -71, -60, -71, 17, 28, 109, 125, -20, -149, -17, 77, -18, -90, -4, 8, 10, -30, -132, -34, -73, 13, -46, -47, 1, 8, 4, -44, -53, -99, 54, -29, -11, -48, -120, 136, 24, -67, 140, 56, -10, 86, -42, 52, -5, -72, 62, -34, 28, 102, -67, 18, 65, 73, 16, -106, -94, 135, 70, 1, 43, -144, 79, 16, 16, -15, 11, -6, -42, 80, 7, -19, 16, -53, 5, 2, 26, 14, 89, -30, -94, 103, 27, 82, 59, 126, -33, 74, -28, -134, 64, 66, -2, -39, 52, 117, 40, 76, 89, -53, -107, -70, -8, 26, -90, -70, -54, 58, -16, -77, 8, -35, -51, 24, 41, 16, 0, 41, 73, -95, -17, 28, 69, 81, 136, -114, 56, 66, -47, 4, 60, 59, -51, 12, -71, -19, 5, 53, 84, 3, -22, -17, -35, 126, -44, -114, 53, -29, 33, -52, 57, 43, 71, 47, 58, 6, -45, 31, -95, 84, -24, -21, 1, 23, -20, 66, 50, -155, 24, -1, 21, 7, -63, -54, -130, 13, 63, -42, 14, 82, 47, 8, 42, -141, 52, 159, 85, 11, 36, -57, -28]
5026b8J5n4J64J3j19Q6ln5O6j50j8P9L7J4m1m0j6l9Q6Q0j11k1qJ58K3j39N0N0
5054G9j50R4Q9j26q4Q9L5j3k8j6L6m1O2KmKo4n2J70j21L4P7j06m1Q0O4Or2J16
5083I7j91J03r7J61q8J12m3J7n0j7K9q0P3j25Q9j3kL2k3R6l6j4K3n4Mol0JO7k1
5113A4n7K7Q2j32J40q4l0P5j0K9r0R0k6q9oQ3n5R4n9n1L3J7O4Rj5qN9j69K04j40
5143aJ23r2lm3lj19N9J53j38j1J13n6L9o9O2J16k58L6Q7K5k9L9m7n3O0j0P5l3
5171B2m5O5k9mO1O0n4j27J12j85K38j96J64r7O8l4n4O1J5J1m4K8k9j00N5KM7N9
5199G0k2r0P2L3n3qk3l0kJ48j00j25K12K9l0o2n6K1PK6l6L0n5R7j10J22n5o9J17
5228E8j00rO7N8j05J34j22KJ15j86Q8m0n%j1JP7J6l6R3j90J55q3k4J65j18M3j00
$$ y = [-28, -13, -67, 97, 110, -9, 77, 74, 19, 85, -65, -83, -4, 33, 47, 6, -34, -50, -89, -3, 77, -34, -55, -63, 95, 118, -21, 29, 79, -71, 23, 112, -14, -98, -9, 26, 13, -15, -31, 5, -36, 26, 28, 24, 26, -38, -90, 80, -41, -7, 70, -36, -77, 3, 67, 73, -19, 97, -94, 9, -88, 73, -15, 97, 54, 71, 21, 4, 33, -47, 26, -99, -10, -23, -25, 7, -16, 80, 44, 30, 53, -1, 3, -3, -33, -32, 35, 14, -43, -16, 66, -66, 74, -10, -40, 35, 25, 54, -36, 54, 28, -61, -67, 16, -39, 55, -4, -55, -22, -5, 59, 68, 53, 45, 104, -65, 139, -1, 122, 30, 27, -16, -19, -138, -79, 74, -64, -75, 38, -18, 21, -48, 14, 130, -128, -92, -5, 20, -9, 30, -17, -70, -10, -20, 55, 22, -23, 42, 13, 9, 70, 130, 76, -51, 61, -124, 114, -82, 82, -15, 53, 19, -35, 26, 41, 52, 8, 36, 7, -93, -38, -36, 11, 70, 48, -42, 30, 63, 10, 2, -21, -51, -53, 95, -5, -130, 82, 111, 81, 19, -37, -16, -9, 17, -19, 11, -44, 53, -57, 65, 10, -59, 58, -42, -51, 16, 74, -31, 103, -19, -17, 98, -88, 0, -40, -45, -45, -56, -55, 22, 38, 2, 95, -95, 60, -23, -47, 118, 0, 43, -57]
5256e7M7L9n3N7j07J05j39rR7o3P5j07K19j9j45N6J04r5k1o6J27K0q4N5R8j64
5282c0OJ57j61NO0k7n4L7n9L8J20j01j4k0J78j63J0K9j1N8j29O5n1kQ3K3l4j20
5310a07J21n8J5j0M1o7O4o5J2p5L9Q2j9j5P5j3j5J8o3k9R0k3j5M6M2n2J01l8j8
5339F4j09P9r5P6J24m1j77J15n6l4J39o6O3j25L0N3k0l1nP2p8r2K52j15jrj10
5366i7K56j42o6J30m8l6K0K3m9K7o8J62l7j5M1n4K0k9n3L1M1q6L2l3J04Mm4J3
5394D7q0r2J63j4L8n5n0L9N4q7MO5on2j2j08K15q9k4Q4j8k8L3p2M9N5j42K00l2
5423H5q5k8K9O6J01k22j18J60p1L3J09o1k0K2N4m5m9N8m5K0p1R1J7o8k7J0Q9p1
5451c7n2J91j2pk0j2o3J6J9N5j83J06M4r8J5m9k1J77Mj57O6l2j6J52j59Q4L1l0
$$ y = [-57, -10, 29, -24, 33, -74, 31, -108, -117, -20, -83, -8, -115, 104, 85, -60, -4, 100, 5, -16, -82, 45, 65, -19, 36, 134, -30, -24, 133, -28, -23, 37, 10, -44, -7, -66, -28, 92, -9, -23, -43, 135, -28, -18, 11, 0, 58, -71, -6, -57, -59, 24, 47, 13, -107, 14, -44, -29, -39, 2, -65, -1, -66, -54, -129, -90, -8, -27, -42, 33, 20, 5, 23, -40, -69, 21, -2, -17, 29, 71, 19, 120, 82, 64, -45, 34, -61, 15, 139, 98, -79, 36, -20, -54, 85, 19, 82, -43, -13, 40, 20, -11, -16, 56, -22, -114, 138, 23, 22, 13, -97, 159, 17, -49, 81, 33, -3, 17, 40, -9, 18, -50, 112, 75, 60, 101, 47, 67, 38, -15, 16, 57, -29, 3, -30, 74, 78, 34, 47, -33, -125, 38, 24, 62, 7, -43, -4, 50, -37, -33, 32, 26, -26, -38, -146, 69, -20, -44, 40, 22, -6, 27, -45, 4, 59, -83, 117, 85, 0, -28, 1, 67, 168, -54, -172, -12, -83, -50, 59, -2, -22, 0, 54, 9, -40, 18, -27, -7, -78, 13, 30, -38, -65, -55, 34, -37, -89, 102, 90, 83, 63, 51, -12, 4, 23, 78, -105, 1, 45, -53, -38, -87, -108, 69, 73, -84, -18, -50, -66, 86, -73, 11, 42, 12]
5479A2pj7j36K09j0j04O0l1J42j02m6k5O6K5j2rj14J47r9p0J44K2j60K59k02P4
5505A6J21p8j61Q8N5P4j16J1PJ03j09K8m1PJ7j26R7R2q3J3M1Q1j86kR8q9Q8L1
5533G7l4k1j74M8P7kJ11j1m5Jm5j7Q6L7K4n2m4k5J8L6k7P3n9r9N3J03j26P7j43
5562a03O5M5j36J37jo4R7l0Q4j29mJ13m4j34R2o8R9J54k43O2o5O3l5O5K5P7j08
5589A4Qm1J7n3k2K2R1O8j57M7L0p8Q8M0o2k2k8l8K69k74N7pmN9j4M8j0j10r0K13
5619F1N2j8r1o1K7R8j45J1k6J63r9J21p0Q6j55L2N1K3K7r2j9O9J2o9J75k70K73
5646A66j73j9M8l0J01n1M7k4j42K01o1k7o2J7J9n7OO8r5O6J2j21J82pn7J2L2o2
5674a1L0mq1J16k6P0j62l9O4N5J5Jl8J62J5j65Nk7m3P9n6L3l1R0j45L9lJ26j21
$$ y = [12, 5, -12, -148, 61, 51, -53, 7, -24, 118, 16, -30, -55, 11, 36, 24, 15, -99, 48, -51, -121, 23, 45, -115, 144, -58, 16, 137, 59, -102, -14, 41, 115, -1, 10, 17, 120, 11, 39, -2, 5, 22, -104, -7, 85, 2, 15, 56, 137, -49, -51, 47, -42, 46, 77, 43, 22, -152, -104, -27, -29, 82, 71, 26, 27, -18, -35, 51, 88, 112, 60, 16, -9, 9, 45, 18, 91, 32, -67, -14, 89, -37, 40, -103, -38, 7, -129, 8, 7, -57, 40, 10, 94, -35, -39, 74, 30, -104, -12, -80, 19, 173, -70, -8, -73, -10, -45, 20, 45, 122, 14, 22, -19, -2, -55, -77, -55, 36, 104, -53, -6, 24, -54, 34, 74, 12, -10, -38, -76, 193, -81, -24, -31, -35, 24, 10, 58, 48, -62, -152, 61, 113, 95, 4, -57, -30, 68, -77, -66, -92, 71, -28, 93, 23, 109, -46, -14, 37, 60, 87, -5, -24, 45, 57, -12, 163, -107, 166, -7, -26, 22, -8, 93, 42, 89, 65, -77, 124, 63, 36, -26, -9, 10, -47, -41, 27, -68, -2, 10, -111, 71, 64, 7, 19, 51, -11, 19, 15, -66, 50, 24, 94, -68, -107, -43, 12, 27, 28, -10, 152, 167, 2, 7, -20, -63, 16, -40, -7, -38, 52, -93, -54, -57, 69, -52]
5703e2k2Q2k6M6k8l1N8q3R7K9j39P5MN3j47J79k4o8P0m8j07J02J7R3k37R0l9J51
5731I5j86J65p8KM1j18kP3QM9j18P3P8r2L8o1L2M4rj25J87m7j27R0K9OK7k03J54
5760B5Q3j86J5Q5k1J3j2K7p0lK3J3q6N6j4L8l7%L4r2J84r9N1l3j9km5P7N6l6n4
5791b9N8n4O4l2o1N8q9l3o0J51R3k6o4l7O9k9P9p8Q4m3J7n7ln9R6l8NM0N1j9j14
5822f0P2j4P0k2k7j18R7K1p7J08rkO7j99J74l1n2Mk4J1M0r0k8J02l6O3j03P6q3
5851g0m1R2J16j01P0n5J8J08p2j52oJ12n3K8J2j74O5O0J19j02q7P9r5J67p0R1
5877E9o2P3r6Q6mj0l5J8j04R1Q4j40N1j1J2P2o9j6%j6J4M8qO4j9n3m5q2J7P5R4
5908H8q1Q5oq4j2RQM0j10R4P2j39O2o9J21qm6P0j38N0N0M0r3K4p8M0O0Rj3Kj51
$$ y = [-52, -74, 8, -18, 28, 0, -31, 27, -56, 41, 70, -69, 6, 10, 63, -84, 95, 71, 3, 73, 25, -82, 20, 37, 130, -107, -17, -56, 95, -91, 74, -4, -2, 39, -79, -81, -8, 0, 49, -69, 4, 82, -10, 28, -33, -1, 43, 34, -91, 96, 49, -78, 12, 41, 47, 74, -129, 25, 108, -78, -63, 22, 1, 14, 2, 29, -41, -44, -21, -8, -94, -38, -52, -14, -51, -51, -17, -109, 75, -24, 27, -6, -25, -27, -72, 5, 61, 25, -29, 29, -25, 39, 7, -54, 4, -85, -118, -178, -27, 66, 40, -24, -61, 8, -21, 58, -20, 64, 21, 38, -19, -22, -81, 15, -23, -18, 22, 73, 54, -60, 12, -2, 68, 46, 19, -99, -2, 19, -58, 50, 41, 39, 106, -93, 81, 50, -2, 2, -22, -11, 29, -61, -89, 13, -23, 40, -63, 13, -70, -111, -19, 97, -4, 66, 11, 29, 137, 65, -87, -93, 19, -34, -6, 6, -168, -103, -43, 76, -26, -113, -34, -129, 38, -32, 59, -3, 70, -26, 60, 56, 46, 11, 29, -75, 16, 100, -40, 11, 0, 12, 84, 15, -1, -1, -17, -3, 45, 37, 101, 82, 29, -16, -98, -81, -6, 88, 7, 92, 86, 2, -10, -1, 7, 47, -63, 31, 103, -36, 26, -43, 78, 70, 24, 94, -44, 6, 56, 96, 3, 27, -51, -11, 49, 58, 45, 47, -104]
5939a04J54%j36J72J6j62N0j3n2nR7j3J07j18m0P7Qm2p0J08l3Ro3jK3r4P9P3m3
5968a6O0l7Q4M4n0k8K1j00k0j5L3J12l7Rn6nj7O6J3n8P5p2j46K06j11O8j04O2
5996a9N0l6J5m4R5K0j65R1k8q4J77j58J51l6q7J7R3j71J08K8j39J28no3J76j36
6022b2j7O2Nj25Q7j16P7M9M5j0j13n1J09j8R9P8j66J74j44Kq5QK05m5r3O8L3j07
6050a1J09j19K2l3qj1N1j1J08no7J5N5k09M9J06m6L4K1l3Qo2R6j72J02k2L4j35
6078a34K80j54K7P9j5j15l5Q9p1J40j19J30j66K9M7N6l6j53K05p5Q7j12P7r1j7
6103d7J63m8o5J1JL4O1o3o6J07m8L5q4J05j7p5JK6n2P1j44J39n3O1oj8q0R4m9
6132fK1q0O5j9O4J6o4Pk8P9j23J34n0l5L3J15q5l2N2k1o0K6l7N9n7M3J9J0k5O2
$$ y = [-104, 50, 50, -86, 86, 102, -60, -10, -23, -75, -80, 17, 4, 111, -7, -47, 30, 38, -4, -74, 34, 1, 10, -53, -54, -31, -125, -46, 27, -16, 44, 7, 91, 135, 85, 57, 78, -22, -42, -57, -24, 88, 51, 60, 4, -1, -18, 48, 61, 3, 78, 6, -140, 66, -45, 23, -81, -19, 31, -5, 10, -34, 61, 81, -84, 7, -21, -105, 72, -86, 65, 29, -58, -41, 52, -119, -11, 17, -122, 6, 1, -62, 114, -22, -39, 23, 28, -97, -10, -126, -49, 0, 45, 35, -78, -129, -20, -38, 61, 139, -27, 147, 3, 5, -80, -72, 133, 88, -5, 63, 96, -11, 98, -21, 1, -32, -40, -51, 0, -11, 97, 92, 25, 40, 95, -114, -65, 41, -5, 29, 50, 17, 25, -37, 59, -113, -11, -33, 1, -134, 146, -8, 19, 98, 83, -32, -67, 22, -49, 91, -28, 102, -64, -35, 12, 68, 32, -121, 84, 9, 96, -16, 61, -30, -47, 116, 68, 3, 14, 15, 49, 110, 47, -19, 88, 40, 75, -9, 96, 79, 4, 5, 31, -21, 50, -94, 45, -8, 53, 47, 29, -51, 43, -6, 15, -65, 0, -19, 45, 61, -3, 4, -24, 55, -68, 66, 16, -19, 14, 129, 44, 12, 64, 43, -17, 9, -28, 31, -26, 17, 36, 46, 21, 83]
6162H3o0M7q1q3L2O8J6k9N0p6j1p6N8J39j27N7Nop5P5M9j17J94r1q3N8O6kj54
6191g4J83p5m2j1JOpk5L2NQ7r8O3j8O5j51m4J24j08J71k20J67K1n0po4q1Q4O2
6220dk5l8K29j84L3k8j2J46p6q3K7J04j04J5k2JJ67j87K6M2k5o9K7R8Ok3j13J11
6248C9L5j0p1Lq0M1j22J16J26o3o9N7J6L7K2l3r2L5J03q0l3N2k4J2p4L3M3n1n8
$$ y = [83, 23, 70, -11, -94, -62, 6, 22, -7, 43, -33, -44, -120, -62, 77, -50, 7, 12, 6, -69, 6, 55, -62, 132, 41, -42, 16, 82, 80, -74, 109, 34, -8, -19, -18, -12, -19, -44, -12, -7, 80, -18, 45, 27, 92, -59, -103, 21, -87, 84, -136, 31, 52, 2, -5, -69, -150, -66, -4, -29, -67, 162, -22, 11, -17, -29, 117, 41, -42, -15, 89, -15, 0, -22, -21, 146, -41, -15, 27, 2, -67, -40, 58, 64, 41, -72, 39, 74, 64, -7, -4, -84, -43, -165, -49, 77, 14, -55, 2, 18, 55, 77, 44, -48, -13, 90, 10, -23, 29, 5, 17, -57, -24, 19, -32, -90]
$$ [...]
8191E8
##END NTUPLES=NMR FID
##END=
