##TITLE=1H_DE-80H_X3
 200.13MHz, d2o
 8 sc
 
 19ns.26.2.2025
##JCAMPDX= 6.0         $$ Bruker NMR JCAMP-DX V2.0
##DATA TYPE= NMR FID
##DATA CLASS= NTUPLES
##ORIGIN= UXNMR, Bruker Analytische Messtechnik GmbH
##OWNER= pz
$$ XWIN-NMR		Version 3.5
$$ Fri Jul  4 10:24:37 2025 Russian Standard Time (UT+4h)  Yarkov@DPX200
##.OBSERVE FREQUENCY= 200.1313
##.OBSERVE NUCLEUS= ^1H
##.DELAY= (6, 6)
##.ACQUISITION MODE= SIMULTANEOUS
##.ACQUISITION SCHEME= undefined
##.AVERAGES= 8
##.DIGITISER RES= 18
##SPECTROMETER/DATA SYSTEM= spect
##.PULSE SEQUENCE= zg30
##.SOLVENT NAME= CDCl3
##.SHIFT REFERENCE= (INTERNAL, CDCl3, 0, 14.3821)
##AUDIT TRAIL= $$ (NUMBER, WHEN, WHO, WHERE, WHAT)
$$ ##TITLE= Audit trail, XWIN-NMR		Version 3.5
$$ ##JCAMPDX= 5.01
$$ ##ORIGIN= Bruker BioSpin GmbH
$$ ##OWNER= Yarkov
$$ C:/Bruker/XWIN-NMR/data/yarkov2/nmr/H-C/1/audita.txt
$$ ##AUDIT TRAIL=  $$ (NUMBER, WHEN, WHO, WHERE, WHAT)
(   1,<2025-07-04 10:22:49.89 +0400>,<Yarkov>,<DPX200>,
      <created by zg, POWCHK disabled, PULCHK disabled
       configuration hash MD5:
       00 E9 B6 7A A2 85 ED C7 34 08 36 98 17 FE 4E 26
       data hash MD5: 16K
       53 74 2B 22 3D BE 6B A8 EA 6C B4 C7 D1 F4 49 88>)
$$ ##END=
$$ 
$$ hash MD5
$$ AD 43 CD D7 4A 70 11 B4 CC 01 90 E7 55 E5 A7 29
##$RELAX= 
##$RELAX= 
##$RELAX= 
##$RELAX= 
##$RELAX= 
##$RELAX= 
$$ Bruker specific parameters
$$ --------------------------
##$DU= <C:/Bruker/XWIN-NMR>
##$EXPNO= 1
##$NAME= <H-C>
##$PROCNO= 1
##$TYPE= <nmr>
##$USER= <yarkov2>
##$AMP= (0..31)
100 100 100 100 100 100 100 100 100 100 100 100 100 100 100 100 100 100 
100 100 100 100 100 100 100 100 100 100 100 100 100 100 
##$AQSEQ= 0
##$AQ_mod= 1
##$AUNM= <au_zg>
##$AUTOPOS= <>
##$BF1= 200.13
##$BF2= 200.13
##$BF3= 200.13
##$BF4= 200.13
##$BF5= 200.13
##$BF6= 200.13
##$BF7= 200.13
##$BF8= 200.13
##$BYTORDA= 1
##$CFDGTYP= 0
##$CFRGTYP= 5
##$CHEMSTR= <none>
##$CNST= (0..31)
1 1 145 1 1 1 1 1 1 1 1 1 1 1 1 1 1 1 1 1 1 1 1 1 1 1 1 1 1 1 1 1 
##$CPDPRG= <>
##$CPDPRG1= <>
##$CPDPRG2= <>
##$CPDPRG3= <>
##$CPDPRG4= <mlev>
##$CPDPRG5= <mlev>
##$CPDPRG6= <mlev>
##$CPDPRG7= <mlev>
##$CPDPRG8= <mlev>
##$CPDPRGB= <>
##$CPDPRGT= <>
##$D= (0..31)
0 0.7 0 0 0 0 0 0 0 0 0 0.03 0 0 0 0 0 0 0 0 0 0 0 0 0 0 0 0 0 0 0 0 
##$DATE= 1751610169
##$DBL= (0..7)
120 120 120 120 120 120 120 120 
##$DBP= (0..7)
150 150 150 150 150 150 150 150 
##$DBP07= 0
##$DBPNAM0= <>
##$DBPNAM1= <>
##$DBPNAM2= <>
##$DBPNAM3= <>
##$DBPNAM4= <>
##$DBPNAM5= <>
##$DBPNAM6= <>
##$DBPNAM7= <>
##$DBPOAL= (0..7)
0.5 0.5 0.5 0.5 0.5 0.5 0.5 0.5 
##$DBPOFFS= (0..7)
0 0 0 0 0 0 0 0 
##$DE= 6
##$DECBNUC= <off>
##$DECIM= 32
##$DECNUC= <off>
##$DECSTAT= 4
##$DIGMOD= 1
##$DIGTYP= 9
##$DL= (0..7)
0 120 120 120 120 120 120 120 
##$DP= (0..7)
150 150 150 150 150 150 150 150 
##$DP07= 0
##$DPNAME0= <>
##$DPNAME1= <>
##$DPNAME2= <>
##$DPNAME3= <>
##$DPNAME4= <>
##$DPNAME5= <>
##$DPNAME6= <>
##$DPNAME7= <>
##$DPOAL= (0..7)
0.5 0.5 0.5 0.5 0.5 0.5 0.5 0.5 
##$DPOFFS= (0..7)
0 0 0 0 0 0 0 0 
##$DQDMODE= 0
##$DR= 18
##$DS= 0
$$ [...]
##$SUBNAM2= <"">
##$SUBNAM3= <"">
##$SUBNAM4= <"">
##$SUBNAM5= <"">
##$SUBNAM6= <"">
##$SUBNAM7= <"">
##$SUBNAM8= <"">
##$SUBNAM9= <"">
##$SW= 18.0517328524113
##$SWIBOX= (0..15)
0 0 2 0 0 0 0 0 0 0 0 0 0 0 0 0 
##$SW_h= 3612.71676300578
##$TD= 16384
##$TD0= 1
##$TE= 0
##$TE2= 300
##$TE3= 300
##$TEG= 300
##$TL= (0..7)
0 120 120 120 120 120 120 120 
##$TP= (0..7)
150 150 150 150 150 150 150 150 
##$TP07= 0
##$TPNAME0= <>
##$TPNAME1= <>
##$TPNAME2= <>
##$TPNAME3= <>
##$TPNAME4= <>
##$TPNAME5= <>
##$TPNAME6= <>
##$TPNAME7= <>
##$TPOAL= (0..7)
0.5 0.5 0.5 0.5 0.5 0.5 0.5 0.5 
##$TPOFFS= (0..7)
0 0 0 0 0 0 0 0 
##$TUNHIN= 0
##$TUNHOUT= 0
##$TUNXOUT= 0
##$USERA1= <user>
##$USERA2= <user>
##$USERA3= <user>
##$USERA4= <user>
##$USERA5= <user>
##$V9= 5
##$VALIST= <valist>
##$VCLIST= <CCCCCCCCCCCCCCC>
##$VD= 0
##$VDLIST= <DDDDDDDDDDDDDDD>
##$VPLIST= <PPPPPPPPPPPPPPP>
##$VTLIST= <TTTTTTTTTTTTTTT>
##$WBST= 1024
##$WBSW= 4
##$XGAIN= (0..3)
0 0 0 0 
##$XL= 0
##$YL= 0
##$YMAX_a= 204568
##$YMIN_a= -155099
##$ZGOPTNS= <>
##$ZL1= 120
##$ZL2= 120
##$ZL3= 120
##$ZL4= 120
##$ABSF1= 10
##$ABSF2= 0
##$ABSG= 5
##$ABSL= 3
##$ALPHA= 0
##$AQORDER= 0
##$ASSFAC= 0
##$ASSFACI= 0
##$ASSFACX= 0
##$ASSWID= 0
##$AUNMP= <proc_1d>
##$AZFE= 0.1
##$AZFW= 0.1
##$BCFW= 1
##$BC_mod= 2
##$BYTORDP= 1
##$COROFFS= 0
##$CY= 83.5205535888672
##$DATMOD= 1
##$DC= 2
##$DFILT= <>
##$DTYPP= 0
##$F1P= 10.8118882576601
##$F2P= -7.23987719738617
##$FCOR= 0.5
##$FTSIZE= 0
##$FT_mod= 4
##$GAMMA= 1
##$GB= 0.15
##$INTBC= 1
##$INTSCL= 1
##$ISEN= 128
##$LB= 0.25
##$LEV0= 0
##$LPBIN= 0
##$MAXI= 10000
##$MC2= 0
##$MEAN= 0
##$ME_mod= 0
##$MI= 1.114404
##$NCOEF= 0
##$NC_proc= 0
##$NLEV= 6
##$NOISF1= 3.799351
##$NOISF2= 2.8
##$NSP= 1
##$NTH_PI= 0
##$NZP= 0
##$OFFSET= 14.38212
##$PC= 1
##$PHC0= -1365.687
##$PHC1= 16.24948
##$PH_mod= 1
##$PKNL= yes
##$PPARMOD= 0
##$PSCAL= 0
##$PSIGN= 0
##$REVERSE= no
##$SF= 200.129724274929
##$SI= 16384
##$SIGF1= 3
##$SIGF2= 2
##$SINO= 400
##$SIOLD= 16384
##$SREGLST= <1H.CDCl3>
##$SSB= 0
##$STSI= 0
##$STSR= 0
##$SW_p= 3205.1282051282
##$SYMM= 0
##$S_DEV= 0
##$TDeff= 0
##$TDoff= 0
##$TI= <>
##$TILT= no
##$TM1= 0
##$TM2= 0
##$TOPLEV= 0
##$USERP1= <user>
##$USERP2= <user>
##$USERP3= <user>
##$USERP4= <user>
##$USERP5= <user>
##$WDW= 1
##$XDIM= 8192
##$YMAX_p= 0
##$YMIN_p= 0
$$ End of Bruker specific parameters
$$ ---------------------------------
##NTUPLES= NMR FID
##VAR_NAME=  TIME,          FID/REAL,        FID/IMAG
##SYMBOL=    X,             R,               I
##VAR_TYPE=  INDEPENDENT,   DEPENDENT,       DEPENDENT
##VAR_FORM=  AFFN,          ASDF,            ASDF
##VAR_DIM=   8192,          8192,            8192
##UNITS=     SECONDS,       ARBITRARY UNITS, ARBITRARY UNITS
##FACTOR=    0.0002768,     1,               1
##FIRST=     0,             0,               0
##LAST=      2.2672688,     0,               0
##MIN=       0,             -155099,         0
##MAX=       2.2672688,     204568,          0
$$ Real data points
##PAGE= N=1
##DATA TABLE= (X++(R..R)), XYDATA
$$ [...]
2122E95j366j058K946j576l06K397j756j30J182j481J365l40j024J767j880p64
2138a429K802j794k68K617k030p2Q22j461J145m89p00K254k095m88K793k540j7
2155i50K296j935J50P20j219J318o46k41J881k104l03K548k383K38K375k043L22
2172B4O69j574J205p25k18K231k205L6K154k755L73K131j819O08L91j227J138
2189D37r07O1K250k165R4J622k835N18J623j578J130K62j241J239j288k93K210
2206A139j720O42J935k736N66J043k073J367M20j159J421j460l09J848j946R58
2222f4J680k549R80P58j873J554Q1q85J566j461n10J520k163R41J830k090J308
2239F23M52k116J392m73q78J867j409k3J422j904Q39J231j858J420J39j632J667
$$ plain form
2122 595 -771 -1829 1117 -459 -765 1632 -124 -254 928 -553 812 472 -552 1215 -665 -1429
2138 -1429 1373 -421 -689 1928 -102 -174 648 -813 332 -157 -857 1397 -698 -1186 1607 -933 -950
2155 -950 1346 -589 -439 281 -938 380 -266 -507 1374 -730 -1033 1515 -868 -630 1745 -298 24
2172 24 693 -881 324 -401 -619 1612 -593 -557 1597 -1158 -785 1346 -473 135 526 -701 437
2189 437 -470 -409 1841 -324 -230 1392 -1443 -925 698 -880 250 512 -729 510 -778 -1071 1139
2206 1139 -581 61 1996 -740 -174 869 -1204 163 583 -576 845 -615 -924 924 -1022 -64
2222 -64 1616 -933 47 805 -1068 486 567 -318 1248 -213 -723 797 -1366 -425 1405 -685 623
2239 623 1075 -1041 351 -122 -1000 867 -542 -565 857 -1047 -208 1023 -835 585 724 -908 759
2256G59p20p91J781j508m1J461j970P78J028j590J561J3j451J627j244p68K002
2273I27j697K07J687j860J034P35j772J330m46j142J583j262k36J911j837L55
2289d83J620k029R27O02j484J496l95q01J549j529p6J574j930P12J627j958J052
2306D74O07j720J274o98q45J489j498M91J618k137J076J194k345J270M19j633
2322i64J240n49n11J374j327M74J140k076J472P31k218J796K03j727J515o47o77
2339g51J205j094O97R99j825J518M93k072J595j78j772J746n70p43J512j187M86
2356E9N65j732J571o5j887K002m42j420K189q49n75J492j112K57M83j392J534
2373F78m15j533K087r07j325K357j267m45J819j122K97P25j340J256o97j053J802
$$ plain form
2256 759 39 -752 1029 -479 -520 941 -1029 -251 777 -813 748 761 -690 937 -307 -1075 927
2273 927 -770 -563 1124 -736 298 1033 -739 591 145 -997 586 -676 -912 999 -838 -483
2289 -483 1137 -892 35 637 -847 649 254 -547 1002 -527 -603 971 -959 -247 1380 -578 474
2306 474 1081 -639 635 -63 -908 581 -917 -426 1192 -945 131 1325 -1020 250 669 -964
2322 -964 276 -273 -784 590 -737 -263 877 -1199 273 1004 -1214 582 785 -942 573 -74 -751
2339 -751 454 -640 57 1056 -769 749 1242 -830 765 587 -1185 561 -9 -752 760 -427 59
2356 59 624 -1108 463 398 -1489 513 71 -1349 840 -9 -584 908 -204 53 536 -856 678
2373 678 263 -1270 817 -90 -1415 942 -325 -770 1049 -73 224 949 -391 865 168 -885 917
2390I17j347n64K407j626k48J744j761L67N15j262J241m57q04J841j490k20K050
2407A303k062K01J770j803N49P78j196P15l70n89J232j352L06J755k006O33J442
2424A306k127P67R28j682J099j38m80J160j304M58J223k216Q80J119k253J246
2440a4Q74j816J398n9p40R67j044K63P76j640J264O88k297J779L68j928J680j32
2458C87q54J039o60L12M42j647J296P5j918K027J15j854J974j52j009J030q14
2475b11J77M55j514J599k07j620K182l34j771K164o56r53J190p76K99N00j153
2492f29J145k04j602J998o04j087K085p97q63J384j258L01L82q75J296l86j157
2509h71J720r56q95K059j356l33J348j346L58P25j248J422j08j063J514j005p00
$$ plain form
2390 917 -430 -994 1413 -213 -461 1283 -478 -111 404 -858 383 -74 -878 963 -527 -747 1303
2407 1303 -759 -558 1212 -591 -42 736 -460 255 -115 -704 528 -824 -518 1237 -769 -136 1306
2424 1306 -821 -54 874 -808 291 153 -327 833 -471 -13 1210 -1006 -126 993 -1260 -14
2440 -14 860 -956 442 383 -357 610 -434 -171 605 -1035 229 917 -1380 399 767 -1161 519 387
2458 387 -467 572 -88 224 666 -981 315 390 -1528 499 614 -1240 734 582 -427 603 -211
2475 -211 -34 421 -1093 506 299 -1321 861 527 -1244 920 264 -689 501 -275 24 524 -629
2492 -629 516 312 -1290 708 104 -983 1102 305 -558 826 -432 -131 251 -624 672 286 -871
2509 -871 849 -107 -1002 1057 -299 -632 716 -630 -272 453 -795 627 519 -544 970 -35 -735
2526g35J568j350J57J183j383O08N04j518J391j95r02J587r68l93J092j524M62
2543d16J066j399J380K93j711J410k21j192J523p73l90Q08j286O01N83j098J514
2560F92R9j576J453m82j006J361m08o0P26j317N95J70j311J717q1j501J739o70
2578A40j234J568o85L2Q66j134O86Oj275J722k45j356J903q50j163J384p81J07
2596c09R40r14Q14l63j219J725p54q18J981r18r95J385q67Q9P00p31R46k43j294
2615h45J602q84q40K014j044o29J344j063l5P97q99J047m33r35J500j056o69J889
2633H61r08m06J225j039K96L55j025J258n35p61J518j001p94J727j033r2J197
2650H43j138M42J62j026J240k74j015J607q76o91J542q73j63J012j177M88L7j112
$$ plain form
2526 -735 833 -517 -360 823 -560 48 552 -966 425 230 -672 915 -53 -446 646 -878 -416
2543 -416 650 -749 631 924 -787 623 402 -790 733 -40 -430 378 -908 -307 276 -822 692
2560 692 791 -785 668 186 -820 541 133 73 799 -518 77 247 -1064 653 572 -929 810 140
2578 140 -1094 474 -211 -179 687 -447 239 245 -1030 692 447 -909 994 144 -1019 365 -416 -309
2596 -309 631 -283 531 168 -1051 674 -80 -898 1083 165 -830 555 -312 -223 477 -254 692 449 -845
2615 -845 757 -127 -967 1047 3 -626 718 -345 -380 417 -482 565 132 -803 697 -359 -1028 861
2633 861 -47 -453 772 -267 29 384 -641 617 82 -679 839 -162 -956 771 -262 -354 843
2650 843 -295 147 309 -717 523 249 -766 841 -35 -726 816 -57 -220 792 -385 103 140 -972
2668i72J315m03q56J734r79m48J348j113K14Q50j131P17o8r77J261n05o33J494
2686H48q34m90J183j076K11O70j027R38k22j041J496p10m62J449r55l59J249j396
2704e28L18N97j073J071k98j004J524p36o05J384r36j73J108j134M26L23j072
2721h08J333m05n85J353r61l68J415j210N8Q81j182M78J97r35J104n58k70J395
2739I32j032k98J283j315K53O65j183P73J12q72J104n20l96J295j037j30J112
2756G46j259K38P42j150P06J63p23J119n86m00J269j074K8J046j367N94M57j198
2774f49Q85Q6q50J155p76l08J139j073J33Q82j319O23M74j239J222r1q78J224
2792F40o85l29J087j225L67O40j217P90L57j129J217j34r98J192o97k90R20r52
$$ plain form
2668 -972 343 -60 -916 818 -161 -609 739 -374 -160 690 -441 276 208 -769 492 -13 -646 848
2686 848 14 -476 707 -369 -158 512 -515 423 201 -840 656 -54 -516 933 -22 -381 868 -528
2704 -528 -210 387 -686 385 87 -917 607 -129 -734 650 -286 -459 649 -485 -59 264 -808
2721 -808 525 120 -465 888 -73 -441 974 -236 -178 703 -479 -1 196 -739 365 -193 -463 932
2739 932 -100 -398 885 -430 -177 488 -695 78 190 -682 422 -98 -494 801 -236 -366 746
2756 746 -513 -275 467 -683 23 186 -537 582 -4 -404 865 -209 -181 865 -502 92 549 -649
2774 -649 236 322 -528 627 -149 -457 682 -391 -258 624 -695 -72 402 -837 385 294 -584 640
2792 640 -45 -374 713 -512 -145 495 -722 68 425 -704 513 379 -619 573 -124 -414 506 -446
2810d46L15N13j030R45J47r63J255n48p92J299p92m59J045r72L30N01q50R27m21
2829Do55J429p48o28J529j022l06R72q47K09M40p82Q33l76o39J308q78n36J412
2848G19j281Q1J008j126M37M82p64Q38m27m07J215j125MJ197j348K97J112j460
2866e48M32M60p86P53k84l52R26j036K81J052j476N36R87j572P91L35j002Q05
2884C02l26k81O76r17L81O74j270Q96N84j469Q90L65j245R60k30k76P48o61J74
2903b5N84j228R79L33j552J301N7j201J116l47n50Q08m72K01M03j009R72Q7j253
2922g96J267j66j183J475m68p24J002o96L37K37p94Q05k10r64J415n57o99J529
2940H10q17m22J061p33JM58p76Q29k68p66J284p53o57J551r75k99J174q76j06
$$ plain form
2810 -446 -131 382 -648 297 444 -519 736 188 -604 695 -97 -556 489 -483 -153 348 -502 425 4
2829 4 -651 778 30 -598 931 -91 -397 575 -272 -63 377 -405 428 52 -587 721 -157 -693 719
2848 719 -562 -481 527 -599 -162 320 -444 394 -33 -440 775 -350 -346 851 -497 -200 912 -548
2866 -548 -116 344 -442 311 27 -325 601 -435 -154 898 -578 -42 945 -627 164 499 -503 302
2884 302 -24 -305 371 -546 -165 509 -761 135 719 -750 140 505 -740 220 -10 -286 462 -199 -25
2903 -25 559 -669 310 643 -909 392 449 -752 364 17 -533 275 -197 4 407 -602 370 457 -796
2922 -796 471 305 -878 597 129 -595 407 -289 48 285 -509 296 86 -878 537 -20 -719 810
2940 810 -7 -429 632 -101 -100 358 -418 411 143 -623 661 -92 -749 802 -173 -472 702 -174 -280
2959b80M16o84Q39l09n75J253r44l27J420j117m6J259j220L43L27q29N38j68j60
2978b64J048j051Q6J014j387K64J071j260L75N42r76O36j69k63J003r66L44R33
2996I80j546L96R32j472O24N51j017P15k59k14Q59q52K19Q97j398O44N95j476
3014h22R58L95r77Q79l58k98P69q21J10P02j095O00L65j274J148J3j020J181l16
3033A39n51Q91o47N3O85j070P45k3q44J057l32q50J441p15m73J170r62N0N86q16
3053d66O84K0j018J372m38o89J397r26l29J036r67J10N93q41P23j17p27J086o53
3072a50n10J404r03j87J050j048J87M56p19O98j38n61J087q77k41J288j137jJ039
3091G37j166J95N71p89O48k40l86J140q87j47R92j232K06J127j332N31N09r27
$$ plain form
2959 -280 136 -548 291 -18 -593 660 -284 -611 809 -308 -354 905 -315 28 355 -474 64 -104 -264
2978 -264 784 -267 -181 833 -554 -290 781 -479 -104 438 -538 98 -71 -334 669 -297 47 980
2996 980 -566 -170 762 -710 -86 465 -552 163 -96 -310 549 -303 -84 813 -585 59 654 -822
3014 -822 136 531 -446 433 75 -223 546 -275 -165 537 -558 42 407 -867 281 294 -726 455 139
3033 139 -412 479 -168 -115 570 -500 245 222 -622 435 103 -747 694 -21 -494 676 -286 -236 350 -466
3053 -466 218 238 -780 592 154 -535 862 -64 -393 643 -324 -214 379 -462 261 144 -583 503 -150
3072 -150 -660 744 -159 -346 704 -344 -157 299 -420 278 140 -421 666 -211 -452 836 -301 -302 737
3091 737 -429 -234 337 -452 196 -44 -430 710 -177 -324 668 -564 -358 769 -563 -32 477 -450
3109d50O72l90j94R49q11k8J031j390K85R08j203O03M86p88O64m80k28J039q89
3128b14O5R03j202K71P08j209O51L55p35P45m48k90P80q80K44J064j164M47M19
3147E10j082N87L57q83J146o16k60R13j249M53P71j120N57N12j303P90r6n67J028
3166D48n17j11R80j268J42Q34j006O19K84p52N60l01m97J033q84K8J222j308K77
3185b17N97r64O13L62q90R34m77k98J034j007J32J068j213K95O68j168N49J12
3203A30o21R63n91l10J128j071N4J040j261M69N64r87N90J09o28Q63o90j12J174
3222H13j301L63R04j470M78O21r94O49L9l86Q39q25n0J050j225M78Q96j464N07
3241g8M95r81P46pl95P86p21N4P22j216N65O19j247Q26L79j208Q36p4l24Q05o15
$$ plain form
3109 -450 222 -168 -362 587 -224 -252 779 -611 -326 582 -621 -18 468 -320 344 -136 -364 675 -214
3128 -214 -149 754 -448 -177 531 -678 -27 328 -407 338 -110 -400 380 -500 -256 808 -356 91 510
3147 510 -572 15 372 -511 635 19 -241 672 -577 -124 647 -473 84 596 -707 83 -13 -580 448
3166 448 -69 -180 800 -468 -326 508 -498 121 405 -347 213 -88 -585 448 -436 -408 814 -494 -217
3185 -217 380 -584 29 391 -499 435 -42 -340 694 -313 -181 887 -326 -31 637 -531 18 130
3203 130 -491 472 -119 -429 699 -372 -318 722 -539 -70 494 -493 97 206 -422 441 -249 -361 813
3222 813 -488 -125 779 -691 -213 408 -586 63 102 -284 555 -270 -320 730 -495 -17 879 -585 -78
3241 -78 417 -564 182 175 -220 566 -155 -101 621 -595 -30 589 -658 168 547 -661 175 101 -223 582 -33
3262c3J27N61j256O55M12j173R12J23j022R37r8n10Q80n82JN98j009P12r1r79
3282h35J234P1j028J101l72o51J051p50KN69q08O23pj026J266k78p80J262m56
3301A88n86R80q75J02O39q16L95J95p16R22m22m72J196q73m02J206r74n1P69p88
3321c83N01j6m96R00n24l50J127j081k5J100j223K28P40r01M22J61m21O45o79
3340b75J28P44j065L46Q92j418L45R07j070M74K39l76M25l69M4O95j309N43Q50
3359G50j542Q62M62j196P61K70o29N75l68J23L50j076Q01M85j321Q01N36j394
3377g50R40J64p25M94j91j9L48q81P75J60j104J204M6j262J131J15q66P54k64
3396F9j81K66m88N63k1r53J294l50r25J241k63r32J081k81m08N82n41N13o5p43
$$ plain form
3262 -33 94 655 -601 54 466 -707 205 328 -694 243 145 -365 515 -67 -66 532 -477 235 144 -835
3282 -835 399 470 -558 543 171 -480 571 -179 -177 392 -416 207 200 -826 440 162 -618 644 188
3301 188 -398 582 -293 -191 448 -368 27 222 -494 428 6 -466 730 -143 -545 661 -313 -364 405 -383
3321 -383 118 102 -394 506 -18 -368 759 -322 -347 753 -470 -242 498 -403 19 180 -241 404 -275
3340 -275 -147 597 -468 -122 770 -648 -303 604 -466 8 247 -129 296 -73 -29 666 -643 -100 750
3359 750 -792 70 532 -664 97 367 -262 313 -55 68 418 -658 143 628 -693 108 644 -750
3377 -750 190 354 -371 123 -68 -87 261 -620 155 315 -789 415 461 -801 330 445 -421 333 69
3396 69 -112 154 -334 229 208 -745 549 199 -726 515 252 -680 401 120 -288 294 -247 266 201 -542
3416e42J095m57p45J272n62o79J135o68k42N46l95K66L9n24R72m23o27J334j057
3435b62j96J179r06q8Q18p58L06ml41O20n03k49J015r99m8J136j141K46O55q97
3455d17M68K51o51O81n80J19Q18j059L06Q19j172L34O68r75M61J37n47O74m43
3474a08k5N46r38N26O01j195P09N84j146N94J20o05N50k59j78M63o86M64M14j116
3494f85Q76J69j119J012j0o74Q29l49j06L01m92N02J70j081R59J18j230J117j50
3513A57q08R27k47k13L73m60M01q4p26R68o1r10J229l00p24P70l09k06N31m95
3533a87M08j40n42R51m56o87J192l62p18R40m43k64N37n15N44j2o88Q94l64n37
3553d49J094m96n19Q53o86r2M82n72O36j44n97Q71l52o96J177m57l39P58o66M3
$$ plain form
3416 -542 553 96 -649 623 61 -618 517 -151 -393 153 -242 24 63 -461 511 88 -539 795 -262
3435 -262 -458 721 -185 -273 545 -213 93 89 -252 368 -135 -384 631 -368 -416 720 -421 -175 480 -417
3455 -417 51 302 -349 332 -248 -129 689 -370 -64 755 -417 -83 585 -390 71 208 -339 335 -108
3474 -108 -133 413 -525 1 602 -593 116 700 -446 148 268 -337 213 -46 -224 239 -447 17 431 -685
3494 -685 191 360 -759 253 243 -431 398 49 -57 244 -248 254 424 -657 302 420 -810 307 157
3513 157 -651 276 29 -184 189 -271 130 46 -680 288 227 -683 546 246 -478 292 -17 -223 308 -187
3533 -187 221 81 -461 490 34 -653 539 177 -541 399 -44 -308 229 -286 258 246 -442 452 88 -449
3553 -449 645 149 -370 483 -203 -295 187 -385 251 107 -490 381 29 -667 510 53 -286 472 -194 -151
3573a51M46o54O29q8o20J040p84m02J029o53m9O74o53J40K27o30P47r1m75R68
3593F50m98o30Q08n25j28Q73o36J89R0o77O16p6m90J149o48l30N99o94P4M65l83
3614b02N82k4o94O97n17m45J163n05l42O27o46j2K50k69P75k14n15Q10o18n99
3634f98J098m34k61Q26n17j60J17m15O69j3m61Q62n22o88R72n10k52P64m01K6
3654BNm66P17l18m25J231o91o12J076p13k69P75m47K86m6l33O52o56j16R82p82
3675a48l25J004p34j79O32m23K33Nk88N70m35l13J077p93l00R22p25r4P59n26
3695h1J06Mj56M27n26j13R63p92j64P55p57J47M41m40L70q5l00N14o14R7O26o36
3717b14o2P91q41M1N16n85N35j18j92N50n82o4O64o26o2P61o06k3K18m80N87o1
$$ plain form
3573 -151 295 -359 270 182 -438 602 -182 -584 445 -208 -257 417 -236 -96 131 -499 248 157 -318 650
3593 650 152 -478 330 -195 -323 550 -86 103 193 -484 132 56 -434 715 67 -263 336 -358 -284 181 -202
3614 -202 380 356 -338 359 -158 -603 560 55 -287 340 -306 -318 -68 -337 438 224 -291 519 -99 -698
3634 -698 400 -34 -295 531 14 -146 -29 -444 225 212 -249 613 91 -597 375 -135 -387 377 -24 2
3654 2 7 -459 258 -60 -485 746 55 -557 519 -194 -463 312 -135 151 105 -228 424 -232 -348 634 -148
3675 -148 -473 531 -203 -382 250 -173 60 65 -223 347 -88 -401 676 -117 -417 505 -220 -314 445 -81
3695 -81 25 29 -127 300 -226 -339 624 -168 -332 423 -334 -187 254 -186 184 99 -201 313 -301 -204 422 -214
3717 -214 -276 515 -326 -285 231 -354 181 63 -129 421 -161 -225 439 -187 -249 512 -94 -117 101 -379 208 147
3739A47l19O77o21l02P35o23J63M51n94M28J2m68M80j95k50P74o47o0N09n20m4
3760b67M95o42M27J02l74O20m49k88P93m43j63N43n16L3L36m65N23j97l01O96
3780D63n30k03P47p17j08P03m78j1K93l12L01j98k67Q01p00j38R02p25k29P29
3800C23m66P3K21k39K43l14J5N82p85M2R06j149L85N61n75J41K14k62K80l02M6
3821f0M62o46O9P34j014M06N97r05K91L72n25M27k17j94N34o35K58L62q43M04
3841a23M97r87O80O7m09L75j23p0L96m58J74L13p29L85L79p49N01J45n26M72j78
3862C2j55L52m15K27J90o67O53j11n17O52j07n18P41m45n2L50m99L42j6n27Q06
3883C16j00n81O52j50m47O79l68k04N34m03Q0K36n04N01k11m73P62n16q6O26n64
$$ plain form
3739 147 -172 505 -116 -418 317 -306 -143 308 -286 142 154 -314 166 -29 -279 495 -152 -212 297 -223 -267
3760 -267 228 -414 13 115 -259 361 -88 -376 417 -26 -189 354 -162 -129 207 -258 265 68 -233 463
3780 463 -67 -270 477 -240 -348 355 -123 -134 159 -153 148 -50 -317 484 -216 -354 548 -177 -406 323
3800 323 -143 -70 151 -88 155 -159 -144 438 -347 -305 601 -548 -163 398 -177 -36 178 -84 196 -106 -60
3821 -60 402 -244 -175 559 -455 -49 548 -357 -66 306 -219 208 -9 -203 331 -304 -46 316 -527 -123
3841 -123 374 -613 67 134 -275 100 -23 -93 303 -155 19 332 -397 -12 367 -382 119 264 -262 210 32
3862 32 -123 229 -186 41 231 -436 217 106 -411 241 134 -384 357 -88 -140 210 -289 53 37 -490 316
3883 316 216 -365 287 137 -310 369 1 -203 331 -72 8 244 -260 241 30 -443 319 -197 -283 343 -221
3904b21PN50m90K16O9l44L86j38l34O32n20j14P46o44j36N57m94J47K19l50L73
3925A17j96j08M68m63J6N78n99J8N64n02J36K06m40K48J0j89L53m65J26N92r40
3946d70L91K45n66L70K38m42K71M9j67L90n42K07L30o71M07L50q28M88K22n52
3966b80M32j30j67L14l57J48M00o91N16J51p06M73J13m77M98j69j66K49l86K18
3986a7J55n45O32j0o92N45J26n03N94k33j44K82l94K67K30o12N60r8l92M71q0
4007A42m89O20k54j46K65l35K19J98o34M93J02m52M80j16l37M28m41J85L93o02
4027b81L07K28o00N02l6n02N15p3k45L98k90J31K14n63M23J02o19N46Ln80N86
4048A66n8k64K06l34L13K70o40N20J8o81P52k23l32M28k07J7J99m77M55J18o39
$$ plain form
3904 -221 -214 336 -154 62 131 -213 173 35 -299 333 -187 -301 445 -199 -335 222 -272 -125 94 -256 117
3925 117 -79 -187 281 -182 -166 412 -187 -169 395 -107 29 235 -205 43 53 -136 217 -248 -122 470 -470
3946 -470 -79 166 -400 -30 208 -234 37 86 -81 309 -233 -26 304 -367 40 390 -438 50 272 -280
3966 -280 152 22 -145 169 -188 -40 360 -331 185 336 -370 103 216 -261 237 68 -98 151 -235 -17
3986 -17 138 -407 225 215 -477 68 194 -309 285 52 -92 190 -204 63 293 -319 241 143 -249 222 142
4007 142 -347 273 19 -127 138 -197 22 220 -414 79 181 -271 209 93 -244 184 -257 -72 321 -281
4027 -281 26 254 -346 156 120 -382 133 60 -185 213 -77 54 268 -295 128 230 -389 157 160 -420 166
4048 166 108 -156 50 -284 29 299 -341 179 197 -484 268 45 -287 141 -66 -49 150 -327 128 246 -393
4069c93P49j32o09N17n7l19M29k31J6J37m17M59Q1o49P37Qo99N25M9n28M58l04
4091a73K65Q0n40N47Jq47R55n4o69O78j09l80K97r0J06R2l75N15j03o70P07O3
4113B96q15P31m5l08J64k14K60n8l66N72q1o95P80m5o57P17o8l18J82j56K13r8
4135im53P56r0p40Q36j49n49O36k52Q5M8l04K90On20O64j32o86J009k88l82M88
4157B64j69M2ol00L92r6m85O77k55o27Q75l32j82K58j9j9K7k69M83j47n69O99
4179B42k48m61P32k71j45L45k46J89k5l53M99j98m38O93k45n05O78j26k52K03
4199F8p0Q5L5l27M11k16m19P95l27l46N95k81q8J08k67M20j30m25P46k62n24P44
4221C25k61l82N34j98l2J95k97K34p1l55O54l22n29P86l60l02O21k97LJ20k22
$$ plain form
4069 -393 356 224 -385 132 75 -244 185 -46 -30 107 -310 149 230 -419 318 326 -373 152 201 -327 131 -173
4091 -173 92 172 -368 179 180 -667 288 234 -435 243 134 -246 51 -39 67 159 -216 299 196 -474 233 296
4113 296 -519 212 167 -141 23 -191 69 11 -355 217 136 -559 221 176 -481 236 168 -150 32 -124 89 -9
4135 -9 -462 294 204 -536 300 151 -398 238 -14 71 119 -185 105 111 -409 255 123 -563 446 158 -224 264
4157 264 95 137 131 -169 223 127 -358 319 64 -563 312 -20 -202 56 37 18 45 -224 259 112 -457 242
4179 242 -6 -467 265 -6 -151 194 -52 137 112 -241 258 60 -378 315 70 -435 243 117 -135 68
4199 68 -2 83 118 -209 202 -14 -433 362 35 -311 284 3 -85 23 -244 176 46 -379 367 105 -419 325
4221 325 64 -318 216 18 -14 181 -116 118 47 -308 346 24 -505 281 -79 -381 240 -57 -54 66 -156
4242a56K97j59k90O26j93n04P82l87l00M15l77J46J06j73L62l85j16P21o25j86
4262c96Q17m36k14N46m04J85Pk73L92p7l95N91n16j30O78n34N9L93m33K16O2l66
4284b28M59k54k40O11m56r7M01l08q7N14l58J16k3l98N30k56j69N05l13j58M43
4305B34m01J29K18m12M06O2n31N00j57j94M59k82j97M45l49m7L32m73M70l7m44
4326b69M57j36l31N46k68j08L08l97K60J35m83L91m7l85O00k69k02M14k72J5K24
4347A83k35J72j2l86N09j38l31M99l24j23N74m67P7K44l59J86M1k90M22k76l05
4368c39N78m14k6M54m52J98J35k70K47k4l31L92k71j0M80l75o5M05m58J50K51
4389B55n07L93j43j78M40l22j15M40m33R7L42m13K85R0m78K73R5k91L71l47R9
$$ plain form
4242 -156 141 -18 -308 318 125 -379 403 16 -284 131 -246 -100 6 -167 195 -190 -306 415 -210 -396
4262 -396 421 -15 -229 317 -87 98 105 -168 224 147 -248 343 -173 -303 375 -159 -100 293 -140 76 138 -228
4284 -228 231 -23 -263 348 -108 -205 196 -112 -199 315 -43 73 50 -348 182 -74 -243 262 -51 -209 234
4305 234 -167 -38 180 -232 174 236 -295 205 48 -146 313 31 -166 279 -70 -117 215 -258 212 175 -269
4326 -269 188 52 -279 267 -1 -109 199 -198 62 197 -286 105 58 -327 273 4 -198 216 -56 -41 183
4347 183 -52 120 108 -278 231 93 -238 261 -63 -186 388 -79 -2 242 -117 69 110 -180 242 -34 -339
4368 -339 239 -175 -201 253 -199 -1 134 -136 111 87 -244 148 -123 -133 347 -28 -93 312 -146 4 255
4389 255 -252 141 -2 -180 260 -62 -177 263 -170 -73 269 -144 141 231 -247 26 121 -170 201 -146 -47
4410d7L20m68J69J49l71K03J53l78L89j12l66N70k00q8L60l80K19J49n72M65j2
4431A52l82L46j98m8K83k21J2K53l63J94J48m39M84j70k81M93k90j61N22m32R6
4452bK19n32L78J64m20L57k27j46M35k87j15M06m06J43K36l09J43K7k48L08j11
4473A3j29L45l54J6L43l89J40K44l76J16J45k84M20k49k43N64m54qL89m98J28
4494a21M40m67J73R1l87M96k97L1K67l71L3L53m40J21K59m13L89k6j70K47j77
4515C1j41K74l39K49K39m66J27J94m43L98p0j68K43k18M8L37n67L54O4l52K59
4536E3J87m31K15O2j83L06m64K67K11l98J76K24l44O6K43l92K75m0j96K81k30
4557a12J82K51m94K68K23n67K56J59l34K54j18r5K38l58J65K70m18K77J74m44
$$ plain form
4410 -47 273 -195 -26 123 -248 -45 108 -270 119 7 -359 211 11 -77 283 -97 122 271 -301 164 152
4431 152 -230 116 -82 -130 153 -68 -56 197 -166 28 176 -263 221 51 -230 263 -27 -188 334 -98 -2
4452 -2 217 -315 63 227 -193 164 -63 -209 226 -61 -176 230 -176 -33 203 -106 37 64 -184 124 13
4473 13 -116 229 -125 -109 234 -155 -15 229 -147 -31 114 -170 250 1 -242 322 -132 -140 249 -249 -121
4494 -121 319 -148 25 116 -271 225 -72 -41 226 -145 -112 241 -199 -78 181 -232 157 131 -39 208 31
4515 31 -110 164 -175 74 313 -153 -26 168 -275 123 53 -115 128 -90 -42 295 -272 82 146 -206 53
4536 53 240 -191 24 86 -97 209 -255 12 223 -175 1 225 -119 -53 190 -202 73 33 -163 118 -112
4557 -112 70 321 -173 95 318 -249 7 166 -168 86 -32 -127 111 -247 -82 188 -230 47 221 -223
4577b23L58n0j89K52n3j76J94l57K61J74m88K42L58n74L64n4j47K68k62N2J70
4598A20l93K97K78o52M05K51m24K00Rk94K86k99J66J99l25K11L32p03L01K70l64
4619a29J63j26l3L37m58J27M38n30K13K26m25J73K93m37J93K9mJ49m20K14O9l49
4641b87L52J43m49K31K22m05K30q3k4K13k58K70M7m80L89J78o20N45p0j86m5m1
4663a28J08R8k78L28J87n80M64M4n49L83R5k43L25k73QN8k71J99K87m71L46R5
4685B32n56L80p6q3K94j36o3J13k77M00j44l47M38L0l22J52p3j26K26p0m9L06
4707B49m85L45n2l81N03r9l31M34j81j29J80k33K43J76m99K96P8m51L31M3j93
4728a56K23p6q3L14n01L90J14n22M13mk08K83j42j43J75j69JK48m42L82K6n26
$$ plain form
4577 -223 135 85 -104 148 95 -81 113 -244 17 191 -297 -55 303 -271 93 39 -108 160 -102 -50 120
4598 120 -273 24 302 -350 55 306 -118 82 91 -203 83 -216 -50 149 -176 35 367 -336 -35 235 -129
4619 -129 34 -92 -125 212 -246 -119 319 -211 2 228 -197 -24 269 -168 25 54 50 199 -221 -7 62 -287
4641 -287 65 208 -241 -10 212 -193 37 -46 -70 143 -115 155 202 -278 111 289 -331 214 144 -42 -87 -128
4663 -128 -20 78 -200 128 315 -265 199 243 -306 77 172 -71 254 -19 -11 47 -224 -25 262 -209 137 232
4685 232 -324 56 -20 -103 191 55 -8 105 -172 228 84 -263 175 205 -117 35 -38 -164 62 -8 -57 249
4707 249 -236 109 57 -324 179 80 -251 183 2 -127 53 -180 63 239 -260 36 114 -337 -6 37 -156
4728 -156 67 -9 -92 222 -279 111 225 -297 116 112 -96 187 45 -98 77 -92 -91 157 -285 97 123 -403
4750d03M99j8m00L68L0k18J17k47L48O8l76M11P6m97L15J3l47L53j7j96R8r5K5
4773i3K34m36N14j17l55M23j31l51N26j48j43J40j58J59K9m29M16J5l82M55j9
4794A49l26K79j60m5K77k34J16o5k85L69r5j84L48r6j27K04j22j05K40j50J14
4815A02j16r5K57j92p7L04k69q0L08k27k3L90l87J01J23l27L54j49j34L33l91
4836a95J06L43m68K79J34l34J34N8j74K06k6j74K17j66J19J94m05J31R5j98J33
4857IN0k34K63r0q0J75k53J50J22k20R3J85l28J65R6j80K51j98J6J55k14KJ39
4880G4k77L03q0k56L22pk75L16j73p3K93j62LJ56l39K89m9k82K68j25j67L49j44
4903c6k27L40k48R8K03m24N29k42j73K74j43o4L21k14m1Q9p6j9J64j40K39k41
$$ plain form
4750 -403 96 78 -322 46 76 -142 -25 -272 76 144 -232 179 255 -242 73 86 -261 92 75 -121 -23 -118 -93
4773 -93 141 -295 219 102 -253 170 39 -312 214 66 -77 63 -95 64 93 -336 80 95 -287 168 149
4794 149 -177 102 -58 -103 174 -60 56 -9 -294 75 -20 -204 144 48 -79 125 3 -102 138 -12 102
4815 102 -14 -109 148 -44 -121 183 -86 -166 142 -85 -108 282 -105 -4 119 -208 146 -3 -137 196 -195
4836 -195 -89 254 -214 65 199 -135 -1 57 -117 89 63 -111 106 -60 59 253 -152 -21 74 -124 9
4857 9 59 -175 88 -2 -82 93 -160 -10 112 -108 -15 170 -158 7 103 -77 174 -24 -8 147 -67 -65 74
4880 74 -203 100 20 -236 86 79 -196 120 -53 -126 167 5 8 164 -175 114 65 -217 51 -74 -241 108 -36
4903 -36 -263 77 -171 -73 130 -294 235 -7 -180 94 -49 -113 208 -6 -47 42 -34 -53 111 -29 210 -31
4925c1j30K66j13n0K61k73J57K0j39O9O8k23K22j29j75L65k75J5L61k39j4J70
4947A83k67J81q3o3J20q2j47L02l11N0L39m26J42J52r8J75j44j39K66k05q9K51
4969A07j40J0L34l82J15K1j17J46o3q4K59k64l9K13k67P2J82k61J66J38k53K02
4991I5m4j99J93p3j28L43k72J38K6k51K14M8k35K20J7j62K05k14O0J29j83q1K42
5014H8l15K78J9l03L04l3k29L95j60j20K88k00o3K20m7j10P6k46K90k65N4K86
5036B07k43p9K78k68J36N5k80L22j07j60L40k79j06M56m19R7K33l41K11P5j61
5057c3J62k14rK80k09j67L68k97k1K40j98J08Q6j09L1J9n3K46k76j8L36l13p8
5080a19K82k20Q8M7j54J60j45J8J66j91J01K11l41J09K18k77m4J02kJ37k81O4
$$ plain form
4925 -31 -161 105 -8 -58 203 -70 87 107 -32 37 105 -118 104 -25 -200 165 -110 -95 266 27 13 183
4947 183 -84 97 14 -49 71 -11 -158 144 -167 -117 222 -204 -62 90 -8 167 23 -116 150 -55 -144 107
4969 107 -33 -23 311 -71 44 65 -52 94 31 -53 206 -58 -97 116 -151 -79 103 -158 8 146 -107 95
4991 95 51 -148 45 -28 -156 187 -85 53 79 -172 42 90 -145 75 92 -70 135 -79 -19 110 -73 -154 88
5014 88 -227 51 70 -233 71 38 -191 204 44 -76 212 12 -51 169 122 12 88 -158 132 -133 -79 207
5036 207 -36 -115 163 -105 31 86 -194 128 21 -139 201 -78 -184 272 -147 -50 183 -158 53 128 -33
5057 -33 129 -85 -94 186 -23 -190 178 -119 -140 100 -98 10 96 -13 18 37 -16 230 -46 -64 272 -41 -119
5080 -119 163 -57 31 78 -76 84 -61 -43 123 -68 33 244 -97 12 230 -47 -91 11 9 146 -135 -71
5102g1J91l57K22K93l89R3J9r4O5o4RJ61k25J06J64l08J00K46l44J35K05k66M4
5125f5L2q2J57j58K2L69m25L6L51l21J09J4p4J11o4j36L14m52K92K06m39J34K30
5148A61k52lQ8q9K81k44O9K59l84O3K53m13J50K33j74j8R2n8k6j15N4L40m37R2
5172g8L16l96J06K04k42j9J84j20J93l45R9L54l88K31J00l29n0L06k34J35J10
5193A37j10P0k89J94J63m21K05K96n54L16K46l98R6k0R9J96l86K29R4l78K82J42
5215B09m17K92j4j90N2O6n4K57k82J26J26m15K32J18l34K35P4j53R9j01O9mj45
5238a54K28N4l25J57K19m03K48L7j99K03j22R9J03l15K40J34m51L59l7k39K33
5259F9j25p1J88j51J96K8l17O8K38l34J68J65k60K96j11n9J57l12J43K16l46J46
$$ plain form
5102 -71 120 -237 -15 278 -111 -18 1 -93 -28 -92 -83 78 -147 -41 123 -185 -85 161 -183 -48 157 -109 -65
5125 -65 -33 -115 42 -116 -94 275 -150 -114 237 -84 25 39 -35 76 12 -124 190 -262 30 236 -203 -69 161
5148 161 -91 -94 -6 -95 186 -58 11 270 -114 -51 202 -211 -61 172 -2 -20 72 14 -12 -127 -73 267 -170 -78
5172 -78 238 -158 -52 152 -90 -109 75 -45 148 -197 -98 256 -132 99 199 -130 -180 126 -108 27 137
5193 137 27 97 -192 2 165 -256 -51 245 -309 7 253 -145 -49 -69 30 226 -160 69 163 -215 67 209
5215 209 -208 84 70 -120 -68 -2 -56 201 -81 45 171 -244 -12 106 -228 7 81 -72 27 -74 -5 -9 -154
5238 -154 74 128 -197 -40 179 -224 24 61 -138 65 -57 42 145 -170 70 204 -247 112 75 -164 69
5259 69 -56 -127 61 -90 106 134 -183 -115 123 -211 -43 122 -138 158 47 -12 145 -167 -24 192 -154 -8
5281hJ45l59L15o9k9R2k07P0J17j97J55J80m46L98q5k75J74QK0l7q9N8K06l61
5305b24K50K38n38L54O2l75K18J23q7N8q6J61M5m22K25J16j96J08Nj08J11o7j31
5328a60P5n6J47J10m09M47J0l57J67J62j39P2K6j30J1O2l1m7p3K20M2l12K47j01
5352a7k45K81rj18M6nP4J67l20J98L6l04M30k05j18K19j55j2Q5q8J37Q0j55P5
5376G7m9k59L24j22l6J60j26K5J58k24j3J22j78K70o4l28L05q4j04K59j83M3K36
5399B09l76J54L4j69L28k76n1L14k05J7J38j98J03J24k23R0J65l10K80k22kJ90
5421A14j87J25J27k94J57R2j95J35p5j62K81r2r5K00j50J39L6l14K03P6k00J62
5443H3O3q4J15l63J32J63k16R2L2l8j0K15m09K99O2l25K86j36k6K01k64Q3J78
$$ plain form
5281 -8 137 -222 93 24 -5 87 -120 -50 67 -130 25 205 -241 157 72 -203 -29 -21 -1 -38 -127 -69 137 -224
5305 -224 26 264 -274 80 142 -233 -15 108 21 79 -7 154 199 -223 2 118 -78 30 35 -73 38 -29 -160
5328 -160 -85 -141 6 116 -293 154 164 -193 -26 136 -3 69 95 -35 -24 38 7 -40 -113 107 149 -163 84 -17
5352 -17 -262 19 10 -108 -62 -67 7 174 -146 52 88 -216 214 9 -109 110 -45 -57 28 -60 77 157 2 77
5376 77 28 -231 93 -29 -65 95 -31 -6 152 -72 -85 37 -141 129 65 -263 42 -42 -146 113 -70 -27 209
5399 209 -167 -13 21 -148 180 -96 -147 167 -38 -21 117 -81 22 146 -77 13 178 -132 148 -74 -76 114
5421 114 -73 52 179 -115 42 134 -61 74 -1 -163 118 26 -69 131 -19 120 156 -158 45 121 -79 83
5443 83 146 62 177 -186 -54 109 -107 -15 17 -21 -31 184 -225 74 136 -189 97 -39 -65 136 -128 -45 133
5466A33k64K30J2l56K22L5j1J28k37r8K73j39J22L0k09J93L3k50K31J9j11K07
5488A93k27o7K29l20J56J26k97L62k02j23L46j36n2K25k57%O9n1N6J8j30J03o6
5511d5m9K66j91j02K22k05J11J03k22J49l9j05L26j90j43K69k15j7K94k22j4Q5
5533F6j76J38m6n4J21j39r4K85j65m8J99j96J10p5n9J75k6p7J71k19JL30j75p2
5557b5K03k92J46K4k68K08o4r1L30j27j68K88k01J7J07j86J35o2pJ76j11j22K32
5580A42k26k4L91k61j7J21j37Q3k6n1J69j64j09K87j15p8J31k32R0P0j14J90m1
5603G9q3J29j44OK54m20O9L26l25K8R7pJ29j89m3K87k88o5M05l58k5K47j78n6
5627a25R7P6m6j3o4K47l25k5M11m04M6L19j45j00L8l7J22k19J19J54k89R4L75
$$ plain form
5466 133 -131 99 111 -245 -23 12 1 129 -108 -206 67 -72 50 80 -129 64 97 -153 78 97 -14 193
5488 193 -34 -101 128 -192 -36 90 -207 155 -47 -170 176 40 -12 213 -44 -44 25 -26 30 48 -82 21 -45
5511 -45 -94 172 -19 -121 101 -104 7 110 -112 37 -2 -107 219 29 -114 155 -60 -77 217 -5 -19 66
5533 66 -110 28 -18 -72 49 -90 -184 101 -64 -112 87 -109 1 -74 -133 42 16 -61 110 -109 -108 222 47 -25
5557 -25 178 -114 32 56 -212 -4 -68 -159 171 44 -124 164 -37 -20 87 -99 36 -26 -33 143 32 -90 142
5580 142 -84 -108 283 22 5 126 -11 72 46 -5 164 0 -109 178 63 -15 116 -116 -26 44 -70 120 79
5603 79 -4 125 -19 -13 241 -179 -110 216 -109 -81 16 9 138 -51 -94 193 -95 -160 245 -113 -138 109 -69 -125
5627 -125 -28 48 2 -11 -75 172 -153 -178 233 -171 -125 194 49 -51 -13 -50 72 -147 -28 126 -163 -69 306
5650C06m13j4K87q4j24k8O9J81k98Q2L27n28P8N17m81p1L80j85l2Q8j02J40k16
5673a21J60J32k61l9L87l69P1J30j98J29J24j75N7q6l3K54k56%K79l09N4J42j45
5696g3N6J1KJ65k57J05K46m39J04K21k23l9K18j34P8r9J4M9k15Q9L10m29J45K29
5720A34l41J73N6J20j12o7P2J52m41J87L53m73J59K26k87O0K1J6J44k02O1J78
5742A89l35Q8J33j04P7J82l00J32r9KJ1l5Q1K34l10Q3R3k26O5K03j76L3J11j48
5766a6J34k77J81J89l73J80K61m37K07J7o2L7N7q2J1j82J69J67m54L59J60l19
5788g3OJ29k12J02K7O6K9j57l7J16k55L34N4k31J45L9j86J26N9J1P5k25P2P3l32
5813b45J23J87k63K32J47j98L7q7N5J92l51J43J27j92J52J0j52O0k5J16M9j94
$$ plain form
5650 306 -107 -121 166 82 -42 -70 -1 180 -118 -36 291 -237 -159 358 -123 -194 186 1 -31 57 -45 95 -121
5673 -121 39 171 -90 -129 258 -111 -40 90 -108 21 145 -30 27 -59 -92 162 -94 -94 185 -124 -70 72 -73
5696 -73 -17 -6 -4 161 -96 9 255 -184 -80 141 -82 -121 97 -37 41 -58 -44 5 -210 -121 189 -240 -95 134
5720 134 -207 -34 22 142 30 -37 35 187 -254 -67 286 -187 -28 198 -89 -29 -8 8 152 -50 11 189
5742 189 -146 -58 75 -29 48 230 -70 62 -37 -35 -24 -59 22 256 -54 29 122 -104 -39 164 -12 21 132 -16
5766 -16 118 -159 22 211 -162 18 279 -158 49 66 4 41 98 16 27 -155 14 181 -273 86 246 -73
5788 -73 -67 62 -150 -48 -21 45 74 -83 -120 -4 -259 75 129 -102 43 82 -104 22 81 92 167 -58 14 87 -245
5813 -245 -122 65 -198 34 181 -17 20 -67 -12 180 -171 -28 99 -93 59 69 -83 -23 -48 68 117 -77
5835g7J21J15k80K03k6j50K50o2j77J47J8r6P6j49L5J28j17J69j1k55J74Q2j91
5858g3Q1ppL4j87J71J10k14O2N9j87K48R4j97J14k57K8K19k15J31J63l01K07K3
5882I9k83J16J56m5L5j14j5R5j31J98Kk65J91o3oJ41p3j1J19k38J94Q1l68J16
5906f9K62l32J99O3l06K76p3j64J28No1J42k77K37J34m03L38j71k2K36k25j10
5928a93L65k00O8J7j23P6l7o0J65n1k33L97j62p9P3q4J58n8l3Q8j8j49Q3N1j62
5953a01J91j71lK63l09J54%q8N7J07j87J96j64k7J65o6l0MRL1P3j72J14O5j49
5978c8J69j87n3K58j96R5N4j99J67K2j24Q6Kj18K53k22k7J87j66R7m6QK5P2l01
6003a82L42p8j22J04j09j6J60k07J46J6k27K73j01m2J59j25r2J52r9n5K61k34
$$ plain form
5835 -77 44 159 -121 82 56 -94 156 94 -83 64 82 -14 62 -87 -52 76 -41 128 117 -138 36 118 -73
5858 -73 8 1 -6 28 -159 12 122 -92 -30 29 -158 90 184 -13 101 -156 -128 91 -124 7 170 -131 76 99
5882 99 -184 -68 88 43 78 -36 -51 44 -87 111 113 -152 39 -24 -30 111 38 27 146 -92 102 183 -185 -69
5906 -69 193 -139 60 123 -183 93 20 -144 -16 -11 -72 70 -207 30 164 -239 99 -72 -94 142 -83 -193
5928 -193 172 -28 40 57 -66 10 -27 -87 78 27 -206 191 29 -50 23 -61 97 39 6 94 76 -73 10 61 -101
5953 -101 90 -81 -84 179 -130 24 24 -64 -7 100 -87 109 -55 -82 83 17 -13 -9 0 31 104 -68 46 111 -38
5978 -38 131 -56 -109 149 -47 48 102 -97 70 92 -32 54 56 -62 191 -31 -58 129 -37 60 14 22 47 119 -182
6003 -182 160 82 -40 64 -45 -61 99 -108 38 54 -173 100 -1 -43 116 -9 -101 51 -48 -103 158 -76
6025g6J00P7j88J53n2j81L44q5j65K64k12J17j48k2J67n9Kj9%j33K28p8r1J44
6049H7q2k7J10j15kM6j50J36J37k08O3L6j88K36j13pO7j33J67n5j14J76lk20L29
6074A73j81q1L14k38J16j21J3j5J7j2L23k34k47L43k36j45K49m5j54J93o9R8l0
6097C1k18L57k19j34M03k35n7J22j29J28n0M8m7l0oJ97j25k66L52j94n4J81K4
6120G9ko9l5J22k04n2M19k39k59L20Lj93O2J0Q5m5m2J38k28JK99k33j30K03Ln5
6146d2J31j59mR7n8K38k97j08L63k32j04K18p7O3l7M8K2o6q2L57l51j13M11l05
6170h7p6K21l5j47K03m2N6j72m7K66j52j38L23k71Q1N6o0q0R1nJ99k39k6L33l74
6195a22L0L04k00k29L02p8J0m8J32J15l44L3L06m11J23K95k97j33K48J3j04Q3
$$ plain form
6025 -76 24 101 -87 66 14 -167 177 92 -73 191 -21 96 -52 -74 93 34 36 17 17 -116 112 34 -57 87
6049 87 5 -22 88 -27 -29 17 -133 3 140 -68 -5 31 -157 79 -34 -41 26 -107 60 5 -109 67 64 -156 173
6074 173 -8 -89 225 -13 103 -18 -5 -20 -3 -15 308 74 -173 170 -66 -211 38 -7 -161 32 -37 61 31
6097 31 -187 170 -49 -183 220 -15 -72 50 -79 49 -1 47 0 -30 -36 161 36 -230 122 -72 -126 55 79
6120 79 77 8 -27 95 -109 -161 258 19 -240 80 83 -110 -48 -38 47 2 -40 98 -130 -129 170 -63 -193 10 13 -42
6146 -42 89 -70 -74 23 -35 203 -94 -202 161 -71 -175 43 -34 29 -8 40 62 -4 -86 271 -80 -193 218 -87
6170 -87 -163 58 23 -124 79 37 93 -79 -126 140 -12 -150 173 -98 -17 39 -21 -101 -10 -15 184 -55 -81 252 -122
6195 -122 -92 212 12 -217 85 7 17 -31 101 216 -128 -95 211 -200 -77 218 -79 -212 36 49 -55 28
6217B8kR1k96J45M08n31m4M45m49J03K49j57r3n1R7J83k53M7L23m19J24K66k54
6240d0j32L09j06l0l6O9J08j79n1L68m75R0K91k21K3O6m4M0q3J1K13l20Q2J85
6264A38j97l3J76q1q7Q7q4J43j98N4K33k95J21J43k70J32M7q6QN4k2J34j44QK78
6289B59m76J40K31k23J23N0j73Q5o3J40k5k31K46M7j60J3K29l84K28j1j36J73
6311H2k30O2J52j72O4Q0j27K3K13l14J02Q6JK4m1q0K10k44O7K85m47J86Q0k57
6335a95K54J09k26J14r3L1J4j03KK44k74L4K72k45J24O6k41R0P1j3L3j93J67P7
6359A19k29R4J59k66J49r3Q0J07j88J38M6l34K26J59k32K02rj91J75j43P8J33
6381A80l20J16K07l02J67O9k09J48J6p3J03r9q3K68k47NJ23j24O4M1j26O4P2j06
$$ plain form
6217 28 26 117 -179 -34 374 -157 -201 244 -205 -102 147 -10 -103 -154 -57 126 -127 -80 243 -176 -52 214 -40
6240 -40 -172 137 31 1 -35 34 142 -37 -88 280 -195 -105 186 -35 -12 54 10 50 -33 -22 191 -129 -47 138
6264 138 -59 -92 84 3 -84 3 -81 62 -136 -82 151 -144 -23 120 -150 -18 29 -57 -49 5 -17 117 -27 -19 259
6289 259 -217 -77 154 -69 54 104 -69 16 -47 93 68 -163 83 130 -30 -17 212 -172 56 45 -91 82
6311 82 -148 -86 66 -106 -42 38 -89 -66 147 -167 -65 21 22 46 5 -75 135 -109 -42 243 -204 -18 62 -195
6335 -195 59 168 -58 56 -37 -6 8 -95 -93 151 -123 -89 183 -62 62 128 -113 -23 48 35 68 -125 42 119
6359 119 -110 -16 143 -123 26 -67 13 120 -68 70 116 -218 8 167 -65 137 128 -63 112 -31 47 180
6381 180 -140 -24 183 -119 48 117 -92 56 72 -1 102 3 -80 188 -59 -54 69 -55 9 50 -76 -12 60 -46
6405d6J91m1j69J56j19RR4j36J68K0k53K52j30n8K24j72m5J38j84Q4J65l31J18
6428f5J38k08Q6J2o4Q3K6j45K22q4J7J32k80J87j19oJ17q6j5J80k13R6Q4j58Q
6453e5K34k60N5j0L5J04k9j67J02j33L3K62k40k2J08q7M4J46l11J35J2j01K45
6476A00j39J12M5k40K29n4j76J72O7k03J29l1j52L27j92N2l2k14K36p0L8J33k17
6499h0K2J76k45J95%j08J70m9k03K18j08k01K73k2j28J38j27J36M4k43K87j21
6521B4j74J72R4k19J65k0j39J04p2L7J38j99K4R4m5O3n6k32L62j37j12J94k5l
6545C8k8n6P4p3j05L45q6k24K64j51o9K71k37kJ48k94J94Kj35J76L7j93J98m2
6569E2r5J93k38J42P1k77K52j2k99L19p4j42J90j3j24J19r9J6M6j76K55j03j23
$$ plain form
6405 -46 145 104 -65 91 -28 -19 75 -61 107 127 -126 126 -4 -62 162 -10 -55 83 -101 -17 148 -183 -65
6428 -65 73 -135 -49 -37 -101 -18 8 -137 85 1 18 150 -130 57 -62 -68 49 -37 -52 128 -85 11 95 -63 -55
6453 -55 179 -81 -26 -36 -1 103 74 -93 9 -124 -91 171 -69 -91 17 -70 -26 120 -191 -56 -44 -145 100
6476 100 -39 73 118 -122 107 53 -123 49 116 -87 42 11 -141 186 -6 46 14 -200 36 -34 4 137 -80
6499 -80 -58 118 -127 68 68 -40 130 81 -122 96 -12 -213 60 38 -90 48 -79 57 101 -142 145 24
6521 24 -150 22 116 -103 62 42 -97 7 -65 -28 110 -89 -65 29 -16 47 -9 -241 121 -16 -128 66 41 38
6545 38 10 -46 28 -45 -150 195 109 -115 149 -2 -71 200 -37 -39 109 -185 9 11 -124 52 89 -104 94 52
6569 52 -43 150 -88 54 125 -152 100 88 -211 108 34 -108 82 69 -55 64 -35 -19 27 -149 106 3 -120
6592a20K81j34j12K14j66K4M1qJ13p1k89L29j34k62L94j45r8J28k3O8j21k6K31
6615A14k7j51K85j75k67L45q5o9M9j64J64Qp0K75k95j64L90j95j91L71j84p0J79
6638G3m8l8J6o7K31j85l6J73j51q5R9J2j91K58Kj00l5l1J43k5j67M83l82j53K70
6663F6j15rJ93j13J13j62p4J85j97%K49k62nK28p5q2Q2k03K18j60J14O5j30j9
6687i3K27k05j64M21k05J12j21j41L20k82j6L48k04j01K89k97l5K09j15L2J27
6708A06k67K93j03j81M23l03j17K81m1k45K54p4j46L2K19j2q5j2J59j80q3K09
6730A27j27m0L3p5J03j05j7L78k16j90K72k25o1K94j85j17K25j32L13k88N1K12
6752B30l14NK91k38p0L36k33j4j8mO8j39M0K32k05M4K13k84NJ54j79j36K00R7
$$ plain form
6592 -120 161 27 -85 129 -37 -13 28 20 133 62 -227 102 -32 -294 100 -45 -143 -15 -38 30 -91 -117 114
6615 114 87 -64 221 46 -221 124 39 -30 19 -145 19 27 -43 232 -63 -227 163 -32 -223 148 -36 -106 73
6638 73 25 -13 3 -64 167 -18 -54 119 -32 -117 -18 -6 -197 61 63 -37 -72 -103 40 15 -152 331 -51 -204 66
6663 66 -49 -58 135 22 135 -27 -101 84 -113 -113 136 -126 -131 97 22 -60 22 -181 37 -123 -9 56 -74 -93
6687 -93 134 -71 -235 186 -19 93 -28 -169 151 -131 -147 201 -3 -104 185 -112 -147 62 -53 -21 106
6708 106 -161 132 29 -152 271 -32 -149 132 91 -154 100 26 -120 -88 131 119 34 22 181 1 -82 127
6730 127 0 -40 -7 -82 21 -84 -101 277 61 -129 143 -82 -143 151 -34 -151 74 -58 255 -33 18 230
6752 230 -84 -79 212 -26 -96 240 7 -7 -25 -29 39 -100 -60 172 -33 11 224 -60 -55 99 -80 -216 -16 81
6776H1m3k15J15K18k38M2J71k08mK21k63J54mj54J48o0P6J30k87JL34l37L8J26
6800D2j33Q7O9j39J39j81J53J09k76R7J61j56o4K23k17R8J03j54J32j27k0J78
6822A24k03j8K14j08j2R9k67J26q3O5J97k08O6N4l3L5j3j50M3N2o0O0O0j37L28
6847B31k33o7J83j58k4J73j58J07O1k11J88j10j19K78k04p4K22k13J78O8j62Q1
6869C7qj46J44n5J0M4k5m9K10k32oJ24q7J68j42p8J78r5p6K04k94K54j29p8J24
6894cO9r9N2L6k5R1j53j2J73j92n7K40l40J40J64q8R9j49n0K38j45M5Q6j44l6
6919f0J21j96J17J38j48M6J7J1J15k03k2J29j08Q1L2k55J49J10r9J81k16J26J01
6942A67k08O9R0k98J75N3j08O9r1P7R0j12r1K43j77J01l6j56N6J49j25J50p5j40
$$ plain form
6776 81 38 -177 -62 156 -82 -40 131 -77 -81 140 -123 31 27 -127 21 -39 37 167 -120 -119 215 -122 -84 42
6800 42 -91 -4 65 -74 65 -116 37 146 -130 -33 128 -28 -92 131 -86 12 115 -39 93 -34 -54 124
6822 124 -79 -97 117 9 -3 96 -171 -45 -128 -63 134 -74 -8 46 13 48 35 -115 -72 -20 -80 -20 40 -97 231
6847 231 -2 -69 114 -44 -68 105 -53 54 115 -96 92 -18 -137 141 -63 -137 85 -128 50 118 -44 37
6869 37 29 -117 27 -28 -18 26 1 -48 162 -70 -76 48 -39 129 -13 -91 87 -8 -84 120 -174 80 -49 -127 -3
6894 -3 66 -33 19 55 30 121 -32 -44 129 -63 -120 120 -220 -80 84 -4 95 -54 -104 134 -11 34 120 -24 -60
6919 -60 61 -135 -18 120 -28 18 35 46 161 -42 -64 65 -43 38 70 -185 -36 74 -25 156 -60 66 167
6942 167 -41 28 118 -180 -5 48 -60 9 -82 -5 85 -27 -118 125 -52 49 13 -143 -87 62 -63 87 12 -128
6966a28K68j48J6K0l7P6N5k60J60M6l00L22q3o2J90j41j1M0o1M3K8p5J24l0j21
6991f9J92r5j44K41j95R6J08p6j58K24l04K93q9k33L88k85K7Q8q9P0N1j81J70
7014C0P1j98K37k15R6M2pj64J72k08Q2Q4q9R4R3j26m2J13j64K66k38J8P3j48J94
7039F6J05k38N7P5j80J03J26j29P0j60K4K26k49L4J16o9J13jk76K45M9r9J4k9
7063gj23J97j38L5P9k27L15m0k24J40l5j8L0O4m5Ok01J05J99j34P3J2m1R4j93
7088g7L5J25j39K20j28k48L87j24k14K56o7l0P5p6q1K48j83J91o6j47K40j22j80
7111a05J59rk1J73k34pM2r4K57r8q4L4P5k28K50j21p6J52qo0l0r7K61n5j26O2
7137A2l9j23J77M0j93J64m1k0Q9j50J58l2j52J72j15o9K03j31QJ23j96J04pm9
$$ plain form
6966 -128 140 -8 8 28 -9 67 122 -138 22 68 -232 90 7 -55 135 -6 -17 23 -38 5 33 -42 82 52 -69
6991 -69 123 28 -116 125 -70 26 134 58 -100 124 -180 113 24 -209 179 -106 -79 9 -80 -10 41 -140 30
7014 30 101 -97 140 -75 21 63 56 -108 64 -144 -62 22 -67 27 120 -6 -48 65 -99 167 -71 -53 20 -128 66
7039 66 171 -67 -10 65 -115 -12 114 -15 55 -105 -81 145 -104 -70 46 -23 90 89 -187 58 107 8 22 -7
7063 -7 -130 67 -71 -36 43 -184 131 91 -133 7 -28 -46 -16 48 3 9 -192 -87 112 -22 51 63 22 116 -77
7088 -77 -42 83 -56 164 36 -212 175 51 -163 93 26 -4 71 -5 -86 162 -21 170 104 -43 197 75 -105
7111 -105 54 45 24 197 -37 -44 -2 -96 161 63 -21 13 88 -140 110 -11 -87 65 57 -3 -33 -130 131 76 -50 12
7137 12 -27 -150 27 67 -126 38 -3 -23 66 -84 74 42 -110 62 -53 -122 81 -50 -42 81 -115 -11 -18 -67
7161f7J70j01j84K43j11q0K30k60N2K30j51P4j7j7Q0m0k20K53n4j54J79l8n3J58
7185A22j86O2R5k70L51j04k30L40j52o3K54k04qj8M1J15q6k19K30m0j45K65j05
7208D5j73Q0k1j05J40p0J71j6j56K38j61o4K19j34j58K66l5o0k9j29J67k3j37
7231a45K69j35o9J05q1o0K03J0q6mj28J99j03j44L72j17k47L46j17k26J72m1O0
7254C3Kk04K47m9j13K58k05n8K60k04j32K52k13J21J04k27J85p7j20K47k23R5
7276b1J30j28r7J80j27J14j09J3J49j38j03J70j57kK69j20p6J10j55J91o1j8J30
7299A44j70o3J93j91O1J01k22M2J68o1M2j7j62J95j0n5J20j79M1N4P5n9L9j53
7323f7J98r1k24L12j39k7J77j23o3O6k72L22K2j60P3J2j05J86j61M7J94j70j62
$$ plain form
7161 -67 103 2 -182 61 -50 -130 100 -160 -108 122 -29 45 28 11 91 51 -169 84 30 -124 55 17 -36 122
7185 122 -64 -2 93 -177 174 70 -160 180 28 -35 219 15 7 -11 30 145 59 -160 70 30 -115 150 45
7208 45 -128 -48 -69 -174 -34 -104 67 51 -105 133 -28 -92 127 -7 -165 101 66 6 -23 -152 15 -8 -145
7231 -145 124 -11 -80 25 -56 -116 87 97 11 7 -121 78 -25 -169 203 86 -161 185 68 -158 14 -27 33
7254 33 35 -169 78 29 -84 174 -31 -89 171 -33 -165 87 -126 -5 99 -128 57 -20 -140 107 -116 -21
7276 -21 109 -19 -116 64 -63 51 -58 -45 104 -34 -137 33 -124 -126 143 23 -53 57 -98 93 32 14 144
7299 144 -26 -89 104 -87 -26 75 -147 -105 63 2 44 27 -135 60 50 -5 115 -64 -23 31 106 47 86 -67
7323 -67 131 40 -184 128 -11 -38 139 16 -47 19 -253 69 91 -69 4 16 -89 97 -64 -17 177 7 -155
7346a55J67l8NQ4j80J79n3j77L59j70j18P9l4M4O5j28R7j3q3K22j93o2J78q9j09
7371a23K13k07K19n3k2o1M6q6K79k90p6K86k07j07L56l21J82ok00L18n8j73J36
7394D5j19n3K69j95O5M9k03K61o2j99K07j29J8K04j58k0J34j81K9O1j10J07q4
7417f4q4K75k12QJ98j65k3K79l24kO2lJ57j11m6J82j27l6J22j26R5Q4l26J75J45
7442A33k66P4P8r0K51l29L5K61k33K4P4j92J93J37j25R1o1o9J05j31k7J98l33
7465b02J40N3j60J72j6j33K86k11L1K32j92o2J45j63P6Q3j80P0J90l09J87m5j03
7488a11J93j02k0Q1o9O8l9j06K04r8l1O3r7oJ89j42Q1j23P8L8O2j76K9J86k15
7513f3K9P9k3R1j75m3K62l22K22P1l14K97j41n4J90j05k0J31k66J22R4r3R7k8
$$ plain form
7346 -155 12 -26 -21 63 -117 62 9 -168 191 21 -97 -18 -52 -8 57 -71 26 13 -70 152 -41 -103 75 -14 -123
7371 -123 90 -117 102 49 27 -34 12 -74 205 -85 -161 125 -82 -189 167 -154 28 22 -178 140 82 -91 45
7394 45 -74 -127 142 -53 12 61 -142 119 57 -142 65 -64 -46 158 0 -20 114 -67 -38 23 -87 20 -64
7417 -64 -148 127 -85 -77 121 -44 -67 212 -112 -114 -52 -55 102 -9 -55 127 0 -36 86 -40 55 139 -187 -12 133
7442 133 -133 -59 19 -71 180 -149 -114 147 -86 -62 12 -180 13 150 25 116 55 -14 91 -40 -67 131 -202
7465 -202 -62 -9 -169 3 -13 -146 140 -71 -40 192 0 -62 83 -80 -4 79 -101 -31 159 -150 37 -8 -111
7488 -111 82 -20 -40 41 -28 40 1 -105 99 1 -30 33 -64 -70 119 -23 58 -65 13 51 113 -63 -34 152 -63
7513 -63 -34 45 22 113 -62 -105 157 -165 57 128 -186 111 -30 -84 106 1 -19 112 -154 -32 62 -31 66 38
7537C8j79J77N9j69J24r3l8K67k23O5m2p3O5P5k18M7R7m4J30j27lQk7R9M0j71
7563a16O2n3qK13L4j27K17k82KJ72j74J21j2n3M5j5l2O3r1J11j3k28J10J05j58
7588a07J46J2k07K54p4j75K20k00J05J75k71J14m2m1P3J39k58L84j79k27L07l53
7610b05J28K58l13K9J22j53J90r4k8J10j6j28K04k84J07K21j80O3M2k08J33J88
7632A86l96J60K7m1J15k15K07L7j53Q1Kj67K55m7j51K54k76L4K33l01K05J0k32
7655a73J54J08k41J07N1m1O4J9p3J15k46K21J26l33J98J08k63K38k34P0J66k48
7677a07R5Q6k44J47J95k90J60Mj20J09n0l6K33l55J68J10k16R5J32k32K28n5j29
7700g2R7J2m5J39j44K5J57j49J1m5j78K75j09j58L25q3j16Kl3J41mj43J58l6k29
$$ plain form
7537 38 -141 36 95 -74 50 -43 -81 186 -37 28 -14 -87 -22 53 -165 -118 -21 -65 65 -62 -65 -57 -84 15 55 -116
7563 -116 -54 -107 -115 98 132 5 222 -60 -58 114 -60 61 49 -4 41 26 -6 57 -34 77 64 -164 -54 51 -107
7588 -107 39 51 -156 98 24 -151 69 -131 -26 149 -122 -8 -50 -91 -18 121 -137 247 68 -159 148 -205
7610 -205 -77 181 -132 -103 19 -134 56 -38 -66 44 28 -100 104 -180 -73 148 -32 31 73 -135 -2 186
7632 186 -210 -50 -23 -64 51 -164 43 80 -73 8 10 -157 98 51 -100 154 -122 -88 145 -156 49 59 -173
7655 -173 -19 89 -152 -45 6 -35 29 48 -25 90 -156 65 191 -142 56 164 -99 139 -95 -25 141 -107
7677 -107 -12 74 -170 -23 172 -118 42 46 -74 35 -15 -51 182 -173 -5 105 -111 -16 116 -116 112 57 -72
7700 -72 25 37 -8 131 -13 12 169 20 31 -14 -192 83 -26 -184 141 58 -58 -56 -89 52 48 -95 63 27 -202
7725b02J51L6j16K82k20P4Q2j21N4J10k58J78Qp4K0j28N3K41k14N1J23j30K9P6
7749A05k48K77Pl32K16J2k6J84l98J10J36j75K30n2j75J40j9r5J88l8j55K94j03
7772H3j30R9j98J63K5j75K16m9j18K30j08j12K28k56J83L4k63J69qj04J06o4q8
7795a37J85j8j51J87j04Q2J5j15J59Pj71J39m1p7J70k54J14P9k42J45J07k45J76
7818A0Q9j57Q4j8l9J72j03j01K14k49M1P0q0J18J11k20K38k72J03J87k71Q6M7
7841F0j35J37o0n1J02l0j50K01j29J01R9k81P7J75k22Q4k3k09K26J11j72J99k38
7864a28J45J46k52N6J17j24P7J3j68J75q9p3K62k52R0J23l02K03J21j94J50n3
7886D3j24J63p6%O0j49n5J92j46J73O0k24mJ29j55J42o8q8L24l24K16j0p4P5p1
$$ plain form
7725 -202 -51 -15 -131 151 -69 5 87 -34 20 130 -128 50 58 -16 4 -124 -71 170 -44 7 130 0 29 105
7749 105 -143 134 141 -191 25 37 11 195 -203 -93 43 -132 98 46 -129 11 -8 -103 85 47 -108 186 83
7772 83 -47 52 -146 17 42 -133 83 34 -84 146 38 -74 154 -102 81 115 -148 21 13 -91 15 -49 -137
7795 -137 48 30 -121 66 -38 44 59 -56 103 110 -61 78 37 -40 130 -124 -10 69 -173 -28 79 -166 10
7818 10 99 -58 26 8 -31 141 38 -63 151 -98 -57 13 -67 51 162 -58 180 -92 11 198 -73 13 60
7841 60 -75 62 2 -49 53 23 -127 74 -55 46 145 -136 -59 116 -106 -22 -45 -254 -28 83 -89 110 -128
7864 -128 17 163 -89 -33 84 -40 37 50 -118 57 -32 -105 157 -95 -5 118 -184 19 140 -54 96 43
7886 43 -81 82 6 6 66 -83 -138 54 -92 81 141 -83 -87 42 -113 29 -39 -127 197 -127 89 79 5 80 9
7911Ir5J08P2j25J25j37L8J22q2l4J58k62J86n3j29J60p1r7J82j97J07J23k75
7934a67P3J59j12P1r8j39K31k6p7K23k13OJ84l02K49N0k09J46j33j9J93r9j9J50
7958A22k73K15K1k20J87J24k93J75L0k70K86m9k2N2r7K9J02k31J19J40k85J94
7980E6q3o6J78j25qJ49k03J33K00k51kP4r0J09r7Q2Q8j49j02K60j75MM1j14J84
8005I3j72m7K27j57J2J46l8j53J90j96R1K1k62L01o2%J61j67o3P2r7K4J66j3n7
8030B0Qj60K81j76j01K22m9r6J31j10j0J33k36J77k4j99K40n9j07K57r7o5J49
8053A29k77R1J16k73J42J36k12J81j23o9L04j53k3N6j60J48N2k18J44R4j59J20
8075D6j28L2K36k02m5J46j14RJ43k59J02k0p1J93l6oJ00j56m3J03o8N9J01l20
$$ plain form
7911 9 -86 22 94 -31 94 -43 -5 117 35 1 159 -103 83 30 -99 61 -10 -107 75 -122 -15 108 -167
7934 -167 -94 65 -47 24 -74 -213 18 -8 -85 138 -75 -69 115 -187 62 112 -97 49 -84 -103 90 -9 -28 122
7958 122 -151 64 85 -135 52 176 -117 58 88 -182 104 55 33 85 -12 17 119 -112 7 147 -138 56
7980 56 -27 -93 85 -40 -48 101 -102 31 231 -20 -22 52 -38 71 -26 56 144 -5 -107 153 -22 -18 23 -91 93
8005 93 -79 -126 101 -56 -44 102 64 -89 101 -95 -4 17 -245 56 -6 -6 155 -12 -75 -3 -100 -76 90 77 20
8030 20 28 -132 149 -27 -128 94 45 -51 80 -30 -40 93 -143 34 10 -189 51 -8 -115 142 45 -20 129
8053 129 -148 -57 59 -214 -72 64 -148 33 -90 -159 145 -8 -31 25 -135 13 65 -153 -9 85 -74 46
8075 46 -82 -50 186 -16 -61 85 -29 -20 123 -136 -34 -54 -125 68 32 26 126 -30 -73 30 -38 21 122 -198
8099a98K07K7j73J51p1M8J66k61J34L4k94K34O6j81J75l1j13J21j09L7N2o1JP3
8123C4j14Q3M9q2M0n4o9K59k17JJ34j31O4K5j11J39Oj84J73n0o8J52j65J4J97
8148A25j24n9L3L6K1P3j90J47m0r5J52p0m8J13k46J20j1N7P4j33m6J36q6k6K70
8173A83j89PJ03j22J26m9j63J40J2j07K23j52j49L83l00J03M1j40
$$ plain form
8099 -198 9 36 -137 14 -57 -9 157 -104 30 64 -230 4 70 -111 64 33 -80 41 -68 -31 21 -40 -39 34
8123 34 -80 3 52 -30 10 -44 -113 146 -71 -70 64 -67 -3 22 -89 50 56 -128 45 -5 -73 79 -86 -72 125
8148 125 1 -58 -25 11 32 105 -85 62 22 -73 79 9 -39 74 -172 -52 -63 -6 68 -65 -111 25 -61 -87 183
8173 183 -6 1 104 -18 108 59 -104 36 48 -59 164 12 -137 246 -54 49 90 -50
8191e0
$$ Imaginary data points
##PAGE= N=2
##DATA TABLE= (X++(I..I)), XYDATA
0@%%%%%%%%%%%Qj6J6j6K4l2L6m4N6o5P3q8J05j24J47j73J99k28K65l05L47l95
33b10M48n06N70o41P19q06R00j002J115j238J372j519J678j851K042k251K481
50A301k732L008l316L659m042M471m955N511o152O905p803Q890j0247J1987j4316
65g831J7615k2676L1505n1267J75593k7284k37695J89743m0050j20992Q0863J13449
77A00973j15631n5302J10876j8138j77877J26251J58688j60550n4967J57074o1079
88A0318j19258N1904O9787k6663N083Q5195m0757j53564Q9217J32343j13960k3875
100c4230J18583o0645r7794M1036M6752k8971j385Q5314j5181j10257P2108O0282
112G5612j41750j312J27229k5073m3692K3430j1705l3181Q837O2325o372p1132
$$ plain form
0 0 0 0 0 0 0 0 0 0 0 0 0 8 -8 8 -8 16 -16 20 -24 32 -33 40 -48 57 -67 80 -93 106 -122 143 -162 185 -210
33 -210 238 -268 302 -339 380 -426 474 -528 587 -651 721 -798 880 -971 1071 -1180 1301
50 1301 -1431 1577 -1739 1920 -2122 2349 -2606 2905 -3247 3658 -4145 4745 -5502 6485 -7831
65 -7831 9784 -12892 18613 -32654 142939 115655 -122040 67703 27653 -93339 -12476 100973
77 100973 -14658 -69960 40916 22778 -155099 -28848 129840 -30710 -85677 71397 10318
88 10318 -108940 -57036 12751 -13912 -8829 76366 35609 -117955 -28738 103605 -10355 -34230
100 -34230 84353 23708 -74086 -33050 13702 -15269 -16654 68660 53479 -56778 15330 75612
112 75612 -66138 -67450 59779 34706 -8986 14444 2739 -30442 -21605 40720 34348 -36784
124c6784M7231L0147r1310J6765P0267k8226j7396K614K505J5812j9110O133R003
137G651m2550L4856M2434o3645j8766L1546K241Q631j212J6149J6571m8125K830
150a1389L2077m1613J1941L5842m3818m169L6847O951r270l2872J1855L3976l6107
163i749N706L2124m9414l748M0993j8500q990J2477Q104k537k9536L2111L9796
176D8837n9810l426M5190m2763n589M1368k6247k4000J7099K6204k904l8367K3012
189a396K0511n9955K0801N4017m6111m346L7994k3285j0140J7739J0021j1798
201D052l0259L1564K7495m7413J5004L0752m8127L795L4382k1279r759M060N988
214B55J858k0123K4948J4144m9807J5815L3800l3000J0166K3368k3198j832O389
$$ plain form
124 -36784 10447 40594 -50716 -33951 36316 8090 -9306 -6692 -4187 11625 -7485 -1352 7651
137 7651 -34899 -43 42391 -21254 -40020 -8474 -6233 2398 1186 17335 33906 -14219 -11389
150 -11389 20688 -20925 -8984 26858 -16960 -21129 15718 22669 13399 -19473 -7618 26358 -9749
163 -9749 -4043 28081 -21333 -25081 15912 -2588 -11578 899 9003 6466 -23070 9041 48837
176 48837 -10973 -14399 30791 -11972 -17561 23807 -2440 -26440 -9341 16863 13959 -24408 -1396
189 -1396 19115 -40840 -20039 33978 -12133 -16479 21515 -1770 -11910 5829 15850 4052
201 4052 -26207 5357 32852 -14561 443 31195 -16932 -13137 21245 -34 -9793 -5733 255
214 255 2113 -18010 6938 21082 -28725 -12910 20890 -12110 -1944 21424 -1774 -3606 2783
227B783N296P47k5194J5445J5530l2265K1628K0461l8539O041J2761j6950J0085
240b171p9j586Q922j5999J6384J6841l0644R398J0568k5481J5517P479j4837J0169
254D481r397m04J5614j9195O340J2340k5521J3499J3351j9623J0227k908j1515
267a2711J6243p570K715J6496j9745P803J4875k1676Q209K736k0370J1864q05
280a936m713J7279j2756K50J5600j8973O395J0052k3066P836M106j3256J4384
293A202n886o857J5456j2504M821J7745j7949P682J0076j8585J1262J570j4828
306f795J2516p255l561J7116j3451K364J1459k0759O881O691j8867J1307L6j0801
320a3119J6155o020k632J4004j5186L867J1487j7592J0424O708j6111J3833M87
$$ plain form
227 2783 8079 8826 -16368 -923 14607 -17658 3970 24431 -14108 -8067 4694 -12256 -2171
240 -2171 -2250 -3836 5086 -10913 5471 22312 -8332 1066 11634 -13847 1670 9149 -5688 4481
254 4481 -4916 -5320 10294 -8901 -2561 9779 -15742 -2243 11108 -8515 1712 -1196 -12711
267 -12711 3532 -4038 -1323 15173 -4572 3231 18106 -3570 4639 7375 -12995 -1131 -1936
280 -1936 -6649 10630 -2126 -1876 13724 -5249 1146 11198 -11868 -4032 74 -13182 1202
293 1202 -4684 -11541 3915 -8589 -3768 13977 -3972 3710 13786 -4799 6463 8033 -6795
306 -6795 5721 -1534 -5095 12021 -1430 934 12393 -8366 -1485 5206 -13661 -2354 -2318 -13119
320 -13119 3036 -2984 -5616 8388 -6798 -2931 8556 -9036 1388 8096 -8015 5818 6305
333F305r742J3936p926k126J1939j4893N168P640j9848R471L319j7552J3133l26
347a502q635J3259o828J30R190j4722Q312O306j8542J4592N221j5106J6279J191
361I145r354J0449p366r2N009j4649R698J511j9553J7007K506j7930J5020k96
375A105r403J1403m259J717L030j2237J3444K70j7037J9724K67j8128J6476q7
389F285r583Q465o514j70J102r027J4729l431j6569K1452j41j5822J6420k910
403D286j0356Q709m511K836K325q187J2640n217j3332K1828k989j6250J3029n511
417g00n716R733q301J663K838p661J4495k234j2319J7470m095j1920J1959n772
431e60j895N472j3809O433P272r145J2658k575j3722J6111M37q574N411p581M265
$$ plain form
333 6305 -3437 10499 2573 447 12386 -2507 2661 10301 -9547 -76 3243 -14309 -1176 -1502
347 -1502 -10137 3122 -3706 -3576 5614 -9108 -796 5510 -13032 1560 6781 -8325 7954 9145
361 9145 -209 10240 2874 2782 7791 -6858 2840 4351 -15202 1805 4311 -13619 1401 1105
375 1105 -8298 3105 -1154 563 3593 -8644 4800 5070 -11967 7757 8024 -10104 6372 6285
389 6285 -3298 5167 -1347 -1517 -415 -9442 5287 1856 -14713 6739 6598 -9224 7196 4286
403 4286 -6070 2639 -1872 964 3289 -4898 7742 2525 -10807 11021 8032 -8218 4811 -700
417 -700 -6416 3317 -4984 -3321 -483 -8144 6351 4117 -8202 9268 5173 -6747 5212 -560
431 -560 -2455 3017 -10792 -4359 2913 -6232 6426 3851 -9871 6240 6677 -1897 3514 -4067 198
446A98M681j4759J1833O105j6027J2011J738j3401J2546J316r468n28k475J3268
460G038p03k0037J6705O685j8392J6185L903k0587P922P127o976m330R74J4896
474A0410j1030k0597K6096M879k4006J8143L959k3145J1420J2619j0513r619P327
487d057K0560j3549j7571K8479m042k7369K5075O747k5315J0544J0638j4996r091
500a3947J5097K1534k0786j7511L0364q323k6314K8147L112k7055J4720J4292
512A3330j6339j1590J4255J7075k2149q005L4827j4544k9891K5571J95k2740K0809
525H04J3004j9798j1216J5435J5628k0132m312L1716j5845k3100K6915k548k0476
538a3925J8432R368j2950m812J0121Q036k3258n648L1011r789j8084J9883q025
$$ plain form
446 198 4879 -9880 1953 8058 -7969 4042 5780 -7621 4925 6241 -3227 -3755 -6230 7038
460 7038 6335 -13702 3003 9688 -8704 7481 11384 -9203 -1281 5846 -1130 -5460 -4486 10410
474 10410 -620 -21217 4879 9758 -14248 3895 7854 -15291 -3871 8748 -1765 -11384 -4057
487 -4057 16503 2954 -14617 13862 9820 -17549 7526 14273 -11042 -498 10140 -4856 -13947
500 -13947 1150 22684 1898 -15613 14751 6428 -19886 8261 11373 -15682 -962 13330
512 13330 -3009 -14599 -344 16731 -5418 -13423 21404 6860 -23031 2540 2735 -20005 804
525 804 13808 -5990 -17206 -1771 13857 -6275 -10587 21129 5284 -17816 9099 6551 -13925
538 -13925 4507 13875 925 -3887 6234 14270 -8988 -14636 16375 6586 -11498 8385 360
551C60j7951J5815P485n821l578M368R180j7383n881K6873q836j6707J8469k242
565D151j1229Q533J47k737j873L767J3317j5825j2894K0830n130j2100J7332P99
579G088r773K2j685M994l440j983J5716j1417j3037K2122k091j6694J0195N091
593E108k974j800N7P286j1255o269K2278p558j4859K0528l742j9871J0066R662
607F657l365p020P54J0142j3610o180K3208j0797j5643K4897M56j8554P742O466
621E153o446p047P448J5085j6092q330K2223j2528j3941K5905j536k0387P894
634b599Q332n896q338P188J2647j7443l615K4782j4483j5021K3287l157j5519
647i835J2344P080q931j0152O569J2568j4257j037K1195j6053j2551K1478n112
$$ plain form
551 360 -17591 -1776 5709 -112 -3690 678 9858 -7525 -13406 13467 4631 -12076 6393 4151
565 4151 -7078 1455 1602 -1135 -3008 759 14076 -1749 -14643 6187 1057 -11043 6289 7088
579 7088 -2685 -2663 -4348 646 -2794 -4777 10939 -478 -13515 8607 6516 -10178 17 5108
593 5108 2134 334 391 7677 -3578 -9847 12431 4873 -9986 10542 6800 -13071 -3005 6657
607 6657 3292 -3728 -2974 7168 -6442 -12622 10586 -211 -15854 9043 9499 -9055 -1313 5153
621 5153 -1293 -8340 -892 14193 -1899 -10229 11994 -534 -14475 11430 9894 -10493 -2599
634 -2599 5733 -163 -8501 -1313 11334 -6109 -9724 15058 575 -14446 8841 5684 -9835
647 -9835 2509 9589 658 -9494 -2925 9643 -4614 -5651 15544 -509 -13060 8418 3306
660C306j3284J0066M169m820n174O219J0015j5931k945K0074j2362q309J8268
673I292p645j1151R692L746j812n587K500Q694j3735q53J8016j2801p813J5345
687E888o303o284Q152j79r86l986L377J0798j1203l321J3029j1621m344J3342
701F359n758l458M740j800K806l717q22Q804j0849l044J3469q254l958R023n852
716b311o03M008j560M296n435k285R990q483k289J1080r233l003Q494m699J952
731h1K237l440N583m363j858R099r034k991R656p204L98O761n852K116J5l837
747b795P069m921l591Q597p665j232R348o881j31M601n197M220K37l894O435n515
763a315k522Q621p077p34O974p307K167M680n245M597j434m860O960m497k341
$$ plain form
660 3306 -9978 88 4257 -563 -5737 482 10497 -5434 -8379 11695 -667 -8976 9292
673 9292 1647 -9504 188 3934 2122 -3465 -965 7729 -6006 -6859 11157 -1644 -9457 5888
687 5888 -415 -6699 1453 1274 288 -3698 -321 10477 -726 -4047 8982 -2639 -6983 6359
701 6359 601 -2857 1883 83 2889 -828 -1650 7154 -3695 -6739 6730 -1524 -5482 3541 -2311
716 -2311 -2914 1094 -466 3830 -1605 -3890 6100 -2383 -4672 6408 -2825 -5828 2666 -2033 -81
731 -81 2156 -1284 4299 -64 -1922 7177 -1857 -4848 4808 -2396 -1998 4763 -1089 1027 1042 -2795
747 -2795 4274 -647 -4238 4359 -3306 -4538 4810 -2071 -2202 2399 -2798 1422 1659 -2235 4200 -1315
763 -1315 -3837 4784 -2293 -3027 3947 -3360 -1193 3487 -1758 2839 1405 -3455 3505 -992 -3333
778c333P631o885K83O658o387L371K171o744N373j922m227P606n118k361P314
793C430o169J049N451o913L641J713n472O654k370m244O969n060j179O882o491
808b109J659M348o927M876P59o162N986l019l817P308m823o35O075o521K842L458
824C298o608M884j7n493O820k731k882O877n516l89N521o361K971K464o649N512
840A701k64n034O608l746k407O874n529P27M995o247L498J562o488O035j178m745
856c638O583l909j433O470o037O14M276o379L766J068n770O374j591l708O946
871C632m933p55O729o943J228M574o080L779L70m960N956k483k648O200n628K54
887a708O742p796J532M720o013L362K52m145N679l080j217N740o813J444O022
$$ plain form
778 -3333 4298 -2587 -2304 4354 -2033 1338 3509 -3235 2138 216 -4011 3595 -1523 -3884 3430
793 3430 -2739 -1690 3761 -3152 489 2202 -3270 3384 1014 -3230 3739 -1321 -2500 4382 -2109
808 -2109 -450 3898 -3029 1847 2606 -3556 2430 -589 -4406 2902 -1921 -2556 3519 -3002 -160 3298
824 3298 -3310 1574 1557 -3936 2884 153 -2729 4148 -1368 -1757 3764 -2597 374 2838 -3811 1701
840 1701 1437 -3597 3011 -735 -3142 3732 -1797 -1070 3925 -2322 1176 2738 -3750 2285 1107 -3638
856 -3638 2945 -964 -2397 4073 -1964 -1350 2926 -3453 313 1381 -4389 1985 394 -3314 3632
871 3632 -1301 -2056 4673 -2270 -1042 3532 -2548 1231 1601 -3359 2597 114 -2534 3666 -1962 -1708
887 -1708 5034 -2762 -1230 3490 -2523 839 1091 -3054 2625 -455 -1672 4068 -2745 -1301 4721
902D721q725J884N032n946L172K51l073N010l636j70N280p390L139O230r716K686
918a251N407o248L054L44k464L956m204P82M036p798M333N319j0330L456N054
933C446o281K855O93j719L993m129J164L280q022N249M849j0055M451M357o633
948b502K564j66j344L996m660J735L034p920N403M053r434M936M292n853K566
963G00j087n40L762n273L064L292q257M958L315r178N245L684n062K446k094K15
979h10L598o344L617M386q046M868L229q687M177K723l657K375k768J596K680
994B937q401M298N314q196M763L381p964K951J950k089J921l070L524K520r768
1009e929N030N512r188M694M790p075J913J145j773N81l093O152K261j0623N979
$$ plain form
902 4721 -4004 -2120 2912 -3034 138 389 -2684 2326 -1310 -1480 3800 -3590 -451 5779 -3937 -1251
918 -1251 4156 -2092 962 1306 -1158 2798 -1406 -624 3412 -4386 -53 5266 -5064 -1608 3446
933 3446 -2835 20 713 -1006 2987 -1142 22 3302 -4720 529 5378 -4677 -226 4131 -2502
948 -2502 62 -104 -1448 2548 -2112 -377 2657 -5263 140 4193 -5241 -305 3987 -1866 700
963 700 -387 -927 2835 -2438 626 3918 -4339 619 3934 -5244 1 3685 -1377 1069 -1025 -810
979 -810 2788 -3556 61 4447 -3599 1269 4498 -4189 -12 2711 -946 1429 -1339 257 2937
994 2937 -5464 -1166 4148 -4048 715 4096 -3868 -917 1033 -1056 865 -2205 1319 3839 -5929
1009 -5929 -899 4613 -4575 119 4909 -2166 -253 892 -881 -300 -3393 2759 5020 -5603 376
1024C76N168j0482M914N392o139J414J008j499n91l960O919J656j0865P540M599
1039E450j1910M148N513n629K226J299m20j288m294P388J150r871R245L895j1905
1054e003M056M385n304K253Q84J1j004m565O791l65r677R551L637j0805M512L209
1070B566n171K314M61J017J01m285O328r76r042R258K662r819M812K398m513K252
1086C63j075J259N95m288O140o16q484Q464J632q655N178J463l162K352k503J818
1102D81J050m834N608l03p703P845Q84p282M359K90j632K451l132K919J374n955
1118c580N655J22o991P180Q63o219L641l24o51J685l966M114J274o500N715L55
1134B373p335O638J138n068L274o46p8P52m418N061J204p094O135M67p531O018
$$ plain form
1024 376 5544 -4938 -24 5368 -771 643 1651 152 -439 -4399 2520 4176 -6689 851 5450
1039 5450 -6460 -2312 3201 -2428 -202 1097 677 -611 -4905 2483 3633 -6238 3007 6902 -5003
1054 -5003 -947 3438 -1866 387 1271 1282 278 -4287 2504 2139 -7538 2013 5650 -5155 -643 2566
1070 2566 -2605 -291 170 1187 1288 -2997 3331 2355 -6687 2571 5233 -4586 226 2624 -1889 363
1086 363 -712 547 1142 -3146 2994 2378 -6106 2358 3990 -4665 513 1976 -1186 1166 -1337 481
1102 481 1531 -3303 2305 2002 -5701 2144 3028 -4254 105 395 -1237 1214 -1918 1001 2375 -3580
1118 -3580 2075 2197 -4794 2386 3249 -2970 671 347 -304 1381 -2585 1529 2803 -3697 2018 2373
1134 2373 -4962 1676 2814 -2254 1020 374 296 1048 -3370 1691 2895 -4199 1936 2403 -5128 890
1150H90J067m477K844p17J120km687N851M69o918O984M18p154N765M44l757K757
1167H97j043J568k12n002N822K4o849P174p9o640N546j88k947K899j659K064k7
1184A348m822N956m70o242O938n60n694N318r44k549K550j969K424k07m782N882
1200B177p81n680O792r60m665N193j645j936K937k581K508K30m567N372j211n063
1216c880O259j803l835M850k616p53K712l394L153M89m293N350r88m202N725j924
1232H50k496M503l155j3K262l915L233M36m438N129j449m029N355k559j893M250
1248B071l702Q31K350m139L443L01l931N124j643l032M830k951j180L980m121
1263a769J387J937m293L353K16l862M796j505k487M684l179k77L515m097J823
$$ plain form
1150 890 1957 -2520 324 -393 727 725 -3962 1889 2358 -4560 2424 2842 -4312 1453 1897 -1860 897
1167 897 -146 1422 1210 -3792 2030 2054 -4795 2379 2300 -4340 1206 1018 -1929 970 -689 1375 1348
1184 1348 -3474 2482 2012 -4230 2708 2148 -3546 1772 828 -1721 829 -1140 1284 1077 -3705 2177
1200 2177 1396 -4284 2508 1548 -3117 2076 431 -1505 1432 -1149 1359 1589 -2978 2394 1183 -3880
1216 -3880 2379 576 -3259 1591 -1025 -1778 934 -2460 693 1182 -3111 2239 1251 -2951 2774 850
1232 850 -1646 2857 -298 -311 1951 -1964 1269 1705 -2733 2396 947 -3082 2273 -286 -2179 2071
1248 2071 -1631 -800 1550 -2589 854 1155 -2776 2348 705 -2327 2503 -448 -1628 2352 -1769
1263 -1769 -382 1555 -2738 615 831 -3031 1765 260 -2227 2457 -722 -999 2516 -1581 242
1278B42J785m475L851k56l665M825k052k185M477l479K58L062m279K267J466m510
1294b668M000n13l541M637k200j526M039l617O38K648m370K785R10m249M228q31
1310C70k997M557k268j147L812l195J069K317m051L045K58l954M477j532l114
1325b353M511k786j208L578l549J171J854l667L165l40l157M665k024k130M944
1340B674l226n44L763l594J174J827l530K892o62k685M235k856j515M428l870
1355a489n6L835m205J523J817l298K857p89j729L907l156n40M254m461O71L624
1371B765m672J572J900l298K326o47j370L192l097J63L712m630J808L077n099
1386b298K391K114l831K454l09j552K615k832P09K591m483K648K036n166L331
$$ plain form
1278 242 2027 -2448 1403 1147 -2518 2307 255 -1930 2547 -932 -674 2388 -1891 376 1842 -2668
1294 -2668 1332 819 -2722 1915 -285 -1811 2228 -1389 -751 1897 -2473 312 1222 -3027 1201 370
1310 370 -2627 1930 -338 -1485 2327 -868 201 2518 -1533 1512 1770 -2184 2293 761 -2353
1325 -2353 2158 -628 -1836 1742 -1807 -636 1218 -2449 716 376 -2781 1884 -140 -2270 2674
1340 2674 -552 -1096 2667 -927 247 2074 -1456 1436 774 -1911 2324 -532 -2047 2381 -1489
1355 -1489 -1545 2290 -1915 -392 1425 -1873 984 195 -1534 2373 -783 -1323 2931 -1530 -859 2765
1371 2765 -1907 -335 1565 -1733 593 -54 -1424 1768 -1329 -1166 2546 -2084 -276 2801 -2298
1386 -2298 93 2207 -1624 830 521 -1031 1584 -1248 -539 2052 -2431 217 2253 -2913 418
1401D18J403m400L315l40j561K748k388Q04J756l766L246N50m675M542K69m676
1417b755L976o78k339K889j779L57J204k822L312o37l899N524q65m435M940j200
1433G93l024L462j482m39J363j494K183j940k499N594k428l189O153k223l160
1448b330M397k230j412K137m55J586k131j166M631m057k048O620l340k001M866
1463C067l528j949K563l47Q67j418J93L781n336p67O191m420j99N681m621j875
1479b117K862j721M8l49J466L139n257O1M346n518J010O071m675k42L439l024
1495d61j008J12J524K832l783J224K877o065J551M136m993J803L785m015p61k18
1511a460K3K163k138K088K462n119J938J815n499L393L465l633J302k12j717J256
$$ plain form
1401 418 1821 -2579 736 396 -1165 1583 -805 -1 1755 -2011 1235 1785 -2890 1652 1921 -2755
1417 -2755 1221 543 -1796 1093 -686 -329 875 -1947 1365 728 -3171 2353 1488 -2947 1993 793
1433 793 -2231 1231 -251 -690 673 -821 1362 -578 -3077 2517 89 -3100 3053 830 -2330
1448 -2330 2067 -163 -1575 562 107 1693 -438 -1604 3027 -1030 -3078 3542 202 -1799 3067
1463 3067 -461 -2410 153 -194 673 -745 -552 3229 -2107 -2874 3317 -1103 -1302 4379 -242 -2117
1479 -2117 745 -976 -928 -1277 189 3328 -1929 -1868 2478 -3040 -2030 4041 -634 -876 2563 -461
1495 -461 -1469 -1357 167 2999 -784 440 3317 -2748 -1197 2939 -2054 -251 3534 -481 -1242 -1460
1511 -1460 -1437 726 -1412 676 3138 -1981 -43 1772 -3727 -334 3131 -502 800 588 -1129 127
1527A27k077J438K296l114K673K88n312L548J374l642L467L9k068K150k212j95
1543a220J773j596L018j58l768L957j230l851M521o13j904L558k170j598J257
1558b4j351J868m63j491M334k481l019M185k604j736N069j859j466K189j345P1
1574a23r45k84L981k626j384M424m159j379M995k864q05L255j499m23q67n06K843
1591A634k737K51M265m770p45M286m166j70L841j563r5k83m48J578l018J154L867
1608B881m381J060M000m767j33L409k354L07M95m40J216k856R37K986m457J640
1624d57L581m851P22K856k815Q59M90m26J202k516J004K268m155J927K712m226
1640a825J400K086l178J078m5o32J807k027J102K218l735J841K001l868J939J406
$$ plain form
1527 127 -1950 -512 1784 -1330 1343 1631 -3681 -133 1241 -2401 1066 1105 -963 1187 -1025 -1220
1543 -1220 553 -1043 1975 1817 -1951 2006 776 -3075 1446 833 -1071 2487 317 -1281 -24
1558 -24 -1375 493 30 -1461 2873 392 -2627 1558 -1046 -2782 2287 428 -1038 1151 -194 -123
1574 -123 -1068 -1352 2629 3 -1381 3043 -1116 -2495 2500 -364 -1169 2086 587 164 -703 -1209 1634
1591 1634 -1103 -852 3413 -1357 -2102 2184 -1982 -2152 1689 126 31 -252 -700 878 -2140 -986 2881
1608 2881 -1500 -440 3560 -1207 -1340 2069 -285 22 517 77 1293 -1563 -626 2360 -2097 -457
1624 -457 3124 -1727 -1005 1851 -964 -105 385 -41 1161 -1355 -351 1917 -2238 -311 2401 -1825
1640 -1825 -425 1661 -1517 -439 -484 -1116 691 -1336 -234 1984 -1751 90 2091 -1777 162 1568
1656A568k587J942m76p76K004k462O78J977l452J778J533l367J980N31k290K084
1672F65j013n42K326k509Q05K066l016J294J342k959J828k61j995K480j533j33
1688a155K871k751O49J970l292J539J197k459K255m18j239K222k040m6K604k868
1704i61J041K036l208J415N80k247K051p70q47K329k420J38K672k944J346J662
1720A873l084J587J00k035K207j069m84K779k730K81K026l017J234J573k509J829
1736E61J21k012J992j207n20K616k627N91K103l195J667J288k723K094l1j761
1752a043K141j596k21K341k402Q75J562l087J521P18k365K346k09j506K362j651
1768b14l03J845k510J311J346l054K064M14k811K448m69j643K413j556K1J829
$$ plain form
1656 1568 -1019 923 447 -329 1675 -787 -109 1868 -1584 194 1727 -1640 340 871 -1419 665
1672 665 -348 -890 1436 -1073 -268 1798 -1218 76 1418 -1541 287 26 -1969 511 -1022 -1155
1688 -1155 1716 -1035 -386 1584 -1708 -169 1028 -1431 824 406 -833 1389 -651 -697 1907 -961
1704 -961 80 2116 -1092 323 903 -1344 707 -63 -910 1419 -1001 -863 1809 -1135 211 1873
1720 1873 -1211 376 476 -1559 648 -421 -905 1874 -856 -575 1451 -1566 -332 1241 -1268 561
1736 561 682 -1330 662 -545 -1065 1551 -1076 -485 1618 -1577 90 1378 -1345 749 718 -1043
1752 -1043 1098 -498 -719 1622 -780 95 1657 -1430 91 809 -1556 790 581 -925 1437 -214
1768 -214 -517 1328 -1182 129 1475 -1579 485 899 -1912 536 67 -1576 837 -719 -698 1131
1784A131k284J421J054k618K422j66k539K723q36j302K369j718m2J495k387J469
1800A92M50k260K475l60k065L117j480j436K546j605oJ566j894J317K59j890K324
1817A250j039j779K967j935r37K803k004k01J766j935J282J59j331K162j502p24
1833i98L006k589n69K942k764K23J840j780R20L93j140J622j511l33K457l055
1849a336L64K960l197O72K201k545R44N52j046J157j424L51J728k960J080K298
1865A799l505J318J991l012J363R04j454R50q44M48J300k762J724J602l613K295
1881E04J381l532J904Q99k155R82k84J51P06k076K139P38l286K825N98l740K856
1898F10N62k569J529J6k85M47j411K059j15k650L395m14l410L579k99l002K204
$$ plain form
1784 1131 -1153 268 1322 -1296 1126 960 -1579 1144 308 -994 1375 -343 -385 1110 -1277 192
1800 192 642 -1618 857 497 -1568 1549 69 -1367 1179 -426 -432 1134 -760 557 816 -1074 1250
1817 1250 211 -1568 1399 -536 -1473 1330 -674 -875 891 -1044 238 397 -934 1228 -274 -998
1833 -998 2008 -581 -1150 1792 -972 -749 1091 -689 231 624 -516 1106 -405 -738 1719 -1336
1849 -1336 -972 1988 -1209 -537 1664 -881 63 615 -431 726 -698 -347 1381 -1579 -499 1799
1865 1799 -1706 -388 1603 -1409 -46 858 -596 354 -490 -42 1258 -1504 220 1822 -1791 504
1881 504 1885 -1647 257 1156 -999 -17 -301 -150 556 -1520 619 1357 -1929 896 1494 -2246 610
1898 610 1172 -1397 132 148 -137 310 -1101 958 843 -1807 1588 1174 -2236 1343 1044 -1958 246
1915B46l1q13P53q93J590o13j810L425j344k610L824j188k717L041o15r99J188
1932D34p06Q57o19j068K558j907j631M082k208j934L626j466j065J989j068O11
1948D85j71p38J847k023o61L396k834q26L377k658m84K260j608L35O76o38J298
1965A033j850K21K536l067M39L016l182K92K168k687N82J186j157P59q91L64J461
1982A223k812J374K146l581J690J904l440J379J437j914Q25P6qM00k132J715P63
1999A045l302K582J313l855K432J310k807J293N94k91J95j422J702k73k748L220
2015I88L64l836L335O18l180J913N54q81J92m94J392r42k117L320p63l008L958
2032A413J19l351K500N6j356M71k07J244q97j576L137j380k472M015q29k735L133
$$ plain form
1915 246 215 -598 155 -738 852 239 -1571 1854 510 -2100 1724 536 -2181 860 245 -754 434
1932 434 -272 585 -34 -1102 1456 -451 -2082 2000 -208 -2142 1484 18 -1047 942 -126 485
1948 485 314 -424 1423 -600 -1261 2135 -699 -1525 1852 -806 -1290 970 -638 -303 373 -265 1033
1965 1033 -817 -596 1940 -1127 -688 2328 -854 -562 1606 -1081 -499 687 -470 289 -602 -238 1223
1982 1223 -1589 -215 1931 -1650 40 1944 -1496 -117 1320 -594 231 307 299 699 -1433 282 1045
1999 1045 -2257 325 1638 -2217 215 1525 -1282 11 605 314 509 -913 789 516 -2232 988
2015 988 1352 -2484 851 1469 -1711 202 756 -125 67 -427 965 23 -2094 1226 463 -2545 1413
2032 1413 1532 -1819 681 737 -619 -148 -355 889 -8 -1584 1553 173 -2299 1716 887 -1848 1285
2049A285n90j534Q85m33Q69l77j050K658j715j731L461j443j672K952j251j210
2065h96J210j225P44r1p46K513j285j458K932k104j253K703j294k43J390j447
2081e50Q22j03j078K357j156r01K490k143r11K168j902L16J290j554J438k36j581
2098a234K100p40o88K350j952o01J491k307R61J284j758K384l75j859J899j046
2114i1j127K109j306o2J205j904J092K42j553K660j75j917K324j086j317J797
2130H91j034Q6P67j774J236l15j656K933n64j849K708j357j311J754r98K37Q24
2147E78j167J735q81j746K863j084j781K870j284j379J931j156M22N83j184J598
2163I18r34j486K957j160j403K888j550j132J606j527N17N72r41J784j117j523
$$ plain form
2049 1285 695 -839 46 -387 482 105 -945 1713 -2 -1733 1728 285 -1387 1565 314 -896
2065 -896 314 -911 -167 -258 -1004 1509 224 -1234 1698 -406 -1659 1044 -250 -493 897 -550
2081 -550 272 169 -909 1448 292 -609 1881 -262 -1173 995 -907 -591 699 -855 583 347 -1234
2098 -1234 866 126 -562 1788 -164 -765 726 -1581 -620 664 -1094 1290 915 -944 955 -91
2114 -91 -1218 891 -415 -477 728 -1176 -84 158 -1395 1265 1090 -827 1497 411 -906 891
2130 891 -143 -57 710 -1064 172 -143 -1799 1134 570 -1279 1429 72 -1239 515 -483 -246 578
2147 578 -589 1146 265 -1481 1382 298 -1483 1387 103 -1276 655 -501 -79 504 -680 918
2163 918 -16 -1502 1455 295 -1108 1780 230 -902 704 -823 -306 266 -675 1109 -8 -1531
2179a531K730j671q84K697j412p04J563j466O92M37j055K059j085j618K296j710
2195f62o30K679j313k09J214j684N64M3r68K332j034q16K020k051q19K242j478
2212e70K69J308j591Q21k47j085K028q07q22K208j963o07J964j718M88J252j619
2229f91J081m34j353K137j085k79K409j807k77J515k112O31R07j541J539k48j314
2246i22J898j173m81K025j743L8J292j946J054N14j645J833n78j111J866j141
2262b20l82J934j634L67R59k063R83J56j677J988m62q73K140j465m05J692j627
2279e89L20Q20j660J427Qj311K198j031q51K075j524m85J668j567N30O10j526
2296h88J358m27j202K152j008o47K225j682k20J540j875K97O88j432J291k64q32
$$ plain form
2179 -1531 1199 -472 -1356 1341 -71 -775 788 -678 14 451 -604 1455 370 -1248 1048 -662
2195 -662 -1292 1387 74 -135 1079 -605 -41 2 -966 1366 332 -484 1536 -515 -1334 908 -570
2212 -570 -301 1007 -584 237 -10 -1095 933 126 -696 1512 -451 -1058 906 -812 -324 928 -691
2229 -691 390 -44 -1397 740 -345 -624 1785 -22 -299 1216 -896 -265 642 -899 640 392 -922
2246 -922 976 -197 -678 1347 -396 -358 934 -1012 42 556 -1089 744 166 -945 921 -220
2262 -220 -602 1332 -302 65 1024 -1039 -56 100 -1577 411 -51 -924 1216 -249 -654 1038 -589
2279 -589 -269 551 -1109 318 326 -985 1213 182 -669 1406 -118 -603 1065 -502 28 638 -888
2296 -888 470 43 -1159 993 -15 -662 1563 -119 -339 1201 -674 -377 311 -1121 170 -94 -926
2313i26K030j426l74J952k163Q1J639j940Q33Q04j246J358n34m93J625j552P8
2330b54J928k281L74J427k226R25N94j428J335k12o17J595j381J74J423k334O11
2347c47J173k202J299O73j438J363l15p71J160j294K61J041j976J332Q63k075
2363a253J649M61j802J548l41p88J240j223O19P38k070J504L90j855J955L8j673
2380h63J899n76r77J194j195L70L21j435J633N6j684K229m28j550K047r35j020
2397i14J570j052J90O66j285J383m48j211K097r00j303K288j264o19J659j232
2413c75N8O15r81J192k80p47J971j360p50K073j801n75J981j646J40J048j047
2430d84R52m60o04J554j626p0J998j881J48J932k048N96Q19j401P42k86n19J343
$$ plain form
2313 -926 1104 -322 -696 1256 -907 -826 813 -1127 -294 510 -736 622 88 -405 1220 -332 -254
2330 -254 1674 -607 -233 1194 -1032 -107 487 -941 394 182 -435 1160 -221 -47 1376 -958 -347
2347 -347 826 -1376 -77 596 -842 521 206 -565 595 -699 -438 603 -1373 -41 822 -1253
2363 -1253 396 857 -945 603 262 -526 714 -509 110 848 -1222 282 672 -1183 772 810 -863
2380 -863 1036 460 -517 677 -518 -148 173 -1262 371 427 -1257 972 544 -1006 1041 106 -914
2397 -914 656 -396 -206 460 -825 558 110 -1101 996 96 -1207 1081 -183 -802 857 -375
2413 -375 -317 298 -683 509 229 -518 1453 93 -657 1416 -385 -960 1021 -625 -485 563 -484
2430 -484 468 8 -596 958 -668 -738 1260 -621 -473 1459 -589 7 826 -575 167 -119 -638 705
2448G05j493K82J568j998N64J432k013R20R83j441Q91j01o21Q40j342O31J308
2465A115k165J199J170k265J168O78j804R93M8p22Q51r97O16R21j865J378Q50
2482A169k188J417M08j819J344j01n93Q64r42M14N92j742J464N45j999J687K85
2499H05j912J641o03o24J242q01O15N55j692J168J27j743J795k61j294J558o30
2516e4o25J476j203N53N79j526J164j02j272J605m37o34J584j062m54J119j374
2533f63N85P98j379R99pj408J348o01l57J581j037m9J152j806P81Q19j619J084
2551B21J92j252J076n92k38J509j285N92P58j906Q02P69j672J237M56j139J006
2568E34q68j21J186j236P67Q57j904R71M90j959J516K32q43R29q03p4P87j316
$$ plain form
2448 705 -788 -506 1062 -936 -372 1060 -953 -33 950 -491 400 299 -322 518 -824 -193 1115
2465 1115 -1050 149 1319 -946 222 900 -904 89 137 -585 266 -731 -115 806 -1059 319 1169
2482 1169 -1019 398 806 -1013 331 230 -363 501 -441 -27 565 -1177 287 832 -1167 520 805
2499 805 -1107 534 -69 -693 549 -252 363 918 -774 394 521 -1222 573 312 -982 576 -54
2516 -54 -679 797 -406 147 726 -800 364 262 -1010 595 158 -476 1108 46 -408 711 -663
2533 -663 -78 720 -659 340 333 -1075 273 -328 -685 896 -141 -190 962 -844 -63 756 -863 221
2551 221 413 -839 237 -355 -593 916 -369 223 981 -925 -123 646 -1026 211 667 -472 534
2568 534 -334 -455 731 -505 262 1119 -785 186 676 -1283 233 465 -378 551 -252 -326 461 -855
2586h55J039O50j798J286M8j688J514K08q63J227o92j18M36j412J083O09j620
2603i46J547J01j932J322l2o63J200o37R7M66j424J133K71j470J812j39j561J419
2621E64l85p12J092o25K12L52j414J014K94j497J732j46j254J514o29n85R21p66
2639c18M68M84j416J127J1j409J608j83j114J307o55m37R22j005P59M70j395J191
2657D15o3j275J599l24r96J275q06k18P10j076Q82M58j313J302r5j303J435m27
2675A80p51J211q29q8O93j146R42M09j404J532k85j269J357n69n55J174j029K36
2693a91N55j248J034J83j387J541k14j127J350o31n41J095p04K68O45j314J074
2710C88j0j099J359l64r58J260o55m04R12q66O65M85j360J277j26j231J394m50
$$ plain form
2586 -855 184 834 -964 322 370 -1318 196 404 -459 768 76 -42 394 -1018 65 674 -946
2603 -946 601 702 -1230 92 60 -603 597 -40 57 523 -901 232 503 -967 845 706 -855 564
2621 564 179 -533 559 -66 146 498 -916 98 392 -1105 627 481 -773 741 112 -473 448 -318
2639 -318 150 634 -782 345 356 -1053 555 372 -742 565 -90 -527 395 -610 149 619 -776 415
2657 415 352 -923 676 352 -644 631 -175 -393 317 -759 123 581 -732 570 475 -828 607 180
2675 180 -571 640 -189 -277 416 -730 212 621 -783 749 464 -805 552 -17 -572 602 -427 -191
2693 -191 364 -884 150 333 -1054 487 273 -854 496 -135 -676 419 -285 -17 628 -686 388
2710 388 378 -721 638 274 -684 576 -79 -483 429 -437 228 713 -647 630 504 -727 667 217
2728B17q25J273q44j78P66q93P38R2j004J172m41j226J551o19n50J334j085J57
2746c65Q74r49O50J68q80J180l19j100J456q52n21J341j048R8R26j005O27Q3r16
2765e52J231n90p57J341r05l05J269j185K20R08j185P38L4r09J055n63m66J252
2783F31j083KJ009j123N15N70j038P48O4r51J204o16l23J016r30R2J123j529O49
2802C0O39j426J033o9q21R15m66k12J024r19K45P36j335R21K57j336J200q8j019
2821f91J188m24m14R60q50K01M56j101J051R3j379J382j64r25J002m27l64J003
2839E97q56M60L00j179J095k33j151J475m96q28J486o60m59R85p53K85K34q93
2857e91R75k84p38J494q21n27J382r56l48J018p73J21M43q49Q71m70n39J411j173
$$ plain form
2728 217 -608 665 -179 -357 409 -484 254 346 -658 514 73 -1153 398 -221 -771 563 -522 -365
2746 -365 509 -440 210 378 -502 678 359 -741 715 -137 -658 683 -365 -267 659 -346 281 364 -552
2765 -552 679 89 -668 673 -232 -537 732 -453 -233 675 -510 228 262 -647 408 -155 -621 631
2783 631 -452 -450 559 -564 -49 521 -517 231 295 -656 548 -68 -391 625 -305 -213 910 -619 30
2802 30 669 -757 276 207 -614 301 -165 -377 647 -272 -27 709 -626 295 552 -784 416 328 -691
2821 -691 497 73 -341 619 -231 -30 426 -675 376 469 -910 472 308 -617 385 -42 -406 597
2839 597 -259 201 501 -678 417 184 -967 508 12 -816 670 10 -449 536 -217 68 302 -591
2857 -591 384 100 -638 856 35 -492 890 -66 -414 604 -169 -48 395 -454 417 -53 -592 819 -354
2876c54l17J519j245j78J281j246M22N41r72Q56l74m14J302j168o0J261j386J54
2894c78J141j400M73O47q78O96j88l56R12j056J77R70j440N79Q53j461O76O42
2912F09j121Q05p4m44O29q52K83P01j292P83N95j455J187J00j081R18k7n89P64
2931D39p38K43N81j310J031K80j379J444j25j193J105l26o40Q48n91L10K53r29
2949f97J125J0j130J406k03j323J445n82n87Q83o25J27M90q62Q77k17r51J492
2967F78n83q98J523p90m93R93p48J56M95o22Q22l57p64J187q29n68J584r23m36
2986e73J073r03K18M15n29P24l03o19J114q44m26J363j040m5J200j079P5N59p12
3005c32P51l25m88J062j122j10J165j146K87J119j297M51N81j035P41j86m76Q93
$$ plain form
2876 -354 -671 848 -397 -575 706 -540 -118 423 -549 307 -67 -481 821 -347 -407 854 -532 -378
2894 -378 763 -637 -164 483 -395 301 113 -243 669 -387 -210 760 -680 -101 752 -709 -33 609
2912 609 -512 293 219 -225 404 -448 -165 536 -756 27 622 -833 354 454 -627 291 264 -325 439
2931 439 -299 -56 525 -785 246 526 -853 591 466 -727 378 52 -588 260 -331 -21 232 -697
2949 -697 428 438 -692 714 511 -812 633 51 -536 347 -278 -151 339 -523 354 137 -814 678
2967 678 95 -803 720 -70 -563 430 -318 -162 333 -289 533 176 -588 599 -230 -798 786 -137 -573
2986 -573 500 -403 -185 230 -299 425 122 -497 617 -227 -653 710 -330 -375 825 -254 -179 380 -332
3005 -332 419 94 -394 668 -454 -564 601 -545 -258 861 -436 15 596 -439 302 116 -360 533
3023E33q80O1Q85j260M46R47j274P37K58r90P17l7o19Q94o55P2P21j134N93P27
3043G42j346Q89K70j160J021k83o74J089q26M2O47r79Q95J54j285J190K0j203
3061g97J126l59m58J078p15N7L61q01P65J0r39J198k11j037J218n82n13J141o93
3080a51M1O47r02O62p5q30J174l08q55J342q74m68J061p86K48M80p98P10j41r57
3100g80J306n96o18J484q94k51R40r60K75L30n27Q75m09o80J045q55l62J385q92
3119a84k03Q79r29K57M19q97R45j43n12J082q66n13J270p91n4R64j091M84J13
3138B30p82Q45k84m34J099q38l79J139j160L15R02r60N24J72q24P43k04n64J263
3157H03q74k14R05r75k9O36p24P25r5p50J015o16n00J264q11r6J017j090L69L83
$$ plain form
3023 533 -347 -286 599 -661 -215 732 -542 195 453 -537 180 143 -476 418 -237 -165 556 -578 15 742
3043 742 -604 285 555 -605 416 133 -541 548 -278 -236 411 -568 327 481 -804 386 406 -797
3061 -797 329 -30 -488 590 -125 -68 293 -508 257 267 -672 526 315 -722 496 -86 -599 542 -151
3080 -151 -110 537 -365 297 222 -608 566 258 -597 745 -129 -597 464 -322 -74 406 -392 318 177 -780
3100 -780 526 -70 -688 796 -98 -349 591 -369 -94 236 -291 584 175 -505 540 -315 -677 708 -184
3119 -184 -387 492 -437 -180 239 -658 287 144 -368 714 -152 -665 605 -186 -240 724 -367 117 230
3138 230 -552 293 9 -425 674 -164 -543 596 -564 -249 653 -307 217 389 -435 308 104 -460 803
3157 803 -71 -285 620 -355 -384 252 -472 253 158 -592 423 -193 -693 571 -240 -336 681 -409 -40 343
3177C43q18Q98j83n75J045q08m97J081o97j22Q07p56M34J20q65J075l54n29J166
3196G65q23n03J191q30r7Q10q52M79R6q07J040n15o33J265q64k79R93q13N8O56
3216C37p40N60K5o12R01n75m00J231r93k91J171q99J93N49p84N80j60n14J011
3235E90o65m53J185j054j10J096r48K19N63o14M83n9p16R87o79k81J230j212L1
3254d07R67j069L10O25p74O23j01n34Q14r28R4J010j139M20P80j297N87M70r92
3273e41P65r2m96P59p14j44R96j027M27P82j239O96K68q72P45l6n62O14m97j7
3293a85O63r90O44M33j183J004m1j023J006j61p53J074n57q0N25q63N93J85q81
3312e90J144k46r06J084n41n21R65n06q1N09o87N38Qo63R78m52o21J393p75o25
$$ plain form
3177 343 -475 423 240 -335 710 -98 -595 486 -211 -333 474 -282 152 272 -593 482 128 -401 765
3196 765 -58 -561 630 -200 -297 513 -339 140 236 -571 469 -46 -679 586 -278 -557 436 -377 -319 337
3216 337 -403 157 182 -430 471 -104 -504 727 -266 -557 614 -285 -92 457 -327 253 93 -421 590
3235 590 -75 -528 657 -397 -507 589 -359 -140 423 -191 292 233 -483 504 -175 -456 774 -438 -407
3254 -407 560 -509 -199 426 -348 275 174 -360 454 -474 -380 630 -509 -89 691 -606 -19 451 -541
3273 -541 224 132 -364 395 -319 -463 533 -494 -67 715 -524 172 440 -432 313 277 -285 329 -168 -185
3293 -185 478 -512 132 565 -618 386 345 -678 328 167 -586 488 -69 -149 376 -487 106 291 -590
3312 -590 554 308 -598 486 -55 -576 389 -117 -198 311 -376 162 170 -493 485 33 -588 805 30 -595
3332e95J143o23j98O94n34K33o2n49J013o22n18J284r31k96J231r42j27P29n07
3351a77L08n1l32Q21p10k22J050j025qJ145j114K9R03q69K56J30m11N76p77L0
3371d48R92j084K48J076j232K34Q26j053M33K86m54M71m63K2P04j104N26P62j377
3390f35N29O55j149P38J30n85N48l17RN72r98O94M05j221P92M02j382R70R9q43
3410e87P51l21J25K37p95O95L21j108R10J44j161J179n8q88R04k89k47M32n94
3429c50N89K9q31R58j31j034J175k36p48J003m33k39M33l68N00k37o16J002m09
3448E7p66J276o06n04J002o48j84P14o35K91J01m90Q14m51m89J198p60l47J016
3467E89q81J2P45p03K07J40l81M38l06k24R14q29k12J106j045K01Q82r58L46K42
$$ plain form
3332 -595 548 -75 -273 421 -113 120 58 -491 522 -100 -618 666 -265 -561 670 -272 -399 330 -177
3351 -177 131 80 -252 569 -141 -363 687 -338 -346 799 -315 -286 617 -252 4 134 -277 299 -478 -448
3371 -448 544 -540 -292 784 -448 -214 612 -441 -8 278 -176 295 -168 -146 558 -546 -20 742 -635
3390 -635 -106 549 -600 138 268 -317 231 -86 -77 495 -503 191 596 -625 167 569 -813 157 256 -587
3410 -587 164 -157 -32 205 -590 105 426 -682 228 372 -789 390 332 -556 348 59 -188 244 -350
3429 -350 239 268 -563 395 264 -770 405 169 -579 424 -9 -248 185 -183 317 80 -536 466 57
3448 57 -709 567 -39 -543 459 -189 -373 341 -294 -3 98 -392 422 -29 -518 680 -80 -427 589
3467 589 -292 -280 465 -238 -31 109 -272 166 -140 -364 550 -279 -491 615 -430 -229 653 -305 41 283
3487B83n47N96m41k05R09q70J89P02j227O57N70j089N31K44n95L73j76r0N81q49
3507d54M94N54j149M98N67r78O82J07n91N19l57n1M02p78N68M69j087P42J70j044
3527g17P56K40n68N19k73l0L99p80O13L21j128R07K22j053P60Pn39O13k47j32
3547a10M01p28N75L28r90Q33R9j003P37ln81O80k86O3M05q97O03J76j012J013
3567C03j7q19P83k93l71O43m57L56L58q83O66j27p14Q89M1o95Q01n36k81N82m67
3588b38L20L26p57O68j77p59P25N7n05Q24m13k47M48p72N40M11q10Q18n4j124
3608g19P89r2k89N94k19j25M07q82N37K29p18R81j00r61Q49k55n12P19k10J63
3628A86K22q46N95mr43J120J14q13P35l03m64M97k54L08M23q60O36r0r53Q73J24
$$ plain form
3487 283 -264 332 -109 -314 595 -275 -86 616 -611 46 616 -473 58 302 -293 80 -96 -186 395 -454
3507 -454 40 594 -555 -57 510 -468 214 321 -270 249 -108 -159 243 -535 33 502 -585 157 327 -717
3527 -717 39 279 -289 230 -43 -73 326 -454 159 480 -648 259 481 -572 188 195 -344 269 22 -110
3547 -110 291 -437 138 466 -524 309 408 -595 142 139 -442 238 -48 15 420 -477 126 302 -710 303
3567 303 286 -533 250 -43 -414 229 -228 128 486 -397 269 142 -572 317 358 -337 464 -72 -353 229 -238
3588 -238 82 408 -349 319 142 -617 108 165 -340 484 71 -176 272 -500 40 451 -359 459 405 -719
3608 -719 70 -22 -311 283 64 -61 346 -536 1 230 -488 493 393 -568 281 26 -486 233 23 186
3628 186 408 -438 157 153 -790 330 444 -369 366 63 -401 96 -158 150 573 -287 349 259 -694 179 303
3649C03p64R47l07n05L77l73M06O3o23Q22r6j032R70o7p04Q79m9l23K00k92L36
3670A68j28m69Q87j97r33J017k35n90O84j34k35K22k30L31j68n47R43k12p54R73
3690C93k61o09P29j89n5J33l19K50k8n15Q72l41p05R25l22n53R61l48OK00m82
3711b58M59k74m41Q83l44m64Q76m55l09P37m40l4L24m40M01j90m67P36l28l19
3731c47P91m92k59O62n19J00L62m93L50q4o50Q22k82k75O07l99j01M61n34K26
3751e4L47o65N98j8o65P61l13l12P35m68N3J65m88L74K01q21Q40j75o54Q30k75
3772dk89N01k45RK96m89M49k35m84Q34k11o29Q30l21l11N44l52J07P4m78P34k82
3794D8m81Q15m70l21Q18m05k68O06l73J19k2k85O15k70n88R08m53n14J018n49
$$ plain form
3649 303 -461 486 179 -326 51 -322 84 147 -476 346 250 -782 188 121 -583 296 247 -76 124 -168 168
3670 168 40 -429 458 261 -672 345 110 -480 204 70 -165 57 -173 158 -10 -557 386 174 -580 393
3690 393 132 -477 252 63 8 141 -178 72 44 -471 401 60 -645 280 -42 -595 366 18 24 224 -258
3711 -258 201 -73 -514 369 25 -439 437 -18 -327 410 -30 -64 260 -180 221 31 -436 300 -28 -347
3731 -347 444 -48 -307 355 -164 -64 298 -195 155 71 -579 243 -39 -314 293 -106 -207 254 -280 -54
3751 -54 293 -372 226 208 -457 304 -9 -321 414 -54 -1 164 -324 50 251 -570 270 95 -559 271 -4
3772 -4 -293 208 -37 -28 268 -221 228 -7 -491 343 132 -497 333 12 -299 245 -107 0 74 -404 330 48
3794 48 -433 382 -88 -409 409 4 -264 342 -31 88 66 -219 396 126 -462 446 -7 -521 497 -52
3814e2k73N85l98J51N5l11M84l17l83J010p20k22R18p54j7N75m38k1J84k48L17
3835A25l36p3O02o07K7O02n12J4M32n23J84L08l09J98k03l2N04n06O9M94q09L14
3857c7L70p31K63K33l44L14k73O6M61o22K73M61p73M20L07o94M06m8m75N50j90
3878f3j63M56m33J34L94p14O23k4o36O50j3n79O53k61j39M46n94L03K18n31L73
3899A00N4o66P32j59m76P24m03j14L96l47K66P4m51N11k55m21O71j51l79P63m82
3920a3j06M22m76J56J22m58N92j43m31O18l54j47N83m59j13N72m60O9J67m69N16
3941A88j99j58N04m57j55M93m64L0M77m98L30M7m08N21l80l1L14k73p2O39o54
3962b06L5N39o40J92K69m27L31j86j7M02n20J13N23q09L05M78p18L43K93l74K21
$$ plain form
3814 -52 -325 260 -138 13 68 -243 241 -76 -459 551 -169 -391 527 -227 -244 331 -107 -128 56 -192 125
3835 125 -211 -284 318 -289 -262 340 -172 -158 274 -249 -65 243 -66 132 -71 -103 401 -105 -36 458 -351 -37
3857 -37 333 -398 -135 98 -246 68 -205 -139 322 -300 -27 434 -339 81 388 -306 100 52 -423 127 -63
3878 -63 -226 230 -203 -69 325 -389 234 210 -426 224 211 -368 285 24 -115 331 -263 40 258 -273 100
3899 100 154 -512 220 61 -415 309 -94 -208 188 -159 107 181 -270 241 -14 -435 236 85 -294 469 -13
3920 -13 -119 303 -173 -17 105 -353 239 96 -335 283 -71 -218 365 -94 -207 365 -95 -26 141 -328 188
3941 188 -11 -169 335 -122 -277 216 -248 -218 259 -239 91 138 -270 251 -129 -160 154 -119 -191 448 -206
3962 -206 -171 368 -272 -80 189 -238 93 -93 -110 292 -228 -115 408 -401 -96 382 -336 7 300 -74 147
3983A47j50r2L59m79J28M12o79L15L61p30L70J70m66M54j29j99N48n42J35L63
4003B96n93L08L08o84M67K2k60K67j95oL29n22K09M51p71L08K60n36N02kk77N04
4025C85n66P7N13p44M02L03o66K86K03n52M68j31k32N24m58R7L61n78K24M11n79
4046b52L41J41n58N43l39j92O05n39J65L67o30K76K91m99L26J37k85L38l64J52
4066B4L19n97K20L85p43L94L27m93J68J54k56J64j89Q2L57o85L01M07p78L54K94
4087B09m57L57k4j92L53m79K16L18p16N13L49q14L87M23p86L95lj36K94l79J75
4108CK76p96N17L93p97M50K67o28K65O5p4K34m25M04J61q28N29L67o73L45J46
4129B01m97L50k09o1M14l67K35K63p55N71K65q33M36K00l53K69k27L6J95n43M50
$$ plain form
3983 147 -3 -95 264 -215 -87 325 -354 -39 322 -408 -38 132 -334 120 -9 -208 340 -202 -67 296
4003 296 -297 11 319 -365 102 124 -136 131 -64 -70 259 -263 -54 397 -374 -66 194 -342 160 158 -119 385
4025 385 -181 -104 409 -335 67 370 -296 -10 193 -359 109 -22 -254 270 -188 -91 270 -308 -84 327 -252
4046 -252 89 230 -328 215 -124 -316 289 -250 -85 282 -348 -72 219 -280 46 183 -102 236 -128 24
4066 24 343 -254 -34 351 -392 2 329 -164 4 158 -98 66 -123 -41 316 -369 -68 339 -439 -85 209
4087 209 -248 109 85 -107 246 -233 -17 301 -415 98 447 -367 20 443 -343 52 49 -87 207 -172 3
4108 3 279 -517 0 393 -404 46 313 -315 -50 15 -59 175 -250 154 315 -513 16 383 -290 55 201
4129 201 -296 54 -155 -216 198 -169 66 329 -426 145 410 -423 13 213 -140 129 -98 -62 133 -410 40
4150D0K42q00N45L29q17O32O5l81K98j91J32J92o38M31K47p31N89M6o25M03J11
4171A19j98K36l33K76Q9n68M70J20n39M18K44o37M08J15m32L28m30L38K63p39
4191d52N45K69p75N18R5n32M30j51J3J76k43J60K13o08N94K3o83N01N9l99L25
4212G8l1n4J40m31M42Qn35O29K9n88L93J28l16K66k36P8R1l09M45R7o77N16k9
4235A34n27M58K14o47N41j88PJ20l30K27K18n93O64j17m86M27j14k46L72k29Q4
4256a1R5m48O01j4o19O96j07n78O16j60k15K16k48R0L52o28N41j08m59O05j44
4277G3l35M67l09j07L36l87L37L1m86M62l2m25O10k01j55M42l44o5L43m35J79
4298aK77o00M32K3m61N91k55k67N39m16J03L07o49M50J4l35M76j65m34O48l28
$$ plain form
4150 40 282 -518 27 356 -461 171 236 -145 153 -38 94 286 -352 79 326 -405 184 230 -395 8 119
4171 119 -79 157 -176 100 189 -379 91 211 -328 90 334 -303 105 220 -212 116 -314 24 287 -452
4191 -452 93 362 -413 105 200 -332 98 -53 -40 136 -107 53 266 -342 252 275 -408 93 152 -247 78
4212 78 47 -7 133 -298 144 152 -383 246 275 -313 80 208 -108 158 -78 0 91 -218 227 324 -353 163 134
4235 134 -393 65 279 -368 173 -15 -8 112 -218 9 227 -366 298 181 -305 122 8 -238 134 -95 -11
4256 -11 84 -364 237 223 -396 300 193 -385 231 71 -144 72 -176 -86 266 -362 179 71 -388 217 73
4277 73 -262 205 -104 -211 125 -262 75 106 -380 82 50 -375 235 34 -121 321 -23 -88 255 -180 -1
4298 -1 276 -324 108 131 -330 261 6 -261 278 -138 -35 272 -377 73 87 -248 228 63 -371 277 -51
4319e1j27L32l39J13K89m94M02R6o63N06j84k28M70k81l1M11m02J26J83m26N22
4340B24j1m85N03q3l62N21l30o0K74l68K52J51n89O17j93m62O27k78m8L85l89
4361a04R2K42l99J97J83n18N96k08l73N62m21j09M56k04n3L04l88j9K78l45M55
4382B24j96k13N95m14j74M06l17j19K99l66K81J16l35L77k65k32N78k35k05L26
4402A31k86J49L68n58K90j31j46L91k70j14M87m05jK10m17J71K88l50M15k30k01
4423b09M45k28j55M27m34J35L29n85N07n6m71M75j40j79M04l15p1L60m05J21J52
4444A07l37K65N8l20K71q8r9L06j14j06K99l56Q9K69m00K48N9m70M90j68l60N79
4466B22l05j13L11k70J56J53l43L45j29k15M63k56j55M46l07j51L74l67J53J22
$$ plain form
4319 -51 -178 154 -185 -72 217 -277 125 221 -442 64 -120 -348 122 -159 -190 221 -181 -55 128 -298 224
4340 224 213 -272 231 148 -214 307 -23 -83 191 -177 75 226 -363 254 61 -401 226 -52 -100 285 -104
4361 -104 -12 230 -169 28 211 -307 289 81 -292 270 -151 -260 196 -8 -61 243 -145 -164 114 -231 224
4382 224 28 -185 410 -4 -178 228 -89 -208 91 -275 6 122 -213 164 -101 -333 245 10 -195 131
4402 131 -155 -6 362 -196 94 -37 -183 208 -62 -176 311 -94 -95 115 -302 -131 157 -193 222 -8 -209
4423 -209 236 8 -147 280 -154 -19 310 -275 232 176 -295 180 40 -139 265 -50 -121 239 -166 -45 107
4444 107 -230 35 93 -227 44 -44 -143 163 49 -57 242 -114 -25 244 -156 92 151 -319 171 3 -357 222
4466 222 -83 -196 115 -155 1 154 -189 156 27 -188 275 19 -136 310 3 -148 226 -141 12 134
4486A34k81L38k36j81N06k27k03M91m35j5M17m08J62Q7l06K71o4k30M24l82r4
4507b32N15l80PL19m20K86l3k47M53j81k38M47m09J3L80m67L1K05k40K32J2k94
4529b41M23l85J4M73m13%L86m25J02K53k96K56n0k16K63j81k23N25m51M7L67m21
4551a93J39J72l76L72j84j1L02l66j9N08m77P0M08l92J65j3k46K38j69l5M29l75
4573e3n5L91m43N2J95k12K45j06k25M11k51r3L64l11L0L42n19J28K59l19J87j5
4595Bq2K25k34j64M93l91M8L87n22L67M0m14L54j92n2M02l76j9K81l51k9M29m03
4618b01J61J76l03J60m7j10M06l19qM02n48P2L93m02R4K44k66L17l09r5N15n31
4640a99J31M26o17J82L59m90J63P6r0J97k10Q7K03l32J30K82n12K00K84m61K32
$$ plain form
4486 134 -147 191 -45 -226 280 53 -150 341 -94 -109 308 -100 62 149 -157 114 50 -180 244 -138 -232
4507 -232 283 -97 -90 229 -191 95 62 -185 268 87 -151 296 -113 -100 280 -187 -156 49 -191 41 53 -241
4529 -241 182 -203 -189 284 -129 -129 257 -168 -66 187 -109 147 97 -119 144 -37 -260 265 -186 -139 228 -193
4551 -193 -54 118 -258 114 -70 -81 221 -145 -164 344 -133 -63 345 -47 118 105 -141 97 -72 -107 322 -53
4573 -53 -108 283 -160 -108 87 -125 120 14 -211 200 -51 -144 220 -91 -61 281 -238 -110 149 -170 17 2
4595 2 -80 145 -89 -253 240 -151 -103 284 -238 129 169 -245 109 -83 -135 267 -109 -128 153 -198 -227 202 -201
4618 -201 -40 136 -167 -7 -54 -164 242 -77 -85 317 -231 -159 234 -168 -74 170 -96 221 -88 -183 332 -199
4640 -199 -68 358 -259 -77 282 -208 -45 31 -59 138 -72 15 218 -114 16 298 -214 -14 270 -191 41
4661D1Mj79K36k09O0K95n28J51L13l82K20J39l00K34j32j59K43j27J16J61m16
4682b19J50K49m68K88J54j67J61j39j7J22k39K05L24m86J56J11l68J99J19j93
4702e8J64m4j10K62l15k1L37l69R8K50l40J15K01l02K47j23j16L38l62J31J90
4723A73l22Q9K38l99J84J55k07K07q7k0J79l32L8L69n14L7L88k86K60q4p5K62
4745B53l19p6K81m15K40L20n31K52P6k21J24l3j01L16k55J29J52l60J79K26n08
4766b71L16K65m33O5J85j79J86k51J56K36m30J27K51m84K44J38l02K82l3k5L7
4787H0k21J39L36n55L28J8l66J75J26l03L19j2p1pk12J95J62l76L08Mk58L03q3
4810B9j12K03j11n8J54l81L28J20m64M91m9k99L56j92j48K94j33j15L36l82K73
$$ plain form
4661 41 45 -134 102 -107 -47 248 -280 -129 184 -198 22 161 -139 95 -37 -196 47 -80 36 197 -219
4682 -219 -69 180 -288 0 154 -13 148 9 -8 114 -125 80 404 -82 74 185 -183 16 135 -58
4702 -58 106 62 -48 214 -101 -122 215 -154 -56 194 -146 -31 170 -132 115 -8 -124 214 -148 -17 173
4723 173 -149 -60 178 -221 -37 118 -89 118 31 11 190 -142 -104 265 -249 -212 176 -110 150 66 -9 253
4745 253 -66 -142 139 -276 -36 284 -247 5 81 -140 -16 -49 -150 166 -89 40 192 -168 11 237 -271
4766 -271 45 310 -123 -58 127 -52 134 -117 39 275 -155 -28 223 -261 -17 121 -181 101 68 43 80
4787 80 -141 -2 334 -221 107 125 -241 -66 60 -243 76 64 -7 -14 -226 -31 131 -245 63 67 -191 112 29
4810 29 -83 120 9 -49 105 -276 52 172 -292 199 150 -149 207 15 -133 161 28 -87 249 -133 140
4831A40j5l37M09k2k40K24j66p9K64k22K1K60l10P9J88l14J83o4q1K42j26k74
4853b40M21m30K23K08l62R7J24j87K04j31JK62m15J66K68l24N9K13k25K6J96k74
4875a20J58j12J0K14k19J66K08n19K02J44l29L24o7k56K32j19n2L70l19J33J15
4896A64m06J83K04k24K10k4j79K19j67nJ12j61oK76m38K83J31l87L34l5k47L02
4918A39l9j54Q9j90K68N5m23L97l8k63L10j23k38K46k1j27K12k70J71O0k14L21
4940A68j40k43K89j05j00K58j64n1Q7j70L33k31j41L11j54j69M35k45r0L46k52
4961b8p8K55j54P6o2j40J89j4j80L03l57N5L09l54J77O6j81K28Ll21K71lk18K74
4985A16k09R4J71k91K9P9j55J83J07l55M18j73p7J84k22J5J52k11J11O4k28L17
$$ plain form
4831 140 125 -212 197 175 -65 159 -7 -86 178 -44 -23 237 -73 6 194 -120 63 -1 -82 160 34 -240
4853 -240 181 -249 -26 182 -180 -83 41 -146 58 -73 -72 190 -225 -59 209 -115 -56 157 -68 -42 154 -120
4875 -120 38 -74 -64 150 -69 97 305 -214 -12 132 -197 127 60 -196 36 -83 -135 235 -84 49 164
4896 164 -242 -59 145 -79 131 107 -72 147 -20 -25 87 -74 -80 196 -242 41 172 -215 119 84 -163 139
4918 139 100 -54 35 -155 113 168 -255 142 104 -159 151 28 -210 36 15 -112 100 -170 1 61 -153 168
4940 168 28 -215 74 -31 -131 127 -37 -88 -1 -171 162 -69 -210 101 -53 -222 213 -32 -122 224 -28
4961 -28 -106 149 -5 71 9 -131 58 44 -136 167 -190 -135 174 -180 -3 63 -118 110 113 -208 63 60 -158 116
4985 116 -93 1 172 -119 -90 -11 -166 17 124 -231 187 14 -63 121 -101 -86 66 -145 -34 30 -198 119
5007A19r3j43L45j57k97L74j86o9K69l49K49k5j24L02o1l01K61l12PK28q6k6J55
5030H0j55J67k9j98K71n2j60K10m6k55L30k06R5m8l9J60j41k78N70k68k05M99
5052C02l88p8K44j23N7M4j71K23j46j32L07p4l01M28j99j61J92j40N9J16j68L09
5074B00l41l0L63k29m0K41o0k28J39j6J56j45r3K09k02n2M63l79j77K71l8p6J78
5097A14q8Q1j46r9K90m7k17K87k20j33M00k32r1K78j87O8J1j17J30j05j32L21
5119A66k14J1J16j52N8q6j2J54o4j2K88k40j98K78j80L0K00j93L8K5q8J26j60
5142a09j46N36k19k92L13k60O5K91k18R6n5j15J83j87j05M10k40j24M20l19J0
5163f5J9Q5N8k45N5L54l40j37M26k78j63M35k66l2J11j12J48j77K6J92j85l8M52
$$ plain form
5007 119 26 -117 228 71 -226 148 -38 -107 162 -187 62 37 -87 215 154 -147 114 -198 -191 37 -49 -75 80
5030 80 -75 92 63 -135 136 84 -76 134 88 -167 163 -43 52 4 -35 125 -16 -294 276 8 -197 302
5052 302 -86 -164 80 -43 14 58 -113 110 -36 -168 139 65 -236 192 -7 -168 24 -116 -57 59 -109 200
5074 200 -141 -171 192 -37 -77 164 104 -124 15 -1 155 10 -83 126 -76 -128 335 -44 -221 50 12 -64 114
5097 114 26 107 -39 -138 152 105 -112 175 -45 -178 222 -10 -101 177 -10 58 69 -48 82 -23 -155 166
5119 166 -48 -37 79 -73 -15 -101 -113 41 -23 -35 253 13 -185 93 -87 -57 143 -50 -12 13 -75 51 -109
5142 -109 -255 281 62 -230 83 -177 -112 179 -39 57 2 -113 70 -117 -222 188 -52 -176 244 -75 -65
5163 -65 -46 39 97 -148 -93 261 -79 -216 210 -68 -231 204 -62 -94 17 -95 53 -124 -98 94 -91 -129 323
5186C23m04j28L82k46P0l7R5N0j29q1L22l21Q8K47k73j24K59p8o2M5QJ77k47N3
$$ plain form
5186 323 -81 -209 173 -73 -3 -40 55 105 -24 -105 217 -104 -16 231 -42 -166 93 15 -47 -2 6 183 -64 -11
$$ [...]
8191A11
##END NTUPLES=NMR FID
##END=
