##TITLE=1H_DE-80H_X3
 200.13MHz, d2o
 8 sc
 
 19ns.26.2.2025
##JCAMPDX= 6.0         $$ Bruker NMR JCAMP-DX V2.0
##DATA TYPE= NMR FID
##DATA CLASS= NTUPLES
##ORIGIN= UXNMR, Bruker Analytische Messtechnik GmbH
##OWNER= pz
$$ XWIN-NMR		Version 3.5
$$ Thu Jul  3 12:22:43 2025 Russian Standard Time (UT+4h)  Yarkov@DPX200
##.OBSERVE FREQUENCY= 200.1313
##.OBSERVE NUCLEUS= ^1H
##.DELAY= (6, 6)
##.ACQUISITION MODE= SIMULTANEOUS
##.ACQUISITION SCHEME= undefined
##.AVERAGES= 8
##.DIGITISER RES= 18
##SPECTROMETER/DATA SYSTEM= spect
##.PULSE SEQUENCE= zg30
##.SOLVENT NAME= CDCl3
##.SHIFT REFERENCE= (INTERNAL, CDCl3, 0, 14.3821)
##AUDIT TRAIL= $$ (NUMBER, WHEN, WHO, WHERE, WHAT)
$$ ##TITLE= Audit trail, XWIN-NMR		Version 3.5
$$ ##JCAMPDX= 5.01
$$ ##ORIGIN= Bruker BioSpin GmbH
$$ ##OWNER= Yarkov
$$ C:/Bruker/XWIN-NMR/data/yarkov2/nmr/H-C/1/audita.txt
$$ ##AUDIT TRAIL=  $$ (NUMBER, WHEN, WHO, WHERE, WHAT)
(   1,<2025-07-03 12:21:24.67 +0400>,<Yarkov>,<DPX200>,
      <created by zg, POWCHK disabled, PULCHK disabled
       configuration hash MD5:
       00 E9 B6 7A A2 85 ED C7 34 08 36 98 17 FE 4E 26
       data hash MD5: 16K
       2E 04 42 31 EC A5 2C DD F5 21 EE BF 9A E2 63 EC>)
$$ ##END=
$$ 
$$ hash MD5
$$ 85 FC C9 FA E6 4A 5D 7D 07 4F 1A 7C 6E 24 D2 CA
##$RELAX= 
##$RELAX= 
##$RELAX= 
##$RELAX= 
##$RELAX= 
##$RELAX= 
$$ Bruker specific parameters
$$ --------------------------
##$DU= <C:/Bruker/XWIN-NMR>
##$EXPNO= 1
##$NAME= <H-C>
##$PROCNO= 1
##$TYPE= <nmr>
##$USER= <yarkov2>
##$AMP= (0..31)
100 100 100 100 100 100 100 100 100 100 100 100 100 100 100 100 100 100 
100 100 100 100 100 100 100 100 100 100 100 100 100 100 
##$AQSEQ= 0
##$AQ_mod= 1
##$AUNM= <au_zg>
##$AUTOPOS= <>
##$BF1= 200.13
##$BF2= 200.13
##$BF3= 200.13
##$BF4= 200.13
##$BF5= 200.13
##$BF6= 200.13
##$BF7= 200.13
##$BF8= 200.13
##$BYTORDA= 1
##$CFDGTYP= 0
##$CFRGTYP= 5
##$CHEMSTR= <none>
##$CNST= (0..31)
1 1 145 1 1 1 1 1 1 1 1 1 1 1 1 1 1 1 1 1 1 1 1 1 1 1 1 1 1 1 1 1 
##$CPDPRG= <>
##$CPDPRG1= <>
##$CPDPRG2= <>
##$CPDPRG3= <>
##$CPDPRG4= <mlev>
##$CPDPRG5= <mlev>
##$CPDPRG6= <mlev>
##$CPDPRG7= <mlev>
##$CPDPRG8= <mlev>
##$CPDPRGB= <>
##$CPDPRGT= <>
##$D= (0..31)
0 0.7 0 0 0 0 0 0 0 0 0 0.03 0 0 0 0 0 0 0 0 0 0 0 0 0 0 0 0 0 0 0 0 
##$DATE= 1751530884
##$DBL= (0..7)
120 120 120 120 120 120 120 120 
##$DBP= (0..7)
150 150 150 150 150 150 150 150 
##$DBP07= 0
##$DBPNAM0= <>
##$DBPNAM1= <>
##$DBPNAM2= <>
##$DBPNAM3= <>
##$DBPNAM4= <>
##$DBPNAM5= <>
##$DBPNAM6= <>
##$DBPNAM7= <>
##$DBPOAL= (0..7)
0.5 0.5 0.5 0.5 0.5 0.5 0.5 0.5 
##$DBPOFFS= (0..7)
0 0 0 0 0 0 0 0 
##$DE= 6
##$DECBNUC= <off>
##$DECIM= 32
##$DECNUC= <off>
##$DECSTAT= 4
##$DIGMOD= 1
##$DIGTYP= 9
##$DL= (0..7)
0 120 120 120 120 120 120 120 
##$DP= (0..7)
150 150 150 150 150 150 150 150 
##$DP07= 0
##$DPNAME0= <>
##$DPNAME1= <>
##$DPNAME2= <>
##$DPNAME3= <>
##$DPNAME4= <>
##$DPNAME5= <>
##$DPNAME6= <>
##$DPNAME7= <>
##$DPOAL= (0..7)
0.5 0.5 0.5 0.5 0.5 0.5 0.5 0.5 
##$DPOFFS= (0..7)
0 0 0 0 0 0 0 0 
##$DQDMODE= 0
##$DR= 18
##$DS= 0
$$ [...]
##$SUBNAM2= <"">
##$SUBNAM3= <"">
##$SUBNAM4= <"">
##$SUBNAM5= <"">
##$SUBNAM6= <"">
##$SUBNAM7= <"">
##$SUBNAM8= <"">
##$SUBNAM9= <"">
##$SW= 18.0517328524113
##$SWIBOX= (0..15)
0 0 2 0 0 0 0 0 0 0 0 0 0 0 0 0 
##$SW_h= 3612.71676300578
##$TD= 16384
##$TD0= 1
##$TE= 0
##$TE2= 300
##$TE3= 300
##$TEG= 300
##$TL= (0..7)
0 120 120 120 120 120 120 120 
##$TP= (0..7)
150 150 150 150 150 150 150 150 
##$TP07= 0
##$TPNAME0= <>
##$TPNAME1= <>
##$TPNAME2= <>
##$TPNAME3= <>
##$TPNAME4= <>
##$TPNAME5= <>
##$TPNAME6= <>
##$TPNAME7= <>
##$TPOAL= (0..7)
0.5 0.5 0.5 0.5 0.5 0.5 0.5 0.5 
##$TPOFFS= (0..7)
0 0 0 0 0 0 0 0 
##$TUNHIN= 0
##$TUNHOUT= 0
##$TUNXOUT= 0
##$USERA1= <user>
##$USERA2= <user>
##$USERA3= <user>
##$USERA4= <user>
##$USERA5= <user>
##$V9= 5
##$VALIST= <valist>
##$VCLIST= <CCCCCCCCCCCCCCC>
##$VD= 0
##$VDLIST= <DDDDDDDDDDDDDDD>
##$VPLIST= <PPPPPPPPPPPPPPP>
##$VTLIST= <TTTTTTTTTTTTTTT>
##$WBST= 1024
##$WBSW= 4
##$XGAIN= (0..3)
0 0 0 0 
##$XL= 0
##$YL= 0
##$YMAX_a= 312101
##$YMIN_a= -289101
##$ZGOPTNS= <>
##$ZL1= 120
##$ZL2= 120
##$ZL3= 120
##$ZL4= 120
##$ABSF1= 10
##$ABSF2= 0
##$ABSG= 5
##$ABSL= 3
##$ALPHA= 0
##$AQORDER= 0
##$ASSFAC= 0
##$ASSFACI= 0
##$ASSFACX= 0
##$ASSWID= 0
##$AUNMP= <proc_1d>
##$AZFE= 0.1
##$AZFW= 0.1
##$BCFW= 1
##$BC_mod= 2
##$BYTORDP= 1
##$COROFFS= 0
##$CY= 83.5205535888672
##$DATMOD= 1
##$DC= 2
##$DFILT= <>
##$DTYPP= 0
##$F1P= 10.8118882576601
##$F2P= -7.23987719738617
##$FCOR= 0.5
##$FTSIZE= 0
##$FT_mod= 4
##$GAMMA= 1
##$GB= 0.15
##$INTBC= 1
##$INTSCL= 1
##$ISEN= 128
##$LB= 0.25
##$LEV0= 0
##$LPBIN= 0
##$MAXI= 10000
##$MC2= 0
##$MEAN= 0
##$ME_mod= 0
##$MI= 1.114404
##$NCOEF= 0
##$NC_proc= 0
##$NLEV= 6
##$NOISF1= 3.799351
##$NOISF2= 2.8
##$NSP= 1
##$NTH_PI= 0
##$NZP= 0
##$OFFSET= 14.38212
##$PC= 1
##$PHC0= -1365.687
##$PHC1= 16.24948
##$PH_mod= 1
##$PKNL= yes
##$PPARMOD= 0
##$PSCAL= 0
##$PSIGN= 0
##$REVERSE= no
##$SF= 200.129724274929
##$SI= 16384
##$SIGF1= 3
##$SIGF2= 2
##$SINO= 400
##$SIOLD= 16384
##$SREGLST= <1H.CDCl3>
##$SSB= 0
##$STSI= 0
##$STSR= 0
##$SW_p= 3205.1282051282
##$SYMM= 0
##$S_DEV= 0
##$TDeff= 0
##$TDoff= 0
##$TI= <>
##$TILT= no
##$TM1= 0
##$TM2= 0
##$TOPLEV= 0
##$USERP1= <user>
##$USERP2= <user>
##$USERP3= <user>
##$USERP4= <user>
##$USERP5= <user>
##$WDW= 1
##$XDIM= 8192
##$YMAX_p= 0
##$YMIN_p= 0
$$ End of Bruker specific parameters
$$ ---------------------------------
##NTUPLES= NMR FID
##VAR_NAME=  TIME,          FID/REAL,        FID/IMAG
##SYMBOL=    X,             R,               I
##VAR_TYPE=  INDEPENDENT,   DEPENDENT,       DEPENDENT
##VAR_FORM=  AFFN,          ASDF,            ASDF
##VAR_DIM=   8192,          8192,            8192
##UNITS=     SECONDS,       ARBITRARY UNITS, ARBITRARY UNITS
##FACTOR=    0.0002768,     1,               1
##FIRST=     0,             0,               0
##LAST=      2.2672688,     0,               0
##MIN=       0,             -289101,         0
##MAX=       2.2672688,     312101,          0
$$ Real data points
##PAGE= N=1
##DATA TABLE= (X++(R..R)), XYDATA
0 0 0 0 0 0 0 0 0 0 0 0 0 0 0 0 0 0 0 0 0 0 0 0 0 0 -1 2 -2 3 -4 4 -4 4 -4 4 -4 4 -4 3 -3 3 -3 2 -2 1 -1 0 3 -2 2 -1 3 -4 2 -1 -2 4 -10 19 -31 52
60 52 -80 124 -195 309 -504 860 -1590 3341 -9096 60271 312101 -81512 -193281 187877 38280
75 38280 -228583 49293 202945 -124612 -153261 177046 85773 -165917 30639 103219 -142250
86 -142250 -55459 165357 40264 -103518 -13209 67453 -31709 -74037 77797 50317 -124663
97 -124663 12623 144914 -56180 -107241 63323 20198 -91345 46211 132318 -78406 -111899
108 -111899 121714 22426 -152948 83913 109531 -154530 213 177867 -81200 -139072
118 -139072 105470 46543 -132990 40402 157362 -99469 -120408 141769 19165 -158732
128 -158732 67960 114559 -99838 -31195 110957 -9669 -110262 13135 91214 -42999
138 -42999 -60026 102135 29569 -122499 8168 86657 -59227 -62380 88757 56546 -97320
149 -97320 -18835 111460 -56971 -111983 118371 55065 -130016 44892 114232 -100965 -72900
160 -72900 98777 5949 -94858 57851 95101 -97268 -53261 109940 -32958 -98815 88060
171 88060 44133 -86433 27840 71791 -54254 -59132 42160 32243 -44162 11916 69642 -42814
183 -42814 -61194 55130 12874 -60524 13520 48982 -13232 -31238 31293 24549 -75867 -20489
195 -20489 92117 -15672 -57144 74626 14640 -93320 18112 69001 -47859 -46084 73572
206 73572 31692 -80561 13208 67266 -82948 -44081 105710 -1281 -70057 51611 29342
217 29342 -69649 -10334 57678 -9453 -49431 42789 50618 -58207 -18649 51812 -35753 -40562
229 -40562 54850 25725 -35237 -6862 26293 -10092 -45824 20364 43730 -41893 -6826 65090
241 65090 -23976 -52673 33589 14760 -39832 8639 52966 -9798 -49725 30215 25008 -67970
253 -67970 4889 68053 -36797 -26901 58895 -8050 -56381 14275 32638 -24357 -15760 50699
265 50699 10704 -56028 15466 33762 -50888 -6454 54414 -9797 -25394 21891 9100 -31878
277 -31878 -19065 31421 8880 -32720 26159 32165 -45375 -13011 33607 -16643 -20183 29162
289 29162 23467 -20225 -16206 26516 -7142 -44740 28366 33668 -39037 5971 39162 -31318 -29281
302 -29281 23897 7844 -22656 6380 38325 -11439 -35892 28128 7317 -45987 20408 38371
314 38371 -25778 -5662 25404 -10708 -28105 2900 23106 -10266 -14320 34780 3078 -40900
326 -40900 12351 15610 -28965 4097 29838 -395 -14663 2723 12714 -19219 -19171 31936 6474
339 6474 -27269 23944 15637 -35716 -5789 18153 -8081 -10447 16536 19794 -19178 -15550 25243
352 25243 -11321 -29478 31709 16154 -25144 12358 16209 -22023 -14786 11582 9694 -12976 2345
365 2345 27531 -14790 -24919 21146 -3746 -24891 19785 17738 -10547 -2505 6268 -1299 -17670
378 -17670 -1425 24683 -7357 -11247 27362 -3514 -27986 8369 5651 -13416 3045 17071
390 17071 5372 -17949 -3173 15418 -19369 -10924 31016 -2646 -16454 22176 3007 -22962
402 -22962 -1866 9449 -367 -5414 12563 13746 -22088 -9003 18420 -14930 -11451 23302 1300
415 1300 -9691 8328 2368 -9334 -11779 5059 15020 -7851 2323 19350 -16206 -15117 14710
428 14710 -3459 -10012 9423 9743 -1619 -9692 3439 3713 -22032 2462 25498 -11537 -4494
441 -4494 20897 -11316 -16674 9384 4426 -5503 997 13942 3469 -17779 3154 8272 -20958
454 -20958 2229 20938 -8524 -2836 10027 -6885 -9279 -2707 5374 6534 -5034 8399 9534
467 9534 -17382 -3194 10420 -9576 -1834 11396 3288 -2055 -4311 2314 -3947 -17158 10494
480 10494 16158 -13916 4739 13166 -18955 -6353 13304 -3028 -6091 6649 11284 -2648 -9974
493 -9974 8036 -4113 -19590 15235 15504 -13441 3178 5308 -13675 -2358 4803 1397 -1308
506 -1308 -2502 11371 4552 -13116 1431 115 -10812 9234 12626 -1147 -3905 -5985 1748 -820
520 -820 -8602 9933 3546 -13226 12676 10126 -18240 -3791 5034 -5743 3785 12306 4249 -10660
534 -10660 -7093 10386 -4242 -9768 15200 -221 -12001 15429 3730 -16733 -1576 804 -1222
547 -1222 5498 5355 3876 -8294 -8292 8675 -1739 -6460 9395 1065 -2194 6561 -1761 -3667 -6040
562 -6040 -5632 12087 3554 -6575 9636 -3694 -15499 6990 4680 -7796 2258 7373 2427
575 2427 -5051 -657 5141 -12310 -4387 19447 -2033 -7689 13026 -5646 -13501 6754 1653 -4270
589 -4270 2538 4402 2852 -6032 -2788 3817 -8813 -799 12748 -1821 -721 5169 -6567 -2421
603 -2421 -213 -2282 7467 -46 -2236 8586 -6154 -9050 5772 -2946 -3703 6864 3974 -253
617 -253 -4038 -628 2016 -9824 2290 14442 -7042 -1316 12356 -10383 -8281 8488 -2421
630 -2421 -3509 5421 4356 -720 -6414 639 746 -10127 4966 10652 -6402 2068 5332 -8696
644 -8696 -1102 1763 -1702 4862 14 1428 5356 -7759 -3646 3631 -5695 1265 7157 -243 -392
659 -392 -2933 -1464 324 -7022 4701 8879 -7476 3825 8461 -11987 -2639 6862 -4916 293
673 293 6722 1974 -2472 -4915 2151 -1752 -8380 8382 6036 -8054 5710 3028 -10523 910
687 910 2272 -1918 4101 1412 2819 1277 -7215 696 721 -5834 5739 4963 -2955 1325 -2521 -2821
703 -2821 -127 -4428 4909 4474 -5741 6441 3076 -11084 1595 3360 -5033 4408 5596 -381
717 -381 -2310 -3298 1944 -3032 -5146 8969 1019 -6512 8343 -737 -10301 2998 684 -2179 4860
732 4860 2288 1597 -2049 -5073 3569 -1934 -4165 7995 622 -3224 4426 -3093 -4228 -149 -2667
747 -2667 4585 2409 -2960 5880 -2324 -8313 4971 -51 -3945 6350 2642 -917 -421 -2315 821
762 821 -3780 -2160 8785 -1503 -3643 7687 -4777 -7898 4707 -1153 -1387 4800 1234 904 -2649
777 -2649 -2790 3160 -3953 -1082 8370 -1959 -1195 5210 -5191 -3650 897 -1843 3837 1339 -1514
792 -1514 3932 -4948 -4350 5309 -3290 -1577 6752 -464 234 1106 -3134 -318 -2964 568 7627 -2818
808 -2818 -1232 5424 -7194 -3493 5352 -3629 -752 4353 124 1197 -2323 -2193 1246 -4896 2604
823 2604 8166 -3993 320 3582 -6444 -644 2418 -2236 2456 493 494 3196 -5524 -2060 2527
838 2527 -4966 2585 6374 -2908 487 329 -3481 1036 -1590 1057 4900 -3132 2078 4085 -7796
853 -7796 -1057 2975 -4184 2791 4017 -1595 240 -3010 -995 1216 -4342 3714 4764 -4384 3434
868 3434 2326 -7174 866 1392 -1855 3900 706 221 813 -5463 471 1212 -4883 4295 3433 -3753
884 -3753 2659 -706 -4150 1111 -1263 1880 3907 -2488 2910 972 -7029 1958 1309 -3937 4381
899 4381 2082 -2168 1047 -3072 -941 74 -3437 4690 2490 -3883 4328 -463 -6255 2947 223
914 223 -1389 4395 187 608 181 -4513 1509 -545 -3438 5770 935 -3280 3378 -2845 -3686 2008
930 2008 -1531 2145 2916 -2089 3239 -799 -5203 3221 -718 -2307 5744 205 -1658 1179 -3528
945 -3528 -510 21 -2105 4632 177 -2770 4732 -2866 -4734 3477 -1473 -186 4873 -429 539 -719
961 -719 -3557 2381 -1498 -1590 5522 -1658 -1538 3796 -4182 -2729 1666 -2108 2786 2465 -1546 2459
977 2459 -2811 -3299 4182 -1960 -684 5270 -1731 -20 1786 -3934 -179 -748 -1261 5155 -745 -1697
993 -1697 3129 -4864 -2086 4170 -2540 700 3498 -1383 1774 -566 -2825 1497 -2389 531 5694
1008 5694 -2504 -575 2164 -5209 -264 2202 -2454 2479 778 -1164 2601 -3216 -2104 2535 -2980
1023 -2980 1908 5002 -2608 741 526 -3804 1551 -235 -630 3768 -1916 22 2571 -5269 -766
1038 -766 2339 -3402 2806 3031 -2236 1453 -1593 -2076 2227 -2157 1594 3928 -3184 1676 1644 -5274
1054 -5274 927 807 -2144 3542 181 -1112 1433 -3994 -387 2037 -3176 3074 2979 -3077 2152 -223
1070 -223 -3456 2073 -748 420 3634 -1918 957 1019 -5188 974 1125 -2953 3760 1123 -2172 1832
1086 1832 -2420 -1323 1912 -2084 2574 2744 -2800 2568 -31 -4509 2281 -173 -1403 3943 -901
1101 -901 -625 858 -3995 644 846 -2774 3902 1200 -2743 2877 -1827 -2823 2492 -1228 1239 3044
1117 3044 -2030 1536 -312 -4266 2216 -278 -2050 4343 -543 -1676 1955 -3251 -808 1452 -1942
1132 -1942 2992 1544 -2353 2729 -1567 -3303 3140 -1048 -112 3774 -1653 108 318 -3737 1399
1147 1399 -48 -1949 4060 -436 -1929 2755 -2909 -1985 2448 -1400 1944 2375 -1811 1871 -1327
1162 -1327 -2733 2932 -1373 -777 4284 -1932 -649 1666 -3883 -199 929 -1578 3407 227 -1773
1177 -1773 2307 -2722 -1611 3078 -1820 1027 3017 -2129 1255 -149 -3398 1645 -915 -854 4103
1192 4103 -1598 -1084 1898 -3595 -384 1921 -1796 2246 1315 -1456 2106 -2065 -1802 2802 -2012 908
1208 908 3907 -2569 221 894 -3793 1090 469 -1353 2976 -746 -825 1823 -3324 -423 2016 -2197
1224 -2197 2444 2254 -2244 1802 -995 -2508 2348 -1270 30 3273 -2242 -40 1174 -3728 678
1239 678 957 -1725 2625 158 -1116 1916 -2703 -525 2152 -2200 2265 2697 -2932 1310 19 -3262
1255 -3262 1805 -358 -872 2700 -1303 -85 844 -3541 521 1048 -2025 3415 788 -2293 1893 -1611
1271 -1611 -1447 2519 -1534 873 2547 -2144 1069 149 -3568 1345 77 -1064 3042 -873 -949 1356
1287 1356 -3108 621 1708 -2292 2792 1386 -2394 2223 -911 -2727 2028 -724 214 2582 -1838
1302 -1838 224 -95 -3090 1741 2 -1835 3387 -422 -1495 2248 -2441 -950 2117 -1415 1839
1317 1839 1851 -2163 1161 -835 -2326 2116 -770 -550 2695 -1768 24 858 -3346 918 708 -1748
1333 -1748 3283 274 -1990 2146 -1677 -1325 2318 -1067 925 1832 -1685 990 -809 -2627 2013
1348 2013 -857 -797 3416 -1696 -996 1744 -2856 -4 1798 -1323 2132 951 -1445 1720 -1602 -1522
1364 -1522 2186 -1445 665 2420 -2279 531 91 -2975 1534 68 -1299 3023 -689 -1201 1720
1379 1720 -2225 -521 1871 -1088 1657 1256 -1558 1332 -1321 -1645 2205 -1466 23 2868 -2167
1394 -2167 -317 1094 -3169 589 1002 -1180 2348 65 -975 1492 -2084 -223 1904 -1622 1652
1409 1652 1616 -2255 1312 -561 -2709 1746 -461 -548 2743 -1458 -654 1095 -2551 538 1160 -1237
1425 -1237 2257 401 -1187 1617 -1847 -957 2015 -1693 1120 2269 -2589 479 364 -2838 1418
1440 1418 192 -1072 2065 -664 -406 1117 -2307 390 1129 -1467 2452 766 -2193 1637 -1106
1455 -1106 -1711 2270 -1004 -127 1997 -1854 198 440 -2598 852 360 -681 2556 -573 -865 1374
1471 1374 -2323 281 1842 -1874 1645 1285 -2320 1400 -296 -2433 1448 -434 -243 2035 -1486
1486 -1486 -130 105 -2203 1324 615 -1324 2634 -210 -1405 2061 -1641 -1258 2137 -1141 782 1676
1502 1676 -1764 410 -446 -1858 1407 -429 -381 2079 -1364 -143 1052 -2450 755 1296 -1552 2421
1518 2421 711 -1899 1469 -986 -1518 1779 -634 201 1231 -1508 394 -411 -1937 1569 -326 -804
1534 -804 2843 -1107 -904 1827 -2148 -136 1882 -1198 1291 1112 -1556 712 -989 -1117 1357 -896
1550 -896 264 1790 -1897 423 429 -2596 1212 701 -1285 2356 -123 -1487 1472 -1279 -617 1555
1566 1555 -957 903 968 -1391 760 -986 -1446 1766 -982 -25 2443 -1862 -265 1347 -2290 651
1582 651 1450 -1286 1575 452 -1099 861 -1307 -547 1262 -1143 1035 1037 -2101 883 -185 -2276
1598 -2276 1703 -111 -925 2444 -815 -821 1194 -1663 157 1231 -632 1430 233 -1210 905 -1507
1614 -1507 -817 1724 -1388 545 1927 -2271 382 850 -2362 1163 1004 -893 1697 -60 -694 725
1630 725 -1389 277 934 -1205 1693 440 -1918 1358 -866 -1881 2033 -700 -629 2129 -1323 -333
1646 -333 923 -1568 620 725 -512 1726 -422 -783 1145 -1778 -63 1607 -1649 1098 1282 -2372
1662 -2372 728 82 -2123 1364 152 -605 1565 -599 -338 441 -1389 941 497 -914 2080 -331
1678 -331 -1400 1613 -1432 -1171 1945 -968 29 1576 -1547 -19 160 -1408 953 114 -133 1641
1694 1641 -842 -137 961 -1845 801 1117 -1403 1510 475 -2069 1198 -465 -1593 1534 -371
1709 -371 -99 1252 -988 160 86 -1392 1452 -17 -575 2194 -858 -955 1543 -1633 -431 1747 -1212
1726 -1212 583 993 -1573 258 -339 -1080 1133 -439 91 1246 -1399 433 619 -1888 1219 788
1742 788 -1225 1889 -21 -1676 1182 -921 -1028 1393 -812 317 807 -1154 380 -454 -1203 1409
1758 1409 -422 -126 2068 -1435 -365 1330 -1747 350 1598 -1304 952 522 -1230 503 -745
1773 -745 -591 1026 -868 621 926 -1660 667 98 -1836 1587 219 -1102 2051 -478 -991 1185
1789 1185 -1199 -270 1087 -695 775 347 -1140 751 -907 -805 1606 -938 165 1720 -1612 187
1805 187 1029 -1845 979 1047 -1016 1235 -70 -1096 636 -1028 -42 882 -1034 980 480 -1697 1045
1822 1045 -436 -1472 1893 -261 -622 1933 -913 -532 960 -1147 378 774 -633 1103 -305 -919
1838 -919 991 -1336 -358 1468 -1262 522 1302 -1806 567 534 -1608 1222 466 -734 1458 -310
1854 -310 -492 738 -1279 447 581 -1030 1237 -126 -1502 1245 -880 -1082 1764 -730 -226 1459
1870 1459 -1101 -38 515 -1177 754 367 -279 1334 -741 -433 1019 -1545 314 1175 -1459 1023
1886 1023 769 -1774 780 -22 -1322 1377 -90 -272 1258 -872 -72 416 -994 965 241 -848
1902 -848 1476 -620 -1131 1231 -1456 -573 1536 -992 268 1105 -1467 237 66 -960 1116 -83
1918 -83 -85 1225 -1098 165 794 -1748 688 810 -1286 1238 108 -1605 914 -522 -841 1266 -448
1935 -448 145 741 -974 542 25 -1031 1314 -24 -427 1666 -1027 -613 1142 -1465 30 1268
1951 1268 -1173 734 460 -1269 622 -541 -710 1092 -431 311 1080 -1307 457 581 -1514 1300
1967 1300 479 -1181 1529 -176 -1200 1082 -925 -378 1048 -719 432 363 -1067 673 -487 -864
1983 -864 1498 -534 -159 1456 -1285 -27 1100 -1419 545 935 -1099 1010 38 -1080 652 -747
1999 -747 -262 1002 -756 567 634 -1414 869 0 -1282 1626 -21 -697 1593 -772 -611 826 -1108
2016 -1108 157 747 -848 767 -173 -942 924 -855 -359 1307 -955 371 1234 -1484 357 602
2032 602 -1401 965 520 -787 1100 -474 -783 592 -929 233 687 -1062 904 125 -1286 1073
2048 1073 -417 -992 1653 -454 -212 1353 -1038 -112 714 -1026 526 333 -693 940 -603 -612 795
2065 795 -1175 -25 1187 -1241 706 758 -1555 773 282 -1153 1221 196 -312 1198 -759 -228
2081 -228 430 -1076 638 431 -899 1106 -407 -1115 1043 -1030 -387 1528 -886 89 1099 -1206
2097 -1206 303 311 -884 933 82 -248 998 -849 -284 741 -1327 423 800 -1288 996 242 -1460
2114 -1460 920 -301 -811 1275 -266 -86 1003 -1021 299 235 -975 1025 -77 -747 1346 -830
2130 -830 -794 1102 -1167 -66 1142 -986 448 724 -1254 551 36 -681 1019 -231 81 960 -1060
2147 -1060 304 528 -1315 1019 383 -1157 1148 -263 -1293 1047 -602 -458 1033 -540 305 524
2163 524 -942 655 -36 -753 1178 -410 -272 1270 -1161 -383 949 -1367 366 782 -1126 619
2179 619 120 -1080 681 -411 -292 1025 -496 449 629 -1092 682 122 -1224 1189 41 -899 1285
2196 1285 -569 -776 1016 -843 -4 785 -598 596 98 -936 748 -584 -375 1340 -668 164
2212 164 1091 -1390 133 559 -1254 798 379 -978 803 -319 -677 761 -714 91 777 -809 686
2229 686 274 -1113 845 -248 -804 1483 -348 -600 1251 -967 -419 743 -1002 393 502 -762
2245 -762 680 -248 -680 720 -905 69 1199 -914 532 822 -1404 596 383 -1140 1121 73
2261 73 -614 954 -659 -428 566 -904 485 580 -825 917 -71 -1042 1046 -596 -531 1472 -704 12
2279 12 1091 -1036 119 499 -1030 726 189 -627 843 -673 -358 605 -979 364 886 -999 715
2296 715 486 -1302 867 -12 -754 1245 -258 -260 875 -823 -65 241 -988 795 131 -720 1040 -500
2314 -500 -710 1060 -837 -83 1149 -944 315 671 -1052 422 207 -778 902 -147 -181 695 -858
2331 -858 86 527 -1075 671 447 -1003 973 -130 -1001 978 -414 -457 1058 -393 160 710 -849
2348 -849 359 71 -776 953 -356 -528 1000 -853 -357 933 -1123 214 944 -873 663 332 -935
2365 -935 640 -149 -366 952 -411 84 544 -1059 286 194 -1008 838 -56 -958 1083 -422 -701
2382 -701 869 -646 -83 891 -642 330 231 -766 626 -219 -483 1070 -566 -230 911 -1016 -25 700
2400 700 -1115 503 457 -854 751 -61 -711 812 -311 -52 923 -645 388 478 -1036 680 8
2417 8 -768 1048 -259 -610 916 -824 -476 681 -807 212 552 -653 637 -38 -645 813 -503
2434 -503 -153 1029 -778 359 657 -1123 365 437 -1055 902 222 -758 741 -534 -504 641 -710
2451 -710 255 712 -755 708 20 -766 963 -300 -516 1023 -489 -365 864 -953 88 524 -794
2468 -794 467 250 -543 709 -457 -410 832 -704 209 878 -836 501 433 -1042 633 107 -760 926
2486 926 -194 -469 791 -803 -207 385 -750 531 177 -701 875 -267 -620 902 -520 -204 1065
2503 1065 -653 101 665 -945 354 207 -690 751 -184 -411 700 -695 -118 527 -946 456 585
2520 585 -885 770 140 -850 858 -274 -504 935 -469 -131 543 -826 180 251 -694 692 -95
2537 -95 -616 768 -509 -370 931 -729 73 848 -832 422 359 -803 495 -173 -383 787 -408
2554 -408 -212 569 -916 93 404 -837 708 328 -845 912 -108 -618 698 -474 -202 814 -625
2571 -625 312 299 -803 519 -229 -567 765 -433 -428 814 -820 -7 680 -834 332 560 -804 519
2589 519 84 -651 705 -271 -89 757 -576 117 208 -785 377 30 -778 819 -113 -519 849 -500
2607 -500 -290 654 -601 228 540 -595 415 74 -579 645 -381 -206 782 -647 -86 690 -958 111
2625 111 322 -756 661 55 -570 666 -182 -432 688 -526 176 715 -646 446 165 -986 654
2642 654 -175 -473 884 -444 -257 647 -735 -152 610 -750 409 372 -536 667 -100 -481 744 -507
2660 -507 104 635 -644 277 270 -909 456 68 -763 759 -105 -346 644 -517 -146 548 -557 390 559
2679 559 -577 642 -188 -622 862 -304 -311 833 -602 31 525 -826 148 284 -661 651 122 -485
2697 -485 652 -423 -92 694 -638 205 625 -766 597 298 -802 530 -65 -505 758 -477 -289
2714 -289 422 -703 30 338 -507 617 141 -543 695 -229 -478 738 -482 93 769 -747 224 260
2732 260 -880 471 11 -581 657 -239 -282 582 -591 74 422 -632 495 339 -649 672 -59 -506
2750 -506 707 -436 -204 695 -581 120 340 -685 292 0 -560 658 -68 -323 695 -648 -158 609
2768 609 -639 446 540 -687 419 100 -641 599 -144 -338 681 -483 -44 403 -641 218 191 -666
2786 -666 723 3 -587 765 -279 -320 660 -455 109 628 -600 265 87 -636 427 -231 -393 743
2804 743 -381 -119 613 -736 110 421 -670 568 296 -479 669 -202 -429 585 -255 14 602 -624
2822 -624 138 67 -774 515 -143 -643 627 -276 -346 611 -561 -31 605 -400 376 336 -606 365 -33 -460
2842 -460 605 -446 -155 608 -674 -83 320 -712 388 80 -665 590 -12 -524 712 -361 -180
2859 -180 564 -518 268 308 -575 452 64 -740 737 -318 -439 777 -541 -29 434 -698 51 338
2877 338 -619 577 46 -588 612 -304 -285 487 -527 65 584 -665 311 183 -735 572 -9 -403 738
2896 738 -351 -163 684 -430 101 454 -504 505 294 -508 639 -167 -351 563 -409 -120 646 -643
2914 -643 -37 442 -783 374 229 -467 609 -185 -303 654 -435 30 562 -622 265 414 -478 443
2932 443 10 -577 560 -321 -428 693 -445 24 424 -604 228 312 -500 673 -64 -348 582 -453
2950 -453 -267 701 -509 66 439 -629 439 105 -763 476 -188 -349 613 -440 -74 543 -497 237
2968 237 419 -632 558 86 -359 604 -318 -293 671 -388 -112 610 -547 248 185 -725 490 -32 -470
2987 -470 689 -235 -162 587 -642 101 611 -624 515 382 -617 472 -89 -614 516 -455 -132 512
3005 512 -497 5 281 -693 316 95 -512 628 -147 -340 663 -357 -45 604 -601 155 288 -627
3023 -627 393 -53 -606 539 -304 -251 623 -500 6 516 -609 309 347 -453 687 -62 -532 573 -304
3042 -304 -309 510 -488 70 456 -757 164 187 -710 447 -2 -341 545 -296 -61 520 -550 79 477 -632
3062 -632 453 213 -432 460 -177 -453 635 -437 -91 490 -616 171 280 -574 381 66 -427 728
3080 728 -150 -272 644 -448 -21 367 -521 311 186 -515 417 -102 -548 560 -348 -175 569 -538 -14
3099 -14 379 -673 356 236 -525 619 24 -366 677 -465 -234 612 -601 299 506 -598 342 -62
3117 -62 -509 554 -259 -249 629 -384 -82 549 -593 139 361 -624 486 18 -416 601 -286 -288 460 -420
3137 -420 -54 532 -632 116 157 -614 382 -7 -294 654 -304 -225 619 -527 74 422 -490 519 86 -701
3157 -701 427 -225 -442 541 -451 -126 553 -612 92 288 -517 487 135 -366 656 -149 -322 591 -467
3176 -467 -34 456 -520 249 320 -501 456 -35 -603 480 -285 -275 696 -473 36 409 -507 276 315 -490
3196 -490 534 -82 -432 610 -444 -216 557 -443 104 404 -763 325 30 -628 541 -99 -401 747
3214 747 -374 -40 578 -587 82 282 -493 332 123 -721 440 -312 -330 608 -424 -90 331 -582 201
3233 201 325 -559 504 137 -329 547 -69 -317 506 -466 -14 489 -563 282 213 -736 465 -129 -464
3252 -464 610 -327 -134 571 -442 -2 385 -534 355 276 -405 565 -147 -411 572 -412 -167 550 -473
3271 -473 191 247 -596 370 -2 -540 571 -140 -333 566 -486 11 438 -456 190 389 -506 639 -85
3290 -85 -505 520 -412 -338 525 -489 -58 469 -599 364 184 -558 468 -97 -254 675 -382 -170 527
3309 527 -563 123 363 -560 355 141 -486 488 -225 -305 527 -376 -151 557 -440 157 259 -502 381 -10
3329 -10 -463 548 -152 -371 435 -519 -182 486 -572 147 303 -607 367 -66 -379 626 -126 -208 706 -383
3349 -383 73 355 -608 275 187 -505 591 38 -436 547 -310 -254 402 -442 254 399 -499 330 7 -581
3369 -581 514 -75 -341 690 -331 -140 559 -488 209 261 -348 388 -35 -480 456 -255 -260 480 -484 -36
3389 -36 506 -577 174 343 -464 502 131 -437 554 -279 -224 404 -524 -29 373 -560 301 164 -547 393
3409 393 -108 -399 638 -360 -95 550 -579 107 400 -612 327 161 -428 442 -102 -290 370 -408 -94
3428 -94 362 -426 229 305 -610 388 -19 -530 633 -258 -197 599 -320 -37 482 -561 267 309 -425 433 -22
3449 -22 -313 405 -445 -333 491 -401 75 408 -583 265 232 -523 498 -1 -278 521 -245 -76 477 -447
3469 -447 97 248 -515 313 175 -516 428 -203 -314 501 -392 -22 483 -456 127 285 -424 370 102 -395
3489 -395 548 -289 -204 458 -442 -71 332 -478 288 333 -470 323 -54 -485 571 -197 -109 498 -379 84 347
3510 347 -574 265 129 -520 370 -61 -364 528 -387 -258 465 -406 42 479 -498 242 111 -388 456 -150
3530 -150 -194 511 -340 -39 287 -496 243 182 -458 431 6 -564 478 -138 -239 441 -304 28 334 -349
3550 -349 237 241 -521 328 -55 -300 527 -270 -153 486 -525 -20 275 -445 199 210 -355 471 -160 -292 461
3571 461 -272 32 408 -512 331 190 -549 364 -74 -418 416 -75 -429 354 -317 -36 420 -356 91 245
3591 245 -388 475 41 -364 515 -150 -199 566 -316 -5 311 -515 229 276 -394 285 -56 -361 368 -170 -171
3612 -171 323 -322 103 399 -463 338 96 -348 398 -5 -315 500 -200 -86 344 -388 48 249 -641 207
3632 207 28 -412 301 -156 -231 419 -321 29 372 -417 183 199 -429 314 49 -371 351 -84 -210 261 -375
3653 -375 57 297 -376 219 240 -481 403 1 -363 470 -184 -153 477 -413 6 408 -429 345 109 -393 273
3674 273 -222 -291 421 -287 -156 294 -393 215 279 -477 318 130 -424 337 -111 -223 370 -345 6 229 -477
3695 -477 124 191 -431 357 29 -359 447 -90 -198 480 -219 66 318 -403 179 102 -277 363 -64 -245 402
3716 402 -273 -177 357 -497 63 273 -478 264 58 -315 354 -90 -255 389 -248 -24 388 -445 120 121 -390
3737 -390 303 10 -371 300 -124 -214 380 -263 22 375 -413 24 219 -374 190 90 -274 433 -184 -16
3757 -16 384 -383 45 153 -471 177 105 -336 377 24 -334 302 -68 -153 350 -197 124 213 -339 257 25
3778 25 -285 371 -102 -159 405 -265 -68 318 -400 111 187 -291 275 58 -304 319 -232 -201 433 -218 -90
3799 -90 200 -427 120 85 -404 370 -38 -376 307 -181 -219 332 -373 9 391 -233 229 117 -302 336 -157
3820 -157 -323 434 -224 -64 341 -351 0 238 -326 279 41 -299 280 15 -275 332 -251 48 285 -296
3840 -296 61 288 -386 322 18 -386 333 -189 -194 289 -342 -66 341 -403 110 79 -326 300 -50 -316 337
3861 337 -252 -119 242 -294 3 347 -390 253 177 -436 244 4 -307 236 -283 -126 224 -277 36 262
3881 262 -397 184 120 -232 326 -203 -183 355 -212 74 268 -355 55 84 -277 179 -72 -318 418 -226 -245
3902 -245 336 -265 66 326 -344 129 106 -367 220 -21 -236 308 -178 -118 260 -289 53 282 -426 66 -30
3923 -30 -243 290 12 -297 394 -136 -102 356 -262 66 242 -378 108 151 -202 223 -109 -264 273 -328 -118
3944 -118 294 -283 123 188 -298 199 106 -416 375 -70 -212 448 -134 -7 199 -192 104 216 -312 202 -156
3965 -156 -219 314 -233 -182 332 -223 4 165 -194 164 128 -187 160 -68 -258 382 -184 2 268 -352 79
3986 79 158 -468 204 129 -166 293 -100 -231 385 -139 -36 315 -248 131 137 -360 363 19 -244 293 -136 -47
4008 -47 286 -204 -20 292 -282 148 243 -291 328 -2 -216 400 -119 -74 264 -257 174 271 -361 233 48
4029 48 -288 260 -9 -220 291 -276 -32 339 -208 63 216 -309 256 171 -285 346 -114 -178 358 -173 -36
4050 -36 277 -269 125 95 -326 189 50 -397 183 -39 -141 326 -225 23 283 -347 283 122 -317 356 -85
4071 -85 -200 357 -173 -113 300 -273 -24 254 -378 191 84 -270 281 19 -231 265 -102 -27 173 -226 113
4092 113 134 -337 239 15 -265 309 -144 -55 271 -37 -34 288 -208 176 155 -240 313 -15 -283 345 -55 -98
4114 -98 380 -231 -26 255 -287 25 73 -320 232 19 -78 273 -256 -50 247 -273 64 237 -333 155 158 -361
4136 -361 304 -56 -145 354 -207 -112 237 -283 -3 171 -315 233 19 -240 284 -165 -70 300 -211 25 299
4157 299 -238 153 116 -338 81 15 -196 250 -172 -108 215 -346 53 196 -380 164 126 -252 194 35 -234
4178 -234 268 -162 -99 305 -218 -14 112 -363 234 68 -257 182 -87 -174 393 -152 14 296 -241 242 192
4199 192 -254 249 262 -204 245 -89 -129 166 -283 31 153 -334 241 158 -285 233 0 -252 238 -121 -134
4220 -134 303 -115 -63 291 -312 113 42 -226 266 -21 -147 416 -113 -57 296 -298 116 305 -298 236 158
4241 158 -335 239 -83 -61 274 -146 -25 180 -273 98 213 -322 290 -81 -192 277 -177 -224 258 -124 15
4262 15 229 -298 194 231 -207 341 -65 -194 283 -145 -144 293 -291 54 143 -322 135 15 -253 327 -127 -168
4284 -168 134 -132 -90 230 -252 198 108 -115 253 -73 -254 215 -30 -258 322 -284 -74 144 -348 80 72
4305 72 -266 166 1 -221 259 -135 -154 372 -219 18 246 -239 202 98 -223 209 -30 -179 226 -94 -29
4326 -29 141 -166 87 124 -170 164 9 -282 252 -146 -257 320 -231 -127 211 -279 43 187 -328 157 80
4347 80 -243 312 -68 -68 309 -230 1 236 -291 213 122 -147 120 146 -268 277 -21 -71 147 -167 -69 145
4369 145 -314 97 85 -203 262 -54 -174 321 -127 -84 298 -199 44 115 -250 242 88 -247 160 -56 -212
4390 -212 188 -164 -31 220 -281 60 201 -370 167 81 -188 253 -137 -224 262 -84 -141 220 -215 42 15
4411 15 -198 186 -59 -193 215 -203 -168 271 -133 -99 243 -249 195 112 -228 189 -19 -184 266 -89 -161 159
4433 159 -196 136 155 -225 139 98 -203 235 -47 -150 310 -171 -47 294 -248 3 56 -133 251 93 -151
4454 -151 231 -132 -155 213 -198 48 179 -200 78 84 -281 275 -35 -171 344 88 -248 271 -176 50 314
4475 314 -165 218 109 -244 206 -89 -259 244 -162 -93 341 -230 -27 129 -168 121 107 -218 232 7 -216
4496 -216 313 -125 -104 131 -242 62 199 -283 167 97 -253 231 7 -75 218 7 -17 291 -159 112 56 -304
4518 -304 164 -85 -258 264 -120 -135 203 -246 89 189 -135 45 53 -225 168 -94 -122 217 -176 -40 213
4539 213 -97 109 98 -212 132 15 -192 196 -42 -161 193 -74 -112 151 -267 46 251 -200 171 109 -174
4560 -174 157 -153 -80 226 -182 -67 262 -244 -63 124 -380 107 6 -97 98 -99 -205 157 -93 37
4580 37 214 -165 182 226 -177 175 122 -161 143 -165 -200 187 -244 22 167 -175 38 97 -145 195 -72 -232
4602 -232 222 -164 3 185 -275 49 209 -170 71 50 -187 114 -146 -84 366 -222 -61 277 -269 -14 91
4623 91 -192 105 40 -239 227 -5 -128 219 -160 -38 126 -227 133 93 -174 149 -35 -133 221 -146 -115 240
4645 240 -187 -34 124 -225 108 157 -170 228 -39 -120 200 -172 -62 227 -226 174 156 -229 191 -50 -150
4666 -150 182 -18 -99 322 -140 -78 144 -125 20 151 -203 219 54 -187 417 30 -100 230 -101 -53 160
4687 160 -118 150 23 -169 296 30 -174 184 -158 -127 162 -72 49 41 -281 59 89 -280 177 26 -67 286
4709 286 -116 -18 231 -110 24 139 -220 136 -10 -213 145 -107 -64 176 -68 -9 208 -282 50 90 -131
4730 -131 84 87 -180 116 -54 -93 204 -131 67 134 -157 24 51 -220 50 -93 -145 170 -62 -15 125 -240
4752 -240 16 167 -145 110 69 -175 158 55 -104 153 -141 -75 68 -118 -21 7 -105 120 -14 -110 195 -52
4774 -52 -149 172 11 17 188 -180 40 159 -168 158 -29 -93 187 -133 -41 236 -163 47 128 -172 12 89 -210
4797 -210 95 -7 -133 201 -137 -75 180 -101 109 59 -158 232 -35 -183 165 -48 -213 150 -207 -84 139
4818 139 -86 108 30 -111 152 19 -64 186 34 -70 187 -206 -22 151 -151 24 71 -11 -16 107 -123 35
4840 35 -102 -54 190 -74 18 148 -150 86 10 -183 191 35 -46 145 -99 -138 149 -89 42 93 -127 111
4862 111 126 -121 94 -131 0 102 -103 -79 131 -168 100 104 -46 127 49 -215 63 -57 -62 77 -48 -50 152
4885 152 -136 58 89 -205 98 -119 31 133 -60 -107 106 -219 0 123 -144 94 135 -273 156 -15 -162
4906 -162 121 -60 23 149 -65 28 66 -73 101 111 -4 139 -96 -160 162 -87 -55 214 -94 44 101 -226
4928 -226 80 29 17 193 -75 -155 219 -205 -27 130 -161 44 -70 -203 93 -28 -193 127 -84 -31 171
4949 171 -157 11 99 -57 98 60 -207 119 -124 -48 176 -28 2 137 -219 49 54 -134 49 -10 -151 103
4971 103 -117 -159 116 -58 6 44 -123 -27 112 -120 148 36 -170 229 -123 -103 176 -138 32 27 -192 -1
4993 -1 54 -165 105 -99 -6 180 -40 53 256 -15 68 74 -181 91 104 -195 63 -70 -187 203 4 54 47 7
5017 7 136 129 -28 209 102 -51 114 4 -48 82 -46 37 76 -127 71 94 -132 96 -25 -77 61 -32 -73 107
5041 107 -86 6 34 -139 86 144 -238 29 -46 -36 48 -89 -94 108 -154 -4 -12 -71 45 12 -76 105 177 -2 34
5066 34 -114 -141 13 -259 15 118 -125 108 -11 -161 14 -71 -55 38 -133 59 112 -74 17 82 -155 179 83
5089 83 -45 238 -18 -49 178 -9 -54 69 -90 96 106 -71 140 -62 -96 75 -54 -114 48 -66 -57 90 -228
5112 -228 93 5 -87 138 54 -66 -37 -6 -71 -51 -182 16 -56 -119 5 7 -129 174 95 -15 65 -75 -17 24 -74
5137 -74 125 -16 -222 76 58 -52 68 -51 -133 87 -37 15 149 -113 34 15 -39 56 -7 -23 152 -39 -129
5160 -129 124 -189 37 30 -48 128 -56 -10 183 -83 -38 142 -134 -28 67 -196 116 7 -79 102 -94 -11 159
5183 159 -44 -63 26 -173 -51 98 -160 -47 36 -164 76 -20 -67 25 -108 -4 186 -98 -110 54 -56 115
5205 115 10 -17 182 -89 58 113 -18 -102 166 -178 -52 113 -105 54 111 -149 153 51 52 218 -52 -81
5227 -81 67 -129 -52 52 -85 121 41 -173 148 -19 -64 99 22 -16 -4 -173 12 -42 -94 109 44 -77 146
5250 146 -95 22 238 -188 -56 5 -84 120 19 -212 78 15 -88 31 30 14 22 -84 45 164 -104 28 75
5273 75 -38 3 9 -109 116 -38 73 119 -94 42 126 -41 60 34 -178 64 -120 -46 107 -62 -46 81 -81
5296 -81 99 41 -137 50 -61 -131 75 -67 -122 111 -104 -18 36 -68 26 145 -101 62 87 -93 70 -40 50
5319 50 49 -65 -106 37 -41 87 110 -107 59 4 2 238 -86 -1 83 -17 51 49 -92 12 -48 -69 188 -23 53 46
5345 46 -17 -29 48 -110 91 -11 -73 84 -78 11 73 16 -57 79 -17 58 31 -149 10 58 -62 97 32 -135 55
5370 55 -131 -47 204 -74 -26 26 -118 43 110 24 122 42 -20 210 51 -79 145 -22 75 14 -66 60 52 -164 -16
5395 -16 -5 61 120 -73 -34 12 -92 41 38 -5 206 -22 -138 115 -54 -80 65 -74 24 60 -61 84 55 -99
5419 -99 77 -84 -60 10 -47 92 50 -84 32 115 -112 -46 65 -254 84 22 31 78 -48 -53 43 -182 -37 31 -40
5444 -40 81 47 -34 132 -42 36 104 -4 -25 123 -38 97 103 -87 172 -35 -32 55 -27 -29 85 13 -103 57 -173
5469 -173 81 -73 -196 38 6 4 6 -136 -1 12 -45 84 43 -158 68 -7 -111 78 -138 -108 2 32 47 178
5493 178 15 62 47 6 163 41 -39 179 -20 -60 126 -81 2 100 -7 45 102 -69 -114 62 -54 98 -67
5516 -67 -93 59 -118 31 127 -145 56 91 -33 51 -74 58 167 12 7 121 -145 80 127 32 33 23 -13 78 -8
5541 -8 -104 116 36 -33 89 0 15 91 -87 9 -5 -79 58 -54 -100 104 -82 10 235 -87 -12 164 -230 21 -27
5566 -27 0 118 68 46 72 -17 -1 146 -108 27 66 -95 170 112 88 95 68 -116 -16 -90 -59 25 -172 64 84 -5
5592 -5 82 -20 20 138 -7 -23 37 -96 -19 50 -55 125 9 -51 144 7 -46 118 -157 -47 70 -9 25 -145
5616 -145 -106 23 40 12 140 -48 -84 -2 12 88 -151 -129 -3 23 6 -79 20 23 16 -7 -4 9 -1 79 -30 -108 -4 17
5644 17 -65 96 -74 -120 145 -27 16 74 -63 123 -21 -20 -44 -87 -120 72 -44 -137 20 68 23 74 -71 25 52
5669 52 -39 100 45 33 66 -65 -107 72 -96 -18 108 -97 -7 83 -128 73 -25 -73 15 -99 -3 51 5 97 16 29
5695 29 87 99 -12 33 -119 -136 6 0 -26 89 -21 24 51 -92 5 -17 -65 122 24 -32 145 -37 75 87 -104
5720 -104 73 42 -50 97 39 -16 37 133 -52 25 -30 -26 -42 -68 44 120 -67 51 16 3 83 -59 111 -66 -16 48
5746 48 30 122 73 -90 -105 -1 44 20 41 -63 -19 68 -36 -49 51 -79 -29 52 -48 135 27 82 -6 -79 71
5771 71 84 -31 89 105 -9 28 15 -114 -55 -4 -24 36 -84 -26 -13 52 147 -52 -25 70 39 -87 -3 -9 63 18 -7
5798 -7 -63 -47 92 -47 -9 -35 50 10 -62 -13 -21 -13 -18 -125 21 34 -49 -51 87 13 25 -13 -13 -12 10 44 20 -20 -7 85 67
5829 67 -11 9 46 43 -116 -2 57 -71 -8 37 18 -20 45 1 62 49 -143 12 -27 51 128 -65 1 10 34 1 56 26
5857 26 45 -10 -71 90 -24 -31 171 83 35 30 -60 74 104 -57 17 20 -7 -64 141 40 27 34 57 53 -105 71 -89 -104
5885 -104 175 4 -77 -55 5 -43 73 6 -48 56 -52 -56 17 -21 73 -19 -41 31 -24 8 92 32 11 13 -69 55 -130
5912 -130 -9 89 55 -25 43 -1 -45 -40 -82 88 66 -16 -23 31 -12 38 -11 -2 32 -83 74 19 23 -5 28 -59 156 -2 25
5941 25 59 31 -125 -25 -55 83 0 18 47 -28 -44 96 -17 -41 31 -9 71 41 51 4 -69 -164 10 -63 -9 127 83
5968 83 2 178 -17 34 79 -76 2 40 73 -17 53 -1 77 77 52 67 -72 12 -8 4 -81 22 31 0 -80 -43 16 17 92
5997 92 109 81 -105 138 -60 110 39 -10 103 -39 -45 -69 -25 30 -1 70 130 -50 3 30 2 82 23 -76 7 -27 -97
6024 -97 -44 124 -167 -19 25 15 -34 10 4 -30 -5 -25 -20 -1 35 51 -100 -74 65 -154 66 35 -25 -72 6 -2 28 38
6052 38 70 -49 -12 63 -4 -22 53 -44 13 -29 -2 73 -105 50 64 10 -49 46 -36 53 66 -11 139 57 0 0 32 -63 76
6081 76 -24 -37 25 51 -99 -1 32 -57 101 -53 100 9 -103 9 -45 64 107 0 -19 29 -24 6 -18 -26 -43 -150
6107 -150 7 -164 43 -46 -14 88 -19 55 -46 -14 2 17 22 -100 -94 34 34 -19 81 81 -38 -4 20 -7 -105 30
6133 30 -34 32 -76 63 36 5 7 -18 -74 -60 23 52 45 2 -22 73 -4 -48 106 31 12 -40 -39 -8 -14 74 -29 98 71 11
6163 11 -38 -105 63 32 54 61 -15 -7 66 -69 -2 10 43 17 33 45 -30 23 68 10 87 3 40 29 38 14 -19 71 -6 34 -5
6194 -5 129 32 -35 103 92 22 81 41 -68 -49 -30 -31 -20 -11 28 28 -103 13 53 -4 108 32 37 -23 59 63 -76 60 -18
6223 -18 26 -62 5 -33 -68 3 -24 -2 59 9 -52 118 -10 2 -45 -41 77 -52 -36 -94 -65 -16 -11 22 102 37 12 91 -77
6252 -77 -68 106 -47 -83 -110 47 29 43 11 130 11 0 5 1 -14 43 44 -40 122 -129 4 -1 -162 68 -102 22 -53
6279 -53 67 -16 3 -128 5 9 66 -41 -87 63 20 -83 2 53 -4 30 41 -10 -44 -3 -2 91 51 -55 -41 -19 -102 22
6307 22 40 -63 124 86 5 64 -7 -26 58 -80 13 107 134 -2 113 8 104 -38 35 -14 32 119 25 34 -69 -109 27
6334 27 17 138 -38 -18 43 22 73 7 12 -6 -29 -3 34 -36 -15 -57 -28 92 28 20 -33 -52 -4 -55 -40 22 83 41 66 17
6364 17 -115 -61 75 -79 2 -4 6 26 44 -4 18 52 -61 14 -83 28 -84 -50 69 -59 -95 86 65 72 127 -55
6390 -55 24 -66 14 13 120 48 -52 0 10 -103 -30 -47 -20 30 70 -46 15 37 -20 5 -103 26 -13 60 -32 16 -29 -85
6418 -85 82 -35 -1 -128 -121 21 -63 -16 -60 17 24 81 -108 -5 -11 -30 -12 -15 -119 -66 -84 -65 -4 -24 26 44 40 -22 62
6447 62 -24 -104 -43 -57 27 61 28 -13 33 29 18 -85 61 -14 30 9 86 29 14 -17 -22 63 -107 -9 48 -25 -77 71 12
6476 12 -56 30 -9 -47 78 -71 -35 5 -67 80 5 -6 18 -68 -13 98 64 13 92 30 -45 35 -28 63 -28 22 0 75
6504 75 63 64 -37 10 16 -1 -7 32 69 10 27 -138 97 75 -64 -30 55 -29 -45 26 107 66 -48 33 -44 -23 -69 -63 -85 -22
6534 -22 5 29 -6 0 -46 31 -6 -4 34 9 -19 63 -9 -15 31 55 -1 -33 84 -50 -27 -22 47 27 -20 103 35 -49 22 154
6564 154 -47 -34 -38 -27 -31 -78 -34 -23 -46 11 77 129 2 61 143 9 5 59 -90 -56 -70 -72 -19 44 15 4 -4 63 -48 -16
6594 -16 -67 8 -39 44 -59 -59 -75 -61 -58 -36 -56 11 -14 -55 56 94 -46 15 -42 -39 97 -54 -119 161 34 34 18 -85
6622 -85 -45 -12 -15 104 29 -31 33 0 -10 -15 -11 46 56 12 71 -29 7 21 36 114 17 -32 86 -13 -67 -93 64 9 48 -99
6652 -99 -12 33 -58 86 -93 -54 93 19 -46 -28 116 -65 219 100 10 97 -62 76 66 84 -91 -20 -5 46 -75
6677 -75 19 -26 73 99 -24 -57 40 72 -18 48 -8 28 14 11 -140 -21 29 -128 87 -27 -34 -16 -61 -88 -11 50 92 -14
6705 -14 -29 65 32 -2 33 144 -58 -61 115 -87 -86 -43 -44 -2 -10 20 -3 -2 -25 -53 40 32 -50 19 43 5 43 99 -21 10 89
6736 89 65 57 -10 79 -7 -23 70 24 -20 31 62 -40 -20 -98 -3 -1 -73 -94 122 41 28 -74 -22 -54 -7 -62 -82 60 2
6765 2 51 -72 99 -40 -69 -8 8 -35 125 -24 -89 -36 -91 -37 -3 4 82 7 -3 -69 -154 -9 -41 -62 -10 22 -50 18
6793 18 -73 -92 19 25 8 62 4 -104 -41 -18 -36 -55 -5 52 63 -66 119 -36 -60 -69 -79 -58 74 -22 -6 6 96 26
6821 26 83 83 79 -5 -61 -81 88 83 32 22 -4 -38 21 -75 -28 -108 3 15 60 -83 -155 -37 17 52 13 -77 -37 -24 15 31
6851 31 4 -53 -68 -28 0 11 -26 22 -15 107 -77 8 -43 -25 60 -7 35 -9 -84 -17 -21 15 108 83 -37 -56 42 44 17 -11
6881 -11 47 45 -25 -11 1 108 24 -7 69 -63 -79 48 138 -69 47 204 0 14 48 12 -12 -56 -58 3 8 60 61 25 -17
6910 -17 66 55 -77 58 -108 -2 8 64 69 -114 -10 86 -124 -61 68 128 3 41 -49 19 103 -99 -74 93 -32
6935 -32 104 -6 -35 11 -31 -10 32 -128 -72 54 -8 -3 39 35 26 11 -59 20 53 86 -57 -61 -124 23 16 58 57 -62 -39 59
6965 59 -80 -36 23 33 119 -90 62 52 93 -50 50 5 7 -50 75 102 78 96 58 -77 91 18 76 100 9 70 70
6992 70 31 20 54 -48 66 11 14 -17 71 -38 82 41 27 91 -19 -4 -11 45 89 42 19 -5 -25 16 -33 8 73 -46
7020 -46 46 -119 -94 -35 -78 -28 77 -4 -22 54 -43 14 78 2 -129 41 16 8 56 150 33 -103 -58 0 73 42 -36 -25
7048 -25 -45 104 79 12 -92 -42 108 96 56 40 19 -7 53 -6 -78 -6 55 25 -2 -78 -19 -72 1 17 30 -87 -27 67
7076 67 50 167 8 -77 -48 -90 59 -34 -63 -54 36 40 9 185 48 -82 5 62 -19 31 -55 -10 -57 -32 58 -77 14 -43
7104 -43 71 -8 -85 -49 -1 -6 -11 35 -64 95 -44 -12 25 -15 8 -55 58 -55 -58 -118 30 -39 -28 65 72 -64 10 -75 52
7133 52 71 31 121 -39 76 111 92 98 81 -92 -27 92 34 14 3 -51 -24 -104 41 96 -34 -7 165 -11 -37 -137
7159 -137 -88 29 78 21 -48 109 64 -44 -52 1 60 35 28 -5 119 46 24 16 13 50 -10 -52 -49 -79 -28 -12 -45 35 -52 -41
7189 -41 134 2 74 11 142 75 -62 -59 -20 -14 -105 -54 103 14 -48 -105 47 -1 44 41 -49 -67 -83 80 62 81 -17 -100
7217 -100 67 -60 5 -46 36 -60 -2 48 35 112 -79 -18 -63 36 -7 34 33 4 -77 -106 -4 58 -4 -110 27 16 -11
7244 -11 -74 10 -35 64 35 51 32 32 -16 84 -110 -89 44 -73 -33 22 -85 8 27 5 -3 13 -13 66 6 -2 -2 -95 10
7273 10 -28 -50 -59 -4 43 54 -99 -58 78 -70 -17 61 -17 -111 -194 12 -14 -152 79 21 16 -138 28 -12 -75 -118 42
7300 42 -139 -54 -33 50 37 95 18 58 51 11 10 -17 5 5 -59 -56 -83 32 182 -90 -57 -49 41 148 59 81 13 17 6 -17 -80
7331 -80 9 6 -9 2 -84 -167 224 -47 -4 75 61 32 70 -33 85 14 -58 -5 -79 -7 -45 30 33 -20 26 36 -114 19
7359 19 -53 -21 -69 -2 -113 19 -108 -79 55 -2 -5 -22 -49 -65 80 12 -108 112 40 -30 -69 -42 -14 -41 6 58 -30
7386 -30 21 -16 -104 120 -50 -41 57 -64 67 40 -36 26 -40 -108 17 -69 23 115 102 -51 167 -68 40 11 -70 27
7412 27 -87 -55 -10 -68 -53 -57 -45 -13 -73 25 -40 -47 93 18 39 -47 -14 -81 -80 -35 -147 35 29 -7 -55 92 19 66 60 -33
7442 -33 12 -73 -50 -11 32 -42 -11 44 -12 28 46 22 -45 -53 -19 96 17 54 10 -14 -44 -31 -82 49 -101 -54 8 3 67 9
7472 9 8 81 -16 25 -6 49 121 80 27 79 -5 -54 44 -48 -7 11 43 59 -55 59 -23 -20 12 82 51 -89 32 44 -46 58
7502 58 -23 -62 -52 -54 -63 -86 -47 63 -51 26 26 -13 -30 -44 17 18 55 -69 18 23 -16 25 99 -97 56 9 24 -15 -17 -28 58
7533 58 -50 -90 87 -70 -114 98 -100 85 -55 99 88 -3 20 60 88 -85 -42 -11 55 47 24 -85 -30 -82 23
7558 23 -60 -59 14 12 6 6 78 35 -152 -99 80 60 20 9 29 81 15 -88 -46 34 -130 -41 8 -71 -132 -18 12 -3 -156
7587 -156 0 -107 -30 51 21 -20 22 -44 -39 48 44 -125 41 38 -14 13 -6 -43 -65 -84 -46 -90 36 47 -17 -95 82 52
7615 52 34 49 14 -54 -34 57 -28 -24 -66 43 -21 -49 -1 -72 49 71 -24 119 24 -152 35 -12 -34 15 -86 -39 35 100
7643 100 -26 24 11 13 26 -37 19 29 -27 58 -1 97 12 17 59 -66 3 112 -31 -80 61 -12 -71 -20 -64 23 -147 -47
7671 -47 43 -7 44 43 111 -124 30 -20 22 -25 -56 -3 7 11 3 -4 -57 24 61 -87 76 51 -92 27 -111 23 6 -90
7699 -90 -30 61 24 82 9 120 -47 40 42 15 -152 32 53 -93 -69 28 -34 -73 55 52 99 -101 -159 42 23 -19 81
7726 81 97 -5 -2 5 -46 53 -78 91 -84 -13 3 34 19 37 -124 -7 95 -20 51 -53 -74 24 -66 -10 236 0
7752 0 25 24 25 -73 28 18 48 -45 26 20 -39 51 39 -132 57 12 60 140 -15 -40 -36 -39 -89 17 -70 9 71 -21 119 -10
7782 -10 -26 109 -25 -122 81 -39 -105 16 -34 135 92 -62 5 6 11 4 76 48 -49 -30 -41 -119 20 2 53 15 94 -65
7810 -65 120 -7 -48 52 65 -97 84 23 -71 61 27 -12 26 5 86 -55 -87 22 49 72 166 -18 102 73 54
7835 54 -44 21 -77 40 -116 -131 -177 -30 -52 25 74 43 -51 -26 24 33 -7 -44 83 -93 113 -4 62 50 106 40 -2
7862 -2 17 -76 -33 -47 13 21 -13 -45 40 51 109 74 -43 49 -13 44 74 -37 103 -71 -28 33 -53 63 119 22 96 27 -86
7891 -86 31 28 -58 5 -9 -49 5 -76 -75 -74 -71 -73 46 -49 -60 42 39 39 78 42 37 -76 38 98 19 -81 -70 -100 -45 119 -13
7922 -13 3 -23 -22 -11 66 -20 1 9 -67 -23 -33 -20 49 -78 47 65 97 64 -41 2 -39 -5 19 64 -39 -20 -38 -93 160
7951 160 -46 66 8 -46 58 -50 -44 -84 66 -77 -5 -53 -65 -1 -27 -11 40 26 -36 43 -81 -101 32 27 95 -22
7977 -22 -110 54 56 -111 -77 -11 -68 91 24 -33 8 2 61 -16 -48 -66 -71 27 3 -137 -33 -21 -156 77 -41 69 24
8004 24 -29 52 81 18 54 25 -120 -2 39 -40 -44 95 -117 17 -83 57 -14 -65 -43 -13 -57 72 -10 -32 29 -73
8030 -73 -182 35 -20 -81 139 -54 -14 46 30 29 -42 -86 -108 -118 -20 -63 30 -29 171 -30 -2 -3 6 -61 -98 -53 12 120
8058 120 8 0 14 -15 62 23 -91 -18 -46 26 -1 -107 -22 -7 -27 46 -85 -91 57 -33 62 -105 11 -16 -84 0 71
8085 71 48 -44 94 -100 6 104 -56 -15 31 33 7 -33 -41 -58 -53 39 42 -18 -102 43 -21 -37 106 85 -14 32 69 50 91
8114 91 62 -31 -3 46 70 -1 -45 32 -17 121 32 -4 36 -18 0 -7 18 -28 29 -106 60 -19 -25 56 26 80 40 -23 -26 -19 9
8145 9 143 -52 -43 82 -51 56 11 -119 -85 71 -40 45 -9 52 -2 16 28 18 -85 -114 99 -57 -28 -40 -7 7
8171 7 105 107 25 -73 -57 82 -11 -13 72 -44 55 10 -44 -73 34 25 -22 29 44 95
8191I5
$$ Imaginary data points
##PAGE= N=2
##DATA TABLE= (X++(I..I)), XYDATA
0 0 0 0 0 0 0 0 0 0 0 0 -5 8 -8 8 -16 16 -24 24 -32 38 -42 56 -64 72 -88 102 -118 136 -154 177 -204 232 -264
33 -264 299 -338 381 -427 478 -535 595 -664 737 -817 905 -1002 1107 -1221 1347 -1484 1635
50 1635 -1802 1983 -2186 2411 -2667 2951 -3276 3648 -4082 4592 -5205 5953 -6898 8126 -9797
65 -9797 12211 -16021 22926 -39373 160304 7754 -289101 157266 97368 -207520 2623
76 2623 228173 -94280 -175016 150259 126897 -186077 -30838 132802 -91205 -77122 170556
87 170556 44898 -135754 -30518 80684 -8013 -66734 55153 71584 -102046 -19275 139562
98 139562 -40279 -136263 60106 63861 -73553 17019 113832 -65123 -133261 96945 73239
109 73239 -143157 33834 143916 -123273 -56012 174344 -47765 -165726 97715 96744 -116550
120 -116550 276 148596 -74112 -150647 120753 72261 -157271 29829 144297 -89771
130 -89771 -72456 106344 3315 -111886 13174 104494 -20474 -74514 74056 45711 -120077
141 -120077 -12690 107758 -34383 -71165 76849 58917 -95182 -45479 102233 -17759
151 -17759 -117166 92836 92336 -129233 -4387 125549 -81014 -96063 105207 42580 -93431
162 -93431 29078 97678 -81157 -82311 105518 10464 -109878 67023 75543 -93357 -6947
173 -6947 77771 -49004 -65968 49921 49123 -37755 -9505 58558 -29117 -71202 51273 39320
185 39320 -58496 5672 56548 -14682 -40610 16526 24673 -54428 -25624 89885 7003 -79430
197 -79430 45999 34819 -90828 3453 84802 -31567 -53933 63380 41150 -79332 -14262
208 -14262 75493 -49371 -57932 102632 23184 -93524 27124 45950 -67035 -18703 64940
219 64940 2323 -50850 26441 52044 -53315 -39287 57578 -8447 -45251 52824 34413 -46765
231 -46765 -16645 26256 -3286 -35863 14006 49060 -30240 -28486 54942 -12367 -64591 30618
243 30618 34595 -35011 1502 47596 -8434 -53687 16718 39786 -49630 -9756 75190 -20915
255 -20915 -50475 49427 4712 -62406 12329 44649 -17508 -22410 36946 13657 -57592 -670
267 -670 47784 -33710 -18121 59217 -1855 -40709 16362 13502 -27700 -13438 32251 18020 -32149
280 -32149 6798 32902 -40972 -26251 41253 -2693 -24925 26754 21336 -24609 -21654 20903
292 20903 6317 -35855 19808 45171 -34455 -14802 40339 -23381 -36327 29186 18352 -21307
304 -21307 131 29408 -9485 -41676 17759 23581 -38373 9444 47341 -24531 -21907 25927
316 25927 -5953 -26220 8065 27084 -2819 -19002 21987 8433 -43158 3093 29514 -22279
328 -22279 -3337 31646 -4201 -22643 -641 11475 -9471 -15925 28336 17341 -30612 9285
340 9285 21820 -33970 -10702 28382 -1255 -11638 12792 14025 -18814 -21996 20876 3026 -28952
353 -28952 24358 25843 -30612 -1187 20233 -20259 -14238 18221 13987 -9011 -3770 20440 -9190
366 -9190 -30539 18021 11297 -24371 14733 22353 -17487 -10615 5625 -1659 -11001 -311 23860
379 23860 177 -19144 18452 3547 -30766 7484 18042 -10525 1868 15494 117 -18520
391 -18520 -8110 16140 -7789 -14538 28061 5172 -26106 13075 8174 -25276 -866 17107
403 17107 2628 -4318 6452 9964 -18399 -14346 21570 -2595 -15634 22193 6218 -18422 3538
416 3538 2844 -10677 -6364 6790 15703 -4723 -7583 14342 -10741 -19439 17616 6784 -11341
429 -11341 9631 9821 -5816 -10420 -530 6762 -12945 -1283 26808 -7110 -17214 16655 -6081
442 -6081 -21029 12037 10758 -5937 597 9572 1858 -16951 -1825 14766 -11963 -2091 24275
455 24275 -6105 -13052 9256 -5347 -10712 2764 6818 6782 -4626 -581 7441 -14883 -7988 15826
469 15826 -2835 -4511 13340 2225 -6323 -4434 -121 983 -9722 7530 19488 -13254 -7469
482 -7469 13442 -15137 -10988 17498 1207 -8407 6121 8141 -4173 -12062 4221 4437 -13844
495 -13844 11721 20718 -15582 -6417 9142 -11377 -3635 10081 1150 -1580 -2179 5146 3611 -14736
509 -14736 -2861 7494 -6241 6850 13893 -6159 -8109 -3315 1549 4340 -4929 6001 8480
522 8480 -12655 4047 11771 -18760 -8012 12328 -1442 1030 9590 -1134 -11963 -7628 10227
535 10227 3001 -10333 11610 6819 -14711 8679 7740 -18623 -1896 9419 376 4478 2815
548 2815 -2375 -7689 -8666 8296 4136 -8015 7276 4392 -6863 3643 -990 -6424 -691 -861
562 -861 10781 7235 -10354 2818 1101 -15115 5946 10760 -7945 -37 7235 -1041 -6627 -3719
576 -3719 4652 -5140 -4954 18419 2519 -14863 8373 305 -14899 7908 8333 -5061 2179 3855
590 3855 -524 -5851 -4957 4706 -3089 -2696 12575 -702 -7921 3747 -4774 -4408 4832 -24 5573
605 5573 2958 -5807 4635 -2393 -10420 6868 3471 -4688 6473 3033 -4678 -4678 -2412 2756 -4334
620 -4334 -342 14237 -4377 -9185 10597 -5501 -11295 11272 3390 -4914 5697 3465 -3280 -6075
634 -6075 -1041 4057 -5432 2096 12061 -6632 -5355 5833 -7545 -3492 6541 -653 3038 2148
648 2148 -2395 3081 -5244 -5426 6926 -722 -478 8083 -1502 -4411 -2033 -2395 1874 -2773 1759 9512
664 9512 -6651 -3595 8422 -9639 -6143 10981 -954 -1902 7358 267 -4457 -4134 1285 2584
678 2584 -5323 5601 8721 -9449 -829 5270 -10376 -1191 7058 -1967 2409 2171 -1477 209 -5963
693 -5963 -663 5563 -3151 3784 6973 -5265 -1708 -485 -3547 1942 -804 2453 5655 -6223 174
708 174 4403 -10849 -1017 8403 -3586 1910 6198 -3033 -3756 -2078 1858 1484 -3544 6891 4370
723 4370 -8926 3567 2377 -11395 2101 5786 -2906 3445 1923 -2716 -2098 -4708 2727 2802 -3697
738 -3697 6553 3406 -6306 2416 -560 -5409 2568 745 2736 3593 -4905 1142 -174 -9049 3892
753 3892 4796 -4768 4429 3398 -4470 -1129 -1582 530 507 -1346 7717 1505 -7243 5052 -1024 -9242
769 -9242 5502 3527 -3225 4043 401 -3066 -2314 -3369 3183 60 -2371 7765 -95 -5573 4169
784 4169 -2812 -4965 4630 1150 2224 2576 -3827 906 -2357 -5726 5567 561 -3738 6162 21
799 21 -3950 905 -3035 -560 1091 511 7092 -996 -5298 4791 -3720 -5252 7567 -97 -2830
814 -2830 4756 -615 -2079 -1781 -3123 2057 -1077 623 7722 -3633 -4698 4195 -4292 -2037 5698
829 5698 -802 1007 2312 -1699 1498 -3715 -3813 4867 -1379 24 6610 -3783 -3859 1230 -3314 740
845 740 1476 -229 4574 -1810 -1910 4386 -5777 -2951 6732 -1541 707 4935 -3279 -2123 -1193 -1861
861 -1861 2579 -1766 1062 5286 -4852 -1223 3534 -6680 -474 5356 -1470 2600 1910 -2556 420
876 420 -3439 -600 4386 -2723 1917 4873 -5144 -825 1072 -4785 1352 1551 199 3776 -2537
891 -2537 -1217 2087 -5925 644 5331 -2929 2657 3758 -3970 -337 -1115 -1893 2258 -1498 2420 3663
907 3663 -5495 513 1599 -6860 2140 3927 -2445 3125 981 -2471 447 -3209 794 3098 -2534
922 -2534 4118 2950 -5643 1209 -299 -4710 2924 979 -95 2979 -2920 -415 630 -5351 2573
937 2573 3131 -2944 4502 1744 -4308 935 -1604 -1099 2778 -1045 2889 1654 -4826 2141 -540 -6119
953 -6119 3626 1714 -2044 4177 -605 -2768 109 -2860 1846 2192 -1961 4491 421 -4410 3081
968 3081 -1842 -3941 3753 -3 695 2825 -3348 -489 -977 -3935 4058 951 -2572 4703 -743 -2991
984 -2991 2187 -2757 -867 2537 -544 3787 603 -4546 2003 -2310 -3514 5164 -460 -1997 3761
999 3761 -1948 -1362 468 -3318 1547 858 -395 5208 -1432 -3632 2896 -2939 -1266 4781 -1314 585
1015 585 2014 -2893 712 -1491 -3500 3441 -490 -455 4939 -2979 -2586 1867 -3002 1154 2671 -1216
1031 -1216 3084 -447 -2508 2667 -3282 -2258 4596 -1511 484 3603 -3619 -1125 98 -2725 2602
1046 2602 254 -391 4099 -2741 -1406 2860 -4186 -122 4097 -1611 2104 1525 -3265 742 -2054
1061 -2054 -1655 3652 -1688 470 3640 -4095 -698 1402 -3681 1732 2029 -867 3239 -1208 -1797 1980
1077 1980 -3605 98 3964 -2365 1752 2272 -4216 205 -553 -2459 2802 -498 274 3195 -3354 -478
1093 -478 1707 -4204 1857 3086 -1832 2910 451 -2785 1268 -2285 -349 3210 -2104 1676 2294
1108 2294 -4463 654 186 -3707 2762 1020 -646 2987 -1969 -1120 1331 -3581 1795 2884 -2316
1123 -2316 3096 920 -3792 1409 -1415 -2022 2908 -981 802 2204 -3642 407 339 -3826 2910 1630
1139 1630 -1472 3448 -903 -2023 1476 -2404 697 2625 -2034 2549 965 -4096 1710 -941 -3135
1154 -3135 3286 24 -256 2516 -2596 -489 385 -3016 2895 1289 -1969 3711 -617 -2984 2108
1169 2108 -2134 -1013 3076 -1144 1502 1154 -3638 877 -901 -2663 3556 -22 -991 3165 -1960
1184 -1960 -1011 1373 -2950 1532 1977 -1422 3331 -339 -3444 1980 -1815 -1583 3532 -1006 181 1694
1200 1694 -2696 415 -581 -2661 3134 185 -911 3929 -2061 -2023 2223 -2518 286 2913 -1409 1748
1216 1748 377 -2952 1383 -1733 -1670 3355 -1284 211 2729 -3063 -335 834 -2758 2506 1196
1231 1196 -1212 3161 -1329 -2232 2175 -2410 -194 3076 -1674 1062 925 -2969 755 -1326 -1799 3153
1247 3153 -835 -9 3168 -3110 -894 1982 -2620 1437 2125 -1374 2042 -187 -1901 1267 -2284
1262 -2284 -375 2819 -1606 1366 1571 -3757 616 137 -2285 2833 141 -753 2807 -1690 -933 1468
1278 1468 -2815 943 2367 -1374 2144 -176 -2859 1122 -1674 -617 2937 -1919 475 2259 -3343
1293 -3343 339 851 -2926 2056 1600 -839 2394 -1279 -1539 1248 -2243 1022 2042 -2238 1916 712
1309 712 -3344 1463 -962 -2057 2857 -381 -146 2127 -2604 -250 991 -2291 2105 1307 -1537 2386
1325 2386 -830 -1931 1510 -2185 -146 2474 -1768 1361 996 -3476 941 -34 -2328 2708 363
1340 363 -674 2082 -1691 -474 826 -2250 1826 1282 -1781 2761 -550 -2758 1846 -1527 -1158 2899
1356 2899 -1004 279 1424 -2558 346 80 -1965 2673 309 -662 2615 -1768 -1150 1545 -2227 992
1372 992 1978 -1847 1759 101 -2997 1319 -985 -1578 2839 -427 66 1629 -2172 264 323 -1919
1388 -1919 2476 649 -1223 2724 -1486 -1996 1955 -1975 -234 2526 -1306 827 641 -2498 803
1403 803 -735 -1099 2679 -723 -35 2255 -2324 -82 1280 -2403 1657 1435 -1492 2122 -632 -2354
1419 -2354 1423 -1429 -418 2304 -1330 562 961 -2290 855 -393 -1512 2754 -162 -312 2625
1434 2625 -2320 -1023 1832 -2096 902 1811 -1606 1053 -118 -1822 978 -1383 -479 2280 -1201
1449 -1201 793 1462 -2920 535 675 -2030 2466 759 -1253 2181 -1176 -1289 1114 -1786 314 1680
1465 1680 -1242 1306 -59 -2385 1020 -972 -672 2733 -1103 56 2173 -2339 38 1309 -2219
1480 -2219 1485 1439 -1104 1528 -918 -1532 847 -1582 494 1777 -1854 1228 524 -2684 1347 -93
1496 -93 -1838 2615 191 -595 2111 -1698 -724 1059 -1488 1257 1149 -1350 1457 -746 -1730 1297
1512 1297 -1657 -325 2481 -1377 781 1475 -2670 582 631 -1776 2060 599 -762 1535 -1203 -732
1528 -732 859 -1701 1040 1044 -1628 1738 -453 -2507 1598 -931 -1181 2733 -526 -270 1589 -1835
1544 -1835 56 672 -1215 1707 333 -687 1757 -1378 -1054 1267 -2027 428 1981 -1652 1083
1559 1083 534 -2512 1142 87 -1138 2018 -153 -410 1455 -1476 -8 337 -1451 1678 464 -1089
1575 -1089 1979 -1310 -2037 1811 -1534 -493 2370 -1016 165 1035 -1803 408 15 -729 1917 -312
1591 -312 -50 1532 -2055 -193 1195 -2109 1263 1312 -1869 1387 -169 -2110 1168 -659 -715 1988
1607 1988 -506 276 986 -1625 526 -35 -1111 2070 -183 -812 2030 -1676 -1192 1484 -1784 239
1623 239 1866 -1427 489 411 -1734 664 -359 -292 1688 -644 556 1114 -2159 590 812 -1851 1826
1640 1826 633 -1637 1620 -717 -1663 1142 -999 -176 1460 -820 692 188 -1605 981 -480 -531
1656 -531 2309 -743 -107 1851 -2081 -335 1343 -1840 901 1311 -1420 797 -321 -1343 634 -835
1672 -835 237 1406 -1074 1059 565 -2207 1166 221 -1615 2287 115 -1161 1599 -1150 -997 1048
1688 1048 -1050 385 1185 -951 764 -439 -1323 1148 -971 -240 2117 -1220 338 1387 -2153 403
1704 403 923 -1694 1362 719 -1070 954 -780 -1071 591 -1089 738 903 -1171 1303 -109 -2013
1720 -2013 1592 -550 -1113 2463 -367 -610 1557 -1360 -331 801 -1023 975 298 -876 1122 -980
1736 -980 -937 1210 -1488 369 1771 -1508 770 919 -1996 808 569 -1192 1714 200 -607 881
1752 881 -1154 -304 358 -1266 946 441 -1206 1520 -747 -1540 1519 -931 -577 2216 -870 -91 1157
1769 1157 -1373 225 496 -973 1302 -3 -481 1083 -1568 -288 1009 -1693 875 1227 -1616 982
1785 982 328 -1877 1113 74 -707 1667 -155 -287 744 -1342 231 225 -1040 1557 -221 -991 1461
1802 1461 -1282 -1106 1452 -1370 -29 1815 -1035 242 748 -1292 582 62 -378 1418 -441 38
1818 38 889 -1752 285 665 -1809 1297 756 -1603 1144 -454 -1471 1139 -440 -160 1475 -541
1834 -541 350 448 -1319 738 -252 -826 1765 -522 -627 1450 -1655 -578 1270 -1457 468 1227 -1277
1851 -1277 663 111 -1270 798 -478 -30 1397 -599 468 675 -1761 850 328 -1388 1647 265
1867 265 -1353 1258 -726 -1019 1164 -847 129 1120 -766 703 -158 -1194 1101 -531 -386 1815
1883 1815 -901 -108 1315 -1681 2 868 -1396 884 709 -1083 810 -459 -952 853 -759 426
1899 426 1044 -1077 899 255 -1437 1209 -76 -1091 1896 -214 -713 1256 -1314 -585 956 -983
1915 -983 561 530 -892 866 -580 -868 1184 -927 84 1700 -1154 447 832 -1849 521 617 -1212
1932 -1212 1120 20 -873 896 -915 -371 714 -1116 810 780 -1075 1079 -341 -1389 1436 -430
1948 -430 -555 1780 -725 -355 1020 -1297 86 529 -979 901 72 -623 811 -1129 -528 1052 -1189
1965 -1189 575 1328 -1409 786 526 -1628 1076 190 -835 1432 -230 -361 777 -1112 76 473
1981 473 -1021 1166 191 -1082 1271 -743 -1020 1477 -731 -138 1640 -960 128 706 -1409 559
1997 559 312 -751 1137 -374 -329 756 -1450 -5 869 -1348 888 796 -1413 1036 44 -1336 1128
2014 1128 -206 -312 1315 -429 109 388 -1258 572 41 -818 1412 -375 -772 1367 -1124 -607 1261
2031 1261 -1075 353 1309 -1033 602 342 -1061 874 -180 -227 1067 -784 67 602 -1474 391
2047 391 478 -1347 1353 305 -1187 1223 -519 -1026 1202 -490 123 1040 -753 510 10 -1113 922
2064 922 -297 -674 1495 -790 -396 1019 -1551 -1 904 -1233 621 748 -957 714 -271 -774 916
2081 916 -497 180 1020 -976 499 332 -1540 808 99 -1074 1476 -253 -840 1083 -930 -489 967
2098 967 -709 505 684 -724 749 -233 -770 1121 -655 -51 1409 -1132 -34 817 -1539 337
2114 337 628 -1087 840 251 -812 771 -663 -367 857 -654 498 934 -1048 885 8 -1274
2130 -1274 1303 -345 -691 1425 -743 -627 973 -1178 -29 606 -768 759 385 -717 740 -679
2146 -679 -421 1257 -890 401 1356 -1289 517 511 -1408 765 307 -934 1087 -223 -742 754 -922
2163 -922 -3 575 -866 937 399 -929 1101 -509 -1032 1305 -657 -294 1277 -962 -111 793 -1184
2180 -1184 297 272 -875 957 -284 -552 889 -923 -42 876 -1087 775 875 -1261 894 170 -1302
2197 -1302 1086 -53 -595 1219 -525 -270 509 -946 382 204 -817 1160 -225 -755 1158 -786
2213 -786 -537 1324 -884 263 1169 -1042 348 356 -1061 773 80 -446 875 -648 -175 528 -1213
2230 -1213 389 615 -1005 1075 353 -1138 1073 -334 -958 1121 -351 -168 998 -686 139 251
2246 251 -1043 680 -84 -457 1248 -553 -500 1049 -1128 -177 1060 -988 441 811 -949 626 94
2263 94 -753 796 -312 17 823 -876 176 293 -1262 699 205 -1006 1264 -41 -708 1194 -680
2280 -680 -567 1132 -618 202 836 -747 469 -163 -851 766 -413 -176 1132 -963 -152 850 -1349
2297 -1349 319 738 -1025 791 385 -899 678 -334 -489 828 -564 357 642 -936 588 3
2313 3 -1139 968 -146 -776 1140 -541 -497 1080 -949 -20 862 -696 617 412 -598 757 -428
2330 -428 -533 956 -737 103 938 -1190 234 520 -1368 607 273 -923 972 -95 -553 776 -653
2347 -653 -140 686 -643 687 495 -913 943 -231 -867 1086 -294 -459 1107 -914 -308 734 -1198
2364 -1198 193 500 -645 768 77 -486 836 -626 -68 954 -814 446 822 -1073 667 171
2380 171 -1230 856 3 -691 1008 -493 -341 549 -828 146 478 -544 862 85 -844 1046 -543
2397 -543 -649 1087 -829 41 1017 -994 209 371 -891 522 107 -517 820 -398 -248 745 -873
2414 -873 320 682 -921 819 406 -1027 917 -247 -784 1022 -294 -294 813 -633 -8 248 -858
2431 -858 478 130 -561 947 -368 -587 939 -696 -82 1070 -704 361 674 -876 380 86 -783
2448 -783 613 -125 -206 803 -721 -27 531 -1112 543 395 -773 969 156 -811 870 -519 -444 950
2466 950 -568 4 684 -817 190 -23 -946 758 -310 -468 978 -580 -192 804 -992 272 904
2483 904 -802 655 442 -790 617 -219 -651 730 -580 8 659 -874 258 170 -1044 721 180
2500 180 -674 916 -320 -586 934 -742 -100 834 -613 297 359 -654 533 -240 -675 734 -473
2517 -473 -180 762 -904 148 461 -1053 452 408 -775 817 95 -567 685 -480 -142 753 -728
2534 -728 325 518 -848 533 -77 -807 715 -237 -541 952 -525 -273 660 -672 100 510 -565
2551 -565 515 223 -594 684 -446 -405 801 -651 218 783 -949 335 157 -1022 696 66 -641
2568 -641 840 -209 -357 565 -604 190 498 -638 579 146 -741 715 -326 -691 774 -436 -234
2585 -234 816 -800 117 533 -745 336 204 -473 752 -218 -325 654 -611 36 653 -683 471
2602 471 397 -1011 471 5 -732 671 -324 -340 735 -574 -81 381 -720 385 374 -538 824 -76
2620 -76 -487 772 -505 -281 759 -746 176 553 -821 295 70 -743 548 -37 -212 741 -461 -233
2638 -233 527 -748 372 603 -675 726 113 -647 589 -263 -493 818 -476 -210 566 -741 163
2655 163 227 -649 519 81 -496 886 -302 -230 695 -651 20 629 -653 350 296 -839 482 -74
2673 -74 -615 661 -300 -118 624 -619 36 311 -689 592 189 -579 915 -218 -472 744 -465 -194
2691 -194 712 -580 215 392 -781 294 21 -634 583 -303 -210 835 -542 -1 470 -749 460 508
2709 508 -664 695 171 -649 608 -346 -373 532 -554 50 288 -704 356 80 -703 617 -11 -296
2727 -296 802 -414 -261 655 -671 44 535 -653 410 -2 -717 451 -342 -289 716 -393 -142 563
2745 563 -696 161 378 -804 646 54 -492 786 -56 -295 602 -491 -30 575 -597 454 169 -716
2763 -716 509 -220 -526 712 -454 -155 644 -666 33 589 -699 503 357 -478 557 -128 -366 595
2781 595 -582 -194 561 -574 266 345 -781 375 130 -683 654 -18 -341 755 -529 -70 477 -606
2799 -606 291 253 -546 435 19 -534 559 -465 -390 794 -511 53 637 -823 182 335 -667 546
2817 546 87 -356 780 -273 -97 544 -586 291 512 -723 602 103 -734 580 -242 -599 797 -328
2835 -328 -235 657 -616 86 298 -589 472 71 -487 685 -201 -391 735 -502 -112 676 -698 189
2853 189 324 -696 431 -13 -530 584 -189 -82 709 -593 36 412 -614 445 306 -641 672 -107
2871 -107 -556 565 -453 -229 617 -481 82 364 -631 304 124 -630 581 -41 -213 615 -409 -50
2889 -50 512 -726 242 393 -597 449 33 -602 538 -235 -334 798 -374 -64 606 -626 240 334 -600
2908 -600 590 130 -452 736 -327 -267 535 -610 38 544 -594 316 230 -651 399 -167 -282 729
2926 729 -240 -60 548 -657 172 391 -599 518 319 -334 644 -145 -502 471 -514 -11 570 -576 122
2945 122 353 -616 319 -8 -477 780 -181 -123 641 -471 25 533 -602 208 232 -561 533 -65 -584
2964 -584 577 -471 -193 648 -476 105 383 -656 267 326 -601 609 -48 -313 618 -325 -305 593 -489
2983 -489 150 362 -626 412 104 -650 607 -177 -397 773 -328 -121 507 -432 186 255 -511 463 97
3002 97 -356 568 -223 -315 616 -513 58 463 -609 250 171 -651 416 -40 -477 668 -343 -205 618
3021 618 -550 51 345 -552 382 159 -539 490 -84 -374 595 -465 -140 578 -498 225 414 -623
3039 -623 318 114 -528 632 -77 -160 733 -443 -61 474 -643 262 367 -561 365 -23 -699 379 -231
3058 -231 -234 531 -363 193 321 -589 311 155 -548 635 93 -306 722 -325 -215 509 -680 102 361
3077 361 -587 354 155 -571 463 -89 -407 731 -193 10 693 -567 130 355 -627 472 203 -476 610
3096 610 -218 -443 480 -446 -101 384 -564 207 275 -621 459 54 -407 730 -210 -209 684 -464 18 514
3116 514 -678 286 217 -571 403 -82 -447 487 -444 -139 620 -522 157 536 -579 325 280 -536 637
3135 637 -84 -336 677 -315 -281 434 -587 260 370 -608 427 128 -610 493 -211 -275 706 -378 90
3154 90 563 -528 281 251 -639 429 46 -468 481 -296 -386 606 -465 112 505 -581 347 276 -510 560
3174 560 -75 -332 713 -172 -143 487 -438 -29 309 -615 378 90 -429 478 -223 -463 482 -479 -151 542
3194 542 -499 146 239 -559 443 107 -463 476 -128 -352 489 -512 7 381 -635 302 285 -476 440
3213 440 60 -516 645 -161 -232 659 -297 65 517 -585 303 218 -608 553 -99 -450 538 -426 -267 578
3233 578 -527 41 362 -434 241 81 -578 612 -89 -270 729 -331 24 583 -481 160 361 -648
3251 -648 436 42 -521 614 -367 -396 517 -443 95 506 -572 237 358 -706 424 123 -363 718
3269 718 -111 -283 494 -519 -58 440 -599 327 194 -636 501 -99 -496 489 -287 -3 681 -535 287
3288 287 435 -552 354 91 -522 600 6 -317 491 -390 -194 413 -547 133 275 -530 295 -8 -478 559
3308 559 -279 -167 479 -301 -38 574 -527 169 310 -579 304 -62 -444 464 -237 -295 478 -523 118 411
3328 411 -520 264 286 -526 462 -33 -423 590 -304 -268 430 -510 -29 308 -565 324 73 -547 401 -171
3348 -171 -384 534 -218 -38 490 -509 236 277 -519 421 27 -487 478 -104 -213 395 -273 -31 389 -505
3368 -505 293 224 -573 560 37 -430 529 -299 -168 637 -430 75 360 -417 275 135 -491 353 -108 -371
3388 -371 488 -396 -206 423 -586 164 368 -553 337 81 -423 446 -57 -262 572 -334 -62 445 -475 148
3408 148 165 -676 418 -7 -457 520 -266 -251 546 -354 21 489 -482 346 239 -596 442 52 -353 409
3428 409 -310 -93 495 -503 4 333 -622 347 274 -596 456 -27 -458 442 -271 2 530 -398 32 208
3448 208 -495 367 115 -536 546 -243 -340 574 -392 -174 461 -503 149 276 -421 421 87 -424 530 -232
3468 -232 -218 623 -404 71 454 -461 183 183 -566 336 -86 -334 571 -321 -399 471 -297 82 404 -333 387
3489 387 122 -427 481 -87 -304 555 -301 -140 363 -539 110 418 -463 353 136 -473 477 -132 -313 406
3509 406 -429 43 453 -312 350 274 -477 371 92 -383 536 -209 -204 378 -518 -107 345 -416 177 199 -427
3530 -427 416 -142 -283 465 -303 -58 454 -507 77 389 -632 245 174 -439 421 -17 -368 333 -423 -55
3550 -55 390 -380 238 387 -482 321 22 -345 596 -132 -147 574 -341 -57 276 -516 142 182 -411 268 44
3571 44 -293 459 -248 -114 427 -383 26 372 -390 327 213 -480 472 19 -354 544 -276 -117 384 -389
3591 -389 93 126 -549 234 35 -422 465 -202 -262 515 -298 -55 408 -425 193 193 -479 239 -68 -343 482
3612 482 -274 -176 433 -370 -3 401 -345 175 291 -343 488 82 -405 486 -103 -93 442 -280 35 248 -437
3633 -437 236 111 -446 477 0 -375 449 -280 -183 472 -384 144 429 -436 284 169 -485 296 -147 -188 328
3654 328 -256 -115 327 -435 144 197 -533 294 25 -447 397 -137 -237 348 -227 -13 352 -413 215 154 -322
3675 -322 342 9 -309 455 -318 -267 347 -284 -13 263 -362 279 128 -387 355 47 -192 410 -286 -180
3695 -180 377 -349 74 225 -515 232 144 -395 400 -99 -340 323 -398 -126 289 -377 151 290 -359 392
3715 392 128 -396 389 -157 -180 379 -429 -150 275 -545 134 215 -339 304 1 -364 296 -251 -125 273 -264
3736 -264 29 196 -472 314 119 -355 475 -182 -295 438 -223 -154 403 -415 31 238 -317 337 163 -354
3756 -354 397 -113 -161 501 -312 -74 396 -346 214 207 -477 180 -43 -297 429 -64 -164 294 -339 -55 223
3777 223 -421 267 127 -379 479 -20 -258 367 -141 -117 448 -257 -53 299 -311 176 95 -397 396 -81 -302
3798 -302 446 -300 -78 382 -308 109 327 -433 291 240 -370 281 -118 -226 319 -244 -71 283 -442 186
3818 186 271 -355 360 -59 -283 501 -120 -220 376 -183 -31 358 -388 49 139 -406 312 -39 -209 419 -189
3839 -189 -181 450 -346 0 259 -254 360 193 -466 306 -87 -350 242 -287 -49 296 -266 114 117 -385 168
3860 168 23 -350 420 -64 -248 376 -257 -165 428 -251 97 228 -324 360 -34 -258 341 -234 -178 215 -265
3881 -265 146 200 -358 271 166 -412 280 -13 -296 481 -69 -146 333 -244 32 188 -293 208 20 -253 255
3902 255 -108 -193 334 -216 -185 331 -332 -92 229 -335 173 90 -369 222 -139 -140 331 -212 -65 234 -366 88
3924 88 94 -256 250 -109 -331 340 -104 -112 441 -235 -60 240 -282 41 36 -326 306 -104 -284 393 -128 -8
3946 -8 381 -274 -22 129 -346 190 158 -322 358 -83 -166 341 -126 39 326 -236 182 149 -366 334 70 -250
3968 -250 308 -170 -226 295 -316 -64 230 -365 122 121 -286 275 73 -183 372 -141 -151 327 -260 19 199
3989 199 -337 91 101 -417 206 -22 -273 327 -201 -89 342 -100 95 201 -213 173 107 -316 325 -4 -167
4010 -167 250 -239 -81 231 -340 -47 225 -306 134 43 -284 240 -148 -139 355 -213 33 345 -375 193 193 -344
4032 -344 210 24 -422 196 -151 -211 234 -201 45 145 -232 265 159 -241 332 -31 -141 379 -44 -29 313
4053 313 -278 58 295 -362 62 54 -323 292 -122 -173 221 -110 -56 237 -166 180 223 -329 247 42 -271 254
4075 254 -79 -266 309 -182 39 203 -215 115 138 -223 265 -19 -207 393 -97 -91 243 -210 -10 216 -246
4096 -246 172 148 -392 232 -31 -130 283 -173 -140 215 -269 43 135 -412 151 121 -296 363 -28 -296 327 -109
4118 -109 -3 255 -348 45 166 -276 289 -60 -303 290 -114 -90 366 -268 40 160 -228 102 197 -174 222
4139 222 18 -283 385 -249 -122 285 -214 26 242 -324 204 27 -327 224 31 -252 345 -181 -21 230
4159 230 -314 91 235 -329 257 -10 -239 256 -188 -131 200 -242 25 382 -289 131 75 -251 174 34 -170
4180 -170 323 -151 -115 295 -165 82 198 -310 86 36 -334 182 -56 -397 314 -158 -170 365 -207 45 226
4201 226 -255 70 21 -188 213 -50 -104 273 -185 -97 341 -292 31 119 -288 215 -66 -281 269 -141 -147 327
4223 327 -88 -21 196 -316 115 148 -241 180 47 -212 358 -130 -219 278 -283 -80 194 -310 -9 152 -297
4244 -297 255 39 -200 332 -249 10 283 -167 5 212 -254 193 188 -220 161 -137 -182 303 -109 -129 160
4265 160 -267 41 17 -263 272 105 -266 251 -108 -21 296 -157 16 143 -317 6 75 -286 188 54 -408
4286 -408 135 -91 -50 277 -203 96 240 -226 249 221 -333 236 57 -147 214 -219 -148 223 -192 -10 243
4307 243 -327 96 6 -240 304 -44 -283 383 -122 60 335 -305 89 148 -226 157 72 -331 298 -75 -139
4328 -139 275 -141 -106 205 -310 133 162 -377 276 84 -64 354 -19 -20 274 -188 -22 181 -149 174 169 -205
4350 -205 220 -47 -250 306 -255 15 237 -160 72 231 -268 215 271 -254 311 -33 -32 304 -202 -131 263
4371 263 -250 205 100 -233 115 -18 -201 185 -58 -222 321 -254 -153 217 -288 63 94 -265 212 -4
4391 -4 -231 211 -192 -170 317 -178 71 43 -280 201 106 -178 264 74 -122 296 -49 -105 205 -277 122 118 -252
4414 -252 98 54 -283 238 -20 -247 232 -231 62 221 -236 91 126 -156 109 70 -130 228 -46 -184 333
4435 333 -302 -38 238 -251 126 35 -244 190 30 -162 164 -48 -43 315 -157 10 180 -231 158 99 -222
4456 -222 332 -54 -102 220 -119 -77 221 -262 33 215 -193 104 112 -188 256 -24 -158 289 -218 -73 207
4477 207 -393 151 272 -306 164 -15 -268 130 -17 -211 326 -48 -123 216 -142 179 123 -210 186 29 -138
4498 -138 222 -116 -57 346 -157 -77 193 -183 -41 101 -318 170 -54 -141 234 -180 -1 229 -189 -15 33
4519 33 -292 193 -17 -147 206 49 -260 235 -183 -17 227 -198 -2 112 -202 123 9 -180 175 19
4539 19 -104 149 -161 21 121 -180 84 147 -233 171 34 -186 313 -178 -60 234 -225 -7 116 -148 55
4560 55 67 -203 161 -76 -134 158 -122 5 130 -171 -6 156 -262 120 87 -166 229 -174 -138 168 -144 -194
4582 -194 231 -221 -43 99 -209 109 8 -247 262 -34 -57 230 -201 89 272 -222 180 6 -237 175
4602 175 -19 -234 274 -151 -55 230 -208 113 197 -197 141 42 -101 164 18 -176 193 -67 -53 175 -187
4623 -187 53 70 -246 14 9 -160 180 -5 -101 245 -161 -32 195 -85 84 80 -243 199 -2 -213 274 -43
4645 -43 -218 253 -161 -39 155 -212 74 73 -100 150 -57 -202 80 -144 -30 160 -219 42 152 -178 127
4666 127 49 -165 212 -1 -54 185 -116 -30 215 -177 44 104 -157 138 -3 -192 205 -63 -101 201 -154 64
4688 64 214 -90 82 138 -114 121 -11 -131 234 3 -14 221 -210 -95 186 -95 131 133 -84 132 -14 -140
4710 -140 298 -132 -57 249 -199 54 121 -216 172 28 -86 180 -109 -32 130 -46 -26 230 -49 72 -29
4731 -29 -167 217 78 -145 176 -90 -230 217 -116 -113 131 -136 27 95 -208 230 -37 -165 139 -111 -155 83
4753 83 -162 171 247 -145 34 69 -116 109 20 -128 247 -48 -77 202 -70 -28 121 -278 167 74 -207 7
4775 7 30 -76 96 -24 38 221 -210 -66 221 -193 113 92 -115 151 37 -31 142 -56 54 193 -261 74
4797 74 97 -172 165 20 -157 188 28 -132 233 -136 52 177 -255 198 181 -153 57 -104 -172 140 -110
4818 -110 -134 194 -102 57 103 -140 65 -8 -157 204 -71 -62 219 -194 10 132 -160 80 76 -129 31 48 -124
4841 -124 78 69 -23 207 -178 20 93 -123 226 102 -109 83 156 -115 167 -124 -121 210 -68 -73 99 -105 -36
4864 -36 176 -177 126 7 -151 252 -81 -138 192 -149 -20 193 -162 38 68 -229 166 -16 -66 240 -50
4885 -50 -3 184 -54 126 145 -169 184 -12 -25 214 -50 -24 174 -123 -53 103 -192 10 113 -140 62 11
4907 11 -120 28 -18 -45 61 -98 -42 57 -136 99 99 -200 158 41 -79 99 -123 -6 132 -205 -4 195
4929 195 -142 91 46 -125 117 38 -128 193 -125 32 152 -92 200 45 -158 105 75 -127 85 42 -91
4950 -91 258 -45 -33 95 -159 -9 140 -188 78 38 -138 125 -57 -70 120 -91 -31 108 -114 9 168 -102
4972 -102 195 -48 -9 128 -46 -35 73 -51 6 27 -74 49 20 -106 166 -28 -143 205 -101 -55 83 -234
4994 -234 103 62 -170 129 40 -130 76 -30 53 207 -1 -72 72 -80 10 37 -149 72 62 -88 93 -28
5016 -28 -90 132 -127 -39 183 -61 -23 63 -55 200 21 -32 104 -100 14 39 -92 131 162 -158 56 22 -118
5039 -118 190 -32 -47 117 -181 -65 46 -73 102 108 -114 111 8 -91 75 -14 -53 62 -84 -57 129 -144
5061 -144 64 -16 -88 171 16 -156 198 -77 -23 86 -34 83 121 -142 54 0 -157 120 -39 -82 101 -141
5083 -141 2 15 -173 -7 127 -133 67 182 -156 84 -38 -89 144 -48 -17 60 -90 106 83 -14 116 95
5105 95 -85 -27 -93 -62 97 -9 127 176 -61 53 35 -143 73 14 -147 94 -60 27 89 -42 113 125 -30
5128 -30 -99 162 -153 143 -36 -80 268 -79 -14 82 14 91 65 -104 71 28 -93 242 -49 -20 106 -78 55
5151 55 125 -146 -64 16 -217 125 37 -160 162 36 -71 59 -29 -30 209 -126 -18 52 6 101 20 -45 185 -13
5175 -13 -134 82 -122 3 88 -161 76 -30 -107 109 49 -10 110 -40 66 243 -60 -43 149 -73 57 -102
5197 -102 -120 166 -96 -87 131 -106 -112 110 -156 71 -20 -168 68 -26 -118 175 41 -111 195 -88 15 159 -60
5220 -60 72 171 5 130 22 -79 126 -5 -109 155 -34 -84 11 -120 167 45 -58 186 -84 -46 202 -94
5242 -94 -20 137 -9 -15 119 -108 66 -99 -263 133 39 4 71 -6 90 106 -32 16 25 -192 28 0 -134 147 -69
5267 -69 -84 73 -18 70 41 -106 46 -19 5 94 34 -48 78 -226 -86 53 -147 32 71 -117 134 45 -145 -48
5291 -48 -51 -133 76 -127 -42 137 -106 -12 63 -7 75 8 -27 111 18 -26 135 -18 -15 112 -167 -41 99 -99 81
5316 81 6 -108 81 -45 -55 61 3 -47 66 -93 135 71 -50 23 -40 -105 -30 -25 19 0 -137 38 69 -121 37
5341 37 -128 25 2 -45 28 38 -38 -97 220 -56 -82 70 -169 -15 66 -154 51 -1 8 93 -55 -16 19 -164 129
5366 129 -27 -124 -56 -22 -75 14 -67 -91 136 -193 -32 -20 -67 -14 78 -65 67 -85 -85 97 -8 -58 -15 9 7 124
5392 124 8 112 38 -38 16 41 -66 78 17 -145 60 -184 -17 -25 -190 72 75 -15 -77 -3 27 107 -146 -72 69
5417 69 -79 35 89 32 44 91 -69 66 -17 -8 69 -150 -71 160 -76 164 -32 -49 76 82 -58 69 -35 2 77
5442 77 -29 52 83 -165 72 23 -15 92 10 4 114 -56 -53 127 -42 -16 9 -20 7 -28 -66 105 24 -85 -6 -126
5468 -126 -36 32 -137 49 -43 -179 125 23 -119 211 -35 -105 2 -125 105 19 -10 11 -16 -64 -86 35 8 81
5492 81 -58 -127 85 -125 76 111 -55 82 17 37 -23 -10 -42 111 -14 -27 50 -64 45 75 -166 5 118 -65
5516 -65 59 46 -79 83 -23 35 10 -39 -107 81 -92 59 28 -47 57 -43 -36 -75 -11 44 100 -35 -51 -17 -47 93
5542 93 58 4 136 21 -7 24 -24 84 55 -40 39 -52 -27 20 -144 -10 40 -1 -26 222 -80 92 91 -91 1 118
5568 118 -37 65 46 -140 136 -24 -73 -7 59 97 36 -66 71 -67 -50 125 -148 4 22 -27 -44 39 -11 -25
5592 -25 19 -76 29 16 -5 22 13 31 43 -4 34 -51 -33 60 11 -24 35 -97 5 63 -6 38 4 -92 -42 156 7 -34
5620 -34 -9 -126 30 -83 -112 12 -32 21 108 64 -64 89 -139 18 -38 6 91 -66 -15 135 -69 -127 19 -128
5644 -128 68 67 -32 -31 -68 -116 -31 -6 -1 85 -260 -49 55 -48 20 4 9 21 -11 -5 43 -37 -52 -25 -92 45 34 -70 48
5673 48 -36 -50 -14 30 33 73 -40 -22 162 -78 -46 -32 -51 15 -156 18 -5 -28 -88 101 -192 -13 131 -51 77
5698 77 32 32 69 33 -59 67 2 -27 -63 -196 -40 123 -39 -57 -3 -191 63 57 -66 -28 -27 104 81 61 24 25 -50 88
5726 88 0 -23 44 -59 -27 -10 10 15 -86 -61 22 5 48 88 -27 -74 85 11 52 90 -62 -5 23 -76 -2 -15 -141 -52
5754 -52 1 -35 21 -30 -84 12 -93 -69 170 -105 -107 -22 -84 60 25 -83 22 -120 -45 -56 -162 29 76 72 23 39 17
5781 17 106 -42 -51 -24 -5 83 66 -83 58 42 -125 -5 16 -65 35 -91 13 15 -127 90 -26 -80 -38 -69 -158 51
5807 51 -78 11 52 -96 -67 -35 48 60 -14 -5 -26 84 -92 113 107 -55 79 39 -24 13 45 8 90 -6 32 105 -42
5834 -42 -20 14 47 -17 -82 24 91 -10 1 134 -22 21 0 -103 16 -57 -104 136 -31 29 15 -24 4 22 -119 -4
5860 -4 20 -16 113 27 3 117 11 34 10 65 -61 38 4 49 -26 -71 -49 -75 58 61 -90 21 53 37 5 40 -54 41
5888 41 -29 -50 63 -43 -21 -23 -35 45 -5 -46 -51 58 -59 83 -58 -30 119 -27 11 -5 -76 -22 -58 -14 -38 -103 -123
5915 -123 -11 -125 -144 136 -30 -20 31 -61 79 -19 -95 46 -24 86 60 -79 -95 91 -85 9 64 85 -109 79
5939 79 -25 10 -18 -15 9 -27 -5 27 -10 33 -74 -8 50 125 -51 -39 -101 -55 -47 -18 70 -9 -61 22 0 -58 130 -99 -3
5968 -3 65 -45 -15 44 -31 72 139 -51 48 121 5 79 -44 -3 6 57 48 107 63 10 46 -89 -98 -27 -57 8 -37 -60 55
5997 55 -43 -56 0 1 10 -8 -107 122 -51 -23 -102 -15 54 52 -50 2 58 -29 3 -127 -17 -42 -147 25 -18 15 -17 2
6025 2 -18 -9 51 -49 55 29 114 -30 6 19 35 57 -67 36 38 -57 126 -83 62 -127 -61 -74 -54 -87 -133 -47 35
6052 35 15 -46 35 34 -18 42 51 65 -30 -134 28 -94 58 13 107 74 -19 147 36 2 59 -43 -30 63 2 23 10 79
6080 79 7 -24 49 107 -64 -3 -83 7 76 17 -25 23 43 -30 -20 6 28 -68 -56 83 5 1 121 10 6 19 13 -27 34 -54
6110 -54 34 -34 -100 12 12 -44 -6 -52 -37 -13 54 -9 42 108 9 -57 -22 -83 -81 31 -22 -14 -42 47 46 -58 -93 -100 46 0 52
6141 52 50 -75 45 13 -140 74 97 53 55 50 58 -9 3 -12 69 37 -69 -20 131 43 75 37 -47 38 50 -47 103 -119
6169 -119 -27 19 -103 50 12 -27 54 -2 -5 -17 10 -67 -9 2 -37 -10 -18 3 -44 -41 -14 3 36 154 -44 12 -81 -17 49
6198 49 9 95 110 25 -95 -11 -42 16 -119 4 79 -15 102 33 0 121 1 -15 -12 -50 -72 -22 88 -28 27 -40 67
6225 67 -73 136 19 -34 -14 -47 37 -25 -123 41 -43 -85 3 25 68 -2 35 15 27 -28 34 -80 28 7 91 -55 -105
6252 -105 65 44 52 32 -95 -2 1 8 76 64 15 1 24 -32 -39 149 -4 -41 41 -54 38 8 -136 -83 -78 -6 17 -35 92
6281 92 -35 -8 56 30 5 77 33 75 88 32 -44 9 -133 65 10 -109 161 -75 -2 25 -37 68 39 -48 -61 40
6307 40 -66 39 48 68 20 -89 -68 -94 12 65 -2 23 2 -7 -10 92 128 -106 25 -21 -22 7 -3 -1 -30 -11 0 28 4
6336 4 -59 -2 5 80 -71 124 -65 -52 39 135 32 -20 55 -29 -52 25 -3 -57 13 115 51 19 -28 -42 -37 95 -47 56
6364 56 -19 -61 -4 12 -41 37 62 -43 69 39 2 49 62 48 52 34 7 -21 -76 1 -11 45 47 50 -43 -67 21 29 -18 73 -49
6395 -49 90 30 52 53 -14 -39 -75 26 -39 148 40 19 81 51 -95 30 -37 -66 -73 39 -39 77 -52 55 -121 -79
6421 -79 52 -85 44 -91 51 -95 -48 -44 -62 -86 44 36 72 -37 3 46 31 38 -67 98 -32 47 100 -40 -47 5
6447 5 19 40 -23 -75 37 80 158 75 -146 13 27 31 -49 65 81 43 34 53 -24 81 -29 -41 -60 62 42 33 -47 -78 -44
6476 -44 71 5 -24 39 24 69 57 -44 -63 16 0 78 6 -21 -30 29 -34 28 26 48 -4 63 -25 107 -88 127 -32 -71
6504 -71 -71 68 33 -71 35 68 -98 -72 38 106 -27 68 34 -52 -77 -10 29 10 81 -29 104 126 53 53 85 -21 99
6531 99 18 36 -12 -15 43 29 -60 -72 12 46 -71 -21 -8 -64 0 22 4 57 159 -147 131 -84 -57 24 53 -14 61 -40
6559 -40 -16 41 -67 -23 -77 -35 54 -12 -77 -48 -9 122 74 147 11 71 -22 5 -78 20 -55 -54 49 -64 76 -33 -17
6586 -17 -1 -29 78 68 -4 -125 32 24 108 -20 72 8 83 25 -88 25 -43 47 20 12 20 -46 -67 -15 60 -2 16 67 -40
6615 -40 -32 64 -81 67 78 -24 -21 -40 87 -79 27 8 5 47 42 -46 44 15 -45 -45 -43 21 -134 -84 -25 22 -112 -16 44
6644 44 -10 -14 -30 110 -39 -9 -42 -14 -107 53 102 -130 6 82 -50 -31 73 42 88 -81 -61 54 -8 -6 -1 -1 -22 21
6672 21 -45 4 57 -7 -99 -16 23 -90 -13 26 30 2 63 -51 70 7 14 59 5 34 72 -70 -23 10 -65 55 -43 -38 -27
6701 -27 2 -36 -4 -59 36 -45 131 -64 42 42 27 -1 50 -20 26 14 -8 -52 118 -24 -98 16 -38 -58 71 -82 -4
6728 -4 23 22 -15 17 -47 -96 54 39 -68 86 -87 8 -32 16 -46 19 2 32 -22 8 13 45 37 14 62 37 -57 -13 -17 19 81
6759 81 -79 31 7 -18 52 128 -40 14 33 21 31 17 -55 -39 19 -5 -13 -17 10 6 -3 -13 14 -36 89 98 -122 27 -21 -43
6789 -43 46 60 -58 28 43 70 27 -63 -50 -146 0 -15 -20 -27 45 -45 2 39 19 -108 17 -58 156 20 45 -114 -85 -51
6817 -51 40 -55 95 5 -20 20 28 -34 95 4 15 72 53 -42 71 -49 25 19 -48 6 -65 22 -27 109 14 -96 26 -19
6845 -19 87 -20 90 48 34 -93 19 -50 -7 4 20 51 39 68 -63 -27 8 54 57 15 22 5 10 77 48 57 -30 -28 68 44
6875 44 -25 -87 -54 96 18 -118 -32 -13 35 -104 22 -34 -97 -17 -71 38 -30 -38 95 13 -130 42 -21 7 -29 -54 9
6902 9 -15 -21 -85 140 31 6 -67 168 37 70 -15 -25 52 -87 -22 51 9 49 -3 66 27 37 75 89 65 -29 -67 95
6930 95 -57 20 74 29 -81 -128 47 10 69 -81 -72 -41 3 104 55 -17 32 -74 -62 54 -65 27 89 -120 -10 -78
6956 -78 -15 -40 25 -41 -58 -26 41 -78 -73 19 -139 21 76 -7 55 -25 0 57 -44 31 36 74 -11 -86 -62 65 10 58 25
6985 25 44 75 -63 102 120 48 27 -65 75 115 -6 18 -19 0 83 -20 -2 -20 14 -43 -126 -7 48 3 -73 -40 1
7012 1 50 11 -27 -1 -97 -37 -63 -78 23 -65 35 48 -7 -12 119 -66 -171 -15 -23 -12 -42 30 27 -55 71 113 -58 -159
7040 -159 -84 34 8 114 46 -27 86 94 48 -9 -52 -49 -3 43 -64 -42 22 -43 -121 78 27 -156 27 51 -31 2 52
7067 52 -2 -2 88 53 -41 35 24 52 -4 51 57 -39 -1 -10 -84 142 -81 57 -22 -7 139 -32 68 -68 -25 -38 -55 64
7095 64 -47 54 41 -60 22 -117 -20 136 -66 -31 1 107 54 -116 -136 -13 -17 -13 -86 -120 56 -107 45 -55 -20
7120 -20 58 75 55 -112 53 -49 25 -20 49 80 48 -85 -58 3 10 1 82 44 -15 18 7 -56 -1 2 -4 -83 -40 -97 -87 75
7150 75 39 4 29 -21 -76 -15 -31 100 74 -63 130 2 0 117 84 8 86 1 38 45 -106 -25 -22 33 -142 -71 -26 -56
7178 -56 88 -3 26 35 -1 -8 -34 -28 -57 -45 91 61 -19 86 -37 -51 87 38 61 -9 -93 -43 97 94 65 90 1 -63 21
7207 21 -35 111 -26 -13 -20 120 -28 -163 15 -13 39 -103 -18 -40 -22 38 -53 36 46 -95 68 59 -96 -55 36 59
7233 59 3 -46 -90 -8 -122 48 -24 -87 89 17 31 68 -82 91 95 16 -21 30 -58 120 51 89 -35 95 29 97 -108
7260 -108 -15 -5 -71 -25 38 -55 36 -67 102 53 -31 125 80 83 16 80 22 -10 -34 178 94 -41 -121 -18 -68 -100 138
7287 138 -10 20 -28 -104 -32 14 -15 14 2 -82 -59 84 -42 -4 -88 21 37 -120 -39 -14 34 32 -13 -10 77 -32 6 55
7315 55 -102 70 45 -137 17 45 -9 11 -124 -31 98 52 -52 -107 -38 131 116 -91 72 -65 34 -15 -28 -76 -115
7340 -115 6 -55 -86 22 13 11 -78 -63 -86 71 111 -48 -41 -38 -3 -21 -14 -108 -27 -38 5 37 -76 -86 24 -1 85 -49 43
7369 43 -7 82 -68 -121 -71 -38 104 143 -91 -38 -41 -1 27 30 -77 -55 -64 -94 -118 -2 89 32 -5 76 -47 61 -24 49
7397 49 -72 13 -57 -30 58 14 96 -91 89 27 -9 -65 -34 15 -23 13 -11 21 49 17 160 -22 -20 50 -19 -45 -2 17
7425 17 -11 -2 -117 27 130 50 139 -23 33 69 -13 -5 0 -129 147 -33 -11 -69 4 -42 -42 -26 106 72 -83 -31 -77 -16
7453 -16 113 -11 -142 83 -14 -61 0 -52 94 -48 38 -35 -16 8 101 64 42 120 -69 13 8 26 9 36 -73 41
7479 41 -52 65 20 -33 5 86 51 3 33 -83 2 46 25 22 -29 -87 42 -78 -24 14 125 32 -6 -40 -7 97 99 -25
7507 -25 101 2 12 -106 28 -31 -14 -77 -35 -48 11 -30 -38 41 -29 51 -19 6 -154 -41 -19 10 -30 116 37 33 50 125
7535 125 49 -34 91 -34 83 10 10 8 -115 -71 97 93 56 29 12 -37 78 -77 72 7 -99 8 127 16 67
7560 67 -60 -59 35 12 -111 17 -18 -23 -57 -137 61 6 21 28 36 88 15 40 -16 14 -43 -13 -38 -23 -34 12 -35 33 -19 -55
7590 -55 -54 20 8 -14 1 76 45 -18 50 88 -57 -96 -34 73 127 -39 5 21 7 78 -16 -8 34 -35 26 53 -12 -73 -32 -37
7620 -37 -18 108 144 104 -14 48 62 -51 4 35 -61 195 -15 -50 137 46 -48 66 -35 -73 44 12 51 -52 -52 -11
7646 -11 -58 9 18 -78 -61 -25 10 1 37 95 70 91 2 42 -46 -147 -16 36 37 166 113 -52 -24 -41 72 -19 -142 145
7674 145 113 -47 95 -12 9 53 41 95 -44 7 -17 -35 91 10 7 -4 38 -10 44 -15 -58 -7 25 86 -114 33 70
7701 70 32 -5 4 33 -85 13 101 -41 -4 -92 -15 -74 25 18 99 127 -8 80 -8 14 11 -47 -43 131 -44 -95 -36 13 -7 -13
7731 -13 -25 81 -60 -87 13 -24 -68 43 22 53 -73 -4 42 23 93 -4 -52 46 44 -8 -67 -58 -19 -15 42 -49 36 -64 41
7760 41 -27 -37 37 -125 -16 -83 33 30 -51 -26 93 80 -2 24 -5 -59 13 129 -26 -185 -79 -40 65 -1 4 2 130
7787 130 42 -46 4 24 6 52 62 43 -19 1 81 -66 6 -35 76 -114 84 38 19 -22 124 -14 -7 10 -50 78 -99
7814 -99 -22 -76 -91 -85 103 126 20 -54 -36 -11 -7 -6 4 19 -37 53 20 -26 -25 3 -50 -40 43 63 71 79 -53 125 46 25 -49
7845 -49 -29 -12 -118 -80 -2 -12 -65 -44 -12 -30 41 -79 -39 -24 -38 -34 12 -52 5 16 -8 29 -96 -86 86 -26 1 -23
7873 -23 19 81 79 -71 85 50 -18 54 47 -5 -40 -24 -34 31 -26 -19 56 16 -1 -37 -3 87 37 -55 -36 -32 -19 -102 -66 -39 -23
7904 -23 -4 -32 40 -51 -68 67 61 19 -40 109 49 102 -48 51 -31 56 29 -9 18 -39 0 -128 76 6 22 -48 2 -97
7932 -97 7 -21 -162 53 -71 -72 -83 -69 -57 -79 16 73 -18 39 -52 44 -37 -71 60 58 26 -49 -113 63 114 -52 56
7959 56 -85 16 109 -21 22 40 -105 10 16 -24 59 28 -14 76 -55 29 96 99 29 17 11 20 78 -49 10 -81 -15 41 -15
7988 -15 15 42 -34 -24 35 -43 7 32 -35 48 -135 -37 -38 -31 94 -63 34 -7 79 40 84 -20 35 -13 19 79 52 -21 -14 59
8018 59 -18 74 -39 -40 73 -19 74 50 87 8 18 15 8 9 -105 -44 -78 -34 -56 -11 80 33 -27 25 -11 57 92 20 -23 54 114
8049 114 16 96 -18 79 -21 26 34 32 -111 76 -103 -9 133 -106 -4 17 -13 1 -26 -19 41 -31 48 -7 -25 -10 -70
8076 -70 -75 -22 -39 55 46 26 -11 -28 12 108 120 37 -72 16 40 -49 -25 -35 24 4 -23 -85 4 38 12 -59 138 26 59 -2
8106 -2 -58 -11 -73 107 -43 50 -108 15 33 -4 -65 -10 5 -37 122 42 -29 19 -79 -2 -18 -31 17 15 -31 94 1 19
8134 19 47 141 73 48 5 10 -13 -86 -34 -37 27 72 -77 -26 36 -41 -28 80 -42 -63 -39 63 21 -52 -55 -47 -17 22 55 -86
8164 -86 -25 -35 -14 -66 -12 -93 30 -13 53 -16 -49 -87 -38 -54 99 13 24 24 -32 -19 -2 -13 -78 -62 -16 -59 -20
8191b0
##END NTUPLES=NMR FID
##END=
