##TITLE=1H_DE-80H_X3
 200.13MHz, d2o
 8 sc
 
 19ns.26.2.2025
##JCAMPDX= 6.0         $$ Bruker NMR JCAMP-DX V2.0
##DATA TYPE= NMR FID
##DATA CLASS= NTUPLES
##ORIGIN= UXNMR, Bruker Analytische Messtechnik GmbH
##OWNER= pz
$$ XWIN-NMR		Version 3.5
$$ Thu Jul  3 11:46:18 2025 Russian Standard Time (UT+4h)  Yarkov@DPX200
##.OBSERVE FREQUENCY= 200.1313
##.OBSERVE NUCLEUS= ^1H
##.DELAY= (6, 6)
##.ACQUISITION MODE= SIMULTANEOUS
##.ACQUISITION SCHEME= undefined
##.AVERAGES= 8
##.DIGITISER RES= 18
##SPECTROMETER/DATA SYSTEM= spect
##.PULSE SEQUENCE= zg30
##.SOLVENT NAME= CDCl3
##.SHIFT REFERENCE= (INTERNAL, CDCl3, 0, 14.3821)
##AUDIT TRAIL= $$ (NUMBER, WHEN, WHO, WHERE, WHAT)
$$ ##TITLE= Audit trail, XWIN-NMR		Version 3.5
$$ ##JCAMPDX= 5.01
$$ ##ORIGIN= Bruker BioSpin GmbH
$$ ##OWNER= Yarkov
$$ C:/Bruker/XWIN-NMR/data/yarkov2/nmr/H-C/1/audita.txt
$$ ##AUDIT TRAIL=  $$ (NUMBER, WHEN, WHO, WHERE, WHAT)
(   1,<2025-07-03 11:43:50.84 +0400>,<Yarkov>,<DPX200>,
      <created by zg, POWCHK disabled, PULCHK disabled
       configuration hash MD5:
       00 E9 B6 7A A2 85 ED C7 34 08 36 98 17 FE 4E 26
       data hash MD5: 16K
       73 DF 66 F1 BB 85 5B FD DF 8B 40 52 AE A8 02 99>)
$$ ##END=
$$ 
$$ hash MD5
$$ C6 1A 4F E3 7C D7 D6 8D 9F 44 27 0B 54 8D 6C 1F
##$RELAX= 
##$RELAX= 
##$RELAX= 
##$RELAX= 
##$RELAX= 
##$RELAX= 
$$ Bruker specific parameters
$$ --------------------------
##$DU= <C:/Bruker/XWIN-NMR>
##$EXPNO= 1
##$NAME= <H-C>
##$PROCNO= 1
##$TYPE= <nmr>
##$USER= <yarkov2>
##$AMP= (0..31)
100 100 100 100 100 100 100 100 100 100 100 100 100 100 100 100 100 100 
100 100 100 100 100 100 100 100 100 100 100 100 100 100 
##$AQSEQ= 0
##$AQ_mod= 1
##$AUNM= <au_zg>
##$AUTOPOS= <>
##$BF1= 200.13
##$BF2= 200.13
##$BF3= 200.13
##$BF4= 200.13
##$BF5= 200.13
##$BF6= 200.13
##$BF7= 200.13
##$BF8= 200.13
##$BYTORDA= 1
##$CFDGTYP= 0
##$CFRGTYP= 5
##$CHEMSTR= <none>
##$CNST= (0..31)
1 1 145 1 1 1 1 1 1 1 1 1 1 1 1 1 1 1 1 1 1 1 1 1 1 1 1 1 1 1 1 1 
##$CPDPRG= <>
##$CPDPRG1= <>
##$CPDPRG2= <>
##$CPDPRG3= <>
##$CPDPRG4= <mlev>
##$CPDPRG5= <mlev>
##$CPDPRG6= <mlev>
##$CPDPRG7= <mlev>
##$CPDPRG8= <mlev>
##$CPDPRGB= <>
##$CPDPRGT= <>
##$D= (0..31)
0 0.7 0 0 0 0 0 0 0 0 0 0.03 0 0 0 0 0 0 0 0 0 0 0 0 0 0 0 0 0 0 0 0 
##$DATE= 1751528630
##$DBL= (0..7)
120 120 120 120 120 120 120 120 
##$DBP= (0..7)
150 150 150 150 150 150 150 150 
##$DBP07= 0
##$DBPNAM0= <>
##$DBPNAM1= <>
##$DBPNAM2= <>
##$DBPNAM3= <>
##$DBPNAM4= <>
##$DBPNAM5= <>
##$DBPNAM6= <>
##$DBPNAM7= <>
##$DBPOAL= (0..7)
0.5 0.5 0.5 0.5 0.5 0.5 0.5 0.5 
##$DBPOFFS= (0..7)
0 0 0 0 0 0 0 0 
##$DE= 6
##$DECBNUC= <off>
##$DECIM= 32
##$DECNUC= <off>
##$DECSTAT= 4
##$DIGMOD= 1
##$DIGTYP= 9
##$DL= (0..7)
0 120 120 120 120 120 120 120 
##$DP= (0..7)
150 150 150 150 150 150 150 150 
##$DP07= 0
##$DPNAME0= <>
##$DPNAME1= <>
##$DPNAME2= <>
##$DPNAME3= <>
##$DPNAME4= <>
##$DPNAME5= <>
##$DPNAME6= <>
##$DPNAME7= <>
##$DPOAL= (0..7)
0.5 0.5 0.5 0.5 0.5 0.5 0.5 0.5 
##$DPOFFS= (0..7)
0 0 0 0 0 0 0 0 
##$DQDMODE= 0
##$DR= 18
##$DS= 0
$$ [...]
##$SUBNAM2= <"">
##$SUBNAM3= <"">
##$SUBNAM4= <"">
##$SUBNAM5= <"">
##$SUBNAM6= <"">
##$SUBNAM7= <"">
##$SUBNAM8= <"">
##$SUBNAM9= <"">
##$SW= 18.0517328524113
##$SWIBOX= (0..15)
0 0 2 0 0 0 0 0 0 0 0 0 0 0 0 0 
##$SW_h= 3612.71676300578
##$TD= 16384
##$TD0= 1
##$TE= 0
##$TE2= 300
##$TE3= 300
##$TEG= 300
##$TL= (0..7)
0 120 120 120 120 120 120 120 
##$TP= (0..7)
150 150 150 150 150 150 150 150 
##$TP07= 0
##$TPNAME0= <>
##$TPNAME1= <>
##$TPNAME2= <>
##$TPNAME3= <>
##$TPNAME4= <>
##$TPNAME5= <>
##$TPNAME6= <>
##$TPNAME7= <>
##$TPOAL= (0..7)
0.5 0.5 0.5 0.5 0.5 0.5 0.5 0.5 
##$TPOFFS= (0..7)
0 0 0 0 0 0 0 0 
##$TUNHIN= 0
##$TUNHOUT= 0
##$TUNXOUT= 0
##$USERA1= <user>
##$USERA2= <user>
##$USERA3= <user>
##$USERA4= <user>
##$USERA5= <user>
##$V9= 5
##$VALIST= <valist>
##$VCLIST= <CCCCCCCCCCCCCCC>
##$VD= 0
##$VDLIST= <DDDDDDDDDDDDDDD>
##$VPLIST= <PPPPPPPPPPPPPPP>
##$VTLIST= <TTTTTTTTTTTTTTT>
##$WBST= 1024
##$WBSW= 4
##$XGAIN= (0..3)
0 0 0 0 
##$XL= 0
##$YL= 0
##$YMAX_a= 95758
##$YMIN_a= -71580
##$ZGOPTNS= <>
##$ZL1= 120
##$ZL2= 120
##$ZL3= 120
##$ZL4= 120
##$ABSF1= 10
##$ABSF2= 0
##$ABSG= 5
##$ABSL= 3
##$ALPHA= 0
##$AQORDER= 0
##$ASSFAC= 0
##$ASSFACI= 0
##$ASSFACX= 0
##$ASSWID= 0
##$AUNMP= <proc_1d>
##$AZFE= 0.1
##$AZFW= 0.1
##$BCFW= 1
##$BC_mod= 2
##$BYTORDP= 1
##$COROFFS= 0
##$CY= 83.5205535888672
##$DATMOD= 1
##$DC= 2
##$DFILT= <>
##$DTYPP= 0
##$F1P= 10.8118882576601
##$F2P= -7.23987719738617
##$FCOR= 0.5
##$FTSIZE= 0
##$FT_mod= 4
##$GAMMA= 1
##$GB= 0.15
##$INTBC= 1
##$INTSCL= 1
##$ISEN= 128
##$LB= 0.25
##$LEV0= 0
##$LPBIN= 0
##$MAXI= 10000
##$MC2= 0
##$MEAN= 0
##$ME_mod= 0
##$MI= 1.114404
##$NCOEF= 0
##$NC_proc= 0
##$NLEV= 6
##$NOISF1= 3.799351
##$NOISF2= 2.8
##$NSP= 1
##$NTH_PI= 0
##$NZP= 0
##$OFFSET= 14.38212
##$PC= 1
##$PHC0= -1360.891
##$PHC1= 10.04947
##$PH_mod= 1
##$PKNL= yes
##$PPARMOD= 0
##$PSCAL= 0
##$PSIGN= 0
##$REVERSE= no
##$SF= 200.129724274929
##$SI= 16384
##$SIGF1= 3
##$SIGF2= 2
##$SINO= 400
##$SIOLD= 16384
##$SREGLST= <1H.CDCl3>
##$SSB= 0
##$STSI= 0
##$STSR= 0
##$SW_p= 3205.1282051282
##$SYMM= 0
##$S_DEV= 0
##$TDeff= 0
##$TDoff= 0
##$TI= <>
##$TILT= no
##$TM1= 0
##$TM2= 0
##$TOPLEV= 0
##$USERP1= <user>
##$USERP2= <user>
##$USERP3= <user>
##$USERP4= <user>
##$USERP5= <user>
##$WDW= 1
##$XDIM= 8192
##$YMAX_p= 0
##$YMIN_p= 0
$$ End of Bruker specific parameters
$$ ---------------------------------
##NTUPLES= NMR FID
##VAR_NAME=  TIME,          FID/REAL,        FID/IMAG
##SYMBOL=    X,             R,               I
##VAR_TYPE=  INDEPENDENT,   DEPENDENT,       DEPENDENT
##VAR_FORM=  AFFN,          ASDF,            ASDF
##VAR_DIM=   8192,          8192,            8192
##UNITS=     SECONDS,       ARBITRARY UNITS, ARBITRARY UNITS
##FACTOR=    0.0002768,     1,               1
##FIRST=     0,             0,               0
##LAST=      2.2672688,     0,               0
##MIN=       0,             -71580,          0
##MAX=       2.2672688,     95758,           0
$$ Real data points
##PAGE= N=1
##DATA TABLE= (X++(R..R)), XYDATA
0 0 0 0 0 0 0 0 0 0 0 0 0 0 0 0 0 0 0 0 0 0 0 0 0 0 0 0 0 0 0 0 -1 2 -3 5 -5 5 -5 5 -5 5 -6 6 -6 8 -9 9 -11 11 -11
49 -11 13 -13 16 -16 19 -22 25 -31 37 -44 54 -67 89 -118 164 -239 371 -626 1219 -3103 20256 95758 -6467
72 -6467 -25922 40085 -9502 -46704 -19419 14150 2215 -20422 38747 24190 -71393 -2683
84 -2683 50685 -35708 -10285 48667 3910 -15991 -4018 7047 -1922 -17301 39125 28482 -62700
97 -62700 -13353 29072 -39395 -13438 35071 6368 -2433 -4672 -6749 -15566 -24478 34807 35001 -26856
111 -26856 28681 45806 -37603 -21688 11421 -8679 4846 8405 4810 -1577 -22504 11843 10945
124 10945 -34192 13068 27537 -24763 -2282 8725 -7799 11528 564 -696 7256 -19281
136 -19281 3393 7759 -33245 5187 25412 -11861 -2973 -7868 -16776 2086 -12555 1890 23814
149 23814 -2540 17794 23319 -20173 3878 16353 -12216 2068 879 276 14208 -13814 -6457
162 -6457 10256 -20145 1998 17146 -18700 371 13716 -3659 6178 -4168 -1199 11258 -20188
175 -20188 -4506 16725 -17119 4583 21454 -16222 -3299 7292 -10984 -6282 -13773 -435
187 -435 14725 -13645 5631 19365 -20868 1180 18532 -14046 3694 15249 1255 8414 -2054
200 -2054 3743 10143 -20541 -1721 11505 -22115 2404 16135 -14761 731 6415 -5992 2258
213 2258 -9284 -443 10945 -12407 8909 19428 -15014 3983 11057 -17003 -443 2888 -6699
226 -6699 4629 -6186 999 8981 -16233 690 8913 -18103 5906 13922 -7539 10019 5800
239 5800 -4839 6531 -8510 -3800 6190 -15172 2969 12192 -11418 7612 8011 -11339 6065
252 6065 -574 -6304 9024 -6170 33 10738 -11660 2024 7132 -14799 3794 4498 -7798
265 -7798 11292 1670 -3833 9418 -8536 -3019 6872 -13444 1478 8196 -8645 8895 5395
278 5395 -7558 7809 -4674 -7867 6626 -9756 -2226 8107 -10905 2874 6630 -9709 6816
291 6816 2629 -5684 12369 790 -465 11761 -7542 -1549 5538 -14155 -719 2074 -11154
304 -11154 6954 1987 -5198 11356 -2293 -2287 10051 -7305 1441 8776 -9368 3482 2825 -11433
318 -11433 4180 -3865 -10074 6844 -4743 -1519 10966 -5569 3464 8728 -8738 4375 3056
331 3056 -8838 7391 53 -4930 9436 -3853 -1491 7854 -8827 863 5465 -10232 3726
344 3726 1490 -9815 4998 -3205 -6879 6707 -4838 1101 10656 -4654 6759 9269 -7198
357 -7198 5888 1919 -9935 4245 -3648 -6317 5150 -6922 -694 5678 -9541 3602 5230
370 5230 -9684 6606 3879 -6735 6999 -957 -3749 5572 -6015 1302 5898 -8510 6028
383 6028 5423 -9786 6572 2655 -8539 4416 -2420 -3688 4922 -5364 2488 4467 -8387 7464
397 7464 4732 -9739 8038 4385 -5768 6790 -173 -2205 3536 -7050 269 488 -10812 5531
411 5531 1219 -12161 6346 2537 -5976 6569 -542 -737 5740 -4373 2828 1717 -9049 6819
425 6819 1356 -10964 6247 771 -6167 5718 -1926 604 7154 -3907 3266 1900 -8039 7810
439 7810 2295 -8527 7352 1449 -3555 5588 -4237 171 6568 -4979 3168 2032 -9065 4521
453 4521 -663 -9875 4491 68 -2141 3497 -7632 -255 5734 -6759 4065 4506 -6768 5826
467 5826 1721 -8319 1934 -866 572 3764 -7462 3085 5321 -10126 3337 5597 -6325
480 -6325 7367 5125 -6517 177 -525 3065 3341 -6577 7599 7078 -10618 4430 5014 -9242 6232
495 6232 7067 -5009 -1456 -2691 -389 -4426 -11879 7790 6476 -11023 6235 4478 -12312 4390
509 4390 7983 -3553 39 1912 4033 -5102 -12666 7074 2763 -12467 8915 5908 -13038 3050
523 3050 6068 -5557 -224 6091 9076 -2523 -9849 8894 1676 -11110 12750 8817 -9924 5750
537 5750 5345 -8860 -4594 1779 6490 -2602 -7711 9406 -1641 -15165 7742 4138 -9883 8075
551 8075 7129 -6827 -4319 -180 4899 -2789 -6562 10278 -927 -13790 6840 1131 -10731 7463
565 7463 7005 -3857 -1697 -543 3347 -3751 -6178 11937 3279 -7973 8889 55 -11335 5166
579 5166 4842 -1474 1641 922 4805 -2921 -8281 7589 919 -7709 8578 1264 -8463 3668 1135
594 1135 -2266 505 -788 6009 -1438 -9589 4735 -439 -7823 7512 1759 -6531 2253 -1529 -2575
609 -2575 -978 -2590 7631 1931 -7244 6230 236 -8780 4917 1616 -2943 5095 1511 1363 -1009
624 -1009 -5272 6769 1815 -7260 7192 1831 -7916 3919 1013 -3324 2611 258 2365 -1442
638 -1442 -6306 6461 348 -8307 7299 2941 -7080 2936 -431 -4871 335 -138 4397 -171
652 -171 -5585 6631 -793 -9887 5800 2057 -6121 4365 1477 -2381 249 -1465 3601 -894 -5046
667 -5046 8685 1530 -7443 7011 2302 -5201 4747 1321 -2045 -397 -2592 3123 -1430 -5564 7673
682 7673 2 -8079 5673 162 -6135 3629 558 -850 1356 -1642 3512 -2061 -6544 6003 -537
697 -537 -6505 6400 448 -4703 3480 -955 -1066 569 -2677 3810 -10 -4263 7322 796 -4865
712 -4865 6492 288 -3120 3831 -1076 -7 1257 -2906 3748 -604 -5434 4717 -1564 -5545 4955
727 4955 -1081 -2758 3623 -2173 127 925 -4060 2936 -632 -4724 5266 -590 -3919 4740 -2008
742 -2008 -2499 2825 -2967 1094 1915 -3293 4354 954 -3456 5319 -687 -3236 4695 -1559 -627 3689
758 3689 -2743 1879 1760 -3987 3380 -363 -4295 4154 -1556 -3042 3725 -3018 -1223 2147 -4312
773 -4312 1164 1343 -4033 3726 391 -3094 4647 -1386 -2374 3648 -3093 -186 2901 -3617 2343 1469
789 1469 -3860 3744 -306 -3366 4125 -1640 -1407 4129 -2595 678 2942 -3925 2260 1054 -3871
804 -3871 3824 -382 -2857 4115 -2115 -1528 3066 -4024 191 2048 -4269 2576 1145 -3635 3872
819 3872 -558 -2634 3951 -2043 -580 3778 -2951 1743 2564 -3778 2822 330 -4057 3531 -1262
834 -1262 -2682 3709 -2582 -817 2840 -3759 982 1421 -3938 3098 319 -3191 4304 -1282 -2189 3859
850 3859 -2606 -610 3078 -3302 1710 1560 -3270 3424 -489 -3317 4074 -1686 -1910 4367 -2359 249
866 249 3476 -2582 2005 1129 -3011 3621 -840 -2821 4357 -2318 -2034 3644 -3486 -866 2228 -3516
882 -3516 1105 201 -3037 3430 -1510 -2579 4262 -2693 -1455 4197 -2953 248 3125 -2628 1642
897 1642 162 -2599 3306 -1996 -2121 4335 -2797 -776 4091 -3388 181 2829 -2674 2065 590
912 590 -1789 4132 -1449 -1589 4223 -2965 -383 3644 -4021 230 1906 -3423 1825 -459 -2604 3678
928 3678 -2249 -2113 3531 -3003 118 3353 -3292 1463 1813 -3250 2462 -693 -2505 4156 -1500 -1892
944 -1892 3186 -3068 -471 2046 -3635 1587 1034 -2785 3596 -976 -2605 4812 -920 -1517 4008 -1554
960 -1554 334 1824 -2639 2264 10 -2331 4346 -2142 -3685 4698 -1990 -2786 3434 -1424 -140
975 -140 849 -2477 1896 -1497 -2083 5431 -2511 -3058 5884 -2279 -3642 3088 -1306 -361 637 -1426 1781
992 1781 -3046 -2133 5479 -3422 -2752 7125 -1705 -3199 3774 -614 -216 1271 496 2994 -2713 -938
1008 -938 5370 -4881 -2875 7321 -1942 -3109 3642 -1504 -1793 -155 -2 2393 -2872 117 5531
1023 5531 -5899 -3275 6741 -2769 -2392 4665 -1041 -1524 -567 -822 1006 -3497 777 5842 -5645
1038 -5645 -2616 5853 -3894 -2242 4868 -64 516 1081 -283 1270 -3731 897 6095 -4400 -962
1053 -962 5762 -4483 -2967 2803 -1697 856 1277 23 1186 -4435 -716 4378 -4460 -171 6410
1068 6410 -2825 -1675 2054 -2706 588 889 485 3082 -3083 -880 3244 -5527 -1407 5215 -1981
1083 -1981 -42 1889 -2608 411 -796 -366 3947 -1724 298 4433 -4798 -1980 3795 -1989 653
1098 653 1956 -1486 1454 -2286 -2083 3214 -2865 -74 5399 -3363 -1998 2662 -2360 74 989 -132
1114 -132 3302 -1937 -1390 3509 -3871 -1101 5450 -2594 -1356 2866 -2048 -748 -695 -832 3128 -2207
1130 -2207 -639 4339 -4203 -1549 4962 -2733 -1047 3548 -772 -53 -976 -604 2638 -3015 -360 4690
1146 4690 -4006 -1441 4565 -3611 -1689 2770 -716 470 -605 -74 2898 -3434 -243 4814 -4028
1161 -4028 -519 4924 -3099 -1156 2391 -1144 404 -813 -60 2902 -3604 -323 4029 -4300 -480
1176 -480 4421 -2872 -416 2263 -1240 961 -774 111 3144 -2981 -47 3763 -4394 -682 3204
1191 3204 -3358 -412 1448 -1676 896 -1410 -394 2689 -2955 436 3951 -3704 102 3187 -3008
1206 -3008 390 1452 -1370 1685 -1056 -408 2797 -3036 162 3453 -3414 398 2509 -2981 817
1221 817 883 -1482 2109 -1022 -76 3260 -2490 400 3148 -3196 593 1992 -3099 846 -218 -2122
1237 -2122 1613 -1945 -1006 2627 -2990 109 2772 -3018 763 1862 -2375 1560 196 -1447 2348
1252 2348 -1579 -451 2892 -2460 316 2588 -2893 1062 1335 -2582 1577 -346 -1644 2410 -1583
1267 -1583 -379 2879 -2203 833 2673 -2386 1520 1081 -2220 1925 -759 -1750 2151 -2300 -876
1282 -876 2120 -2878 349 1684 -2696 1471 563 -1954 2226 -831 -1174 2714 -1966 -324 2487 -2521
1298 -2521 725 1670 -2508 1480 259 -1932 2303 -1164 -1229 2548 -1999 -144 2463 -2286 933 1765
1314 1765 -2041 2037 503 -1447 2452 -1310 -1035 2267 -2544 -236 1828 -2968 645 1064 -2506
1329 -2506 1514 -10 -1477 2333 -1190 -343 2541 -2118 699 2046 -2456 1173 1214 -2187 1720 -75
1345 -75 -1697 1879 -1506 -562 1786 -2599 565 1540 -2718 1588 1042 -2298 2176 142 -1259 2272
1361 2272 -1055 -162 1748 -2312 1085 1145 -3049 1521 463 -2735 1842 -327 -1707 1927 -1067 -19
1377 -19 1695 -1778 1524 1244 -2419 2441 610 -2297 2396 -283 -1716 2026 -1261 -561 929 -2043
1393 -2043 1085 606 -2358 2214 -147 -2094 2604 -843 -1549 2468 -1194 -226 1411 -1713 1209 421
1409 421 -2192 1902 -530 -1691 2649 -1446 -1420 2434 -1708 -449 1400 -1784 1090 647 -1408 1984
1425 1984 -516 -699 2940 -1826 -741 2537 -2328 -291 1639 -2019 779 723 -1425 1112 -1084 -464
1441 -464 2300 -2020 238 2859 -2505 45 1955 -2557 549 1233 -1039 1012 -611 209 1699 -2571
1457 -2571 560 2479 -2953 548 1812 -3170 390 1409 -1287 570 -265 705 1113 -2832 1232 2202
1473 2202 -3178 1593 2320 -3458 357 1183 -2104 117 193 1059 1024 -2397 1627 1339 -3670 2054 2234
1490 2234 -3121 1666 1809 -2109 -39 31 771 674 -1775 2095 906 -3747 1892 1183 -3626 1712 1517
1507 1517 -2424 -244 -611 -18 190 -1397 2579 1235 -2849 2287 435 -3657 1988 1329 -1589 1048
1523 1048 -127 -409 -256 -2129 1610 1009 -2078 2952 726 -3101 1804 502 -1514 1615 98 546
1539 546 578 -2115 1228 406 -1946 2649 627 -2609 1457 -751 -1926 1007 -772 599 1021 -2058
1555 -2058 847 153 -2421 1852 793 -1122 2200 -282 -1087 841 -1876 436 1388 -1848 1347 1102
1571 1102 -2338 1152 255 -1335 1523 -305 -35 1143 -2003 855 1390 -2401 1449 1433 -2277 914
1587 914 185 -1349 928 -505 620 1032 -2183 1142 901 -3272 1322 1471 -2007 1264 945 -858
1603 -858 488 -782 787 838 -2086 2080 1461 -3029 1527 1111 -2659 685 547 -923 198 -793 799
1620 799 176 -2438 1832 971 -3076 1741 1214 -2443 1144 843 -439 517 -654 1014 57 -2490 1904
1637 1904 679 -2735 2209 1239 -2272 922 269 -781 410 -559 1439 540 -1964 2099 544 -2793
1653 -2793 1823 750 -1917 1383 226 -553 332 -1169 761 31 -2315 1569 192 -2594 1853 453
1669 453 -1673 1491 31 -304 551 -1070 1052 363 -1918 1938 491 -2217 1621 -115 -1901 1054
1685 1054 -321 -72 936 -997 1132 305 -2127 1775 528 -1689 1992 412 -1049 1421 -372
1700 -372 90 616 -1538 1005 165 -2230 1662 36 -1942 1674 -168 -1028 1264 -897 186 936
1716 936 -1310 1438 508 -1931 1409 -345 -1943 1273 -404 -730 1262 -992 230 424 -1679 1088
1732 1088 231 -1696 1751 311 -1059 1799 -345 -448 1327 -1172 466 668 -1602 1299 440 -1765
1748 -1765 1564 -104 -1380 1440 -767 -153 1357 -880 895 788 -1618 1101 -22 -1971 1368
1763 1368 -337 -1187 1360 -880 -292 940 -1528 589 499 -1700 1356 276 -1523 1468 -492 -1072
1779 -1072 1300 -939 -75 951 -1144 1104 712 -1315 1660 97 -1393 1472 -498 -849 1455 -872
1795 -872 159 1025 -1398 814 195 -1564 1411 -99 -1154 1561 -517 -741 1188 -1125 101 841
1811 841 -1305 967 360 -1347 1546 -310 -1295 1315 -1144 -823 1252 -1112 96 922 -1025 1012
1827 1012 320 -972 1528 -432 -666 1882 -751 -400 1372 -1281 -17 757 -1257 813 -32 -1142
1843 -1142 1565 -562 -607 1674 -1224 -394 1414 -1310 234 979 -1049 945 27 -958 1236 -853
1859 -853 -516 1467 -1463 -137 1394 -1498 244 760 -1431 727 23 -822 1285 -637 -52 1602
1875 1602 -1324 294 1343 -1694 603 836 -1463 799 -61 -970 916 -806 -379 1059 -1431 601
1891 601 1211 -1390 1045 816 -1359 1238 176 -733 1123 -653 -44 973 -1516 629 697 -1801 895
1908 895 194 -1604 1293 -25 -889 1173 -381 -13 900 -1090 734 577 -1433 1336 98 -1653
1924 -1653 1316 -179 -1279 1041 -607 -285 851 -1116 717 266 -1187 1409 -105 -1266 1799
1939 1799 -218 -1102 1374 -655 -222 759 -847 668 -182 -1290 1456 -610 -1234 1939 -420 -907
1955 -907 1624 -681 -410 705 -728 727 -91 -903 1304 -904 -1211 1990 -685 -861 1779 -610
1971 -610 -415 771 -931 718 -170 -812 1493 -1081 -976 1628 -1392 -827 1711 -814 -105 923 -737
1988 -737 563 -159 -537 1591 -816 -526 1647 -1424 -716 1306 -1341 -7 769 -893 519 -132 -654
2005 -654 1449 -569 -321 1718 -1152 -288 1257 -1310 416 792 -792 904 -284 -1048 1081 -1119
2021 -1119 -595 1471 -1023 11 979 -1448 331 488 -772 1297 16 -515 1495 -774 -537 1305
2037 1305 -1138 -118 739 -1277 445 55 -1253 1049 -344 -697 1514 -813 -536 1365 -764 241
2053 241 918 -741 763 -123 -1202 1074 -705 -1007 1631 -810 -545 1158 -1023 -157 513 -759 1026
2070 1026 77 -757 1591 -785 -940 1709 -664 -446 1397 -623 361 538 -725 964 -509 -927 1432
2087 1432 -1278 -1192 1439 -1065 -348 1324 -498 319 318 -605 995 -626 -662 1668 -980 -894 1512 -1374
2105 -1374 -741 826 -1000 305 375 -244 1311 -286 -433 1640 -1137 -573 1687 -931 -209 1129 -822
2122 -822 260 64 -730 1096 -580 -461 1587 -1078 -420 1452 -1255 -234 793 -946 186 -96
2138 -96 -759 988 -660 -378 1555 -1253 -704 950 -1569 -241 856 -684 759 201 -602 925 -1031
2155 -1031 -364 1672 -780 97 1689 -1066 -48 582 -1121 773 -4 -377 1326 -672 -343 1640
2171 1640 -875 228 1523 -1241 -18 100 -1233 522 -326 -570 997 -1130 -732 940 -1366 -48
2187 -48 1470 -627 760 614 -1000 475 -704 -768 1205 -773 -215 1270 -1235 -114 928 -1025
2203 -1025 602 477 -601 1163 -212 -242 1499 -774 -36 1239 -1342 -144 758 -1201 716 446
2219 446 -679 853 -763 -972 730 -1079 -140 1205 -925 350 737 -1026 524 23 -717 1140
2235 1140 -631 -476 1200 -1144 -272 925 -1231 84 453 -1018 702 199 -414 1314 -452 -368 1148
2252 1148 -1159 -124 984 -954 551 588 -922 872 -286 -973 864 -863 -206 1321 -928 182
2268 182 801 -1170 391 208 -933 830 -221 -489 1287 -647 -195 1103 -1318 -11 641 -1081
2284 -1081 602 319 -773 947 -418 -523 776 -958 -112 1030 -974 527 965 -909 820 299
2300 299 -919 844 -393 -448 1053 -792 -19 874 -1285 167 504 -1323 666 218 -745 1171 -271
2317 -271 -373 894 -1064 -79 687 -1273 608 597 -898 1009 105 -899 823 -541 -396 1015 -689
2334 -689 418 751 -933 712 157 -1227 839 -210 -784 1056 -257 -109 979 -808 137 461 -1142
2351 -1142 604 289 -903 1103 -208 -908 709 -871 -582 610 -793 390 631 -770 881 125
2367 125 -1001 974 -384 -818 1192 -458 -175 926 -648 215 292 -960 764 -165 -862 1256 -307
2384 -307 -533 1186 -659 -279 919 -804 364 564 -598 917 -105 -751 764 -923 -712 714
2400 714 -1152 -145 784 -986 264 328 -828 623 -4 -417 1233 -504 -41 1221 -1008 -88 685
2417 685 -1149 118 365 -717 726 -32 -266 972 -609 -136 1065 -1145 169 902 -986 417
2433 417 410 -768 436 -369 -512 728 -708 58 919 -1095 249 520 -1245 417 97 -912 582
2450 582 -101 -217 915 -543 351 776 -1212 343 624 -1203 588 388 -819 633 -103 -438 395
2467 395 -626 315 851 -857 782 471 -1250 587 182 -947 791 -96 -352 638 -594 340 544
2484 544 -1002 667 275 -974 857 31 -837 763 -277 -344 571 -782 149 372 -871 913 556
2501 556 -721 973 -164 -1071 752 -493 -315 685 -595 306 330 -966 469 -25 -746 1064 -120
2518 -120 -604 1025 -607 -253 691 -802 279 447 -827 728 86 -734 912 -157 -254 979 -760
2535 -760 -208 567 -1019 309 513 -738 752 34 -669 711 -368 -124 1021 -435 238 777 -1039
2552 -1039 59 293 -955 479 101 -542 727 -582 -366 566 -671 278 851 -980 426 397 -844
2569 -844 604 149 -380 582 -478 -128 655 -988 212 537 -1052 495 416 -931 499 -85 -495 678
2587 678 -274 334 836 -727 382 425 -1039 644 301 -798 639 -62 -595 266 -764 -47 491 -754
2605 -754 545 499 -1021 611 253 -731 652 -70 -342 518 -589 13 416 -877 607 451 -911 742
2623 742 -57 -850 698 -116 -220 724 -495 149 401 -979 558 424 -642 882 102 -799 602 -324
2641 -324 -233 629 -449 292 289 -818 590 93 -774 771 49 -567 598 -583 -419 556 -517 391 496
2660 496 -789 525 60 -909 719 -7 -516 706 -506 -269 571 -663 435 464 -608 608 57
2677 57 -775 667 -124 -326 749 -426 -26 467 -787 262 250 -753 770 101 -674 584 -341 -381
2695 -381 737 -454 46 489 -679 361 190 -817 671 90 -635 757 -305 -385 640 -550 81
2712 81 470 -772 311 71 -775 612 -57 -436 847 -73 -137 606 -612 190 521 -724 473 200
2730 200 -705 504 -80 -498 687 -403 -192 515 -726 189 405 -764 483 265 -645 677 -82 -466
2748 -466 614 -260 -29 604 -649 275 269 -903 557 -7 -779 626 -184 -458 521 -397 -6 537 -505
2767 -505 406 219 -562 580 -56 -665 644 -313 -391 563 -492 -90 426 -703 402 152 -714 709
2785 709 -33 -537 842 -292 -239 717 -513 25 503 -525 400 99 -539 696 -275 -524 608 -579
2803 -579 -233 744 -627 -100 514 -580 322 156 -466 740 -286 -342 811 -607 -311 656 -651 -81
2821 -81 442 -538 304 11 -449 595 -249 -181 693 -641 1 592 -715 233 569 -634 246 153 -296 551
2841 551 -356 -202 652 -710 193 589 -838 226 331 -904 323 146 -553 536 -352 17 618 -634
2859 -634 233 575 -766 450 310 -767 421 50 -487 422 -360 -106 448 -658 297 357 -737 511
2877 511 331 -694 687 13 -448 567 -207 3 353 -543 285 155 -773 656 46 -849 709 -133
2895 -133 -590 509 -264 -143 358 -467 449 220 -488 758 -42 -683 726 -259 -521 714 -385 -244
2913 -244 396 -391 232 24 -446 565 -154 -541 883 -348 -381 876 -461 -118 465 -448 150 140 -441
2932 -441 543 -249 -457 695 -470 -283 730 -581 -159 566 -382 216 134 -300 545 -230 -229 752 -503
2951 -503 -149 712 -656 51 459 -640 174 47 -404 382 -313 -158 703 -470 62 736 -597 50 551
2970 551 -558 338 300 -445 512 -293 -226 485 -557 25 560 -768 192 464 -768 304 122 -418 504
2989 504 -165 -102 560 -642 170 486 -674 369 316 -726 468 198 -466 496 -232 -116 490 -677 168
3008 168 344 -727 415 462 -547 545 28 -490 502 -192 -49 519 -438 188 301 -844 453 -53
3026 -53 -712 628 -99 -486 535 -272 -283 370 -544 330 208 -631 412 89 -568 661 -171 -499 699
3045 699 -493 -164 433 -544 98 380 -525 556 0 -492 705 -343 -226 749 -365 20 493 -604
3063 -604 147 175 -587 569 -94 -406 501 -480 -333 509 -454 42 299 -730 260 155 -542 501 -41
3082 -41 -259 689 -441 -301 634 -712 -22 543 -685 300 234 -515 463 -192 -442 613 -377 -93 610
3101 610 -683 15 478 -568 366 298 -534 593 -282 -402 660 -444 -30 598 -653 91 300 -682
3119 -682 323 120 -441 606 -190 -135 562 -419 -21 545 -625 345 314 -751 312 -82 -529 612 -254
3138 -254 -295 487 -692 -41 398 -613 317 338 -479 537 -67 -546 531 -298 -82 603 -513 138 374
3157 374 -711 395 227 -413 573 -165 -448 636 -364 -98 607 -324 142 305 -622 277 54 -523 573
3176 573 -166 -380 522 -542 -261 395 -598 158 333 -563 300 -50 -500 704 -144 -204 641 -298 -76 444
3196 444 -547 139 345 -420 458 -1 -444 561 -154 -156 721 -453 -63 439 -627 180 225 -427 549 -31
3216 -31 -415 512 -329 -242 726 -557 -33 328 -715 241 147 -528 401 -101 -409 581 -397 -245 542 -448
3236 -448 185 511 -579 380 145 -439 491 -110 -195 460 -406 -120 619 -629 186 279 -638 515 -18 -502
3256 -502 538 -27 -269 717 -384 -72 462 -671 171 277 -636 351 99 -649 594 -269 -297 448 -380
3275 -380 -60 491 -559 343 243 -643 601 90 -464 427 -184 -361 440 -380 75 361 -650 273 138
3294 138 -610 625 62 -487 655 -133 -317 490 -409 183 326 -547 453 83 -498 717 -185 -530 621
3313 621 -305 -177 519 -459 109 238 -489 286 46 -400 787 -157 -446 653 -295 -137 558 -412 132
3332 132 359 -418 284 -204 -516 456 -338 -348 550 -392 -159 506 -562 104 343 -379 466 -48 -346 587
3352 587 -277 -38 686 -550 -25 573 -618 217 247 -492 403 -10 -407 492 -208 -207 506 -589 37 392
3372 392 -553 148 254 -649 370 -54 -292 448 -461 34 419 -661 183 379 -618 372 311 -569 531
3391 531 71 -227 540 -328 -11 463 -589 300 280 -679 483 224 -603 485 40 -350 400 -368 100
3410 100 418 -584 299 239 -560 491 72 -487 592 -72 -202 546 -396 110 292 -583 322 80 -466
3429 -466 484 -51 -557 550 -78 -302 516 -347 24 287 -551 436 204 -418 487 -111 -447 576 -269
3448 -269 -275 415 -446 -41 289 -525 300 19 -408 605 -143 -404 673 -221 -257 532 -441 82 301 -416
3468 -416 212 -34 -329 464 -227 -261 479 -448 -116 479 -515 12 326 -496 284 49 -288 492 -182 -165 629
3489 629 -420 -127 477 -466 118 284 -482 221 -60 -341 422 -241 -199 570 -499 142 453 -591 160
3508 160 167 -473 344 -41 -309 527 -300 -126 474 -560 5 356 -623 380 254 -529 386 -32 -259 576
3528 576 -231 -77 550 -409 102 339 -701 269 93 -418 499 -162 -329 350 -321 38 496 -491 163 298
3548 298 -556 394 29 -359 418 -69 -302 414 -264 -61 417 -471 144 327 -518 298 78 -439 395 -242
3568 -242 -192 477 -355 -122 304 -399 197 236 -347 375 7 -371 390 -216 -369 477 -426 23 308 -387 213
3589 213 198 -356 424 -90 -345 514 -322 -132 472 -314 34 443 -507 264 -23 -478 373 -191 -319 429
3609 429 -273 -132 504 -412 149 411 -255 319 -25 -406 440 -208 -233 427 -331 -150 330 -500 49 203
3629 203 -533 188 27 -433 383 -264 -233 411 -380 53 414 -585 103 191 -443 419 85 -256 617 -304 -237
3650 -237 452 -455 -39 514 -392 209 164 -460 230 6 -233 456 -239 -127 390 -380 34 524 -446 317
3670 317 221 -534 267 -192 -350 354 -280 -47 312 -495 0 351 -387 329 170 -393 324 -128 -312 452
3690 452 -205 -70 475 -462 3 121 -614 255 93 -330 313 -269 -340 458 -268 61 380 -473 234 198 -420
3711 -420 293 163 -321 438 -221 -321 293 -336 -57 332 -384 225 190 -461 257 -75 -109 521 -106 -207 382
3732 382 -350 -89 298 -417 283 122 -434 253 -150 -375 377 -204 -251 378 -384 -36 240 -391 167 133 -350
3753 -350 492 -86 -290 383 -366 -129 330 -430 0 171 -403 207 42 -328 406 -113 -138 323 -341 8
3773 8 341 -316 167 276 -481 331 78 -181 323 -213 -171 313 -434 -59 449 -449 76 277 -337 297 -25
3794 -25 -166 439 -184 31 449 -457 14 353 -414 72 134 -476 231 22 -417 293 -126 -118 309 -394 145
3815 145 281 -484 245 186 -347 385 133 -249 358 -224 -101 420 -286 185 275 -488 300 197 -441 351 48
3836 48 -243 324 -258 -168 318 -253 139 282 -410 212 80 -372 434 -93 -366 371 -257 -46 296 -278 65
3857 65 21 -404 290 42 -401 537 -29 -227 383 -202 -39 234 -124 115 18 -299 371 -49 -425 460 -177
3878 -177 -260 445 -272 25 267 -297 264 39 -389 390 -114 -313 462 -224 -207 324 -334 -116 295 -419 67
3899 67 47 -356 413 -149 -210 520 -251 -34 470 -342 156 435 -367 312 123 -294 307 -187 -174 378 -374
3920 -374 -76 362 -365 57 240 -378 187 46 -204 268 -134 -26 346 -269 71 307 -418 57 208 -359
3940 -359 227 91 -337 304 -204 -151 320 -275 37 260 -275 339 323 -363 345 121 -368 216 -34 -112 299
3961 299 -272 -34 155 -401 311 221 -449 348 29 -308 381 -86 8 460 -273 213 288 -348 341 71 -490
3982 -490 396 -25 -318 244 -162 -110 295 -363 61 248 -349 271 127 -411 355 34 -220 447 -151 -47
4002 -47 201 -439 132 254 -315 435 7 -283 385 -122 -276 435 -159 -28 281 -388 60 97 -378 355 -32
4023 -32 -273 437 -62 -141 374 -233 75 285 -464 102 166 -462 173 -38 -265 488 -129 -233 334 -357 201
4044 201 324 -296 355 164 -267 318 -51 -278 330 -266 -190 253 -354 76 224 -422 281 20 -384 364
4064 364 -63 -240 409 -133 -16 323 -363 159 175 -373 153 28 -316 349 -20 -306 206 -161 19 295
4084 295 -298 226 209 -345 366 5 -372 403 -81 -299 245 -284 -108 27 -361 177 103 -310 471 -35 -359
4105 -359 381 14 -91 325 -87 -14 139 -409 192 135 -448 351 4 -372 379 -167 -156 199 -201 113 255
4126 255 -322 301 14 -399 371 120 -280 437 -102 -122 202 -226 153 191 -444 271 -28 -422 462 -72 -287
4147 -287 362 -81 -78 303 -279 90 148 -219 319 2 -399 507 -67 -268 322 -157 -152 237 -218 34 96 -309
4169 -309 248 -159 -294 445 -169 -190 444 -306 -109 140 -239 100 181 -292 264 -39 -367 483 -256 -239 355
4190 355 -213 -41 221 -337 112 75 -363 348 -127 -222 284 -112 -68 302 -285 29 191 -382 277 51 -385
4211 -385 409 -84 -258 332 -242 -174 191 -385 146 73 -321 371 37 -336 308 -69 -185 433 -140 -64 220
4232 220 -365 3 40 -424 431 81 -291 392 -23 -290 333 -135 -103 197 -237 159 -32 -418 341 48 -400
4253 -400 385 -253 -314 188 -188 -151 147 -380 170 -39 -334 374 -82 -256 446 -35 -233 324 -113 -38 107
4274 107 -275 134 -121 -303 333 -101 -164 469 -203 -77 395 -129 68 247 -309 227 73 -373 365 -334
4294 -334 -277 316 -252 -150 447 -334 -39 138 -257 202 -1 -317 476 -192 -150 450 -270 6 446 -298 39
4315 39 153 -249 221 -61 -146 186 -67 -172 462 -294 51 438 -275 87 232 -250 204 -18 -248 345 -136
4336 -136 -76 317 -272 -20 274 -428 130 114 -304 189 -28 -198 333 -302 -56 241 -407 85 247 -357 231
4357 231 161 -293 258 -11 -278 279 -198 -95 254 -316 138 160 -392 153 71 -265 284 2 -191 254 -155
4378 -155 -49 219 -308 125 196 -313 215 -27 -241 299 -14 -183 174 -205 -74 108 -388 152 60 -312 428
4399 428 28 -326 455 -38 -133 307 -213 -91 105 -221 242 24 -306 305 24 -286 356 -214 -284 404 -273
4420 -273 1 318 -229 81 17 -336 302 -31 -205 405 -135 -195 326 -242 11 107 -315 156 -27 -238 325
4441 325 -53 -164 462 -163 -63 445 -228 -70 195 -278 82 69 -257 250 -231 -244 321 -308 -6 403 -190
4462 -190 40 275 -293 106 61 -290 264 -197 -45 305 -386 45 313 -297 74 333 -199 143 -29 -282
4482 -282 177 -244 -125 248 -192 78 330 -393 278 130 -278 292 -117 -248 209 -206 -127 156 -308 153
4502 153 282 -326 165 163 -319 222 -56 -141 311 -212 -127 243 -310 87 217 -318 142 150 -257 317 -51 -147
4524 -147 336 -263 -100 278 -374 33 114 -289 219 -55 -226 281 -40 29 304 -281 26 262 -300 63 151
4545 151 -186 219 -14 -226 257 -272 -95 300 -272 -56 201 -356 124 205 -218 273 -3 -140 398 -256
4565 -256 -76 396 -247 -31 261 -291 7 65 -231 184 -178 -82 218 -229 -28 359 -311 -4 278 -393 76
4586 76 121 -189 221 -174 -262 240 -296 -31 369 -314 69 161 -277 56 178 -115 243 -126 -109 268 -344 -81
4608 -81 300 -326 -12 212 -277 146 6 -143 210 -215 -60 278 -301 31 257 -291 76 339 -210 127
4628 127 30 -198 171 -251 -194 210 -343 -17 371 -348 106 114 -217 191 78 -113 286 -119 80 364 -333
4649 -333 -14 215 -447 178 163 -231 172 -139 -189 228 -254 -32 335 -277 67 187 -287 166 223 -207 151
4670 151 -91 -38 170 -103 48 396 -363 17 119 -304 110 89 -194 272 -66 -63 228 -396 0 340 -360
4691 -360 97 226 -203 111 -92 -197 110 -200 5 260 -326 -107 200 -329 124 309 -312 127 32 -204
4711 -204 200 -162 -12 381 -271 14 359 -457 -27 223 -277 242 20 -123 170 -195 -44 407 -322 26
4731 26 371 -369 159 213 -365 145 -11 -143 394 -281 61 313 -409 -3 292 -443 185 38 -92 216 55
4752 55 -30 260 -219 23 292 -388 120 154 -277 204 144 -225 202 -31 -67 204 -186 69 180 -461 95 277
4774 277 -308 203 176 -334 231 -72 -174 125 -162 85 236 -347 141 246 -280 151 169 -230 302 -192 -132
4795 -132 195 -287 126 188 -168 155 72 -339 275 -36 -302 171 -189 -89 317 -257 51 85 -265 150 25
4816 25 -259 222 113 -103 298 -90 -56 180 -170 91 75 -214 216 89 -195 228 -205 -199 287 -231 -100 236
4838 236 -252 54 48 -228 28 83 -169 139 -113 -84 272 -230 -34 243 -333 28 133 -262 134 -55 -214
4859 -214 191 -155 -110 143 -118 80 302 -325 9 132 -279 110 82 -177 226 -80 -58 186 -285 -92 207
4880 207 -282 15 102 -354 207 -86 -148 132 -129 -149 269 -216 102 231 -388 220 124 -157 210 4 -157
4901 -157 144 -144 -64 175 -337 30 197 -233 228 126 -125 267 156 -74 185 -113 -32 238 -328 90 92
4922 92 -321 98 14 -151 191 -114 -53 124 -117 87 315 -259 53 125 -285 209 -60 -327 230 -63 -92 323
4944 323 -273 -62 80 -245 101 130 -261 187 -97 -284 274 -45 -157 198 -201 -16 157 -277 218 94
4964 94 -224 190 14 -231 283 -248 -217 155 -261 -38 162 -201 329 125 -192 250 -37 -82 164 -15 -63
4985 -63 120 -162 112 218 -302 149 65 -305 137 -9 -95 190 -141 -21 171 -114 185 127 -228 160 97 -266
5007 -266 126 34 -204 151 -207 0 237 -216 197 -39 -288 206 62 -195 229 -85 -196 323 -89 60
5027 60 128 -174 66 138 -331 260 -10 -200 187 -123 -89 155 -33 -15 134 -312 41 125 -90 63 67 -199 181
5050 181 -90 -53 151 -168 73 75 -325 239 91 -220 181 -67 -196 240 -37 -45 237 -86 204 60 -325 198
5072 198 113 -254 296 -9 -151 69 15 -44 85 -314 125 158 -248 294 27 -260 223 23 -187 186 -154
5093 -154 -74 105 -199 63 77 -241 223 -11 -345 95 7 -137 224 -34 51 20 -128 257 -14 -452 345 113
5115 113 -221 217 5 -79 179 -148 26 105 -216 239 43 -385 367 -94 -322 316 -90 -178 198 -88 24
5136 24 -58 -166 343 59 -281 301 -72 -379 211 -3 -90 182 -149 48 15 -242 362 50 -299 244 -64
5157 -64 -298 224 -98 -144 207 -173 121 -24 -271 192 -35 -261 235 36 -163 223 -61 -46 81 -135 236
5178 236 99 -145 304 -42 -253 333 -21 -224 112 -121 22 -23 -230 189 23 -325 340 32 -290 207
5198 207 19 -246 149 -48 34 23 -222 213 76 -199 289 -36 -266 97 -99 -156 76 -163 24 85 -191
5219 -191 195 -69 -330 314 -13 -273 192 -71 -45 81 -129 181 39 -224 359 11 -324 325 -42 -154
5239 -154 248 -10 -119 91 -122 147 45 -191 325 55 -359 295 -89 -281 191 -62 -90 141 -212 -13
5259 -13 110 -260 234 -45 -145 201 -34 -311 232 -22 -42 140 -170 82 -7 -148 281 -14 -135 339 -99
5280 -99 -124 207 -167 -43 95 -151 117 37 -195 148 -61 -225 236 -196 -172 203 -100 119 113 -235 237 76
5302 76 -203 213 -152 -201 282 -153 -83 182 -150 -17 184 -89 183 45 -154 329 -83 -194 354 -203 -61
5323 -61 164 -213 55 27 -321 260 6 -241 249 -88 -155 151 -151 48 120 -221 222 85 -226 195 -14
5344 -14 -259 110 -44 -85 192 -249 75 85 -201 114 141 -159 154 77 -197 217 -109 -169 242 -130 -15 153
5366 153 -163 149 42 -236 230 -154 -176 228 -61 -158 157 -118 14 67 -211 195 -14 -264 163 83 -156
5387 -156 196 -133 -84 178 -165 54 39 -303 37 72 -191 264 -102 -209 192 -140 -119 241 -42 51 11 -158
5409 -158 176 89 -209 280 -176 -105 243 -164 -170 172 -198 63 95 -160 196 102 -123 256 -31 -197 223 -180
5431 -180 -18 168 -227 75 210 -200 218 -42 -208 252 -50 -122 257 -198 46 160 -174 173 158 -144 157
5452 157 63 -100 295 -113 -8 159 -230 -106 107 -250 28 66 -233 269 -14 -139 178 -90 -5 147 -223
5473 -223 118 35 -288 89 20 -161 216 -167 -235 263 -131 29 127 -188 23 62 -161 195 -16 -131 229 -43
5495 -43 -98 283 -210 -43 174 -117 61 210 -293 189 -52 -215 164 -133 -214 216 27 -57 113 -207 90
5516 90 -69 -158 75 -30 -233 271 -44 -106 307 -176 9 11 -241 136 37 -200 288 -109 -224 285 -109 27
5538 27 272 -177 -75 107 -201 53 78 -91 98 -49 -73 222 -151 -119 169 -215 -51 88 -204 173 -63
5559 -63 -112 238 -272 -118 166 -146 -76 206 -204 -27 176 -109 186 -59 -174 236 -129 -36 236 -183 35
5580 35 178 -184 85 101 -67 265 -118 -148 221 -88 -38 209 -185 -42 274 -158 -34 5 40 77 -89 -142 307
5603 307 -148 -203 240 -274 -126 233 -110 -61 62 -47 68 -121 -165 250 -236 -10 228 -187 6 114 -154
5624 -154 -69 3 -83 210 -61 -113 332 -191 -134 210 -158 -102 141 -198 133 -42 -97 264 -155 23 296 -126
5646 -126 -62 303 -180 37 92 -120 -4 -22 -65 77 -149 -107 257 -198 -72 363 -200 -42 14 -179 -14 -172
5668 -172 31 260 -134 -27 226 -231 -101 146 -29 0 44 -89 156 -97 -102 321 -148 -184 319 -197 -124 70
5690 70 -129 42 83 6 285 -145 24 228 -292 25 307 -209 -21 108 -69 -51 -15 26 159 -37 0 338
5712 338 -182 -42 275 -200 -57 234 -50 114 -10 -27 72 -136 -122 291 -160 -68 245 -235 -25 187 -166
5733 -166 112 -10 6 38 -153 -18 270 -265 34 219 -184 -2 143 -268 32 -74 -20 119 -133 -56 157
5754 157 -199 130 321 -225 64 100 -240 65 52 -66 156 -160 -68 291 -278 -121 175 -204 112 59 -91
5775 -91 69 23 -104 191 -90 -36 129 -32 -20 135 -121 136 58 -153 132 -103 -85 186 -229 -98 16 -186
5797 -186 -55 135 -37 -6 -2 -101 93 -121 -158 191 -210 -24 244 -245 35 38 -156 68 29 -84 109 -168 -20
5820 -20 124 -149 62 167 -126 84 146 -40 155 -37 -51 153 -104 -35 129 -195 7 89 -172 8 45 -254
5842 -254 121 -77 -49 168 -80 -150 274 -48 29 157 -137 -37 56 -102 155 44 15 62 -178 95 227 -204
5864 -204 26 160 -174 40 -17 -148 166 -74 -162 311 -122 17 203 -213 -28 117 -213 30 155 -137 76
5885 76 -13 -58 123 -129 -18 132 -75 190 142 -123 95 10 -212 206 -10 13 86 -36 -117 221 -191 57 48
5908 48 -138 71 6 -133 111 -4 -4 152 -53 -40 86 -98 49 136 -168 183 -152 -162 108 14 -126 119 -199
5931 -199 29 6 -310 59 -6 -119 64 51 -71 4 -60 31 42 -188 115 31 10 57 22 -163 126 19 -43 219
5955 219 -133 -49 14 -80 68 332 -204 72 143 -19 249 -26 -72 72 -83 4 192 -261 39 39 -114 175 -73
5978 -73 -142 132 -104 -45 35 -203 -131 144 -108 21 58 -93 143 43 -127 25 -81 -118 156 -152 48 125 -213
6001 -213 -57 93 -126 83 36 -37 80 -88 -52 210 -124 -23 73 -150 195 66 -172 166 15 -51 157 -86
6023 -86 10 153 -265 27 202 -178 188 86 -60 73 -105 -36 -7 -149 34 58 -119 -12 48 -188 -26 -11
6045 -11 -42 129 41 32 53 -101 137 69 -139 175 94 -126 -1 89 -40 194 -56 -39 32 -153 34 73 -133 106
6069 106 126 -172 57 24 -260 126 -51 -59 174 -102 112 119 -121 129 76 -125 155 -45 -55 109 -18 4 69
6092 69 -147 106 176 -144 76 98 -114 52 -24 -57 88 -51 -13 27 -134 -10 94 -135 57 20 -107 115 -104
6115 -104 55 115 -171 32 -6 -223 174 58 -216 16 127 -84 36 -81 -199 129 -65 81 103 -190 -6
6136 -6 57 -184 162 148 -69 133 -161 -64 127 -159 42 125 -198 72 113 -161 63 95 -93 122 10 -8 -30
6159 -30 -133 132 28 -113 152 219 -164 65 67 -133 85 -80 13 58 -142 21 38 -259 105 59 -157 37 82
6182 82 -111 35 -43 -51 39 -164 104 17 -130 15 6 -197 41 38 -75 71 -88 -78 99 -157 163 139 -167 260
6206 260 57 -193 53 83 -68 20 -32 -23 58 -75 134 39 -124 116 53 -125 107 -71 -147 9 -148 6 158
6229 158 -26 96 116 -179 42 4 -250 89 -113 -29 166 -59 67 -6 -19 73 69 -210 162 -33 -84 143 -20
6252 -20 -54 69 -129 16 60 -72 120 -34 30 102 -48 -124 82 -8 31 -49 -82 94 30 -147 45 -60 -125 91
6276 91 64 -128 65 -116 -18 122 -165 -39 -70 -219 109 45 -338 124 -101 -65 104 -7 37 51 -165 77 13
6299 13 -175 85 29 -79 24 19 -53 139 -105 13 45 -104 88 -49 -79 236 -121 -161 155 -8 -92 151 -61
6322 -61 9 30 -47 151 138 -172 179 -86 -87 96 -110 -53 69 6 84 101 -172 130 71 -210 95 12 -129 112
6346 112 -100 -129 114 -192 173 55 -181 87 -200 -168 61 22 -76 114 -85 -64 129 -109 19 128 -121 84
6368 84 6 -124 69 -26 -29 154 2 -80 27 -142 55 127 -157 170 -1 -77 112 -135 -54 101 17 42 127 -27
6392 -27 81 -36 -85 251 -37 -84 78 -122 -92 77 -61 22 56 -140 -4 -33 -109 167 144 -61 244 -167 -138
6415 -138 97 -31 -1 85 -101 102 81 -156 -21 -24 -125 109 -32 -35 114 -71 -26 -8 -71 56 33 -150 83 -71
6439 -71 -80 20 -13 19 86 -85 -43 44 -167 25 97 -83 52 -90 -88 120 6 6 110 -116 45 148 -133 53
6463 53 -38 -74 114 -30 -71 87 -37 92 58 -177 82 86 -64 243 -89 -110 141 -82 24 75 -126 79 68
6486 68 -56 53 86 -125 135 3 -123 50 -71 32 40 -172 -25 13 -169 172 64 -24 80 -37 -108 41
6508 41 -77 -68 95 -31 21 83 -41 41 -75 -141 33 -30 -51 110 -75 -53 117 -71 121 75 -135 142 5 -16
6532 -16 137 -95 -107 141 -143 -33 167 -157 83 37 -67 135 -33 -125 164 -101 -39 147 -58 54 84 -78
6554 -78 -46 9 -71 188 -69 -74 61 12 -27 7 23 25 84 -193 14 -21 -121 68 -6 -28 96 -76 33 73 -72 37
6580 37 19 -113 142 23 -115 101 -19 -121 129 -135 -39 182 -33 109 14 -114 139 -10 12 173 -27 -89
6602 -89 15 -95 51 93 -43 -32 -34 -2 131 -23 18 147 -61 -41 94 -115 -20 -30 -45 165 67 31 173 -45
6626 -45 -42 59 -12 7 90 -124 93 59 -7 48 -41 -58 123 -26 -12 110 -67 -52 147 -128 -39 18 -9 -4 -103 -50 165
6653 165 -49 -115 73 -29 -84 121 32 16 -44 -32 -16 -117 -149 65 -62 -90 149 -18 -98 80 -161 -40 -11 108
6677 108 119 23 -73 193 -52 39 102 -75 -111 0 -34 -126 116 -21 48 -35 -86 38 -201 -132 116 -215 -8 107
6701 107 7 -5 49 -83 66 -58 -87 115 -175 -8 133 -101 -42 19 -95 -57 58 -96 37 8 -132 143
6723 143 -14 -162 160 -113 24 34 -26 106 -124 44 6 -46 -17 51 -9 -91 91 -117 -61 1 -14 84 36 -16 18
6748 18 -145 -7 98 26 -83 120 -119 39 22 -98 152 -18 -54 177 70 -106 259 -81 -14 101 -106 102
6770 102 -6 -72 -10 -63 -174 135 -53 -205 40 -119 14 115 -83 -23 56 -33 204 -111 -95 2 -47 -31 52 -97
6794 -97 22 33 -40 3 -33 -84 -15 -97 -156 54 -112 81 166 -74 -18 163 -104 2 78 -32 70 -121 0 120
6818 120 -149 -43 141 -3 -12 142 -54 69 21 -51 15 119 -66 55 -20 -46 -45 -69 -5 41 108 126 -24 -38 110
6843 110 -38 15 114 -72 -67 16 -51 -9 18 -34 79 97 -19 50 -45 22 82 -58 -67 93 -62 3 132 -136 -7 -31
6869 -31 52 185 -31 -124 6 -150 10 122 -119 -62 37 -48 248 -111 -34 138 52 -53 85 -99 -24 36 -104
6892 -104 98 -34 -84 95 39 -48 169 -39 27 75 -105 -9 24 24 1 83 -45 86 -96 -26 100 -88 37 17
6916 17 -142 -40 126 -82 -21 -31 54 88 -107 -20 36 -15 51 81 -32 -56 21 -37 58 71 -98 94 10 -59 -32 -80
6942 -80 -110 70 -41 -26 -17 -7 121 29 -114 49 -109 66 38 -12 -27 37 -87 73 -33 -119 72 -5 33 51 -118
6967 -118 -31 69 -81 -67 104 -86 86 148 12 96 4 0 220 -96 11 120 -22 25 46 10 59 -75 -108 -37
6991 -37 -45 27 204 -96 -169 51 -101 5 17 -106 63 41 -80 60 -17 -1 56 -12 -96 122 -9 -32 80 62 136
7016 136 -20 21 21 0 52 84 18 23 86 -95 4 59 -64 138 4 47 8 64 -78 50 -1 34 64 0 10 -45 57
7043 57 85 100 -122 9 -61 -18 4 -93 106 96 -64 26 124 -82 194 56 -66 4 -9 -101 155 -166 39 87 -141
7068 -141 24 27 25 -112 26 -117 186 -43 63 18 -133 -1 -24 -96 77 11 76 -51 -84 -179 26 -117 16 40
7092 40 -70 20 61 -66 79 47 35 115 -25 -38 -47 -76 21 43 -284 54 -42 -81 67 32 -25 53 -98 12 50 3
7118 3 -51 -31 -109 46 60 -23 188 -80 0 68 -36 36 35 -81 -93 45 -54 40 65 -72 36 15 20 10 23 30 49 14
7146 14 61 -30 -33 67 55 73 48 13 -30 97 2 76 76 -21 37 -19 -173 18 -23 -65 47 -4 9 83 -136 4 164
7173 164 -24 91 42 -54 -30 -9 -149 -13 -82 10 107 -100 -19 -2 4 -79 19 -67 88 -118 26 91 -11 -18 69 -141
7199 -141 -39 16 -177 122 3 -53 48 -61 8 12 21 91 54 -73 -10 17 -69 70 29 6 14 -77 68 53 -65 -38
7225 -38 -7 -119 8 35 -206 148 66 -38 -2 -81 36 83 82 56 -75 -59 37 44 -54 40 59 -99 -83 -90 -17 -28 -83 11
7253 11 23 -145 -42 -93 -78 -76 13 -14 17 15 67 288 -15 55 74 -81 121 27 -23 71 66 139 -20 16 -25 6 -2 24 -81
7282 -81 -99 -19 -11 -14 103 99 -52 78 15 -35 28 -50 62 -26 -26 33 -41 11 -4 0 -12 14 -57 6 22 10 84 -21 -121 13
7312 13 -37 -53 46 64 -40 30 -153 92 -79 -17 -71 70 -46 6 31 52 77 90 -2 15 -103 20 -20 -53 70 -80
7338 -80 -163 -4 -19 -158 45 11 11 8 -13 -22 -25 -133 -52 109 -130 -81 -39 3 2 -43 40 -35 -59 -43 -45 -67 27 57 -54 -106
7368 -106 -36 -32 21 -14 -1 2 9 148 14 -137 9 -10 -45 46 -15 -14 25 -29 11 -29 -109 83 37 -81 33 -8 -125 82
7396 82 -46 31 95 -126 51 79 -80 87 -20 -27 43 -98 -66 131 -18 25 131 73 4 -17 -56 25 33 -134 17
7421 17 -26 -91 90 -75 -160 50 50 95 57 19 -2 -45 -57 36 41 -3 34 -47 -14 45 -89 63 -62 -11 -8 -79 -8 -2 -54
7450 -54 -49 -4 -72 9 94 -18 -5 -44 -82 100 151 -3 171 -2 4 113 -58 -37 -36 54 38 31 -129 145 11 -117 -4
7477 -4 67 73 28 15 86 50 -155 -33 -3 -78 36 -30 19 53 30 68 -30 -12 -48 165 -34 -2 36 -74 135 -2 -79
7504 -79 27 36 -32 -4 62 2 29 -22 125 69 -54 32 -55 36 75 60 -25 75 -40 -19 85 148 46 17 20 125 74
7531 74 -10 142 0 -75 -3 52 -1 -83 -49 -5 150 -53 35 -63 -18 73 -77 194 18 -71 22 81 -84 42 -62
7556 -62 -81 -31 2 -37 221 -88 -2 8 -135 51 -10 -101 75 61 -182 123 -52 -31 -23 -35 51 -19 -7 131 30 -25
7582 -25 -5 39 -15 54 -100 -83 -49 1 -1 27 -100 -153 20 -18 135 58 -43 2 -97 -63 87 24 110 -18 -104 10 -11
7609 -11 -121 -3 32 -91 -38 -86 -36 -28 80 65 0 22 -144 -26 -22 81 13 -17 -31 -131 45 -96 -41 72 -27 -11
7635 -11 80 16 -122 -69 5 34 -6 -9 10 54 46 86 -35 -64 55 32 -1 54 -98 -33 105 24 -94 44 -15 -54 -7 34
7663 34 41 -88 -24 58 -78 -61 78 -98 -68 -59 -78 91 -46 -42 163 -55 -30 126 -18 -40 17 -11 -84 28 -26 30
7689 30 -49 66 49 -97 -30 -2 17 -21 93 -54 32 -20 -105 13 101 -108 74 -76 31 39 -56 9 26 -33 105 -41
7715 -41 -17 9 12 -83 18 53 -61 47 -79 87 -41 34 4 38 -46 12 135 -35 22 -22 -16 119 -9 59 -14 -71
7741 -71 -87 -76 -101 39 -37 20 70 -8 -19 -94 -6 -42 -53 -18 -32 -33 16 150 -85 -35 58 86 130 102 -6 -37 -75 -53 97
7770 97 68 63 33 37 -94 15 -6 65 20 -70 -9 60 -4 -5 -3 31 6 -60 -65 41 -7 -107 23 6 5 4 -24 103 -95 75
7800 75 88 73 26 -121 56 -34 16 -79 109 -33 115 0 -180 103 -10 11 -48 -19 36 33 68 98 -20 21 -113
7825 -113 17 -161 45 10 -110 30 52 -90 27 28 -62 -49 146 20 65 22 64 -71 -117 24 3 88 86 -34 -15
7850 -15 77 -57 -102 70 -14 -33 -27 -130 32 94 -77 0 -73 45 65 70 -15 127 15 -11 31 40 2 23 21 51 -160 24
7878 24 -55 -9 -80 61 -22 -109 46 -61 -12 87 -53 112 -65 -68 -57 -77 -6 88 -43 -75 -60 113 -48 -20 40 102
7904 102 15 -69 5 -133 -62 56 -33 35 156 -55 27 -24 13 65 -66 -99 86 -107 -53 -38 -64 40 95 -28 -13
7929 -13 19 90 21 94 18 45 -27 -90 -81 -31 49 24 -91 14 -22 -70 -35 17 74 14 -33 -57 36 -128 -34 95 32 -3 -65
7958 -65 -18 84 -4 19 25 -87 12 -11 40 18 -35 -85 26 19 -35 -24 -156 -48 -7 -9 -52 -5 30 61 -64 -16 11 19 -15
7987 -15 62 0 5 51 -28 21 13 -58 51 -20 68 -19 -72 -10 57 -58 -3 -114 -9 -127 -43 -43 70 -13 -30 31 -28 -17 64
8016 64 -79 -58 11 -43 24 -8 37 -62 -187 -47 -21 3 -74 -15 -9 9 -49 -107 28 -73 -7 39 34 -45 40 68 108 13 -45
8045 -45 -24 -46 -14 -52 34 -111 32 10 127 171 -35 42 -30 -68 -71 40 -90 18 -85 54 54 21 -42 92 27 12
8071 12 58 -22 4 1 16 -9 17 -11 6 -114 4 -20 -49 99 -59 39 -43 170 63 -76 53 68 89 24 11 22 126
8098 126 51 -29 -17 19 46 -9 45 72 -105 103 -91 11 -11 -7 -60 -1 -40 62 44 -128 -25 13 87 -63 -31 21
8124 21 71 36 91 61 -67 -38 -6 -67 2 -117 38 92 -113 -19 36 4 95 89 -67 -40 -10 -99 36 -69 8 95 -141
8151 -141 -40 -60 -14 113 -47 -61 -45 68 -95 44 -10 -9 -20 57 18 24 -111 59 18 -91 -9 24 87 26 -124 63
8177 63 99 -95 -29 41 -82 -126 7 -6 68 5 2 -21 -66 -45
8191d5
$$ Imaginary data points
##PAGE= N=2
##DATA TABLE= (X++(I..I)), XYDATA
0 0 0 0 0 0 0 0 0 0 0 0 0 0 0 1 -8 8 -8 8 -9 16 -16 24 -24 30 -32 40 -48 52 -59 72 -80 89 -104 115 -130 147
36 147 -165 185 -209 232 -258 285 -316 352 -388 429 -474 523 -576 634 -699 770 -849 936 -1034
55 -1034 1145 -1271 1415 -1583 1783 -2019 2310 -2676 3155 -3803 4743 -6234 8958 -15583 68241
70 68241 43302 -52720 45209 4409 -39329 -8444 24997 5106 -20560 6167 16626 -71580
82 -71580 -22935 63167 -17077 -31697 46213 262 -34608 -7203 2602 -2440 -14811 15215 22602
95 22602 -60629 -28512 49040 -12655 -18429 42285 4040 -23296 -12384 -15025 -11085 -11230 27335
108 27335 41567 -25912 1454 46826 -29087 -25586 37669 13514 8683 18689 56 -5105 -19459
121 -19459 -104 16760 -28675 -3317 32704 -21883 -12804 21537 -4372 5706 8255 -8359
133 -8359 4030 -13948 -7932 14733 -22050 -4398 29990 -14164 -17328 -827 -15619 3204 2318
146 2318 -1496 21683 -4939 -8122 13057 -24288 -13003 20257 -8644 -658 15727 2354 13663
159 13663 -2142 -9020 17619 -7155 -6340 21596 -12672 -9923 16416 -7217 -4186 611 -7558
172 -7558 8767 -8976 -7495 26340 -3036 -4420 25296 -10731 -12419 12561 -9372 -7986 -1235
185 -1235 -540 14833 -9806 -10074 15989 -19126 -15151 19374 -11117 -6519 18353 -2994 -1208 737
199 737 -3774 8417 -12951 -7492 21241 -8640 -2873 23992 -9161 -5838 13239 -6807 -2357
212 -2357 -1910 -4056 11896 -7652 -4065 17914 -14246 -9590 14534 -12940 -3306 15345 -2241
225 -2241 5212 3206 -2252 10161 -11052 -8557 12778 -12639 -3032 17340 -10360 -2070 7996
238 7996 -10899 247 -2941 -7712 10154 -5997 -2473 16850 -7886 -1413 12337 -11895 894
251 894 8998 -5997 8736 1626 -5716 10828 -8438 -9017 7441 -14041 -4293 9994 -9050 4315
265 4315 7445 -7543 7866 -683 -6264 12276 -3935 -2205 13488 -7199 -345 6994 -13391
278 -13391 -839 155 -10513 8004 -217 -4590 13043 -3572 -2458 10391 -9295 -676 7191
291 7191 -8835 5718 4044 -7552 8421 -3294 -8049 8868 -7088 -3378 9802 -7863 2009
304 2009 7287 -9251 4415 708 -8855 9158 -1321 -3759 11995 -4855 -1791 8037 -11001
317 -11001 -1074 2987 -10873 5058 1547 -6304 10438 -1776 -4310 9350 -7140 -1877 7862
330 7862 -8711 2414 5307 -8024 6387 624 -6820 9013 -2399 -2246 11106 -5059 622
343 622 8198 -9333 374 1451 -10515 3772 -1535 -6496 8381 -3792 -2289 9344 -7863 -429
357 -429 7715 -8117 3289 5200 -5667 7225 452 -4108 8047 -5324 -1603 8742 -9007
370 -9007 59 7430 -9509 892 1404 -9074 3483 -2356 -4016 7709 -5060 1568 10583 -7843
384 -7843 2410 8933 -8316 2233 3024 -6551 4027 -2605 -4116 4552 -8228 138 7822 -10132
398 -10132 2736 9595 -6492 4381 4836 -4669 4469 -1721 -1705 5848 -6472 2859 7908 -10430
412 -10430 2853 7748 -8493 2310 1613 -6708 2772 -3903 -3496 3349 -7973 2546 7226 -9575
426 -9575 4245 7600 -6719 4782 2896 -3949 5160 -4287 -4279 2480 -8851 1629 5557 -10008
440 -10008 3152 5890 -6197 4588 1325 -1977 8883 -1266 -27 6761 -6253 2358 6171
453 6171 -7836 3704 5240 -5793 1614 -4577 -4497 6683 -5137 -1655 7152 -6537 1063 5838
467 5838 -7606 2042 5040 -1319 3789 -4817 -2318 6077 -9713 -3032 7947 -7464 -301 4913
481 4913 -9809 -2463 2896 548 3840 -4540 2462 9285 -9387 -149 11220 -5704 3562 10922
495 10922 -5669 -2848 1326 -903 -48 -6384 5587 10484 -11162 -1034 8174 -10643 1130 12097
509 12097 -4047 -1976 3414 1056 -2906 -9764 5131 8552 -12150 1634 8304 -14369 -2651
522 -2651 8903 -6331 -2457 5769 3096 -4435 -11546 4637 7079 -10647 6616 11916 -12069 -231
536 -231 8790 -7558 -2290 7743 7596 898 -6871 6168 4071 -14026 4732 10462 -10277 2669
550 2669 8592 -9381 -5303 3437 4866 854 -5907 6588 3514 -14250 3396 7540 -10782 3611
564 3611 8650 -7851 -4787 296 1305 -689 -5414 8253 5714 -11953 1946 3178 -12484 3057
578 3057 8888 -3486 13 1352 1646 -322 -6744 6400 6548 -7868 5003 5075 -10009 1855 4885
593 4885 -3559 1232 812 2887 1179 -8355 3693 6346 -6544 5349 5434 -8731 118 1456 -3830
608 -3830 1006 -924 3685 2888 -9148 1279 3392 -9644 2586 5532 -5148 2391 1726 -3093
622 -3093 -604 -4223 3897 5147 -7231 3663 5768 -8246 2349 5411 -4045 1950 1520 -933
636 -933 -329 -5435 3569 4534 -8262 3957 6502 -8427 500 3529 -4557 1875 2912 2332 1551 -5790
652 -5790 2933 2889 -9575 3677 6609 -7252 1580 3496 -4892 -304 -253 936 1243 -4912 5057 4335
668 4335 -8916 3549 5757 -7141 2008 3405 -4299 -96 -1011 1312 1573 -5255 4603 3194 -9650
683 -9650 2857 4050 -7401 2291 3131 -3074 1342 -1047 746 718 -5401 5124 4484 -6375 5007
698 5007 4520 -6339 2333 1576 -3148 1611 -1378 1303 2238 -4770 4335 3217 -7048 3489 2714
713 2714 -5859 2444 571 -2786 2084 -2239 839 1716 -5795 2775 2276 -6416 3792 2166 -5012
728 -5012 2735 -745 -3007 1801 -3368 641 2617 -4398 3983 3286 -4737 4119 1631 -3743 4032
743 4032 -146 -893 3842 -2779 1227 2657 -5292 2368 1434 -5489 3361 774 -3303 3694 -1381 -1182
759 -1182 3036 -3629 1018 2397 -4870 2851 1788 -4498 3411 -433 -3636 3095 -2426 -1186 3269
774 3269 -3571 1209 2523 -4483 2511 1003 -4339 3452 -257 -2009 4586 -1667 -51 3753 -3934
789 -3934 1175 2073 -4859 2382 666 -3899 3384 -1079 -2316 3646 -2952 -383 3531 -3535 2034
804 2034 2730 -3712 3239 779 -3391 3632 -1393 -1690 4120 -2942 318 3367 -4168 1481 1429 -4432
820 -4432 2587 11 -3258 3666 -1540 -1292 3556 -3412 268 2680 -4110 1961 1743 -3743 3213 -140
836 -140 -3207 3259 -2328 -1640 2933 -3465 903 2681 -3968 2604 1503 -3789 3710 -9 -2314 4221
852 4221 -1329 -314 3489 -3078 1312 1848 -4261 2698 803 -3965 3645 -768 -2992 3460 -2392
867 -2392 -1153 2477 -3400 1522 1594 -3927 3495 638 -3621 3862 -947 -2559 3866 -1835 -643 2357
883 2357 -2969 1826 887 -4015 3246 -172 -3608 4139 -1024 -2282 4002 -1710 -554 2257 -2848
898 -2848 1971 790 -3419 3736 -395 -3399 3807 -2146 -2650 3376 -2541 -552 2055 -2844 2158
913 2158 475 -3424 3939 -341 -2377 4555 -1755 -1399 4171 -2214 489 2174 -2976 2567 264
928 264 -3746 3278 -961 -2503 3731 -2527 -1512 2969 -3178 504 1671 -3114 3300 888 -3603
943 -3603 3119 -837 -2360 3133 -2319 -618 2417 -3513 947 772 -4526 3179 828 -3797 3381
958 3381 -156 -1911 3015 -1444 894 2797 -2443 3040 867 -4545 4319 1189 -4214 3601 401
973 401 -2211 1667 -2054 237 793 -2917 3735 -178 -5137 4668 223 -5306 3485 1118 -1642 1743
989 1743 -1258 481 -518 -3080 4208 -973 -5526 5314 -327 -6364 2976 795 -2063 2013 138
1004 138 1313 -875 -2299 4831 -1365 -4418 7277 680 -5633 3503 430 -2826 1482 506 1645
1019 1645 -971 -1875 4532 -3085 -5348 7116 323 -4894 4631 547 -3198 1012 74 1391 -706
1034 -706 -576 5139 -3753 -5712 5742 -1756 -5189 4799 166 -2771 746 -1350 130 -1350 -346
1049 -346 6170 -2258 -3809 5959 -2170 -4654 4645 459 -673 2231 -992 283 -2234 -1647 5214
1064 5214 -1661 -2544 6258 -1883 -4474 2961 -995 -224 2830 -215 1818 -1462 -2569 3795 -2267
1079 -2267 -2717 6216 -890 -3329 1755 -2844 -1386 912 -1401 2701 -624 -2734 3647 -2977 -3771
1094 -3771 5257 27 -1274 2873 -1614 -128 -47 -2468 3541 63 -1942 5046 -1922 -4202 3665
1109 3665 -767 -1331 2266 -698 1345 -737 -3039 3243 -1126 -2529 5767 -763 -3582 3431 -988
1124 -988 -2112 987 -736 2078 -774 -2941 3404 -2328 -3751 5119 -952 -3169 3942 -273 -1667
1139 -1667 694 -565 2473 -509 -1660 4815 -1845 -3530 4983 -1408 -3506 3745 -169 -1440 84
1154 84 -1298 1686 -1813 -2163 4740 -1829 -3159 5097 -1717 -3295 3451 -470 -692 673 -747 2354
1170 2354 -1679 -2196 4390 -2243 -2738 5027 -1767 -2791 2953 -1053 -617 628 -828 2789 -1129 -1468
1186 -1468 4529 -1889 -2210 4866 -1523 -1773 2976 -1453 -478 -35 -1735 2118 -1709 -1954 3864 -2444
1202 -2444 -2265 3995 -2074 -1490 2735 -1500 376 336 -1627 2474 -1334 -1575 4050 -1985 -1624 3507
1218 3507 -2256 -1084 2037 -1971 730 146 -2007 2486 -1368 -1579 3973 -1460 -935 3775 -1587 12
1234 12 2257 -1955 1282 69 -2114 2446 -1603 -2039 3129 -2272 -1327 2934 -2246 -8 1629 -2086
1250 -2086 1546 -65 -2021 2688 -1218 -1587 3149 -2016 -766 2825 -2160 364 1249 -2479 1511
1265 1511 -384 -2426 2441 -1535 -1538 2995 -1804 -264 2696 -1749 1406 1666 -1793 2374 54 -1809
1281 -1809 2719 -1440 -1443 2677 -2170 -421 1962 -2571 1129 892 -2348 2230 -325 -1990 2716 -1467
1297 -1467 -1098 2666 -1980 -116 1731 -2303 1255 577 -2407 2145 -678 -2044 2388 -1808 -1238 2352
1313 2352 -2175 240 1718 -1967 1860 758 -1601 2776 -386 -1296 2956 -1606 -679 2265 -2322
1328 -2322 203 1224 -2377 1057 59 -1806 2361 -1005 -1184 2848 -1907 -331 2589 -2193 619
1343 619 1609 -2040 1631 242 -1639 2047 -1425 -1176 2262 -2584 -473 2010 -2927 522 1349 -2368
1359 -2368 1438 273 -1286 2238 -1016 -154 2711 -2085 372 2250 -2628 1057 1443 -2333 1494
1374 1494 146 -1570 1627 -1456 -356 1935 -2542 581 1998 -2535 1457 1279 -2332 1788 481
1389 481 -1435 1701 -1209 -317 1628 -2526 669 1179 -3070 1430 610 -2670 2151 119 -1554 1929
1405 1929 -967 -12 1643 -1929 1230 1112 -2184 2233 315 -2333 2434 -391 -1834 1866 -1261
1420 -1261 -683 1244 -2102 526 482 -1913 2023 -305 -2002 2935 -718 -1422 2821 -985 -428 1847
1436 1847 -1644 199 276 -1254 2073 -884 -1314 3108 -1502 -1586 2835 -1624 -503 2357 -1291 -43
1452 -43 348 -807 1481 -1455 -691 3252 -2183 -1308 2825 -2469 -947 2396 -1576 -517 263 -885
1468 -885 647 -1985 -185 3302 -2163 66 3458 -2572 -615 2846 -1533 -56 1426 143 869
1483 869 -1994 -121 2335 -2840 475 3735 -2774 -55 2694 -2372 -849 1169 90 543 -1704
1498 -1704 299 1607 -3359 468 2896 -3107 499 2689 -2881 -983 674 -585 487 -1086 805
1513 805 1588 -3297 495 2071 -3085 1384 3357 -1783 418 744 -913 230 -1124 928 2243 -2085
1529 -2085 1139 1705 -3408 716 2006 -2084 827 813 -1023 406 -1880 55 1569 -1992 1230 1650
1545 1650 -2937 819 1108 -2050 1429 651 -359 1118 -2119 -646 1138 -2261 806 2045 -1800
1560 -1800 1082 615 -1938 957 -207 -149 2430 -1146 189 1890 -2247 186 1523 -1493 1004 536
1576 536 -1224 985 -1282 -533 1892 -2008 -84 2121 -2433 -265 1428 -1386 752 564 -239 1216
1592 1216 -1744 -170 1766 -2517 118 2753 -2209 -107 1460 -1736 50 -58 1 1455 -1389 783
1608 783 2351 -2776 328 2450 -2418 83 1939 -1065 148 -36 -109 841 -2173 447 1896 -3140
1624 -3140 299 2263 -2602 182 1743 -1098 264 -119 96 805 -1912 1080 2156 -2635 712 2129
1640 2129 -2774 27 1225 -1250 381 -4 388 935 -1926 726 1543 -2864 959 2279 -2072 923
1656 923 1495 -1066 536 -212 41 850 -1897 665 1235 -2742 775 1524 -2266 709 851 -1217 569
1673 569 -487 239 1293 -1526 898 1401 -2775 562 957 -2294 808 678 -711 905 -769 -117
1689 -117 930 -2041 785 1469 -1984 1049 1394 -1782 1055 530 -646 1206 -563 471 1428 -1671
1705 -1671 1046 1453 -2156 836 702 -1907 818 -90 -797 1131 -942 214 1174 -2130 547 1015
1721 1015 -2309 976 619 -1498 1023 -411 -898 896 -1364 213 1443 -1634 941 1208 -1945 879
1737 879 306 -1480 990 -383 -349 1491 -936 780 1690 -1404 1078 1312 -1552 1117 384 -1113 1127
1754 1127 -703 -624 920 -1722 -34 958 -1875 857 1023 -1374 1237 184 -998 1063 -879 -329
1770 -329 1261 -1487 352 1177 -1876 650 439 -1701 1010 -141 -874 1277 -766 -24 1244 -1572
1786 -1572 523 1169 -1645 1149 840 -1218 1511 9 -747 1097 -1155 -322 816 -1724 525 798
1802 798 -1732 1101 391 -1458 1365 -191 -636 1439 -731 150 1182 -1472 724 517 -1843 1020
1818 1020 -66 -1349 1360 -247 -717 1303 -868 -14 887 -1524 794 505 -1417 1429 -8 -1324
1834 -1324 1507 -578 -767 1348 -832 204 876 -1083 757 198 -1460 1330 -469 -1271 1711 -706
1850 -706 -585 1592 -958 200 902 -1104 714 217 -989 1467 -478 -973 1682 -1051 -671 1299
1866 1299 -1365 69 874 -1119 879 187 -908 1353 -722 -794 1650 -1162 -473 1450 -1201 162
1882 162 876 -1204 715 21 -773 1290 -575 -374 1598 -1322 -177 1234 -1635 217 926 -1254
1898 -1254 872 231 -655 1185 -698 -122 1334 -1349 229 1244 -1761 558 895 -1424 768 201
1914 201 -929 799 -735 -183 1185 -1401 438 1027 -1825 900 747 -1420 1113 477 -656 1129
1930 1129 -395 -74 758 -1186 614 634 -1941 936 417 -1972 880 274 -922 1105 -292 34 850
1947 850 -999 969 622 -1554 1588 350 -1850 1219 -96 -1333 848 -280 -228 536 -1125 878
1963 878 165 -1407 1777 381 -1320 1842 106 -1045 1119 -269 -68 582 -919 637 -320 -1755
1979 -1755 1308 -191 -1451 1772 -83 -995 1210 -448 81 751 -603 1006 68 -1331 1398 -497
1995 -497 -1639 1595 -473 -856 1284 -814 -208 439 -934 934 147 -1092 1377 -400 -1221 1522
2011 1522 -615 -399 1483 -765 110 397 -1215 807 63 -1058 1553 -482 -1213 1207 -1018 -428
2027 -428 1217 -828 570 710 -1047 1091 14 -1232 1328 -265 -708 1212 -808 -174 885 -1183
2043 -1183 627 540 -1282 1046 -36 -1394 1192 -276 -670 1091 -796 -163 495 -1388 804 562
2059 562 -1185 1575 268 -1262 1137 -466 -715 926 -711 273 428 -1186 934 -41 -1572 1544
2075 1544 136 -1053 1593 -79 -499 993 -633 372 290 -1363 987 -146 -1548 1647 77 -1127
2091 -1127 1459 -191 -614 572 -854 383 154 -1255 1187 -181 -1507 1520 -244 -1232 1452 -102
2107 -102 -104 1025 -456 504 19 -1334 1074 -485 -1485 1482 -393 -1138 1336 -518 -432 667 -644
2124 -644 571 330 -877 1520 -254 -1196 1571 -531 -1174 1154 -782 -478 493 -799 616 105 -1014
2141 -1014 1254 -537 -1346 1496 -537 -461 1687 -225 112 617 -1008 456 -199 -1011 1641 -228 -1073
2158 -1073 1312 -1047 -1085 845 -850 94 695 -693 953 103 -835 1616 -174 -800 1399 -891 -1005
2175 -1005 753 -1019 194 545 -856 917 -324 -1205 1344 -201 -371 1917 -320 -275 752 -1142
2191 -1142 23 293 -850 1125 -3 -717 1402 -568 -831 1305 -774 -164 868 -1017 321 239
2207 239 -857 1110 -274 -1079 1282 -731 -692 1379 -485 191 982 -847 388 -66 -1219 971 -126
2224 -126 -670 1539 -504 -474 1153 -948 -54 773 -857 899 317 -860 1139 -384 -886 1238 -721
2241 -721 -448 986 -776 206 694 -840 704 -200 -1291 714 -660 -900 1265 -481 -182 1112 -792
2258 -792 140 331 -1051 905 144 -759 1430 -286 -812 1055 -1004 -279 905 -923 381 597 -806
2275 -806 945 -81 -975 976 -505 -612 1194 -579 20 1017 -806 375 237 -1190 764 -343
2291 -343 -804 1330 -589 -337 1105 -1003 -300 593 -1149 372 432 -721 1034 -79 -503 1124 -687
2308 -687 -219 1228 -833 159 907 -937 516 189 -1094 569 -496 -697 1186 -617 58 1283 -873
2325 -873 191 816 -1053 646 380 -797 1024 -304 -460 795 -1009 -276 600 -1385 189 615 -986
2342 -986 750 378 -827 857 -280 -473 861 -833 125 893 -1129 534 496 -1349 654 -6 -844
2359 -844 902 -84 -190 1056 -650 120 649 -1084 629 488 -980 1027 267 -629 1081 -328 -425
2376 -425 573 -875 47 506 -979 700 143 -1141 858 -279 -958 1059 -254 -198 916 -670 210
2393 210 225 -1186 353 -82 -1075 1068 -134 -527 1234 -331 -206 857 -741 209 435 -733 864
2410 864 -6 -951 953 -438 -724 1091 -680 -142 1130 -453 333 436 -742 616 -353 -860 836
2427 836 -675 -683 1038 -776 -291 794 -871 154 391 -550 782 -74 -389 1085 -683 -336 991
2444 991 -942 -242 932 -848 334 511 -567 757 -264 -456 788 -827 -299 1103 -1001 178
2460 178 1040 -951 187 415 -724 633 -91 -186 1030 -805 -105 683 -1339 -148 592 -1136 390
2477 390 543 -584 660 -52 -238 875 -646 80 864 -1034 311 596 -1118 513 240 -843 587
2494 587 -500 -412 785 -647 350 762 -1050 417 353 -1162 567 239 -629 947 -115 -286 747
2511 747 -843 166 671 -818 615 474 -987 647 -212 -908 780 -320 -97 851 -426 224 785
2528 785 -689 719 405 -796 794 -487 -971 595 -630 -370 807 -618 48 608 -880 467
2544 467 263 -573 1039 -127 -441 777 -718 -414 770 -621 249 819 -678 477 17 -651 790
2561 790 -504 -250 993 -622 -159 859 -782 185 627 -619 497 50 -663 765 -466 -324 937
2578 937 -727 -88 737 -1105 11 435 -666 497 117 -303 760 -618 -356 812 -856 198 941
2595 941 -730 227 498 -851 313 -87 -238 893 -337 -28 809 -980 45 606 -984 421 431
2612 431 -750 365 -163 -389 564 -374 165 795 -825 165 504 -981 461 328 -562 566 -330 -512
2630 -512 482 -652 50 776 -777 382 550 -987 513 357 -495 901 22 -203 573 -713 96 629
2648 629 -724 381 417 -939 432 14 -642 730 -139 -10 793 -824 7 431 -877 497 653 -698
2666 -698 485 -4 -667 519 -378 -106 659 -660 20 413 -1063 302 433 -585 698 113 -395 661
2684 661 -488 -81 776 -618 165 488 -919 353 169 -708 722 -79 -517 521 -635 -143 676 -547
2702 -547 436 632 -608 468 106 -639 645 -174 -298 668 -612 -126 592 -667 126 312 -775 514
2720 514 27 -643 610 -334 -287 694 -579 112 668 -755 453 378 -539 576 70 -603 458 -375 -359
2739 -359 630 -805 -26 546 -844 445 382 -704 570 64 -403 661 -340 -152 602 -744 193 467
2757 467 -797 382 231 -749 502 -91 -563 632 -441 -112 515 -706 194 448 -828 483 224
2774 224 -585 621 81 -374 729 -293 55 576 -677 315 247 -814 521 63 -729 647 -127 -505
2792 -505 585 -335 -12 505 -538 560 209 -801 589 -95 -721 649 -275 -427 600 -533 -116
2809 -116 493 -512 275 157 -696 710 -59 -578 777 -244 -245 755 -430 35 579 -489 370 -5
2827 -5 -569 724 -445 -681 787 -417 -330 755 -641 85 454 -505 347 204 -346 581 -254 -439 795
2846 795 -681 -285 643 -739 -6 437 -541 222 56 -408 521 -312 -270 655 -545 -35 721 -681 94
2865 94 496 -645 259 110 -403 577 -377 -45 609 -678 -40 504 -910 135 453 -688 367 123
2883 123 -378 555 -286 -68 518 -569 163 470 -715 333 369 -838 389 58 -471 359 -187 -119 447
2902 447 -491 374 390 -805 560 426 -811 621 126 -528 612 -137 -174 280 -630 234 292 -776 642
2921 642 191 -819 735 -114 -547 583 -149 -83 385 -338 472 186 -674 700 4 -694 780 -195 -570
2940 -570 682 -266 -176 333 -408 227 155 -585 629 -156 -612 901 -383 -491 717 -462 -202 537 -378
2959 -378 210 117 -463 705 -373 -508 701 -411 -495 789 -548 -61 572 -432 232 292 -567 552
2977 552 -170 -339 786 -554 -237 708 -673 -106 490 -584 308 100 -348 502 -335 -281 550 -479 -94
2996 -94 639 -534 180 557 -629 293 183 -497 333 -324 -199 595 -636 -90 576 -724 202 343 -725
3015 -725 338 75 -374 523 -171 -160 469 -615 48 433 -687 329 348 -899 454 -62 -560 545
3033 545 -199 -280 516 -456 101 416 -589 494 300 -643 641 12 -551 575 -257 -99 445 -451 108
3052 108 246 -808 391 234 -677 588 -139 -648 613 -354 -175 472 -393 254 321 -704 656 96
3070 96 -566 757 -144 -431 625 -431 -207 533 -511 226 335 -522 464 -99 -590 746 -248 -379 733
3089 733 -245 -122 470 -613 129 159 -491 461 -133 -615 514 -354 -448 579 -444 -55 568 -512 289
3108 289 229 -446 576 -4 -316 608 -437 -293 518 -544 58 470 -590 356 82 -603 461 -260 -341
3127 -341 684 -234 -79 653 -622 125 471 -547 354 199 -609 592 -189 -508 574 -391 -166 606
3145 606 -629 105 256 -621 465 161 -365 628 -148 -290 556 -350 43 535 -672 275 169 -705 497
3164 497 -26 -469 593 -168 -268 486 -483 -67 359 -620 402 256 -597 461 -57 -476 599 -143 -58
3183 -58 552 -530 9 310 -641 363 240 -519 483 4 -515 552 -290 -176 646 -361 90 369 -625
3202 -625 304 195 -562 541 -107 -561 473 -437 -248 558 -519 184 293 -665 365 76 -396 629
3220 629 -46 -397 644 -498 -95 484 -473 291 313 -486 347 -147 -605 537 -192 -304 606 -448 -69
3239 -69 503 -481 257 362 -531 425 -89 -387 596 -305 -113 473 -575 -82 399 -753 147 301 -649 472
3259 472 -65 -375 592 -376 -117 659 -533 78 517 -651 278 310 -496 509 -41 -319 556 -374 -17
3278 -17 527 -590 269 399 -634 351 228 -623 522 -49 -249 607 -351 104 485 -539 318 399 -634
3297 -634 375 106 -511 393 -231 -278 514 -412 36 537 -652 473 258 -575 519 181 -426 465 -140
3316 -140 -406 466 -355 -44 355 -610 304 194 -595 500 -67 -469 666 -326 -378 486 -316 136 443 -456
3336 -456 362 49 -539 592 -173 -501 642 -278 -265 542 -395 -10 288 -502 333 48 -530 586 -200
3355 -200 -399 671 -353 -250 624 -405 7 352 -421 326 -15 -519 471 -200 -290 651 -389 -188 507
3374 507 -488 101 283 -423 328 22 -383 603 -323 -145 671 -462 -89 548 -633 101 214 -480 316
3393 316 -114 -394 491 -278 -71 642 -461 27 580 -601 265 284 -440 403 -51 -363 423 -291 -99 486
3413 486 -597 58 471 -655 339 281 -530 395 -94 -337 463 -338 -93 505 -553 181 325 -721 260
3432 260 186 -615 406 -86 -293 472 -342 -17 410 -530 276 426 -585 504 189 -604 420 -146 -291
3451 -291 539 -347 -124 318 -473 194 101 -716 508 4 -508 618 -150 -322 466 -253 -108 403 -550 302
3471 302 276 -604 594 -107 -605 492 -338 -237 526 -425 24 303 -573 337 54 -460 582 -90 -452
3490 -452 517 -285 -251 570 -428 14 175 -252 373 6 -428 503 -202 -352 540 -334 -183 491 -424 61
3510 61 259 -319 372 84 -443 356 -181 -351 522 -437 -29 443 -385 150 137 -434 268 74 -400 588 -200
3531 -200 -223 561 -409 -1 416 -360 137 241 -369 315 -28 -373 415 -300 -227 336 -539 41 414 -350 151
3552 151 239 -513 344 -157 -310 532 -174 -43 509 -421 -33 276 -524 325 25 -443 372 -114 -425 443
3572 443 -234 -43 495 -384 127 111 -490 389 83 -439 474 -178 -374 458 -468 8 376 -395 156 262
3592 262 -466 341 2 -502 484 -121 -166 526 -401 -146 323 -331 153 208 -269 370 -89 -488 428 -224 -179
3613 -179 594 -280 -94 312 -390 185 78 -366 579 -78 -272 566 -139 -154 534 -318 -26 277 -368 188
3633 188 25 -388 436 -132 -372 425 -334 -395 321 -323 14 389 -351 221 14 -398 567 -20 -204 641
3653 641 -338 -165 367 -493 29 242 -333 269 -1 -446 427 -163 -249 512 -239 -33 355 -501 -31 299
3673 299 -435 377 -24 -368 347 -263 -141 543 -299 52 366 -428 210 148 -379 380 -116 -298 394 -342
3693 -342 -151 466 -375 35 242 -435 200 119 -425 253 -17 -257 485 -252 -63 523 -326 73 400 -328
3713 -328 193 249 -456 351 -43 -218 466 -213 -182 400 -391 1 269 -413 362 107 -490 284 -172 -213 479
3734 479 -188 -118 387 -337 177 112 -366 297 36 -402 376 -166 -355 487 -204 -65 344 -382 197 131 -434
3755 -434 255 -40 -357 404 -108 -265 392 -433 -154 373 -412 127 38 -417 330 -163 -322 375 -216 -181 481
3776 481 -394 94 289 -296 286 70 -339 425 -110 -224 451 -214 -65 553 -296 16 297 -396 288 115
3796 115 -293 161 -116 -261 464 -353 -36 563 -383 -51 251 -417 156 15 -346 293 -196 -154 411 -342
3816 -342 -66 438 -397 197 348 -313 343 141 -164 309 -40 -38 372 -371 -36 389 -494 113 183 -562 265
3837 265 -36 -224 300 -183 41 329 -342 223 354 -432 227 335 -377 330 27 -352 307 -192 -85 275
3857 275 -363 62 301 -409 360 181 -388 307 123 -203 510 -163 -47 375 -273 161 129 -429 274 -24
3877 -24 -523 357 -97 -398 341 -277 -129 284 -386 144 195 -343 303 -64 -448 410 -19 -252 381 -204 -212
3898 -212 342 -243 151 139 -342 373 -68 -347 352 -248 -306 445 -308 -34 272 -359 168 99 -293 308 -142
3919 -142 -259 436 -316 -77 329 -276 -35 203 -425 169 101 -231 332 -37 -237 414 -223 -87 426 -422
3939 -422 45 395 -368 140 173 -283 331 -132 -139 282 -301 -44 342 -443 95 322 -423 198 130 -192 379
3960 379 -13 -95 314 -347 128 381 -345 129 297 -445 186 130 -258 263 -58 -57 315 -260 94 291 -481
3981 -481 185 167 -383 244 86 -309 256 -56 -210 308 -387 108 243 -439 205 207 -489 263 125 -182 313
4002 313 19 -44 354 -264 89 252 -479 150 179 -385 252 88 -377 274 -224 -128 260 -348 167 199 -379
4023 -379 246 153 -308 376 -137 -178 309 -191 -166 262 -379 -33 191 -324 212 8 -355 306 -99 -202 319
4044 319 -140 -8 231 -212 32 203 -424 333 51 -364 387 -169 -171 375 -368 97 314 -264 137 136 -281
4065 -281 231 79 -179 406 -69 -153 301 -322 115 263 -368 242 225 -351 162 -54 -202 342 -207 -100 313
4086 313 -373 -38 256 -411 291 159 -338 342 -84 -145 367 -159 -58 299 -368 119 244 -363 193 120 -320
4107 -320 256 -90 -267 349 -197 150 431 -393 255 227 -380 203 140 -321 298 -49 -170 198 -358 -49 267
4128 267 -440 171 187 -417 198 102 -332 143 3 -32 301 -266 227 249 -404 142 153 -462 269 59 -362 272
4150 272 -61 -150 343 -210 140 206 -445 332 239 -352 365 65 -267 229 -153 -159 206 -286 177 261 -445 177
4172 177 168 -398 329 33 -268 335 -129 -61 296 -249 219 195 -382 352 29 -453 428 57 -273 336 -143
4193 -143 -82 215 -355 112 75 -544 167 -45 -197 328 -142 -172 415 -222 -24 304 -421 41 101 -263 162
4214 162 -21 -361 321 -117 -137 305 -146 77 230 -460 281 130 -332 191 79 -329 347 -161 -65 264 -379
4235 -379 205 184 -381 201 -4 -470 308 21 -330 240 -219 -32 358 -327 192 164 -384 357 97 -321 300
4256 300 -73 -194 252 -260 3 133 -340 237 190 -433 267 189 -475 212 -52 -278 238 -68 67 207 -238
4277 -238 257 153 -444 360 -4 -362 304 -47 -261 351 -263 -209 208 -346 202 37 -456 314 -7 -314
4297 -314 493 -111 -261 286 -62 -9 185 -353 191 -11 -313 456 -133 -256 452 -82 -171 331 -290 26 203
4318 203 -204 266 151 -325 312 -143 -233 434 -257 -216 231 -321 16 185 -410 217 -30 -238 308 -229 -143
4339 -143 392 -235 -46 327 -317 -25 140 -295 173 -43 -309 260 -242 -159 499 -337 -77 442 -262 70
4359 70 227 -406 268 60 -232 324 -182 -57 309 -326 119 198 -332 116 172 -256 181 -11 -297 325 -146
4380 -146 -17 374 -382 74 239 -413 230 131 -351 231 30 -227 272 -214 -87 356 -421 9 230 -389
4400 -389 274 147 -439 369 -92 -237 318 -146 60 277 -245 222 78 -373 241 16 -327 395 -64 -316
4420 -316 376 -144 162 253 -207 176 100 -294 265 9 -253 332 -168 -312 195 -280 -61 349 -149 261 43
4441 43 -263 361 -56 -381 415 -253 -279 422 -144 -48 259 -277 168 109 -232 221 -75 -272 357 -205 -204 236
4463 236 -390 -2 174 -303 129 66 -239 292 -184 -246 399 -321 -136 313 -363 66 240 -302 203 35 -188
4484 -188 310 -126 -144 376 -191 -76 329 -189 -75 165 -194 256 -8 -384 347 -113 -159 442 -208 73 319
4505 319 -389 161 67 -339 125 83 -305 312 -188 -170 369 -149 62 254 -403 143 116 -378 384 -91 -195
4526 -195 208 -139 -162 256 -205 90 232 -219 265 67 -254 338 -7 -377 231 -220 -148 228 -228 -88 184
4547 184 -208 211 19 -395 278 -95 -183 515 -114 -210 332 -154 36 206 -240 388 7 -236 376 -139 -139
4568 -139 306 -273 -163 228 -247 34 70 -273 240 42 -235 398 -200 -199 345 -96 -61 264 -228 115 -28
4589 -28 -368 194 -9 -253 301 -141 -303 363 -126 -141 223 -236 174 117 -209 243 -172 -186 341 -235 -232 383
4611 383 -264 -98 235 -150 66 -21 -280 242 -115 -254 182 -218 -273 397 -131 37 224 -195 116 -37 -10
4632 -10 350 -190 -153 425 -140 -78 344 -267 -14 172 -292 131 76 -267 240 -124 -183 301 -291 -116 362 -278
4654 -278 26 227 -180 207 -91 -172 200 -151 -180 393 -228 -56 241 -298 -9 184 -169 271 -4 -208 447
4675 447 -222 -68 511 -186 -45 187 -233 68 70 -234 246 -202 -256 438 -159 -162 427 -193 -41 240 -268 200
4697 200 18 -143 337 -268 -278 259 -184 -196 292 -380 -32 127 -259 115 -71 -226 351 -184 -241 265 -147
4718 -147 -143 391 -160 52 206 -195 252 -85 -142 195 -185 -112 390 -354 -53 298 -185 -48 269 -7 179
4739 179 -1 -191 365 -310 -130 354 -286 -83 208 -201 68 90 -181 164 -142 -40 364 -183 -85 452 -279
4760 -279 11 364 -230 82 133 -117 235 -70 -138 231 -310 -135 306 -300 -87 327 -300 43 60 -338 121
4781 121 -59 -46 368 -202 6 375 -260 105 248 -278 69 53 -237 100 -105 -12 316 -161 -180 295 -279
4802 -279 99 269 -288 174 48 -254 211 -194 -7 264 -254 11 274 -274 -3 36 -352 191 -19 -229
4822 -229 202 -109 -79 250 -250 82 307 -180 161 178 -276 180 49 -260 260 -137 -175 191 -182 -36 165
4843 165 -226 166 85 -119 180 -170 -98 300 -75 -81 247 -214 -78 200 -196 217 99 -138 220 -77 -148 208
4865 208 -167 -11 233 -239 54 189 -252 120 -74 -54 214 -106 -31 329 -211 -80 301 -182 50 194 -188
4886 -188 230 -61 -111 216 -110 -176 408 -252 -7 168 -233 170 84 -232 154 73 -95 161 -73 -127 289 -195
4908 -195 30 282 -192 106 240 -161 173 33 -144 214 -159 -17 209 -288 135 255 -231 150 79 -282
4928 -282 168 103 1 220 -223 84 178 -191 87 170 -297 97 134 -222 307 -109 -154 117 -75 -128 130 -120
4950 -120 110 159 -451 163 5 -180 115 -216 -84 256 -296 -14 267 -198 222 192 -249 241 -50 -216 172
4971 172 -161 -44 255 -107 20 248 -169 -15 38 -248 258 88 -279 192 -8 -67 336 -137 28 201 -216
4992 -216 37 34 -212 169 27 -160 245 -179 -97 277 -227 77 231 -292 22 191 -254 155 10 -213 266
5013 266 -213 -15 315 -330 94 205 -248 56 152 -207 114 8 -36 243 -190 25 251 -278 69 206 -251
5034 -251 95 112 -185 178 -107 -94 110 -185 -63 181 -318 112 150 -298 126 192 -101 215 -121 32 349
5055 349 -208 36 254 -217 56 101 -316 161 -109 -258 188 13 -5 194 -369 185 281 -240 141 176 -145
5076 -145 134 114 -133 176 -116 -21 237 -201 60 274 -340 37 255 -296 176 0 -75 117 -183 59 163
5097 163 -305 168 276 -310 148 84 -298 171 68 -90 158 -239 -87 67 -291 101 109 -236 70 128 -252
5118 -252 122 8 26 226 -153 38 75 -293 205 197 -318 317 154 -177 168 4 -63 137 -140 125 192 -312
5140 -312 131 104 -363 153 189 -121 120 8 -117 28 -276 72 182 -269 130 120 -280 92 46 -57 303
5161 303 -118 -72 207 -343 60 95 -158 194 179 -245 208 0 -118 117 -146 123 148 -287 82 192 -288
5182 -288 162 106 -171 49 20 -76 124 -66 10 172 -236 -12 159 -431 -7 159 -144 169 166 -50 29 -186
5204 -186 10 212 -268 94 200 -401 244 77 -317 74 48 -23 47 -110 -5 168 -244 128 226 -305 66
5225 66 160 -228 119 19 -42 129 -212 139 143 -270 211 101 -239 209 98 -276 -19 -42 -115 109 -293 24
5247 24 169 -326 148 126 -209 181 69 -255 203 -60 34 136 -135 178 150 -226 137 155 -472 169 27 -129
5269 -129 253 -186 -58 58 -107 61 113 -214 186 156 -298 332 -4 -155 186 -65 14 120 -292 165 109
5290 109 -298 211 74 -270 136 -19 -186 169 -202 56 42 -211 133 170 -198 138 32 -207 209 -127 -76
5311 -76 222 -246 -13 179 -227 160 35 -228 125 49 -80 230 -180 -109 346 -197 -13 142 -211 88 85 -171
5333 -171 173 -32 -135 196 14 -9 217 -120 13 94 -184 222 70 -261 257 21 -174 283 -84 81 140
5354 140 -217 103 279 -126 164 27 -156 313 32 -38 190 21 -31 151 -235 30 61 -241 232 130 -181
5375 -181 115 -41 -169 117 -130 22 53 -272 18 53 -257 82 -40 -201 310 -1 -76 142 -110 111 187
5396 187 -314 177 20 -313 215 10 -176 182 -1 -106 201 -172 116 147 -216 196 93 -171 302 30
5416 30 -214 174 -155 -168 141 -165 35 -1 -208 229 109 -292 124 -99 -160 201 -174 -232 225 -148 78 40
5438 40 -208 216 -84 -191 258 -33 -160 353 -123 -11 139 -260 57 197 -250 148 32 -183 285 -35
5458 -35 -104 224 -159 -109 132 -210 -39 107 -302 175 13 -258 185 -120 -27 140 -164 104 132 -103 130 140
5480 140 -277 193 21 -180 284 -24 -96 154 -136 48 132 -223 176 176 -237 134 -91 -141 252 -121 -82 159
5502 159 -210 175 119 -303 105 8 -186 188 11 -144 135 -37 -23 130 -187 -8 89 -290 194 69 -138
5523 -138 263 -36 -209 165 -170 -57 171 -188 4 170 -196 69 85 -253 262 10 -147 240 -32 -13 36
5544 36 -138 233 -12 -160 190 58 -243 201 -59 -160 248 -181 -20 74 -238 201 -72 -188 340 -21 -314
5565 -314 270 -52 -120 270 -120 -54 13 -91 99 18 -287 183 -3 -277 259 -26 -55 148 -132 45 60 -128
5587 -128 146 -41 -310 172 -39 -201 381 -170 -55 224 -179 69 65 -197 106 -54 -171 281 -51 -143 263
5608 263 -76 53 132 -46 121 83 -187 293 52 -121 263 -163 -133 231 -109 -94 132 -67 118 -19 -198
5629 -198 307 33 -117 175 -91 -110 202 -178 -48 124 -100 39 2 -111 169 -12 -137 266 -78 -113 108
5650 108 -105 94 39 -156 155 24 -248 252 -17 -196 294 48 -151 184 -92 9 -36 -139 160 -139 -198
5671 -198 230 -124 -361 204 -123 -35 105 -49 -85 52 -104 199 27 -173 280 -75 -213 133 -105 -192 133
5692 133 -46 -50 70 -148 217 15 -224 165 -9 -119 365 -101 -131 -3 -157 84 -21 -197 214 -63 -168
5713 -168 211 40 -112 287 -32 -54 74 -35 126 8 30 282 -78 -194 324 -52 -184 318 21 -83 24
5734 24 -95 166 6 -112 194 -151 -98 233 -117 -177 205 -101 108 80 -162 83 -44 -70 208 -66 -120 183
5756 183 -158 -32 140 -118 -4 68 -50 64 -3 -139 200 -183 -190 316 -23 -18 108 -51 120 88 -164 159
5778 159 -39 -89 125 -87 -143 245 -115 -98 166 -155 55 79 -127 98 -71 -114 248 -151 -83 232 -199 -77
5800 -77 162 -100 38 -5 -129 232 -45 -115 201 -141 -54 138 -57 72 97 -28 133 30 -211 214 -74 -102
5822 -102 202 -137 -143 170 -106 19 98 -171 149 -6 -232 144 -88 -87 239 -179 -25 212 -100 -7 43 -198
5844 -198 151 -54 -107 219 -73 -232 184 -184 -70 144 -22 -1 81 13 121 -43 -202 169 -25 -146 281
5865 281 -207 -9 85 -115 2 -19 -142 108 -65 -59 92 -167 35 269 -116 143 175 -211 90 75 -1 155
5887 155 -150 -13 178 -71 5 110 -88 -77 11 -191 62 17 -113 145 -34 60 259 -122 -100 298 -168 27
5909 27 188 -155 -53 -30 -215 13 -102 62 154 -165 -8 180 -42 31 140 -166 136 71 -94 237 -61 -138
5931 -138 126 -78 -99 78 -175 29 112 -36 41 -57 -67 174 -107 -175 177 -74 -89 101 -17 171 -79 -130 141
5954 141 -56 -89 290 -40 -140 195 -117 -40 145 -89 75 45 -137 86 -36 -109 116 -87 9 90 -165 -91
5976 -91 94 -82 182 95 -80 175 16 -148 167 -110 -97 160 -57 -13 -41 -153 146 86 -105 199 -132 -128 129
5999 129 -113 -64 96 -83 -7 -6 -126 -11 76 -102 155 -170 30 205 -143 133 213 -92 19 120 -78 84
6021 84 -60 -95 230 -92 -48 154 -262 -2 133 -100 82 186 -114 90 -108 -182 165 -41 35 139 -131 60
6043 60 104 -79 -16 70 -231 153 -97 -24 163 -266 -43 147 -162 18 135 -56 73 151 -92 158 -70 -126
6065 -126 82 -79 24 68 -214 41 72 -210 18 -11 -59 165 -117 -70 237 -70 102 -13 -166 68 64 -111
6087 -111 87 40 -126 70 -98 -12 187 -223 -34 150 -144 -9 160 -153 85 -22 18 113 -23 -76 232 -170
6109 -170 -50 97 -186 13 63 -73 50 55 -81 74 -112 -128 124 -181 -75 137 -115 26 -42 -164 -35 -92
6131 -92 -58 132 -95 59 75 -152 -60 158 -153 28 -56 6 12 9 62 162 -16 20 179 -159 31 6 -85 155 13
6156 13 -1 75 -67 -97 139 -76 -41 111 -222 13 250 -76 53 79 -102 88 -8 53 3 -238 102 231 -85
6179 -85 44 233 -129 61 32 -140 10 -27 8 139 -129 -3 124 -68 5 98 -73 -46 49 100 74 -150 78
6202 78 71 -245 -66 238 -148 80 214 -52 -47 -69 15 76 -133 -27 157 -235 1 59 -155 109 3 -279 74
6225 74 105 -49 90 -229 -45 139 -40 87 21 -129 159 160 0 21 -18 -6 98 -77 -50 41 -161 91 199
6248 199 -120 110 88 -70 34 -61 22 156 -156 97 153 -200 99 93 -135 51 -43 -190 88 -136 -127 201 -89
6271 -89 136 126 -180 21 63 -74 63 -107 -58 139 -106 -29 141 -77 104 125 -176 16 118 -37 75 -30
6293 -30 -7 75 -56 9 151 -230 21 49 -187 54 164 3 89 -41 26 -7 -85 9 125 -85 126 125 -167 42
6317 42 -4 -128 72 -108 -127 30 -159 154 175 -130 -28 72 -166 185 72 -26 85 -52 19 47 -118 70
6339 70 38 -167 117 43 -140 -24 96 -129 60 -77 8 71 -24 34 -39 -123 -15 113 -153 5 -63 -30 171 -136
6363 -136 -19 183 -9 -35 10 -121 113 13 -176 -23 -50 -94 111 -69 -2 7 -52 -50 35 -140 101 -9 -125 218
6387 218 -10 -121 -24 -44 27 144 -66 108 -7 -43 98 4 -211 137 -123 -46 19 -199 -33 7 -112 129 -21
6410 -21 -70 35 4 -78 121 11 -47 83 -127 5 138 -194 97 123 -127 84 -17 -137 22 43 -52 159 -169
6433 -169 51 55 -72 155 100 -136 43 1 -42 223 -44 -146 126 -23 24 81 -108 93 112 -79 193 -99 -66
6456 -66 42 106 -35 76 -37 75 187 -129 98 26 -127 76 -80 -109 157 9 25 80 -80 5 137 -64
6478 -64 65 38 -104 171 -41 -93 152 -165 -120 15 -144 54 8 -141 75 -30 -159 63 -33 -28 58 -109 -24
6501 -24 6 -237 -41 99 -80 107 22 7 74 28 57 -14 -127 -3 57 -185 114 122 -79 156 -17 -79 120 -57
6525 -57 -57 144 -118 -4 95 -64 175 46 -72 126 -12 -115 146 -112 2 98 26 116 183 -154 -38 37 -127
6548 -127 190 -26 -16 128 -65 -25 39 -99 -25 -42 -141 102 -35 -38 125 35 -25 41 -7 102 106 -159 -17 13 -67
6573 -67 131 -54 -161 156 -63 28 89 24 -37 -30 -106 127 48 -142 26 22 -144 139 -170 33 40 -136 -71 -75 -41 125
6599 125 49 -106 124 25 -67 27 -8 -65 -35 -140 123 115 -113 -7 -24 -71 166 15 -65 75 -59 -62 -13 -42 71
6624 71 74 -244 109 79 -98 94 28 -42 128 9 7 66 -160 121 -24 -183 162 33 -119 119 -39 -77 103
6647 103 -99 127 71 -24 178 31 -54 83 14 -148 177 21 -129 23 -72 163 113 -52 131 -132 -51 52
6669 52 45 -125 49 0 -92 72 -6 71 34 -97 43 -104 -139 36 22 -177 150 42 4 71 10 181 96 -50 67
6694 67 68 -197 152 32 -51 16 60 -86 52 -144 78 33 -78 202 82 -196 193 -102 -88 100 -15 -111 62
6717 62 14 -31 -9 -184 136 -116 -141 190 -78 -65 42 -86 31 44 -27 21 -64 17 113 -4 -81 188 -54 -29 140
6742 140 -13 9 54 -110 109 -19 -117 153 -2 -97 56 -25 -72 26 -70 38 -11 -64 91 76 -85 54 18 -57
6766 -57 205 9 -56 147 -97 59 -61 -41 85 59 -40 179 18 -15 56 -99 15 73 -39 17 32 34 104 -52
6790 -52 2 83 47 -96 87 -98 -83 106 -18 13 -41 -45 67 -34 -215 66 -39 -118 75 9 -24 83 15 55 94
6815 94 -111 67 139 -127 123 -10 -80 155 -6 239 -42 -17 -1 74 -11 117 52 -28 136 -115 -25 114 30 9
6839 9 84 -29 50 -43 -36 80 -33 -52 48 14 -44 78 -39 68 125 -2 12 9 -55 31 12 -38 120 -72 -157 0
6865 0 -25 -9 -21 -72 40 -147 -4 121 -20 -73 161 -5 -16 147 -23 60 79 -83 -38 69 -122 69 -52 -98
6889 -98 87 -62 -29 -25 8 116 43 46 11 5 -39 90 -43 -12 138 -93 -83 -46 -26 -30 -15 -16 124 24 -13 -13 -31 56 54
6918 54 -167 -73 40 -33 196 47 15 150 15 20 -3 6 6 -9 -153 95 -102 51 99 -71 18 79 37 -8 46 -69
6944 -69 -43 82 107 67 185 -69 132 -46 -65 49 27 -86 98 18 -23 -18 -25 19 129 -55 -12 -61 -89 121 -108
6969 -108 -52 95 -38 88 68 -121 9 118 -79 136 10 -26 -5 -30 -33 74 -50 -59 82 -7 -29 -35 13 25 -28
6994 -28 79 84 -77 -21 -6 9 12 97 47 47 10 -89 74 -2 -120 61 -88 61 61 -29 41 93 -15 -17 26 32 45 34 -102
7023 -102 25 -60 6 124 -80 10 -27 -106 -70 68 -146 120 59 -49 -58 70 -107 91 -29 58 -74 -55 -30 17
7047 17 -33 -1 67 -138 102 78 7 51 -72 21 81 -99 87 48 -38 3 -32 -7 39 35 -26 60 -10 95 34 -42 -26 -46
7075 -46 -116 35 16 -54 136 -65 24 24 -66 -4 39 -12 97 -141 -35 8 -23 -36 59 -14 50 -128 -122 88 34 8 21
7102 21 -77 60 27 -67 14 11 -89 -70 27 62 44 -38 -2 77 29 -31 105 -110 -60 5 -39 -55 96 -26 38 -34 55 48
7130 48 -178 -87 105 -53 0 135 2 -62 25 -47 42 54 1 109 -32 -165 20 28 -53 -1 26 67 -1 -90 5 -39
7156 -39 -31 115 -14 41 70 -131 -24 86 -64 -131 8 8 -32 -130 -21 -30 -31 53 1 -91 -18 -23 -88 46 58 42 27 -129
7184 -129 17 92 -25 -12 102 -111 13 50 -41 83 13 19 7 39 -32 60 -14 76 102 -66 -5 21 -5 8 -102 -4
7210 -4 73 -8 47 75 -127 67 90 -43 -20 41 -74 -139 -4 -121 54 -89 32 58 57 -33 -2 -53 18 97 28 -82
7236 -82 -31 55 170 1 -9 37 -41 -25 168 87 79 48 -109 24 14 26 -17 -105 -114 65 -131 -22 53 37 100 -32 13
7263 13 -3 -71 -70 -20 38 -123 82 -83 -38 26 22 111 -17 -62 -60 -136 3 135 -69 -1 151 -94 8 -13 13 -24 -49
7290 -49 -76 68 -47 59 72 53 -9 111 44 105 5 4 19 21 32 7 -65 17 115 -92 76 197 -41 50 -23 -41 69
7317 69 93 18 80 -167 24 58 -2 4 -45 -35 114 -2 -2 1 -69 89 50 -61 -26 62 -69 -45 -19 -85 71 -5 -93 52
7345 52 -84 8 -85 24 2 19 -126 -18 -35 -82 67 -123 41 64 -164 32 32 -21 -20 58 -56 122 4 42 37 17
7371 17 -32 35 -56 25 101 -15 -2 153 -61 -57 18 -112 50 14 -41 51 -58 -95 120 -197 -21 72 -62 -16 34 -41
7397 -41 -85 -86 -120 69 39 8 53 -15 99 44 -3 123 -41 -50 96 7 -19 57 -147 91 64 -114 24 50 -59 43
7423 43 -59 -103 36 6 -20 66 45 -83 108 -9 -13 1 74 -77 5 -16 150 27 -61 23 -114 6 71 -38 45
7448 45 -11 70 159 15 3 24 -9 -67 21 -126 38 26 30 20 42 19 74 -101 -14 112 -5 56 146 46 -95 -150 -100
7475 -100 -39 47 15 23 69 -78 32 75 -68 -170 -72 -52 120 -47 -77 83 -144 67 39 8 138 -66 22 -1 -24
7500 -24 -5 -11 -24 79 73 -91 -63 -32 -71 -27 -29 -6 90 -27 23 12 -44 88 -71 -50 77 -35 22 6 -106 -33 -94 -48
7528 -48 137 127 -130 62 -23 -93 8 -16 39 92 -17 3 -21 -89 50 39 -67 154 -48 70 21 -13 -7 55 34 66
7554 66 -95 -38 -49 90 51 78 -112 -98 67 -16 -1 135 -45 -4 -30 -34 73 -77 76 72 15 -27 -8 2 -41 53 1
7581 1 -14 80 -61 50 -14 -85 71 12 -107 81 -115 -55 -61 -40 33 98 -27 33 -40 -29 41 -9 -61 30 -37 56 13 9
7609 9 -53 52 61 116 -100 -153 81 -63 -35 14 -22 156 105 62 62 19 -10 53 -83 40 16 -27 -9 -17 -61 -94 -100 -5 85
7638 85 34 -64 45 -6 -80 81 11 45 68 86 171 35 -122 5 20 -29 136 -33 -59 33 -49 -66 -47 23 96 11 18
7665 18 59 48 -30 91 -79 45 -17 100 -58 -8 34 31 13 40 170 -90 146 80 7 86 51 -194 50 79 -129
7690 -129 -2 67 -69 -53 51 -90 81 -58 72 83 -9 13 -56 -89 -19 -36 -94 49 21 -18 -57 -93 89 -60 13
7715 13 137 -45 -74 31 98 2 -50 -101 -68 38 -6 22 11 -124 11 3 -43 128 48 40 139 12 -26 85 -63 -5
7741 -5 44 -67 121 18 60 89 -18 -68 -69 8 -78 -8 33 51 9 -16 16 41 -79 -21 12 -52 -36 -67 24 -59 -46 59
7769 59 92 -19 -61 -101 -6 33 -40 51 33 27 -26 78 -12 10 52 -88 47 -85 27 -62 13 146 60 36 78 14 -9
7796 -9 51 -27 40 83 3 -110 -23 21 -86 142 -60 -4 47 -42 42 -18 -56 133 -33 33 -30 13 76 54 -38 59 112 -86
7824 -86 -24 89 -92 135 38 7 26 46 90 -73 51 12 -17 95 71 -22 -113 -27 19 -20 182 6 49 43 -68 26
7850 26 38 4 5 38 -50 1 -48 -126 -64 56 40 -45 60 121 30 -78 31 2 -31 58 106 8 -29 53 79 71 85 48 45 -40
7880 -40 31 93 -18 -79 -7 -13 -44 38 -56 13 21 -45 16 -31 158 -3 69 45 56 72 20 -110 -8 32 -35 122 -70 -19
7908 -19 145 46 38 111 36 -22 -22 -64 -4 -6 33 27 34 -35 20 -22 -40 13 -47 -41 -23 8 -29 -44 -114 -54 -50 -110 44 -75 18 78
7940 78 -70 -42 55 6 -15 26 -71 1 50 -100 -55 0 -21 92 -9 73 -115 92 68 59 1 18 31 89 -18 -81 -28
7967 -28 102 -128 7 -25 59 49 1 -10 72 69 -15 41 -40 18 8 -115 -18 121 30 155 -32 -1 -61 -16 75 19 29
7994 29 -10 -50 -16 96 43 -23 6 -43 30 -5 -37 6 -68 16 -10 -86 -98 54 -101 -33 53 -20 57 72 -47 111 60 -25
8022 -25 91 21 34 25 -7 56 47 -22 35 -13 96 -32 73 -86 -81 72 -63 39 -22 -1 -22 123 -17 -32 -56 74
8048 74 77 -43 -72 53 18 33 -62 -48 9 123 65 67 -12 61 21 -94 57 82 -64 15 -64 26 60 13 62 56 -24 153
8076 153 181 16 30 11 -29 36 118 -19 14 -49 -14 141 -43 7 142 -4 2 -32 -146 84 16 33 47 -39 34 67
8102 67 -34 -1 34 -48 88 32 -51 4 52 -23 63 165 -33 -95 -55 48 -48 -24 -51 -32 -93 -6 -115 101 -6 19
8128 19 28 102 61 -53 68 -180 102 124 98 82 -111 -37 63 20 73 29 -99 -24 -19 -106 56 -51 28 103 79 -6 67
8155 67 46 -152 3 -52 -21 -9 11 75 42 22 -28 48 -66 80 -126 7 13 -77 64 -9 -63 86 19 -37 74 -112
8181 -112 -10 69 -56 26 -29 -35 -63 3 1 -43
8191d3
##END NTUPLES=NMR FID
##END=
