##TITLE=1H_DE-80H_X3
 200.13MHz, d2o
 8 sc
 
 19ns.26.2.2025
##JCAMPDX= 6.0         $$ Bruker NMR JCAMP-DX V2.0
##DATA TYPE= NMR FID
##DATA CLASS= NTUPLES
##ORIGIN= UXNMR, Bruker Analytische Messtechnik GmbH
##OWNER= pz
$$ XWIN-NMR		Version 3.5
$$ Mon Jun 30 10:36:49 2025 Russian Standard Time (UT+4h)  Yarkov@DPX200
##.OBSERVE FREQUENCY= 200.1313
##.OBSERVE NUCLEUS= ^1H
##.DELAY= (6, 6)
##.ACQUISITION MODE= SIMULTANEOUS
##.ACQUISITION SCHEME= undefined
##.AVERAGES= 8
##.DIGITISER RES= 18
##SPECTROMETER/DATA SYSTEM= spect
##.PULSE SEQUENCE= zg30
##.SOLVENT NAME= CDCl3
##.SHIFT REFERENCE= (INTERNAL, CDCl3, 0, 14.3821)
##AUDIT TRAIL= $$ (NUMBER, WHEN, WHO, WHERE, WHAT)
$$ ##TITLE= Audit trail, XWIN-NMR		Version 3.5
$$ ##JCAMPDX= 5.01
$$ ##ORIGIN= Bruker BioSpin GmbH
$$ ##OWNER= Yarkov
$$ C:/Bruker/XWIN-NMR/data/yarkov2/nmr/H-C/1/audita.txt
$$ ##AUDIT TRAIL=  $$ (NUMBER, WHEN, WHO, WHERE, WHAT)
(   1,<2025-06-30 10:35:12.12 +0400>,<Yarkov>,<DPX200>,
      <created by zg, POWCHK disabled, PULCHK disabled
       configuration hash MD5:
       00 E9 B6 7A A2 85 ED C7 34 08 36 98 17 FE 4E 26
       data hash MD5: 16K
       90 4B 4E 3C 85 F2 23 1D F7 0E 0C A8 22 68 8C 8D>)
$$ ##END=
$$ 
$$ hash MD5
$$ 5B 7C 56 85 12 17 8F D7 F4 7C F6 30 ED 3A E3 9B
##$RELAX= 
##$RELAX= 
##$RELAX= 
##$RELAX= 
##$RELAX= 
##$RELAX= 
$$ Bruker specific parameters
$$ --------------------------
##$DU= <C:/Bruker/XWIN-NMR>
##$EXPNO= 1
##$NAME= <H-C>
##$PROCNO= 1
##$TYPE= <nmr>
##$USER= <yarkov2>
##$AMP= (0..31)
100 100 100 100 100 100 100 100 100 100 100 100 100 100 100 100 100 100 
100 100 100 100 100 100 100 100 100 100 100 100 100 100 
##$AQSEQ= 0
##$AQ_mod= 1
##$AUNM= <au_zg>
##$AUTOPOS= <>
##$BF1= 200.13
##$BF2= 200.13
##$BF3= 200.13
##$BF4= 200.13
##$BF5= 200.13
##$BF6= 200.13
##$BF7= 200.13
##$BF8= 200.13
##$BYTORDA= 1
##$CFDGTYP= 0
##$CFRGTYP= 5
##$CHEMSTR= <none>
##$CNST= (0..31)
1 1 145 1 1 1 1 1 1 1 1 1 1 1 1 1 1 1 1 1 1 1 1 1 1 1 1 1 1 1 1 1 
##$CPDPRG= <>
##$CPDPRG1= <>
##$CPDPRG2= <>
##$CPDPRG3= <>
##$CPDPRG4= <mlev>
##$CPDPRG5= <mlev>
##$CPDPRG6= <mlev>
##$CPDPRG7= <mlev>
##$CPDPRG8= <mlev>
##$CPDPRGB= <>
##$CPDPRGT= <>
##$D= (0..31)
0 0.7 0 0 0 0 0 0 0 0 0 0.03 0 0 0 0 0 0 0 0 0 0 0 0 0 0 0 0 0 0 0 0 
##$DATE= 1751265311
##$DBL= (0..7)
120 120 120 120 120 120 120 120 
##$DBP= (0..7)
150 150 150 150 150 150 150 150 
##$DBP07= 0
##$DBPNAM0= <>
##$DBPNAM1= <>
##$DBPNAM2= <>
##$DBPNAM3= <>
##$DBPNAM4= <>
##$DBPNAM5= <>
##$DBPNAM6= <>
##$DBPNAM7= <>
##$DBPOAL= (0..7)
0.5 0.5 0.5 0.5 0.5 0.5 0.5 0.5 
##$DBPOFFS= (0..7)
0 0 0 0 0 0 0 0 
##$DE= 6
##$DECBNUC= <off>
##$DECIM= 32
##$DECNUC= <off>
##$DECSTAT= 4
##$DIGMOD= 1
##$DIGTYP= 9
##$DL= (0..7)
0 120 120 120 120 120 120 120 
##$DP= (0..7)
150 150 150 150 150 150 150 150 
##$DP07= 0
##$DPNAME0= <>
##$DPNAME1= <>
##$DPNAME2= <>
##$DPNAME3= <>
##$DPNAME4= <>
##$DPNAME5= <>
##$DPNAME6= <>
##$DPNAME7= <>
##$DPOAL= (0..7)
0.5 0.5 0.5 0.5 0.5 0.5 0.5 0.5 
##$DPOFFS= (0..7)
0 0 0 0 0 0 0 0 
##$DQDMODE= 0
##$DR= 18
##$DS= 0
$$ [...]
##$SUBNAM2= <"">
##$SUBNAM3= <"">
##$SUBNAM4= <"">
##$SUBNAM5= <"">
##$SUBNAM6= <"">
##$SUBNAM7= <"">
##$SUBNAM8= <"">
##$SUBNAM9= <"">
##$SW= 18.0517328524113
##$SWIBOX= (0..15)
0 0 2 0 0 0 0 0 0 0 0 0 0 0 0 0 
##$SW_h= 3612.71676300578
##$TD= 16384
##$TD0= 1
##$TE= 0
##$TE2= 300
##$TE3= 300
##$TEG= 300
##$TL= (0..7)
0 120 120 120 120 120 120 120 
##$TP= (0..7)
150 150 150 150 150 150 150 150 
##$TP07= 0
##$TPNAME0= <>
##$TPNAME1= <>
##$TPNAME2= <>
##$TPNAME3= <>
##$TPNAME4= <>
##$TPNAME5= <>
##$TPNAME6= <>
##$TPNAME7= <>
##$TPOAL= (0..7)
0.5 0.5 0.5 0.5 0.5 0.5 0.5 0.5 
##$TPOFFS= (0..7)
0 0 0 0 0 0 0 0 
##$TUNHIN= 0
##$TUNHOUT= 0
##$TUNXOUT= 0
##$USERA1= <user>
##$USERA2= <user>
##$USERA3= <user>
##$USERA4= <user>
##$USERA5= <user>
##$V9= 5
##$VALIST= <valist>
##$VCLIST= <CCCCCCCCCCCCCCC>
##$VD= 0
##$VDLIST= <DDDDDDDDDDDDDDD>
##$VPLIST= <PPPPPPPPPPPPPPP>
##$VTLIST= <TTTTTTTTTTTTTTT>
##$WBST= 1024
##$WBSW= 4
##$XGAIN= (0..3)
0 0 0 0 
##$XL= 0
##$YL= 0
##$YMAX_a= 169135
##$YMIN_a= -137343
##$ZGOPTNS= <>
##$ZL1= 120
##$ZL2= 120
##$ZL3= 120
##$ZL4= 120
##$ABSF1= 10
##$ABSF2= 0
##$ABSG= 5
##$ABSL= 3
##$ALPHA= 0
##$AQORDER= 0
##$ASSFAC= 0
##$ASSFACI= 0
##$ASSFACX= 0
##$ASSWID= 0
##$AUNMP= <proc_1d>
##$AZFE= 0.1
##$AZFW= 0.1
##$BCFW= 1
##$BC_mod= 2
##$BYTORDP= 1
##$COROFFS= 0
##$CY= 83.5205535888672
##$DATMOD= 1
##$DC= 2
##$DFILT= <>
##$DTYPP= 0
##$F1P= 10.8118882576601
##$F2P= -7.23987719738617
##$FCOR= 0.5
##$FTSIZE= 0
##$FT_mod= 4
##$GAMMA= 1
##$GB= 0.15
##$INTBC= 1
##$INTSCL= 1
##$ISEN= 128
##$LB= 0.25
##$LEV0= 0
##$LPBIN= 0
##$MAXI= 10000
##$MC2= 0
##$MEAN= 0
##$ME_mod= 0
##$MI= 1.114404
##$NCOEF= 0
##$NC_proc= 0
##$NLEV= 6
##$NOISF1= 3.799351
##$NOISF2= 2.8
##$NSP= 1
##$NTH_PI= 0
##$NZP= 0
##$OFFSET= 14.38212
##$PC= 1
##$PHC0= -1354.82
##$PHC1= 3.966602
##$PH_mod= 1
##$PKNL= yes
##$PPARMOD= 0
##$PSCAL= 0
##$PSIGN= 0
##$REVERSE= no
##$SF= 200.129724274929
##$SI= 16384
##$SIGF1= 3
##$SIGF2= 2
##$SINO= 400
##$SIOLD= 16384
##$SREGLST= <1H.CDCl3>
##$SSB= 0
##$STSI= 0
##$STSR= 0
##$SW_p= 3205.1282051282
##$SYMM= 0
##$S_DEV= 0
##$TDeff= 0
##$TDoff= 0
##$TI= <>
##$TILT= no
##$TM1= 0
##$TM2= 0
##$TOPLEV= 0
##$USERP1= <user>
##$USERP2= <user>
##$USERP3= <user>
##$USERP4= <user>
##$USERP5= <user>
##$WDW= 1
##$XDIM= 8192
##$YMAX_p= 0
##$YMIN_p= 0
$$ End of Bruker specific parameters
$$ ---------------------------------
##NTUPLES= NMR FID
##VAR_NAME=  TIME,          FID/REAL,        FID/IMAG
##SYMBOL=    X,             R,               I
##VAR_TYPE=  INDEPENDENT,   DEPENDENT,       DEPENDENT
##VAR_FORM=  AFFN,          ASDF,            ASDF
##VAR_DIM=   8192,          8192,            8192
##UNITS=     SECONDS,       ARBITRARY UNITS, ARBITRARY UNITS
##FACTOR=    0.0002768,     1,               1
##FIRST=     0,             0,               0
##LAST=      2.2672688,     0,               0
##MIN=       0,             -137343,         0
##MAX=       2.2672688,     169135,          0
$$ Real data points
##PAGE= N=1
##DATA TABLE= (X++(R..R)), XYDATA
0@%%%%%%%%%%%%%%%%%%%%%%%%%%%%%%KnPrJ1j2J4j8K1k3K5k9L3l7M3m8N3n9O7
49C6p5Q2r1R9j08J17j26J35j42J49j55J56j48J28q3j2K05o22J661n015L2423J40521
71A69135j67546o4699J43217p4125j14185P7453P7613p0577o079J27237o3481
82C3963j62190J20646Q8969j39794J8794J11941n4997n4744L9059K6493m3949
93a5809p297R4201m0783j33168Q0168O4953j07077K8048J03853l5910n0172K0490
105A497P757n8040N987J22776j7508r7226Q8224J9750j35568J6271O6287l4746
117a4539P438M1303j2601m9827p00N9303l7511n4748Q5508J6330p3944K8027K1506
130A5545k1621J9567L2q756j2624j9910L4502j1687m5077N9458K6474n1765O9
$$ plain form
0 0 0 0 0 0 0 0 0 0 0 0 0 0 0 0 0 0 0 0 0 0 0 0 0 0 0 0 0 0 0 0 2 -3 4 -5 6 -6 8 -10 11 -12 13 -16 17 -20 23 -25 28 -31 36
49 36 -39 43 -48 51 -57 60 -66 69 -73 76 -79 77 -71 57 -26 -38 167 -455 1206 -3809 28614 169135
71 169135 1589 -63110 80107 5982 -108203 -30750 46863 -23714 -29793 97444 33963
82 33963 -128227 -7581 81388 -58406 -39612 72329 17332 -37412 1647 28140 -15809
93 -15809 -23106 71095 30312 -102856 -22688 42265 -64812 -36764 67089 31179 -18993 1497
105 1497 9254 -48786 -42799 79977 62469 -34757 53467 73217 -62351 -46080 20207 -14539
117 -14539 -7101 34202 21601 -28226 -28926 30377 -7134 -61882 23626 39956 -33988 -5961 15545
130 15545 -6076 13491 13523 4767 -7857 -27767 6735 -4952 -50029 9429 35903 -15862 -15793
143a5793Q81r714J0528N47L0790J2584j8599L4562j8304o1022L8446J7949l4247
156a1392J6797N689m313M118k4039Q031L879k3153L2358K158l6298L1777J5321
169B0933j9126K372j1905R299L625l4349K6619J7757l2749L3925J1645m8275J1098
182i131J2853k0864n760K130K9670L270k8506L2070j230m4270L7330J1255l7487
195a8670K9157J8913j8257m338p639J1842r174l0028L0009J990l0388L9136P408
208A9961l3937J8156M010j4988j271n127K2737J163k2214L2634k832l7310K7292
221H274j814l2560K0274P713n350M170o699J4503q323k4775K8832k465k1497L7195
235A7478P36k1657J8932p286j1097J524j4633J3705J034j6380K8672q67k0026
$$ plain form
143 -15793 -14912 -24626 -14098 -13551 17239 29823 11224 45786 27482 -33540 4906 22855 -11392
156 -11392 5405 11094 6781 10899 -13140 -5109 -1230 -24383 7975 10133 -26165 5612 20933
169 20933 1807 4179 -7726 1573 5198 -29151 -2532 15225 -17524 16401 28046 -20229 -9131
182 -9131 3722 -17142 -22902 -20772 8898 12168 -16338 15732 14502 -29768 7562 18817 -18670
195 -18670 10487 29400 11143 6805 -834 11008 1834 -28194 1815 3805 -26583 12553 19961
208 19961 -13976 4180 8190 -6798 -8069 -13196 9541 10704 -11510 21124 18292 -19018 8274
221 8274 6460 -26100 -5826 1887 -3463 707 -5992 8511 188 -24587 4245 1780 -19717 17478
235 17478 18214 -3443 15489 8203 -2894 -1370 -16003 -2298 -1264 -17644 11028 10161 -9865
248i865K3643r461j6176J7368p577L928R486j5680J3862k155k4398J9252m577
261b350j7088K4062l128m162J7317j1643J874K133k1592J3806R11j6253K4154
274H041j255j3360J7638j0732o754J0531j4731P659O949j5817J8306Q19j8107
287a0813J7899o551j1550J8376o207K643J3153j4358P325n27k2526J2912m728
300d952j6875K0154l748n537J9700q255K013R101j5311J0530K453j5267J7868
313A1874n129j6497J5322j1857r409J4794j0602M931J1497j0298J4056K023j4642
326c937J4989r045j3696J7301r512l247J6040j1179L640O354j3415J1462j239
339D516j2019J6932q122r836J6726j2263n533J1127j2140N280P018p404J5952
$$ plain form
248 -9865 13778 4317 -11859 5509 -2068 1860 11346 -4334 9528 7373 -17025 2227 -2350
261 -2350 -19438 4624 1496 -2666 14651 3008 4882 7015 -14577 -771 140 -16113 8041
274 8041 6786 -6574 11064 332 -6422 4109 -10622 -2963 3986 -11831 6475 7294 -10813
287 -10813 7086 535 -11015 7361 1154 3797 16950 2592 9917 9390 -13136 -224 -4952
300 -4952 -21827 -1673 -5421 -10958 8742 487 2500 11601 -3710 6820 9273 -5994 11874
313 11874 6745 -9752 5570 -6287 -15696 -902 -11504 -6573 4924 -5374 8682 10705 -3937
326 -3937 11052 2007 -11689 5612 -3900 -7147 8893 -2286 1354 7708 -5707 5755 4516
339 4516 -7503 9429 1307 -8529 8197 -4066 -9599 1528 -10612 -5332 1686 -5718 10234
352A0234k044r412J6942j2775j0315J6733j3748n004J2248j0262M763L472p755
365f923J2596p521o133J9724j3431m577K0576j4792n778J0888j1032L054J823
378a526m453J2926q664j020J9632j7839m223J9693j7756n977J1915q179K566O02
392b303k172R934j1962L054J9401k0203M61K3294j7940m796J2481r540j875j566
406c732j493O548j2443P817J6409k3866L652K2199j9318j597J3810r117J51l94
420a374j546M811j1330R614J2764k4630N851J9175j8965J800J1985r061L058j905
434B47l687L640j0802J0090J1702k1728Q764J6578j8080L083P435p338Q853j405
448G352m659L111j2347N393P342j8832R310J2561j4899K316j620o453J4690k492
$$ plain form
352 10234 8190 -1222 15720 2945 -7370 9363 -4385 -9389 2859 -7403 -2640 832 -6923
365 -6923 5673 -1848 -7981 11743 -1688 -6265 14311 -481 -6259 4629 -6403 -3349 -1526
378 -1526 -5979 6947 -1717 -2737 16895 -944 -5167 14526 -3230 -9207 2708 -5471 -2905 -2303
392 -2303 -4475 5459 -6503 -3449 15952 -4251 -3790 19504 1564 -3232 9249 -291 -2166 -3732
406 -3732 -5225 1323 -11120 -3303 13106 -10760 -7108 15091 -4227 -5824 7986 -1131 -980 -1374
420 -1374 -2920 1891 -9439 175 12939 -11691 -5840 13335 -5630 -3830 8155 -906 2152 247
434 247 -3440 200 -10602 -512 11190 -10538 -1774 14804 -3276 -193 7242 -96 8757 7352
448 7352 2693 5804 -6543 -1150 6192 -12640 -3330 9231 -5668 -3352 -4972 -11425 3265 773
462G73k673J0582j0738P66O410j5940N876J2085m820K968j0018m098J4502j2716
476g041k374J8559j0999j070J0448j5932k035J1441M584L892j1260N145J4712
489A8070k3487k434K2116j3293Q63J7097j7925j3605N571N608j612j1343J7984
502C610J7442l0707j184K1877k0985K811K8412j2936j6119Q797O705j4670j7835
515b4782K6090J6314l3302P614K1724l2005J436L3013j3462j3409J9684R881k3440
528d644j9245K9226J1092l0422K0206K1107l8479J064K6967k2135j1834K7320
540A0223J3640k3229j7684K4485l42l2470K5588K2143l3148Q554K3882k8109j3438
553a9905K5309J2835j9510j1911K4801n600l3103K4550J5613l0775J5823K3229
$$ plain form
462 773 -1900 8682 -2056 -1290 5120 -10820 -4944 7141 2321 5289 -4729 -8827 5675 -7041
476 -7041 -9415 9144 -1855 -2925 7523 -8409 -10444 997 5581 9473 -1787 3358 18070
489 18070 -5417 -7851 14265 972 1835 18932 1007 -12598 -7027 -1419 -3031 -14374 3610
502 3610 21052 -9655 -10839 11038 -9947 -7136 21276 8340 -7779 1018 7723 -6947 -24782
515 -24782 1308 17622 -15680 -8066 13658 -18347 -16911 16102 2640 -10769 8915 18796 -4644
528 -4644 -23889 5337 16429 -13993 6213 27320 -11159 -10095 16872 -5263 -17097 10223
540 10223 23863 634 -17050 7435 7093 -25377 211 22354 -10794 -2240 21642 -6467 -19905
553 -19905 5404 18239 -1271 -13182 11619 6019 -27084 -2534 13079 -17696 -1873 21356
565B1356k9705j1959K1186P688j5828k827K7846n843k9498J9733N032k8719K1436
578a02K2434k2867n375J4478n9j5859n100K3586n70k0311J7634P85k6029J6078
592a277J4118j6743L47J0461J623j1857r676J9054K404j6944J5712Q15k2850J0441
606d372P773j1845K713Q351O622p469j4366J3419J897j6001J5543O771j3455Q455
620D036K056j0571j299J103J1831q23j5113J3633L879j9227R648P892j0650M759
634A154L241m233m609k956J5435j258j7451J6813N147k2688P857R175j0115M181
648c07O984r7p961o864J3870m707j7609K0189P538j9763Q582O926j2421O34N883
663H77L836n424m454J6496o084j9578J8818M973k0183R743P216j1975j80O160
$$ plain form
565 21356 -8349 -20308 878 8566 -7262 -10089 17757 11914 -17584 2149 7181 -21538 -102
578 -102 22332 -535 -5910 8568 8509 -7350 -12450 11136 10566 -9745 7889 8674 -17355 -1277
592 -1277 12841 -3902 -3555 6906 8529 -3328 -13004 6050 8454 -8490 7222 8037 -14813 -4372
606 -4372 3401 -8444 -5731 2620 9242 1773 -12593 826 2723 -13278 2265 9036 -4419 4036
620 4036 6092 -4479 -5778 -4675 7156 6333 -8780 4853 8732 -10495 -847 7045 -3605 1154
634 1154 4395 162 -4447 -7403 8032 6774 -10677 6136 11283 -11405 -3548 5627 -4488 -307
648 -307 6677 6580 -1381 -8245 5625 918 -16691 3498 11036 -8727 -145 6781 -5640 -5006 877
663 877 4713 -711 -5165 11331 5247 -14331 4487 9460 -10723 -980 6236 -5739 -5919 241
677B41M582o915m265J6762q113j8123K0199L056j8039J2961O677j1375O61L703
691B012J472p097l072J6838o224j3422J8178j988j7015J0966K921q218L711K713
705A775L059m843m630J3344o356j1975J5724k389j2978J0751Q09o163K902o90
719a660K957m352m776J2931m651q548J5193l611j0016R873k680m556L991k330
733b235M419j278m225J0850m689p920J1244n186n606R253l818j048L419n886M446
748A740j328o465R816l253o216J0638l842l565P011n625K02J920o122O276p89
763C98n612R519l834n496Q834n199k117O677n811K578L095o227O424r91o461P557
779C334l863l480Q243m890L85N208p651L440J484p757P097j063o001Q343l121
$$ plain form
677 241 4823 -2092 -6357 10405 2292 -15831 4368 7424 -10615 2346 9023 -2352 -1691 2012
691 2012 3484 -3613 -6685 10153 3929 -9493 8685 6697 -10318 648 3569 -4649 -938 1775
705 1775 4834 -9 -4639 8705 2349 -9626 6098 3709 -9269 1482 2291 -3872 -970 -1660
719 -1660 1297 -3055 -7831 5100 449 -8099 7094 3483 -6533 3340 660 -3896 95 -2235
733 -2235 2184 906 -3319 7531 2842 -5078 6166 980 -4626 4627 809 -239 3180 -2706 1740
748 1740 412 -6053 3763 510 -5706 4932 1090 -2475 4536 -1089 -887 1033 -5089 1187 398
763 398 -5214 4305 471 -5025 3809 -1390 -3507 3170 -2641 -63 3032 -3195 3229 2238 -4223 3334
779 3334 -529 -4009 4234 -656 -271 4937 -2714 726 2210 -5547 1550 487 -5514 2829 -292
794b92k612P007n747Q42L801p068N698J592o364P622k225o067P385m579k105O317
810C205n964K538L520o846O179J34p373P428k622m752P962l773r09N188o615K568
826a32J859o700O811q22o184Q639l005m552P678m942j399M782n429L409K023m684
842b648P026k747n177Q647m900l387Q247n897n58N468n834K490P75m729N874m234
858a584l137R474o052j685Q487p825l12N840o157K346J262l016N442m876j182
873b975Q401q189l79Q134q638J473P109o531J846J289k454L985n346O58P488q766
889b895J787P228r866K836O336q142J450J545k040L710m719J621N726q924K876
904a471N417j0242N264N958q334K745J798k388L664m765J297N218p461M186L554
$$ plain form
794 -292 -2904 4103 -1644 -802 2999 -4069 1629 3221 -3143 4479 2254 -3813 3572 -1007 -3112 3205
810 3205 -2759 -221 3299 -3547 2632 2766 -4607 2821 199 -4553 3409 -364 -1273 3915 -2700 -132
826 -132 1727 -4973 1838 1016 -5168 3471 466 -4086 3592 -1350 -2749 2033 -3396 13 2036 -2648
842 -2648 4378 1631 -3546 5101 201 -3186 5061 -836 -1394 4074 -1760 730 1505 -3224 2650 -1584
858 -1584 -4721 4753 -1299 -2984 5503 -2322 -2634 3206 -2951 -605 657 -2359 3083 -1793 -2975
873 -2975 5426 -2763 -3142 4992 -3646 -2173 4936 -1595 251 1540 -914 3071 -2275 -1617 5871 -2895
889 -2895 -1108 6120 -3746 -910 5426 -2716 -1266 279 -1761 1949 -2770 -1149 4577 -4347 -1471
904 -1471 3946 -6296 -1032 4926 -3408 -663 1135 -1253 2411 -2354 -1057 4161 -3300 886 4440
919D440r398O612L343q767M614M44k475M810n359K20N279o046L929J713p754O319
935A924L82p154O409j503j557O485p132j451N938m767K134J578m721N982k425
950A22m427O266n178K80R360q753j790Q638m853o74J789j669M399l718n17N162
966D437r834K987J1128j2136q36J1915o545m069K823J93J473l076M406L293j3646
981g487N736J0883j6452J432J5417p850n315M415l75k495k433Q079J188j4288
995i545J0034R100k0251K871J6493r188l904P961p68n719j979R230j489j2691
1009i845J4924P360k2762M144J4735j1891j642J0944p12o518j085P980n635j1644
1023a1647J8363O314k1697P203J1423j5644q01J0937j217m310J540O521r052j1579
$$ plain form
919 4440 -4958 1654 4997 -3770 844 1288 -1187 3623 -1736 -1516 3763 -2283 1646 3359 -4395 1924
935 1924 2306 -4848 1561 58 -1499 4986 -2146 -3597 2341 -2426 -292 1286 -3435 2547 122
950 122 -4305 1961 -3217 -2937 6423 -2330 -4120 4518 -335 -1009 780 -889 3510 -208 -725 4437
966 4437 -5397 -2410 8718 -3418 -4254 7661 1116 -2953 -130 63 1536 -1540 2866 6159 -7487
981 -7487 -1751 9132 -7320 -5888 9529 1679 -3636 779 404 -2091 -4524 3555 4743 -9545
995 -9545 489 9589 -10662 -7791 8702 -486 -4390 3571 2803 -2916 -4895 4335 2846 -9845
1009 -9845 5079 12439 -10323 -6179 8556 -3335 -4977 5967 5255 -1263 -2348 5632 -3 -11647
1023 -11647 6716 13030 -8667 -1464 9959 -5685 -6486 4451 3234 -1076 464 6985 -2067 -13646
1037a3646J7539L617j8364J1116R299j5626k27P530k921j579M253P749p668j0781
1051i709J3817j49j5925J2895R050j1840J599K279n241j107K895Q484l318q220
1065d490J1213k472j5267R972O790o835M240P46m208j840k376O658o17o193J1474
1080F795n03j4398N125L270m525M466J175R52n74o459N275m52p928J1897L844
1095G960j0916L287J066m544Q47p24O261J303p553O262j224j1807R940O067q253
1110b028L187K697k921l191l091P985M13q094J0464K78j4327P989N240r507K475
1125b431N774J3m547l632P939k878q601J3521J409j3777Q995M414j1375J449O286
1140B559R75m322j974Q767n501r757J3693L49j2981J0838M343j1116P56N020M64
$$ plain form
1037 -13646 3893 7510 -10854 262 9561 -6065 -6292 1238 -1683 -3262 991 8740 1072 -9709
1051 -9709 4108 3959 -11966 929 9979 -1861 -262 2017 -3224 -4331 -1436 7048 3730 -4490
1065 -4490 6723 4251 -11016 -1044 5746 -1089 3151 3897 -311 -2151 -4527 2131 1514 -4679 6795
1080 6795 6292 -8106 -2981 289 -4236 230 1405 2357 1783 -4676 599 147 -7781 4116 7960
1095 7960 -2956 331 1397 -3147 -2300 -3024 3237 4540 -3013 3249 2025 -9782 158 6225 -2028
1110 -2028 1159 3856 935 -2256 -5347 2638 3051 -5043 5421 5699 -8628 -639 4601 -4906 -2431
1125 -2431 3343 3356 -1191 -4823 3116 238 -8363 5158 6567 -7210 1785 6199 -5176 -3727 2559
1140 2559 3534 -788 -2762 6005 504 -9253 4440 4789 -8192 2646 6989 -4127 -3371 1649 2113
1155B113m347o64R837n763r263J3421j678j2584J0824L620r691K168L900l60m756
1170c223r70R637n443o907J3386l200j1326J0165J763p675L286K793l0m050j490
1185c284Q325n110n768J2198l310r020R049j64o411K969J374J074l071j698P905
1200E058n250n407J0878l412p152Q673j330m804K350m18J489k342j812P682m584
1215c81m778R361l880n112P883j875k732K113k024K335j868k449P455l966m253
1230d171Q512l714l676O518k583j328J806k575L222k026l196P025m008l539P836
1245D103l610k772N190l115j33J301k712L608k255l295O278l774k589O986l781
1260e70j474M485l714J118J122l249M196k242l221N931l593k110O287l767k32
$$ plain form
1155 2113 -2234 -2898 6939 1176 -8087 5334 3656 -8928 1896 5516 -4175 -2007 1893 1533 -3223
1170 -3223 -4193 5444 1 -6906 6480 3280 -8046 2119 3882 -3793 -507 2286 2256 -1794 -3284
1185 -3284 5041 -69 -5837 6361 3051 -5969 3080 2916 -3495 -526 848 1922 -1149 -2847 5058
1200 5058 -192 -5599 5279 1867 -5285 3388 2058 -2746 -396 -814 675 -1667 -3479 4203 -381
1215 -381 -5159 4202 322 -4790 3093 1218 -1514 599 -1425 910 -958 -3407 4048 82 -4171
1230 -4171 4341 627 -3049 3469 886 -442 1364 -1211 2011 -15 -3211 3814 -194 -3733 4103
1245 4103 493 -2279 2911 -204 -337 964 -1748 1860 -395 -3690 2588 -1186 -3775 3211 -570
1260 -570 -2044 2441 -1273 -155 967 -2282 1914 -328 -3549 2382 -1211 -3321 2966 -801 -1033
1275a033L718m114K474O43l670M793k353l204N659l464j536N035m154O98K775
1290B267l991L442l3l916M878k565k766N399l656j129M288m143J361K137l866
1305b293L916o78l776N064k786k233N403l782r41L908l932J875J574l467M221
1320B073j309k851N446l538j466N086m591l60L778m305J955J458l466L670j741
1335a61k018M974m025m11N073n353P31L840m676K361J026l235L208j551r53M107
1351B937m432O36M181n938J723L485m949K704J115l416L337j401m99L086m446
1366a877J656L472o157K901K912n657L187O96l802L043q41l99K340m192K606K615
1382B503n839M014J756n590M390L72l948L834q16j008J664l599K717J271m817
$$ plain form
1275 -1033 2685 -1429 1045 1688 -1982 2811 458 -2746 2913 -551 -2087 2948 -1206 -508 2267
1290 2267 -1724 1718 1685 -2231 2647 82 -2684 2715 -941 -2070 2218 -1925 -564 1573 -2293
1305 -2293 1623 945 -2831 2233 -553 -2786 2617 -1165 -2106 1802 -2130 -255 1319 -2148 2073
1320 2073 764 -2087 3359 -179 -1645 3441 -1150 -1510 2268 -2037 -82 1376 -2090 1580 -161
1335 -161 -2179 2795 -1230 -1641 3432 -1921 -1190 2650 -2026 335 1361 -1874 1334 -217 -1170 2937
1351 2937 -1495 -859 3322 -2616 -893 2592 -2357 347 1462 -1954 1383 -18 -517 2569 -1877
1366 -1877 -221 3251 -2906 -5 2907 -2750 437 1133 -2669 374 -467 -866 1474 -2718 -112 2503
1382 2503 -3336 678 2434 -3156 1234 1606 -2342 1492 676 -332 1332 -2267 450 1721 -3096
1397c096M456L24m771N332p98l905M476j398j357K144k733K273R23m010L781j377
1413B64l470N822k422l168N574k664j674K877k839J480R22k557K978k188j202
1428b267N821m108j710O278m274j548M120l501J43J983j477J206k536N48M378
1443C056o187N19O969n594P9N659n105j131K862j181j18j699L047K578p462K337
1459a371N848p607J952O668o461r93M205j940j846n24M468R28p571M549L986r333
1475e042L893O854p628L89N179l559l515j70M587l29n652P182K386j0424M772
1490a077N226q694K750P071l397l510M92L037k454m513Q376J254r091O475K928
1505D873r911L786O387l784j773J209J729l752m296P815M55o994P908J233r977
$$ plain form
1397 -3096 1360 1684 -3087 2245 1447 -2458 2018 620 -737 1407 -1326 947 1870 -2140 1641 264
1413 264 -3206 2616 194 -2974 2600 -64 -1738 1139 -1700 -220 702 -1855 1123 -1065 -2267
1428 -2267 3554 -554 -2264 4014 -260 -1808 2312 -1189 -1046 937 -540 666 -1870 -1322 3056
1443 3056 -3131 -2612 4357 -1237 -1158 4501 -604 -1735 1127 -54 -172 -1871 1176 3754 -3708 -1371
1459 -1371 4477 -3130 -1178 5490 -971 -1964 2241 301 -1545 -2069 2399 3327 -4244 305 4291 -5042
1475 -5042 -1149 5705 -1923 -1534 3645 86 -3429 -3599 988 659 -4993 2189 4575 -5849 -1077
1490 -1077 4149 -4545 -1795 5276 1879 -1631 -1139 1898 -556 -5069 3307 4561 -4530 1945 4873
1505 4873 -5038 -1252 5135 1351 -422 787 2516 -1236 -5532 2283 2738 -4256 3652 4885 -5092
1520e092L271M003l919M27K197K278l043m668N243j633n714Q639J801p038M140
1535H92J405m448K64J382L257r96l521M433k142n651O999Q96m892M308K49l383
1551i48k9j072L055N23l193M517j112n606M192o7l124M160O00m79J09l693K496
1568C29k2m613N018J662m662L179k21l036J579l19K408N82l980M472R5o439M790
1585H22K082m712K508Q65k529k61p07L656o97m156O109l29p719N119K358n647
1601c238K860K736j260j480p25L327k831m635P926J33p108O156J594o616J733
1616a428K627r25j503N52M512l650m442P893j286p230O707J439o315K286K601
1631A838j199j718M72M381m134m192P601k041o400P325J079n651K680J573j555
$$ plain form
1520 -5092 -1821 2182 -1737 -1310 887 3165 122 -4546 697 -936 -6650 1989 3790 -3248 892
1535 892 2297 -2151 -1887 -505 2752 1756 -1765 2668 526 -5125 1874 2770 -2122 2186 2435 -948
1551 -948 -977 -2049 1006 1529 -1664 2853 1741 -3865 327 260 -2864 1296 1896 1417 1526 -2167 329
1568 329 307 -4306 712 2374 -2288 891 670 -2366 -787 -1106 1302 1884 -2096 2376 2471 -3968 822
1585 822 2904 -1808 700 1565 -964 -1225 -1932 1724 1027 -3129 2980 2651 -5068 51 2409 -3238
1601 -3238 -378 2358 1098 -382 -1107 2220 -611 -5246 2680 2813 -4295 1861 3455 -3161 -1428
1616 -1428 1199 274 -1229 -677 3835 185 -4257 3636 2350 -4880 1827 3266 -3049 -763 1838
1631 1838 639 -1079 -607 3774 -360 -4552 3049 1008 -5392 1933 3012 -2639 41 1614 59
1646E9k216M38M657l492k686P871l203o309O155k80m580L272J864q43j723J12
1662i04M145l881k556P005k955m997O345m11l922K770O97m96j590l31L964l392
1678e09k249O671k637l987N366j521l463J929l2N65p72k54M167l630k820N590
1694B414l171l180N036p91j992J940o41P42j380r29M353k971k076N660k804k488
1710b278M437j638j499J080r43J600j319p49M637k808j805N180k954k191L247
1725A997j971n11J189q99J931k164j829L724k952j688N101k338j117L275k147
1740c99oM17j415K238j637j440M169k807j306M173k732q73K418k087R81M82j066
1757h90L046j652j298L725k815j371L628k635j56K259j950J176l76k015K650k319
$$ plain form
1646 59 -2157 -1719 2938 -554 -3240 4631 1428 -4881 1274 994 -3586 -314 1550 707 -1016 -904
1662 -904 3241 -640 -3196 3809 854 -4143 2202 1791 -2131 639 1336 840 -750 -1081 2883 -509
1678 -509 -2758 3913 1276 -2711 2655 1134 -2329 -400 -432 133 -639 -893 3274 -356 -3176 2414
1694 2414 -757 -3937 1099 308 -1684 256 -385 357 -1023 -1952 2401 -570 -2646 3014 210 -2278
1710 -2278 2159 521 -978 102 -841 759 -560 -1309 3328 520 -1285 3895 941 -1250 1997
1725 1997 26 -485 704 -195 1736 -428 -2257 1467 -1485 -3173 1928 -410 -1527 1748 -399
1740 -399 -405 12 -1403 835 -802 -2242 1927 -880 -2186 1987 -745 -1618 800 -1287 -306 176 -890
1757 -890 2156 504 -794 2931 116 -1255 2373 -262 -418 1841 -109 1067 691 -1324 1326 -993
1773i93j365M327k548o45L209k663N2J541k042J708p63j360L129k298p51L628
1789B166l147q04K846k745P60J593j547J925r10j150K932k525p03L362l005R8
1805h54K949k768P29Q68k032J656r53p20K965k529K90L056l619M98K396l327J080
1822c15J104k030J649o26m46K324k686M98K334l712J740K278l687K096R65k788
1838a302J593o95o11J886k237J173J816l405K506J245l953K460M07k620K289j49
1854D03p35J380j968J182O24l060L185M09l665L406K84k992K500o43j381J401
1870C30j531J266N55k159L393q11l179L891r13k803L543j204j517J917j103O43
1886C18j83j622K873j721k060M455j822j965L913k184j477K609j461K23N03r14
$$ plain form
1773 -993 -2358 1969 -579 -1224 1985 -678 -626 915 -1127 581 -182 -1542 1587 -711 -1462 2166
1789 2166 -981 -1785 1061 -1684 -924 669 -878 1047 137 -1013 1919 -606 -1309 2053 -952 -854
1805 -854 2095 -673 56 924 -1108 548 -405 -1125 1840 -689 -399 2657 -962 -464 1932 -1395 -315
1822 -315 789 -1241 408 -218 -664 1660 -1026 -528 1806 -1906 -166 2112 -1575 521 1486 -1302
1838 -1302 291 -404 -1015 871 -1366 -193 1623 -1782 724 1969 -1984 476 883 -1737 552 403
1854 403 -332 1048 -920 262 886 -2174 1011 1420 -2245 1161 1445 -1547 953 310 -1071 330
1870 330 -1201 65 620 -1539 1854 1043 -2136 1755 842 -1961 1582 378 -1139 778 -325 318
1886 318 135 -1487 1386 -335 -2395 2060 238 -1727 2186 2 -1475 1134 -327 -104 399 -515
1902e15K030j810j020L757l151j030L878l364o85L270k069j37R97o13J483j768
1918g47K92K944l463L41L719m149K6L477l493l57J416r81P55q07R89J548l534
1935b024J722L052m768J928L589m278K46K194k093K79l63R57M22l521K875J545
1951A762n259L151L102m952J754K523k595K85M15R03k60k448L419K46n385L675
1967C36J669n189K762K182k911N37O67K88n25j191L815o73m442M269L30n300L505
1984A29J746l393J434N27m86n34j070L181p50l248M818n62m589L851N3l033K168
2001B42K85m05k24j080K476j148k553M513r07l382L658q42k486K372k57Q0L25
2018F67j483J890j186k195L827q32k128L222j679j681J936j728R76J284j644K192
$$ plain form
1902 -515 1515 -295 -1315 2442 -709 -1739 2139 -1225 -1910 1360 -709 -846 151 -462 1021 -747
1918 -747 -455 2489 -974 -633 3086 -1063 -1037 2440 -1053 -1410 6 -975 -220 -1027 -38 1510 -2024
1935 -2024 -302 2750 -2018 -90 3499 -779 -533 1661 -432 -153 -516 441 863 -2658 217 1762
1951 1762 -3497 -346 2756 -2196 -442 2081 -514 -229 186 1089 829 -1619 1800 2046 -3339 336
1967 336 2005 -3184 -422 1760 -1151 -614 53 341 -184 -1375 2440 1767 -2675 1594 1924 -3376 129
1984 129 1875 -1518 -84 443 -43 -577 -1647 1534 784 -2464 2354 1792 -2797 1054 1107 -1926 242
2001 242 527 122 -102 -1182 1294 146 -2407 2106 1199 -2183 1475 633 -1853 519 262 342 667
2018 667 -816 1074 -112 -2307 1520 688 -1440 1782 103 -1578 358 -1370 -394 890 -754 1438
2034A438l28k652K754q46j808K677j626j67J591k559J350P39k681K817M62k499
2050a338K494m42j339J785j282J012N37l154K153J24l488L478R89k814K271m1
2066I45j641P11j201J793K30k564L363l77m203L575L29l311K626P06r12L02n86
2083b15J665j252k734L930q68l851M362q6l614K683R24q76K51l38J744j623k146
2100b044M552j357l486M325p84l994K644P9j035M96M13K161j637j801M067k300
2116B99l261M947r35k730K931j1j578n6m47J757j692j192M408k398k831M422j476
2133A57k441L127m25r08J51n65K282j485r89M259k758k834L937k058k060K795
2149A85k87J24J74n96J903k175j295M221j937j206M203j951k287J752j441j23
$$ plain form
2034 1438 1110 -1542 1212 366 -1442 1235 -391 -558 1033 -1526 -176 563 -2118 699 1161 -1338
2050 -1338 1156 714 -625 1160 -122 890 1427 -1727 426 550 -2938 540 1529 -1285 986 945
2066 945 -696 15 -1186 607 837 -1727 1636 1259 -2944 631 960 -2351 275 981 69 371 -215
2083 -215 1450 198 -2536 1394 526 -3325 1037 951 -2663 20 944 68 319 -19 1725 102 -2044
2100 -2044 2508 1151 -2335 1990 1206 -2788 -144 -65 -1100 -604 -191 1970 333 -1468 2599 299
2116 299 -2962 1985 1050 -1680 1251 1240 -338 -394 -841 916 -776 -1968 2440 42 -2789 1633 157
2133 157 -2284 843 418 -490 -339 -904 1378 -107 -1096 3163 405 -2429 1508 -550 -2610 185
2149 185 -102 22 196 -400 1503 -672 -1967 2254 317 -889 3314 1363 -924 828 -613 -736
2165g36J36l84K451j852j253L740k311j292L751j845j170J469j315N70l55o57
2181a053K624k349j511L046k204q93L735j257l5J498j577L52r43j019K847j734
2197d73n21L576k537j180K519k006j46J380q77J551r39j090K616k161p89L240
2213B163k525q44K391j898O16R55j210J522j710j380K431k182l50L570j870k33
2229e54J870k009M80J74j020K235j052q31K899k436r57K618k547j53J798j518
2245a003J319K38r68K290j673r01K667k609n15K627k149O26J453j774J006p50
2261a16j393K113j673l5L217k371l70K079k509K08J182j374J349k53n40K161k043
2278c68k02K336l058K48K208k244R51J135j619J220p40p40J695k023K85K592k597
$$ plain form
2165 -736 -600 -984 1467 -385 -1638 2102 -209 -1501 2250 405 -765 704 -611 -41 -396 -1053
2181 -1053 1571 -778 -2289 757 -1447 -2340 1395 138 103 1601 24 376 -567 -1586 1261 -473
2197 -473 -994 2582 45 -1135 1384 -622 -768 612 -265 1286 347 -743 1873 -288 -1077 2163
2213 2163 -362 -1206 1185 -713 -97 858 -352 1170 -540 -1920 511 -1671 -2021 1549 -321 -554
2229 -554 1316 -693 -213 -39 -1059 1176 124 -707 2192 -244 -1201 1417 -1130 -1283 515 -1003
2245 -1003 316 554 -414 1876 203 -698 1969 -640 -1155 1472 -677 -51 1402 -372 634 -116
2261 -116 -1509 604 -1069 -1104 2113 -258 -628 1451 -1058 -850 332 -1042 307 54 -486 1675 -368
2278 -368 -570 1766 -1292 -1044 1164 -1080 -129 1006 -613 607 -133 -873 822 -1201 -916 1676 -921
2295i21J133K123k812R04M54k104J477l27m91K021j973M21J325l030J257J519
2311I76k665J810Q30j561J607m13o04J080j973N00J024k405K085J064k850K036
2327E41Jk273J935m04n43J728j236R35Q33k354J838j91k808K457j32j668K635
2344A294o90j070J312j374M54K64j490K226m50j827K917j140k069K621j470r76
2360a468J844r18N62P07j284J570j254j530K779j506r76L247j598o79K192j615
2376G3M1L74j205J381j020n17K720k131p33K621k622k57K427j710O11R32q91J119
2394A213j154n42J569k698O6K429k738P02K551k369N11R52j118Q52l32L39J432
2411A665k285R50J762l441R90J633l067J207J411j552J347j45l1N24k160J336
$$ plain form
2295 -921 212 2335 -477 427 881 -1223 254 -73 -564 1457 -516 -95 1230 -1800 -543 976
2311 976 -1689 121 951 -610 997 584 -20 1060 -913 -413 611 -1794 291 1355 -1495 541
2327 541 542 -1731 204 -200 -743 985 -251 684 1517 -837 1001 810 -1998 459 327 -1341 1294
2344 1294 604 -466 846 -528 -74 190 -1300 926 476 -1351 1566 426 -1643 978 -492 -1468
2360 -1468 376 -542 20 727 -557 1013 -241 -1771 1008 -498 -1474 1773 175 -504 1688 73
2376 73 114 488 -717 664 -356 -873 1847 -284 -1017 1604 -1018 -1275 1152 -558 53 985 94 1213
2394 1213 59 -483 1086 -1612 -1546 883 -1855 -1153 1398 -971 -460 492 -626 226 -106 233 1665
2411 1665 -620 330 2092 -1349 -359 1274 -1793 -586 825 -727 620 475 444 968 -1192 144
2427A44J035k922K231J350l194J682Q73k193R17j0j65L18r42J661K27k694K120
2444D38K74l238K524O97k090J814J90n03N71r59J326k40k382K509k54k594K983
2461A066n5k402J720l13p81P27n32J664m09j505K494j250k358K763q89j743K381
2478E78l22o09R33q10Q06n06j171K443j249j277K691j644j311K491j256l28J157
2495F16j199P54m5o29K120j123j106K198k208p91J946j499L13J564j527Q46O8
2512B98j346J630r29k38K009j691N8J429k181M77R54j804J451M72j167J361p18
2529F5l04J280j483O45R55k191J002O90k232J873M05j567J518o26o35Q52r44R76
2547B79P95j973J882j88k640J968J06j703J806K5n49Q11j173P81k62j674K497
$$ plain form
2427 144 1179 -1743 488 1838 -1356 326 1199 -994 -77 -87 -252 66 -876 785 1012 -1682 438
2444 438 712 -2526 -2 695 -1395 419 609 106 677 -282 1044 804 -1578 931 677 -1917 1066
2461 1066 1011 -1391 329 16 -765 -38 -570 1094 685 -820 1674 424 -1934 829 -60 -1803 578
2478 578 256 -353 580 -230 576 70 -1101 1342 93 -1184 1507 -137 -1448 1043 -213 -541 616
2495 616 -583 171 126 -503 1617 494 -612 1586 -622 -1413 533 -966 -653 911 -616 230 298
2512 298 -1048 582 -347 -585 1424 -267 -209 1220 -961 -484 470 -1334 117 589 -578 783 65
2529 65 -239 1041 -442 203 1158 -1033 -31 659 -1573 300 705 -862 656 30 -605 247 -697 279
2547 279 1074 -899 983 795 -1845 123 229 -1474 332 357 -192 619 -554 227 -35 -1709 788
2564G88q1k108K535l86k192J838j32n64R66p01P39n09j489K163o28j743K792r25
2582C63j929K079n37o11J046l87J108n98j179J891j408j464K828p74j381K044
2598A091j091j007O07m39R60Jo10K046j498j500K423j269p95K416r58n70M35j101
2616h59R17l61n19K230j562j035K303j670o57K222q72J78N12j052P93q94p00K195
2634A169j130n20K088j727q29J341j169N15Q75p88J114j099r76J926j279k75K096
2651A332j418m56J154j379N08N71o92J482j106r58J789j519k35K098j512K74Q25
2668G58j473O34N7p82J777q06o25J823j689m88J712j485M69Q12j035P20l92q56
2686h69J564q25n68J978j467l87J235j505N99O70r73J203o26j050J708r22m26
$$ plain form
2564 788 707 -1401 1134 748 -1444 394 262 -302 664 -37 702 193 -1296 867 239 -1504 1288 363
2582 363 -1566 513 -24 -635 411 24 1132 534 -645 1246 -162 -1626 1202 428 -953 1091
2598 1091 0 -1007 -400 -839 121 122 -488 1558 60 -1440 983 -286 -1081 1335 377 -193 242 -859
2616 -859 58 -303 -822 1408 -154 -1189 1114 -556 -1213 1009 137 315 827 -225 568 -326 -1026 1169
2634 1169 39 -481 1607 -120 -949 392 -777 -262 613 -175 939 -160 -1136 790 -489 -764 1332
2651 1332 -86 -542 612 -767 -259 312 -380 1102 -4 -962 827 -692 -927 1171 -341 -67 758
2668 758 -715 -81 -24 -806 971 165 -460 1363 -326 -814 898 -587 -118 694 -341 379 -13 -869
2686 -869 695 -130 -698 1280 -187 -574 661 -844 -245 425 -548 655 29 -1021 687 -235 -661
2703f61K014j601p1J051j614P63K78j056J496p31p32J830j499j69J785j478J70
2720b25J169j425P62l8j008J460q41m92J772j656p1J532j506J86J290j196O09
2737C22k41q03J337j186j78J947j747%J585j661M62R74r83Q06n20p72J285j287
2755f60J26J450j866L22J433j728N78J012j178Q32m2m33J070j207P0J079j887
2772a029P37J289j936R51P12j490J071k25m69J156j149L32P98j790J176Q29j962
2789i99J206L77j412J278j82n44R68j081L91M76j548J115M76j747J540O8j417
2806a035J591l97o59J115r56K49P20j243J225k55j600J724m35j160J843o75n40
2823d88J168r30K81N01j025J144m48j150J880q47r82J838j054p74J574q27P8M80
$$ plain form
2703 -661 1353 -248 -319 732 -882 -119 159 -897 599 -132 -864 966 -533 -702 1083 -395 -225
2720 -225 944 -481 281 243 -765 695 -146 -638 1134 -522 -593 939 -567 -381 909 -287 322
2737 322 81 -722 615 -571 -749 1198 -549 -549 1036 -625 -163 811 -172 634 114 -658 627 -660
2755 -660 -534 916 -950 -628 805 -923 -345 667 -511 321 279 -154 916 -291 -221 858 -1029
2772 -1029 -292 997 -939 12 724 -766 305 80 -389 767 -382 -50 748 -1042 134 963 -999
2789 -999 207 584 -828 450 268 -276 692 -389 2 478 -1070 45 521 -1226 314 382 -1035
2806 -1035 556 159 -500 615 -341 -92 628 -615 610 355 -1245 479 44 -1116 727 52 -488
2823 -488 680 -250 31 532 -493 651 203 -947 933 86 -896 942 -112 -886 688 -139 -61 419
2841D19p78P81m55o31J584j252o17J899j451k20J532j157K14O23q30P58n16k49
2859c46J313j460j36J808j935J80J542j508K36P89q69O71l04j62J154j569L36
2876b60J277j938O68J403j865N59P95r41N00q9k92P72j238M77R76j921J133R73
2894I89k060R60Q07j292Q17L7l66O47r87P35N28j863J390M20j976J413M39j512
2912h74J078K0n28N52q21P50K13j307J498Jj695J892j22j557J415k80p67P59l65
2931a38N28l2j146J391m89j331K040n35j277J754o87o64J008n37L73L0r89J590
2949H89p70j048J873r79j058J850r37m98J146o98J40J73n58J099n98o29J672j298
2967b29n38J802j359l4J334j258J08L86n69Q04o06k70J377j591j0J512j596L79
$$ plain form
2841 419 -359 422 -33 -664 920 -332 -949 950 -501 -721 811 -346 -132 491 -339 419 -97 -346
2859 -346 967 -493 -629 1179 -756 -576 966 -542 -306 483 -386 285 -19 -181 973 -596 -260
2876 -260 1017 -921 -253 1150 -715 -156 639 -302 198 109 -183 589 -649 -172 804 -1117 16 989
2894 989 -1071 -111 696 -596 221 258 -108 539 -448 287 815 -1048 342 762 -1214 199 638 -874
2912 -874 204 224 -304 248 -573 177 390 -917 581 582 -1113 779 657 -900 515 235 -532 227 -138
2931 -138 390 358 -788 603 114 -1217 823 288 -989 765 78 -586 422 -115 258 288 -701 889
2949 889 119 -929 944 -35 -1093 757 -180 -678 468 -230 -90 83 -475 624 26 -603 1069 -229
2967 -229 -767 1035 -324 -358 976 -282 -174 212 -357 447 -159 -429 948 -643 -653 859 -737 -358
2985c58J193j359N02M96q66Q22o89o4J094j290L69J207j770O32Q85j629P72N53
3003E00r05O47m61j61R28j242P62Q36j761J021M32j604J109L71r59R69m44l48
3021c10O76j146O69N49j363J230L50j543J234N8j171J212l27j43O90j017N46K30
3039D24j339J465O4j427J471m15j158J348n76q2P70r77N19J73j220J361j41j032
3057g72J742o23j075J297q22k38R13q10N08K33j164J267m80j003J858q23n63J443
3075H88r99j78P81r31P27J15p74J050o12q85J527j037l09J574j267J25O86j246
3093g65P05K38p17J200o40o21J386j271n0J320j122L05P52j234O69O9q81J152
3111D95o24k59J279j318j0J094j380P24N85j093R93k73r21J172p17j67J362j243
$$ plain form
2985 -358 835 -524 -22 474 -392 430 -259 -323 771 -519 -150 1057 -713 -81 804 -825 -53 500
3003 500 -405 242 -219 -380 548 -694 68 904 -857 164 596 -1008 101 472 -487 482 38 -310
3021 -310 366 -780 -111 438 -925 305 655 -888 346 404 -767 445 118 -25 665 -352 194 424
3039 424 -915 550 614 -813 658 243 -915 433 -143 -225 545 -432 87 260 -960 401 260 -772
3057 -772 970 347 -728 569 -253 -491 422 -388 120 353 -811 456 -24 -1027 831 8 -555 888
3075 888 -111 -289 492 -439 288 403 -371 679 67 -818 709 -328 -637 937 -330 -205 481 -765
3093 -765 -60 178 -539 661 21 -600 786 -485 -535 785 -337 -32 720 -514 155 224 -657 495
3111 495 -129 -388 891 -427 -437 657 -723 1 586 -507 486 213 -708 464 -253 -420 942 -301
3129c01R4O85j390P71N20j067J176k56q59J123p48l18J092j108O85P39j435Q70
3147B73J25j178J306k36o33J061q56j85O74j140O97O22j245J221j72j275J106
3164A65l54l49J275q15M0M04j169P26L98j087J314j08j104J176p71l66J195p82
3182b12L23N00j220Q17J41j193J529k80q97J325q60n21J097j004M58O88j153Q37
3200C75q2j109J170m57m79J392j052j38Q61j213M53O82q76R01r2j037J297o95
3218i9m35J397j000n2R61j353N35N23r69R44k36p08J084q80j86J259j123L56P50
3237G68j439P00M71j206J011m5p60J137r50k20J125j337O73O98j365R74J37j098
3255g26J006j59m64R65p95m9P23j144Q27L60j317J122Q9j317J248k75n47R73p04
$$ plain form
3129 -301 -207 478 -912 -141 379 -688 488 232 -627 496 -252 -570 522 -586 99 838 -597 273
3147 273 398 -780 526 290 -343 718 -138 -323 351 -789 -92 530 -715 506 334 -941 165
3164 165 -189 -538 737 -78 -38 366 -803 -77 321 -766 548 440 -664 512 -259 -625 570 -212
3182 -212 111 611 -609 208 349 -844 685 405 -492 833 -27 -548 549 -455 3 691 -462 375
3200 375 293 -816 354 -103 -582 810 -242 -380 481 -732 -279 403 -473 428 336 -701 596 -99
3218 -99 -534 863 -137 -189 772 -581 -46 477 -492 452 216 -492 592 -288 -474 785 -338 18 768
3237 768 -671 29 500 -706 305 260 -500 637 -313 -533 592 -745 -72 626 -739 235 372 -726
3255 -726 280 121 -343 622 -173 -222 501 -643 184 544 -773 349 438 -879 369 94 -453 520 -184
3274a84R0M37r97Q34J86j128J199j39r55J152m20n78J001o08J6M30q27P60j55
3293A14q88J443n87q46J520p23o43J183p49JN44o87P01l79p66J516q57n90J604
3312I11j124n35J394j023J81M91o75O59k63m56J136q70k97J454j356o8J336j180
3330b85J19N43p58O01l20k39R77j144J06J224j406K06J216j401M60N94r36N99
3348A56j32k29P28q61P4R75j389M69J098j568N92N30r58O04o0k67M98n19K64O46
3368F51j331Q05N93j491Q70M48j123Q73j10n65O95q85O09M18j176R76K60j523
3386a006J411qj203J248k48n01P93o61L45L01j068J009j65j107J400l37r24J164
3404D43m96m57Q79n87K73K75p86Q96l12q13J501p60o88J335o25n06Q56o68J67
$$ plain form
3274 -184 -94 343 -654 180 366 -762 437 298 -657 495 75 -503 498 -110 -94 336 -491 269 114
3293 114 -774 669 82 -764 756 33 -610 573 -176 -175 369 -318 383 4 -762 754 -103 -693 911
3312 911 -213 -748 646 -377 -196 295 -380 279 16 -440 696 -174 -471 983 -373 -441 895 -285
3330 -285 -166 377 -381 220 -100 -339 638 -506 -400 824 -582 -376 840 -561 -101 493 -443 156
3348 156 24 -205 523 -338 -264 711 -678 -209 889 -679 -87 443 -515 89 29 -238 260 -259 5 651
3368 651 -680 125 718 -773 97 545 -578 295 185 -380 315 -570 39 457 -719 257 517 -1006
3386 -1006 405 397 -806 442 194 -307 486 -175 170 471 -597 412 247 -860 540 203 -721 443
3404 443 -53 -510 369 -218 55 330 -456 440 128 -685 816 56 -632 703 78 -428 428 -240 -73
3423g3K13o38Q16l38n70J253q30n63J470j061k30J107p46J03J93l61O72n56k38
3442c77J196j213j06J321j137m2J052r97J32L73n84O96m47o6P31r61J49J072j415
3461f23M41Q96j128L70L95p15N11k65j34O00p71K13Q51j403N99Q00j211N08M79
3480D13o90N56k34k95P38j035N85O54j381P30L57j092P88J66o92P21m13r8N83
3499C61p22L46M39j114R00L60j231J041j06p73P58l28k3N20q23L98K86r85R59
3518B63O0q73R76k89n67Q09l96j21O75q28M63L04j016P85J01q95J134o37m66R60
3538D42o61N3O53q82M30L12r25R00j27o93R23m86l09J020r53L00L58q94O23K87
3558C71p53P65k93o36Q52m51o7P82q05J04O32j046M92M03p59Q65l77l16M86o24
$$ plain form
3423 -73 140 -498 318 -20 -590 663 -167 -730 740 -321 -551 556 -190 -87 106 -255 417 -139 -377
3442 -377 819 -394 -500 821 -316 -358 694 -303 -171 202 -382 314 -133 -199 532 -429 -280 792 -623
3461 -623 -182 714 -414 -44 351 -364 147 -118 -252 348 -423 -210 641 -762 -163 637 -574 -66 413
3480 413 -277 279 45 -250 488 -547 38 692 -689 41 398 -694 94 260 -432 289 -124 -222 361
3499 361 -361 -15 424 -690 210 570 -661 380 274 -499 259 -69 -92 428 -395 3 289 -696 263
3518 263 323 -550 426 137 -430 379 -17 -138 537 -291 172 476 -540 245 346 -549 585 -52 -518 442
3538 442 -219 -166 487 -395 35 347 -578 322 195 -498 425 -61 -370 650 -303 -3 355 -539 84 371
3558 371 -382 383 90 -546 306 -145 -212 570 -235 -131 501 -545 -53 350 -409 456 79 -237 249 -375
3578c75P8O47q50N80M83j087N99K49q91O70L4k17O65q21J66N55j120O75N84j010
3598c86O16M1r10O78j14o1O68p41L26K42j247R53L83r21Q39K5p44N14k39l5L73
3619B60n91O11K16j274J050k1j029R81K04o75N95m89j6L21n94P20K36j045J091
3638E51k30j134J059Jm54P06n54L0K08q75R40K3q12R88l23q12Q03k1m53O73k95
3659A9k5K61o76O86r0p54J136k75p73Q93m64l46P08m83K46J48p40P32q5p31J173
3680E60l20n55P97m20l29N11m70L73J60p52P09l03o02J002l61l61Q74o05j94M16
3700A30n23N38K86p11P30l87p11J010m04l04Q50o78J83K93q74O61P3o24Q35j74
3720A99p40R64n95j75P18n55L23K67p96N44j8p19J061k23p01Q30m44k93N28m12
$$ plain form
3578 -375 -297 350 -500 80 563 -524 75 324 -567 103 137 -80 585 -236 -70 485 -635 40 624 -386
3598 -386 230 271 -639 39 -75 -136 532 -209 117 359 -888 65 448 -473 366 391 -353 161 -78 -113 260
3619 260 -331 280 496 -778 272 251 -778 203 407 -268 327 -162 -178 143 -451 269 505 -540 551
3638 551 321 -813 246 247 -207 499 -55 -25 183 -692 248 271 -541 447 124 -688 115 94 -359 314 19
3659 19 -6 255 -421 265 175 -579 557 282 -491 402 -62 -408 300 -183 63 211 -529 203 118 -613 560
3680 560 240 -315 482 62 -267 244 -226 147 307 -445 264 -39 -641 361 0 -361 513 -92 -286 130
3700 130 -393 145 431 -280 450 63 -648 362 -42 -346 504 -174 9 302 -572 89 162 -462 373 199
3720 199 -541 423 -172 -347 371 -184 139 406 -390 154 136 -583 478 255 -446 384 -60 -353 175 -237
3740b37L10J88o70Q19l11q48J140k60n12R18n16r3K67m02L82J0o11R22l80p38
3760f22J091n12m30R40m83j17L79l47L25j04n89R67n27n87J110n45m39R07n89
3779a72m1K93l03L44k65l09Q59n60k66J070q60j84R17o36j68M26l72M36k84k62
3799c37R73o74k54Q88q03j01R93q58J48L38n33L63j35k93N45o13Q0P60r27K55
3819a85P68r20J23M83o31M94q4j93M52o59M6O59r60M23N46q74N02L40n63M61q4
3840A44l10N06m49J50L75o60N29J79q31O32p4n87O69j33m83N45k26lK74o03N14
3861A58J68r12P53J5o11O36j78m96N30k69L0L35o12N61k58m83R56k03n97P90k47
3882F6m19O65k57m0K16l96M76k61m44O74m04k95Q08n55p9O86n84L1J80k61L78
$$ plain form
3740 -237 73 261 -409 410 99 -749 391 131 -381 537 21 -72 195 -207 175 185 -426 496 116 -622
3760 -622 469 -43 -473 467 -16 -133 246 -101 224 120 -469 498 -29 -616 494 -51 -490 417 -172
3779 -172 -213 80 -223 121 -144 -453 406 -154 -420 650 -210 -394 523 -113 -281 145 -227 209 -75 -337
3799 -337 636 -38 -292 596 -207 -308 685 -173 -25 313 -220 143 8 -285 260 -353 -273 487 -440 -185
3819 -185 583 -337 -214 269 -362 132 48 -145 307 -352 -306 353 -607 -184 362 -512 -10 330 -233 228 144
3840 144 -166 340 -109 41 416 -244 285 464 -367 265 191 -396 273 140 -343 202 -24 -27 247 -356 158
3861 158 326 -586 167 182 -429 207 29 -467 63 -206 -176 159 -453 108 -150 -633 323 120 -477 313 66
3882 66 -353 312 55 15 231 -165 311 50 -394 280 -124 -419 389 -166 -245 441 -143 -112 68 -193 185
3903A85k06j80P04o62l13R71p13n8O91p40J14L84m31K84l6j38M98o75O2Q19q23
3924b63N7P42p48K32J81m10L76l4k53N09o73L3O60p22K34N30q27K65L57n33M21
3945A34j18q4L92o23K19N37p26L01L58p95M57K90p82N65r7j98M30m65K06L81q53
3966d71M84K01p50O36J11n34M83k17j24M02l64R4M48p73O45J17q68N79J26n21
3986b96M31k05p3L91n72L33J00m61M96K8n27N70j68n06O56j41m7M21o21J45K13
4007A67p44P38p0n03O03r3m12N83m95L7N56n89L94P1n21N41o0m67N19l43r4M16
4029B34n54J38L64n87L86M38p17M62o2l50M28k39O6M18n19J34L01q77N16K60n42
4050c02M36p1l86L24k98J77L82o11M15L69q02N37J67p20N53l3k44J98m07K71J75
$$ plain form
3903 185 -21 -201 503 -159 -472 499 -214 -272 419 -321 -207 177 -254 30 -6 -144 354 -321 -259 560 -263
3924 -263 -206 536 -212 20 201 -209 167 133 -120 389 -284 -251 409 -313 -79 451 -376 -111 246 -287 134
3945 134 16 -68 324 -299 -80 457 -269 32 390 -405 52 342 -440 125 28 -170 260 -205 1 382 -471
3966 -471 13 214 -536 100 211 -323 160 -57 -181 221 -143 -49 399 -374 271 388 -480 99 225 -296
3986 -296 135 -70 -143 248 -324 9 109 -352 144 172 -355 215 47 -459 197 56 9 430 -191 -46 167
4007 167 -577 161 91 -412 191 98 -314 269 -226 -189 367 -222 172 243 -278 263 203 -264 255 -88 -182 234
4029 234 -320 -182 182 -405 -19 419 -298 164 102 -248 180 -59 7 425 -94 40 341 -536 -20 240 -302
4050 -302 134 63 -323 1 -297 -120 262 -349 66 435 -367 170 337 -383 170 137 -107 91 -316 -45 130
4071A30n98N90K89r02O48J20o12L09J97r7J17m12L61k6p21Q04J21q63P73J84q59
4092d47M04P2j74M35m13K62O6p85P76J29r26R34j8n65L95M3k98J07j92O06l02
4113A09o07Q09j43p93Q39J27o22M49j55j74N8k82O07%o64O69m6r27R27Q1n65M85
4135A82j01o7J12m02N57n4p22Q12j91p74Q27n8l71L83k68J76J32n07P36l44n48
4156d90Q93k42o89P97k47k39K85l25L20J28l53N12k34n41Q05l71m03P28l41q3
4176i0K02l20M46n0m81O56k87n39P68k23m46O51k94k04L57l30M21k08l45O93k35
4197A42m80Q10l26l59N32l06n8Q9k47M45k36n41Q75l08m58P81k69m37N04q7oR1
4219A51l78O23l37n98R74k97n44Q04l85l32M59k79K08j52k51O73l66m17R06n36
$$ plain form
4071 130 -468 122 411 -491 157 277 -335 -26 171 74 191 -221 140 114 -607 197 318 -545 228 412 -447
4092 -447 -43 29 -145 290 -123 139 205 -580 196 325 -601 333 315 -250 145 188 -110 -3 -195 411 109
4113 109 -498 311 168 -625 214 341 -281 168 13 -161 -103 -385 222 222 -442 227 181 -746 181 262 -303 182
4135 182 81 14 126 -276 281 227 -495 317 126 -648 179 121 -250 133 -135 41 173 -334 402 58 -490
4156 -490 403 161 -528 269 22 -217 68 -257 63 191 -162 350 116 -425 380 9 -394 334 -7 -90
4176 -90 112 -208 238 188 -293 363 76 -463 305 82 -364 287 -7 -211 146 -184 237 29 -316 377 142
4197 142 -338 472 146 -213 319 13 -45 44 -203 242 6 -535 340 32 -426 355 86 -351 153 66 60 151
4219 151 -227 396 59 -539 435 138 -406 398 13 -319 140 -139 69 -83 -334 339 -27 -444 462 -74
4239g4k64P71l22k25L05j76J01j98k20P77o38k80R72o44l18P58l84k61N40j97
4259B3J62j76j12N02o02l03J073p29m45Q64m57J69L13l17MRp1M67n40j13Q58o75
4281i6j83N66m86J68K47l16J03K6j23L54m38j4O28o00J20M29o47K09K01l05K35
4302G8j1k35M39m69Q5M58n18K41K34o96M29J94m66M30j87j74M58m33pL99n48M29
4324A30K22p01L67O3m31O14r4l71M65m17n6M35l00J04J59n48N99k05k85M59k46
4345c7l12O09k53p9L29m72L37P4m06M88k16l19O19l63k81N16l70n4M36m39K96
4366A03n5k62L91k17k69O31m27o5N67m37o1K87k79R8R5k74M06l67q5N24m83j3
4388a92N80n02M6K93l42K47o5j45L67l51j70O68o54K01M83o46O5L59m82K68r1
$$ plain form
4239 -74 -338 433 111 -114 191 15 116 -82 -302 475 -163 -443 529 -115 -433 325 -59 -320 220 23
4259 23 185 9 -103 399 -203 -506 567 -162 -607 257 -200 -31 282 -35 -31 -22 -93 374 -166 -279 579 -96
4281 -96 -279 287 -199 -31 216 -100 3 29 -94 260 -178 -192 436 -164 -44 385 -262 -53 148 -157 78
4302 78 67 -168 271 -198 -113 345 -173 68 302 -394 35 229 -237 193 6 -168 290 -143 -150 249 -299 130
4324 130 352 -349 18 81 -350 264 170 -201 264 -153 -209 226 -74 30 189 -359 240 35 -250 209 -37
4345 -37 -349 260 7 -72 257 -215 122 196 -210 278 62 -257 362 -1 -282 234 -136 -190 246 -193 103
4366 103 48 -214 177 -40 -309 322 -105 -170 397 -40 -101 186 -93 5 100 -174 232 -135 -220 304 -179 -192
4388 -192 388 -114 -68 225 -117 130 65 -80 287 -64 -234 434 -220 -19 464 -182 -117 242 -240 28 -63
4409f3r3K35k76R0N04o40K52L87o79L16K82m39J81N2m04M81m80J28M38n97K65
4430f0K96m47L05K57n31L40l3k80L38l07O2K75n53K66L78o28M43Q5n45M95o6l04
4452b14M25m70K89P2m43M25J72m05M35q8m93N90k61k07M09l60J27P6m27N32N4
4473B38m54M55j00l91M73k05r7L63o06L23J59n78M77l7l46N52o7l51N29l41n9
4494f3L65m66K29L6m89M86K3l89L58r3k12N30m22R2K95m44M19J83n59K08r8k55
4516b66M32k55l7K75l09J47K79o08M28J55n12L39l7j88K25j03M6R4m17L08K43
4537B39n73M87J02m86L14J04l04K22k71K15N5m11M54J15n89M87K09p53N02L9k86
4558a29K65k42M9K00n82N93O9o42O45k2m43L01J87k94J43l59L63l7m28N68n0n56
$$ plain form
4409 -63 -156 79 -197 -107 397 -243 9 396 -283 33 315 -124 57 109 -295 186 -294 -166 272 -325 -60
4430 -60 236 -211 94 351 -180 160 127 -153 185 -122 -60 215 -338 -72 306 -322 121 206 -339 156 90 -214
4452 -214 211 -259 30 102 -341 84 256 -149 286 198 -295 295 34 -173 236 -124 3 79 -348 184 238
4473 238 -216 239 139 -252 221 16 -81 282 -324 -1 158 -420 57 20 -326 226 159 -192 337 -4 -63
4494 -63 302 -164 65 101 -388 98 121 -268 90 -3 -215 315 -107 -15 280 -164 255 438 -121 87 -11 -266
4516 -266 166 -89 -126 149 -160 -13 266 -342 86 241 -271 68 31 -157 68 -35 11 105 -312 -4 239
4537 239 -334 153 255 -231 83 187 -117 105 -166 49 104 -307 147 262 -327 160 369 -384 118 157 -129
4558 -129 136 -106 -57 143 -439 154 223 -419 226 204 -239 62 249 -45 98 -261 102 65 -363 205 155 -401
4580d01O62j7n96N09k0j76O9j77L39o8m54N05P4q20O66J24m97M69o7k98L94k79
4602e9R3L5m45N86l5o84P68j89l34L89j25L4K4j90L65j47l67N24k2o42N92r3l58
4625b80L41lj1j7j89M95k74m91O22m2o18O69j9l94K74p9j1o1j55M00j73k89N95
4648B90k19m26O83l33j17K62j78K03j88k18M10k18k18N65j93m00M63j54k10K43
4668D7j34K15j37l12O17k95l85O94j68k95K26k5k04J27j55L58j67k92O80k87l22
4689b14N73k91m22M98o4j2K8j84K89l38k18O53k43l01M66j16n20N73j13m1k0p6
4711i3L79k60m35Q11l52m52P21l45l12L42L7j67J35q3L86n13j36O12l27k97O31
4732B82k82k09L26j35m2r6M2L45l82l9N92n75j91O18l27j74M21k08J52k15K6L32
$$ plain form
4580 -401 261 244 -352 157 137 -39 30 -147 192 124 -330 175 249 -571 95 219 -278 191 124 -174 220 -59
4602 -59 34 69 -376 210 175 -509 259 70 -264 125 0 34 58 -132 233 86 -281 243 221 -421 171 78 -280
4625 -280 61 58 47 30 -159 336 62 -429 193 151 -467 202 183 -211 63 -16 -27 -88 -243 157 -16 -305 290
4648 290 71 -355 328 -5 -122 140 -38 165 -23 -241 169 -49 -267 298 105 -295 168 14 -196 47
4668 47 -87 128 -9 -321 296 1 -384 310 142 -153 73 48 -156 -29 -184 174 7 -285 395 108 -214
4689 -214 359 68 -354 144 80 68 96 -88 201 -137 -355 298 55 -246 220 104 -416 157 44 3 -17 -93
4711 -93 286 26 -409 402 50 -402 319 -26 -338 4 41 -126 9 -74 312 -201 -337 275 -52 -349 282
4732 282 0 -209 117 -18 -60 -156 -114 231 -151 -190 402 -173 -364 254 -73 -247 174 -34 118 -97 -71 261
4754B61m35J30L79l79j68N49l05j38J99k00K48j97p4L53l94n7M94l98L5M34m31
4775i4L9J95j84J9P5j97M11l73j65N19m59N2L75l47M6K41k43J27p2M3L05l97L
4798h1K41k97QL12l85L42ol53K91pk47L23k80J5L34l20j2K16l33L81r8j06M03
4821C41l45k15L31j68j61M12l11Q6J33k09J69k9j33K67k06k9L22k66j51M12m14
4842a64R8J97j99J58r5j60N32m76o1M11l49J4L39l48O0J15k98M00k11p4L61l20
4864g0K4L55l87L6J56k22O9N8k06M08l31J9K34j82p3L30m07Q3K20k75J59L0p2
4887d4M8p1m6K57k71P7L14m18J35J95l18K21O3k34J98j41n1J99l15J42L30m75
4909b05K32J87l74L01m1j43J57k44J10K10l92J71M9l30L49J6j86K24o9j55K66
$$ plain form
4754 261 -174 -44 335 -44 -212 337 32 -106 93 -107 141 -56 -130 223 -171 -228 266 -132 -97 337 -94
4775 -94 -55 140 -44 -25 50 -147 264 -109 -274 245 -214 -162 213 -134 -88 153 -90 37 -35 8 313 -84 -81
4798 -81 160 -137 -129 183 -202 140 134 -219 72 65 -182 141 -139 -124 210 -110 -122 94 -239 142 44 -62 341
4821 341 -4 -219 112 -56 -217 195 -116 -30 103 -106 63 34 -99 168 -38 -67 255 -11 -162 250 -164
4842 -164 -66 131 -68 90 -5 -165 367 -109 -170 241 -108 -94 245 -103 -43 72 -226 174 -37 -111 250 -70
4864 -70 -46 309 -78 -42 114 -108 -39 19 -187 221 -110 -91 143 -39 -112 218 -189 -106 114 -161 -2 28 -44
4887 -44 4 -67 -113 144 -127 -50 264 -154 -19 176 -142 79 142 -92 106 -35 -86 113 -202 -60 270 -205
4909 -205 27 214 -160 141 100 -43 114 -130 -20 190 -202 -31 18 -312 37 53 -133 91 22 -133 133
4930A33k27p0L50m31L30L5k93J92M5j58J88m8j81K38j03J0P2l76L71J11m68L22
4952D2l7j29L09q2j23J85l02J87J6k86K69K4l35K72M1k27K07r9Q3J34k69J76O5
4975A21k66K39o8j70K09j14j32M06k87r1L05l16K39N8k44J98J8k13J16m9O5J73
4997A97k62M0J49k76K17J35l37J70K6j13J60j77%R6j22Q7J38l15K16K00m49K34
5019A4N9l35L76j16M6J66l37J38K71m54J92K24n55L71n0j22K26j76j7J22j61J49
5041C1J78m60L63P1l39K98l6k26J80k9o2J34l90M07Rm37L45K80n04L13j9j69J22
5064F0k27K37J0k25L64q5m29L40J18l64L09p3k04J59j6R5ok77L27k4k74L11K9
5087A55k91J86L7q0N2j33J32L4l35K44J01k95L61O8l62J52n7r4J39j54J40L9k41
$$ plain form
4930 133 -94 -164 186 -245 85 120 -173 19 64 -94 94 46 -135 103 0 10 82 -294 77 188 -280 42
4952 42 5 -124 185 103 -20 165 -137 50 66 -220 49 73 -262 10 51 -176 31 -68 15 149 -120 56 121
4975 121 -145 94 26 -144 65 -49 -181 225 -62 -153 152 -164 75 133 -111 87 105 -108 8 -41 24 197
4997 197 -65 -25 124 -152 65 200 -137 33 59 -54 106 -71 -71 25 -97 -10 128 -187 29 229 -220 14
5019 14 73 -262 114 -2 44 210 -127 11 282 -172 20 244 -311 60 10 -112 114 -62 -79 43 -118 31
5041 31 209 -251 112 183 -156 142 106 -120 60 31 -31 103 -287 120 129 -308 37 317 -187 126 107 -62 60
5064 60 -167 70 80 -145 219 134 -295 45 163 -201 108 35 -169 -10 -26 69 63 -214 113 89 -185 126 155
5087 155 -136 50 87 7 59 -74 58 92 -243 1 102 -193 168 236 -126 26 -31 -125 14 -140 0 39 -202
5110b02M41k69k09L21l2k16K92j03p8J20k24K88j04k64N32j42m22L42K5k54K79
5131A21p9J67n8k12J78m5l41M76j02m20L98Rk48R3J4M0L6j74L37j98l76O19k40
5154ek53M38r2k10N9o0K43j03k23M16qm55N79k18m14L16J20k31K07l8q9l3j36
5177a90L89j11k34L74j84k19J76M5j04R9m7Q0k03k42O21j94l33M21q8l41L76l8
5199E3p2r0N4K58k10k89M59r2m37N50o2k33K23r5p8L4j39L50j91r7L09j75l13
5222b83N82j79k27K70j23k04J03j14L51k27q2M58l34k09M38j43k85L60j14q2N7
5243A3r0J89k59l1N19l31j60L99k25j93K52q2q5M1N4K0j39j34M59k55k27L88r9
5266B4j57K97k44J26p6J01J42k88j02L02j01j84K20j86j07L28k78K33r1r4L13
$$ plain form
5110 -202 239 -30 -239 82 50 -166 126 23 -55 65 -159 129 25 -239 293 151 -271 71 96 -158 121
5131 121 42 209 151 -61 117 72 -269 207 105 -315 83 92 -156 -63 -49 -9 27 -147 190 -8 -384 235 -5
5154 -5 -258 180 88 -122 -63 -123 120 17 -206 210 202 -253 326 108 -306 10 130 -101 106 68 -21 -54 -190
5177 -190 199 88 -146 228 44 -175 1 46 -58 41 -6 74 -129 -371 250 56 -277 144 56 -285 91 53
5199 53 -19 -109 -55 203 -7 -296 163 71 -366 184 122 -111 112 17 -61 -27 -166 184 -7 -104 205 30 -283
5222 -283 299 120 -107 163 40 -164 -61 -175 176 -51 -133 325 -9 -218 220 77 -208 152 38 -44 13
5243 13 -77 112 -147 -178 341 10 -150 249 24 -169 83 1 -84 -43 11 31 -108 -242 217 -38 -265 123 24
5266 24 -133 164 -80 46 -30 71 213 -75 -177 125 24 -160 60 -126 -233 95 -183 50 -41 -135 178
5287A78j71j38K34j60j42L75k35R7N2l19K22m7p5J81j52j01M14l66JL03j88jJ43
5310A05j25J27j52j76M14k52p7L36k08j65L43k57J08l7j90M32l23l7L06k26r9
5331a53K44r7n2Q8j35J64j19KL16k81j53L41j60q0K29k68j22L37q2j09Nj09M18
5354B24l68r5M85k62q5K23j99J33j9r5n2L4j15L31k03LL35l80o3L92m44K06J23
5377A09k48K32j31n6K05n2k86M35l00R2P2k09J55pO9k5j67L1K70l26L5L18m41
5400b25L80J1l10K13p2p5J29q2j31K52l10Q6K88l42J09K43l46K60l8j78K32j14
5422b0j56K97j31n7K28k45PJ34k63K24k5j29L10j41j70L19k34N3Q8j14M2j9j65
5445a67K15N0k11K58l10J45K20k10lJ19j78N3N5k86L79k44l9L59k74k4K00j64
$$ plain form
5287 178 7 -131 103 -57 -199 176 -59 38 90 -229 -7 -54 -129 52 -100 -201 213 -153 -152 151 -37 -38 105
5310 105 -20 107 -45 -221 193 -59 -136 200 -8 -173 170 -87 21 -16 -206 226 -97 -134 172 -54 -153
5331 -153 91 -6 -58 30 -105 59 -60 -58 258 -23 -176 165 5 -75 154 -114 -236 101 19 -90 -85 -194 224
5354 224 -144 -239 246 -16 -101 122 -77 56 37 -58 -110 -76 -191 140 -63 -60 275 -105 -168 224 -220 -14 109
5377 109 -139 93 -38 -94 111 59 -227 208 -92 0 72 -137 18 11 80 55 -112 -81 189 -137 -102 216 -225
5400 -225 155 166 -144 69 -3 -78 51 -31 -162 90 -220 -134 154 -188 -79 164 -182 78 40 -138 94 -20
5422 -20 -176 121 -10 -67 161 -84 -77 57 -206 18 -7 -136 174 33 -137 182 -52 1 89 -25 17 -2 -167
5445 -167 48 98 -113 145 -165 -20 200 -10 -13 106 -72 -19 36 -250 129 -115 -154 205 -69 -93 107 -57
5467e7M7J9k08L37j90p7L54l13j7K91k56JJ08j02QJ63k75K02k4K2J44j43j10K80
5491B04k11LK54l24J18J77l87J58P3j46P6j54rK93k07%J79k79L13p0j96J83J3
5514F1j93K41l22J98J55k07M6K32m09K12J37l34J25K6LJ00k60K84R4m32L37O4
5536A58k50R5J52l18J42q0J75Q2j34P2J02m72L63J5l54L67j9j22pj3O8K6k65L21
5560A04K4k04J49M4l22K87p1l9k0n4R9J59l98K84J32m49M71o8l26K21J33k02O9
5583B3j34R0J31k65J83J54m77L80j5l25L19J2j79J52n9J7J59l55L13j2k72K63
5605A03R6k96J94j6q7J01j41P3K4m28N54j22l19L59r0j77J70j4M7J01k48L05r7
5628I2l51M68o3m01L92J9m35K63j2J28j48j60M87j62m42L70J09l09K04N1rr5m7
$$ plain form
5467 -57 -10 9 -199 138 -52 -129 225 -88 -105 186 -70 -69 39 -63 -55 108 -167 35 11 33 177 34 -76 204
5491 204 -7 -4 250 -74 44 221 -166 -8 65 -81 -5 -159 -168 125 -82 -82 97 -182 131 61 -135 48 61
5514 61 -132 109 -213 -15 140 -67 -21 211 -198 14 151 -183 -58 -32 -29 71 -189 95 189 -243 94 158
5536 158 -92 3 155 -163 -21 -101 74 156 22 94 196 -276 87 102 -252 115 96 -26 -33 -46 22 48 -217 104
5560 104 128 -76 73 117 -205 82 11 -28 -48 -102 -3 156 -242 42 174 -275 196 128 -198 23 156 -46 23
5583 23 -111 -21 110 -155 28 182 -295 85 70 -255 64 76 -103 49 -10 7 166 -189 124 112 -160 103
5605 103 199 -97 97 81 -6 95 -46 27 51 -377 177 55 -264 95 5 -172 -2 -16 31 132 -116 189 92
5628 92 -259 209 146 -255 137 156 -279 -16 -28 100 -48 -208 279 117 -325 45 154 -155 49 100 91 -4 -51
5651e1J24n0p2K48j26l71M23qm56L54M8r1p7J39K9J5l01M23r8l61M84m7n12M23
5675H9l6j38l5J76J73l06j79M43p5n04P01j66l59L25J7k76J57n5K57j58j27L93
5697C17k76k81L55j7k70K33k7j85J11n9K70k19p1M25k16l77L30k4k09J83J49j40
5719Bl4o9K60k58q0K51k9l10L85n6j57J61l9No0j8K32k82j03L13j62j73M70j87
5743F2l22K42m6J26o0j00K31j68j17K93j69j88M27j26j84P8pJ38j49j25K63j89
5765i0j31M34k13k78M61r5j23jN8O5j40j52K81o5k09L72k38j36J91Nj33J63l3
5788gP2j83oK96j72j81L39k23k45M25p8q7K9n1J01p0j92M24k10o8L63k37j20R4
5812A3o6J48j23R8l4j8k26K13j21j09L92j47m2R8j02l5Q4o5K42l30O2K39j88r9
$$ plain form
5651 -51 73 23 -49 199 73 -298 125 117 -339 15 63 -28 -105 34 63 78 -223 200 102 -259 225 178 -334 89
5675 89 53 -85 -120 56 229 -77 -256 187 112 -392 309 143 -216 109 126 -150 7 -48 209 51 -76 317
5697 317 41 -240 115 98 -172 61 34 -151 -40 -99 171 -48 -119 306 90 -287 43 19 -190 -7 142 2
5719 2 -32 -101 159 -99 -179 72 43 -267 118 62 -95 66 27 32 -28 -46 186 -96 -199 114 -48 -221 249 62
5743 62 -260 -18 -64 62 2 -98 133 -35 -152 141 -28 -216 211 85 -99 -21 -28 110 -39 -164 99 -90
5765 -90 -221 213 0 -278 183 88 -35 -36 22 87 -53 -205 76 11 -198 174 -64 -200 -9 -4 -137 26 -7
5788 -7 65 -118 -124 172 0 -181 158 -65 -310 115 37 -50 -21 -72 29 -41 -233 191 -19 -87 276 39 -81 13
5812 13 -53 95 -28 70 36 18 -208 5 -116 -225 167 20 -22 76 -26 -61 23 -42 200 -130 -68 171 -17 -116
5836a16K32r5j42L28p7r7j12o4K57k03RL28l49k8L71k64j47L26k50K72j52n5P9
5859E1o4n7J53j09k0K57k98M4K93k73R2p1j52K05j96Q5J27j92N1L28m06Q4R3j27
5883a02K72p7j58J60k38J02K12k51M6Q4m8Q6k5k10J18N5j59K75k58J50J69l14
5905a11J57M7j84J09k0j93K68n2j40K71k68P7Q7q5R9Jk49K71p9K3J54k56K1J82
5929A30k07J0J29k04J91j4j54K76j22j71L11j17j22L53k65N4J0j70R2O6j70K32
5951A38j24p4K50l47L0K90j96K6N5q7n1Q2l9Q4k3r8J80j78nJ60j23J9J66j77L0
5976a2m5j9J66r0j67L37j62l9K03l35J91P9k20J33N0k03K00j58p9L16j89N2J48
5999A57k86K04N3j99R0O4j20J46j36O2M1k48J35R6k25J26Q3o9J0j7m8J07j64P9
$$ plain form
5836 -116 116 21 -121 207 130 33 -79 -143 114 -89 -80 248 -101 -129 242 -22 -169 157 -93 179 27 -28 51
5859 51 -13 -70 83 -26 -46 211 -87 -43 250 -23 69 -2 -154 51 -145 -60 67 -125 -74 254 -152 -68 25 -102
5883 -102 170 93 -65 95 -143 -41 171 -80 -34 50 2 88 63 -147 -29 26 -133 142 -116 34 203 -111
5905 -111 46 93 -91 18 -2 -195 73 21 -119 152 -116 -39 48 -37 62 63 -186 85 6 29 183 -73 -52 130
5929 130 -77 -67 62 -142 49 35 -119 157 35 -136 175 58 -64 289 24 78 88 -82 10 76 -94 138
5951 138 14 -60 190 -157 -127 163 -33 -7 48 -39 -90 -8 -47 37 14 -84 96 -82 -87 73 -50 -31 135 -42 -12
5976 -12 -57 -76 90 0 -167 170 8 -31 172 -163 28 107 -113 20 70 -133 67 -91 -170 146 -43 9 157
5999 157 -129 75 128 -71 19 83 -37 109 -27 35 76 -172 -37 59 -166 -40 43 -26 -16 -33 -81 26 -138 -59
6023e9K55k18P8J24l45J71J18r5J5k5jlj9m0J14k77K67m7r6K06L0j77R7p5J6J51
6049A65k25Q2J14l43J58J55j83L1Q7j55J50j02L0J21k11J85J7k85L25O2l04J75
6071D9k5M2L0r7k4J78l10K02J02k96K06qk70L77j02j99K82k96J48M4j64K36R9
6094B04m04J95P8k08R3Q5o1P3j12R1j4k69L01R6k79K46m9q4L7N9m5p3q6K49m2
6119H1l65K60J97k81J41J18k01M9J8nJ19k34J94J1l46M24j15l97L24J04k30R8
6141c6PJ26j77j96M60j17k65L35J8l37J64J5o4L4nJ98j67j76K24J15m40N00l0
6164A86l76K41P3k96K29j01Q7k9k08L78k67j93L00P2k14K73r9q2L5L0K6j05j07
6187a47L12j92j86L95o8k61K70j3k11J77j1k8n6k8K65j37l52M00o4k60J77J3j20
$$ plain form
6023 -59 196 -22 56 180 -165 6 124 29 44 19 18 15 -4 -44 70 -207 60 13 -83 123 153 -24 73 -2 14 165
6049 165 -60 22 136 -207 -49 106 -77 -46 41 -114 36 -66 -36 85 -126 59 76 -209 116 178 -126 49
6071 49 24 66 96 -1 -25 153 -157 45 147 -149 57 49 -221 156 54 -145 137 -159 -11 33 -131 105 204
6094 204 -200 -5 73 -135 -42 43 -18 55 -57 34 20 -249 52 148 -131 115 66 -18 19 78 33 -40 -126 123 81
6119 81 -284 -24 173 -108 33 151 -50 -1 17 12 131 -103 91 102 -244 180 65 -332 -8 96 -134 -36
6141 -36 -29 97 -80 -276 184 67 -198 137 155 -182 -18 -3 -67 -33 -38 160 -7 -183 41 156 -284 216 186
6164 186 -190 51 124 -172 57 -44 43 14 -194 184 -83 -276 24 96 -118 155 56 -26 9 39 65 -40 -147
6187 -147 165 -27 -213 182 114 -147 123 110 -101 76 65 37 -19 -47 218 81 -271 129 65 -195 -18 -5 -125
6210a25K27k05J86k61K0L49j19j60K23n1k27K72j49jQ5q0J48j18k57L16m0k16
6232a83K82o3r8J55j31J2j32J15P2r6n2K79k52q3K33r9L7K4O4p2J11k42L87l18
6256e0j01K57j19l23M71r5j26J57j76K88j51j67K95j71k22L87j25k77M79j50k64
6277a83J93j17J43j48k2K29j79j39M73l12k5P1l3o0K4LK29k69L2K32p7k15K30
6300H0l7j67K05Jj64J50j27N7P6j73K88k50r3K91l2l08L32j25lk4N2P4k48R2J94
6325A41k46l8K27k57J8K89k12k7J13n3J30r3j01K69k25n5L13l00R3k5Rk8Q0j13
6349i1J25j68j01L36k27L8K13j46l5Pq6L12p8p4K10l69P7J58j71K1K07l10J99
6372D7P2k42J47jj13P6L3m7J55k17K5K26j07n8J07k42J44Lj40L20k13n9M7r0N4
$$ plain form
6210 -125 102 -103 83 -178 -158 191 72 -88 135 84 -143 129 -20 -21 64 -16 132 14 -243 73 33 -183
6232 -183 99 36 -62 93 -38 -26 -158 -43 29 -67 -119 160 -92 -175 58 -41 -4 20 84 12 123 -119 268 -50
6256 -50 -151 106 -13 -336 135 40 -86 71 -105 183 32 -135 160 -11 -233 154 29 -248 231 81 -183
6277 -183 10 -107 36 -112 -134 95 -84 -223 250 -62 -87 -16 -49 -109 -85 -82 147 -122 -90 142 65 -150 80
6300 80 43 -124 81 82 -82 68 -59 -2 74 -99 189 -61 -154 137 105 -203 129 4 1 -23 29 103 -145 -53 141
6325 141 -105 -143 84 -173 -155 134 -78 -105 8 -45 85 -8 -109 160 -65 -120 193 -107 -14 -39 -30 -58 22 -91
6349 -91 34 -134 -235 101 -126 -88 125 -21 -56 -49 -135 177 99 25 235 -134 -57 101 -70 -49 158 -152 47
6372 47 119 -123 24 23 -90 -14 19 -28 127 -90 -65 161 54 -4 103 -139 5 8 -132 188 -25 -84 -37 -127 -73
6397g3R8j59O2J32j12J59j77oJ21p9R4P6j83JJ5j13J97l0p9J67j89L6J64j48J2
6422a4J24k34Q5Q2k36L11m0j44Q1n0o4K87l18J72R8k32J38j30K4M4k3j77K91j7
6446E8q8R8o8k4J04p8N9p2k3Q9K7j92J60j27LJ83l33J94K97k86J61j17o1J38j68
6471f6O2K04l37J87P5k63K00Q2j69J18j10j16J01K4k8J45j89Q2K30l98K29Oj13
6494d4J34o7j88J13J8j8J09j10J38P2k54J71J10l59L21j80m2J02j42N9J64k35
6516a28K03K1k26K39l4j43J46j53ML2j30J50R6k08J29K5k56K73J74k39J04r8K8
6539IO4j16NJ30l36K72J00l51K35k2j36J82J6p9O2j20N5J45k11J55N1j50J19L2
6563A11j05P8j00L9l9j03J00J56k62J59J40l70J94p2O2J11k13J41J15k81J49Q9
$$ plain form
6397 -73 25 -134 -72 60 -52 107 -70 -76 45 -34 60 136 -47 -46 -31 -144 53 23 -56 111 -78 -42 122 -26 -14
6422 -14 110 -124 -39 43 -193 118 78 -66 15 -35 -99 188 -130 42 140 -92 46 -84 -60 -16 -39 -216 75 58
6446 58 -30 68 0 -24 80 2 61 -11 -34 55 82 -110 50 -77 -74 109 -224 -30 267 -19 142 25 -36 102 -66
6471 -66 -4 200 -137 50 125 -138 62 144 -25 93 -17 -133 -32 -8 -36 109 -80 2 232 -166 63 69 -44
6494 -44 90 23 -165 -52 -34 -52 57 -53 85 157 -97 74 184 -175 146 -34 -76 26 -116 -57 107 -128
6516 -128 75 96 -130 109 75 -68 78 -75 -71 -39 -169 -19 77 -131 -2 23 -233 40 214 -25 79 -19 9
6539 9 73 -43 -38 92 -244 28 128 -223 12 -10 -146 36 52 -27 35 -85 -30 115 -96 59 110 -40 79 111
6563 111 6 84 -16 23 -16 -119 -19 137 -125 34 174 -196 -2 -74 -12 99 -114 27 142 -139 10 99
6585I9k42J78N5l05N5J71j36P4m0J54M0k70J53M2j48J37N0j42J75j08j38K44j86
6608h8K59j26j49K22Ol27J03K52k90K08o4q4M7LQ0o8j04K00n3k46K25Q0j92J70
6632F4j4j4j26M4O6K0k37K51Q7k84J98j0j62P3Q4J2m5j07K46j49k40M68o9k61
6656a05K39j33j15J29l3R0j15q7K00j03j58K52O3l41J87J40k49K19j6j03J66l02
6678a75L11j68j25L59k36j81L67o4m2r5p6K23j47k6K08j13k03M08k13j85K06L6
6700F9q9K6M6J14l9l40L62j67j31L02lj96J02o7j52P5M2J60j45k9K98k31j82L26
6724A51r0j84P8J5J5J6p0J78o2j37K62m4l04L36j63j36J96lM8l3j84K19j51j10
6748a57K44o2k09K33l5j18J74o8L3j1p9J41j48j25M42k40j70K58p1j82O7p4K11
$$ plain form
6585 99 -143 35 90 -215 -160 11 -125 -51 -91 63 103 -167 -14 28 -120 17 67 -75 100 -8 -146 98 -88
6608 -88 171 45 -104 118 124 -203 -100 152 -138 70 6 -78 -31 -28 52 -16 -120 80 27 -219 6 86 -106 64
6632 64 50 36 -90 -46 20 40 -197 54 141 -143 55 45 -117 -44 40 52 7 -100 146 -3 -243 225 156 -105
6656 -105 134 1 -114 15 -18 72 -43 -130 70 -33 -191 61 124 -217 -30 110 -139 80 64 -39 127 -175
6678 -175 136 -32 -157 202 -34 -215 152 88 46 -49 -125 98 -49 -75 133 20 -183 225 12 -173 33 69
6700 69 -20 6 52 166 127 -213 149 -18 -149 153 150 -46 56 -11 -163 -88 -46 114 -31 -60 238 7 -175 151
6724 151 61 -123 -45 -30 -15 1 -69 109 47 -90 172 128 -176 160 -3 -139 57 54 102 69 -115 104 -47 -157
6748 -157 87 25 -184 49 14 -104 70 2 35 24 -55 86 -62 -187 255 15 -155 103 32 -150 -83 -157 54
6771E4j10j25K95j48j46L50j62k14L88j49j90J70O3j1k03J22K70l05j01K97k24
6792g9j6K13o2j28L7o5K02o8j27K46j44l7R4n6j54L02k38k3L6P5J07r8l7J06j61
6817g5l5J47j56M2Q3j20Q3K2j44J06O7j44J78j59O4K01j81k0J94j60j19O2pJ46
6841G5j05j45K63j40K0J73j88oQ7j75K1Q2j01K70j26q9K55k59N6K61k93q3J81
6864C4j2PJ02j73J26j01n5K46k86J03N3j70J33l7o3K32q4j67K23k13l0L73k14
6887B7n9N5q7J72j44N7M5m3j23L23m33J31J83j65R3p8j5O7o3P3LK2l4K13k76l5
6913i1J47j80M0J23j7m6K8K2N9j51j19L03j07j0J55k34N8M2j22P7k3PJ80j40j06
6938a05K79k28r8L37k70L1M2k3M8L3l8L9o7j3J07j52P0Q6j85M7rJ03L7m4o1J41
$$ plain form
6771 54 -56 -181 114 -34 -180 170 8 -206 182 33 -157 13 76 65 -138 -16 254 -51 -152 145 -79
6792 -79 -95 118 56 -72 -35 -100 102 34 -93 153 9 -28 66 10 -144 158 -80 -103 -67 8 115 17 -20 86 -75
6817 -75 -110 37 -119 -77 6 -114 -31 -9 -153 -47 20 -124 54 -105 -41 160 -21 -41 153 -7 -126 -64 -71 75
6841 75 -30 -175 88 -52 -32 141 -47 -53 34 -141 -120 -38 -139 131 5 -84 171 -88 -32 229 -64 -147 34
6864 34 22 29 131 -42 84 -17 -72 174 -112 -9 44 -126 7 -30 -93 139 55 -112 111 -102 -132 241 27
6887 27 -32 23 -64 108 -36 21 66 23 -100 223 -210 -79 104 -61 32 -46 -61 6 -57 16 19 41 7 220 -56 -91
6913 -91 56 -124 -84 39 22 -24 4 26 85 -66 -185 118 11 1 156 -78 -20 22 -100 -23 -46 -39 141 1 -105
6938 -105 174 -54 -152 185 -85 -54 -12 -35 13 46 8 47 -20 -33 74 -78 -8 78 -107 -60 -69 34 71 27 -34 107
6964A07r3n9J89k58l8J97j07P6m0j4J07j97O6K06j71k2J43j83J24L8k31K46j0
6987G6j09MR1j18J37k03J28Rj83K07K3j61P6J37j39R2o0p0J39j98R5J19k41J64
7011A5l1m2O7Qr9J16n3m4K06k65R6J17k40K28q0k02K70q3j35K52j39k7J22j16
7035e9J61N3l32K05R0k17K61j03j51K06j64N6Q0j00J08l2j77J61j7K4n1l5m3L0
7059d6k7J47L5k49J40O6n4q8J07m7K8q9l2P0l2N7J25j95K30l7j62N0j3j10J06
7084b0m2Q5mm6Q6J72k91K03j09j82J25J06j48J33r1O0q2r6J55k9j03J82Lk21J99
7109D5p7q6K11k23K14j02j62K25Q5k68J89M5k49K62r5J7M5j60J94q7j94K19k3
7132B5o9J06m8r1Q5n1K1N4r6K21j67j77L45j66j42K37j4k01L00k10o7O7j1N2M6
$$ plain form
6964 107 14 -45 144 -114 -152 45 -62 14 -26 -40 67 -130 -64 142 -29 -51 92 -91 33 71 -160 86 76
6987 76 -33 -29 62 -56 81 -122 6 15 -168 39 62 -99 -23 114 -25 67 7 -63 76 -122 -27 92 -149 15
7011 15 -16 -58 9 17 -82 34 -19 -63 143 -122 -26 91 -149 79 -1 -203 67 -16 -151 101 -38 -65 57 -59
7035 -59 102 155 -177 28 118 -99 162 59 -92 114 -50 6 86 -14 94 62 -115 46 29 53 2 -33 -76 -46
7059 -46 -73 74 109 -140 0 66 12 -76 31 -16 12 -77 -109 -39 -71 -14 111 -84 146 109 -53 -3 -16 -126 -20
7084 -20 -62 23 19 -27 59 231 -60 143 34 -148 -23 83 -65 68 -23 37 -45 -141 14 -15 -118 64 67 -154 45
7109 45 -32 -118 93 -130 84 -18 -180 45 130 -138 51 96 -153 109 14 31 76 -84 110 23 -171 48 25
7132 25 -44 62 14 -77 8 -43 -22 32 -64 157 -10 -187 158 -8 -150 87 73 -128 172 -38 -105 -38 -49 3 49
7157D9j11J66r9j28J90j14J8J84k19nN3j59L80r3j05J68j44j73J44j9J8j9o3R9
7181A8pj0J11l0k46K64j7k61K46m3j41J49r1J9O8k47K12K6j99J33J14l00K15O8
7205E1n6k4kK4l6o1J95rj38J58j00j54J81%m3R6j62J04j6k14K34k0j46K71j71
7230c8J8L3L9l6O8j18J94k81o1K69p7p3k5K40k75K11j43J05J0r4J75j35j23L18
7254B01j92n7K38k00l0J24o4M1pj01J53j33m7K22k24p0L21j25j26J78j23J93j82
7277a0J5K28l60j0L06k07n1K64k10k9J84q4Q9j93J2K00k15L6O1n7n3K32k55P5
7301c2J02j80J27j09qK72j17j36K97l01l7K94k14L1J06m3j10o1K31m6j23m5K84
7324A82j91p6Q5J2N4J2j65J54k24J03J21j39K3K70l96K23p3n2J59n8p0P3k6j65
$$ plain form
7157 49 -62 104 5 -123 67 -47 -29 155 -64 -69 -16 -175 205 112 7 175 31 -142 2 -17 1 -18 -81 18
7181 18 11 1 112 82 -164 100 83 -178 68 25 -116 33 -58 -39 29 -218 -6 20 -179 -46 68 -232 -17 51
7205 51 -5 -29 -31 -7 -43 -104 91 82 -56 102 2 -152 29 29 -14 82 -80 24 8 -206 28 8 -138 133 -38
7230 -38 -20 13 52 16 84 -34 160 -121 -182 87 10 -63 -88 152 -123 88 -55 50 60 -34 141 6 -117 201
7254 201 9 -48 190 -10 -40 84 20 61 54 -47 106 -27 -74 148 -76 -146 175 50 -76 102 -21 172 -10
7277 -10 5 233 -127 -137 169 -38 -89 175 -35 -64 120 36 125 -68 -56 144 -71 -35 26 -31 -84 148 -107 -32
7301 -32 70 -110 17 -92 -100 172 55 -81 216 -85 -122 172 -42 -11 95 52 -58 -119 112 66 -57 -102 182
7324 182 -9 -85 0 12 66 78 -87 67 -157 -54 67 -72 -49 221 -175 48 -25 -77 82 24 -46 27 1 -164
7348a64K96j50p3J15m8m0J62j54J52o9r9Q9n4k0J17j57O9J72k20J18O3j50J61
7371A16k15o6K08j74R1K33k50m1O4o6J12R7j32O4j23K4J49j51M5pm2m2J70q7k4
7396d7J05j34J88k51J05R5q5m0Q7j73K10L9j90J19j3n9J49j14NJ79l46J11P7j70
7420a53J94j10m6J70m3n3J4o7J30n7k4K3J85j84K0K9p7Q5p7K1R8k08j8L53l77
7445a72J03J35l52J91Q3j10J51j48J23L7k21L8L56j61m6M1k05O2K94j89mp3K4
7468d3P5j28J11J21k13J31k3j32K38p5j80K10j41n9K30k22L0J60k78K86j14j02
7490a18K07j55JJ92j38l2J98j72P0Q4k18J5O6r3R3Rl9Mp9N3J16j12Q0J18k06J36
7516H0r6k5J62j18p5J80p1J9k4j56%L9p2K06n2o5J27j76M6R9k32J58K34l23K03
$$ plain form
7348 -164 132 -18 -91 24 -24 -64 98 -56 96 27 -72 17 -37 -57 60 -97 -28 144 -76 42 105 -45 116
7371 116 -99 -165 43 -131 -40 193 -57 -98 -34 -100 12 109 -23 41 -82 -58 91 -60 -15 -22 -64 -106 64 -23 -47
7396 -47 58 -76 112 -139 -34 61 -24 -64 23 -150 60 99 -91 28 15 -44 105 -9 -4 175 -171 -60 17 -153
7420 -153 41 -69 -115 55 12 -41 -27 -94 36 -21 -45 -22 163 -21 -1 28 -49 36 -41 -20 78 -130 -148 205 -172
7445 -172 -69 66 -286 -95 -12 -122 29 -119 4 41 -180 -142 214 53 7 48 -157 -95 199 10 6 -67 -43
7468 -43 32 -96 15 136 -77 54 31 -101 137 62 -118 92 -49 -108 122 -100 -70 90 -188 98 -16 -118
7490 -118 89 -66 -65 127 -11 -43 155 -17 53 137 -81 -66 0 -93 0 9 -30 -26 -105 -52 64 -48 32 150 -56 80
7516 80 -16 -41 121 3 -72 108 37 56 32 -124 -124 -85 -157 49 -3 -68 59 -117 -71 28 -204 -46 188 -135 68
7541F8q6o3P5O1j46J60j41J06R5j91P2J29k37J75K1j93N6J23l4J5p9m4K04k91
7565a45K12n3p1M9J00m3n7pk2L0p1J13R2j15r9J75k36K53L6j40Q9Qj06L2j55Q8
7591d3R5j54J62Nl38M17o2k41R5J18p2Q0k06J80J24k04J02m9p7J40m7q7J08p2
7615b6P2j3j01J65o7j55J11P1j06J28j07q5J89j7j39J30j44J23N2q3N3p6j96K16
7639eq8N2J15m2qP2r6R4p4k01L36j35j87J67q8O3J15p8O1k1l1o9O8j88J95p3K3
7666b3J43r5j63L00k93J68J6k36L62p5k65K13M9j15LnN1%j58J14P5k41J80pj70
7691a72K28j08oR1j64O0N7n7K24j99QK30k37j02K49r7q4J54p1p0J06j39K62j46
7715A7l11M21q8k24K00O3j58K55j83q3j0O1J91j16j08J39L6k18K88k23k9J87j32
$$ plain form
7541 68 -18 -81 -6 55 -91 69 -72 34 129 -62 10 139 -98 77 98 -95 -39 84 50 65 -14 -58 146 -145
7565 -145 67 14 -57 -8 92 49 -8 -15 -37 -7 -78 35 127 12 -87 88 -148 105 141 1 90 98 -8 24 -131 -43
7591 -43 52 -102 60 65 -273 144 82 -159 -64 54 -18 62 -144 36 160 -44 58 9 -68 72 25 -62 46 -26
7615 -26 46 33 -68 97 30 -125 -14 57 -49 79 -28 -113 76 59 -80 50 -94 29 81 -2 51 -25 -221 -5
7639 -5 -93 -41 74 32 24 96 0 94 20 -181 155 20 -167 0 -88 -25 90 12 73 52 21 -48 20 -168 27 -46 -23
7666 -23 120 25 -138 162 -131 37 53 -183 179 104 -161 52 101 -14 -11 -16 35 35 -123 -9 66 -175 5 -2 -172
7691 -172 56 -52 -58 33 -131 -71 -14 -71 153 -46 -38 192 -45 -147 102 5 -79 75 4 -66 40 -99 163 17
7715 17 -294 127 39 -185 15 78 -80 175 -8 -91 -101 -40 151 35 -73 66 102 -116 172 -51 -80 107 -25
7738b5P7p8N8Q9j49mJ44j13r0J31l3q9L8L6k2O2j24J98p9j00J83j54o5K47j40
7763bOJ17j12Oj11J70Nj34j5L10l35MJ51j83J9J03J1R6j78M7J26j47K7J32j85
7788g2p5K69j23om5M8J18j33j07J82j31K6J68r6l9J09j91Q2K34l23P2K6L4M7j44
7813g0R0R6r5l4k2q3J35l5r1K14j90j00J83l5P7l4n2R0p9M3J08Oj92J80r6n1R4
7840E7q6n2J69q2L8J8k1j1L0j41P8J16j27J81j87o2J94j33K8K6j13K66j58j13
7864h5J60k20J16J87k51j8J20Kj12K19k60K02J0j71J77j38OJ77j98R6Q1j57j2
7887f9L9J12l9j41N5K64k64j6J68k08N1O8j51J18J18j91J10qJ4J48l37J73J11
7910A25k46J44pr5N4K7J49j06r0P7m4r8O8M4m3LJ46j55J61k48J13J62j78J36k8
$$ plain form
7738 -25 52 -26 32 121 -28 -32 112 -1 -91 40 7 -82 -44 -8 -30 32 -92 106 27 -73 110 -44 -109 138 -2
7763 -2 4 121 9 15 -96 74 79 -55 -70 240 -95 -91 60 -123 -104 -1 10 106 -72 -25 101 -46 -19 113 -72
7788 -72 -147 122 -1 -7 -52 -4 114 -19 -126 56 -75 -49 119 23 -16 93 -98 -16 218 -105 -33 -7 27 74 -70
7813 -70 20 116 21 -13 -35 -118 17 -18 -109 105 -85 -185 -2 -37 40 6 -46 44 -35 8 116 122 -70 110 14 -37 57
7840 57 -29 -81 88 6 44 62 41 30 60 -81 -3 113 -14 167 -20 -82 112 -21 7 33 -80 186 28 -85
7864 -85 75 -145 -29 158 -93 -111 9 11 -101 118 -142 60 70 -101 76 -62 -56 121 -77 19 100 -57 -69
7887 -69 -30 82 43 -98 -43 221 -43 -59 109 -99 -48 20 -131 -13 105 -86 24 16 30 178 -159 14 125
7910 125 -121 23 16 -79 -25 2 151 45 -45 32 -12 -110 -42 2 -41 -38 108 -47 114 -134 -21 141 -37 99 71
7935G1j00K0K0p7R9M9j38J63j42j6J56r7J0k2n4o8J82j17J60l6j78Q2K2o0J57
7960H6j37J07j0j62J56M1k45K72p9n8K40k15J4J09j82J0J81k69P0Q8j10J51j36
7983g8J02O8r2q8L1J7O3O3j9o7J6pK7r7p5J87j49Q7N9j15N4M9j47J09J07k45J76
8010C6Rj19K00k79J93J06j74OR5j28J72j64J0L0j2K3Q5j15J6J21j96J01K14l16
8034h6N9p9L1J15p9J09K9j78J27n5j20K83o5j59R8q7n7J48J1q1Q9j46M3J11m9
8059A2J02j41j40J14J52j47Q0n6J0j6n4QJ08j29J87r3O5p0O6j11J24j39OQ7j27
8084a02J24lj71J44M2j34Q1l9R1jj36N3Q6j70J64r5O9J13j95M4Q8p3Q6o1L3M9
8110H7j5k07K04m4j10J09K1j51K05q7L7L1j89J36n8k4J37r9o3J00p9PJ32n8j67
$$ plain form
7935 71 -29 -9 11 -66 33 82 -56 107 -35 -51 105 8 18 -4 -58 -126 56 -61 99 63 -115 -33 -11 -71 86
7960 86 -51 56 46 -116 40 81 -164 108 29 -29 211 -4 10 119 -63 -53 128 -141 -71 17 -93 58 -78
7983 -78 24 92 0 -88 -57 -40 23 86 67 0 16 9 36 -61 -136 51 -98 -11 48 -67 -13 36 -111 -2 105 -140 36
8010 36 45 -74 126 -153 40 146 -28 -22 73 -55 117 -47 -37 -7 -19 4 89 -26 -10 111 -85 16 230 -86
8034 -86 -27 -106 -75 40 -39 70 99 -79 48 -7 -127 156 91 -68 30 -57 -114 34 45 -36 53 -93 -50 61 12
8059 12 114 -27 -167 -53 99 -48 32 -24 -14 -30 -84 -76 32 -97 90 -3 62 -8 58 -53 71 -68 -62 25 -102
8084 -102 22 19 -152 -8 34 -100 -19 -58 33 32 -104 -51 35 -135 29 -66 3 116 -79 -35 53 -20 66 5 38 87
8110 87 72 -135 69 25 -85 24 45 -106 99 12 49 80 -109 27 -31 -55 82 -17 -80 20 -59 -52 80 22 -145
8135a45Q2J15l0o4l9K32j66l6P4o5J9P5ll4Q8j31P8j33K7J01l4KL0j50J5P8m2
8162e6j2R7j24K06r7k0O0j17m8K31j47n1J48j76J82n3n6J21k42Q3J58o3m9J13
8186H8j76j0J6J23J4
$$ plain form
8135 -145 -63 52 22 -42 -81 151 -15 -51 23 -42 -23 52 49 15 103 -28 50 -83 -56 45 11 13 43 -107 -92 -14 -56
8162 -56 -68 29 -95 111 14 -6 54 -63 -111 120 -27 -78 70 -106 76 23 -33 88 -154 -71 87 24 -25 88
8186 88 -88 -98 -82 41 55
8191E5
$$ Imaginary data points
##PAGE= N=2
##DATA TABLE= (X++(I..I)), XYDATA
0@%%%%%%%%%%%Qj6J6j6J6k4L2l4M2n6O5p3Q8j04J21j45J69j93K24k56K90l31L74
34A97m22M77n35N99o71P51q35R26j028J139j261J396j540J698j872K063k274K505
52A313k760L042l358L715m119M582n116N742o487P390q518R968j1905J4643j8845
67a0713K6172m2536J45461k6835j87607J74947m9309j24030O5144J01765q0603
78h144l8858Q7414k0986j56769J04559J38034j29109l2929J34337n2587q3245
89e8283M2962L5551l9405j8420O3677j1450j22204O6153J11963r3829j3686J10390
101G3419m5985q2756K1814K4864k9627O736J01262J235j15666N5067O3375j19772
113d6034N396J11177l0314k7703L1840k5589n2027l584N1281j3677n9581O8589
$$ plain form
0 0 0 0 0 0 0 0 0 0 0 0 0 8 -8 8 -8 8 -16 16 -18 24 -32 33 -40 48 -56 65 -80 89 -104 120 -136 154 -177 197
34 197 -225 252 -283 316 -355 396 -439 487 -541 598 -663 733 -807 891 -981 1082 -1192 1313
52 1313 -1447 1595 -1763 1952 -2167 2415 -2701 3041 -3446 3944 -4574 5394 -6511 8132 -10713
67 -10713 15459 -27077 118384 91549 -96058 78889 29580 -94450 -29306 72459 -8144
78 -8144 -47002 40412 19426 -137343 -32784 105250 -23859 -56788 77549 24962 -58283
89 -58283 -15321 20230 -19175 -37595 26082 14632 -107572 -41419 70544 -23285 -36971 73419
101 73419 27434 -55322 -33508 -8644 -38271 -31535 69727 70962 -44704 10363 73738 -46034
113 -46034 -40638 70539 40225 12522 44362 18773 -33254 -36838 14443 766 -58815 9774
125I774M3353q3935J3287N2160k9903L776O895k3040n171j1831K2079J0333m3630
138c5853L9022L9193o4366j2362K6491q139J3344O750R356J0168l2877O862J380
151a031n3678L5447M9315l5468R192K3311j4637K774j4554k837J6838k1745J2910
164E837J4995m1367J6520K7185l1407k709L059J077J5325k2098J3566L4204l3861
177C26P877K3325n0480q12L0644k0879m556J1902J5724M362l5215J1185J6003
190I406m4366K2461L3798m0300J4881L0734k8351q326K832N129L876k3474K1692
203hK2256l3595K1622K1069m3112P098J7835k1482J696L635J1153P668k7236J4969
217C568J1780m1133J7950K1238l2045J8069K2957j4854J601m903P35o47k6372
$$ plain form
125 9774 53127 -30808 -17521 34639 4736 8512 15407 -7633 -12804 -24635 -2556 7777 -35853
138 -35853 3169 42362 -22004 -34366 -7875 -16014 -2670 4080 13436 23604 -9273 -2411 -1031
151 -1031 -54709 -19262 30053 -5415 3777 27088 12451 15225 671 -2166 14672 -7073 5837
164 5837 20832 -20535 -4015 23170 -8237 -10946 -7887 -6810 8515 -13583 -17 34187 326
177 326 8203 31528 -18952 -19764 10880 -9999 -14555 -2653 13071 17433 -17782 -6597 9406
190 9406 -34960 -12499 21299 -19001 -4120 26614 -1737 -10063 -7231 -2102 1774 -21700 -8
203 -8 22248 -11347 10275 31344 -11768 -4670 13165 -8317 -6621 -2986 8167 15835 -11401 3568
217 3568 15348 -25785 -7835 13403 -18642 -573 22384 7530 9131 4228 4963 4316 -22056
230b2056J8309J3985k9340K3574J2892l3868J2946O509j7558R810k786P066J2914
243A2397j8311J5031Q978l0601J4010N419k3076J9205N217p440J3183j3902k92
256a82P197k6355J0414J1091k1949J9299R384j5305J6264m049q573J1350j4350
269e764O614J4528j9773J2032O350k6142R955j446j5893J5727l689P72J7923j2373
283a179Q017J1086k3298R115M913k0093J5175J562j0519J3355j0896l755J0664
296D147j7789Q761J2557j7945J5490P070j7469J3477m491j2891J1410j1235J650
309g258J4096j4273J0847P847k0905J2249J492j6232J6182k336o611J4697j0400
322f05J652Q761j8006Q552M230j7543J6766K134j3242J5507p049q592J1213j1601
$$ plain form
230 -22056 -3747 10238 -19102 4472 17364 -16504 -3558 2951 -14607 -4797 -7583 -517 12397
243 12397 -5914 9117 18095 -12506 1504 6923 -16153 3052 8269 829 14012 110 -182
256 -182 7015 -19340 -8926 2165 -19784 -485 8899 -6406 9858 5809 -2764 8586 -5764
269 -5764 850 15378 -4395 7637 13987 -12155 -2200 -3646 -19539 -3812 -7501 -6729 11194 -1179
283 -1179 6838 17924 -5374 3741 8654 -11439 3736 5298 -5221 8134 -2762 -6517 4147
296 4147 -13642 -4881 7676 -10269 5221 12291 -5178 8299 3808 -9083 2327 -8908 -7258
309 -7258 6838 -7435 3412 11259 -9646 2603 4095 -12137 4045 1709 -4902 9795 -605
322 -605 1047 9808 -8198 354 4584 -12959 3807 5941 -7301 8206 1157 -7435 3778 -7823
336g823L805R719j3339J3059M283j5970J5575k709j5104J3628o986m929J1877
349E086r965N099M768j6094J2326l35j5311J9577j196j1493J6799m520m637Q696
363H800j0287M720Q65j3022J6058l734j4900K0036p181j5423J5469n261l849R287
377A578n770P893o8r224J7628q486j3938K1826q427j4615J7472m114n213N532
391B074o298N703m718o229J9065j1886j0435K5923j0280j4539J8459m382o420
404c963O073j918O328m918j742J6791j8001q979K5105j4823j3342J8436p296o500
418h749N810k792N675l599J650J5944j7716m038K5500j4815r303J7077r535n188
432d079K881p213M331l851J713J4694j6973j700K2636j5144n797J5798o882K733
$$ plain form
336 -7823 -4018 5701 -7638 5421 9704 -6266 9309 6600 -8504 5124 -1862 -6791 5086
349 5086 -4879 220 4988 -11106 1220 885 -14426 5151 3955 -7538 9261 4741 104 8800
363 8800 -1487 3233 4098 -8924 7134 3400 -11500 8536 1355 -14068 1401 -3860 -7709 1578
377 1578 -4192 3701 3633 -5591 12037 3551 -10387 11439 3012 -11603 5869 1755 -3458 2074
391 2074 -4224 1479 -3239 -9468 9597 -2289 -12724 13199 2919 -11620 6839 2457 -3963
404 -3963 2110 192 6520 1602 -140 16651 -1350 -10329 14776 -47 -13389 5047 -2249 -8749
418 -8749 -2939 -5731 -56 -3655 -2005 13939 -3777 -7815 17685 2870 -6433 10644 1109 -4079
432 -4079 -1198 -8411 -4080 -7931 -6218 8476 -8497 -10197 12439 -2705 -8502 7296 414 3147
446C147M295r303M539m152k4J3297j3566M57J7227j5989o019O969p678R650K710
461E560j1294Q558m837o140J2246q408J351J7293p500m675l011p589J3146m888
475a88j1210J7756o244j2018J2777q963n129J7304K639k004p612k295J4641j5088
489e634r965K6799n704j1136J7669j2035j5473J4201Q842q70p484P201J5135k7962
503f416j2852K8757j0898r131K8161r589k2353J2251R983r372j1134J9733J9588
516B6728l2629p872K8526k3024j0903L5544r348k3451J7238R004k0896j4404K6580
529A093J9055l0706L525K7676l3087j0636L6320j2102j6809K7978J1707k4857
541h43j7571K2088J0910k9880J2785K9755l3151q365K9685k1001j6986L0029J3195
$$ plain form
446 3147 7442 -1861 2678 -1474 -1498 11799 -1767 -1310 15917 -72 -6091 878 -6800 2850 5560
461 5560 -5734 2824 -2013 -8153 4093 -4315 -2964 14329 6829 2154 -857 -8446 4700 -188
475 -188 -11398 6358 114 -11904 873 -8090 -13219 4085 6724 4720 -2892 -5187 9454 -5634
489 -5634 -15599 11200 5496 -5640 12029 -6 -15479 -1278 7564 6694 -790 6411 21546 -6416
503 -6416 -19268 9489 -1409 -10540 17621 8032 -14321 -2070 7913 -1459 -12593 7140 26728
516 26728 -5901 -13773 14753 -8271 -19174 16370 7022 -16429 809 9813 -11083 -25487 1093
529 1093 20148 -10558 -7033 20643 -12444 -23080 13240 1138 -15671 12307 24014 -843
541 -843 -18414 3674 14584 -15296 -2511 27244 -5907 -14272 15413 -5588 -22574 7455 20650
554B0650j9995j2699K1114N077l0843J5239K6870l1045r57K7069k7395j7856K6570
567A799R303j6333n244K1073n14l1823J2567J9791k5807J0377K7979k4939j3434
580a5205J8744R93j2767j826K0727M548k4365Q431J1341k4935Q717K1488j8500
593b609n558J3513o94r126n616J6531R190j9533O518R613k2674N388J6170j3124
607b011o74R456l25p479j2663R951J0399j5765Q417J3185j7201J287P529j1873
621g767L88O273O331J432j4910O818J1197j8594L839J4980j2115n13O304o359
635b696k340K36R934L160j8079R232J2877k1651K759J7928j0057o33Q366m211
649D825p069n185J0131K924j7343J3382J4154k2834Q67J3658j2728j498R341R85
$$ plain form
554 20650 655 -12044 9070 14147 -16696 -1457 25413 -5632 -6589 20480 -6915 -24771 1799
567 1799 11102 -5231 -10475 10598 10084 -21739 -9172 10619 -15188 -4811 23168 -1771 -15205
580 -15205 3539 4532 -8235 -10061 10666 15214 -9151 -720 10621 -14314 -5597 15891 -2609
593 -2609 -8167 5346 4652 -4474 -10090 6441 15631 -3902 2616 12229 -10445 -5057 11113 -2011
607 -2011 -2685 6771 6446 -1033 -13696 -3745 6654 -9111 -694 12491 -4710 -3423 4106 -7767
621 -7767 -7379 -1106 5225 6657 -8253 -1435 9762 -8832 -4993 9987 -2128 -2641 3663 -2696
635 -2696 -5036 -4800 5134 8294 -9785 -553 12324 -9327 -6568 11360 1303 670 9036 4825
649 4825 -2244 -7429 2702 5626 -11717 1665 15819 -7015 -6148 7510 -5218 -6716 2625 3610
663C610l934n589J0586N64k0289J3218J3896k1582L591J4386j2412j932R212J822
677E147n011o037J1774p20j9649J5726J2218k1113O759J2563j4212j773O947l51
691B268l530l073J2509k60j7265J2784N905k0166P733J0175j1222K110M552j359
705A161k560n442R151K65j4447J2484N825j5869Q540O993r687K964J918n37m71
720B88m891R285J534j2289J1101K455j4668Q072L229q500N112L35l6K302n826
735b497O606L65j1209R162J673j0036R131Po494M853m470k8L334p335O553K586
751B201r403Q914J283q188P292j708m162N612m210K741M154p547O216J273r376
766d908P930j01o779P681k658k545N873o018J655L342q369N292J760o839P944
$$ plain form
663 3610 -324 -5913 4673 5237 -15052 -1834 12062 -9520 -5929 8457 -3955 -5887 3325 5147
677 5147 136 -5901 5873 5153 -14496 1230 13448 -7665 -906 11657 -2555 -4328 2619 2268
691 2268 -1262 -4335 8174 7914 -9351 3433 9338 -10828 -3095 7080 -4142 -2032 2520 1161
705 1161 -1399 -6841 2310 2575 -11872 612 6437 -9432 -892 6101 -3586 -622 1296 759 288
720 288 -4603 4682 6216 -6073 5028 7483 -7185 887 4116 -4384 728 1063 1027 3329 -2497
735 -2497 4109 4474 -6735 2427 4100 -5936 3195 3202 -3292 1561 -2909 -2937 397 -6938 -385 2201
751 2201 -7202 1712 2995 -5193 2099 391 -3771 1841 -2369 372 4526 -3021 3195 4468 -4908
766 -4908 3022 2921 -3858 3823 1165 -1380 4493 -1525 130 3472 -4897 395 2155 -4684 3260
781C260q64m858O480n364j338N809p397L346M110q217N780J474p045O744k193
796b73l892O651m858J130O223p577L814K924q815O051P80n941P123k713k555O392
812D464o244J284M283q576M124L047p468O785L42n455O153l771j657N729n967
827b927L142M122q017N841J889q266O811r80n698O570l066q43N314n613K974J611
843B864p806O896L15p327Q333j661n338P291m039j750M505n322L151O42n831Q194
859C117j627o796Q676l812n204Q587m065j541N160m014L071o48m621Q045l668
874F60n424R869n118l748R523n325k469M735l743K037j094k854P825n193l713
889d032R676o966k530R562p078j984N676l000K010j112k421O472o158k314Q696
$$ plain form
781 3260 2396 -2462 4018 -1346 -2684 3125 -4272 -926 3184 -5033 747 2221 -4824 1920 -273
796 -273 -4165 2486 -2372 -1242 4981 -2596 1218 4142 -4673 1378 2158 -3783 3340 627 -1928 4464
812 4464 -1780 -496 3787 -4789 -665 2382 -5086 1699 2041 -3414 2739 -1032 -2689 3040 -2927
827 -2927 215 4337 -3680 2161 4050 -4216 2595 1615 -4083 2487 -579 -1422 3892 -1721 1253 2864
843 2864 -4942 1954 2269 -5058 3275 1614 -3724 3567 -472 -2222 2283 -3039 112 754 -5077 3117
859 3117 1490 -5306 3370 -442 -5646 2941 -1124 -2665 2495 -1519 1552 904 -3717 4328 660
874 660 -4764 5105 -13 -3761 5762 437 -2032 2703 -1040 997 -97 -2951 4874 -319 -4032
889 -4032 5644 -1322 -3852 5710 -1368 -3352 2324 -676 1334 222 -2199 4273 -1885 -4199 4497
904D497p896k8R553q418j141N803m119K001j255j951O591n276o89P164q289J719
920a734P501r255J430N178m902L154j492l237O875l843r87N252p240K766N223
935D689q260M217L315n459N319l577m889Q175k435j920M382m913K451J487o785
950d203N316l11m498Q469n261o628J0031k508m784M653j597K053m51l812N712
965B181m799k162J2160q171o786J3546m051q047N867J181O79q00J76M153r677
980d550L24J3920j1927m857J7618o191j0682O995J344k349o46M503K846j2143
994e795L296J2863j6910l395K0033p566j0260R261J27o048k05P196J896j1511
1008g018P621J1296k0602k138K0411r274p548J2325q56q348l61O614p03r998J2337
$$ plain form
904 4497 -3399 -3427 6126 -2292 -3433 2370 -1749 252 -1003 -2954 3637 -1639 -2328 4836 -3453 -1734
920 -1734 5767 -3488 -2058 3120 -1782 1372 -120 -3357 3518 -325 -1312 3940 -3300 -534 4689
935 4689 -3571 646 3961 -1498 3821 244 -4645 3530 1095 -825 3557 -1356 1095 2582 -4203
950 -4203 1113 802 -3696 4773 -488 -7116 2915 407 -4377 276 -1321 732 281 -3531 2181
965 2181 -2618 -4780 7380 -791 -7577 5969 1918 -6129 -262 919 1598 798 974 5127 -4550
980 -4550 -4226 9694 -2233 -7090 10528 4337 -6345 650 1994 -355 -1001 3502 6348 -5795
994 -5795 -2499 10364 -6546 -9941 10092 2526 -7734 1527 1654 -4394 -4599 2597 4493 -7018
1008 -7018 603 11899 -8703 -10841 9570 296 -7252 5073 4217 -4131 -4492 2122 1419 -8579 3758
1023C758J0552k1841OJ7415j3140n014J4565r81o648R86M343m117r830J3653R331
1038A3038j9481L665J4178j5886m521J2227k321k793L484L714m986j0596J0804
1051E26O959j5717P633J3169j4362l869O701m723p7M191M717j836r813O890L688
1066D077j4499P501J2592r663m85L269n871k81O46M785K531p128O161L371j4987
1081g981L554R689n860J941K504l227k91m959K539M495o977P174O927j3177M6
1096c603O088n115J291K170J956K098q558J709M082j0493O618J0394j0350o33
1110b346N321m562j807l00N441L629r055M990M793j4059M538J0846r789k01P796
1125E235k432m576k711N711J731r321Q796O037j5338M196R559j1367l75R291r78
$$ plain form
1023 3758 14310 -7531 -7525 9890 -3250 -8264 6301 5320 -1328 -342 4001 -116 -9946 3707 13038
1038 13038 -6443 -2778 11400 -4486 -9007 3220 899 -1894 1590 5304 318 -10278 526
1051 526 7485 -8232 -599 12570 -1792 -5661 1040 -3683 -3760 431 5148 3312 -6501 389 4077
1066 4077 -10422 -2921 9671 8 -477 2792 -3079 -3360 -2714 2071 4602 -2526 3635 7006 -7981
1081 -7981 -4427 5262 -598 1343 3847 620 329 -4630 -2091 2404 -4573 2601 9528 -3649 -3603
1096 -3603 2485 -2630 -1339 831 2787 4885 -3673 -1964 2118 -8375 -1757 8637 -1713 -2346
1110 -2346 2975 -1587 -3394 -3694 1747 5376 -3679 1311 6104 -7955 -3417 7429 -2360 -2561 5235
1125 5235 2803 -1773 -4484 1227 2958 -6363 2433 8470 -6868 -2672 6887 -4480 -4855 4436 3458
1140C458m198k348O147j066j0415J0278O128j4735O018Q975j2642q86Q034p21
1154B027l460j216P062j685j0955J0431M552j4311P518Q424j1515J01O365k060
1168A278l702j142P261j372r435R971K429j3734P818O821r848K049M758k411k640
1183a899j640O337r47q253R725J795j2124P631M452q573K730L338j441j384k649
1198b902N704j134p932R162J570j0039P326K858p438K887J424p10k20k849N158
1213B865j274p620P879P61q099P260J399n918L054m53Q5P51l587M925m75p298
1229e745P180K06o862O771L74m105L224j342R41R97m489N058k27o524O968l27
1245B098n990N716n73k705L576k153J297R41m900M897l34n778O175q82n019N318
$$ plain form
1140 3458 -740 -3088 3059 1993 -8422 1856 7984 -6751 -733 8242 -4400 -5286 2748 2027
1154 2027 -1433 -2649 4413 2728 -8227 2204 6756 -7555 -37 8387 -3128 -3027 3338 1278
1168 1278 -2424 -3566 3695 2323 -7112 2859 5288 -8446 -628 6193 -3655 -1606 3152 741 -1899
1183 -1899 -3539 2798 1851 -6402 3323 5118 -7006 625 5077 -3496 -766 2572 1131 -253 -2902
1198 -2902 2802 1668 -6264 2898 4468 -5571 1755 4613 -2825 62 1486 776 556 -2293 2865
1213 2865 1591 -6029 1850 2611 -5488 1772 3171 -2747 307 -146 -61 690 -2897 2028 1553 -5745
1229 -5745 1435 1641 -5221 1550 1924 -2181 1043 -299 642 1639 -2850 2208 1981 -4543 2425 2098
1245 2098 -3892 1824 1251 -1454 2122 -31 1266 2207 -2693 2204 1870 -3908 2267 1385 -3634 1684
1261A684j691j900L841l037K000J213n184M649l84n134N643j437l816M770k549
1276a332m12L565l942K878J271n099N005j84m809N310k100k771M465l017M73L001
1292B302m602L152J265m753N124o73m202M818k384j814M114l469R93K266m629
1307b492L755P53m592N067j212m054M713k519j482L611l745J688J612m291M212
1322A024J29m281N466j722l472N294k690j118L399l804J445J305l689M110p92
1337F04l248N542k848k572N515l268p19L386l760J651J181l197L975j794k490
1352b042N419l942j676N705m353l31L392m096J516J128k586L190k247j181N063
1367B959m509l64N354n263M86L714m450J763J678k623K391k198j29M132m869O54
$$ plain form
1261 1684 -7 -1907 1934 -1103 897 2110 -3074 1575 1191 -3943 1700 263 -3553 1217 -1332
1276 -1332 -1744 1821 -2121 757 2028 -3071 1934 1750 -3059 2251 151 -2620 1845 -1172 -699 2302
1292 2302 -2300 852 2117 -2636 2488 1815 -2387 2431 47 -1767 2347 -1122 -129 2137 -2492
1307 -2492 1263 2016 -2576 2491 1279 -2775 1938 -581 -2063 1548 -2197 -509 1103 -3188 1024
1322 1024 1153 -3128 2338 616 -2856 2438 -252 -1370 2029 -1775 -330 975 -2714 1396 604
1337 604 -2644 2898 50 -2522 2993 -275 -994 2392 -1368 283 1464 -1733 2242 448 -2042
1352 -2042 3377 -565 -2241 3464 -889 -1220 2172 -1924 -408 720 -1866 1324 -923 -2104 2959
1367 2959 -1550 -1914 3440 -1823 -1337 2377 -2073 -310 1368 -1255 1136 -1062 -1191 2941 -1928 -1274
1383a274M564n662J683L651n011K400J597k839K085j760J68L352m714J501L163
1398B904n809K829K320n597L341J205l366K831j146j26K863m057J610J824m700
1413c074M406Q01n297M842J18m181L808j188q35K603k957J078N26l199M670j434
1429F87m525O171j390m400N373j366j865L332j713n9n98j594L997l547k739P686
1445C450l288l882O819l266l183M880o37r48J57P11K632n668r64P818n596k023
1461b988Q348n029l826N902j200k545Q35K305J241o851R59O769p518J79R275o450
1477e94l036O959k788l936K054L655P29n906L048M373j0000J236Q795p328l47
1492c086Q786l952m627J923K840n73m191N325L471r865K290O639r069J100Q911
$$ plain form
1383 -1274 3290 -2372 -689 2962 -2049 351 1948 -891 1194 -566 -398 2954 -1760 -259 2904
1398 2904 -2905 -76 2244 -3353 -12 1193 -2173 658 -488 -614 2249 -1808 -198 1626 -3074
1413 -3074 1332 2133 -3164 1678 1796 -2385 1423 235 -600 2003 -954 124 650 -2549 2121 687
1429 687 -3838 2333 943 -3457 1916 550 -1315 2017 304 245 -353 -1947 2050 -1497 -4236 3450
1445 3450 162 -3720 3099 -167 -3350 1530 893 -55 102 813 3445 -2223 -3187 4631 -965 -2988
1461 -2988 5360 331 -3495 2407 1207 -1338 -503 1802 3043 -3808 -2849 3920 -3598 -3419 5856 -594
1477 -594 -3630 3329 541 -3395 -1341 2314 3043 -2863 185 4558 -5442 -4206 4589 -2739 -3086
1492 -3086 5700 1748 -2879 -956 1884 1311 -2880 2445 5916 -3949 -1659 4980 -4089 -2989 5922
1507E922m512l636K202J075j981l492N816L202q359L591M371r889J563P826l836
1522a37q52L342L50k350m549L979K285o330N641M163q976J543M448n009O56L236
1538A440J484l86m228K476J062n821M921L824p053K059K350m744P21J112J563
1553G80J704l777J907J273o270K989L274m171L072J853k981L72k375J109K827
1568A586l827K877L668n689P13K195l918J661J324J20J179l575J728K756o196
1583c398K687M950n596O21K679l123j02Q79J802P99m628L260K511p908L069N408
1599C910n863Q40M245k663j747l37K266m15m412N792L088q250L282M349p257N59
1615b613M847j838j364L48K955j669n269O030K116q393M537M655p399J095M674
$$ plain form
1507 5922 1410 -2226 -24 1051 -930 -4422 1394 4596 -3763 -172 4199 -5690 -4127 3699 -137
1522 -137 -989 2353 2703 353 -4196 -217 2068 -4262 1379 5542 -3434 -1891 2557 -2452 -1796 1440
1538 1440 2924 2538 -1690 786 1848 -3973 948 4772 -2281 -222 2128 -2616 -1895 -783 780
1553 780 2484 -1293 614 1887 -4383 -1394 1880 -2291 781 2634 -347 25 -2350 -1241 1586
1568 1586 -2241 636 4304 -1385 -672 1523 -2395 -734 590 710 1889 -1686 42 2798 -3398
1583 -3398 -711 4239 -1357 -736 1943 -1180 -1282 -403 1399 2198 -2430 830 3341 -4567 -1498 3910
1599 3910 -1953 -1113 3132 469 -1278 -1615 651 236 -4176 1616 4704 -3546 -264 4085 -3172 -2613
1615 -2613 2234 396 -968 -620 2335 666 -4603 1427 3543 -4850 -313 4342 -3057 -1962 2712
1630B712k107j492O56K950k001n033O403J307p741N368L648p200J238L332k604
1645e64j517Q23L658j254m231N856o5q105N109L112o029K566L024k335j216r6
1661a264K949j257m105N782J61o710N406K027n600K214J884k025l59m06L089q39
1677I47l810O016q9o140M654Q78n112K161J279q61J10r78K643j358m226N089n
1694A198m668M990J011m134J941q6n80K1j508L246p25l751N103k08m656M235J44
1711A573l427J787l45L59K64j663L366p21l688M516o50m218L935j03k046K158
1727A097j009K29m23k860L278l21k882N037l62l476L596p51j850J503j230J016
1743E92j25k654L410o48l265M255q33k893L309p69o68J865j795J402j52l158L049
$$ plain form
1630 2712 605 -887 -231 2719 718 -4315 2088 3395 -4346 1022 4670 -2530 -1292 2040 -564
1645 -564 -2081 -1258 2400 1146 -3085 2771 2706 -5399 -290 2822 -3207 -641 2383 48 -1168 -1264
1661 -1264 1685 428 -3677 2105 2266 -4444 962 2989 -2611 -397 1487 -538 -897 -1303 1786 947
1677 947 -2863 3153 3064 -3076 1578 2456 -2656 -495 784 -77 33 -945 1698 340 -3886 1203 1198
1694 1198 -3470 1520 2531 -1603 338 252 -328 -307 -1815 1431 706 -3045 2058 1850 -2806 1429 1573
1711 1573 -1854 -67 -412 -53 211 -1452 1914 1193 -2495 2021 1371 -2847 1088 985 -1061 1097
1727 1097 88 317 -106 -2966 312 -9 -2891 2146 1784 -1692 1904 1153 -697 806 -424 592
1743 592 467 -2187 1223 575 -2690 1565 732 -2161 1148 379 -289 1576 -219 1183 1031 -2127 922
1760I22r91l096L966q08j984L311j293l34J299k400J885j1k487L851o93l031L382
1777A488j490j862K841j484L45J187k121K459m42k701L592j452k844L763j366
1792h7r57K965j599L13Q08k559K240r28k365L565j622k023L515j944j093K522
1808G51k021P22J098j550K712q99j690L172k480j694L554k735m67K734k246P64
1824b75R53j611K106j139j194L117k486k98L537l293j15K691l231P95J082j637
1840i98J914j066o43K663k941M15K684l976P62K697l314J609J274j904J583r95
1856b36k58J943k558J193K157l862J646K073l961J755R88k654J611j54k34J571
1872A020k002J619J133l916K630J324l798K700Q54k899J934k14q04P06j437J340
$$ plain form
1760 922 -69 -3165 801 -7 -1991 1320 27 -307 992 -1408 477 466 -2021 1830 1137 -1894 1488
1777 1488 -2 -1864 977 -507 -162 1025 -1096 1363 921 -1780 1812 360 -2484 1279 -87
1792 -87 -1044 1921 322 635 1443 -1116 1124 196 -2169 1396 -226 -2249 1266 -678 -1771 751
1808 751 -1270 -548 550 -1000 1712 813 -877 2295 -185 -1879 1675 -1060 -1527 1207 -1039 -275
1824 -275 678 -933 1173 34 -1160 1957 -529 -827 2710 -583 -698 1993 -1238 -443 639 -998
1840 -998 916 -150 -793 1870 -1071 -656 2028 -1948 -1186 1511 -1803 -194 1080 -824 759 -236
1856 -236 -494 1449 -1109 84 2241 -1621 25 2098 -1863 -108 880 -1774 -163 -317 -551 1020
1872 1020 -982 637 1770 -2146 484 1808 -1990 710 1564 -1335 599 385 -419 287 -1150 190
1888A90L55k800L393L09l606L335j60l121L041l27j185J394j125J066k62k073
1904a576L135j058k959L933j244k757M000j018j846K117r28L99k82q99K679j792
1920i6j669M404k809k116M411k333k092K949p40j10L23m90J880k468k74M142l638
1937g26p59M939l867j712L595j694p11R09j46R35k391J112L098m445Q69M749m559
1954h04o24M049k763j048J375j83J01j864J664J858m872J983M258n057J071M154
1970C298l613l94J657n62n5j203J967P97m924K504K815n451K262L770m109M71
1986g70J753j105r6n54K220M30l774K869J595n413K473K401l949J487J579j683
2002e37K41p50J359L31l007L246J197m504K850J372l567K384Q92j710R74j490
$$ plain form
1888 190 545 -2255 1138 1447 -2159 1176 1016 -2105 936 609 -576 818 -307 759 497 -1576
1904 -1576 1559 501 -2458 1475 231 -2526 1474 456 -1390 727 -201 198 -84 -983 1696 -96
1920 -96 -1765 2639 -170 -2286 2125 -208 -2300 649 -91 -201 122 -368 1512 -956 -1230 2912 -726
1937 -726 -1485 3454 -413 -2125 1470 -224 -935 -26 -172 763 -1628 -516 2582 -1863 -994 3755 -804
1954 -804 -1428 2621 -142 -1190 185 2 103 -1761 -97 1761 -3111 -1128 3130 -1927 -856 3298
1970 3298 -315 -709 948 386 331 -872 1095 1892 -3032 -528 2287 -3164 -902 2868 -1241 -770
1986 -770 983 -122 -218 -772 1448 1878 -1896 973 2568 -2845 -372 2029 -1920 -433 1146 -537
2002 -537 -296 -1046 313 644 -2363 883 2080 -2424 426 1798 -1769 615 1507 -203 771 -719
2018g19N07O33k688K948R64l603K480R0k895K452J8o54K197j945P69R27l179J945
2036B47O41k560K195N2j918K028j431l09K240k467J232J859l204J359J231k354
2052a159J639k06q06J520k543P40K226l173K036K519l781J100J148k458P09K58
2068b31K96J256k621J660J414m447K445K490l795J714K107k229J39k05L20M1k861
2085b507K773J179m512K923K221m478J957K384k237K48p1N52j90k405L198P64
2101A799m747L228J517n090K485K334j958P87M41Q97o74k778K987Q0m384M046
2117I70J369m418K632J113k528L72J20J103k65j816L235o13m350L875O33l970
2133b538K694R43k249R11k79J083k26j930K986r67l955L664L34l069L324Q75j471
$$ plain form
2018 -719 -212 421 -2267 681 1645 -1958 522 612 -2283 169 187 -467 1730 -215 554 1481 -1698 247
2036 247 888 -1672 523 575 -1343 685 -746 -1055 1185 -1282 -50 1809 -1395 -36 1195 -1159
2052 -1159 480 274 -532 988 -1555 -815 1411 -1762 274 2793 -988 112 1260 -1198 -489 -231
2068 -231 65 1321 -1300 360 1774 -2673 -228 2262 -1533 181 2288 59 198 -7 313 354 -2507
2085 -2507 266 1445 -3067 -144 2077 -2401 -444 1940 -297 -49 -120 432 242 -2163 1035 1799
2101 1799 -2948 280 1797 -3293 -808 1526 -432 355 796 1693 1019 -1759 1228 1308 -3076 970
2117 970 2339 -2079 553 1666 -862 -490 -370 733 468 -1348 1887 1274 -3076 799 1432 -2538
2133 -2538 156 1099 -1150 -239 -518 565 339 -1591 1395 428 -3527 137 471 -2598 726 1601 130
2150A30P44q24R09m42k078L585l04l196L386q50l756K192j5o10J559l69J539n70
2168A030k348L159n73k967L524q63k861K025o63m97R49j028J545o63k459L211
2184E21k78k258L986l09k273J685j395m94N20j054K419p7k297L199j243k957K991
2201F86p05j336K267p52L13K39j854K214n31k201L353r88k426K985q26j004J852
2218A286j425J24l02j878K330o3j671L599r97k114K187j262q27J626j220J296
2234F89K42k082K181j044k226K996j044j493K892q96l54J229j522J181m38j989
2250a678K532j007j703L162r60j060K232j506l74N96j478J833N7j469L004j412
2266G69k196K608j742j101K517j197K79J021j465J585q61j714K673j699j241L266
$$ plain form
2150 130 874 50 959 517 -1561 2024 1720 -1476 1910 1060 -2696 -504 -519 -1129 430 61 1600 1030
2168 1030 -1318 1841 1268 -1699 1825 962 -1899 126 -537 -1034 -85 -1113 432 -231 -2690 521
2184 521 243 -2015 1971 1662 -611 1074 -321 -815 -295 -1349 1070 993 -1304 1895 652 -2305 686
2201 686 -19 -1355 912 160 473 712 -1142 1072 541 -1660 1693 705 -1721 1264 438 -566 1286
2218 1286 -139 -15 -317 -2195 135 72 -1599 2000 1003 -1111 1076 -186 -1013 613 -607 689
2234 689 931 -1151 1030 -14 -2240 756 -288 -1781 1111 215 -139 1090 -432 749 311 -1678
2250 -1678 854 -153 -1856 1306 346 -714 1518 12 -362 234 -1244 589 646 -823 2181 769
2266 769 -1427 1181 -561 -1662 855 -342 -63 958 -507 1078 217 -1497 1176 -523 -1764 1502
2282A502j639o63K270j843J51M53j565J788p02q19K750j635q06K667k529m67J829
2299G42j832P85R63j094J547q44j140K112k113l89K931k341N77J963k334O96O11
2316H40j810J116q77m30K216j796M30K115k744P99J522k603J195J151j545J474
2332A053n66p03J276k267N37J278k681J705J548k432J875N14k218J472m84n79
2348f72J495j398R58R17k539J979J91k965K114K32k071K230mp65J321j424N39
2365A38K53j975K536K0k103K965m16k130K137j012j304J185j173P79K44j395K275
$$ plain form
2282 1502 -137 -800 1470 -373 -222 231 -1334 454 -248 -1067 1683 48 -758 1909 -620 -1087 742
2299 742 -1090 -305 658 -436 1111 267 -873 1239 -874 -1263 1668 -673 -96 1867 -467 229 840
2316 840 -970 146 -731 -1161 1055 -741 -311 1804 -940 -141 1381 -1222 -27 1124 -421 1053
2332 1053 487 -216 1060 -1207 -670 608 -2073 -368 1180 -1252 623 1137 -1081 391 -93 -672
2348 -672 823 -575 383 1300 -1239 740 931 -2034 80 312 -1759 471 467 -298 1023 -401 138
2365 138 391 -1584 952 972 -1131 1834 1418 -712 1425 413 -891 294 -879 -100 144 -1251 1024
$$ [...]
8191f3
##END NTUPLES=NMR FID
##END=
