##TITLE=1H_DE-80H_X3
 200.13MHz, d2o
 8 sc
 
 19ns.26.2.2025
##JCAMPDX= 6.0         $$ Bruker NMR JCAMP-DX V2.0
##DATA TYPE= NMR FID
##DATA CLASS= NTUPLES
##ORIGIN= UXNMR, Bruker Analytische Messtechnik GmbH
##OWNER= pz
$$ XWIN-NMR		Version 3.5
$$ Wed Jun 25 11:24:44 2025 Russian Standard Time (UT+4h)  Yarkov@DPX200
##.OBSERVE FREQUENCY= 200.1313
##.OBSERVE NUCLEUS= ^1H
##.DELAY= (6, 6)
##.ACQUISITION MODE= SIMULTANEOUS
##.ACQUISITION SCHEME= undefined
##.AVERAGES= 8
##.DIGITISER RES= 18
##SPECTROMETER/DATA SYSTEM= spect
##.PULSE SEQUENCE= zg30
##.SOLVENT NAME= CDCl3
##.SHIFT REFERENCE= (INTERNAL, CDCl3, 0, 14.3821)
##AUDIT TRAIL= $$ (NUMBER, WHEN, WHO, WHERE, WHAT)
$$ ##TITLE= Audit trail, XWIN-NMR		Version 3.5
$$ ##JCAMPDX= 5.01
$$ ##ORIGIN= Bruker BioSpin GmbH
$$ ##OWNER= Yarkov
$$ C:/Bruker/XWIN-NMR/data/yarkov2/nmr/H-C/1/audita.txt
$$ ##AUDIT TRAIL=  $$ (NUMBER, WHEN, WHO, WHERE, WHAT)
(   1,<2025-06-25 11:22:57.73 +0400>,<Yarkov>,<DPX200>,
      <created by zg, POWCHK disabled, PULCHK disabled
       configuration hash MD5:
       00 E9 B6 7A A2 85 ED C7 34 08 36 98 17 FE 4E 26
       data hash MD5: 16K
       8A FE E4 50 64 9F 12 BC B6 10 F6 65 7B 0A 7D 89>)
$$ ##END=
$$ 
$$ hash MD5
$$ 3B 9C 39 66 65 AB F1 7D 0F 48 09 C3 D3 AB F4 3E
##$RELAX= 
##$RELAX= 
##$RELAX= 
##$RELAX= 
##$RELAX= 
##$RELAX= 
$$ Bruker specific parameters
$$ --------------------------
##$DU= <C:/Bruker/XWIN-NMR>
##$EXPNO= 1
##$NAME= <H-C>
##$PROCNO= 1
##$TYPE= <nmr>
##$USER= <yarkov2>
##$AMP= (0..31)
100 100 100 100 100 100 100 100 100 100 100 100 100 100 100 100 100 100 
100 100 100 100 100 100 100 100 100 100 100 100 100 100 
##$AQSEQ= 0
##$AQ_mod= 1
##$AUNM= <au_zg>
##$AUTOPOS= <>
##$BF1= 200.13
##$BF2= 200.13
##$BF3= 200.13
##$BF4= 200.13
##$BF5= 200.13
##$BF6= 200.13
##$BF7= 200.13
##$BF8= 200.13
##$BYTORDA= 1
##$CFDGTYP= 0
##$CFRGTYP= 5
##$CHEMSTR= <none>
##$CNST= (0..31)
1 1 145 1 1 1 1 1 1 1 1 1 1 1 1 1 1 1 1 1 1 1 1 1 1 1 1 1 1 1 1 1 
##$CPDPRG= <>
##$CPDPRG1= <>
##$CPDPRG2= <>
##$CPDPRG3= <>
##$CPDPRG4= <mlev>
##$CPDPRG5= <mlev>
##$CPDPRG6= <mlev>
##$CPDPRG7= <mlev>
##$CPDPRG8= <mlev>
##$CPDPRGB= <>
##$CPDPRGT= <>
##$D= (0..31)
0 0.7 0 0 0 0 0 0 0 0 0 0.03 0 0 0 0 0 0 0 0 0 0 0 0 0 0 0 0 0 0 0 0 
##$DATE= 1750836177
##$DBL= (0..7)
120 120 120 120 120 120 120 120 
##$DBP= (0..7)
150 150 150 150 150 150 150 150 
##$DBP07= 0
##$DBPNAM0= <>
##$DBPNAM1= <>
##$DBPNAM2= <>
##$DBPNAM3= <>
##$DBPNAM4= <>
##$DBPNAM5= <>
##$DBPNAM6= <>
##$DBPNAM7= <>
##$DBPOAL= (0..7)
0.5 0.5 0.5 0.5 0.5 0.5 0.5 0.5 
##$DBPOFFS= (0..7)
0 0 0 0 0 0 0 0 
##$DE= 6
##$DECBNUC= <off>
##$DECIM= 32
##$DECNUC= <off>
##$DECSTAT= 4
##$DIGMOD= 1
##$DIGTYP= 9
##$DL= (0..7)
0 120 120 120 120 120 120 120 
##$DP= (0..7)
150 150 150 150 150 150 150 150 
##$DP07= 0
##$DPNAME0= <>
##$DPNAME1= <>
##$DPNAME2= <>
##$DPNAME3= <>
##$DPNAME4= <>
##$DPNAME5= <>
##$DPNAME6= <>
##$DPNAME7= <>
##$DPOAL= (0..7)
0.5 0.5 0.5 0.5 0.5 0.5 0.5 0.5 
##$DPOFFS= (0..7)
0 0 0 0 0 0 0 0 
##$DQDMODE= 0
##$DR= 18
##$DS= 0
$$ [...]
##$SUBNAM2= <"">
##$SUBNAM3= <"">
##$SUBNAM4= <"">
##$SUBNAM5= <"">
##$SUBNAM6= <"">
##$SUBNAM7= <"">
##$SUBNAM8= <"">
##$SUBNAM9= <"">
##$SW= 18.0517328524113
##$SWIBOX= (0..15)
0 0 2 0 0 0 0 0 0 0 0 0 0 0 0 0 
##$SW_h= 3612.71676300578
##$TD= 16384
##$TD0= 1
##$TE= 0
##$TE2= 300
##$TE3= 300
##$TEG= 300
##$TL= (0..7)
0 120 120 120 120 120 120 120 
##$TP= (0..7)
150 150 150 150 150 150 150 150 
##$TP07= 0
##$TPNAME0= <>
##$TPNAME1= <>
##$TPNAME2= <>
##$TPNAME3= <>
##$TPNAME4= <>
##$TPNAME5= <>
##$TPNAME6= <>
##$TPNAME7= <>
##$TPOAL= (0..7)
0.5 0.5 0.5 0.5 0.5 0.5 0.5 0.5 
##$TPOFFS= (0..7)
0 0 0 0 0 0 0 0 
##$TUNHIN= 0
##$TUNHOUT= 0
##$TUNXOUT= 0
##$USERA1= <user>
##$USERA2= <user>
##$USERA3= <user>
##$USERA4= <user>
##$USERA5= <user>
##$V9= 5
##$VALIST= <valist>
##$VCLIST= <CCCCCCCCCCCCCCC>
##$VD= 0
##$VDLIST= <DDDDDDDDDDDDDDD>
##$VPLIST= <PPPPPPPPPPPPPPP>
##$VTLIST= <TTTTTTTTTTTTTTT>
##$WBST= 1024
##$WBSW= 4
##$XGAIN= (0..3)
0 0 0 0 
##$XL= 0
##$YL= 0
##$YMAX_a= 79595
##$YMIN_a= -56787
##$ZGOPTNS= <>
##$ZL1= 120
##$ZL2= 120
##$ZL3= 120
##$ZL4= 120
##$ABSF1= 10
##$ABSF2= 0
##$ABSG= 5
##$ABSL= 3
##$ALPHA= 0
##$AQORDER= 0
##$ASSFAC= 0
##$ASSFACI= 0
##$ASSFACX= 0
##$ASSWID= 0
##$AUNMP= <proc_1d>
##$AZFE= 0.1
##$AZFW= 0.1
##$BCFW= 1
##$BC_mod= 2
##$BYTORDP= 1
##$COROFFS= 0
##$CY= 83.5205535888672
##$DATMOD= 1
##$DC= 2
##$DFILT= <>
##$DTYPP= 0
##$F1P= 10.8118882576601
##$F2P= -7.23987719738617
##$FCOR= 0.5
##$FTSIZE= 0
##$FT_mod= 4
##$GAMMA= 1
##$GB= 0.15
##$INTBC= 1
##$INTSCL= 1
##$ISEN= 128
##$LB= 0.25
##$LEV0= 0
##$LPBIN= 0
##$MAXI= 10000
##$MC2= 0
##$MEAN= 0
##$ME_mod= 0
##$MI= 1.114404
##$NCOEF= 0
##$NC_proc= 0
##$NLEV= 6
##$NOISF1= 3.799351
##$NOISF2= 2.8
##$NSP= 1
##$NTH_PI= 0
##$NZP= 0
##$OFFSET= 14.38212
##$PC= 1
##$PHC0= -1721.113
##$PHC1= 8.566601
##$PH_mod= 1
##$PKNL= yes
##$PPARMOD= 0
##$PSCAL= 0
##$PSIGN= 0
##$REVERSE= no
##$SF= 200.129724274929
##$SI= 16384
##$SIGF1= 3
##$SIGF2= 2
##$SINO= 400
##$SIOLD= 16384
##$SREGLST= <1H.CDCl3>
##$SSB= 0
##$STSI= 0
##$STSR= 0
##$SW_p= 3205.1282051282
##$SYMM= 0
##$S_DEV= 0
##$TDeff= 0
##$TDoff= 0
##$TI= <>
##$TILT= no
##$TM1= 0
##$TM2= 0
##$TOPLEV= 0
##$USERP1= <user>
##$USERP2= <user>
##$USERP3= <user>
##$USERP4= <user>
##$USERP5= <user>
##$WDW= 1
##$XDIM= 8192
##$YMAX_p= 0
##$YMIN_p= 0
$$ End of Bruker specific parameters
$$ ---------------------------------
##NTUPLES= NMR FID
##VAR_NAME=  TIME,          FID/REAL,        FID/IMAG
##SYMBOL=    X,             R,               I
##VAR_TYPE=  INDEPENDENT,   DEPENDENT,       DEPENDENT
##VAR_FORM=  AFFN,          ASDF,            ASDF
##VAR_DIM=   8192,          8192,            8192
##UNITS=     SECONDS,       ARBITRARY UNITS, ARBITRARY UNITS
##FACTOR=    0.0002768,     1,               1
##FIRST=     0,             0,               0
##LAST=      2.2672688,     0,               0
##MIN=       0,             -56787,          0
##MAX=       2.2672688,     79595,           0
$$ Real data points
##PAGE= N=1
##DATA TABLE= (X++(R..R)), XYDATA
$$ [...]
963h35K388k128K83m24l50L194k314j849L990p44j619N78q68K213n53m144K936
980b46J765k905Q01L9P47J819l200O86L382k806o23R07j272J763j162k319L036
997D12l62j215J942j256R20J883l087Q20J980k087K88j002p82L037k218k129L404
1014E48k73q22O62r53K657P4l870K555J554k525L06o96N21J783l211K56L121k180
1032d93k33J013r28K122r03k228K784m08j316J375j766O63J715k968O88J841j604
1049f46R22p76o74L286j745k108K831m80o14J62j728K395K40l681K158J651j801
1066f08N83p40Q06K293l057N3K863j865k98M70j240J981r97k283K506l17j072
1083i22J446j677Q37J926k734P05J536j502R64r61j093L022j692k078K276k24
$$ y = [-835, 1553, -575, -292, -716, -1066, 2128, -186, -2035, 1955, 1211, -408, 170, -698, 1515, 962, -3182, -246, 1519, -1386, -585, -546, 201, 2020, -1180, -494, 2888, 82, -541, 366, -906, 857, -305, -2624, 412, 50, -1165, 777, -479, 441, 2324, -763, 57, 2037, -50, 238, -764, -1546, 1491, -727, -2856, 548, 275, -547, 115, -838, 1819, 1893, -1977, 578, 2132, -393, -87, -783, -262, 1521, -1690, -1434, 1687, -493, -726, 287, -641, 1481, 578, -1650, 1134, 726, -590, 785, -981, -318, 1397, -1571, -883, 958, -646, 276, -500, -1174, 2112, 367, -1741, 1090, 610, -4, 158, -1570, 825, 1065, -2616, -458, 1193, -608, -25, -765, 41, 2334, -723, -670, 2193, 328, 30, 500, -740, 1241, 244, -2039, 467, 150, -922, 524, -1153, -316, 1610, -1124, -419, 1117, -385, 579, -382, -1475, 1547, -145, -2223, 53, -171]
1099a71k23L03j687K635Q34l314J965J571j512O03j255N34K126k982m06K472j598
1116a05J03L13j192K308o21k105K398l62r45J082j904P00J541k572L87J051j180
1133a103J291q92j037L092j124j812K137l91J32R1j986K191P74l271J434J180
1149G06j106O62j180O07K475k568k80K416j330K80L5j384K111p23k147J954m77
1166E1q26J212j781O88J773k221N04R97j136J432j033j246K775j010j748J668
1182I9m17K92L04k083K215J069k776J213J034p88Q17j510L25K334k457n63J942
1199A050j140L15k5j314K177m30j822J981m35n51J238j774N46J534k161L78P04
1216B71j065J473q96j202K676p18j404J545n95M80K92k351J822J017k619Q34O32
$$ y = [-171, -394, -91, -1778, 857, 1691, -1623, 342, 1913, 401, 1004, -251, 283, 2409, -573, -979, 1493, -105, -2, 311, -881, 1427, 806, -1299, 1099, 737, -208, 874, -1030, -330, 1211, -1361, -974, 77, -1103, 188, -704, -1741, 1351, 227, -1585, 552, 161, 293, 384, -1602, 589, 1363, -1908, -474, 706, -400, 262, -918, -311, 2164, -404, -684, 1732, 402, 682, 717, -667, 1444, 721, -1426, 528, 51, -775, 437, -1344, -656, 1117, -1104, -600, 397, -739, 693, -340, -1586, 1189, 179, -1569, 99, -318, -26, 278, -1805, 410, 1479, -1297, -84, 950, 162, 979, -531, -206, 2128, -329, -892, 1050, -90, 225, 200, -1114, 1063, 633, -1189, 792, 357, -194, 1044, -730, -184, 1350, -811, -433, 271, -794, 679, -217, -1419, 1257, 539, -865, 680, 85, 565, 857, -1494, 328, 1345, -1274, -440, 192]
1233A92n11J018j517J58K417k073m91J698j112N73k72j403K116m44j632J797l75
1250A39l70J220j657N41J493j909L57L93j037J440j007j232K404n03j152J237
1266C57n37P11N00k147J610J078k347O06L77n16J045j755J5K306j755m69J465
1283E44q15P62j98j372K003l28j647J527o14k76J185j696M97J427j604N51M03
1300C49r56J590q16j244K019n00j020R26q49Q27M15k135J342J073j810N80J56
1317e3j98J153j657m1K146j458m99J147q74Q50k74j413J884l05j500J414o12n7
1335c47J176j552N15J360j472N67K37j013J433p98j280J726m91q10Q42r36R65
1352A22O37j961J381J086j490O33j16j70J161j717k48J820j479m10Q93q04R68
$$ y = [192, -319, 699, -818, -660, 1757, -316, -807, 891, -221, 352, 80, -1323, 793, 349, -1283, 514, 139, -231, 989, -668, -127, 1366, -543, -186, 207, -830, 610, -397, -1629, 775, 272, -880, 357, -180, 531, 1031, -1116, 494, 1572, -775, -169, 208, -308, 737, -1018, -1003, 1303, -452, -921, 544, -271, 491, 293, -1079, 924, 596, -1051, 476, -138, -414, 771, -925, -428, 999, -605, -54, 349, -607, 983, 167, -1077, 942, 442, -578, 348, -501, 326, 741, -1394, -52, 1021, -789, -209, -53, -251, 902, -755, -796, 1350, -108, -607, 540, -334, 516, 242, -1171, 713, 408, -1092, 322, -290, -347, 829, -723, -208, 1152, -320, 247, 484, -529, 904, 106, -1174, 552, 61, -749, 93, -843, 122, 759, -1202, 179, 1265, -225, 408, 292, 122, 1283, -434, -682, 1138, -341, -751, 142, -662, 306]
1369C06j78j234J832j06j208J254n66n0J006j574K95J060j404N35J37r55J501
1386F51n61j115J673l47n27P82j018Q69N99k020R33Q58j401M45k74j92J385j483
1404g43j88J886j063j37P51o80R85k82j426J472k87j184J025p79O7J022j362M55
1422d68J163j106P41J73r15J380n24j240J278m99m81N48j046Q71P23j740R77R06
1440G41r41O07l32j99J349j434m34J542j067j82M87p54R89j10j278J464r1p80
1458d23R05o88O1J021j341K34R54j125O24M4r59J331n03r32J266m26k04O68j104
1477e97Q79P39j655P43O63j015N41o39k13J264j279l68J458p80O8N95o99J073
1495G78o3j246J187k06r45P77q24j09R31j292L55R12p79P51J90p10J203k68j039
$$ y = [306, 128, -1106, 726, 620, -588, 666, 100, 50, 1056, -518, -223, 837, -567, -32, 105, -850, 651, 90, -1025, 648, 301, -226, 556, -462, 407, 1006, -1014, -81, 777, -624, -179, -453, -645, 740, -743, -931, 955, -108, -245, 506, -174, 811, 529, -897, 575, 288, -896, 129, -650, -583, 439, -923, -468, 695, -411, 330, 503, -412, 968, 444, -796, 482, -17, -498, 50, -996, -125, 598, -1142, -165, 741, -200, 407, 75, -124, 1225, -209, -643, 899, -168, -350, 137, -617, 372, 262, -1016, 448, 357, -423, 482, -206, -145, 876, -465, -231, 723, -402, 222, 266, -693, 638, 135, -797, 469, 43, -161, 507, -597, 282, 1021, -634, 109, 772, -243, 298, -341, -554, 710, -569, -937, 521, -259, -191, 404, -295, 778, 715, -531, 656, 450, -495, 282, -542, -651, 280, -1012, -657, 255, -524, 227, 417, -293, 910, 642, -397]
1514c97R60o18k49N15j247P37P93j409P60P44o13P32m73k41J272j279n77J080
1532D90q30j08K95q18J079N9j030J295mn75P83p35LQ39j336J30N96r45O10J34
1552f8p24J179p8p01J054m34m5N88j238N57O94j419M56M40n80O66n25j89J316
1571I49r30m01J074p77J37J39r23R11M9j111J029K2n31P05o17J28Q86j125K27
1590a59N14r45O48p5p90J081j98p12J017l25O1O69j159O10O39j239M29J91n15
1609b58O20n77k88J224q52k61R32n91K13K42r01Q29Jj077Q70p7n71P89o65J39
1629b59R18r83K60N64q50O96r8q08R31k27o96P75m26K4O56j027M34P32j014M40
1649D2K31n59P98n75l55J161p97l96Q07o08K07K36q84Q16J21r27Q94j32l40P24
$$ y = [-397, 563, -55, -304, 211, -1036, -299, 494, -915, -155, 589, -24, 708, 235, -6, 1266, -13, -590, 490, -340, -448, -153, -971, 108, 167, -863, 432, 428, -147, 636, -99, -96, 743, -593, -463, 133, -812, -202, -68, -792, 387, 309, -392, 662, 228, 183, 771, -467, 90, 784, -635, -179, 261, -319, 347, -178, -367, 949, 19, -382, 692, -85, 52, 191, -732, 179, 228, -883, 146, 168, -363, 342, -275, -147, 739, -386, -159, 355, -590, 58, -17, -807, 274, 76, -636, 381, 56, 117, 786, -373, 237, 876, -363, 66, 257, -258, 362, -215, -503, 721, -131, -392, 540, -51, 162, 404, -497, 332, 333, -744, 126, 49, -522, 267, -398, -259, 659, -324, -64, 500, -350, 346, 248, -560, 371, 144, -552, 223, -203, -179, 477, -550, -116, 616, -398, 42, 273, -286, 512, -63, -418, 743, -54, -450, 357, -251, -44, 192, -692, 124, 245, -682, 212, 80, -260, 464]
1669D64o04M6Q03r72J87M66q56O54r3p84Q58j99m80Q18n03Q6O77j004M28O75r28
1690b61L88J21n71P84n54m38J101o26l27P46n51L24J77q05Q03J76q85P33k59m22
1710c46O51o04J7O87p97J88N17o98P08j4p52R01k98m93P23o06M7N86r30K96N90
1731C73p55L74J00m27Q74m62l79R90n20l09O21o26L32P3q95O93J09p43O92k45
1751a30k64P40n36O3O44p19K21L50q31N60j29p02P63j92l66P39l54J02O57p80
1771a64L37M56p67K15o9m76O61m93l30R62k96q2O79m66L56K09q87N65jr68N06
1792e3l26l07P40n40J30Q01n42L50L78o64N11j44q65N11k56m42N92m56J58Q13
1812C89n30K97O66p25L90p4o05N17m72n92Q14m60k9O55m01M79L27o45N55k8q47
$$ y = [464, -140, -94, 709, -263, -76, 390, -466, 188, 95, -689, 169, -30, -510, 308, -195, -109, 568, -436, -8, 667, -261, 127, 248, -323, 461, -93, -531, 570, -56, -383, 363, -188, 136, 313, -492, 311, 487, -398, 335, 76, -346, 305, -299, -282, 405, -392, -204, 313, -385, 323, 309, -443, 458, 160, -333, 390, -216, -169, 417, -513, -217, 373, -382, -8, 92, -335, 539, 77, -302, 688, 168, -141, 480, -146, 186, 259, -636, 57, 166, -577, 115, -130, -394, 346, -190, -127, 517, -202, 19, 369, -462, 98, -31, -733, 30, -162, -528, 211, -143, -41, 616, -164, 173, 629, -138, 77, 8, -468, 193, -300, -630, 332, 36, -46, 633, 167, 523, 732, -155, 410, 409, -559, -53, -379, -686, 54, -486, -356, 445, -97, 253, 631, -33, 478, 334, -531, -20, -276, -718, -126, -582, -424, 389, -141, 156, 822, 97, 487, 413, -192, 325, -147, -739, 75, -385, -414, 241, -160, 319, 646, 1, 556, 528, -319]
1833c19M81l43l82O27o16J6P59n32L80M65o74N90r5o82N73k97m23N49n18R1P07
1854C57o70L99N27o48M38n6n87O72n69m76O43l89j3M99m97M98L40n94O00J14o57
1875f9M42l90l49N32o02j00O48n70L88M54n47N70J3n45N99l75l61M84o56M1O14
1896B21p01K92M62m82N57l3m76O90m38m74O97n90q3M65o58M64L20o16O21J03n08
1917a67N99l29k93N83o00j09N97o32K01L09n81O48k1n61O70j89l95N75n15M6N44
1938C80o91K53L87n68M62l0n25P19l42l87O33m74l0M40o03M30L16p27N79Mm97
1959b71N74l25k14N85o06K6N15n45L18K26n42N01rn42N54k94k57O34o33Q0N66
1980C41n73K63L34n05M16q5n04O72l73l77N59l96M0M25n95M17K76o99N23M3n29
$$ y = [-319, 162, -181, -563, 64, -552, -536, 223, -309, 71, 536, -138, 452, 357, -325, 248, -49, -472, 77, -441, -350, 357, -313, 86, 613, -35, 403, 347, -240, 432, -137, -613, 30, -359, -372, 127, -370, 128, 468, -126, 474, 588, -69, 373, -17, -366, 166, -436, -536, 112, -458, -70, 384, -163, 407, 420, -125, 474, 99, -262, 222, -434, -393, 221, -480, -188, 274, -208, 349, 316, -160, 530, 92, -382, 315, -275, -358, 107, -551, -87, 233, -383, 238, 341, -167, 432, 103, -190, 393, -207, -316, 281, -351, -150, 159, -422, 226, 205, -356, 314, 125, -270, 305, -210, -164, 380, -311, -58, 329, -239, 223, 193, -332, 387, 45, -342, 291, -183, -213, 227, -376, 54, 370, -357, 222, 226, -271, 303, -22, -236, 349, -257, -231, 284, -261, 57, 283, -259, 242, 233, -309, 245, -49, -306, 328, -305, -225, 341, -232, 31, 365, -140, 276, 191, -313, 359, -14, -391, 168, -228, -188, 237, -358, 59, 335, -364, 159, 202, -327]
2001c27O10l86k04N41m71P8M73o08L07K54n82N46l5n62N63k00k62M80m77P9M97
2022C14n60K47K75n34M50r3m36O72k45l70O18m66M9M36o33K85K08o87N13Qm13
2043c62N70k53k03O55m79N2M39o02K68J76o24N02j06m75O00k54k26O66n36J59
2063c3M49o10L26J64n27M48j05n50O33k71k97O28m64Q9M14n30M03K11n19M68q6
2084B41m48M73l93k81O26n49K1M05m81L70K64m79N29O3m70O11l30k60M92o25K8
2105a93L09n52J59K90m52N90K4l97P39k82k27M83m57L5K76p44L08J96o60M63o4
2126a56l75O56k08p9N57l66J18L61n20L03ko48M00k32l97O16k96p7O28l93K45
2147A35N25m89K79J04o24L56k08n80M50l79k16O08k80K08M94m33M03J87n09K75
$$ y = [-327, 283, -103, -307, 234, -237, -159, 314, -294, 13, 267, -315, 231, 196, -366, 197, -3, -265, 215, -262, -183, 314, -246, 1, 276, -258, 192, 99, -337, 335, 90, -280, 338, -128, -79, 357, -276, 9, 217, -470, 43, 51, -362, 208, -45, -248, 407, -72, -20, 419, -183, 85, 261, -363, 139, 33, -442, 158, -96, -322, 344, -192, -33, 416, -194, 132, 296, -231, 217, 112, -438, 195, -76, -373, 255, -209, -120, 294, -236, 167, 378, -141, 327, 241, -207, 266, -127, -408, 218, -331, -310, 95, -386, -16, 248, -231, 298, 361, -109, 502, 172, -88, 404, -221, -193, 116, -436, -277, 13, -439, 151, 175, -222, 517, 235, 8, 491, 34, 69, 345, -399, -91, 105, -555, -92, -156, -531, 125, -83, -162, 395, 29, 147, 508, -12, 291, 289, -359, 41, -191, -588, 28, -268, -345, 283, -110, 135, 660, 171, 450, 554, -70, 286, 78, -502, -52, -431, -647, -39, -319, -111, 383, -50, 353, 540, 31, 306]
2167C06j93n27M85m32k12N22m55J85N97m29L60K45n66N19j72m65M29l35k12N32
2187A82l59J29M52m69L60J34n09L50j53m42L94k85j28N30l73R1M27m98M08N7n26
2208b28L54k27l39M78l13j72N48m03K06M11n12L75J13n25M11r3m03N11l04j42
2228b54N87m60J63L71m75K53J41m86L94j39m18N28k67j96M86l67J04L15m79K36
2248C7J17n13L88o6k70N10l23j60N17m18J55L69n75K71J32m72M20m5l72N25l00
2269g3j28M34l46J43K51n04L20J47m96N60j61l33N29l85q9L66m89J55K25m61K66
2290f9J62l94M52l1k95M94k13j44M00m20L3K60n79L37O0m93M47k2k90N19k03q0
2312f9N05m63J24K71n44K22P3m04L13j84k29M46k07m8M50l81K20L59n21L48J4
$$ y = [306, 113, -414, 71, -361, -573, -51, -506, -321, 276, -153, 207, 452, -114, 405, 233, -232, 197, -138, -350, 182, -177, -48, 404, -65, 295, 429, -80, 270, 117, -325, 69, -216, -344, 186, -187, -96, 331, -167, 241, 298, -228, 126, -101, -440, 38, -275, -447, 101, -302, -96, 315, -197, 178, 291, -234, 177, 84, -319, 192, -112, -254, 333, -127, 36, 407, -68, 185, 326, -160, 234, 95, -323, 205, -62, -258, 228, -139, -35, 280, -199, 37, 154, -359, 29, -37, -307, 203, -120, -280, 237, -181, -26, 343, -232, 39, 171, -301, 119, 74, -298, 227, -73, -201, 233, -113, 30, 281, -223, 97, 244, -252, 308, 147, -186, 343, -42, -131, 235, -254, -99, 126, -335, -69, 93, -301, 151, 120, -175, 319, 106, -38, 362, -58, -25, 235, -344, -7, 53, -440, 7, -15, -305, 214, 11, -69, 436, -27, 97, 368, -176, 46, 119, -285, 28, -156, -385, 61, -146, -194, 256, -125, 95, 454, -67, 281, 295]
2333B95m34L10j82l72M23l04j09M76k99J26M67l56K55J37m89L15j58l95L17l80
2353c57q7M53l06J55L31k98L33J19l47K22m6m21M14l09j08L85m11K17L17l60K61
2374A57O9l84L52r5k98L37l12n0L72l05J43K51m22L74L6m13M04k35k86L85k27
2395a47j36M34l58J68L26l90K27Q7l35L33j66k48L71l01j28M05l58J53L25m32
2415a70L23O0l64L63j46k75L41k02j04K84l35J13K92l84K75K1k57L91p9k81L87
2436B53k63j47L18l52O6K21l50K27J34k43L11r4j96M18l22n8L37m85J67J57l73
2457b74L58Lk75L29l7k10L79k95k1K21m04J48J90l91K88M3k77M15j00j88L94l09
2479a3n2L30m32J62J61m05K76K5k75L14j42j65M37k60m5L20l37R6J87l20K79j2
$$ y = [295, -139, 171, -11, -383, 40, -264, -373, 103, -196, -70, 397, 41, 296, 433, -56, 259, 101, -294, 23, -357, -444, 9, -297, -142, 189, -109, 224, 343, -4, 218, 172, -249, 165, -144, -252, 133, -278, -61, 256, -104, 157, 226, -158, 194, 99, -199, 138, -174, -224, 148, -157, -14, 237, -185, 189, 225, -188, 216, -19, -305, 80, -147, -283, 151, -207, -39, 287, -103, 124, 211, -124, 209, 43, -205, 166, -135, -263, 142, -216, -63, 262, -170, 153, 213, -151, 212, 66, -209, 132, -70, -174, 110, -225, -112, 180, -204, 71, 92, -165, 226, 147, -134, 253, -10, -157, 161, -191, -125, 96, -254, -27, 107, -136, 175, 81, -115, 303, -19, -77, 260, -225, -58, 99, -274, 84, 87, -188, 141, 104, -106, 273, -22, -43, 178, -226, -78, 112, -279, 9, 52, -225, 190, 90, -98, 296, -13, -65, 265, -167, -5, 156, -249, 27, 52, -223, 91, -51, -216, 221, -39, -84, 236, -101, -5, 182, -138, 141, 129]
2501A29l23M12k27k21L31j97p7K80l39J90K08l27L14Qk85L03j72j78K97k60m6
2522a80L23l45K00J63l47K64J9k84L12r4k48L52k14j11L86l31J24K12k92K24K6
2543A59l39L28j20j95L27k30RK11k66J15J39k73K41N9l35K83j07j78K48k01J7
2564a08K59k29P9J59l15K69K3l09L23j39j68L39l41N1K90l17J15J22k96J87J35
2585A29m00L74r3j06L43k13K1K17l23L7J58l50J85Jk28K98k0j48L26j86K4L08
2607C54l49N7R2k87J09Jl04L12r9j43L42j75RK93l24K04J00l25J80k4k83K95j35
2630a00q9L21k18LK87l19J49J33k37J53P3k62L04k02j32L27k93j2K58l30J69J47
2652A30l47K80K6k87L66r9j83K83j84q1K29l05J12J30l36K70n6j42K81p8j48L52
$$ y = [129, -194, 218, -9, -230, 101, -96, -173, 107, -232, -42, 166, -161, 153, 161, -124, 179, 7, -171, 126, -134, -180, 143, -202, -2, 161, -186, 78, 97, -187, 125, 31, -217, 135, -79, -190, 196, -135, -11, 201, -91, 133, 159, -180, 148, 28, -167, 160, -70, -61, 150, -116, -1, 138, -135, 106, 165, -170, 113, 6, -172, 76, -125, -108, 151, -78, 1, 160, -155, 114, 137, -172, 151, 12, -156, 183, -158, -107, 183, -134, -19, 103, -193, -6, 129, -271, 103, 10, -96, 247, 34, 55, 272, -51, -14, 144, -206, -21, -20, -248, 50, 30, -118, 208, 22, 46, 354, 5, 62, 154, -133, -24, -23, -327, -15, -114, -257, 85, -90, -81, 212, -112, 92, 192, -133, 47, 23, -260, 35, -100, -189, 132, -86, -83, 204, -115, 34, 167, -70, 83, 156, -106, 198, -4, -136, 191, -102, -114, 144, -186, -17, 130, -217, 63, 89, -198, 168, 69, -114, 169, -15, -96, 133, -172, -60, 70, -266, 4, -52, -194, 87, 9, -139, 213]
2674B13k46M3K08k44M3J39k86K47m6l05L45j52j31K84k23L6K46k61J56J22k39
2695e1J49o1k40K68j52j55K02j89Q8K65k86K35J39k64K63n1k60K14j92j21K74
2716G5k96%K97k10J63J35j73J87m9j60J86j63j99K95k77K1J59k04J64J32k04K30
2738A09M2k15L10k14j28K80k72m5K06l32K83J08k92K40K0j51K06j75n5K21k70
2759a24M2K55l47J51J48k86K45K9j79K49j58j65K88k39pK50k90J23J73l20K45
2780H3k6j33K65k25k4J68k31K4K15k51R7J46k47J93N7k54L03j58j22K65k50J0
2802i5K08l14Q1J76j52K16n9j28K77p0j59K15k58N9J37l13R9R1j81K19j8j67L39
2825B03k12j3K31k48j1K11l48K10N6k91K37jj74L04j81p7K94k71L1J53k67Q1J63
$$ y = [213, -33, 10, 218, -26, 17, 156, -130, 117, 71, -234, 111, -41, -172, 112, -111, -75, 171, -90, 66, 188, -51, 98, 37, -203, 65, -87, -242, -40, -229, -141, 124, -162, 73, 212, -52, 211, 160, -100, 114, -78, -199, 75, -221, -221, 76, -134, 29, 164, -9, 178, 129, -31, 155, -8, -207, 88, -189, -168, -9, -213, -49, 83, -121, 109, 151, -64, 246, 32, -96, 184, -88, -133, 73, -259, 24, 132, -160, 80, 100, -51, 155, -20, -75, 146, -124, -82, 173, -174, -23, 125, -161, 84, 113, -66, 183, 25, -140, 148, -91, -98, 152, -138, -15, 158, -162, 83, 57, -76, 189, -36, -60, 108, -123, -99, 116, -135, -38, 108, -139, 54, 111, -143, 160, 2, -120, 145, -105, -95, 113, -201, -120, 56, -96, 120, 61, -67, 210, 140, -19, 196, -62, -3, 134, -179, -80, 11, -170, 49, 31, -136, 203, -9, -22, 209, -39, -50, 161, -187, 23, 79, -212, 25, 24, -150, 154, -27, -104, 190, -81, -50, 103, -164, -83, 80]
2848H0k50K19K1j96L22j75j6J49k68J51R1j80Q0Q2k34J91Pj41K41k41L0J46k40
2871a31j5J75j84J38J31k22J59L3j63K04j22q7K01j89J6J66k34R5J47k38K61n6
2893H5j70K17p7j13K06j91L4J42k77J89O0k44K19j2j32J84j09j19J78j74M9J63
2915A08k10J85M3j84J87n7k29K89j53j04K30j78k9K04k04Q5J03j60K16j14j61
2936a33K40j27p5J69j36J0K02k40J17P2k12K08o7j42K13j67o1K61k12NJ70j92
2958i7J04J01k46K79r2j61K43j65j5K12k45J20J07k71J88N5k88K39l8j36K07j76
2980g5MJ98j82J9J70k59J17Q3k03K26n7j81K81j21q5K71k78Q8M3j24J52j2k25
3003a50J80J8j75K35j63l7L18l01R0J58l03R9J01k71K46k3j22J95j86K8K35k09
$$ y = [80, -170, 49, 70, -126, 196, 21, 5, 154, -114, 37, 128, -52, 28, 110, -124, 67, 74, -67, 174, -67, -37, 109, -131, -146, 29, -155, -17, 114, -108, 51, 84, -79, 125, 3, -84, 117, -72, -56, 110, -124, -29, 118, -120, 141, 85, -85, 132, 55, -58, 148, -43, -9, 133, -144, 45, 105, -139, 80, 68, -64, 120, 11, -108, 70, -104, -55, 108, -102, 83, 126, -58, 129, 72, -157, 132, -21, -125, 105, -73, -102, 102, -102, -17, 86, -74, 142, 28, -133, 107, -20, -95, 74, -62, -52, 150, -90, 27, 99, -113, 95, 28, -114, 99, -68, -129, 132, -80, -75, 95, -97, 7, 108, -138, 141, 49, -112, 131, -34, -49, 163, -82, 38, 145, -126, 62, 117, -171, 68, 30, -106, 101, -75, -71, 127, -55, -36, 134, -125, -8, 75, -128, 98, 41, -140, 141, 20, -65, 206, -72, 16, 59, -65, 87, 75, -150, 30, 48, -127, 108, -55, -92, 226, -75, 15, 173, -130, -31, 70, -201, 45, 22, -100, 95, -91, -63, 172, -37]
3025c7m2K00k54J33N8k00K39n7k11L01j91m4K25k28J23O9k51J68R1j88J89r2r5
3048i4J60j08k0J49j95N9J36j94J58L9k36K64l9j64J50j23LJ38k03R9J24k27J83
3071E9jj60J90r4j23K96k25m4K12k10Q9J28j56L9J26k24K10o9j52K74k16j7K20
3094A52k20Q3J18k95K31j2j92K28q2p1K02k76N3J91k20O7J39k48J49R5k30K40
3116A02j30q9K52k27O8J76k38J12P4j99J36M0k08K32r3j10K20j72m4J77k18P2
3138f7J83k17J99j8j96J79n5n5R3j16K0K05k28J7J62k26J27L7j85K24j18n4J96
3161A07j05J1P6j86J12L6j65J41J5j29K13o4j51K77j88j4J27j57M5R0k19J57M5
3184G4k13L01j45r0J96j16mJ59k11M3N4j97J66k4j32K12m0j55K04j66l5K21j76
$$ y = [-37, -79, 121, -133, 0, 58, -142, 97, 40, -171, 130, -61, -105, 120, -108, 15, 84, -167, 1, 92, -96, 93, 1, -94, 66, -42, -62, 87, -108, -49, 87, -107, 51, 90, -146, 118, 79, -85, 65, -58, -55, 83, -120, -21, 103, -124, 59, 58, -102, 88, -6, -129, 167, -58, -102, 110, -100, -11, 117, -39, 0, 126, -98, 112, 43, -109, 165, -51, -68, 152, -68, 15, 133, -162, 69, 57, -135, 93, 11, -60, 142, -134, -81, 110, -110, -43, 96, -152, -3, 92, -138, 102, -28, -117, 135, -92, -24, 152, -86, 26, 100, -99, 37, 77, -131, 101, 8, -102, 118, -54, -98, 79, -139, -67, 116, -101, 98, 80, -116, 63, 8, -47, 46, -70, -50, 155, -73, -56, 106, -120, 7, 44, -141, 83, -35, -89, 107, 2, 13, 89, -97, 15, 51, -114, 27, 42, -87, 126, 62, -89, 188, 0, -14, 113, -44, 1, 91, -128, 29, 74, -139, 162, 17, -73, 123, 7, 3, 162, -49, -6, 48, -149, 17, -7, -139, 73, 33, -122, 82, -84, -119, 102, -74]
3207g4Q8R6k39J96Oj48J89q4j17J69q5l5J54j56Q1P3j89J65L3j86J61o6r6J72
3231A08j42p9J49r2N0Q5j65J37N4j74J03J3j77J90j76J2J82k27J48L9j24J78j1
3254H1j40J53qj40J68j48M2J62k04P9O2j45J09rj77K32p7q1J22j58O3J01j13M2
3278A6O6j42J83l5k20J68j09j03J86o7m5J05n7P0J66k19J04M3j76J78j18j48K83
3301A29j51j9J50j60R1N3j05J83k7k25J66q1p4J15j15L6J38k19J24N6j22Q9l2
3324@j06K00r4o7J48o9n2J80j68KJ14j79J52%j15J25q4n0J49o2l3J14r5K1Q1j52
3350d0J28k9j72J90o8j29K38k07O5J18j52L9J64j63P6n0j54K22j28l0K04j73M3
3373hN3j62J45L5j48J36k9p2J23o8n3J68j71QJ21j64J23K6j38J19k0j51J81m8
$$ y = [-74, 14, 110, -129, 67, 73, -75, 114, 30, -87, 82, -3, -38, 116, -40, 41, 114, -75, 90, 123, -63, 98, 32, -64, 108, -34, -113, 36, -56, -6, 79, -86, 51, 105, -69, 34, 47, -130, 60, -116, -104, 78, -149, -1, 38, -86, 92, 81, -59, 94, 86, -54, 114, -34, 8, 170, -34, 45, 107, -38, 71, 62, -115, 117, 40, -41, 81, -77, -14, 87, -26, 16, 82, -60, 123, 88, -132, 36, -73, -176, 10, -57, -102, 3, -54, 16, 182, -37, 67, 110, -66, 112, -6, -154, 129, -22, -41, 109, -51, 40, 93, -12, 171, 144, -81, 85, 4, -70, 45, -70, -34, 104, -115, 9, 65, -57, 32, 0, -106, 94, 0, -67, 81, 12, -40, 140, -28, -26, 88, -91, 61, 61, -54, 71, -13, -63, 86, 24, -9, 105, 10, 31, 112, -40, 88, 59, -113, 77, 9, -120, 118, -89, -24, 94, -58, -19, 145, -18, 58, 8, -146, 76, -52, -82, 122, -51, -8, 45, -117, 28, 63, -85, 51, 22, -50, 73, 5, -48, 120, -51, -43, 78, -86, 37, 63, -75, 44, 24, -127, 54, 6]
3397FjP6j41QQ1j71Q4R9j56J12J5r1J11j0m7J10j37M6J28j64J01p6j03K53j09
3422B4j08J75m6j10J61j17k5J43j42P0J7j34J70n0j22J57n8nP8o9p5J88j91K3
3446d6R9j16J43n6j10J47r7l9J07j37O7J15j38N8P7j49J56jj80J72q3p5J43j91
3470a34N0J71j86J22M7j20J04m7qN6l1m9J59j56j2J31k16J36R4k27J60l8q1J93
3494A18j10m2J27j44J6J43j71J13n7j00J23J7r3J36r8J7K2o2N1M3j26Q1L4p3Q2
3519D7j10oJ24j27L1J78k38J12Q2j21Q6J7j99J88l8j25J54n4p7Q3j29J10O9j39
3543h2P6L5q1J05n8k9J08r4j4J10j94O2O7p7Q8K8r6J17k0j22K14j30l5P9j16J0
3569d9O8j42R1N4j33J47o9l1J25o7j0Q0r3K9N2q2J7mo9J05N8j03M7o0OJ22j30
$$ y = [6, 5, 81, -60, -52, 29, -142, -58, 41, -115, -3, 12, -79, 32, 22, -25, 85, -52, -6, 122, -42, 59, -17, -120, 133, 24, -84, 91, 45, -65, 96, -21, -46, 97, -45, 25, 42, -92, 78, 28, -94, 63, 5, 0, 78, 9, -66, 122, -69, -46, 53, -63, 80, 24, -86, 61, -36, -75, 32, -105, -38, 77, -61, -3, 74, -75, 81, 80, -100, 72, -11, -86, 57, -134, -84, 87, -99, 23, 70, -50, 54, 7, -1, 55, 24, -25, 134, -22, -34, 97, -119, 17, 111, -116, 44, 6, -75, 118, 8, -34, 93, -51, -35, 108, -63, 50, -7, -107, 16, 33, -60, 76, -22, -5, 17, -45, 6, 49, -77, 4, 38, -35, 47, -63, -69, 55, -72, -41, 137, -101, 11, 93, -28, 58, 75, -124, 64, 26, -99, 55, 1, -76, 7, -122, -12, 57, -82, -6, 29, -52, 53, -5, -34, 74, -20, -34, 76, -118, -56, 11, -66, 22, 50, -46, 71, 51, -71, 143, 13, -22, 57, -59, -49, 19, -123, -32, 22, -111, 36, -33, -64, 61, -6, -16, 64, -29, 0, 52, -30, -13, -17, -86, 19, 77, -26, 21, -39, -33, 89, -41]
3596d1L8P5j12O4M8j56J15q9J5J18n2k7J5l6L8M5p5J06k1q0P5r8o2J13j12j0J67
3623F1j02mJ16j15J41l6j01N9jn3J21j03q1J46p9O6L7j24J21n3j16J64j17L3L7
3648A7p8K7J11j31P7N8j37R6m4q3P1J5q1J22r0NJ42j28M5Qm7N2l3r6J32o3l0R5
3676C2q6k7J53j25N9J37k13J43pj39J45j07l5M2k3j7J35j24O7J05q6L4Pj50J57
3701G7q5J9O7j02K4Qp3M2M7q2Q8q6j5J09L3q8M8n9L1J35k07P6R2k06J20J6o9Q5
3729D5q2QO4ml9J04j44JR9j11P6j2r1J13l7o9Q7Lj3K4j1PO3j29O6M7o8M7r8J4
3759d0P8m2k7Q1o9rJ13j02K6K4m1O8n1LL5m9qO1q9J03pr1Q0l2j39J20L6o6J22
3788H8j26rQ1q6P1K2j52J45Pr9P6qo9J49j06M6K4p4J6K0p6P3L2j01O4l3m5J61
$$ y = [-41, -3, 72, -40, 24, 72, -84, 31, -58, -43, 75, 23, -4, 11, -25, 13, 58, -17, 89, 68, -12, 63, -35, -97, 16, -96, -106, 61, -41, -45, 71, -44, 97, 61, -40, 19, 18, -35, 86, -17, -98, 48, -31, 35, 72, -52, 69, 16, -100, 64, -53, -20, 17, -61, -34, 77, -54, 23, 81, -56, 40, -4, -87, -16, -1, -82, 40, -50, -45, 97, -31, 14, 22, -25, 27, -6, -102, 30, -33, -63, 32, -54, -81, 72, -53, 6, 143, -70, 73, 66, -73, 72, -35, -70, -28, -51, -68, 67, -57, 10, 115, 29, 63, 70, -80, 77, -8, 11, 78, -24, 0, 8, -65, -23, 24, -58, 30, -56, -71, 38, 71, -17, 31, -28, 3, 138, -69, 7, 99, -107, 13, 29, -40, 45, -37, -29, 35, 31, -8, 96, -48, -47, 52, -59, 17, 5, -86, 27, -10, -79, 8, 11, -2, 22, 11, 18, 81, -48, 18, 65, -3, 44, -54, -40, 38, -4, -31, 50, -19, -28, 85, -17, 9, 33, -8, 60, 9, 12, 47, -2, -10, 51, -38, 65, 58, -33, 47, 15, -124, -4, 32, -34, 88, -38, -47, 34, -52, 19, 41, -111, 34, 41, -58, 18, 10, -59, 90, -16, 30, 54, -20, -4, 16, -60, 13, 45, -56, 8, -25, -70, 91]
3816I1j36L9M5r1J8P4q0P0lj32J53j14m9J20p0K4O7q8Q9O1j12N1j5LK7q5J0P3
3844D0o7rQ5j09J4P6p6P3K3n4L0o7L5Q0j35J3R0j48J26J6n9R2l9r6J07o3K0L9
3872C7l8j3J0k9L7K9j01Q5J0p5J37o8o3J31j40O4L3r5L2N5j36J07k6L3J5lo5J16
3900G9j08J2N5m5O4k4q6N9m2JQ6r6J9N0J8k6M8j48Q4J6p3R9k8JK8o4J5M0l9K8
3930B3kr3R0Mq5P9l0o2J54m4m5N7j01K2j0k0N5J4j25J01M7j8M0o6L3Lq8M3O4o1
3960b1J4%l4M9nl7N2m9j8J34p9N1K9p4M1J4j17Q4n7n8J24r5O1M3j20O5J00p3j2
3989A2n6J3N9m2p4Q5j7MK6oOJ7m1K9l6l4N0K5p2J07q7OO2o6qM1n6J07L4j32O1
4020A7K4r6N5k2m1J56j07k2M6o4O2n3JL9L1l8O2Or9J22j02K4P2j35O0l5k2M9K8
$$ y = [91, -45, -6, 39, -52, -34, 40, -40, 30, 27, -105, 48, -66, -115, 5, -65, -41, 26, -62, 27, 88, -24, 27, 12, 15, 42, -43, -33, 40, -27, -36, 49, -60, -46, 30, -46, 27, 50, -4, 26, -41, -6, 74, -61, -48, 42, -106, 20, 36, -23, 69, 30, -66, 41, -22, -2, 37, -1, -14, -4, -33, 4, 33, -68, 17, 27, -48, 89, 21, -42, 89, -51, 13, 46, -49, -17, 38, -98, 9, -17, 16, 31, 28, -37, 79, -29, -17, 38, -7, 57, 33, -53, 6, -36, -35, 51, -45, -26, 24, 42, 16, 64, -84, 0, 16, -57, 42, 14, 15, 43, -21, -6, 34, -5, 23, 21, -72, 18, 22, -63, 16, -14, -76, 78, 34, -11, 46, -55, -33, -43, -63, -8, 6, -119, -18, 29, 11, 51, -15, 18, 21, -67, -24, 40, -21, -7, -7, -41, 8, 3, -34, 18, -31, -49, 85, 6, 57, 86, 12, 53, 67, -50, 34, -23, -81, 43, -52, 9, 52, -68, -3, 97, 24, 12, -44, -31, 28, -14, -88, -3, -20, -16, 10, 4, 10, 27, -14, 15, -21, -55, -5, 20, -52, 55, -32, -26, 36, -30, -38, 3, -53, 54, 88, -44, 17, 41, -55, 0, -22, -63, 93, -14, -36, 10, -54, 8, -45, -44, -5, 26, -12, 50, 56, -43, 79, -23, 1, 73, -62, -2, -37, -59, -10, 18]
4049A8l4M7n1n0J20l1m0K6n9M7M0j13J37n4m7R5j6j1L2j30L9R2p9M3k4n7R4J2
4077D6j10R9k5J1P0j61J08L8j00lO7n4PL3m8P8r8K8J5n6M8O7r6L5N8j44J37k6
4105B4m6Q3kr0O9n8L4J7q5O7L9q9O9m6p8J40p0O3kl5%On7L7%K8j2ln5Q6l3j2O1
4138E0o0L3N8r9N7m6l0J03j00l7J27n9j3P1r4N8j1l7M5qJ8Qq5K0P9j3l5K6l0L9
4168C5P4q7j6%n2J06j21K3Q4j07L3Q1n5J8J7j8K1j1n0L9n7j4N7ql3J04o1J3O0
4197G5q9L8L0q9M8M1j02O7o7M5M7p5k2Q8o1M8lqK9l3k8PKrJ19j12pO8o3P6m5p2
4229e7R2ko4M2L3p3L4n6J9nl0O9j8j6P6m8m2J01o9K5K3o5L4J7m0L9k9k2N1M2l7
4260B4K8o8qJ43j09mL0r3R8o8lP1m3rK1J4q6J51j32N2Q4j21L7Kk1k2L7Qj1o8N6
$$ y = [18, -16, 31, -20, -70, 50, 19, -21, 5, -54, -7, 33, -80, 57, 3, -44, 51, 35, 24, 56, -74, -35, 57, -22, 21, -3, -60, 34, 46, -64, 35, 10, 21, 91, -70, 38, 76, -24, -27, 40, -14, -7, 26, -22, 56, -42, -14, 1, -55, -7, 60, -36, -1, 57, -87, 50, 24, -22, 61, 59, -31, 38, -20, 14, 31, -54, 13, 52, -37, 32, -14, -92, 48, -22, 41, 39, 4, 4, 10, -47, -10, -10, 18, 6, 3, -52, 34, 1, -11, 50, -10, 23, 81, -18, 39, -7, -37, 66, -34, -71, 56, -3, -16, 55, -39, 19, 8, -29, 16, 8, 26, 34, -51, -31, 48, 35, 0, 26, -4, 35, 109, 22, 6, 6, -46, 60, -61, -38, 46, -61, -28, 53, -2, 16, 33, 15, 36, 25, -25, 14, -43, -57, 0, -8, -41, 63, 2, 15, 75, -14, 24, 54, -35, 13, 54, -48, 19, -48, -3, 44, -31, -53, 35, -26, 22, 19, 11, 40, 7, -21, -14, -12, -21, 98, -14, -21, 47, -16, 60, 15, -57, 35, 33, -31, 11, 44, -29, 5, -51, -32, -37, -67, 2, -16, -32, 44, -4, -46, 55, -14, 11, 34, -31, 3, 20, -20, 19, -10, -32, 19, 61, 24, 52, -16, -24, 119, 10, 6, 36, -57, 41, -27, -30, 41, -2, -11, 10, 24, -62, 89, -43, 9, 93, -28, 9, 11, -10, -32, 5, 13, 2, -66, -10]
4291a0K7qM4n7n4Q2N5j40P9JJN1j05L3K8k9j9N3o7O7k5k6%j7J9N3lj7j2r5J08
4322A7Lj6Qm7k0O5Mn1L8L5m7P4n8N1no2J7Jl5O7k9lM5o2RqJ6Rk5nL6jr3O4jl7
4358d6O4k2L9N3n3l2Qm9L9m1L5O5p6P3j5k9k8O2k3QNo2LR2o9ML1m5O0n2j5M5p6
4391d7J1N6l7K2k3mP9m5k7M2j0j3L0q7J1R7q7L6pm4J5Q9l4J3m4K2k6l5N0J5k8
4422a0M4k8m2O2l8m7P7p2Q9j2m8QJ6q0K4N1PK6l9l4M0KlLJ4p0Q4o8J06o4l1J44
4454A11j16j3J23j28P0L8q6l0K6n2L8L8o8M4m2L0J00q0j3j8l4O2oJ5k7j7k1J58
4482A02j35kQ9n5oN0m8O2m1o7O4qp8O8Nm8M7o0M0Q3j07P9J4l9oj3j4M%j4J3M1
4514B0K6j7Kj1L2m5L2o5k8Q9o3K9J4kK4L9k1n0K7r3Q3L2n8M4mo5N1m8J0K1l0M1
$$ y = [-10, 17, 9, 53, -4, -58, 24, 79, -61, 18, 19, 20, 71, -34, -1, 27, -2, -21, 32, -35, 32, 7, -19, -19, -36, -17, 36, 33, 16, 4, -91, 17, 20, 4, 12, -35, -55, 10, 14, -37, 1, 36, -11, 63, 5, 56, 51, -11, 6, 7, -28, 39, 10, 7, 52, -10, -1, -9, 7, 16, -9, -14, 22, 21, -72, -8, -9, -46, 18, -4, 35, 88, 35, 3, 11, -38, 1, -40, -5, 60, -16, 57, 42, 13, -15, 47, 24, 32, 37, -25, -22, 70, 1, 5, 36, -9, 51, -1, -16, 29, -47, -36, 20, -17, 5, -18, -22, 57, 12, -15, 27, 17, 4, 34, -53, -42, 55, -32, 4, -3, -47, -32, 57, 23, 36, -8, 14, -12, -47, 3, 18, -10, 34, 6, -36, 26, -12, -59, 18, -54, 35, 23, -25, -17, -1, -81, -57, -6, 1, 27, -12, -46, -6, -4, -7, -4, 10, -60, 24, -44, 62, -2, -33, 111, -5, -18, 105, -23, 47, 85, -1, -31, -5, -57, -19, 19, -49, -5, -47, -17, 83, 3, -10, -28, -62, 0, -6, 9, -18, -35, -56, 102, -33, -35, 54, -1, -7, 43, -5, 57, 16, -51, 13, 5, -73, -5, 0, -48, -1, -61, -21, 62, -45, 34, 48, 9, 3, -10, -24, -20, -20, -34, -21, 20, 46, 29, 31, 20, 52, 7, 39, -26, -54, 35, -28, 1, 15, 13, 37, 76, 55, 5, 32, -61, 22, 54, -4, 40, 36, -29, 22, -26, -16, 5, -25, 16]
4546A6kk7Q5j36R5k1lk1nK1k0M7n2L2Rk8P4o9oM5m3kK9n3MJ06p7J5P6q5QM9j10
4579d9J05l1q5N5KQL4l2M0n3m4J44l8l7k5J8j5Lk2K6l3M2L3l8K4o5J7J0N3j03
4609e6Q1mkj9M2r2N9J6q8P7Km6O3m8j2Q6o5L7n2M1j19N9J2P6p4n4Q7j6qN6n2L6
4641B3l5K0J4m8NN0n5K3K9%k7j5k6L7N7n4j1K4j8K8j7k7P1l3n0N5j3j2P3q0L1
4672A9L5p1N7k9r7J10l3l8Q7Kq7N1m5R7n0l7L4j7K0L8m7j1O4o8J9N8k1m1jk2O0
4703C6mj4K7l5MNp5L4Q2q2O8r7J13rl8Pn1O2p6O2k6lOpM5n7L3lKj2K1j4k3M5m2
4738a6j2J4J0K0k2%N9m3m7J1jN5K5j13Q8j0j7M3m4K5%k0j4N2pn3J4Qj7N5j29J13
4770B7J3p5Q6n7%N8m0L0m9M8NJ8r2K6O8j03P6q1J8Q9r7l2J05o1l0N8Oj2j1o0J04
$$ y = [16, 14, -13, 72, -64, 31, 10, 7, -14, -19, 2, -18, 29, -23, 9, 18, -10, 64, -5, -11, 34, -9, -11, 18, -35, -31, 75, -2, 13, 89, 4, 12, 61, -49, 56, 25, -60, -5, -3, 5, 39, 7, 47, -6, -50, 94, 56, 19, -6, 12, -3, 0, -22, 4, -29, 13, 46, 8, 32, -33, -16, -6, 47, -56, 25, 21, 19, 0, 42, -50, 9, 25, -63, 14, 16, -30, 33, -15, -27, 59, -6, 31, -21, 20, -99, -40, -28, 48, -26, -80, 7, -9, -17, 39, -13, 23, -12, 8, 22, -26, -21, 29, -26, -3, 26, 26, -1, -16, -42, -5, 52, -2, -13, 11, -7, 21, 4, -23, 48, 15, -35, 20, 7, -5, 68, -12, 19, 54, -17, 40, 11, -86, 24, -9, -47, 40, 42, -45, 6, -39, 58, 8, -29, 5, -12, 8, 46, -1, -12, 52, -16, 3, 61, 40, -1, -2, -24, 36, 32, 18, 45, 10, 14, 19, -56, -22, 60, -22, 46, -51, 62, 53, 15, 22, -29, 33, -43, 19, -7, -10, -4, -11, 34, -23, 10, 7, 9, -3, 18, 4, -19, 26, -16, -28, -14, -4, 16, -6, -6, 53, 10, -37, -26, -27, 28, 53, -60, 28, 18, 1, 44, 0, 25, 25, 5, -9, 43, 36, -17, -3, 5, -12, 43, -86, 27, 40, -35, 51, -6, -6, 52, 12, 42, -7, 41, 46, 64, -28, -2, 66, -37, 39, -42, -24, 65, -32, -64, 41, -20, -50, 8, 14, 2, -9, -69, 35]
4801C5J1p4K8K0k9M1n8j9N9j7K3j0m2N3k3M7K7j15N8k1kl6Q6n5Q9k5o8M6MQj4
4832B7p0M8L0l6k4N8m7K7k2k0oN3p2J16om0Mp3P6k3q9N3O9j24J28m7j0j4K3JK3
4863A3m1N1J4p6kO3l1L2o8M6K4o5K0P4p7NO6n3O3j6l4M2n5rO1j6k3M8m1RNn9L8
4896Hk8k9M8nL3K5j13O9m0M5k2J3K2PMo8P8o5pR9j13K2L8j0PJ6j12J03J5q4J06
4927F2on2K8n4pK6JJj0K1kKk5K0mk3K1J3k4J0K7m6O1q0K9j4QJ4L5n4j9P8JL7j11
4962c6O4Om3K4K9m1L7p9M3Pm1N4l8j2K8RL6m4nJ1J3m1l8R1oj8O2r6L1l7PJ9k1
4995b5J5L5k2o3O8k8L5P2n8K2l3j0K7k6m5Q0l6m0N5m1kL3k9K8j8lJJ4o1N2J1k1
5027a3L1j3P8l7r5K9J3MN4k0q2J00j2p9O2j4k4J7k3N8J7k0OQp8K5%mP1p4m1O0
$$ y = [35, 46, -28, 0, 20, -9, 32, -26, -45, 14, -3, 20, 10, -32, 21, -2, 45, 72, -43, 15, -6, -8, -44, 42, -13, 76, 51, -17, 29, 33, 41, 27, -43, 5, 35, -1, -25, 33, -14, 13, -9, -29, -35, 18, -54, 62, 56, 16, 20, -53, 23, 0, -89, -36, 33, -91, 37, -10, -20, -34, -11, -10, 13, -28, 23, 37, -39, -41, 22, -9, 23, -45, 1, 25, -40, -20, 54, -23, -18, 48, -5, 58, 42, 8, 50, -5, -14, 47, 31, 8, 56, 15, 24, 29, -30, 8, -20, -49, -1, -6, 27, 52, -61, 8, -32, 13, -9, 4, 26, 33, 37, -31, 47, -18, -25, 74, -39, -17, 21, 11, 18, 34, -78, 25, 40, -44, 62, 56, 4, 32, -22, -29, -3, -2, -1, -11, 10, 8, 10, -15, 5, 1, -22, -1, 12, -12, -2, 25, -21, 40, -40, -11, -25, -17, -3, 32, -22, -41, 37, 38, 75, -36, 28, 34, -9, 15, 44, 3, 40, -39, 4, 11, -30, 24, -14, -26, 2, 11, 47, 3, -2, 9, 22, -19, -57, 34, 28, 10, 72, -24, 7, -30, -23, -4, -25, -10, 25, 3, -60, 8, -20, 15, 87, 29, 51, 18, 8, 35, 9, -36, 44, 8, -32, 23, -18, -20, 13, -16, 12, -6, -9, -8, 6, -55, -3, 8, -13, 18, 5, 83, 46, -49, -20, -7, -3, 51, 31, -51, 49, 37, -42, 20, 6, -18, -1, -24, 34, 51, 31, 37, 45, -33, -8, -8, -12, 59, -15, -56, 4]
5059DpK4n4mQ0k2o1M5m8j9J07j15Q3j0pj1Nm0J1R9m9k0N3m7k4MM1Jm9LN8k0J2
5092B3l3n1J00n0NN3q2N2%m8N3k5j7l0K8l6L5nM1l1l4J9Q1n4Ql8N6j9jN7k7l6
5124fjjqnR2j09P3p2P4Nj16L5M4J9l3Pm2O6L9j00J2N0k5jn7N4J5JL2k2l1K0o5
5157e6rJ19o4KO6q9M9M7p0NM9n4J8J0pJ9o3K6K4nm8Q7r5O8L3q0J07p2k3OM7m9
5189bK4nl3J5K8pk5M5l8RNmk2j6R2ql8o3O4MK5o7O0m1oJ9j9%N6p2Q9p2j3L5j5
5224Dm7O4J6l7Mj5J5kn3J6K4q4R6L6j7NJ2l5L5q4L6O0n2l8Q9kl1M5p4J3MK5m9
5257b1K7n6J1R5p1K1n7K7J1m2P0j6J4rN8r3J4L9j1K3n6K4P3j05N6p2J0J9L9m2
5287b0P5m6l1M0j6qjoON9p3K9j4J3Rn4O8j9qk3L5kj3M7o1j2KK0K3j8L7j0n0nN1
$$ y = [4, -3, 21, -33, -37, 43, 21, -40, 5, -43, -62, 45, -70, 13, 3, -4, -15, -10, -50, -39, 60, 11, -9, 44, -3, -27, -23, 18, 19, -30, -27, 31, 11, 23, -10, -61, 39, -11, -6, 47, -35, 17, 17, -31, 22, -3, -20, -50, -22, -58, -23, -28, 13, -18, -52, -33, 48, -6, 2, -36, 20, 1, 0, 57, 30, -6, -7, -8, -16, -21, 71, -38, 35, -37, 37, 42, -74, -39, 5, 24, -9, -2, -44, 22, 61, -39, -27, 23, -2, -3, -60, -6, 9, 10, 42, 20, -11, 9, -56, -65, 54, -10, -8, 58, -31, 18, 65, -5, 0, 49, -5, 13, 23, 16, 35, -28, -2, 22, 17, -31, 56, -39, 29, 62, -18, 89, 17, -6, 0, 47, -2, 22, 17, -16, -1, 27, 20, -5, 40, 2, 11, 16, 12, -10, -26, 66, 58, 20, -43, 21, 25, 50, -17, 43, 2, -4, 15, -4, -4, 52, -20, 69, -3, -16, 19, 4, -43, 21, 37, 0, 4, -11, 4, 2, -51, -35, -11, -95, 1, 37, 20, 25, 37, 2, 37, -47, -11, 49, -3, -41, 48, 46, 15, 60, -14, -1, 3, 28, -21, 6, -50, -39, 56, -15, 6, -51, -24, -13, -55, 15, -1, 13, 4, 62, -31, -17, 22, 11, 34, -22, 2, 75, -30, 26, -46, -36, -17, 22, -20, 55, 9, -22, 18, 2, -6, -7, -13, -7, 52, -21, 8, -6, 7, 16, -38, 30, 11, 3, -20, 15, 13, 0, 47, -14, -26, -24, -4, 19, 1, 38, 28, -22, -27, 24]
5322B4J7p8M2l8O9m0j0K5J8k9L1k1l4Q7n4J3L6p1J8l8kQ3l9o7N3l7K4K0K8J5k2
5353B3l2mP8j11O3JJ2jl2j2N9m5pK2n2O8J5r1J30r5j9J5M0m2J5K6j2ll2N5lj2
5385A7l7M3k4k0K1O4r7O3mK1r4O0k9J4J7l3j4M0p1P3L5r4RP0ml0LJ0K5l2kL7n7
5418b0L8m5L6M1l6nM6k5q%J8lL2j09N2k5L0q3O7k7P5k8n5O8n7K1j6j3O0On3M3
5450B5m4K1RJ9ok4o1L2N6n3Q3k5q5R2j09J12k3j3m7J5PLP6j50J04m8P6J3o8O4
5480E1j9o9K8J4rj3M5m3K8k8l0J02j1o4J04n7p5K4L3mJ3j6l4P1Jn3kM9Rj4q5J00
5512D6n8K4k7JL1K8r5O6J6m0J9p7Q5ml6N0j0k3J5K3p7NOj1M0o4LP5p1L1N0j8r
5545fP4r2K2mm1K3KRk8N8oM2q4NM7o1O9l8Nkl7M0M5p5J2N1j00O6J04q2k5N8m3
$$ y = [24, 41, -37, 5, -33, 36, -4, -14, 11, 29, 0, 31, 10, -24, 63, 9, 22, 58, -13, 5, -33, -35, 48, 9, -58, -5, -42, -18, 2, 30, 45, 23, -9, -13, 65, -46, 17, 18, 30, 29, -3, -15, 44, -1, -8, 14, -38, 30, 45, -46, 84, -11, -30, -15, 25, -17, -2, 24, 12, 9, -23, 32, 29, 17, -20, 23, -1, -21, 0, 64, -33, 30, 26, 47, -47, 13, -16, -2, 15, -18, -32, 8, -63, 10, 45, -49, -40, 30, 26, -4, -1, 9, 34, 2, 0, 37, -20, 18, -27, 9, 50, 14, 9, 55, 30, 22, 22, 40, 37, 69, -40, 12, -13, 17, -66, 1, -26, 49, 21, -34, 34, -23, -2, -18, -31, 29, 35, -18, 25, -19, 2, 11, 30, 24, 0, -61, -29, 27, -26, 57, 32, -53, 39, -70, 42, 19, 6, -41, -26, -19, -16, 60, -90, 14, -34, 42, 55, -13, 51, 32, -37, -9, 5, -4, -17, 28, -15, 13, -15, -45, 57, 46, -18, 86, 29, -46, -22, 11, 7, 20, 4, -30, 41, 42, -11, -13, 36, 45, 31, -54, 46, -12, 12, -15, -14, 17, 45, -50, 16, 32, -8, 11, -66, 19, 15, -21, 29, 19, -4, 11, 34, -43, -38, -32, -43, -3, -67, -64, 11, -60, -29, 21, 3, -6, 68, -24, -2, -6, -47, -24, -22, -13, -41, 17, 11, 53, -31, -26, 21, -40, 29, -9, -4, -6, -43, -3, 42, -33, -21, 30, -70, -4, 100, 18, -7, 51, 8]
5578Hkk8L1Kn1m3P5RM3qo8O2m7M2ml4%N9m4J0K%K3m9ll1K8L9l2j4J9J9j6j8K9
5613HJ5k8L0n4J24k1j61J40q5L2J2o2Q1l5l2N0M5p0N2k9o6O8n6N6pl6P5j8o1P3
5643D0l5m0KPK2k7O5m5RJ7l7K9L9j8pm2oN3l7M3m0kj2J7J7p1K0pK8k6N6J8q1J00
5677D9q8J7R0j04M2m6M4J7JMkK5p0Q2l5j6j4k5J5J0l9P8No8L3m8N3pm1K0K9l3
5709b2O1J5p8M7J0m5L7l6N3k8J9p0Q2p0P5l3l2k9N9j9P0j10j9J49j43P0N4j14
5737d7O8Rk0l9J7M4k1j7j7jOQM3l8M2j1NL6o9K1k1M2m5M1m3Lo3Q6m8N0K5o0J5
5770ApRP2q9O0j03N9m1J5KL7jj0m4MN5Mk7M3p6J8L0m7N5m4m9M1Q0l4pOJ5j5Ok3
5805eQ7p7M9n7k7O7k4J9m5kK4J1k0pj4K1J3L9k4m7NPk4J6M1m5L7j3Mm0O7q4M7
$$ y = [8, 6, -22, 9, 11, -40, -83, -8, 1, 44, 36, -32, 30, -17, 25, 21, -13, -13, 46, 2, 12, 14, 14, 37, -12, -15, -46, -18, 21, -11, -25, -6, 13, -3, -21, 8, 23, -5, 25, -29, 95, 74, -87, 53, -32, 0, 12, -50, 31, -4, -36, 14, 59, -11, 41, 12, -54, 14, -42, 14, 7, -29, 46, 28, -33, 40, 5, -35, -33, -26, -4, -31, 34, -11, -2, 15, -22, 7, 46, 28, 21, -21, -27, 26, -11, 32, -8, -10, -22, -5, 12, -59, -39, -46, -18, -44, 12, 30, -51, 49, -39, -22, 68, -36, 6, -40, 4, 21, 22, 26, 24, 49, -21, 61, 26, 10, -4, -29, -14, -4, -43, 35, 40, -28, 5, -43, 10, 3, -38, -18, 11, -22, 39, 54, -24, 23, 33, -12, 25, -11, 42, 14, 33, -37, 45, -25, 50, 17, -15, -44, 15, -4, 66, -44, -63, 86, -57, 13, 67, -47, 21, 30, 10, -29, -12, 32, 11, -6, -23, -24, -18, -10, 33, -5, 37, 26, 31, 67, -2, 19, -2, 40, -5, 36, -7, -4, -67, 19, -29, 21, 46, -14, 1, -6, 3, 75, -14, 46, -57, 2, -39, -24, -22, 15, 14, 4, -40, -36, 19, 23, -4, 39, -37, -19, 11, -36, 19, -25, -74, -33, 47, 13, 6, 12, 27, 12, 18, -5, 82, 5, 54, -3, -30, 37, 13, 32, -13, -15, 9, 20, 0, -7, -21, 0, 13, 52, 28, -19, -14, -7, -31, -15, 26, -19, 18, 5, 9, -31, 36, -48, -1]
5838aJ5o1L7o2M7j3P3m0RK4l8J3j0k0J7K3pK1n0N2k3ml0J08r2J3k3k5P3l9OJ0
5870CJ9m2K0l3mL7K0L5n1K7n3K9L1m5K6K7%J0m0kmK0l6j2J8K9Pj3j8m9Q3k9On1
5904c5M3K%J9J2j9K4n2prP4o0j0L0J3j1k3JnNpN4j3k1J2j5Koo2L9N6J5m3PK1K0
5940E1l7rJ5m2l1P5p5Q0m5K9M3n0J0m5J5J7Kj4Pjkk2M9k4K5k0l2P0j9j7kkj5L7
5974B1m6PK5rO6k5q5O3J6m6M1l0L2nKl8oj9J03j8j5n0K5j6J4K8Nm1jJ9jm4N0j6
6008Fm6J08m7Rjn3J8J4M9l2K3r3P2q0K7N6J1o1P1k4Oj7k3l5L8k2L9o7L9K7%J0
6040B2l2K1m2N7n8N0K3p5J5M0j0K5k3Oj5n5N4%%k8O7r0P2Oq1J5J6K8lk0J8N9j2
6073E0No4p3N0N3l9%J9k3M5k2L2l8j8J13q1QlK5m6MK9j8j9qmJ9j6M4j3l6J4lK
$$ y = [-1, 14, -47, -10, -72, -25, -38, 35, -5, 4, 28, -10, 3, -7, -27, -10, 13, 6, 27, -23, 29, 6, 2, -28, 80, -12, 1, -22, -47, 26, -13, -7, 3, 22, -20, 0, -33, -37, 0, 20, 55, 4, 31, -22, 7, 38, -7, 19, 46, 46, 56, 16, 14, 10, 30, -6, -18, 0, 29, 36, 23, 5, -44, 39, 10, 16, -35, 8, 10, 10, 29, 41, 22, 46, -6, -13, -22, 52, -8, -18, 12, 25, 14, -9, -8, -13, -8, -15, 39, 26, 5, 17, 2, 4, -2, -64, -25, 31, 46, 3, 10, 31, 51, 14, 5, 20, -22, -53, 22, -53, 27, -18, 11, 54, 4, 14, -31, -16, 1, 3, -11, -4, -5, -7, -29, 20, -4, 21, 1, -31, 39, 20, 3, 1, -1, -16, 21, -25, -18, 7, -2, 64, 39, -46, 17, 33, -13, 28, -2, 30, 25, 27, -11, -17, -36, 67, 49, 34, -16, 9, -7, 7, 35, 40, -1, -2, 17, 16, -28, 22, 6, -40, 68, 21, 30, 29, -24, -6, 8, 57, 25, 48, -45, 27, -53, -26, 30, 41, -20, 51, 27, 33, 16, -7, -42, -4, -26, 13, -54, -15, 12, 12, 22, -10, 11, -31, 26, -32, 18, 41, -34, -19, 21, 11, 36, 13, 19, 4, -51, 3, 3, 3, -25, 42, -48, 24, 30, -51, -36, -20, 8, 5, -15, 3, 62, 50, 55, -9, -82, -32, 21, -18, -18, 1, -22, 23, 1, 33, -5, -23, 90, 9, 17, 14, 39, -7, -3, 26, 8, -11, -19, -23, -4, -20, 24, 11, -25, -11, -14, -12]
6107a2K4Ll6O4j4k2j4Qjrj9J2J8j0N2j8k1L1m8K6Rn8k6P6m6MN5n8L4PN0o2M4m5
6141bm3LL7Pn7J10j40R0M4j1p4ON0J3o5K6J5k3J4K3k3m9N6M5n9qj8M4K8q1Kl3
6173g3J09k9j0k7MNj5M6kkl4L8Oj3n4P1j2L2k5l1lO7k5n2rpK9L0k1J4JK6J0o7
6207b3j4l0J3L0Qnk4N2n8R8n8jM2n9K5O2k0l9j1%L8j00P7O5l5k1j8J1L4l0K3m9
6239a7M7q6N5L2q4N2K0Qml4N5p3J1R0r0R0p3l9j9J29j21M4J6l2RK3J7L5o8N2j3
6270C2K7r2M0K6j9oPj5j7K4K7Ro7J8%K1n4N7l2O3j8k1rrnj0K2K3l3Qj6k2K4j9
6304c6L0j7m1P2%lm1M4K4q7J04p1L8j0K8k7K5pk0K9q7L7K8jn2K7Pn0L8j9N3o4
6336d9kJ5J5L4Ko3L8n1N9M6n3j7L9n2N7j5N0o7L3l6M5qk8J8l5L9qKMjm6K0M2K7
$$ y = [-12, 12, 15, -21, 43, 29, 7, -7, 1, 0, -9, -28, -16, 2, -8, 44, 26, 5, 36, -12, 14, 23, -35, -61, 15, -31, -27, 28, -30, 4, 11, 61, -1, 43, -2, -45, -42, -5, 2, -55, 55, -85, 5, 49, 38, -36, -30, 20, 33, -32, -6, 9, -14, 0, 23, 0, -49, 7, 52, -7, -15, -33, 11, 39, -42, -40, -73, 36, 7, -3, -30, -26, -21, -36, 10, 8, 6, -28, 10, 16, 3, -51, 20, 8, 40, 15, -16, -19, 48, 23, -29, -38, -45, -16, 14, -7, 7, 8, 34, 44, -23, -37, -67, -54, -24, -16, -21, -45, 7, -51, 47, -11, -12, 30, -29, -4, 58, 38, -1, -12, -12, 26, -74, 3, 68, 33, 12, -6, 5, 39, 9, 32, -17, 30, -56, -1, 31, -53, -1, 19, 27, 23, -11, 44, -29, -18, 72, -18, 72, -1, -40, -59, 70, -51, -7, 9, -23, -14, 9, 26, 61, -7, 45, 32, 59, -33, 7, 33, 14, 8, 15, 0, -17, 7, 34, 43, -24, -6, -6, 15, -39, 18, -14, 49, 31, 10, 1, -8, -13, -23, -1, 22, -11, -3, -19, -41, -17, -36, -6, -23, -64, 8, 8, 5, -36, 8, 32, -55, 49, -22, 16, 6, 34, 7, 32, 25, 5, 34, -53, -16, 12, 11, -41, -14, -7, -57, -19, -38, 15, -49, -51, -36, -21, 13, 15, -48, -10, -61, -2, 44, -9, -26, 13, -39, 18, 3, 53, -14, 19, -17, 28, 20, -8, 10, -25, 14, 6, 8, 12, 11, -35, -15, 27, 54]
6370E4k0k7j5oN7l8QJ1n3M4rJk5J5P9q9j0J5Pk4O4p5L5L9l2k4k3M9l1j3J26q3
6402Gm0M3j3K4ml1j9P9j00P2j3Oo2J26j15L4j4K4k7Q6l2j4Rn0m8M9j0n0O7m2P5
6433A7rM9jm6rM4p8M6oL5o9MJ1QM1Rr6L6N1k0m8N5j2m1R1o3J9n2K8j2Pj8N5k2
6467DK0j14R7j6P6o6l6M7oP6o8j7n5Q8K8p0Nl4N2K5r3O8k8JN5n0k3NL1J8j5Rj1
6500Cm0K1J1m0MM9L6o2L7n7P6j6j9L5n2Om2Q0l3l2L7nonM0n3N3l6j4M5Nm4K6L3
6534D1n3L5l4rM2Ln5K7n3L9M8j1n9l0K9lQl6J16J4n2Mnk4Kp5O2K3JK1j6o5J04
6567C9m0L6k9n1nQ3qj7k0MMk4K8J2l8L4J7n7Q2p0K7J3k7J5L8l8QL4r9K7M4k1K8
6600B9m3J1pmRK7J8q1R0J1j9m3n0R2j9o0KO2m3M1o2J0JK4l7M7M9l8L1p4Q8n5k1
$$ y = [54, 34, 7, -8, -14, 43, 5, 13, 24, -29, 15, 6, 7, -18, -3, 76, -13, -23, -8, -1, -25, 39, -36, -1, 38, 6, -18, -41, 8, -23, -36, 90, 7, -33, 10, -3, 21, 17, -14, -33, 46, -54, 18, 5, 11, -51, 75, -40, -6, -20, 4, -23, 63, 31, 17, 26, -24, -72, -23, -33, -83, -16, -58, 17, 8, 57, 56, 10, 1, 45, -33, 13, 7, 42, -27, -23, -12, -4, 37, 46, -50, -14, 37, 17, -31, 24, 12, -29, 62, -1, 18, -34, -6, -18, -11, -29, 26, 4, 24, -90, 7, -9, 67, 1, -35, 12, 6, 82, 14, -3, -58, 30, 58, -12, -7, -41, 11, 36, -57, 11, -17, -16, 39, -11, -34, -29, 2, 20, 5, 14, 3, -37, -16, -5, -45, -41, 8, 44, -18, 19, -38, 38, 22, 3, 38, -14, -8, -50, 30, -3, -35, 2, -3, -9, -14, 26, -27, 26, -10, -24, 21, 26, -18, 8, 41, -12, 23, -11, -20, 22, 25, -30, -3, -56, -17, 31, 20, -39, -69, -40, -43, -35, -71, 45, 59, 7, 11, 6, -18, -16, -91, -29, -6, -5, 16, 0, -65, 39, -1, 35, 6, -45, -50, 33, 25, 8, -12, -8, -4, -28, 0, 12, -26, 8, 25, -32, 50, -20, 7, 20, -7, 8, 46, 8, 16, 50, -49, -22, 22, 1, 29, -14, -3, -10, -14, -5, 22, 40, -41, 49, 60, 41, -2, -52, 40, 21, -39, -37, 25, -18, 23, -39, -29, -28, -4, -41, 6, 55, 17, 48, -26, 62, 7, -14]
6633a4L7n1L0%nJ7KKj5N3m0N1n5J1Ro7M4j2oj6O8k3k8L9o9JJ4K2k8Pl4Q8No0N0
6668B7r3J36l4m2J4k9n1J13o1K1J5j6j2N5j8k4M0n4j0L6mmK5l1rJ4rj7J8K1nk
6700A0K2n2l4Q1p6R4j2l7qk3j6M8kK8k5jn2P6J2m3pQN1p4PN4k3J6m6O0k0j7J1
6733A0k4L9l7n8J23o7l2M3k2M1K5l9J8Ko7J5JL2P1p7P0n9j8P2m0l9K7j2J4oj6
6764a0P2mm4%k8j6K6m5L2J6K8n3N3n3L7M1l6oM8j36J07k6j9k0L4J5J8l1j9KN1
6795C4%o3j9JN6l1N8m5J7n7J07j11O8l4K3l8RK5P1n2jJ6m8P5k9l3j1mM7k1J4j3
6827A1j2NK7l5Nk4K8k2P2p3N4Nl5Ol3j9J2nK7N8m7k2K9L3q8K1QL7l8M6k7j4kN1
6861C9K5pm9k6Q8j35L4P3k5m0OoN4Pk7k0LQJ5m8K9J8m0n3L4O2j1n5M6j5O6n4k2
$$ y = [-14, 23, -28, 2, 2, -3, 14, 16, 18, 3, 56, 16, 67, 12, 23, 32, -35, 9, -3, -9, -25, 43, 20, -8, 31, -38, -37, -23, -1, -29, -22, -56, 32, 37, -23, 27, -66, 70, 36, -6, 8, -21, -72, 41, -20, 1, 16, 0, -12, 43, 25, 1, 41, -13, -23, 13, 9, 5, 30, -1, -10, 4, -5, -22, -4, 17, 12, 10, 32, -20, -54, 27, -49, 45, 33, -4, -12, -35, -51, -3, -5, 23, -2, -3, -55, 21, 33, -10, -17, -9, 42, -32, -25, 29, 6, 22, -24, 36, 16, -1, 10, -14, 25, -12, -70, 53, -14, -46, -3, -25, 16, 41, 2, 20, 22, -45, -30, -29, 3, 74, -3, 67, 8, -10, 62, 22, -17, 10, -2, 12, 6, -10, 62, 58, 14, 14, -14, -30, -4, -49, -17, -1, 27, -26, 27, -26, 11, 52, 16, 10, 58, -78, 29, 3, -16, -36, -2, 13, 31, 0, -19, -17, 34, 34, -29, -48, -47, 9, -22, 36, -9, 8, -49, 58, -53, 15, -19, 4, -34, -25, 0, 71, 19, 18, 34, -14, 61, 32, -1, -12, -16, 31, 10, 24, 11, -1, 4, 31, -4, 1, -23, 5, -17, 55, -18, 36, 41, 6, 12, -21, -40, -28, -33, -6, 52, 5, -17, 12, 45, -43, -22, -14, 23, -15, 31, 4, -10, -12, 39, 64, 57, 8, -18, 70, -65, -31, 42, 17, -23, -17, -23, 31, 38, 11, -9, -6, 2, 17, -31, -2, 16, -24, -77, -43, 19, 8, -47, -1, -16, 50, -4, -26]
6894b6qL1nj1O0p6Jj4L9k1k0O6J3l4%OKLO4n8kK8j7j9pJ7P5p4K4k7k1Oj1J5j1
6929a2L0l7O1o0N6j01L1Q2p5L3M3q1L7k1J5J5N0r3PO7k2m5K6l1QP9n6k8NL7Jn7
6961c6M4k3rK4qn0M5L2j7l3jO3rk8K2q8J02K1n6OKoK2L3j4n1J5l1K1J8k4PJ2r
6995dL4k2K9q8N4K7n9J04o9l6J1MJ9k0O2p9L6r8J16L0r9K9RK2k8J0K3K8l2l3L7
7026A7qj7N3p1J2oooO8o3J9j0K5J0m8OJ1J6j0J8PkK9l2j5J9k5K4mOk5J3j2j9k3
7061d9O5l1%J3J4o5N8LK4J4n6kL8j7k1K5m6%J5MNK6KJ3n6jM9o5M0mJ7Jk9J0K3
7096A7qm7N1n5M4N1q4N1Qj9l1rk1L8n3M6L7%J1o9O1n7R5o5J0L4o6kj4J23p8nl9
7129d5R8q3M0OmL6m2j3pj4rK4KkJ6l2M0j3k2P9l4j7LjqM9o2J6k9JN8kj2J1J6p5
$$ y = [-26, -34, -3, -8, -19, 41, -35, -34, -48, -9, -30, -50, 16, 29, -5, -5, 1, 3, 6, 70, 12, 10, 38, 21, 2, -5, 12, 87, 13, 37, 10, -11, -5, -16, -1, -12, 18, -19, 42, -18, 38, -63, -32, 50, -25, 8, 51, -30, 7, -14, 1, 16, 66, -27, -20, 47, 25, -20, 6, -25, -17, 62, 6, -22, -17, 20, 21, -36, 8, -15, -24, 0, -8, -58, -13, 19, 2, -31, -32, 31, 22, -6, 16, -72, 30, 51, -5, 1, 3, -3, 19, 52, 38, -13, 2, -29, -8, 10, -14, -7, 5, -4, 30, 8, 37, -51, 3, 30, -29, 75, 6, -30, -19, -15, 4, -16, 46, -33, 3, -95, 21, 51, -48, -19, -10, 12, -16, -6, 17, 45, 13, -20, 17, 9, -8, 45, -26, -14, -20, -26, -32, 36, -27, -8, -18, 7, 17, -31, -25, -14, 2, -8, 10, 17, 15, 44, 12, -3, 16, -9, 15, 11, 17, -8, 5, -7, -26, -49, 16, -15, -15, -2, 12, -53, 5, 8, 32, 46, -10, -12, 26, 9, -12, 13, -33, -33, -18, -14, -9, 17, 19, 32, -24, -25, 24, -41, -1, -5, 12, 13, -16, -6, 17, 9, -38, 13, -42, 2, 53, -31, 20, 28, 9, -22, -31, -52, -14, -67, -21, 16, 16, 27, -42, 19, -38, 57, -8, 2, 36, -30, -32, -46, 77, -1, -6, -45, 53, -30, 10, 16, 12, 48, 6, -7, -14, -28, -37, -13, -11, -13, 3, -29, 11, -2, -24, 55, 21, 4, 7, 6, -2, 47, -15, 1, -28, -27, 31, 29, 17, 28, 44, -31]
7165c1M6j1Q0m2j3l4LLM5j6m8J1Pk1P2n2L7o1oP0kj02Q4m1J8J7l5l7K1J8Nk5N1
7198A1M2q7O1j1nm3N5l2k8N0JJ3J0n2l7P6m2M8l8prO2m1M6n4j9O3n7M2p1N4k7
7230b6M3k1M8k8k7K6j7RL2j8k1R6n8J3o0K0l0qL3J3J0o1L6N1p1n1jN3L8Ok4j4
7262iK2j1kLn7P6m5J1N8m9K5n4Q7m4m2M4ll8K8K0K2m2PPL1n1K0ml6O5j9l8M1k5
7296bQ6j01J2J5K8m1K4N0q0K2j1Nk2KJ4l2npN8q5J33o2nMj5K7m7N0o4N0l9L5M3
7329D0rn4l9N8K7J7l7K6%j4m2jN5m8N0o6N8J8o6M1j9j1L3l4j0J5M4%m4K2K7p3
7361c6J1M1o2M5l0P7nq8J06k9j4ok8J0PrL6p2N1rM5n1pO8m4OL4n5M0jk3l8m5O5
7395a0Lk1N1j19J03m5pL5Q5j20OQ4k5k8oN8n1J8k9K6k1J2M4K1n8J5k1J5K9q9L1
$$ y = [-31, 15, 4, 84, 42, 29, -5, -2, 1, 46, 30, -18, -7, 0, -21, 51, -1, 36, -25, -31, 39, 37, -65, 19, -22, -4, 13, -22, -59, -38, -20, -15, -40, 11, 53, -34, 27, 16, 11, -32, 23, -9, -37, 13, 14, 27, 37, -15, -52, 24, -18, 30, -8, -15, -24, 38, -3, 43, -11, -30, 33, -24, 18, -53, 1, -26, 17, -4, 44, 16, -11, 15, -2, 7, 39, 21, 0, 96, 38, 51, -9, 11, -19, -27, 6, 19, 29, -32, 4, 55, -16, -67, -68, -15, 23, 29, 5, -9, 13, 2, 0, 3, -54, 22, -23, -12, 46, -3, 22, -32, 55, 11, -31, 13, 10, -28, 0, 20, 42, 0, 7, 14, 45, -6, 14, 10, -26, 39, 20, -18, 23, -2, 84, -17, -5, 10, 38, -3, 21, 71, -9, 13, 2, 7, -15, -13, 1, -31, -36, -43, 15, -70, 63, 1, -4, 0, -15, 12, -35, 15, -49, 1, -38, -3, 40, 31, -23, -62, -4, 23, 40, 3, 29, 29, 15, -27, -28, 27, -21, 29, -37, 21, 39, -27, 14, -5, -16, 17, -17, -27, -12, 32, 32, -12, 10, 37, -36, -25, 16, -46, -1, -31, 46, 41, -47, 59, 30, 16, 10, -18, -8, -1, -10, 26, -46, 5, -4, 41, -10, -17, 51, 7, 13, 47, -8, 32, 31, 8, -30, -75, -10, -7, -28, 23, -96, 7, -38, -45, -10, 75, -45, -39, 45, 20, -8, -14, 44, -7, 11, -18, 8, -13, -1, 43, 64, 6, 21, 0, 15, 44, -45, -14]
7426a4L6k7N4k6qk8L6j1Jo9R5l3j8L4k8km0P3n6P4p1O9J2o6M4n8O7l5K3m0O4o1
7458iL0l9kP4o3j4M8j7l0L1k7M5Kk5J9j9rOL0J6l8k0J9K7o1K1k0ON2n2l7O0RJ1
7492B4l2M9k3n9O5j7N7Rl0j16M3ML1kl5M6k1J6jj1l4L8m6O6k5rnK1o4pM6J1k5
7525c6N2J4j9l5j0L2J0j3Klk5L6m8R4o7kkJ6m2P3nJl5N2j9pl3L8k7kN4l1Moj7
7560fM8l1j4ln3M8J0n2Q8k0j6j0k2j2M4m3j9M9N2k4L0l5j3qJ2K0Pp0K9rM9m6o
7593b6K3J5l4M9n3J9L3Kj5rM1j8n4l9P6k0KmK1M6p9N3o9O9m7L0J7p9Q1m2k5K1
7625a5J4K1ll8N7Jk5Jk1j6L7j8Ok5mM1p2Q4J9n0J7Onrj1J1K7Mp4j5P6Ql2mk5M2
7661A0rk3J9pj2K8j0mL7k5J5pkQj2k8P4m8l5O0j8k4K6l8M5k7J0oL1k4K9N5j07
$$ y = [-14, 22, -5, 49, 23, 15, -13, 23, 12, 13, -56, 39, 6, -12, 22, -6, -8, -48, 25, -31, 43, -28, 41, 53, -13, 31, -27, 40, 5, 28, -12, 52, -9, 21, -18, -20, 54, -9, -23, 25, 8, -22, 9, -18, 27, 29, 4, 23, 4, -5, 1, 31, 47, 9, -11, 8, 35, -26, -5, -25, -19, 33, -19, -56, 4, 13, 24, -8, 41, 18, -41, 24, 7, 64, 73, 43, -73, -30, -26, 5, 3, -32, 14, -7, 9, 8, -3, -37, 1, -45, 21, -4, -13, -18, 3, -61, -68, -22, -11, -36, 16, 30, 11, -24, -34, -2, 8, -5, -3, -6, -31, 5, -43, 51, -16, -18, -20, -4, -46, 27, 22, 23, -12, 40, 21, 14, -19, 19, -8, -10, 44, 13, 17, 11, -6, 42, 11, -3, -6, -59, -11, -1, -53, 35, 15, -1, -11, -33, -45, -1, -44, -63, -14, 38, 14, 44, 9, -4, -12, 0, 20, 27, -43, -14, -23, 26, -20, -26, -3, 12, -22, 27, -26, -7, 26, 28, 13, 4, 45, 27, -27, -66, 10, -10, -8, -12, 9, 55, -24, 29, -40, 29, -18, 12, 29, -50, 31, -11, -36, -15, -1, 20, 17, -21, 36, 37, 12, 13, -8, -24, 13, -5, 1, -24, -28, 13, -59, 25, 44, -6, 11, 17, 12, 3, -8, 3, 30, 34, -40, -55, 21, 29, -3, -7, -32, 10, 1, -22, -3, -10, -22, 6, -4, -8, 29, 4, 19, 12, 10, 18, 6, -22, 52, 4, -31, 29, 11, -13, 13, -25, 20, -7, 3, -3, 28, 4, 33, 88, -19]
7694a9QK0L3r6L3Q1o0j8nK4K6rk3O2o4k9P8j00M7RN1J5o2MJJ5k1l1K4kp9J43m1
7727A5k8Ml2L9nk2K8J7k2j3j3l7P5Rm3P1l6L2j3pJj%k9mK8j1K1j2J2M4j20K8L5
7761A1l4L7L2j1o3QN5l4K0mmj4J6k7lM0o1K6M7l6oK7o1O8K3p4N4m9L3J8p3P8l5
7794Dm9M1J9Pl9L5j3k3M8n5L2J6mL1k0l9n3P0j1L9K6m8pl0ml9K7M1L6p6N0K5p3
7827c6J0L1J9j9k4KJ0L9Qm3K1j1%J7K2n4L6m3oQ5m4p4R6n1L7n1J0N5l9l8N5J4
7859C4k9j0K4rKlJ0p5R7j8J0kj8K6k5j7M0rM6q3N7j13M4M8m0k5O1j8KN0m2o0M7
7892BNL3pJ2j18O9M6p6M6M1n0M2k4l9L0m0P1r3N2K1l5pN1jkMLj06K3O6L4p3j1
7925c1J3n3L5M3K3n5J5K8qoj8K6m1pM4k0lJ5Pno6L9j3l8K8P1Nj8M9l3j3j3L8J5
$$ y = [-19, -11, 9, 42, -54, -21, 60, 0, -18, -23, 1, 27, 18, -5, 57, -7, -36, 42, -58, -11, -2, 49, 64, 2, 6, 7, 22, 1, -30, -6, -8, -87, 56, 15, -13, -9, -41, -2, -7, -29, -1, 16, -6, -19, -32, -69, 6, 15, -28, 43, 7, 39, 26, 19, 20, 19, 19, -10, -14, 14, 3, 24, 12, 24, 68, -52, -24, 11, -23, 14, 46, 35, -28, -20, 35, 1, 21, 17, 13, -1, 15, -12, -15, 25, -36, -10, 37, 1, -5, 22, -39, 29, 52, -22, 32, -17, 16, 34, -39, 39, 4, -45, -4, 15, 22, -17, 18, 5, -18, 30, -25, 7, 23, 19, 50, 30, -9, -62, 8, -3, 36, 62, 14, 7, -23, -27, -66, -39, 2, 38, -38, 12, 37, -36, -26, 5, 24, 5, -19, -17, -7, 32, 40, -3, 18, 7, 7, 24, 46, -8, 28, -15, -21, 64, 20, -54, 42, -9, 28, -23, -13, 42, 3, -35, 20, 34, 5, -5, 19, 10, 12, 9, 19, -56, 41, 23, 33, 31, 13, 39, 14, -3, 37, 28, 74, -9, 48, -65, -21, 27, -13, -38, 23, 5, 7, 57, 15, -45, 2, 7, 40, 33, 45, -73, -4, 42, -34, 12, 53, 3, 45, 21, -18, 12, -28, 43, -50, 2, 23, -12, -19, 32, 31, 29, 33, 36, -70, -47, 19, 53, -20, -31, -18, -71, -36, 7, 30, -25, -10, 18, 10, 4, -14, 12, -29, -36, 8, -12, -15, 0, 7, 2, -64, -25, -38, -76, -48, 23, 28, 10, 59, 26, 13, 0, 38, 53]
7959E3j18M0KL7Nl3kM7j1K5o9J9l1j7J01l1ml5P3o8M8L5m0kk7L8n9KK9RrOK0m4
7993a1M0J6o2k3N1qK3oL3k7k9L7o2KN1kj3j4J9rM0m9j3Q3q6N8rl8M8k0OPn4J7
8027dj5k4J6N7n2L8Nl8J6N0q1J6QK5K5j02L5M0Mj4OJ2Qm9M5M6l9n9L9RLj1K1m6
8061a0lo2J16m1n1P7l7L1k8j4O3j4o6Q7k9J0j2K1m9K7l0l1R9K7j33QJ7oKJ0Rl0
8093d2N9qk1M2kk2N6q1Q8n1L7j07J18n3k3mj2KPj3O0l9N8n5J9lnM9p9k7L1M0k7
8126hOJ1NoN6l4Qj1l9K9J7m8%K5J9o5J00n1n8O6n0l0K4k7J1R4m4l7L9j4L9pMj6
8160HJ2j2Mmn5Q1n6j8K0L0j0n8K5rO4l7M3o2L6Jj5k3J8L8l8M9p0N6k4K1l4
$$ y = [53, -65, -25, -23, 14, 19, -14, -16, 31, 20, 45, -24, -5, -36, -53, 48, 17, 13, -22, 51, -17, 31, 66, 26, 24, -3, 35, -24, -22, 7, 16, 7, 13, 33, -11, 29, 45, -17, -40, 11, 3, 26, 20, 53, 26, -3, 34, -28, -26, 25, 23, 10, -4, 15, 6, 46, -3, -16, 67, -19, 39, 30, -8, 40, 20, 26, 33, -21, -4, -19, -43, -27, 30, -22, 16, 21, -17, -1, 49, -32, -16, -8, 17, 42, -60, -25, 15, 19, 5, 11, 23, 31, -18, 27, 73, 34, -25, 14, 23, 26, 15, 36, -10, -13, -75, 41, 0, -51, 26, -11, 20, -8, -22, 41, 27, -39, 48, 19, 29, 17, 38, -11, 16, -14, -45, 54, 81, -52, -44, -27, -33, -31, -21, -12, -42, 17, 9, -12, 30, 28, 6, 62, -19, 69, 18, 55, -52, 66, 13, -10, -14, -26, -24, -17, -30, 30, -9, 49, -6, 13, 10, 5, 54, -25, -52, -21, 19, -8, -2, 9, 14, 8, 64, 30, 38, 27, -12, 17, 34, -14, -14, 11, 30, -35, 65, 14, -44, 22, -28, -58, -34, -61, -50, 44, 0, -37, 2, -12, 27, 20, 24, 8, 20, 8, 12, 8, -47, 34, -22, -40, -20, 10, 0, -58, -33, -42, 22, -15, 28, -34, 2, 3, -12, -35, -17, 21, -17, 32, -38, 18, -6, 15, -19]
8191a9
$$ Imaginary data points
##PAGE= N=2
##DATA TABLE= (X++(I..I)), XYDATA
0@%%%%%%%%%%%%%%%Qj6J6j6J6j7K5l2L3m1M8n6O6p4Q8j04J20j36J52j69J88k12
37a13K41k68K96l33L72m12M57n06N58o16O80p49Q24r08J003j104J217j345J487
56G81j648J833k047K297k596K960l412L994m776N886p602J0628j7572O4389K6480
71G9595o2442J6001k1041j3281l4852j6639J9421p390j6159N1064K8297M707j056
84B6225j1594K1579J6567m0242j4834q073j9980O061m454k438K7114r629o781
97b0479K7195J3349J2656q711l3990J8284J7723k4583n974n34j801J748k1418
110b6535J4634L2737l0942k2945K0611J3939R785j5130j2878K9538p19j8436J9949
123A3608N455j0445j1339j8906K0168J5578l1252o694Q343N29J6472m795m864
$$ y = [0, 0, 0, 0, 0, 0, 0, 0, 0, 0, 0, 0, 0, 0, 0, 0, 8, -8, 8, -8, 8, -9, 16, -16, 17, -24, 24, -32, 34, -40, 48, -56, 64, -72, 80, -89, 99, -113, 128, -140, 156, -177, 195, -217, 240, -266, 292, -324, 356, -393, 431, -477, 526, -578, 639, -706, 781, -867, 966, -1081, 1216, -1380, 1580, -1832, 2162, -2614, 3272, -4330, 6298, -11274, 53115, 79595, 17153, 33154, 12113, -1168, -36020, -52659, -33238, -40628, -56787, -5723, 22574, 27281, 26225, 14631, 36210, 52777, 12535, -2299, -10372, -30352, -24291, -28745, -31183, -4069, -13698, -20479, 6716, 20065, 32721, 24010, -9980, 8304, 26027, 1444, -4530, -5064, -6865, -5117, -26535, -11901, 20836, -10106, -33051, -12440, 1499, 11284, -3846, -16724, 12814, 12095, -6341, 13608, 19063, 8618, -2721, -21627, -1459, 14119, -17133, -23827, -15484, -14955, 1517, -3278, -8142]
136h142K0266r816r033J5796K24L048j1881k7787J9704J8360j9864m752J502P468
150d907J2146j4096J0468K7771k0738j4366J6119Q043L912k2071k0863K1109j028
163A499j9500Q516J596p31J726q684K1860J8195k1858l759P218O98J0498j4808
177B466j4712J4781n091o815J0157l02Q646l278j9636K0777J7706j9940r624k077
191f942O824Q733k1216J24K1741j5212j0504J3083P764O821j6315j3525K6026
204G402M791j6136N711J182K062K467j1782J1757R364k1179k754N074n53R610
218G016j1623j0932J6379J158l035M507n442Q375l93j9098J2868J3390j4845o632
232h307m59J1622J2991j9199k905K1133p936j0100M190K930O447j5305j4129K3446
$$ y = [-8142, 12124, 2308, -6725, 9071, 9295, 12343, 462, -27325, -7621, 10739, -9125, -13877, -12375, -4907, 7239, -6857, 3611, 31382, 10644, -3722, 12397, 20440, 24352, 2281, -18582, 2527, 1499, -18001, -9485, -7889, -8620, -6894, -15578, 6282, 24477, 2619, -1140, 6078, 6776, 17274, 2466, -12246, 2535, -2556, -9371, 786, 484, 9130, 5852, -13784, 6993, 24699, 4759, -4865, -6942, -118, 8615, -12601, -12477, 9264, -5948, -16452, -3369, 4395, 11216, -5099, -18624, 7402, 12193, -3943, 1768, 2950, 5012, 7479, -4303, 7454, 16818, -4361, -7115, -2041, -2594, 7016, -4607, -15539, 840, 1998, -1037, 3470, -1972, 6403, 6010, -13088, -220, 13170, -1675, -8307, -8766, 2856, 15847, -3352, -6257, 14876, 6940, -3160, 1030, 3960, 10407, -4898, -19027, 4419]
246D419N217j6132J987K133N583K230j4080P631Q901j6343k74N458j47R284q435
261b568p289J5953J053l687J290p780P492J849j7471O852R724r775l388k371Q493
276a623J2424j7232n986J8108k951p859m12J328J0486r009j3156J8997O633j2684
290b936K01J413P459K973j4807M957J0372j0873r64K062j283P989q709q137J2698
305B415l58m487P62n511R771M699j4284O265R949n552j259m249M759J1036j4999
320a043o634J5209j289n851j878K97J2006o065j3800J3034M682j0280r05j556
334d073N722L518j3322L748J0960o478J6K29j065R685o097q388R479k97l187j39
350C11n988Q476M074j4234L333Q898l141j673o487L383J1655j2375p106J2484
$$ y = [4419, 9636, -6496, -4509, -2376, 3207, 5437, -8643, -1012, 7889, -8454, -8728, -3270, -3417, 5867, -2568, -9857, 6096, 7149, 3462, 4752, -3028, 4464, 6313, -11158, -4306, 5418, -4357, -7745, -10116, -1623, 10801, -6431, -12417, 5691, 2740, -5119, -5531, -4203, 6283, -2726, -15882, 3115, 9748, -2936, -2735, -1322, 6137, 9110, -5697, -740, 9632, -1241, -2205, -143, -1426, 6563, -2146, -10283, 2415, 2057, -2430, -1668, -7179, 2592, 7291, -6993, -728, 9221, 3669, 2410, -1839, 2920, 13956, -1043, -7677, 7532, 6243, 392, -1486, -1189, 10817, 4752, -9048, 3986, 8668, -1612, -2517, -4073, 1649, 5167, -8155, -4407, 6553, 75, 91, 320, -745, 8940, 2843, -5545, 3934, 3637, 450, 311, -5677, 2799, 6873, -7361, -4028, 4870, 1729, 56, -6431, -3048, 8607, -3768, -10874, 1610]
364A610o49m987k835N9J2594m163j2853J1631O468o198J26k670M568L537j2473
379f235J750P973o772n25q45q88J0593l182p093P644J43q00mq323N334L674j2575
396a0131J973Q214K85J089n577M689J4616q311q138Q363q63m741n706k974J0402
411C190m055j2846J0186Q359k551J12l213N329M915j1384JN788o774j117r20q5
427e065J0194k620n904P642J174J026P36q983L233L788j0254N48M736o66J109
442F94o704K433J3823o808q698N838R07n25m085l940J0231j363j0954P990P245
457F084k045j711n823M728O218j0032j282M941m207O22n24k89Q798l508o441O021
473A550J103R09n8q775L522N617o971R00L314l15K019o144J285J1886o115q431
$$ y = [1610, 961, -4026, -6861, -6802, 5792, 1629, -11224, 407, 6875, 677, 803, -1867, 2701, 6238, -6235, -4485, 3488, -3284, -3809, -4654, -5542, 5051, 1869, -5224, 2420, 2563, 1763, 1759, -6564, -1230, 2444, -10131, -8158, 56, 341, 1430, -4147, 542, 15158, 6847, -1291, 7072, 6209, 1468, -4238, -7212, 3190, -865, -13711, -3525, 4834, 2283, 2395, -818, 4511, 9426, -1958, -1957, 3831, -2943, -4060, -4980, -5065, 5129, 2509, -3395, 4247, 5421, 6447, 7183, -1800, 1433, 5221, -5033, -4485, 251, -415, 694, -6010, -3577, 10246, 3438, -5260, 578, 1485, 960, -3125, -7065, 3166, 1803, -9151, -1161, 6084, 4039, 2328, -3495, 1233, 7451, -2581, -3863, 1078, -3129, -2507, -3031, -3320, 5478, 1970, -4471, 1550, 2653, 3562, 3504, -5271, -1749, 3868, -3103, -2203, 1111, 796, 2815, -3329, -2044, 9842, 3727, -4704]
489d704M421J977J975l523n562Q652or540N109M259k504k044o432M748P715p977
505c436j329M878j583K971m44j878O953l560o064M728K03Q11m63q528M118P041
521D418n330q2J609JL013n900k73R743n858p985L478K433K985l858o259Q426K216
538B777p205M218L568j197p36n434M634O829q309k716L185j604K845j604l337
553d086N840j958l582N091j33J342N48p575L696O681m946j639m11M47M761n232
569a156j528Q628l651o012L148K258L293m153p400P653L516o590J935J931k47
584A625J62n324L677O032p866k902L170k11L256j859l231N978l28k254M085j505
600B505K80K97p307K268M954m993j733p76J351O447l852k244P807j911m088J540
$$ y = [-4704, -283, 1694, 3669, 146, -5416, 3236, 3230, -6310, -1201, 3058, 554, -1490, -7922, -3174, 4541, -3436, -4765, 113, -1470, 1501, 1057, -821, 6132, 2572, -3492, 1236, 1439, 2250, 1787, -6741, -2623, 4418, -912, -994, 615, 616, 3629, -2271, -2544, 7199, 1341, -6644, -3166, -733, 2252, -1606, -7865, 561, 2777, -4428, -210, 3358, 2161, 1425, -4009, 625, 7454, -855, -3571, -386, -1990, 855, -749, -4086, 1754, -204, -3786, 1305, 1172, 2514, 3062, -4513, -817, 5864, 918, -721, -1132, -685, 4076, -1156, -2684, 5944, 2293, -3719, -571, 1687, 4980, 827, -6573, 1080, 4596, -1994, -59, 1872, 1625, 1787, -3537, 140, 6172, -1694, -4596, -1426, -1637, 1619, -240, -3471, 2507, 2179, -75, 4010, 2505, 2785, 3082, -4225, -1957, 2997, -1996, -3729, -4505, -3154, 3293, -559, -2803, 5004, 3093, -995, 545]
616E45L02K630m356q179O662M112n444R59J568K197K557m557K999N723o967l006
632b255K155j109K073l596m317N623L67j532L642j172J611K285n473K521M124
647D947m690j851j424O73N535m350l422O726j17k034J464n3L568k637p250N384
663D69L385n767q96k66J947K902m819J728N721m407j132K555o48K618l298m514
679d422M959O4k227J940k304J885L065m631K111L908l377n84j274L22N022m702
695b45m298N601J75j707L44r58M108j030o221N008L388m748j015n66K130K751
711B717n358L04N027l528o18J685q63K734k439l654M829J20j960J368k680J895
727d21L179m526R70L074k518N71j290j9N199l813l993N122O51j162p34j948M318
$$ y = [545, 847, 3477, -879, -9058, -2396, 1716, -3728, -2769, -1201, 996, 3553, -1004, 1995, 7718, 751, -2255, -100, -1209, 864, -2732, -7049, -1426, -1059, -2591, 1051, -121, 1490, 3775, -1698, 823, 4947, 257, -1594, -3018, -2345, 3190, -1160, -4582, 2144, 2027, -7, 1457, 1404, 4972, 2335, -4915, 469, 3854, -1913, -2809, -3075, -1128, 1774, -3045, -1317, 4404, -3, -1135, 1420, 772, 3390, 92, -4422, 537, 601, -1626, 314, -1990, -105, 2960, -1671, 440, 4348, 971, 387, -887, -565, 4457, -245, -4543, 1058, 1233, -474, -130, -1088, 3020, 1990, -4231, 777, 4165, -583, -1598, -2164, -34, 2717, -2641, -2337, 2690, -838, -1456, 229, -634, 2100, -339, -3993, 836, 956, -1004, 364, -2316, -421, 2758, -1768, -798, 2276, -242, 329, -961, -980, 4219, 406, -3587, 1535, 2186, 1024, 290, -1658, 2660]
744B660l42o239L850L052l901n78r24K408L089n519j51M873k524m56Q59j130L040
761B067j894l277M443q8j894J170k512J836K918m382N78K411j697J158j613p77
777a553M985k961l816M063M79o65r50k464M534Q24n706K870K946k513j77j419
793a523J863L176n444p04M379j933l98J52j127L627j446l133M103j99j708J218
809I03k552J578K531m292M56K126j320J594j765j018M830k252l372L321K37j74
825H31q22k821M280J175n415K124K514j597J74k095J434L453m709q90L965j533
841F8j21k48j309L738j245l196L369k41j227J321k669J500K710l817N24J826j156
858a73J704k095j467M545j887l256K661l5M40m86k948M121J592m755J581K156
$$ y = [2660, 2318, -3921, -71, 2981, -920, -1498, -2422, -14, 3075, -2444, -2595, 2278, -246, -702, 157, -973, 2067, 173, -3104, 1339, 1251, -643, 527, -1985, -149, 2769, -1613, -1035, 1376, -321, 837, -776, -1553, 3432, 471, -3345, 718, 1197, 532, -418, -2882, 1652, 2476, -3230, -360, 2586, 73, -104, -1523, 340, 3516, -1928, -2632, 1747, -186, -584, -432, -1559, 2068, 622, -2511, 1592, 1393, -315, 903, -1649, -71, 2460, -1832, -1376, 750, -570, 1024, -741, -1759, 3071, 819, -2553, 768, 1005, 831, 9, -2812, 1468, 2643, -2772, -648, 1866, 269, 443, -1652, -218, 3235, -1474, -2364, 1601, 68, -53, -301, -1610, 2128, 883, -2313, 1056, 815, -412, 909, -1760, -260, 2450, -1367, -843, 983, -173, 1531, -564, -2031, 2514, 627, -2629, 32, -3, 437, -49, -2997, 1124, 2716, -2039, -458, 1698]
874A698r33K72k647J067L463m269j061L307j219K65l84j291L770q40k999K954
890A153l21q61J325k873J039K416l295L44J303r59K077j898j424M582j288k804
906a484J903k19Q08n55l532L436J600m375J210J783j73Q76k753J193L882l750
922a50j234K727j315L19r95j683L533q95k793K844j46k37J475k693J159K478l035
939f41K81P59j230K082j849j763M133q86k323J529l63J461k14l658K953J887l843
956a685Q44J137m2J061k840O70L994l240j369K202r41P41r02j892L454m86k571
973a865K508k03j22J355k782R81K222k849K18L31j171K375j552j745L852o17j704
990g68J433n84J570Ml906K408J837l437L51M35J47J526k818N48M012k529j010
$$ y = [1698, 765, 1037, -1610, -543, 2920, -1349, -2410, 897, -322, -57, -441, -1732, 2038, 1198, -1801, 1153, 832, -29, 1296, -1577, -538, 1878, -1417, -1073, 230, -729, 1348, -550, -1974, 2608, 1320, -1484, 419, 200, 1008, 453, -3079, 357, 1957, -2418, -1208, 575, 402, 1278, -1475, -282, 3600, -150, -1384, 1343, 28, 347, -648, -2331, 1202, 307, -2486, 358, 212, -25, 1450, -1243, -84, 2394, -641, -360, 399, -831, 1251, -598, -2361, 1772, 886, -1437, 92, -271, 1190, 976, -2682, 271, 2158, -1685, -841, 296, 254, 1315, -1525, -855, 3139, -101, -1470, 732, -209, 532, -370, -2262, 1192, 706, -1865, 643, 440, 318, 1673, -1109, -128, 2094, -755, -537, -206, -1377, 998, -554, -2299, 1553, 936, -768, 665, 81, 1651, 1655, -2251, 157, 1994, -1443, -1092, -657, -510, 1016, -1802, -1254, 2758, 229, -781]
1007g81J927p66J161j070k313K929o38k567J906n61j4J588k496J173K439k154
1023b37N25L65j081K288j480k207L065q03j620J027r13J757M39l558K369K127
1039B063k636M74%K14J630l077k1L402k351j079J528p20J520p92k119L211j64
1056A083k020J858p69J11J442k640O60K042k333M12K0j196K487j293j989K865
1072G40k78j016J005j193J757O36l606J681J864k395O9l81L17J882k761k47L464
1089A538j686p30J349o72J763q42k237K816k08j984J394q77J50J510k488P89J867
1106A452j902Q22J29j126K474j118k057K436n92p56N04j709J662Q23l388J510
1122h36J768j714M89n95M16K248k631n77L020j597p10P14r04J832o50k206K802
$$ y = [-781, 1146, 380, 1541, 471, -1842, 1087, 449, -2118, -212, -773, -787, 801, -1695, -522, 1917, -237, 288, 653, -428, 1860, 380, -1827, 1238, 435, -1185, -158, -1071, 686, 1125, -2433, -64, 2063, -573, -99, -99, 115, 1745, -1332, -1353, 2049, -302, -1381, 147, -573, 947, 155, -1964, 1247, 1083, -937, 921, 152, 263, 1705, -935, -275, 1767, -566, -154, -134, -1330, 1157, -136, -2125, 740, 462, -554, 451, -742, 1015, 1651, -1955, -274, 1590, -805, -736, -1117, -800, 1082, -1679, -1926, 1538, -148, -878, 471, -201, 1562, 720, -1517, 1299, 1091, -893, 501, -376, -226, 1284, -1204, -415, 1452, -450, 372, 501, -625, 1849, 731, -1326, 1110, 518, -238, 266, -1443, 219, 1042, -2346, -836, 932, -782, -293, -888, -472, 1776, -855, -1432, 1588, -9, -719, -5, -909, 923, 273, -1933, 869]
1139H69K73j542J481p71M03J530k426M88J441j886O09k45j353K297j089j810K218
1156D87l55m28P12j671J674J135l145J144J502j535M21r81K02K251k487p69K660
1173H17j147k42N05r92K115m26k175K411J04j424J194j147K93J506k348M79J435
1190I58j546R12j37j190K335p38j688J847m65l15N26j968J547J173k920R61J332
1207F24j097P29r71J79K339k171p87K250j013l12K30j167J948k96k146K157Q8
1224E84r97J187j083M44J491k239M00J138j492R46l24j293K192o91j464J755n14
1241D0J9O32j899J485J182k577P09R49q63Q46j199N2K429j924p73K042q12J9r7
1260B60j253J851l44k180J787J1r81J171j111M49J538j856M41J236j354R49l23
$$ y = [869, 1142, -400, 1081, 310, 713, 2243, -183, 305, 1746, -140, 469, 224, -1129, 1168, 79, -1731, 487, 132, -296, 416, -1255, 419, 1554, -1591, -447, 1055, -480, -59, -1040, -838, 1413, -1074, -1843, 817, -330, -572, -67, -1059, 1056, 630, -1545, 866, 970, -454, 740, -407, -114, 1392, -956, -477, 958, -588, 324, 187, -1003, 1332, 594, -1094, 753, 288, -27, 499, -1469, 78, 1251, -1669, -708, 624, -473, 256, -715, -536, 1803, -368, -1155, 1095, 82, -230, 0, -1167, 781, 485, -1661, 496, 584, -413, 774, -309, 135, 1626, -613, -213, 925, -567, 379, 55, -1238, 954, 263, -1201, 554, 40, 59, 691, -1208, 277, 1459, -1118, -409, 540, -323, 523, -676, -624, 1805, -119, -892, 1150, 338, 357, 260, -993, 858, 514, -1666, 121, 132, -849, 322, -789, -340, 1198, -658, -217, 1019, -335, 614, 291]
1277B91j422K047o83j362J424o58K28P84j850J248J366k218O60P35o71Q97j398
1294e82j79K198j707q71J777p23K03J13j336J986j82j915J599O4p76R64j250L80
1312b37J378j805K99R78j223R80l82j150J820l89j164J269o22L58P73j851J074
1329A06J188j998M68M17n50J013j387l04K151j361p40J504n98N17mj310J793l7
1347H68j833J281j89o83Q67j298L47J316j531M66Q50r89J186k33j095J737m43
1364F24r93R44p92K51O45j829Q90J149j637N07L11l62J177j223l32K052j146p73
1382e37J066p11N53q9j427J576J18j632J269o2l42J028j255M13J275j524L05O17
1400F41j113R35l77j223J529m60p37J027o89M88R27j624Q14J103j418M67o6m79
$$ y = [291, -1131, 916, 233, -1129, 295, -363, -135, 649, -1201, 47, 1413, -805, -145, 590, -81, 816, -582, -761, 1437, -270, -1141, 636, -87, 116, 229, -1107, 879, 697, -1218, 381, 445, -331, 633, -617, -237, 1141, -664, -365, 613, -610, 370, -12, -1162, 658, 269, -895, 374, -248, 110, 883, -968, 106, 1294, -704, -236, 181, -369, 644, -743, -1047, 1104, -257, -997, 507, -91, 426, 422, -888, 905, 868, -965, 316, 127, -556, 311, -987, -640, 676, -855, -389, 461, -528, 658, 425, -670, 1067, 624, -369, 575, -217, 34, 679, -1150, -260, 889, -748, -241, 70, -292, 885, -338, -670, 1382, 236, -537, 529, -182, 371, 282, -1145, 431, 549, -1083, 186, 124, -218, 810, -445, -32, 1243, -281, 24, 641, -472, 463, 86, -1137, 392, -68, -805, 222, -467, 21, 948, -676, 138, 1241, -177, 290, 224, -255]
1418b55J052j315n62J770j020n79R61n15Q21O2j290J615J19j363R45l01l74Q20
1436E91j379K27J070j336M72N02q48J127j98r48J429l38o52R04r53L29Q25j774
1454i50O76R38j178M06J0l90J261j045n49J781q34n05P38o80P59k4j385J419O3
1473E11j270R59k90j94R00j102K80J176j198L64M32r26R41l37j050J176m85o38
1491g51Q87q51M29Q67j266O57R19q64M81j43m55J127j135p15J319p30m34O33o70
1510f95R13K60j250J374K35j006Q53m59k80P37j296l6J042j190L27M93o92J071
1528D01q5q09J245l37n20O55r91J77O55j391M17O86p84O92p2k42J346p67n92J263
1548I47o46l20L54r49P49O1j215J094K35p30Q89l01m3R19j128N1Q02j118K01J34
$$ y = [-255, 797, -518, -1080, 690, -330, -909, 52, -463, 358, 420, -870, 745, 864, -499, 446, 145, -229, 591, -788, -561, 509, -827, -355, 147, -701, 426, 228, -720, 709, 371, -281, 623, -330, -1, 824, -950, -274, 664, -514, -108, -98, -488, 773, -272, -821, 960, 126, -379, 359, -321, 438, 414, -971, 448, 511, -759, 200, -90, -284, 616, -486, -206, 970, -228, 136, 568, -358, 583, 246, -804, 372, -113, -751, 136, -715, -286, 581, -685, -28, 891, 27, 508, 365, -90, 1037, -98, -813, 506, -224, -658, -25, -695, 218, 478, -772, 602, 837, -169, 684, 225, -55, 682, -614, -650, 392, -798, -471, 22, -670, 401, 316, -493, 752, 415, -105, 550, -441, -264, 391, -1000, -583, 103, -681, 11, -61, -303, 1043, 276, -316, 947, 301, -19, 335, -614, 135, 196, -1019, 75, 310, -420, 469, 168, 125, 1044, -84, -33, 769, -349, -148, -14]
1568a4q08R45j33q42J142k26l27P40q43K51P43j237K65N89q50O07k26l65J349
1587G60o46n00J149n19j54L29q43P14R2j310J000J11p36Q29l94j1R60j057J44
1606h2Q02r72K96K21q72P40j86p32R98l08k19P68q93L40P98j077K92M46p22N88
1626B26l41n00J175o10n52J028m10j8M42q30O87K64j134P88J56o75O52m47j39
1645b38P93r23R2O95q02L93K54p71Q35q2p37R19l66j91P38r43K24P36j114L60
1665a28L04o15N79k68m43J087m67m56Q92m45J02L52r33O75J93j088O80R7n93N96
1685A21m39k6R20q83J56O54p61L87J83q25P95j59p00P70k92j79O51p94K53P57
1705E89q51K28K87n44N82l14n39J006m98m40P79m18J52L51q55O03K77r13O42J59
$$ y = [-14, -822, 123, -10, -852, 290, 64, -263, 477, -366, -115, 628, -609, -344, 245, -605, 2, -224, -589, 760, 114, -386, 763, 244, 90, 419, -424, 290, 382, -928, 72, 183, -553, 276, -118, -129, 831, -226, -82, 720, -252, 44, 265, -607, 133, -53, -785, 213, -95, -314, 454, -439, -99, 699, -378, -86, 360, -362, 226, -115, -615, 560, -50, -602, 426, 16, -2, 440, -390, 297, 561, -573, 215, 371, -304, 348, -99, -238, 555, -368, -276, 419, -383, 10, 264, -507, 328, 246, -491, 428, 62, -129, 609, -334, -110, 626, -488, -128, 176, -439, 140, -128, -571, 516, 49, -407, 485, 40, 142, 494, -439, 236, 429, -659, 21, 118, -475, 121, -318, -344, 576, -307, -151, 503, -258, 129, 312, -513, 282, 123, -577, 193, -99, -278, 373, -421, -168, 589, -262, -34, 253, -291, 291, -23, -562, 444, -54, -494, 285, -133, 19, 370, -485, 118, 395, -518, 124, 283]
1725B83m70O43m48r9Q26q72l4O10p56L05R6p46P83n4n84Q85l24r9P26p59J25O03
1747F40r60J04J47n84O41k54m55J053l31k64Q56m65J68K73r41N79J51r06M30M1
1767g7m14P78l80l6R58o51j6O57q78L16n3q55O27j80n79P87l20j4Q17o38K79O22
1789G50q09K21M6o47N33l80n53P94l53k04P59k87K95M45p56N79K67q86M14j89
1809C9m15N64n12j40Q40n85J26O42o34M57J38p14N81k05n95N66m74j92O99o81
1829d95K32P00o25M15J69n55O78l76n91P09m39l30N61n24L56M36p06N93L58p25
1849a59M99j29n22O95o60j94P37o70J61N66n55M57K77o48N42j26o38N35m74j41
1869d47N90o26K02N91n66M53K49m76N93k10o35O93m37m29N05n69K77M38o53N81
$$ y = [283, -187, 456, 8, -91, 735, -137, -171, 439, -317, -12, 84, -662, 121, 67, -517, 368, 44, -55, 671, -88, 37, 640, -320, -216, -69, -653, -12, -266, -721, 332, 1, -263, 593, 128, 296, 569, -372, 207, 358, -548, -118, -77, -491, 287, -93, -129, 829, 178, 162, 819, -59, 257, 204, -651, -24, -204, -783, 4, -316, -330, 487, -151, 128, 750, -59, 162, 208, -439, 94, -286, -839, -45, -398, -602, 157, -130, 165, 610, -146, 433, 700, -186, 228, 39, -376, 188, -324, -464, 376, -209, -83, 559, -75, 382, 520, -194, 387, 182, -413, 153, -321, -513, 186, -495, -263, 437, -188, 227, 396, -159, 519, 143, -448, 261, -178, -508, 53, -471, -115, 321, -385, 208, 566, -159, 340, 211, -311, 384, -276, -470, 267, -403, -242, 324, -231, 226, 503, -145, 397, 271, -367, 168, -306, -447, 143, -483, -281, 310, -256, 197, 446, -30, 563, 353, -282, 411, -26, -455, 50, -519, -242, 196, -457, 124]
1889A24L43o09N51o0m57N73o16k37O20o07L3N08n90N34K19o36P71j43m92N85m84
1910g0j32M80o77Q4M52n43M15J51m80P49j58m59O59l21k75M68o31J93L72p93M40
1931g6K26n26N14j9l29O01m78j81O37o04Q6L73o20M43Q3n52O40n4m10O10l87j72
1953a95N71o16Q9M15n87L58J06n48P21k14l88O77l56j91M80o15K82L52p58M78
1973F1J97n91N67j91l32P10n58p7N21n85J35M06o52M90J63o53O50j18l68O08m00
1994a7j81N82o88Q6M48o46M38Q5m75P43j62n17P15l91j89M93n17Q5M14p04L91
2015gL02n76N78j71l05N80m38j96N52o36J40L22n83M54Q6m72O33j03l38N72m05
2036a1r3N18o35N4M44o67L86J25n17O08j70l83O11k89o4M71n43J35L78o76L99
$$ y = [124, 467, -142, 409, 349, -108, 465, -151, -388, 232, -375, -342, 166, -424, 110, 329, -307, 464, 321, -171, 414, -70, -202, 278, -399, -315, 137, -406, 9, 160, -320, 429, 271, -188, 471, 150, -125, 343, -288, -95, 277, -516, -76, 150, -376, 138, 119, -210, 391, -87, -268, 369, -235, -149, 224, -396, 47, 130, -422, 218, 164, -246, 364, -23, -195, 376, -240, -151, 264, -323, 35, 141, -407, 314, 100, -288, 389, 33, -158, 322, -293, -11, 341, -417, 61, 258, -333, 234, 43, -289, 421, -137, -214, 307, -278, -143, 263, -389, 101, 264, -389, 261, 143, -225, 383, -17, -198, 384, -304, -218, 230, -416, 22, 107, -368, 375, 213, -304, 411, 20, -169, 324, -193, -108, 306, -398, -7, 295, -281, 297, 126, -179, 401, -37, -233, 319, -317, -177, 145, -438, 16, 102, -370, 263, 160, -178, 394, -11, -104, 414, -221, -167, 277, -390, -4, 121, -396, 212, 42, -341, 270, -19, -83, 388, -155, -20, 358, -318, 81]
2057H1J31n16M94k28k53N98m10j32N06m78K58K79n89M26P0n34M47r6l65N12m33
2078b32j26N79m82K43L41n12M61P0n06N04j77m96N61l43j39M06n68K40K95m85
2098c66M05J91m45N57j40k21N75n27q9M17o06O9K13n91M10L2m79O72j9j70O38
2119E26l51j1M79o24J7J74o97L37n7m57N70j08j42P55k62M6N33o00J84J82o26
2140a32J76k9n61M37j52k60O95l22J09N00m26K54J64o18L69j09n32M18k14l41
2160e74N20l15M9M89l95K58K80m58L62J66n34M87k26k90M32l36j47M22m63K62
2180a1L24n50M31J51m47M94k16k98M99m88q4L69n13K17K50n35N11m2l59M98k02
2201ak89M50l55r4M60m80J37L31m85N06N9m06M99j84l13M75l74j19L88n01K28
$$ y = [81, 212, -304, 190, -38, -291, 307, -103, -235, 271, -207, 51, 330, -259, 167, 237, -297, 150, 54, -311, 201, -232, -358, 221, -261, -18, 323, -189, 272, 342, -164, 340, 163, -333, 228, -115, -254, 152, -416, -176, 119, -366, 39, 230, -215, 342, 202, -19, 556, 29, -60, 357, -249, -180, 33, -558, -148, -116, -595, 77, 58, -112, 526, 175, 164, 643, 19, 36, 210, -487, -150, -207, -664, -94, -202, -344, 411, 149, 195, 728, 128, 312, 494, -132, 44, 15, -546, -109, -261, -521, 174, -148, -39, 461, 35, 289, 453, -165, 204, 95, -437, -19, -233, -574, -54, -369, -320, 169, -226, 32, 312, -146, 216, 382, -152, 335, 109, -181, 251, -85, -232, 190, -273, -11, 313, -237, 194, 345, -102, 392, 176, -122, 377, -111, -195, 174, -339, -122, 128, -407, 104, 62, -297, 201, -1, -290, 160, -195, -289, 171, -309, -172, 159, -326, 180, 239, -167, 332, 148, -165, 310, -64, -183, 205, -296, -68]
2222f8L44m18L73J5l80N11k33l55M97m85l9L71m44J94K76m24L45J34m73N14k44
2243A1l20N09m82mL47l63J73L21m51M73Q4m28M30k12k90M38l95l4M06m07J80K69
2265B55m02L99J1m03M06k31l30M64m00m5M74n24L31J94l96M19M5l95M30k39k87
2286b24M42m00j5L26m22K09K41m82M06L6m02N27j36k26M54l36l8L52m23J58J43
2307A90n59L53M5m91N10j73j79N73l11P8L97m07J82J19m77K64o9m22L49j61j40
2328c29N04k60L5M28m24K28J85m63L20j42l83L70k47k01M00k50P0L51l02K67J35
2349B92l59L58n5l54K82k23k33L95l72K6L94m79L28K72m00L24J0l46M18k03k48
2370a73L86l82l0L35m29K33K25m00M21l1k92L77k05k19L34l17k4M12m48K68J55
$$ y = [-68, 276, -142, 231, 246, -134, 377, 144, -211, 286, -199, -238, 133, -311, -117, 159, -265, 80, 214, -259, 255, 11, -309, 200, -282, -286, 61, -302, -129, 192, -259, 214, 298, -130, 300, 88, -202, 236, -159, -193, 213, -194, -14, 255, -147, 252, 263, -140, 266, 35, -295, 169, -231, -276, 198, -326, 5, 199, -197, 222, 267, -128, 302, 63, -224, 218, -182, -197, 129, -293, -84, 157, -325, 81, 117, -285, 242, 106, -120, 334, -2, -40, 312, -111, 47, 190, -369, -16, 29, -462, 48, -125, -304, 269, -42, 36, 433, 26, 208, 327, -150, 114, 45, -377, -28, -189, -329, 175, -85, -50, 378, -46, 182, 367, -96, 224, 82, -301, 69, -178, -379, 21, -229, -159, 192, -110, 157, 292, -67, 291, 236, -118, 164, -59, -292, 103, -269, -243, 151, -328, 0, 272, -128, 196, 206, -140, 278, 75, -173, 213, -169, -199, 136, -293, -60, 165, -235, 186, 155, -137, 240, 35, -184, 150, -167, -191, 221, -227, 41, 196]
2391A96l04L37Ql51L71k29k20L30l67kL27l72K39K24l31M11rk72K57k12k27L22
2413A26l59mL45l97K56K38l34L32K7l00L71k64k91M28m42J8L07l48K49K15l66
2434a93M05L0l20L83k02j90L19m06n4L71m55K87J35l42M01Rl21L69k17j12L31
2455B28l03p1K43l89K51J65l95M23k2k54L79k24j72M05l62%K81m44K62N9k86L47
2477A21j17j72L34j77j47M49l17%K66l61J11J69l75K54J2l15L94j22j48L21l42
2498a62J27K63m01K16J03l64L97j23k70L38j55j27L06k36jK87m13K67N6k94K65
2519G9L4k94M19k60n0K64l53P6K69l57J52K06m44L63l9k10L40k11j02L21k40p2
2541a09K48l61J93J70l84L75n0j96L55k25j30L69l98L9K20l63K26R2k31K62j7
$$ y = [196, -108, 229, 237, -114, 257, 28, -192, 138, -229, -231, 96, -276, -37, 187, -144, 267, 258, -14, 243, 31, -196, 126, -233, -237, 108, -289, -33, 205, -129, 203, 230, -70, 301, 37, -254, 174, -268, -250, 57, -291, -42, 173, -193, 212, 242, -78, 305, 103, -87, 232, -174, -228, 143, -312, -25, 110, -232, 169, 178, -143, 226, 9, -103, 228, -75, -146, 97, -292, -41, 124, -271, 152, 130, -124, 255, 31, -141, 264, -98, -98, 183, -261, 1, 60, -226, 121, 4, -168, 166, -11, -158, 291, -26, -26, 240, -121, -10, 159, -216, 38, 50, -265, 129, 7, -141, 180, -162, -35, 228, -173, 43, 146, -218, 179, 56, -214, 124, -31, -158, 148, -88, -89, 198, -215, 52, 108, -186, 79, 113, -181, 238, -22, -72, 192, -161, -85, 184, -173, -21, 185, -259, 104, 65, -145, 195, -16, -118, 203, -37, -109, 139, -222, -29, 141, -243, 132, 82, -114, 241, 16, -114, 255, -143, -104, 116, -247, -21, 71, -160, 102, 85]
2562H5k54M01k09r6K17l02k3K85l51K47J25l44L49Jk34L22k16n6K41k96l3K34
2584I3l46J73J68l16L56m3k14L79k20p3K98k79J2K07l44J23J01l49L05k0k15L41
2606A37k03o9K78k26J04K11l56J92O8l17K07n3j91K64j56j21L64k73J13K60k73
2627d0J90R0l59K84r3k36L02k45q1L29l21J35J97k24K24N9k88L18j79k18K46j84
2649i4j52K88k06M2K70k90K13M9k46K90j22j95L10k03l5K50k90J22K00l12J83
2670G2rk49K36p3k20L65j46q6L19j92O6J76k93J59M8l52K66j38k37K67q9p3K97
2693A14j53O1K24k58J97K3l36K97j54k21K38k21j5L23k57J20K55k80K23L0k88
2714g8K50j41j86K63k94l3K63k73J06J85k22K33J29k54K38p9j81K43k17j45K93
$$ y = [85, -169, 232, 23, -73, 144, -158, -181, 104, -247, 0, 125, -219, 130, 131, -103, 219, 3, -53, 188, -108, -141, 93, -253, -80, 88, -228, 128, 85, -129, 250, 30, -43, 255, -24, -12, 195, -149, -26, 75, -274, 31, 11, -204, 137, -66, -135, 143, -83, 21, 232, -124, 68, 136, -181, 26, -27, -218, 46, -110, -231, 133, -140, -27, 233, -40, 150, 240, -119, 165, 72, -164, 138, -107, -188, 141, -180, -45, 152, -72, 152, 211, -77, 241, 62, -156, 90, -94, -246, 42, -164, -122, 148, -142, 71, 120, -126, 164, 42, -153, 157, -46, -81, 169, -121, 1, 201, -111, 72, 63, -186, 50, -23, -243, 122, -24, -110, 209, 17, 83, 259, -34, 125, 173, -179, 87, -51, -288, -21, -110, -183, 114, -39, 22, 246, -12, 185, 208, -128, 169, 15, -206, 32, -189, -204, 119, -138, -18, 237, -43, 180, 210, -78, 172, 31, -155, 108, -186, -219, 44, -229, -123, 62, -160, 73, 202, -52, 186, 107, -74, 169, -48, -193, 100]
2735A00l39J03J68k13K09P8j48K36m8k34K38j69q9K21l14J48J43k72J82J15k11
2756i6K34q6j75K77k09q3K33k40L3K36l24K45N1k00K27p2j26K72k71j6K11k83
2778a62P7J64k02J86O2k50K72r2k16K94k23k7J68j97R6J01j52J44P1k33K27o9
2800C9j29K34k42J2K03k77N4J99k93K52N8k70L07r2j17K44k02p0K14k52P9J27
2822G8l23K43L3j81J94r3o9K06k06M9K27k21M7J56k62J79P2k33J39l2j11K50j75
2845c3jK17k28R5J40k44J23J1k31K07k5k13K83j40k0J93j60M6R2k55K14K0k24
2868a33K23r7j70K37j10k7K23k43O0J35k26J50Oj90K84r2j27K30j15p3K52k72
2890g5Q0Q2k44J91K6k25K01Kj59K69j34n5J78k05O0J43k76K09n2j55J99k4j45
$$ y = [100, -239, -136, 32, -181, 28, 106, -42, 194, 146, -88, 150, -19, -108, 113, -201, -53, 90, -182, 0, 115, -96, 138, 52, -123, 154, -55, -138, 95, -145, -112, 124, -200, 45, 96, -104, 123, 51, -75, 197, -74, -90, 121, -162, -85, 79, -123, 63, 125, -125, 147, 55, -161, 133, -90, -117, 51, -146, -50, 51, -101, 43, 114, -119, 108, 39, -90, 144, -98, -86, 117, -160, -106, 93, -200, 52, 110, -160, 147, 55, -62, 182, -20, -90, 124, -128, -49, 78, -245, -2, 31, -150, 44, -49, -118, 88, -118, -69, 158, -63, -16, 140, -122, 57, 129, -104, 35, 3, -108, 142, -33, -34, 183, -45, 50, 190, -54, 69, 80, -151, 56, 31, -182, 101, -39, -59, 134, -26, 20, 112, -143, 71, 91, -133, 90, -7, -177, 60, -50, -77, 146, -97, -37, 98, -128, 22, 28, -162, 122, 30, -97, 133, 18, -55, 197, -75, 5, 87, -157, 34, 60, -165, 36, 38, -121, 148, 14, -41, 137, -68, -8, 135, -141, 68, 16, -139, 60, 36, -109]
2913a09K57j50n3J98k26Q9N3j92J79L8k54K37N8j74J90j27q9J70j90J36N3k66
2935a72K59k8j64K00r9n5J75j90lK24k92J51O6j70J34J6j51K02l5q6J99k32K3
2958b8J18j73M1J38k52J86L1j83K38j1k26K42j19m8J68k02OJ66k32J59O1j73J91
2981I8p4j37K67j86p2K11k34J32Q5k22J81k3q9K26k03j20K75j95K6J26j33P4M5
3004E8k09K17k3k21K64j31p0K12j98K9J80k03J61L7k58J81O5k21K08r1j48K55
3026I4k05R2J08j39J01N8k06J30M4k53K52j13n5J82j62nK12k11P4J56k42J39j3
3049C8j85K61j10j63L18k75O4J19j14j7J61j44Q7j3j67K26j11j16K38j47n5J93
3071H8j40M8J12j94J13O6k21K54j69o4J76r7L9P8j38J12J9j66J46l2j48K03p7
$$ y = [-109, 148, -2, -55, 143, -83, 6, 59, -133, 46, 84, -170, 67, 125, -49, 141, 14, -75, 95, -95, 41, 94, -172, 87, 59, -105, 95, -4, -59, 116, -74, -77, 147, -145, 6, 72, -98, 36, 52, -99, 103, 68, -18, 181, -51, -28, 90, -83, -42, 96, -156, 30, 61, -122, 116, 105, -121, 121, 2, -46, 122, -80, -74, 92, -140, 19, 80, -93, 98, 24, -113, 154, -32, -104, 107, -127, 5, 90, -132, 49, 26, -63, 163, -40, -160, 115, -80, -54, 72, -61, 13, 58, -151, 66, 43, -178, 86, -45, -115, 97, -101, -72, 108, -95, 66, 103, -155, 26, 91, -130, 78, -13, -161, 94, -111, -19, 89, -50, 51, 109, -97, 33, 77, -176, 76, -37, -92, 90, -72, -77, 135, -76, -2, 154, -88, 51, 38, -147, 114, 4, -159, 159, -116, -52, 67, -47, -64, 97, -47, 40, 27, -140, 86, -25, -141, 97, -50, -105, 88, -52, -4, 108, -86, 27, 93, -128, 126, -43, -107, 69, -28, 11, 89, -49, 63, 82, -84, 62, 30, -118, 85, 8]
3094Hj37K55j71oJ67k72J20R6j82J91o1r0J96j25nJ27j99L4J66j94P6J41k42J51
3118D4k1j63K02m0r2J75j52RJ71j95O5M9j56J46qj72K45j11p4J66j49%J32j66
3142i5J52J7j85J84k8j67K67j77q1K55j69qJ24k18K19k0j61J71l0j27J68j25r2
3165a26K32j93P3J60k42J26O1k13J68%j36J82q7j19K74k04m5K13k47R7J01k00
3187a25J19j4j01K07j51PK02j76J3J37j51J20j8j26J59m9j88J71j09oJ90j44N7
3210B4O3q7O4K5j63J18o4j10J59o7o4K66k08PJ19j27M5O2j02P0Kj46K47k07J0
3235f4R0r4N0J18k23J50O6k31J89m5p3J86n9j13K14j91L2J36k21J30j3k05J97
3258B6k0j36K22n8p5J94j95O7J05k09M2M3j73J38k8p7K17j22jJ31j33M2R3k06
$$ y = [8, -129, 126, -45, -51, 116, -156, -36, 60, -122, 69, 8, -82, 114, -11, -16, 111, -88, -54, 112, -82, -6, 135, -107, 44, 23, -140, 62, 22, -70, 105, -47, -38, 133, -62, 3, 52, -104, 42, 34, -138, 107, -4, -78, 88, -61, -61, 71, -95, 57, 74, -111, 73, 45, -122, 145, -32, -113, 142, -27, -35, 89, -129, 90, 70, -91, 80, 50, -77, 91, -34, -126, 106, -87, -14, 146, -96, 30, 91, -122, 46, 46, -90, 92, 5, -114, 160, -44, -89, 124, -123, -26, 75, -125, -6, -20, -121, 86, -65, -58, 144, -32, -19, 118, -33, 87, 69, -57, 102, 53, -135, 36, -73, -79, 111, -33, 24, 87, 0, 64, 89, -74, 44, -20, -130, 29, -38, -102, 164, -44, -37, 82, -45, 0, 62, -40, 30, 32, -114, 133, -74, -64, 26, -68, -18, 100, -123, 27, 93, -138, 51, 6, -67, 119, 60, -53, 161, -30, 2, 138, -83, 47, 34, -171, 26, 6, -130, 92, 34, -41, 153, -42, 25, 130, -79, -37, 6, -167, -29, -57, -134, 83, -39, -40, 91, -42, 0, 93, -113]
3282a13J96m0j42J73p5j17K88j65j7J11j62O7J16j89R3M5j65J99o6q5R9j00j9
3305f8J65k19K3J11j20P1R1j49J34l0r5K49k14K6N7j80P4J18j83J05R2j90K22
3328I0n7j36K50p3j55J72j35J4O5j33J18P1j87J66q1r5J67q8m0J60j76M5R6j41
3352h3P1O3j06J45p1j09J89j26l0J80j98N4Q9r5J09J1j22J22o6j10J41q1l7J35
3376G5j77O7J50j72J48k0j57J23J4j90K26j36J3N7j39O3J11j33J61m2r7K05q2
3399F8j41J78j04j0O6j64P2J13j88J12Q7j52J06p9J9J59k06m8K22j34K3K0r1R2
3423B0J3j53K08j54k2J26m6l9J32k08J38O9j83J37M1k09J22o4j5J71j38N7Q3j59
3447g3J10N9j80J41Q6k03O9j8j23J92j09J8J66j88N1O3q3P7pj32K20j09j45J71
$$ y = [-113, 83, 43, -99, 74, -1, -118, 170, 5, -12, 99, -63, 4, 120, -69, 24, 69, -96, 103, 37, -48, 51, -49, -68, 97, -122, -99, 12, -108, -37, 54, -95, 39, 9, -86, 163, -51, -25, 32, -148, -74, 44, -139, -34, 58, -132, 90, 33, -103, 147, 74, -81, 91, -44, -30, 35, -98, 20, 91, -96, 70, -11, -106, 61, -27, -67, 93, -83, -38, 58, -83, -12, 51, -55, 90, 19, -90, 99, -27, -57, 123, -75, -21, 68, -27, 82, 93, -29, 93, 27, -83, 58, -23, -60, 75, -102, -35, 115, -57, 91, 71, -86, 37, 51, -139, 87, -49, -36, 21, -118, -55, 56, -77, 84, 42, -55, 150, 68, -73, 105, 1, -9, 57, -107, -35, 78, -110, 2, 89, -63, 43, -36, -17, 142, -64, -112, 110, -24, -1, 19, -72, 20, 33, -120, 88, -66, -88, 38, -8, -47, 85, -123, 15, 84, -99, 38, 79, -130, -8, -72, -87, 84, -54, 3, 86, -73, 37, 96, -84, 57, 143, -60, 9, -9, -132, 60, -49, -31, 135, -53, -2, 61, -22, 55, 48, -84, 136, 27, -118, 53]
3471E3o6l3J17j62P1O4j28J18m8j46K44lj40J60j20l8J38j30N9K3j57K25m7j37
3495h3J61j32K9R2j03N4K9o8K0R9j74J20Mj47J60m6q9J67j64K0J11r2lJ96k16
3520e5N0Q0j97J58m3q8J73j24JJ16r1N8J7j13J71q3n2O4k2p2J00j34J0J85j99
3545i0J05j9n5P9l2j07K36j08m2J08r4k6J82k85J14R3j45J06Nr4J36q5n2K37j48
3570A9l2Q1j15O3Oj04J00L3j53J49rm6R1j10L1R2j14M4P2j50J12p7k5R9p5q6J86
3597H2r0k7J17j30J03J6j33J21j13rR9p1j1J17r9k3J51j19J3R3j31L9L1n6J33
3622A03j02j7Q9r4M3J4j06M3M4j14Q8N6j64J84n6l2J05j27kJ10k11J28l1k7P9
3647CJ5q7J01o0NJ15j20J5Q4j85J33m3q7J54l4j8O3j1n8R8j28P4P2r9L9m1m8P7
$$ y = [53, -13, -46, 71, -91, -20, 44, -84, 34, -14, -160, 84, 81, -59, 101, -19, -57, 81, -49, 10, 33, -124, 101, 54, -83, 78, -54, -25, 67, -36, 18, 47, -21, -1, 98, -76, 44, 48, -99, 61, 15, -74, 93, -71, -51, 60, -32, -35, 161, -55, -5, 75, -122, 36, -7, -95, 78, -46, -45, 71, -20, 38, 55, -58, 113, 30, -22, 42, 20, -52, 48, -86, -76, 109, -90, 15, -4, -59, 20, -12, -119, 117, 9, -33, 75, -19, -45, 137, -148, -34, 59, -86, 20, 25, -69, 67, -18, -70, 167, 19, -13, 68, -47, 16, 22, -82, 18, 51, -102, 47, 38, -8, 83, -27, 4, 96, -18, 26, 98, -52, 60, -17, -42, 57, -18, -104, 82, -8, -35, 82, -48, 55, 71, -62, 59, -54, -63, 36, -35, -46, 71, -28, -51, 100, -19, -6, 87, -44, -5, 26, -30, 103, 1, -16, 73, -21, 22, 36, -70, -27, 17, -97, -9, 47, -117, 67, 11, -21, 84, -43, -45, 65, -146, -18, -49, -76, 3, 18, -69, 32, -28, -23, 92, -28, -13, 71, -114, 19, -24, -111, 43, 9, -9, 54, 43, -15, 83, -45, 29, 101, 2, 41, 0, -48, 29]
3675B9k2j07J07j11J1J39p6j8P8q0R6J5q8Q8n7j1N9m7p4R2r4j1J26j25O2O6l5
3702A2O0l7k4O2q9L8L4r3L8L2j34J23N9j20J30lj56J69r3qJ00j53M2Q0j09N6J3
3729B9p6K8o3J2J27j02l1J72j43J09j6j05J02l0o9J19k8p4O4j7r1J21q8Q8P1j16
3755gK8P1j32P3M6j43J11j01m3J55j37%J14j38Q2N1j35J65q2m2J35j14j5J01j02
3780e9O0L0r6R7j4n4J12r9r9K01j22P1K0m9K0N0r2J3N9j23J07j9r9J39p0KR6q0
3808Bn0O2p7Q7J7q9M0k1p7J28j09O5M8q2R4m8K2M9K2j18J56j28p1J37j30PJ17
3835E3j54R2J08j25J4L9p1J07n0l4N1p4l0R2j14O8P2j18P5L6q1J28q9l8Q9r8r
3862f1R6q7m4J22j24J42k0j06J59j6l2M6r3J1N3j03J4J02j19Q2k8j20J84m5k6
$$ y = [29, 7, -100, 7, -104, -93, 46, -30, -48, 30, -50, 46, 61, -27, 61, 4, -7, 52, 5, -69, 23, -71, -82, 44, -81, -19, 47, 12, 72, 35, 11, 73, -16, 22, 56, -37, 1, 33, -101, 22, 81, -39, 91, 88, -68, 101, 8, 0, 100, -53, -11, 69, -40, 16, 29, -47, -19, -82, -70, 57, -45, -76, 96, -47, 62, 46, -59, 43, 13, -56, 63, 35, -39, 25, 8, -83, 38, -50, 38, 109, -7, 21, 92, -40, 33, 79, -64, 47, -54, -97, 58, -79, -79, 35, -103, -21, 30, -105, 60, -22, -64, 71, -43, -58, 43, -59, 1, 31, -65, 32, 18, -36, 76, -23, -122, 79, -43, 28, 48, -1, 19, 69, -23, -10, 49, -74, 33, 14, -85, 54, -16, -14, 82, 2, -48, 14, -63, 24, 41, -48, -8, -29, -106, 22, -87, -22, 26, -56, 38, -10, 12, 61, 83, -35, 121, -7, -78, 59, -71, -64, 53, -101, -9, 99, -26, -12, 27, -44, 63, 13, -21, 30, -44, -74, 18, -96, -28, 44, -74, 1, 37, -44, 84, -5, -43, 46, -52, -61, 35, -52, -96, 26, -98, 44, 24, -82, 77, 61, 29, 75, -18, -7, 46, -57, -43, 59, -60, 22, -6, -126, 58, 13, -13]
3887a3O0l5kn3PlP8j13Q5%p5J11j2p0J17p0l5N3j21O3Mm0Q8K8j26J28o5rR4q3
3917ij5K7jM8p2j1K7N8o3L0j5l3O1l7Ojj5j8No1M2M1j2L7k8m7J07q1j2N0o7J5
3949d4J6q8J45m8k8R6Lj01R2Qo1Q6r9K2Mo2N3M2j18J15Jo7R3p2J4N5j09P3qq6
3979g3L9M7mnrq7R5p0K1Q6p5O3J5r2J01n6pP2j01MR5kl2j1nL9N9j06N5L6j31M2
4011Cj0k5MJOK5l4oN9l6L4k6mN5m5m0R0r0k7P7o4K9J6o8J05k6p6J48j3j04R2k8
4043B2j5P9r9k5M1n0P5J5j31J19L3p0nL8J7mj12N7J3k1O9l1r3Q9Qp3J17q1J4O
4073Bj3M4k0q9R0l2p6P6MrP0j26P8j2l8O9n4j0P6k1o5P6o6O2K0q2M0K4q6P2j1
4104gj4O0j7o3Q7r6m1J55j01m0Q7p7O0N7q2R1m5r3J00l4N1K8j08K5P3k9k7M7n9
$$ y = [-13, 47, 12, 10, -43, -36, -39, 39, -74, 11, 11, -64, 47, 35, -35, 82, 12, -23, 30, -91, -28, -24, -64, 24, 52, -74, 54, -11, -20, 74, -9, -24, 3, 2, 50, -22, -33, -6, 52, -11, 19, 4, -29, 32, -5, 1, 0, -15, -33, -28, -89, -47, -6, -18, 19, -9, -56, 51, -30, -42, 8, -59, -44, -28, -116, 29, -19, -47, 49, 52, -49, 43, 51, -10, 76, -23, -1, 3, -59, -6, 36, -82, 33, 34, -33, 60, -12, 2, 57, -52, 21, 13, -73, -34, 13, 9, 4, -5, -92, 3, -67, -46, 40, -35, 28, 43, -49, 52, -4, -11, 61, -40, -36, 59, 57, 25, 14, 9, 48, 107, 1, 56, 92, -39, 3, -7, -32, -28, -27, -21, 4, -30, -36, 23, -13, 21, -5, -9, 46, 1, -39, 51, -39, -66, 11, -53, -24, -8, -76, 29, 3, -73, 75, 62, -42, 50, 22, 7, 86, -13, -38, 3, -47, 28, 43, -88, 31, 64, -6, -11, 27, 44, 40, -72, -15, -2, -23, 46, 15, -78, 11, 19, -54, 63, -18, -4, 2, -11, 33, 13, -76, 14, -18, -94, -18, -14, -23, 47, -79, -1, -13, -51, 18, -36, -46, 30, 9, -56, 20, -46, 16, 36, -46, -6, 18, -68, 4, -7, -21, 39, 22, -41, 46, -50, -91, 64, -37, -77, 10, -67, -7, 50, -32, 59, 14, -79, 21, -13, 38, 66, -42, -17, 56, 27, 0, 47, -12]
4133a2K8j3l9L6J0LL1p9K0K2o1J5Q9n2l9J7l5N5m2K0P2n5L6J9q0M5K8p1O0l5m9
4164e6N8qlRmJ7N7q5J04n0j13P7pn4P0m7k5M9k9Q2Mk3k7R1j33P6n3LN2r1O3O0
4196F4n8m1K1k7L3L1m7J18n2p9P8p4mP6j22L8P2j04J51l7m2J7Lr9J47j06J9N3
4224B9j05Q1P2j70J52o2l1P9k7k2N8p7o0J34r8P6Qq3K2O8r9J10k9m6J10q9l8Q2
4252D5k0q8J11j03N7Rp1K3N1j6L4n9RJ00j14K0j2j7N8N4n4l3k2k3J16n0OLk1n7
4282f4P7o0L9R1j26R7m5k9K4J9k3Q8j16l1Q2l7M7k9k5QL0o1Q5o9K0O7j21L7J1
4311a4K1K6l7m1J02q2rJ12l1o3L0n5LO0l7M0J4p3O7j6o8J05q5J0L8k4j2M3m2J0
4341hm3L3R9r7k7N2k4N0k1n7LP5p0M4j3j2L7l4p4J42k9j7J0o2J1J5pN0l4l2Q5
$$ y = [-12, 16, 3, -36, 0, 10, 13, 44, -35, -15, 7, -54, -39, 50, -2, -41, -24, -59, -4, -46, -26, 46, -9, 27, 46, -34, 11, 39, -32, 28, -7, -56, 2, -6, -9, 0, -4, 13, 70, -15, 89, 39, -74, 3, -4, -58, 12, -35, -60, -11, -40, 42, 46, 23, -4, 87, -46, 30, -23, -20, 32, -59, 4, 64, 6, -35, -14, -41, -8, 23, -24, 94, 42, -37, 41, -33, -37, 39, -83, -45, 27, -77, 74, 37, -5, 12, 15, -84, 63, -43, -24, 29, -76, 5, 77, -93, 59, -3, -34, 45, 18, -4, 54, -23, -83, 51, -47, 29, 37, -46, -24, 44, -55, 55, 26, -20, 90, 1, -37, 45, 25, -63, 48, -55, 2, 11, -60, -37, 14, -2, 32, -27, -18, 82, -32, -12, -24, -41, 17, 71, 17, -16, -38, -61, 55, 5, 11, 14, -7, -64, 13, -47, -8, 83, -43, 54, 9, -20, 4, 23, 0, 88, -28, -59, 23, -14, 33, 4, -21, -13, 17, -44, 41, -28, -8, 59, -62, -25, -14, 7, 33, -4, -45, 57, -25, -34, 78, 47, -16, 14, -41, -38, 22, -15, 25, 39, -34, 33, 17, -51, 54, -31, -21, 17, -7, -19, 24, -18, -8, -51, -18, 81, -16, -43, 9, -15, 35, 14, -43, -40, 35, -35, 9, -4, -16, 21, -13, -87, 55, 26, 9, 19, -43, -32, -17, -24, 26, -8, -40, 45]
4372D5l2n7J32n7rj7m5L4O8k0p6%M1K3p0K8M2n9J3O7r9L9po8R3L5l4L3p7L4O9
4403F9j22N5M2n0l4O3j26J13J5r1J12k4k5J0k7PM4n9L5K1k8pj0L1jK1p2P3o0L4
4433ILm0K8J4j4L3m2mM4j6o9N6njKm0O4J5o3K9M7j19Q3p1%O5L5n2L9n9P2j2l4
4466cJ5M2j00P9l1j0L1LoJ3n2l4M5j7jmL5Kj3l4P6m4k1K1l6K0Q5j19L3R0r1J8
4498hK0n2L4K1J3M2o3K2o7oQ5k9o4J8ljJ05n5k2K0m3M1J0K9kn0o0O7k4r2J58p5
4530c1pL1K3L6j8k3Pl3j8M2K2l9Rn7O2jl7J8O5p1J7l1Q1l5Jk3J7J0rJ0J6k4J3
4563B3n9J1J2pR6q5J1kl5KP6m1k6L8m1K8J6l7L0j8n8P2m5J7Q4p7J5j5jK5K2k0
4595A1P1r2l3O1r6K1P8k8rL7p8M2j1J2K1k1k3M1j4K1j6l6M5k1LnM0q6Q5m1r1J43
$$ y = [45, 13, -44, 88, 31, 22, 5, -40, -6, 62, 42, -34, -34, 7, 30, -40, -12, 30, -29, -16, 51, -48, -9, -16, -84, 9, 44, 10, 43, -34, 0, 69, -53, 2, 44, -6, -40, 23, -103, 10, 25, -66, 46, 22, -3, 7, -20, -13, 31, -28, 7, 28, 0, -7, -17, 14, 13, 34, -38, 35, -25, 9, 12, -28, 0, 14, 0, 33, -9, -13, 31, 15, -54, 2, -3, -4, -2, -42, 22, 37, -26, 3, 50, -69, 14, -57, -57, 8, 43, -9, 30, -29, 43, 31, -3, 12, 54, -46, 33, 2, -8, 23, 26, 20, 33, -19, -53, -8, -25, -26, -30, 5, 7, -6, -40, 36, -8, -29, -8, -44, -24, 61, -58, -25, 65, -26, -8, 12, -40, -6, 15, 28, 70, 7, 29, -38, -44, 41, 12, -52, -34, -37, -38, 67, 12, -10, 10, -33, 8, 18, 47, 45, -5, -65, 2, -22, -114, 44, -31, -38, -7, 16, 52, 34, 11, 18, -15, -33, 9, 31, -8, 1, -56, 6, 5, -32, -14, 51, -20, -3, -34, 47, 12, 13, -10, 7, 17, 8, 18, 34, 10, 23, -36, -25, -13, -20, 76, -9, 2, 0, -35, -33, 43, 2, -24, 14, -27, 1, 17, -20, 10, -8, -66, 6, -39, -22, 62, -15, 0, -15, -16, 9, 31, 11, 82, -10, -43, 18, -78, -57, 21, -7, -16, 21, -57, -15, -26, -14, 7, -14, -37, 4, -10, 11, -5, -41, 4, -17, -14, -19, 21, -65, 20, -21, -112, 31]
4627C1l8k4RMpN6k0Ml5%N6l7k2O6Rj06J07n8k5qJ7jm8J0J06k0q6Q4l7L8j7l1J2
4660a1K4n7M4J0j05J24o7L6N8r9KO6k7k5R6p5O8n2Rm6L7j4O1q7RJ8nL1K0k6K7
4691D4L6p1j2K0n4LQK6j2o2k0J49r8L0P2r7N5qLn1P5n2J5K8L7n2k3N2l1N7l6j3
4723A8j3M1j21P3K6k0J4pn2N0k0l9J04l6m3L3K1j2j8l6M5M9q1L7j0l9R1q7m7J32
4753E3j04L0Q3q5N5P0p9K4Np8L9l9M2O2q6K4L8n8L7p9mR0o0J5ll4N6l5mK1m%K5
4786A7j0q1K9L8K8K2o1qO3j9K1mk9k4K1k8P7l4m2R8j04L4J1pL0k1l8O4k0k9k9
4817c5M1m0R5r2L2nj1jpj6N6n2RL7LQn4K5K4k3pN5o5qM0KrpM0o8J10n7l5Q2j26
4852e9P3K8k4J3l2m5J08k7RK2k8m7M3Np0L2LJ3j2jMj4m3N6m6%N3k7k1J17r7N1
$$ y = [31, -7, -31, -22, -18, -25, 31, 11, 15, -20, -20, 36, -1, -23, 43, 52, -54, 53, -5, -30, -38, -21, -22, -70, -60, 46, 26, -60, 24, -13, 25, 8, -23, -11, 13, -44, 0, 10, -95, 29, -38, -2, 56, -43, -41, 25, -2, -27, 69, -6, 62, 10, 19, -27, 10, -4, 57, -30, -21, -3, -8, 23, 43, 17, 44, 80, 9, -3, 17, -37, -34, -26, 0, -12, -74, -94, 55, -43, -13, 59, -38, 17, 9, 12, -39, 36, -16, -1, 27, 64, 12, -11, 41, 10, 67, 31, 18, 5, 46, -75, -2, 24, 4, 18, 11, -41, 9, -11, -50, 54, 18, -25, 8, 29, 17, -1, -37, 8, 57, -24, 13, 3, -36, 55, -32, -79, 53, -51, -21, 62, -23, 32, 102, 23, 47, 52, -26, 13, -26, 16, 78, -8, 16, 54, -4, 33, -46, -50, 40, -20, -5, -8, -42, 14, -21, -25, -4, -8, -8, 17, 7, -74, -45, -7, 21, 43, -18, -26, 37, 18, 39, 35, 6, -18, 3, -25, 52, 18, -24, 74, -30, 4, 15, 8, 38, 17, -21, 43, 23, -6, -35, 6, -34, 61, -31, 1, -4, -15, -16, -23, -39, 17, -35, -26, 11, 14, 22, -32, -7, 17, -6, -13, 42, -23, -31, 9, 11, 2, -5, 35, -33, 77, 20, -15, 67, -59, 14, 42, 18, 31, -1, -46, 62, 35, 44, 66, 38, -9, 34, 39, -31, 1, 4, 17, 5, 4, 8, -6, -49, 7, -39, -39, 14, -13, -34, 83, -14, 37]
4884C7n4oK6K7m8O6q8%O6m7N2K0p3N1Rq4Q5J8p8jOL5J03j24mL8m8J7ml5J04r1
4916b5prO8m4k1L5m9R8lj07K0K0l6L3j3M5j3J6l5J4J6J1m7L9%m6R8m4l3J9QPJ4
4949B9k9k3L1l4Nk4JM9qlL2k3K3nl9P0n9L5m3K8q4Q8j9k3Mqj5Q0m4O0%l9o9J00
4983D4l5M0r2M1jj1K9o8K4K2K1km5k0ML3kk1Q8rk8J9n8N8l2n0O6j9L9k5m5M9o4
5016e0O8k0J1JN9k2r0O9k2k2M7j6l0O6q1J0O8n0J7JJJ5l4k4L4l4k2R4n9NMl7K6
5049a7NkO6mk9J5k3q0P7n8K3O2n8N6nm5K2N4m1L0n0k0N3o1K7L5k8MOMN0r8pQ7
5083E0m6n1P1m7K7N3j03N4j7l3O6m0j5Q2j7ok3l1J5N4m8M0k2l6J19m1m7j0n7M9
5113a0K3k3M2l6J8L1kj01K6P0o5J7m0O7m9k2M0Kl1OK5M1L8n4J6k8l4M5k4m8Q9
$$ y = [37, -17, -23, 3, 30, -18, 48, -40, -40, 26, -21, 31, 51, -22, 29, 38, -46, 39, 57, -21, -22, -16, 19, 122, -2, -6, 32, -16, 1, -3, -38, 66, -25, -32, -41, 27, -17, -38, -3, -52, 46, 43, -64, -44, -24, -60, -27, -40, 5, -8, 8, -27, -13, 3, 14, -33, 6, 6, -40, 58, 14, -19, 0, 8, 15, 29, 0, -23, 8, -26, -21, -45, -44, 5, -3, -6, 26, 3, 26, 21, -18, 52, -7, 28, -15, 13, -71, 17, -2, -25, -21, -29, -44, 36, -8, 52, 52, 13, -56, 44, 9, 49, -43, -2, -3, -14, 15, -53, -29, -7, 14, 12, -33, -53, -49, -16, -18, -39, 49, 40, 12, 31, -27, 31, -1, -51, 15, -4, 35, 10, -35, 14, -50, 18, -2, 9, 10, 69, 47, -43, 26, 4, -18, 29, 13, -17, 49, -32, -22, 46, -4, 13, 14, 15, 30, -4, -28, 6, -28, -50, 44, -15, -10, -6, -43, -17, -12, -14, 52, 48, 19, 34, 11, -69, 8, -50, -27, 35, -23, 33, 28, -17, 5, 59, 18, 48, -2, -22, 31, -30, -3, 32, 4, 8, 14, 18, 68, -30, -37, 50, 4, -47, 24, -23, 4, 57, -46, 8, -9, -42, 24, -16, -31, 51, 34, 28, 5, -26, -11, 43, -5, 35, 13, -23, 96, 55, 8, -2, -59, -10, 13, -10, 32, -4, 14, 45, 43, -58, -32, 38, -27, -10, -50, 17, -32, -54, -14, -12, -43, -37, -12, 29, 67, 13, 29, 1, -33, 12, -12, -60, 29]
5144B9o1N7k0J4K0K0m6J1J1n5L0M2J1q0%NO8r4JP4l4J4lk4j8K4J6k5JJk8J8Qq
5178b1k7P2m9LM%K6L0l1kqlJ1J6J9ok0L6j20Q8Qj1Mk5k1J5%lnRN1m4j7N9m2pm7
5215e8L5K7j1k2L8n7MO3j6L4O4j10k8Q5l3Qk3l5K3j4j8K6L2k5O9p9KK3n9Q5p8
5246d8mJ1L8M2L2j08J3O9n2J3n2O1K9m2J3K7p9QL2K1j5K5j16J08QnKlj5mk6j0
5278b7j1lN4K6Ln0O0m9qQ0j05M8k9K8nRk3k6PJO3k0%l8O6Jq6L9l6mN3K1n8L8K0
5313C9q1N3K5krm9J8N0n5N7j2p5P8l8j0L7k5l2J8LK7k5Ql0J2O0n8Mk2J2Qn0P7
5346A3j3k1J3n5M9L8j4l6P1o5J4k4N8k7JL1p0M7K8k8Nm4L2N%j4j9K7J0k2m0K9
5378b1J3K0l4J9k5L9n3Q6l3J4n4K5L7o2L9J6j4qRm8O5Or7O2j2J2N4j8o4M2ljj6
$$ y = [29, -32, 25, 5, 19, 39, 59, 13, 24, 35, -20, 10, 52, 63, -17, -17, -12, 56, -38, -37, 37, 3, 17, 14, -10, -28, -4, 12, -13, -12, -11, -39, -21, -13, -21, -48, 24, -25, -22, -18, -18, 8, 38, 7, 5, -3, -6, 5, 21, 40, 34, 14, 50, -70, 18, 26, 15, 19, -6, -27, -12, -12, -15, -20, -11, 40, -4, -21, 38, -4, -11, -58, -23, 4, -7, -29, 9, -48, -44, 19, 3, 37, 101, -9, -37, 48, 15, 23, 0, -35, -12, -26, -44, -18, 14, -11, 58, -21, -19, 4, -55, 30, -48, -52, -41, -3, 39, 71, -37, -24, 45, -7, 6, -46, 15, 44, 2, 15, 42, -37, -29, 3, 24, 9, 34, -82, 26, 34, 29, 31, 28, 13, 9, -17, -27, -38, -41, 13, 39, 42, -8, 52, 3, -5, 75, -30, 18, -11, 17, 12, 21, -2, -28, -21, -20, 43, 23, 23, -15, 51, 52, -34, 5, -31, -35, 18, 39, -19, 19, 39, -42, 11, 36, 34, 25, -24, -6, 44, -11, 46, 34, -41, 37, -1, -11, 26, 1, -31, -13, -10, 17, -8, 0, -30, -18, 42, -16, -12, -34, -22, -14, -64, 13, 0, -21, -8, -63, -14, 24, 10, -26, 45, -20, -6, -30, 28, 1, 2, 33, -37, 10, 38, 10, 15, -29, 3, 8, 8, -6, -25, 2, 12, -10, -50, -21, -8, 12, -22, -3, -28, 11, -42, 44, 11, 25, -29, -4, 33, -29, 10, 26, 12, 4, 13, -35, 30, 36, -61, 1, -11, 1, 55, 37, -27, 15, 12, 11, -5]
5411eM8n2J6l1Rmm0J18p6n0M2L2Kk6nQ1k2o7K0J1o2P2L0p2N0o2M6l7J9M5p6M4
5443bJ1LPjmLL8q5K1P0n9%M8o9R2o4l4M1l0oK5l7rO1l0RK6p3P8j39R5N6k4n5N7
5478B0k8j4M6o5O8J0p7J2L4k8M3J8q1Q4q0N4O2j95J06k9M0J1M4j10J06j37N5L1
5506@j6O0k9lkl0K6l7lL1lj1L1L7k4m5k8L3k6M0LK0n2K1K3q3L6N6l0M2j3J7m3
5539bQJ9L9m9k4l6M5j3M7j7k2L0r3Q0m0l8Q2n4M6m6M2lN7n3j8P2Rn6n8Q0l3J9
5571B0L3k3J0mq2K3P3nm5R0n3n8L4k9K7K0j7m0N2n7KL5NK9n3k8N9j3m9P6n6M5
5603B1K3k8o8PO8lK3mk1n4M1J8k5k4R5j01M1l9Q2J8r8R6j7j26Q5K0l9k4M3k7K5
5634HOj2K9km7jJ9k6P5q4pP3j5jj0J8K5j2L0o7K8L3m1m5J2L1NK7l8n6L1M5m6J3
$$ y = [-5, 43, -9, 7, -24, -15, -19, -59, 59, -17, -67, -25, 7, 9, -17, -22, 59, 37, -30, -10, 1, -61, 11, 41, -31, 19, -43, 3, -34, -15, 30, -46, -2, 9, 12, 19, 18, 14, 17, 55, -30, -9, 61, 2, 2, 50, -19, 73, 9, -25, 16, -14, -20, 5, -32, -41, 20, -10, -1, 25, -48, 30, -109, -14, 42, 18, -37, 20, -8, -22, 24, -41, 27, 37, -40, -28, 6, -22, 21, 39, -42, 42, -38, 16, 78, -117, -11, -40, 0, 11, 55, -55, 51, -86, -31, 0, -16, 44, 15, 12, 10, -20, 6, -31, -34, -3, -6, -17, 14, 51, 27, -18, -46, -13, -39, 1, 4, 24, -28, -7, 16, -67, -31, 25, -5, 37, 24, 41, -2, 6, 25, 64, 15, -9, -45, 0, -13, 34, 17, -5, 25, -68, 12, -28, -66, 16, -38, 8, -38, 4, 1, 58, 5, -13, 59, 68, 12, -46, 34, 1, 20, 53, 30, 40, 36, -46, -23, 50, 45, 0, 90, 37, -21, 13, -16, 11, 31, 14, -26, 26, -31, -29, 6, 11, 40, -13, -41, 18, 5, -44, 32, -24, 21, 44, 16, -52, -45, 23, 20, 43, 39, 18, -36, 5, 23, -2, -26, 69, -32, 9, -30, 52, 70, -28, 68, 51, -75, 10, 30, -9, -33, 10, -17, 8, 14, 2, 31, 29, -18, -19, 0, -26, 49, -35, -42, 31, 16, 15, 5, 23, 48, 36, 66, -1, 27, 60, 19, -26, -14, 17, 22, 49, 11, -45, -14, 31, -15, -2]
5668bPP1m6j13J09k8L4m3l8M6J0J9p2k0O0j0J4k6N1m1J9NM1m6k5M5J7l5o2R0j0
5699B1OJ5mj2K%Qm9K9l9j2RR0o8n9R5j4l6R6r2nL3Pn5j0j0P2j0p0Q4J5q6N6J7
5733B4j8J1k5pK8m1L3l4J5M2k9RJ2l0j0J5QP5o6l8M6k5L7q2L7M3Mj1n1K4J1K0
5765B7p9L2P9k2l0l2M4n4M5J6o4R6l9p1J10o8J6J8k7J5J2n6O1k9kOL0m7npK4K1
5797B0j4N7r4K5J3L6o6J5j8jO9on8P2r4M7j3PK3j4l6O0l7K4j3n1N3O2q3L0K0o0
5829b5L0lLK1Jo1P1k3J3%l9J9Nm1m5J00n4K1JK5mp3M9Mj7N6On3M4n0N4n0k5KJ01
5864F3q4k4P1J1kk6Oj5MJ7%l9k0P8k2N7l3n9J6L5k4M7p7L6K9r4M5m0N4KL4n6J3
5897CJ7l8NM3k4L0n2L6O3n4mk3J3l5N2l8J6n0N7M8r4O2K4q1J6kk1K4Nl2K6K3k9
$$ y = [-2, 5, 76, 30, -83, 26, -2, 32, -11, -49, -3, 7, 26, -46, -66, -6, -16, -2, -28, 23, -18, 1, 6, 47, 1, -24, 21, 38, 3, -59, 31, 21, 27, 42, 38, 26, 28, 28, 36, -13, 16, -23, -35, -26, 64, -4, -63, 32, 18, -18, 78, -14, -19, 14, 21, -34, -44, -54, 18, 8, -62, 22, 37, -49, 7, 24, 6, 17, -8, -15, 13, -28, 5, -29, -14, 28, -1, 8, 20, -10, -20, -5, 3, 78, 12, -26, 20, -5, 32, -50, -13, 30, 34, 23, -28, -4, 7, 27, -52, -20, 59, 37, 7, -25, 19, -35, 10, 26, -38, 58, 19, -52, 58, -10, 6, 24, -3, 12, 24, -32, 29, 0, -2, 4, 34, -13, -18, -25, -1, 20, 6, 63, -31, -6, 7, 43, -23, -8, -26, -27, 42, 36, -22, 50, -44, 3, -10, -3, 20, 6, -30, 30, -7, 17, 4, -47, 6, 68, -15, 15, 35, -25, 5, 2, 5, 26, 27, -34, 37, 14, 27, 27, -12, 7, 12, -29, -74, 26, -28, -7, -6, 19, 15, -58, -9, -5, -22, 34, 40, -13, 31, -19, 35, -15, -40, -38, 63, -21, -45, 26, 37, 35, 9, 15, 0, 4, 21, 21, -18, -38, 40, 18, 75, 42, -17, -1, 34, 10, 57, -20, 16, 45, -49, -4, -44, 10, 12, 46, -10, 3, 20, -18, -13, 30, 6, 36, -16, 20, 83, 29, 25, 2, 15, -20, 32, -6, 10, -40, 17, 65, -29, 33, 57, -24, -8, -10, -31, -7, -2, -34, -8, 15, -14]
5930a4N7k7n6L9jl6M1m7O2M9n1Lj0r6J71r9j9M2l1K1P7j03L3PL2J4J8p2l2N7m8
5961a9L2l4J0j9L8o0J9QP1r5K4L7j4j5M5K3j28N3m2J11k7r9J35j28J4O6j6RJN1
5991E1k5N1j11M7j4mN2j5p9P4o3kJ3kLM3k3j6jK0J7k1J5K9q7O9j3j7J6M5p1K2
6023CK4j3M9l3m9L7l4k5J9J7k4%L6JK2p3j3O3Qql0Q7j4j15O8j7k6M2j5k5P9p5
6055c4l8Q9Jm1MJ0J1n3K4M4n2j2L4l7N3L5r0J5Q0k2L0m1M2m8L9j15J24q9J0l3
6085f0N2K2j5m1L3O7j11Q3k1j7K1n6N3Qm4O6l7j2L4mmk2pL1jkpl8J1M5k0J0n2
6118c5K1N2m1N3p7K1l0M5j4J6l9M0p7Q1Q0r8J0j1j2Jl1M8N5j49J03L9l9jp5K8
6148c6j3J0j0R7o9mN1k4mL3p2M9J0l8N3kpl5L6p0Q5k2l4l6N0M0j2n3L8k3k3K2
$$ y = [-14, 43, 16, -40, -1, -2, -38, 3, -44, 18, 67, 16, 19, 9, -87, 84, -15, -34, 8, -23, -2, 75, -28, 5, 12, 44, 58, 76, 4, -28, 29, -19, 13, -21, -11, -30, 8, -52, -33, -25, 46, -49, -25, 12, -2, -17, 28, 51, -77, -24, -66, 45, 18, -81, 54, -74, -60, 6, -10, -1, 0, 51, 26, 77, -34, 13, -1, -5, 47, 32, -47, 27, -36, -38, -25, -27, -24, 19, -4, -20, -21, -1, 16, -5, 10, 39, -48, 21, 8, -9, 7, 52, -19, 3, 27, 14, 63, 30, -19, 18, -16, -41, -22, -5, -29, -29, 7, 8, 30, -43, -56, 7, 15, 7, -23, 64, 50, -65, 3, -14, -40, 2, -13, -38, 41, -34, -72, 17, 18, -23, -19, -9, 2, -51, -27, 17, -35, -47, -13, -50, 3, 38, -52, -37, 43, 21, 51, 10, 52, 4, 43, -72, 52, -37, -27, -60, -8, 14, -1, -42, -9, 58, -53, 30, 9, -8, 13, -43, 10, 18, -26, 40, 3, -9, 25, 21, 17, -5, -12, 19, 18, 16, 9, -29, -18, 27, 7, 17, -35, -14, 38, -3, 50, -27, -6, -36, 9, -5, 11, -28, 12, -65, 16, 96, -2, 8, -3, -15, -14, -45, 3, 58, -91, 12, 51, 12, 11, -64, -36, -49, -39, -49, 48, -21, -25, 26, 2, -2, 31, -41, 8, 18, -20, 33, 31, 24, -11, 25, -45, 40, 18, -16, -52, -2, 38, 26, -27, 11, -12, -35, -13]
6180a3l3J7K2J1mK9m5P5n4j1KJ2O8p1M9p6M6n3N7m1J1lM1r2N2ll2M2JK7N9j28
6212c8j5O3rj5k2K3J5%%L6m1K0j1jK4j6o2JP1p9O6m7PMJ4L3l5K0J1L5p7L7QKk8
6247fK3om0N7J2nJm8M6l4k2L4n3M3K3q9J00m5k5N1m5L4oj0M9j3o9K8J9kKJ2kk
6281A2K5q8Q9n8N2Kj6J7k8Qm0J13o4Kk7M7l1l3M1j9K9j2m7K4Jj5J4m2M5n0M4M5
6313D0j4m2l1L8Ml0N1L7j9K8n2J6l0J8Kk1J4J0l5oJ6l3J13j7j06N3kK0m4L9pK
6345A2Nj9N3o9L6J6j6k8L7Qjm4k3L2L1Ok8m4qM0n4O0nj0O9n5kM9l1J7Jl9j0L8
6379B4o1K4KJ0J5kmJ3l7k3O0o7R6q8M3ko4Q2n9K1NK3nm0J1K6rK4p1J04m3j7LQ4
6413G8o8mj6J8ll7M5K1oo5P0m9qO9m4M2j8m2L3m1N1K9p6nJ1K1j1oJ0l5q%P0o0
$$ y = [-13, -46, -29, -7, 4, 0, 29, -16, 59, 5, -6, -4, 8, 76, 5, 54, -22, 24, -29, 28, -13, -2, -5, 36, -56, -4, -7, -39, 3, 4, 31, 90, -38, -53, 10, 1, -14, -36, -13, 2, 2, 2, 38, -3, 17, 6, 5, 29, 13, -49, -48, 23, -56, 10, -37, -30, -26, -12, 21, -14, 6, 17, 52, -25, 12, 20, 22, -6, 17, 11, -29, 28, 40, 35, 36, -12, 34, 0, -22, 12, -41, 2, 25, -64, 36, -9, -34, 17, -28, 6, 0, -10, 39, 26, -43, -15, 4, 2, 4, 16, 14, 12, 37, -51, 38, -20, 32, 34, 18, 35, 7, 15, -25, 88, 24, 26, -1, 46, 15, -18, 23, 4, 33, 21, -26, -2, -1, -16, -2, -44, 1, -49, -5, 40, 26, -16, -47, -9, -5, -35, 16, 53, 34, 62, 10, 26, -4, 14, 16, -5, 9, 19, -16, -22, -6, -39, 74, 57, -49, 4, 2, 22, -22, 17, 10, 12, 17, -2, 51, -18, 18, 34, 18, -10, 27, 35, 34, -10, -33, -1, 30, 36, 8, -36, -44, -4, -58, 2, -3, -13, 56, 1, -1, 48, 17, 34, 35, -4, -14, 24, -37, -13, -11, -1, 14, 12, 8, 21, -16, -39, 21, -46, 50, -38, 5, 3, -61, 21, -38, -17, -12, 11, 6, -34, -23, 3, -6, 18, -53, 51, 8, -9, -6, 78, 10, 6, -10, 8, 5, -32, 13, 34, 28, -37, 33, -16, -24, 45, 1, 43, 25, -17, 16, -25, 26, 55, -21, -26, -15, 6, -5, -11, -1, -36, -44, -44, 26, -34]
6447c4k0R7k1n5N9n2K3l0N2j8Ql9N2m6On0O9L9m7n0J17o0rN1p4J4K0OLj8K4k0
6479cN9m4j8K1mqj1L2l1k5K7mQk6P9n2N1j1n9L6k6l4K1J3k3J9j6J7j3N2j2l6k9
6512e0J13j55M6P2n7O6o8K4J2l7M1J7r6M0O9o1M0k0j0P5m8k0j7Rqk8J33k1k7k1
$$ y = [-34, -54, 43, 22, -33, 26, -26, -3, -33, 19, 1, 9, -30, 22, -24, -18, -68, 1, 40, -7, -57, 60, 0, -9, 42, -32, -18, 2, 8, 11, -7, 17, -3, 56, 12, -6, 15, 11, 3, -8, 24, -7, -32, -5, -9, -1, -27, 52, 0, 51, 40, -19, 17, -9, -43, -22, -9, -32, -13, -29, -12, -25, 27, 15, -21, -50, 63, -92, -46, 26, -31, 35, -33, -9, 3, -34, 7, 24, -72, -32, 37, -24, 16, -4, -14, 61, 13, -7, -24, -15, -23, -51, 82, 61, 34, 13]
$$ [...]
8191A9
##END NTUPLES=NMR FID
##END=
