##TITLE=1H_DE-80H_X3
 200.13MHz, d2o
 8 sc
 
 19ns.26.2.2025
##JCAMPDX= 6.0         $$ Bruker NMR JCAMP-DX V2.0
##DATA TYPE= NMR FID
##DATA CLASS= NTUPLES
##ORIGIN= UXNMR, Bruker Analytische Messtechnik GmbH
##OWNER= pz
$$ XWIN-NMR		Version 3.5
$$ Mon Jun 23 12:27:24 2025 Russian Standard Time (UT+4h)  Yarkov@DPX200
##.OBSERVE FREQUENCY= 200.1313
##.OBSERVE NUCLEUS= ^1H
##.DELAY= (6, 6)
##.ACQUISITION MODE= SIMULTANEOUS
##.ACQUISITION SCHEME= undefined
##.AVERAGES= 8
##.DIGITISER RES= 18
##SPECTROMETER/DATA SYSTEM= spect
##.PULSE SEQUENCE= zg30
##.SOLVENT NAME= CDCl3
##.SHIFT REFERENCE= (INTERNAL, CDCl3, 0, 14.3821)
##AUDIT TRAIL= $$ (NUMBER, WHEN, WHO, WHERE, WHAT)
$$ ##TITLE= Audit trail, XWIN-NMR		Version 3.5
$$ ##JCAMPDX= 5.01
$$ ##ORIGIN= Bruker BioSpin GmbH
$$ ##OWNER= Yarkov
$$ C:/Bruker/XWIN-NMR/data/yarkov2/nmr/H-C/1/audita.txt
$$ ##AUDIT TRAIL=  $$ (NUMBER, WHEN, WHO, WHERE, WHAT)
(   1,<2025-06-23 12:26:33.37 +0400>,<Yarkov>,<DPX200>,
      <created by zg, POWCHK disabled, PULCHK disabled
       configuration hash MD5:
       00 E9 B6 7A A2 85 ED C7 34 08 36 98 17 FE 4E 26
       data hash MD5: 16K
       35 B0 F9 50 70 D0 3F A3 B5 88 95 46 9C B2 A6 F9>)
$$ ##END=
$$ 
$$ hash MD5
$$ 04 EB 27 DD 04 0F BC 5C D6 27 C4 4B C1 B9 33 89
##$RELAX= 
##$RELAX= 
##$RELAX= 
##$RELAX= 
##$RELAX= 
##$RELAX= 
$$ Bruker specific parameters
$$ --------------------------
##$DU= <C:/Bruker/XWIN-NMR>
##$EXPNO= 1
##$NAME= <H-C>
##$PROCNO= 1
##$TYPE= <nmr>
##$USER= <yarkov2>
##$AMP= (0..31)
100 100 100 100 100 100 100 100 100 100 100 100 100 100 100 100 100 100 
100 100 100 100 100 100 100 100 100 100 100 100 100 100 
##$AQSEQ= 0
##$AQ_mod= 1
##$AUNM= <au_zg>
##$AUTOPOS= <>
##$BF1= 200.13
##$BF2= 200.13
##$BF3= 200.13
##$BF4= 200.13
##$BF5= 200.13
##$BF6= 200.13
##$BF7= 200.13
##$BF8= 200.13
##$BYTORDA= 1
##$CFDGTYP= 0
##$CFRGTYP= 5
##$CHEMSTR= <none>
##$CNST= (0..31)
1 1 145 1 1 1 1 1 1 1 1 1 1 1 1 1 1 1 1 1 1 1 1 1 1 1 1 1 1 1 1 1 
##$CPDPRG= <>
##$CPDPRG1= <>
##$CPDPRG2= <>
##$CPDPRG3= <>
##$CPDPRG4= <mlev>
##$CPDPRG5= <mlev>
##$CPDPRG6= <mlev>
##$CPDPRG7= <mlev>
##$CPDPRG8= <mlev>
##$CPDPRGB= <>
##$CPDPRGT= <>
##$D= (0..31)
0 0.7 0 0 0 0 0 0 0 0 0 0.03 0 0 0 0 0 0 0 0 0 0 0 0 0 0 0 0 0 0 0 0 
##$DATE= 1750667192
##$DBL= (0..7)
120 120 120 120 120 120 120 120 
##$DBP= (0..7)
150 150 150 150 150 150 150 150 
##$DBP07= 0
##$DBPNAM0= <>
##$DBPNAM1= <>
##$DBPNAM2= <>
##$DBPNAM3= <>
##$DBPNAM4= <>
##$DBPNAM5= <>
##$DBPNAM6= <>
##$DBPNAM7= <>
##$DBPOAL= (0..7)
0.5 0.5 0.5 0.5 0.5 0.5 0.5 0.5 
##$DBPOFFS= (0..7)
0 0 0 0 0 0 0 0 
##$DE= 6
##$DECBNUC= <off>
##$DECIM= 32
##$DECNUC= <off>
##$DECSTAT= 4
##$DIGMOD= 1
##$DIGTYP= 9
##$DL= (0..7)
0 120 120 120 120 120 120 120 
##$DP= (0..7)
150 150 150 150 150 150 150 150 
##$DP07= 0
##$DPNAME0= <>
##$DPNAME1= <>
##$DPNAME2= <>
##$DPNAME3= <>
##$DPNAME4= <>
##$DPNAME5= <>
##$DPNAME6= <>
##$DPNAME7= <>
##$DPOAL= (0..7)
0.5 0.5 0.5 0.5 0.5 0.5 0.5 0.5 
##$DPOFFS= (0..7)
0 0 0 0 0 0 0 0 
##$DQDMODE= 0
##$DR= 18
##$DS= 0
$$ [...]
##$SUBNAM2= <"">
##$SUBNAM3= <"">
##$SUBNAM4= <"">
##$SUBNAM5= <"">
##$SUBNAM6= <"">
##$SUBNAM7= <"">
##$SUBNAM8= <"">
##$SUBNAM9= <"">
##$SW= 18.0517328524113
##$SWIBOX= (0..15)
0 0 2 0 0 0 0 0 0 0 0 0 0 0 0 0 
##$SW_h= 3612.71676300578
##$TD= 16384
##$TD0= 1
##$TE= 0
##$TE2= 300
##$TE3= 300
##$TEG= 300
##$TL= (0..7)
0 120 120 120 120 120 120 120 
##$TP= (0..7)
150 150 150 150 150 150 150 150 
##$TP07= 0
##$TPNAME0= <>
##$TPNAME1= <>
##$TPNAME2= <>
##$TPNAME3= <>
##$TPNAME4= <>
##$TPNAME5= <>
##$TPNAME6= <>
##$TPNAME7= <>
##$TPOAL= (0..7)
0.5 0.5 0.5 0.5 0.5 0.5 0.5 0.5 
##$TPOFFS= (0..7)
0 0 0 0 0 0 0 0 
##$TUNHIN= 0
##$TUNHOUT= 0
##$TUNXOUT= 0
##$USERA1= <user>
##$USERA2= <user>
##$USERA3= <user>
##$USERA4= <user>
##$USERA5= <user>
##$V9= 5
##$VALIST= <valist>
##$VCLIST= <CCCCCCCCCCCCCCC>
##$VD= 0
##$VDLIST= <DDDDDDDDDDDDDDD>
##$VPLIST= <PPPPPPPPPPPPPPP>
##$VTLIST= <TTTTTTTTTTTTTTT>
##$WBST= 1024
##$WBSW= 4
##$XGAIN= (0..3)
0 0 0 0 
##$XL= 0
##$YL= 0
##$YMAX_a= 36537
##$YMIN_a= -31364
##$ZGOPTNS= <>
##$ZL1= 120
##$ZL2= 120
##$ZL3= 120
##$ZL4= 120
##$ABSF1= 10
##$ABSF2= 0
##$ABSG= 5
##$ABSL= 3
##$ALPHA= 0
##$AQORDER= 0
##$ASSFAC= 0
##$ASSFACI= 0
##$ASSFACX= 0
##$ASSWID= 0
##$AUNMP= <proc_1d>
##$AZFE= 0.1
##$AZFW= 0.1
##$BCFW= 1
##$BC_mod= 2
##$BYTORDP= 1
##$COROFFS= 0
##$CY= 83.5205535888672
##$DATMOD= 1
##$DC= 2
##$DFILT= <>
##$DTYPP= 0
##$F1P= 10.8118882576601
##$F2P= -7.23987719738617
##$FCOR= 0.5
##$FTSIZE= 0
##$FT_mod= 4
##$GAMMA= 1
##$GB= 0.15
##$INTBC= 1
##$INTSCL= 1
##$ISEN= 128
##$LB= 0.25
##$LEV0= 0
##$LPBIN= 0
##$MAXI= 10000
##$MC2= 0
##$MEAN= 0
##$ME_mod= 0
##$MI= 1.114404
##$NCOEF= 0
##$NC_proc= 0
##$NLEV= 6
##$NOISF1= 3.799351
##$NOISF2= 2.8
##$NSP= 1
##$NTH_PI= 0
##$NZP= 0
##$OFFSET= 14.38212
##$PC= 1
##$PHC0= -1713.766
##$PHC1= 10.1666
##$PH_mod= 1
##$PKNL= yes
##$PPARMOD= 0
##$PSCAL= 0
##$PSIGN= 0
##$REVERSE= no
##$SF= 200.129724274929
##$SI= 16384
##$SIGF1= 3
##$SIGF2= 2
##$SINO= 400
##$SIOLD= 16384
##$SREGLST= <1H.CDCl3>
##$SSB= 0
##$STSI= 0
##$STSR= 0
##$SW_p= 3205.1282051282
##$SYMM= 0
##$S_DEV= 0
##$TDeff= 0
##$TDoff= 0
##$TI= <>
##$TILT= no
##$TM1= 0
##$TM2= 0
##$TOPLEV= 0
##$USERP1= <user>
##$USERP2= <user>
##$USERP3= <user>
##$USERP4= <user>
##$USERP5= <user>
##$WDW= 1
##$XDIM= 8192
##$YMAX_p= 0
##$YMIN_p= 0
$$ End of Bruker specific parameters
$$ ---------------------------------
##NTUPLES= NMR FID
##VAR_NAME=  TIME,          FID/REAL,        FID/IMAG
##SYMBOL=    X,             R,               I
##VAR_TYPE=  INDEPENDENT,   DEPENDENT,       DEPENDENT
##VAR_FORM=  AFFN,          ASDF,            ASDF
##VAR_DIM=   8192,          8192,            8192
##UNITS=     SECONDS,       ARBITRARY UNITS, ARBITRARY UNITS
##FACTOR=    0.0002768,     1,               1
##FIRST=     0,             0,               0
##LAST=      2.2672688,     0,               0
##MIN=       0,             -31364,          0
##MAX=       2.2672688,     36537,           0
$$ Real data points
##PAGE= N=1
##DATA TABLE= (X++(R..R)), XYDATA
$$ [...]
$$ plain form
293 -2637 1842 3511 -2594 312 746 -1559 1122 -2732 -1904 3887 -1435 -2145 2459 398 1963 1022
309 1022 -1952 3647 1814 -2877 1806 949 -558 1372 -2071 482 3177 -2291 -321 1706 -1361
324 -1361 1224 -394 -2126 2490 -482 -2229 1466 -860 -1 1180 -2750 780 2058 -2040 413
339 413 528 -403 1958 -1477 -1206 3038 -1077 -1728 827 -1073 575 -463 -2772 1970 796 -2526
355 -2526 815 141 -372 846 -2451 -464 1545 -2579 -798 713 -1181 1031 -249 -1045 2772 247
371 247 -1079 1398 -780 146 834 -2441 195 1028 -1886 364 297 -293 1773 -1271 -1048 2261 -832
388 -832 -1318 196 -1193 719 -44 -1906 1923 1263 -1179 1379 817 940 1584 -1493 104 1862 -1461
405 -1461 -447 391 -1066 718 -716 -1163 1935 -102 -1014 1059 -393 684 1197 -1555 520 1086
$$ packed form
293b637M479J669o105K906M34k305K681l854Q28N791n322p10M604k061J565r41
309A022k974N599j833m691M683q57j507J930l443K553K695n468J970K027l067
324a361K585j618j732M616k972j747L695k326Q59J181l930L530J278m098K453
339D13J15r31K361l435K71M244m115o51K555j900J648j038k309M742j174l322
355b526L341o74n13J218l297J987K009m124J781J511j894K212j280p96L817k525
371B47j326K477k178R26O88l275K636Q33k914K250o7n90K066l044K23L309l093
388h32m86J514j389J912p63j862L829o60k442K558n62J23O44l077J597J758l323
405a461J014Q38j457J784j434m47L098k037r12K073j452J077N13k752K075N66
$$ plain form
421 1086 -1086 517 -18 -538 1253 -1109 -810 2044 -120 -337 525 -623 1225 403 -1798 888 213
438 213 -1692 61 -529 -3 828 -1561 140 1893 -425 272 604 -555 944 -496 -1080 1158 -509
455 -509 -1045 619 -453 673 1032 -1218 455 906 -813 450 -438 -873 756 -1122 -821 1174 -379
472 -379 -359 273 -564 1195 433 -1502 652 210 -877 296 -285 240 978 -1039 411 1761 -233 184
490 184 192 -551 799 -517 -1071 766 -596 -801 503 -450 465 712 -1150 420 795 -476 451 -392
508 -392 -600 857 -618 -489 983 -400 -245 49 -631 871 208 -1348 338 217 -519 410 -454 56
526 56 749 -1073 11 1006 -548 -148 -140 -430 946 -71 -554 975 39 -44 734 -255 402 302 -1192
545 -1192 -39 242 -728 110 -518 -488 959 -178 -150 893 -180 155 327 -510 668 127 -1272 178
$$ packed form
421A086k172J603n35n20J791k362K99K854k164k17Q62j148J848q22k201K686o75
438B13j905J753n90N26Q31k389J701J753k318O97L32j159J499j440n84K238j667
455e09n36J664j072J126L59k250J673M51j719J263q88m35J629j878L01J995j553
472c79K0O32q37J759p62j935K154m42j087J173n81N25P38k017J450J350j994M17
490A84Qp43J350j316n54J837j362k05J304r53R15K47j862J570L75j271R27q43
508c92k08J457j475J29J472j383J55K94o80J502o63j556J686j21p36R29q64N10
526E6O93j822J084R95j554M00Qk90J376j017m83J529r36q3P78r89O57j00j494
545a192J153K81r70Q38o28L0J447j137K8J043j073L35J72q37J178n41j399J450
$$ plain form
563 178 167 -282 402 -413 193 894 -563 203 873 -295 76 -106 -330 787 -243 -718 533 -180 -148
582 -148 444 -356 239 350 -726 266 389 -351 276 -316 -302 761 -196 -231 589 -240 188 202 -540 507
602 507 110 -851 209 120 -156 207 -557 14 633 -547 1 453 -360 13 -193 -358 621 -206 -657 487
622 487 -30 50 393 -369 324 289 -627 189 167 -545 27 -495 -370 558 -363 -279 415 -134 320 294 -429 456
644 456 136 -608 224 -14 -204 129 -570 42 601 -335 34 363 -117 317 -20 -282 491 -256 -549 277
664 277 -109 24 223 -357 301 453 -361 364 240 -255 236 -326 -268 385 -387 -273 197 -245 247 165 -359
685 -359 411 147 -352 292 -64 -114 138 -524 -53 416 -430 -72 155 -135 341 -61 -197 485 -87 -245 306
706 306 -26 65 99 -431 208 241 -306 203 94 -159 309 -220 -162 376 -293 -160 120 -267 142 43 -422 291
$$ packed form
563A78j1m49O84q15O06P01j457P66O70j168L71j82k24J117j030m75J251p13L2
582a48N92q00N95J11j076R92J23p40O27n92J4J063r57l5Q20q29M28J4p42J047
602E07l97r61J060q9k76L63p64N71O19j180N48M52q13L73k06j65R79q27m51J144
622D87n17Q0L43p62O93l5r16Q16k2p12N72n22J25R28r21Q4O94n49M54k6p23Q85
644D56l20p44Q32k38j90L33o99O12N59r36L69L29m80M34l37k62P73p47k93Q26
664B77l86J33J99n80O58J52q14P25j24m95M91n62N8O53p72J14M70m42M92q2n24
685c59P70k64m99O44l56n0K52o62M71M69q46L58K27k90M76m02j36O82n72j58N51
706C06l32R1L4n30O39L3n47N09j09k53M68n29N8N38o69J33K80l87M09r9m65P13
$$ plain form
728 291 42 -261 174 -50 58 291 -323 45 436 -299 -11 54 -116 257 -114 -234 408 -82 -187 295 -115
749 -115 74 123 -373 209 230 -303 197 25 -120 263 -177 -86 290 -265 -79 151 -186 86 27 -335 221 27
771 27 -151 135 -121 -30 207 -283 37 235 -248 22 63 -94 256 -39 -298 276 -76 -123 192 -171 65 89
793 89 -330 137 130 -194 168 12 -89 239 -201 -81 221 -145 -10 135 -198 145 -6 -268 176 24 -127
814 -127 171 -160 -12 203 -213 43 148 -84 11 25 -113 230 -85 -200 230 -93 -104 94 -132 113 53 -236
836 -236 123 80 -159 57 21 -55 198 -142 -98 183 -94 27 51 -112 123 14 -209 80 -45 -121 121 -105
858 -105 -10 177 -181 37 117 -92 47 -1 -98 237 -147 -140 187 -73 -42 79 -109 131 24 -242 127 46 -203
881 -203 58 -31 -54 155 -148 -34 125 -109 15 -1 -52 162 -19 -183 135 -15 -78 91 -98 35 131 -187
$$ packed form
728B91k49l03M35k24J08K33o14L68L91p35K88O5j70L73l71j20O42m90j05M82m10
749a15J89M9m96N82K1n33N00j72j45L83m40R1L76n55J86K30l37K72n9l62N56j94
771B7j78K86k56R1K37m90L20J98m83K70M1j57L50k95k59N74l52m7L15l63K36K4
793H9m19M67pl24L62j56j01L28m40J20L02l66J35J45l33L43j51k62M44j52j51
814a27K98l31J48K15m16K56J05k32R5J4j38L43l15j15M30l23j1J98k26K45o0k89
836b36L59m3k39K16l6p6K53l40M4K81k77J21K4j63K35j09k23K89j25p6K42k26
858a05R5J87l58K18Q0k09J39m8r7L35l84PL27k60L1J21j88K40j07k66L69q1k49
881b03K61q9k3K09l03J14J59k34J24j6n1K14j81j64L18j50o3J69j89J33R6l18
$$ plain form
903 -187 71 95 -151 89 -30 -83 105 -63 -126 153 -61 -9 80 -50 77 88 -195 88 95 -69 41 -46 -40 69
927 69 -127 -6 128 -74 87 94 -34 106 -28 -122 91 -39 -64 78 -100 15 122 -136 55 50 -38 91 -26
950 -26 -95 101 -6 -91 94 -49 -29 65 -82 73 64 -118 46 -5 -36 34 -63 18 127 -124 -53 75 -126 23 -3
975 -3 -83 121 -74 -108 94 -1 -4 93 -110 39 62 -91 25 -2 -112 75 -82 -99 122 -64 -38 60 -36 21 39 -27
1001 -27 113 -24 -92 133 10 -62 38 -143 -31 64 -117 -36 33 -82 55 -18 -68 134 6 -67 112 -25 -20 11
1025 11 -72 -20 78 -87 18 66 -66 82 -21 -28 110 -31 -41 40 -57 2 97 -106 57 6 -143 65 37 -38 108
1050 108 -96 7 49 -41 -46 93 -13 16 -32 -84 97 1 -127 70 -19 -7 3 -31 44 73 -17 39 29 -28 -12 -52 -9
1077 -9 77 -29 -68 37 -62 39 40 -59 126 15 -64 21 -51 14 75 -71 7 31 -71 28 -4 -22 61 -34 -3 95 -25
$$ packed form
903a87K58K4k46K40j19n3J88j68o3K79k14N2Q9j30J27J1k83K83Pj64J10q7OJ09
927F9j96J21J34k02J61Pj28J40j34r4K13j30k5J42j78J15J07k58J91nq8J29j17
950b6o9J96j07q5J85j43K0R4j47J55rj82J64n1l1P0r7Q1J09k51P1J28k01J49k6
975cq0K04j95l4K02r5lR7k03J49K3j53J16k7j10J87j57j7K21j86K6R8r6N7J8o6
1001b7J40j37o8K25j23p2J00j81J12R5j81Q1O9j15J37p3n0K02j28p3J79j37NL1
1025A1q3N2R8j65J05M8j32J48j03pJ38j41j0Q1r7N9R5k03J63n1j49K08k8p5J46
1050A08k04J03M2r0nJ39j06K9m8n2J81r6j28J97q9J2J0l4P5K9r0N6j0n7J6m0M3
1077iQ6j06l9J05r9J01Jr9J85j11p9Q5p2O5O1j46P8K4j02R9l2j8Q3r5L1R8j20
$$ plain form
1104 -25 -71 63 -77 49 -42 -74 40 27 -20 -23 33 5 55 -45 6 128 -68 -85 46 -50 3 55 -105 8 13 -55
1130 -55 -13 -115 25 56 -2 31 75 -62 19 70 14 50 -31 -85 80 -20 -37 63 10 -5 4 -68 93 29 -36 68 -17
1157 -17 42 40 -60 -26 56 1 -25 6 -26 54 9 -12 51 -15 -32 -23 -46 26 20 -10 -27 25 -67 25 19 -23 58 6 -40 68 -42
1188 -42 4 34 -69 9 26 -68 -26 26 16 11 35 -74 66 -43 3 72 -68 39 9 -53 68 10 -7 108 11 -51 44
1215 44 3 40 37 -69 39 44 -72 18 -21 -28 49 -66 -33 7 -71 -50 29 -17 47 -33 -76 44 26 -32 41 13 -12 46 -64
1244 -64 -2 25 -21 20 -22 -75 64 -2 -48 68 9 -7 -11 -17 -6 74 -67 12 -6 -19 61 -23 -36 54 50 -31 39 -16 -15 -33 -61
1275 -61 28 -29 -36 60 71 -34 34 -9 -8 14 -25 -14 50 26 45 41 -17 -4 22 -61 6 3 -93 46 -38 -24 4 -23 -1 -30 -18
1306 -18 -6 -14 -40 26 -10 -28 28 -30 -18 59 -54 7 -24 0 43 15 -81 13 -34 -59 79 -10 61 47 -48 43 -25 -23 44 -12
$$ packed form
1104b5m6J34j40J26r1l2J14j3m7lN6k8N0j00N1J22j96j7J31r6N3N2j60J13No8
1130e5M2j02J40L1n8L3M4j37Q1N1n6L6q1n4J65j00j7J00n3j5Rp2J61o4o5J04q5
1157a7N9kj00L4Q2n5k6L1l2Q0m5k1O3o6j7Rk3P2ol0j7N2r2R2om2Q1n2m6J08j10
1188d2M6L0j03P8J7r4M2N2j0nK4j09J40j09M6O9j40J07l0o2J21n8j7J15r7o2R5
1215D4m1L7lj06J08Nj16R0l9pP7j15L3M0p8K1P9m6O4q0m3J20j8n8P3k8k5N8j10
1244f4O2K7m6M1m2n3J39o6m6J16n9j6moJ1Q0j41P9j8j3Q0q4j3R0mq1P0n5Jj8k8
1275f1Q9n7pR6J1j05O8m3JK2l9J1O4k4J9mn8J3K6q3O7lr6J39q4J4K8k7K2k9J2
1306a8J2qk6O6l6j8N6n8J2P7j13O1l1K4M3k8r6R4m7k5J38q9P1j4r5R1o8KO7n6
$$ plain form
1336 -12 18 -10 -33 -39 25 -69 5 -35 -4 4 6 -75 17 29 20 62 -77 -33 42 -16 11 37 -27 -8 27 12 32 -8 -37 32 -38 16
1368 16 65 17 9 9 -28 12 -10 -14 44 4 -8 45 -51 -10 22 -108 3 20 30 33 -8 -54 8 -26 -7 -20 -13 -5 4 27 15 34 9
1401 9 69 8 -30 -53 -9 -33 18 3 31 54 30 -12 -14 -19 4 -22 3 37 27 75 46 -5 44 36 4 35 17 1 72 19 -37 -4
1433 -4 19 -55 -16 -52 -68 -1 37 -2 -33 -20 -20 -19 8 13 9 34 -5 16 11 17 -28 -19 89 -64 3 71 -46 39 -15 11 20 7 0 46
1467 46 -91 46 16 24 15 47 -9 -39 16 -6 5 -28 -2 -4 -57 45 -5 2 -30 3 9 36 -4 -55 59 28 13 -1 -7 50 5
1498 5 -31 103 33 3 -12 31 35 17 45 70 74 -21 -70 -2 44 41 42 -4 -1 -32 43 17 7 18 0 -13 14 0 -25 15 12 -32 12
1531 12 9 0 -30 -3 34 29 -56 48 26 40 33 -29 -28 39 12 -26 18 -3 12 25 5 16 43 -1 32 -32 -12 12 4 13 4 -34 16 25
1565 25 -6 -21 -10 -37 8 38 -14 -14 49 -29 39 13 51 -21 -12 49 18 46 18 42 -7 31 -73 23 -38 -32 -32 -17 -68 -25 -10 11
$$ packed form
1336a2L0k8k3oO4r4P4m0L1QKq1R2J2rM2j39M4P5n8K7K6o4J9L5j5K0m0k9O9p0N4
1368A6M9m8q%l7M0k2mN8m0j2N3r6M1L2j30J11J7J0Lm1m6O2l4J9j3PQRK3j2J9k5
1401IO0o1l8k3M4k4N1j5K8K3k4m2knK3k6K5L4j0M8k9n1M9ql2L1j8j6P1n3n6L3
1433dK3p4L9l6j6O7L8l9l1J3%JK7NmK5l9K1nOm5RJ08j53O7O8j17Q5n4K6Rj3pM6
1467D6j37J37l0QrL2n6l0N5k2J1l3K6kn3J02n0Pl2L3OK7m0n1J14l1j5j4oN7m5
1498El6J34p0l0j5M3Mj8K8K5Mr5m9O8M6lJm6Ll1P5k6j0J1j8j3K7j4k5M0lm4M4
1531A2lrl0K7L7nq5J04k2J4po2JO7k7l8M4k1J5J3k0J1K7m4L3o4K0K4qRrl8N0R
1565B5l1j5J1k7M5L0n2%O3p8O8k6L8p2RO1l1K8k8K4m9L8j04R6o1O%J5n1M3J5K1
$$ plain form
1597 11 16 -49 64 1 16 47 18 -44 14 -28 -29 16 -22 -15 19 -10 25 44 -62 -2 2 -24 17 32 -19 55 -54 -57 -30 9 14 -47
1629 -47 -21 -12 13 -10 -38 -60 -5 -7 -46 -6 -14 -5 13 -20 1 21 2 7 77 -10 38 33 -25 17 -22 -21 22 -25 -17 -5 24 -46 50 47 28
1664 28 12 25 -20 -47 16 12 -17 -26 -17 -3 -3 -19 -9 4 30 -19 18 34 32 -14 69 6 -51 -14 -21 -16 1 -36 -47 -5 33 -8 9 -31
1698 -31 34 -66 -3 -8 -14 -28 -5 -20 34 20 20 -19 45 -8 11 -22 28 3 42 48 -32 -28 -22 -13 58 34 -1 40 18 -19 -22 62 -50
1731 -50 18 3 12 31 1 -11 22 -3 18 3 28 2 -50 -38 4 -33 -25 8 60 40 57 -20 12 34 -25 9 1 -32 -40 -27 14 43
1763 43 -5 -24 32 28 52 -5 -8 37 4 5 28 -58 17 -47 -39 30 28 -18 -28 40 -86 -44 30 -35 -6 -8 -7 19 -29 44 5 23 24 56
1797 56 -31 -4 12 -8 -29 -20 2 1 -49 -43 14 -40 -42 20 -48 29 -18 9 33 -12 68 2 -43 -16 -9 53 -21 36 -37 -14 -3 10 -31
1830 -31 -17 10 68 -35 -46 4 7 11 9 8 15 -25 13 7 -10 -34 18 28 -1 26 14 5 2 45 8 18 -42 40 -3 28 70 27 10 13
$$ packed form
1597A1No5J13o3J5L1k9o2N8m2jM5l8PL4k9L5J9j06O0Mk6M1J5n1P4j09lK7L9No1
1629d7K6RK5k3k8k2N5kl9M0qRJ8l3K1K0j9NP0q7M8nn8M2l9JM3m7QJ2K9p0R6lj9
1664B8j6J3m5k7O3mk9rRJ4%j6J0J3K6m9L7J6km6Q3o3n7L7pNJ7l7j1M2L8m1J7m0
1698c1O5j00O3noj4K3j5N4j4%l9O4n3J9l3N0k5L9Oq0MORP1k4l5M1k2l7lQ4j12
1731e0O8j5RJ9l0j2L3k5K1j5K5k6n2J2M2l7QL3N2k0J7p7L2K2n9L4ql3qJ3M1K9
1763D3m8j9N6mK4n7lM5l3JK3q6P5o4QO9km6j0O8j26M2P4o5K9kJK6m8P3l9J8JL2
1797E6q7K7J6k0k1RK2jn0ON7n4kO2o8P7m7K7K4m5Q0o6m5K7PO2p4N7p3K3J1J3m1
1830c1J4K7N8j03j1N0LMkjPm0L8oj7k4N2J0k9K7j2rlM3l7J0o0Q2m3L1M2m3j7L
$$ plain form
1864 13 -28 32 33 -8 1 8 -2 13 30 -16 -1 56 24 9 4 3 -17 -75 -10 -39 -5 42 10 22 -13 43 16 13 21 -20 27 -53 41 -6
1898 -6 17 0 -2 28 -19 21 -3 4 -61 29 37 35 2 -34 7 -6 -33 -45 -19 0 89 -21 -40 1 -24 12 -4 -23 -19 -28 -19 -30 -30 -27 -9
1933 -9 -12 79 -16 28 -62 57 -5 -48 11 26 -41 43 -13 -18 -4 -36 18 -6 -42 61 2 -15 25 5 49 -11 -32 -35 -65 2 11 18
1965 18 -13 -18 -10 -21 32 34 -3 -22 -18 1 -33 13 -14 33 11 -43 47 -7 14 -35 -17 25 -73 -61 68 -41 25 -5 -38 -39 -54 28
1997 28 34 37 16 71 -14 -20 -31 13 -13 -10 13 -16 -35 -3 -8 -16 -18 -1 33 2 2 -41 -22 21 -10 42 -1 8 -69 -36 14 -10 -3 -44 33
2032 33 -11 7 29 -20 -35 16 -39 -13 60 7 -28 -21 22 11 53 19 71 17 -13 -30 65 5 -15 -5 -30 -8 56 16 5 -38 38
2063 38 -65 48 28 -16 -7 -25 -37 -70 -27 26 -16 22 -25 16 -64 0 -7 -48 -34 3 -34 26 -8 -34 -8 62 15 14 1 -44 2
2094 2 12 -33 13 -17 14 50 -66 11 2 19 20 -9 8 -67 -5 7 -37 -22 8 28 -8 7 -27 12 -29 53 -45 31 -17 -57 5
$$ packed form
1864A3m1O0Jm1RPj0J5J7m6J5N7l2j5njk0n8O5k9L4M7l2J2l5N6k7lQm1M7q0R4m7
1898fK3j7kL0m7M0k4Po5R0Qkl3l6M1j3k7j2K6J9Q9j10j9M1k5L6j6j9MrRj1%LJ8
1933ilR1r5M4r0J19o2m3N9J5o7Q4n6nJ4l2N4k4l6J03n9j7M0k0M4o0k1ll0O7RP
1965A8l1nQj1N3Kl7j9MJ9l4M6k7M7k2n4R0n4K1m9J8M2r8J2J29j09O6l0l3jj5Q2
1997B8OLk1N5q5oj1M4k6LK3k9j9L2nqkJ7L4l1%m3J9M3l1N2m3Rp7L3N0k4Pm1P7
2032C3m4J8K2m9j5N1n5K6P3n3l5PM3j1M2l4N2n4l0j7R5o0k0J0k5K2O4m0j1m3P6
2063C8j03J13k0m4Rj8j2l3M3N3m2L8m7M1q0O4pm1J4L7l7O0l4k6K6P0m7jj3m5M6
2094BJ0m5M6l0L1L6j16P7rJ7Jk9J7p5O2J2m4J5L0K0l6J5l4L9m1Q2r8P6m8m0O2
$$ plain form
2125 5 -24 48 -3 -23 -7 -12 30 38 -8 21 9 35 52 -33 -57 -30 -48 -5 43 2 -11 16 -9 -19 -54 33 18 -26 13 34 -15 -47
2157 -47 5 -7 -38 28 7 29 -5 -10 7 -6 -28 -21 3 30 -17 52 32 55 -13 -31 46 -43 57 51 -61 23 16 12 20 -37 -22 4
2189 4 22 2 21 -25 12 -11 -11 -40 10 -46 13 -16 -3 -42 -2 28 22 -5 44 -33 -62 44 -44 10 -8 13 5 21 -11 10 26 18
2221 18 -21 -54 14 -26 -12 -47 19 -9 14 8 -5 27 51 32 14 8 26 -1 66 1 -6 -1 -21 -11 5 26 -53 -3 -20 9 67 -10
2253 -10 -9 -22 -8 -7 80 -11 -18 -25 48 33 28 14 13 -12 -11 15 -37 -12 9 -5 -15 52 16 0 -44 34 -48 -27 -33 -4 21 -19 -19 -20 -23 -9
2289 -9 31 -32 16 -56 13 -14 -29 25 71 -2 -39 10 -6 24 -19 -25 -20 18 15 46 -14 -13 9 -49 -40 -22 -26 -8 -55 23 -18 -50 -63 -35
2323 -35 5 -28 -3 -49 50 -18 12 7 -6 59 40 32 -34 27 35 15 3 16 30 26 -98 58 -4 13 -35 3 -9 3 -39 29 69
2354 69 48 15 -11 20 -7 -44 19 33 2 -2 -28 -26 2 2 -16 34 0 11 10 11 9 47 -2 -12 17 0 -16 6 11 -70 -2 -53 -28 -1
$$ packed form
2125Ek9P2n1k0J6nM2Qm6K9j2K6J7q5k4K7j8M3M8m1j3K7k5j0l5Q7j5m4L9K1m9l2
2157d7N2j2l1O6k1K2l4nJ7j3k2PK4K7m7O9k0K3o8j8P7q9J00oj12Q4pmQn7J5K6
2189DJ8k0J9m6L7k3%k9N0n6N9k9J3l9M0L0ok7M9p7k9J06q8N4j8K1qJ6l2K1J6q
2221A8l9l3O8m0J4l5O6k8K3oj3L2K4j9j8oJ8k7O7o5pNk0J0J6K1p9N0j7K9N8p7
2253a0Jj3J4JQ7r1ppP3j5nj4jk5JK6n2K5K1j4j0O7l6j6m4P8q2K1oK9K5m0%jlJ4
2289iM0o3M8p2O9k7j5N4M6p3l7M9j6L0m3oNL8lL1o0JK2n8RJ8mJ8m7P8m1l2j3K8
2323c5M0l3K5m6R9o8L0nj3O5j9qo6O1Qk0j2J3J4mj24J56o2J7m8L8j2J2m2O8M0
2354F9k1l3k6L1k7l7O3J4l1mk6KK8%j8N0l4J1jJkL8m9j0K9j7j6K2Nq1O8n1K5K7
$$ plain form
2388 -1 24 0 1 -28 23 -50 -9 15 -20 -44 -19 0 7 -28 15 -28 34 -2 -5 35 -29 11 -26 -3 -4 7 -30 -20 11 30 28 2 -62
2421 -62 -14 6 48 -31 17 13 -4 7 27 -65 37 -4 3 -13 -72 38 3 -55 11 10 -2 7 -12 14 -40 -10 12 24 -13 14 2
2452 2 -30 23 -15 -10 40 -27 -5 -18 -36 21 -17 -17 2 5 -31 -39 -5 29 -29 1 6 12 -13 38 -57 -46 19 -29 7 10 -13 -62 -5 -33
2486 -33 -29 -4 7 52 -23 4 -21 47 -5 10 -17 -37 -53 -16 -48 -35 18 -36 31 15 23 20 13 8 8 -15 55 34 19 -32 8 10 3 -5 -6
2521 -6 -7 -29 65 14 -4 -10 -64 -69 -26 -13 15 42 25 20 23 49 37 39 -30 -38 22 -56 -20 18 23 -56 27 -2 10 5 59 -20 23 -24 10
2556 10 36 4 22 -24 -19 -29 5 -5 -15 2 -24 9 -5 -32 -23 -27 -20 -17 30 -13 -51 16 -21 40 46 -56 -12 -15 -41 -5 54 -25 -19 -17
2590 -17 33 13 32 -41 9 84 58 43 -21 -6 34 56 61 -17 -37 -41 1 49 -5 -3 36 -25 20 -41 -10 19 -32 43 -20 -12 -52 70
2622 70 37 -7 -10 -11 -21 23 -40 15 -10 19 4 25 -13 -29 52 5 15 -10 1 31 2 -19 38 -19 -16 39 -14 -11 -40 43 -14 41
$$ packed form
2388aK5k4Jk9N1p3M1K4l5k4K5J9Pl5M3m3O2l6lM0o4M0l7K3jJ1l7J0L1J9kk6o4
2421f2M8K0M2p9M8mj7J1K0r2J02m1Pj6n9J10l5n8O6jj2Rj9K6n4L0K2J2l7K7j2
2452Bl2N3l8NN0o7K2j3j8N7l8%J9Ll6qL4L4n8L0NOk5N1r5J1O5m8L6Lk3m9N7k8
2486c3MK5J1M5p5K7k5O8n2J5k7k0j6L7l2J3N3n4O7j6Qlpn%k3P0k1j5n1M0Kpqj
2521fjk2R4n1j8on4nM3J3K8K7j7nLK6j2Ko9qO0p8L6L8Np9Q3k9J2nN4p9M3m7L4
2556A0K6l2J8m6Nj0L4j0j0J7k6L3j4k7RmPLM7m3l8O7l7O1Oj02M4lk6L6N9p9OK
2590a7N0k0J9p3N0P5k6j5o4J5M0K2Np8k0mM2M8n4KL9o1M5o1L1K9n1P5o3Qm0J22
2622G0l3m4ljj0M4o3N5k5K9j5K1l8j6Q1m7J0k5J1L0k9k1N7n7LN5n3Lk9Q3n7N5
$$ plain form
2654 41 -40 21 18 9 20 -39 -13 -11 61 -26 -30 29 17 -17 33 -22 -11 10 13 -14 -19 -33 -46 -24 -36 -18 -23 -41 41 36 1 28 -14 29
2688 29 13 -8 36 25 -59 -18 34 -26 -51 -51 20 -41 -39 22 -33 4 -15 -28 -35 3 15 -6 42 40 -13 -66 -48 18 4 -37 -8 -21
2720 -21 -33 22 30 -20 21 -8 17 8 0 43 -19 49 -69 34 -17 21 -21 26 -4 -5 -23 18 29 -49 -21 42 37 -15 15 -17 7 -43
2752 -43 -8 -11 -12 22 -3 -6 -3 50 27 -16 -23 31 -9 47 49 10 -7 -33 -53 12 43 2 16 -15 -48 -22 -43 0 -29 -38 7 14 -80 10
2786 10 31 31 -31 24 25 24 -37 -25 40 -45 7 63 12 -17 -8 -14 -5 28 50 21 64 23 -33 -11 -36 72 -51 32 -14 -6 28 -23 17
2819 17 -1 59 -25 0 -7 -56 2 0 -11 -30 8 -20 -30 -29 0 41 8 -12 1 47 45 16 -6 0 -25 -21 -9 21 28 -43 34 -9 -50 17
2853 17 -44 50 16 -8 -48 24 6 -43 -14 -34 -28 16 -29 4 -27 -26 8 -20 -25 11 -14 -9 -12 9 -20 21 42 41 29 -9 16 10 -12 49
2887 49 -16 28 65 28 22 -41 -31 -25 -15 -5 36 19 -21 30 17 -13 10 -67 -67 -17 -47 40 -16 -31 44 -13 -4 -23 20 25 -16 0 -30
$$ packed form
2654D1q1O1lrJ1n9K6KP2q7mN9j2l4N0n5J1K1Lk7nj4j3K2j2J8nj8Q2nl5K7m2M3
2688B9j6k1M4j1q4M1N2o0k5%P1o1KO1n5L7j9j3pL8J2k1M8kn3n3J8O6j4m1K9j3
2720b1j2N5Qn0M1k9K5rqM3o2O8j18J03n1L8m2M7l0jj8M1J1p8K8O3nn2L0l2K4n0
2752d3L5ljL4k5lLN3k3m3pN4m0N6Kl9j7k6k0O5L1m1J4l1l3K6k1M3k9rM5Pr4R0
2786A0K1%o2N5Jjo1J2O5q5N2N6n1k9RoRL3K2k9M3m1n6K2k5J08j23Q3m6QL4n1M0
2819A7j8O0q4K5pm9N8kj1j9L8k8j0JK9M1l3k0J3M6kk9k2Ok5MJ2L0Pp1P7m3m1O7
2853A7o1R4l4k4m0P2j8m9K9k0OM4m5L3l1JL4k8nL6k5NlK1k9M1K1jj2l8K5ok2O1
2887D9o5M4L7l7oo3J0OJ0J0M1j7m0N1j3l0K3p7%N0l0Q7n6j5P5n7Rj9M3Nm1J6l0
$$ plain form
2920 -30 30 -41 -1 -38 1 -52 -41 -26 50 35 -46 -10 -5 -25 19 -68 -27 -23 -14 -9 -12 -11 19 -39 -14 -9 -72 -2 -49 27 -34 11 -30 20
2954 20 -13 -1 18 -28 -4 -34 -17 10 -60 -98 23 -43 39 13 22 32 -35 -26 -29 -48 -40 -13 11 29 -7 3 34 -37 -41 14 7 28 44
2987 44 30 -19 43 26 -3 -24 28 -80 23 24 -83 -21 20 11 -18 36 -14 11 -37 35 54 -18 -21 49 20 -35 -6 14 -41 55
3017 55 29 -18 -34 4 15 19 -32 -32 29 -60 -17 26 -34 31 18 -4 1 -32 21 -15 -14 -62 -12 -28 -56 22 45 8 -43 -22 -5 13
3049 13 3 12 17 13 -17 -32 -10 4 16 38 -37 16 10 -3 55 36 48 1 20 -39 -22 -4 1 -59 -10 -13 12 37 69 -16 10 -9 -4 -30
3083 -30 -13 9 5 22 1 -5 -31 -5 -70 -15 -42 38 -18 -3 -27 38 19 -7 -7 4 -38 -3 -5 -4 21 7 1 -4 10 30 -11 15 26 -1
3117 -1 -11 0 6 -12 -13 -24 8 -11 24 -48 37 26 -53 -36 -8 -12 4 71 16 5 -7 51 40 -19 20 25 40 39 16 9 29 12 -20 -26
3151 -26 32 -30 -25 1 -5 1 -11 -9 45 -53 -6 12 -10 62 -2 -28 7 -26 -26 37 -33 27 11 -6 -17 -59 22 15 12 -12 -22 20 34 10
$$ packed form
2920c0O0p1M0l7L9n3J1J5P6j5q1L6Nk0M4q7M1MRNlJL0n8K5No3P0m7P6o1M5m1N0
2954B0l3J2J9m6K4l0J7K7p0l8J21o6Q2k6RJ0o7Rlj9QK7K4J8l6J0L1p1mN5pK1J6
2987D4j4m9O2j7k9k1N2j08J03Jj07O2M1rk9N4n0K5m8P2J9p2lP0k9n5K9K0n5R6
3017E5k6m7j6L8J1Mn1%O1q9M3M3o0O5j3k2Nl3N3l6Jm8N0j6k8P8K3l7n1K1J7J8
3049A3j0RNml0j5K2J4J2K2p5N3oj3N8j9J2m7J9n9J7J8No0M9lK5K5L2q5K6j9Nk6
3083c0J7K2mJ7k1ok6K6o5N5k7Q0n6J5k4O5j9k6%J1m2L5kJK5j4onJ4K0m1K6J1k7
3117aj0J1Oj8jj1L2j9L5p2Q5j1p9J7K8mJ6O7n5j1j2N8j1n9L9NJ5jk3pK0j7l2o
3151b6N8o2NK6oOj2KN4r8M7J8k2P2o4k6L5l3%O3p0O0j6j7j1m2Q1plk4j0M2J4k4
$$ plain form
3185 10 -12 38 13 56 9 62 55 35 -57 -9 -31 45 -7 4 -14 39 -1 -44 -1 30 -26 -2 -32 39 -39 46 7 19 -47 -14 -25
3216 -25 -3 -46 61 66 43 41 22 -40 -21 51 8 33 18 30 -40 2 -20 34 -4 6 -4 -1 85 -2 -34 -18 -36 6 41 -14 27
3247 27 -37 -43 25 -45 -3 13 2 -42 22 -10 -11 -46 12 -7 -1 -41 82 -3 -10 50 24 3 87 -16 45 5 -2 16 12 -28 27 20 26
3280 26 32 11 0 33 -30 89 -8 -42 71 -20 58 -50 -36 39 65 -27 -6 27 51 55 -24 38 -36 12 15 32 -1 28 -26 -7
3310 -7 35 -13 -46 -59 -3 3 -77 2 -35 50 -37 59 16 -30 11 37 -28 49 17 -52 -5 -28 -32 25 -30 -7 -28 -20 -44 -75 -23 59
3342 59 -4 31 0 53 20 27 -8 -41 -18 11 21 2 23 12 4 31 -1 10 -2 -29 78 -2 46 18 -17 35 27 13 27 18 -68 -48
3374 -48 17 62 -19 -18 -9 -16 8 -7 -39 -1 1 52 61 6 37 -40 -3 17 1 -5 35 -8 -10 -47 -14 -29 14 15 -7 -4 5 44 -26 8 -19
3409 -19 19 39 69 -45 8 -16 -22 -16 13 35 -62 -10 84 26 17 -56 6 -7 -27 23 46 72 -46 34 5 -20 16 -17 43 -23 -33
$$ packed form
3185A0k2N0k5M3m7N3pk0r2M8k2P6n2J1j8N3m0m3M3L1n6K4l0P1p8Q5l9J2o6L3j1
3216b5K2m3J07Nk3kj9o2J9P2m3K5j5J2p0M2k2N4l8J0j0LQ6q7l2J6j8M2L5n5M1
3247B7o4oO8p0M2J6j1m4O4l2jl5N8j9Om0J23q5pO0k6k1Q4j03O1m0pJ8mm0N5pO
3280B6Ok1j1L3o3J19r7l4J13r1P8j08J4P5K6r2K1L3K4Mp9O2p4M8LJ7l3K9n4J9
3310gM2m8l3j3N6Oq0P9l7Q5q7R6m3m6M1K6o5P7l2o9M7k3mN7n5K3k1Qk4l1N2Q2
3342E9o3L5l1N3l3Pl5l3K3K9J0j9K1j1qK7l2J1j2k7J07q0M8k8l5N2qj4J4rq6K0
3374d8O5M5q1JRpK4j5l2L8KN1Rn5L1p7L7K0j6oM0m3kl7L3j5M3Jk2LRL9p0L4k7
3409a9L8K0L0j14N3k4oOK9K2r7N2R4n8rp3O2j3k0N0K3K6j18Q0k9k5L6l3O0o6j0
$$ plain form
3440 -33 14 14 77 -36 -21 6 -32 -2 -33 -16 34 -8 5 54 9 49 -31 -73 -22 -41 -10 -66 46 6 34 -24 55 -9 -15 13
3470 13 66 3 6 2 26 47 19 -23 -17 -24 12 13 18 48 -22 7 47 -13 -7 63 30 10 -3 -28 -14 -58 18 0 -30 9 15 5 12 7 -6
3505 -6 -45 12 -7 7 53 -6 -30 19 5 -20 21 -19 -19 38 -4 14 14 -61 -9 6 17 -7 22 -6 18 13 24 25 58 21 16 -20 -45
3538 -45 -30 2 20 -3 -32 41 -22 50 -14 -57 6 67 12 3 -32 14 48 38 8 77 40 17 -17 -3 -32 -4 -43 46 -6 -17 12
3569 12 3 -11 48 -19 -30 29 12 -24 36 34 -9 26 -2 -37 4 -1 -34 -19 -33 -24 -19 0 17 41 -18 -16 -1 15 25 -14 -24 2 16
3602 16 1 51 38 -27 32 4 46 13 -60 42 -12 -16 -18 -16 15 -28 -33 -76 4 1 -57 50 -14 49 -35 -44 37 32 -24 -13 -38 38 48
3635 48 -6 -22 48 35 -26 35 30 22 32 -14 -24 60 -73 12 -33 48 -4 -69 -12 -21 38 -2 -18 -45 27 -48 -40 28 24 41 -6 34
3667 34 12 -2 -79 -31 28 67 -23 20 -34 19 20 57 19 -9 -10 33 -18 -1 66 37 37 -46 15 -6 0 -65 -18 16 3 -14 -12 -28 35
$$ packed form
3440c3M7%O3j13J5K7l8L0l1J7N0m2J3M9m5M0q0m2N1j9L1n6J12m0K8n8P9o4oK8
3470A3N3o3LmK4K1k8m2OpL6JNL0p0K9M0o0OP0l3k0j3k5J4m4P6j8l0L9Oj0Pnj3
3505fl9N7j9J4M6n9k4M9j4k5M1m0%N7m2J8%p5N2J5J1k4K9k8K4nJ1JL3l7nl6k5
3538d5J5L2J8k3k9P3o3P2o4m3O3O1n5rl5M6L4j0l0O9l7k3l4J4k9K8l9Q9n2j1K9
3569A2rj4N9o7j1N9j7l6O0km3L5k8l5M1nl3J5j4RNJ9J7K4n9KJ5J6J0l9j0K6J4
3602A6j5N0j3o5N9k8M2l3p3J02n4mkKL1m3nm3Q0ln8J07o4O3q4rQ1nn6J1k5P6J0
3635D8n4j6P0j3o1O1nqJ0m6j0Q4j33Q5m5Q1n2o5N7rN9m0j6k7P2p5QO8mJ7m7M0
3667C4k2j4p7M8N9L9r0M3n4N3JL7l8k8jM3n1J7O7k9%q3O1k1Oo5M7L4j3j7Kj6O3
$$ plain form
3700 35 -36 -5 47 1 15 -57 -1 -39 -3 -2 44 14 -66 -19 16 65 13 -19 -10 39 -2 19 5 -64 3 41 26 -51 15 16 -7 -8
3732 -8 4 21 38 24 -32 -30 -38 22 -58 -32 10 9 -5 -35 -17 -80 50 -3 -81 54 16 13 27 12 1 -20 36 -37 27 -22 31 -24
3764 -24 67 4 -30 9 -42 -36 -24 60 -31 -55 -29 -11 -25 -30 -50 -27 -23 -6 23 64 -14 -4 -52 1 -5 -29 -14 -65 -22 -42 10 28
3796 28 -18 -57 -50 63 -79 7 52 6 7 36 -4 -4 5 3 -47 28 22 22 41 3 7 -54 -19 -20 28 61 40 51 20 21 -7 41 51 -29
3830 -29 -27 -14 21 -8 -10 25 27 -13 -5 -38 -51 22 -27 -8 -31 21 -58 -17 -11 76 30 8 -2 -5 -30 -27 8 48 19 -7 -28 -28 26 -8
3864 -8 12 -45 32 -19 -50 -1 -17 -30 -20 -12 -20 38 -10 41 78 -48 39 18 -18 53 -38 19 18 -1 -50 -22 29 -2 -11 -52 -49 4 22
3897 22 27 15 -8 10 40 16 -77 2 45 28 33 -33 5 -26 -19 -15 -40 -18 -26 -3 5 23 -47 37 15 -76 -37 9 -2 -20 -35 -26 -20 4
3931 4 -3 18 -45 -61 0 -44 27 -9 -14 -33 -41 55 53 -22 -59 -26 -8 -3 38 69 1 -4 1 22 23 1 -16 -54 8 50 -13 3 -37 -6 -75
$$ packed form
3700C5p1L1N2m6J4p2N6l8L6JM6l0q0M7L5M9n2l2RM9m1K1j4o9O7L8j5p7O6Jk3j
3732hJ2J7J7j4n6KqO0q0K6M2jj4l0J8o3J30n3p8J35l8lJ4j5j1k1N6p3O4m9N3n5
3764b4R1o3l4L9n1OJ2Q4r1k4K6J8j4nk0K3MJ7K9M1p8J0m8N3ok4J5n1M3k0N2J8
3796B8m6l9PJ13j42Q6M5m6JK9m0%Rkn0P5o%J9l8Mo1L5jM8L3k1J1l1Jk8M8J0q0
3830b9KJ3L5k9kL5Km0Ql3j3P3m9J9k3N2p9M1OQ7m6k2j0lk5LL5M0k9k6k1%N4l4
3864hK0n7P7n1l1M9j6j3J0QqN8m8N1L7j26Q7k1l6P1r1N7jj9m9K8N1l1rm1LN3J8
3897B2Nj2k3J8L0k4r3P9M3j7No6L8l1PMk5K2qK3QJ8p0Q4k2r1L9M6j1j8j5ROK4
3931DpK1o3j6O1m4P1l6nj9qR6kp5l7L3J8NM1L1o8nNK1Jk2j7l8O2M2o3J6m0L1o9
$$ plain form
3966 -75 -34 -36 -29 19 -34 4 2 30 -17 -19 60 70 -2 -7 27 -19 -8 23 -11 -7 -12 -21 52 9 -79 -66 -58 2 2 -15 7 -24 -20 -4 29 16
4002 16 -19 -50 -21 -34 -6 -10 -18 22 -24 3 -22 24 41 -1 -41 -39 34 32 8 -61 -7 -18 -21 -3 1 68 35 -28 7 16 -18 -2 -25 -51
4036 -51 -17 -6 74 -1 42 32 7 -40 -13 30 -28 -7 -10 -11 39 36 33 58 -14 -30 -30 1 -27 -15 7 -8 -1 27 -40 52 -21 5 -2 -6
4070 -6 21 0 -3 37 18 -40 6 20 7 -11 10 -27 -7 -10 17 27 16 52 -37 54 -71 -14 -37 6 -10 8 -17 55 26 7 64
4101 64 -40 -58 10 16 29 -16 36 -37 -28 35 -13 4 35 16 -16 23 -38 -7 -28 31 18 -12 -7 -23 -26 29 10 42 -57 8 11 5 -12
4134 -12 26 2 3 19 60 49 -3 42 -13 -8 -4 6 -27 -24 -12 1 -57 4 33 -7 -26 -29 36 57 17 32 50 -7 28 -54 13 -15 -47
4167 -47 -23 27 20 -7 -21 -19 0 -40 17 22 -17 18 -19 -81 58 -38 0 -19 11 4 30 -45 -13 2 10 -74 15 -24 27 45 11 23
4199 23 17 39 0 31 -67 -36 -30 33 4 -5 -23 -28 -18 25 6 36 -11 17 -37 -21 6 -22 -4 13 2 -1 44 28 18 -54 -22 27 3
$$ packed form
3966g5M1kPM8n3L8kK8m7kP9J0p2nL4m6J1L1l4MnrP3m3q8J3QO0%j7K2l1MJ6L3j3
4002A6l5l1K9j3K8mqM0m6K7k5M6J7m2m0KP3kk4o9N4j1lJ8MO7l3o3L5Rl4J6k3k6
4036e1L4J1Q0p5M3j0k5m7K7M3n8K1ljN0llK5p2j6%L1k8J2K2j5PK8o7R2p3K6pm
4070fK7k1lM0j9n8M6J4j3j8K1l7K0lK7J0j1L6q9R1j25N7k3M3j6J8k5P2k9j9N7
4101F4j04j8O8OJ3m5N2p3RO3m8J7L1j9l2L9o1L1k1N9j3l0Nj6lN5j9L2r9O5Loj7
4134a2L8k4JJ6M1j1n2M5n5NMJ0l3LJ2J3n8O1K9m0j9lO5K1m0J5J8n7L5q2O7k8l2
4167d7K4N0pk7j4KJ9m0N7Nl9L5l7o2J39r6L8j9L0pK6p5L2J5Qq4Q9l9N1J8l4J2
4199B3oK2l9L1r8L1OO3k9rj8nJ0M3j9L0m7K8n4J6K7k8J8J7j1lM5j6j0p2L2M9k4
$$ plain form
4232 3 -17 50 21 9 1 -14 -15 66 -7 0 -23 -49 2 -5 46 -22 23 16 0 -33 19 37 -36 -13 -3 -5 -56 5 -53 -17 67 -19 36 -11
4266 -11 2 -3 18 -36 33 -19 10 37 -13 -9 45 -52 -18 9 -24 25 57 -69 -69 -1 -41 4 -12 -59 -25 -57 -39 -47 -87 -60 -15 -34
4298 -34 -19 51 -21 25 -20 -56 63 -19 -20 30 -3 11 -9 12 32 56 1 -21 28 20 -7 -2 22 5 14 -64 -68 9 27 3 35 38 5
4331 5 -44 -3 -6 -42 -7 2 15 -2 -115 -34 -51 -8 38 -9 -58 57 34 -40 11 -34 74 25 11 0 51 13 -19 46 13 3
4361 3 29 19 -12 -46 40 58 -79 -38 -32 59 -42 47 -50 -20 -27 -57 33 5 44 39 33 -27 -49 -11 -8 11 65 16 -17 -47 13 20 44
4394 44 22 61 -6 12 43 19 -13 -6 33 12 33 19 -10 -24 22 8 -28 18 -70 7 -21 -12 -39 17 -7 -28 -34 -58 -50 41 -2 -52
4426 -52 -34 54 13 -24 6 47 -63 32 -35 -9 -23 -3 14 12 38 6 7 12 -5 24 17 44 48 -16 -29 5 9 46 25 26 -80 -26 -8
4459 -8 29 -25 -46 -25 -35 -3 28 -20 10 3 0 31 23 34 -5 -3 -11 0 13 -13 -7 -59 -36 50 -1 31 -16 -30 -47 6 -15 -24 -31 2 0
$$ packed form
4232Ck0O7k9j2qj5jQ1p3Pk3k6N1pN1o8M5pj6l3N2J8p3K3J0kn1O1n8L6Q4q6N5m7
4266a1J3nK1n4O9n2K9K7n0MN4r7L4K7l3M9L2j26%O8m0M5j6m7L4l2J8qm0K7M5j9
4298c4J5P0p2M6m5l6J19q2jN0l3J4k0K1K0K4n5k2M9qk7NK4j7Rp8mP7J8k4L2Ll3
4331Em9M1ll6L5RJ3j7j13Q1j7M3M6m7m9J15k3p4N1m5J08m9j4j1N1l8l2O5l3j0
4361CK6j0l1l4Q6J8j37M1OR1j01Q9r7L0pl0R0k8L9noo0k2L8LJ9N4m9l3l0O0PK4
4394D4k2L9o7J8L1k4l2PL9k1K1j4k9j4M6j4l6M6q8P7k8Rk7N6k4k1ok4QR1m3n0
4426e2J8Q8m1l7L0M1j10R5o7K6j4K0J7kK6l2JNj7K9pK7Mo4j3L4ML7k1Jj06N4J8
4459hL7n4k1K1j0L2L1m8L0plL1qJ1l9KqJ1J3k6On2K3Q6n1L2m7j4j7N3k1rpL3k
$$ plain form
4494 0 33 -1 24 -52 -24 -32 -29 0 -5 -52 15 33 2 -37 -29 19 -31 -55 -15 -44 -38 41 13 -17 -14 7 -24 5 3 33 -18 -18 -35 45 -60
4529 -60 -14 35 39 -2 1 -13 -18 -24 17 -1 -27 -67 -1 -38 -57 -20 -31 -16 -65 -32 -7 92 -22 -14 17 -48 4 -20 -31 -32 -51 5 11
4562 11 56 -30 -65 -14 0 -2 -1 43 -66 29 -14 34 39 37 -45 -51 -25 17 -31 21 -50 -4 12 -53 -14 35 3 -38 -5 1 51 18 10
4595 10 -19 -22 5 -5 6 3 28 -1 -7 -14 -7 9 -2 31 -12 -43 3 -16 -7 33 -7 5 -7 -29 -30 73 -39 -35 -58 -43 -45 -11 9 -1
4629 -1 -26 27 -19 -52 -11 56 -21 12 2 -44 2 -1 31 43 2 -6 -31 -25 -39 -18 -17 28 4 22 2 20 16 -5 29 27 29 3 32 -58
4663 -58 -33 -18 -10 -15 -7 17 -26 10 6 7 26 74 -10 15 -35 28 -10 19 -7 -40 -65 -55 20 18 67 7 48 23 41 46 -77 -38 13
4696 13 -5 -13 27 14 3 -7 9 1 9 -13 -46 -30 -10 32 32 -8 -16 15 -36 2 64 31 -53 -22 -4 -46 -6 5 -1 -28 -62 -9 -25
4729 -25 18 -1 -28 35 8 -9 -52 2 44 -67 -25 -40 8 7 4 -15 -27 30 18 -27 9 -31 -10 -22 -30 -22 -24 -15 -26 15 6 -47 52
$$ packed form
4494@L3l4K5p6K8qLK9nm7O7J8l1l9QM8n0k4M0k9OP9k8l0LK1l1K9kL0n1%j7Q0j05
4529f0M6M9Mm1Lj4noM1j8k6m0O6l7j9L7j1J5m9L3K5R9j14QL1o5N2k4j1jj9N6O
4562A1M5q6l5N1J4kJM4j09R5m3M8Nkq2oK6M2m8N2p1M6J6o5L9M9l2m1L3ON0l3q
4595A0k9lK7j0J1lK5k9opPJ6j1L3m3l1M6j9RM0m0J2j2k2jJ03j12Mk3J5kL4K0j0
4629ak5N3m6l3M1O7p7L3j0m6M6lL2J2m1qk5Oj4K1JM5k4J8k0J8mk1L4kKk6K9r0
4663e8K5J5QnQK4m3L6mJJ9M8q4K5n0O3l8K9k6l3k5J0P5kM9o0M1k5J8Nj23L9N1
4696A3j8qM0j3j1j0J6qQk2l3J6K0M2%m0qL1n1L8O2l3q4L1J8m2M0J1ok7l4N3j6
4729b5M3j9k7O3k7j7m3N4M2j11M2j5M8jlj9j2N7j2m5L6m0K1j2qQkRj1M1rn3R9
$$ plain form
4762 52 -2 -55 -37 -10 65 -32 30 34 -58 16 24 -10 19 -72 39 40 -19 23 13 52 -3 1 -23 11 4 3 -14 33 -51 5 31 38 6
4795 6 8 44 -65 -67 77 13 12 13 -20 20 2 -4 10 20 -17 30 27 -27 -9 -45 -17 -4 -17 48 -24 -21 45 22 -25 24 -9 20 -9
4828 -9 7 5 21 26 45 47 33 33 -13 17 -36 -12 -4 42 14 12 -10 -34 -31 -41 22 14 12 -12 30 -30 -26 34 4 7 45 17 42 47 -30 -19 19
4865 19 42 19 20 -10 -25 -24 17 -22 28 -59 -19 51 12 -38 -72 -11 -35 -52 -19 -45 7 18 -14 -44 12 19 -38 -43 12 18 73 16 -12
4898 -12 24 23 -24 -35 -27 0 1 -10 11 -25 37 -22 -27 16 8 3 21 -44 15 -5 31 21 -3 -9 -30 3 43 13 7 -43 12 -47 -8 27
4932 27 -16 -7 29 -26 23 -24 -14 -16 -34 42 24 54 14 14 -36 -50 17 -1 -46 10 -28 10 35 5 -61 -1 13 -37 1 -12 -4 54
4964 54 19 15 7 -35 39 5 -14 -42 -2 -43 -9 3 -34 31 18 11 18 15 -7 38 64 60 -9 9 -20 -42 13 23 -16 -26 10 20 -10
4997 -10 -7 -40 3 -25 5 5 3 37 -18 -60 36 -44 -5 1 7 1 7 -27 -50 15 -4 25 24 10 12 -70 30 -21 -7 -21 2 26 -44 -2
$$ packed form
4762E2n4n3J8K7P5r7O2Mr2P4Ql4K9r1J11Jn9M2j0L9n5Mk4L4pjj7M7q4N6K6Pl2
4795FKL6j09kJ44o4jJl3M0j8oJ4J0l7M7ln4J8l6K8J3j3O5p2LO6k3m7M9l3K9k9
4828iJ6kJ6NJ9Kj4%m6L0n3K4QM6k8kk2k4Lj0O3qkk4M2o0MO0l0LL8k8K5Np7J1L8
4865A9K3k3Jl0j5JM1l9N0q7M0P0l9n0l4O1k4j7L3k6N2J1l2l0N6Pn7nN5ON5n7k8
4898a2L6jm7j1QK7Jj1K1l6O2n9nM3qnJ8o5N9k0L6j0k4ok1L3M0l0on0N5n9L9L5
4932B7m3RL6n5M9m7J0kj8P6j8L0m0%n0j4O7j8m5N6l8L8K5l0o6O0J4n0L8j3QN8
4964E4l5mqm2P4l4j9k8M0m1L4J2l7O5j3pPlk2M5K6mo9J8k9k2N5J0l9j0L6J0l0
4997a0Ll3M3k8L0%kL4n5m2R6q0L9OOoOl4k3O5j9K9jj4Kq2J00n1J4j4K3K4p0M2
$$ plain form
5031 -2 -3 23 -11 -30 10 -30 -18 -6 5 -33 -18 57 1 -46 33 36 -26 28 26 -34 -48 27 -12 -12 69 -45 -15 -22 15 26 -17 7 37
5064 37 -34 -9 -11 -45 -25 -16 44 -10 20 3 -27 -36 5 -45 -8 -8 14 -9 42 -13 19 21 21 7 -2 -3 -30 28 10 13 -24 10 -12 17 -40
5099 -40 32 -38 -35 5 -8 2 -3 -55 24 28 -6 6 -35 42 26 -42 15 -25 -34 53 10 16 44 37 -13 -34 -14 -24 37 3 10 -83 -20 44
5133 44 -25 -43 20 24 -57 -7 -20 -27 15 -25 -4 6 -24 25 -37 -3 -13 -34 29 2 17 6 -8 37 3 13 69 17 -17 17 24 27
5165 27 15 -50 11 16 52 8 43 -14 -8 -19 25 14 5 -47 -20 3 -7 18 34 20 -31 -8 1 -12 17 0 5 12 -33 24 -62 5 5 -48
5199 -48 47 42 34 5 4 -17 14 29 -22 21 -22 44 66 -4 -12 94 -2 13 -8 -42 19 4 -10 -3 15 25 35 -38 -2 10 -45 25
5231 25 -34 41 70 -12 52 32 39 -72 73 20 -79 33 -15 48 -28 16 -39 -14 -20 51 34 12 -1 53 -29 57 -20 22 39 -11
5261 -11 5 12 -10 -69 51 67 23 8 -26 -12 -37 0 -37 63 -8 -58 19 -16 8 27 21 36 23 42 -38 29 -28 -42 11 15 21
$$ packed form
5031bjK6l4j9M0m0J2J2J1l8J5P5n6m7P9Lo2N4ko0j4P5l9%Q1j14L0pL7J1m3K4L0
5064C7p1K5kl4K0RO0n4L0j7l0rM1n0L7%K2k3N1n5L2K%j4rjk7N8j8Ll7L4k2K9n7
5099d0P2p0LM0j3J0nn2P9Ml4J2m1P7j6o8N7m0rQ7m3OK8pn0k1K0j0O1l4Pr3O3O4
5133D4o9j8O3Mq1N0j3pM2m0K1J0l0M9o2L4j0k1O3k7J5j1j4M5l4J0N6n2l4L4PL
5165B7j2o5O1NL6m4L5n7Oj1M4j1rn2K7K3j0K5J6j4n1K3Rj3K9j7NPm5N7q6O7%n3
5199d8R5nqk9jk1L1J5n1M3m3O6K2p0qJ06r6J5k1l4O1j5j4PJ8J0J0p3L6J2n5P0
5231B5n9P5K9q2O4k0Pj11J45n3r9J12m8O3p6M4n5K5oP1j7k2j3N4q2Q6p7M2J7n0
5261a1J6Pk2n9J20J6m4j5l4J4k5L7l7J00p1n0P7l5K4J9oJ5j3J9q0O7n7j4N3MO
$$ plain form
5292 21 -24 -5 75 15 -13 60 -30 -48 19 -26 -40 -56 -30 31 13 -16 44 65 43 3 -24 8 2 6 41 42 13 -21 -37 29 15 1
5324 1 45 -3 -2 -13 35 -10 -22 4 -62 32 -12 58 -41 -26 -5 24 -6 69 10 8 28 -42 31 1 6 23 39 -3 -36 1 37 2
5356 2 3 -18 15 48 7 -25 60 -73 -27 4 -9 6 9 21 15 -10 16 -45 55 -19 -24 47 -23 9 -31 26 3 -8 -3 11 6 -43 -17
5389 -17 24 -29 -31 -43 14 37 6 43 -32 7 20 52 -36 13 -24 -12 18 19 -14 47 -37 -28 2 -8 -1 19 44 38 22 62 24 -29 16
5422 16 -33 8 -2 16 -13 -35 11 -13 -9 25 7 -25 24 -19 28 34 67 -21 -35 -8 16 10 -6 -10 -29 19 7 -3 -30 7 4 11 -32
5455 -32 26 30 58 -16 -2 11 -20 -42 15 -75 -69 -38 54 -3 -16 -10 -25 47 -32 49 -7 21 -9 -49 -36 -19 24 -7 -27 38 -10 29
5487 29 29 -16 0 36 0 -39 47 31 19 -13 10 -38 -33 -23 4 16 -10 11 36 -16 -36 25 10 -40 16 10 -14 60 5 -43 42 10
5519 10 -12 -11 12 17 -40 -43 -5 2 -20 -50 -20 22 17 -16 -1 -32 -15 21 -15 -8 38 0 -20 16 -53 35 -23 -30 -16 -22 -17 -7 16 -14 -13
$$ packed form
5292B1m5J9Q0o0k8P3r0j8O7m5j4j6K6O1j8k9O0K1k2m0k7L2oML5Jk9l4j6O6j4j4
5324AM4m8Jj1M8m5j2K6o6R4m4P0r9J5K1K9l0P5n9kK0p0P3l0NJ7J6m2l3L7L6l5
5356BJk1L3L3m1l2Q5j33M6L1j3J5LJ2ok5K6o1J00p4nP1p0L2m0N7k3j1NJ4nm9K6
5389a7M1n3kj2N7K3l1L7p5L9J3L2q8M9l7J2L0Jl3O1q4RL0j0PK0K5oj6M0l8n3M5
5422A6m9M1j0J8k9k2M6k4ML4j8l2M9m3M7OL3q8j4K7K4oj6mj9M8j2j0k7L7lPm3
5455c2N8MK8p4J4J3l1k2N7r0OL1R2n7j3Oj5P2p9Q1n6K8l0m0J3J7M3l1k0O5m8L9
5487B9%m5J6L6l6l9Q6j6j2l2K3m8NJ0K7J2k6K1K5n2k0O1j5n0N6ok4P4n5m8Q5l2
5519A0k2JK3Nn7lL8Pk2l0L0M2nl3J5l1J7L6l6PM6l8k0L6o9Q8n8pJ4oNJ0K3l0J
$$ plain form
5554 -13 -1 -6 -19 -18 41 -50 25 15 10 1 -13 51 12 21 33 13 15 28 21 2 10 -5 3 85 -16 4 3 2 -33 -31 56 18 -17 -8 5 6 9
5591 9 -10 35 -27 20 46 7 31 16 -9 51 3 -56 -57 42 -4 61 -3 -64 -28 27 32 -9 20 15 35 69 33 25 59 -10 -24 18 50
5624 50 61 18 -9 28 -14 -11 18 15 10 25 1 24 17 -44 12 1 6 56 61 -24 -20 -23 -3 -3 1 -3 33 17 -14 -56 -34 -63 63 20 -16
5659 -16 -46 62 -16 -11 -3 -31 -1 11 38 17 -9 2 31 -33 -35 -14 22 -46 37 6 -1 22 -1 -27 -24 -24 -27 -8 0 35 -2 -6 -3 -31 21
5694 21 35 34 -43 13 2 4 38 -40 18 -39 9 51 -36 -40 -7 -14 12 3 -30 -8 37 25 13 -28 -34 -75 -22 -1 54 -41 -2 8 -7
5727 -7 -31 37 41 22 10 -59 11 38 -53 -44 -9 -14 -9 53 9 -39 -10 -5 -32 -8 -19 0 3 18 15 -11 -20 13 6 -21 -39 -60 -77 -2 -14
5762 -14 28 -1 6 6 -16 12 37 7 -32 -8 47 -6 2 6 -32 -16 -10 49 24 37 15 26 -18 23 13 -5 15 -9 73 -26 26 -21 -3
5795 -3 -29 -4 17 14 -35 -25 -7 -2 2 -10 -33 -22 11 -13 14 61 58 26 -20 -28 28 -19 22 -2 11 -3 -54 22 -10 -9 65 -2 18 14
$$ packed form
5554a3J2nj3JN9r1P5j0nrj4O4l9RJ2k0KJ3pj9Qj5QQ2j01K0jjl5KQ7l8l5RJ3JL
5591Ij9M5o2M7K6l9K4j5k5O0m8n9jR9m6O5o4o1L6N5Nm1K9nK0L4l6qL4o9j4M2L2
5624E0J1m3k7L7m2LK9lnJ5k4K3po1N6j1NN0Nq5MlK0%MmL6j6l1m2K2k9J26m3l6
5659a6l0J08p8NQk8L0J2K7k1k6J1K9o4kK1L6o8Q3l1pK3k3k6L%lJ9QL5l7mLk8N2
5694B1J4jp7N6j1KL4p8N8n7M8M2q7mL3pK6rl3K2M5j2j2m1om1N3K1N5r5L9J0j5
5727gk4O8Mj9j2o9P0K7r1RL5nNO2m4m8K9Nk7K4j1J9LJ5lk6rL3pk7j8k1j7P5j2
5762a4M2k9P%k2K8K5l0l9K4N5n3QMl8J6ON9k5J3k2J1m4M1j0j8K0k4Q2r9N2m7J8
5795ck6K5K1lm9J0J8NMj2k3J1L3k4K7M7ll2m6qN6m7M1k4J3j4n1P6l2JP4o7K0m
$$ plain form
5829 14 6 40 6 1 19 -25 -47 -17 29 45 -11 4 24 16 -11 0 -10 9 36 -2 37 32 31 -47 -32 -22 3 35 -26 44 13 -48 13
5862 13 -30 1 34 -3 -15 1 -4 -33 70 -16 8 23 -14 10 -2 -12 -5 1 -57 16 32 19 35 45 -14 7 -115 10 46 14
5892 14 -16 -19 3 -4 14 49 6 31 -7 -40 28 5 23 -23 -4 28 29 69 -34 2 34 21 -19 -4 8 -20 25 -34 12 3 -41 -43
5924 -43 -54 11 -3 38 -44 19 -11 -16 8 8 31 6 -45 3 32 -29 -6 18 23 -41 8 5 -25 9 5 14 -13 40 6 -31 41 -21 -8
5957 -8 6 15 6 -19 -69 -4 -65 65 27 -2 -27 11 57 -12 -3 -60 27 -35 -61 -7 -38 -16 -27 11 8 -12 -14 44 32 13 9 -72 -38
5990 -38 9 6 -15 27 27 41 5 -25 -9 -4 -35 8 14 60 54 -4 1 -35 -50 24 -15 -4 4 -21 -14 -7 35 -9 -55 1 -1 -9 11 38 26 -43
6026 -43 -40 5 28 31 -39 9 37 -17 -7 29 46 68 -52 -8 50 13 -12 -21 19 -9 -20 -37 -23 -30 -4 -40 18 6 -37 0 0 44
6058 44 21 -29 -19 -30 13 -42 57 29 -3 -19 -33 -21 -9 -1 -31 13 -65 -60 16 11 53 23 13 23 9 19 55 32 -26 -2 24 39
$$ packed form
5829A4qL4l4nJ8m4k2L0M6J6n6J5K0qk7J1j0J9K7l8L9njp8J5J0K5L2o1P0l1o1O1
5862A3m3L1L3l7j2J6nk9J03q6K4J5l7K4j2j0POn8P3J6j3J6J0n9K1j22J25L6l2
5892A4l0lK2pJ8L5m3K5l8l3O8k3J8m6J9L2JM0j03L6L2j3m0J5J2k8M5n9M6rm4k
5924d3j1O5j4M1q2O3l0nK4%K3k5n1M8K9o1K3K4No4M9ll0L4mRk7N3l4l7P2o2J3
5957hJ4Rrk5n0O5o1J30l8k9k5L8M6o9Rn7Q7o2k6N4l1K2j1L8lk0kN8j2j9mq1L4
5990c8M7lk1M2%J4l6l0J6Nl1M3OM6on8Nl6j5P4l9J1Qk5PPM2m4m6N6kqK0K7j2o9
6026d3LM5K3Lp0M8K8n4J0L6J7K2j20M4N8l7k5rM0k8j1j7J4pK6l6N8j2m3L7%M4
6058D4k3n0J0j1M3n5R9k8l2j6j4J2J2Ql0M4p8NP6nM2l0j0J0j4J0L6k3n8K4K6J5
$$ plain form
6090 39 -46 -8 -22 -15 -22 -63 -48 -18 -32 -80 -41 50 21 -13 -52 38 -9 -48 -4 -31 -14 -17 17 -52 17 -11 78 -3 36 24 8 -51
6122 -51 3 13 -50 39 -16 78 38 31 24 -3 -20 -46 4 -14 -12 15 8 -40 -46 -82 -55 -32 12 -4 -13 -53 38 41 24 -18 -6 21 -23 48
6156 48 -10 -3 50 35 40 16 -27 -14 -22 5 40 -33 -10 -12 20 -19 -6 -13 -47 -15 20 19 66 -36 19 30 1 20 -2 2 -31 -23 9 29
6190 29 -63 -4 6 14 28 -3 -79 -12 -11 -8 -19 36 31 -32 7 64 -10 -9 -7 15 16 24 -26 -28 -2 0 -62 52 22 42 16 -5 51 -27 2
6225 2 37 7 -19 -28 -65 35 -62 3 -8 31 -7 2 22 -4 -3 8 26 -4 -57 -12 12 19 44 17 21 34 -25 -3 -8 29 68 32 -14
6258 -14 -9 41 5 -7 -23 49 -2 -23 -41 25 4 40 31 -57 -51 7 -13 -47 43 69 44 35 -7 12 34 2 31 -25 27 19 4 20 19
6291 19 47 -5 55 78 -29 -56 -51 62 7 0 39 21 -46 -75 7 -19 -13 -17 52 -6 -19 12 -34 14 50 -22 -74 7 -27 13 3
6322 3 -23 -49 0 -20 -62 50 11 -3 4 12 2 21 12 15 -2 49 -26 -28 41 5 -3 -20 -10 21 -12 -51 -9 16 -18 6 -10 -16 -48 -54
$$ packed form
6090C9q5L8j4Ppm1J5L0j4m8L9R1k9l4l9R0m7l9M4k7J7lL4o9O9k8Q9q1L9j2j6n9
6122e1N4J0o3Q9n5R4m0ppk7j7k6N0j8KK7pm8ol6K7K3M4j6rm0R1Lj7m2J2K7m4P1
6156D8n8PN3j5Nk4m3J3qK7L5p3K3kL2l9J3pl4L2L5jM7j02N5J1k9J9k2Ml3QL2K0
6190B9r2N9J0QJ4l1p6O7JLj1N5no3L9N7p4JKK2JQn0kK6Ko2J14l0K0k6k1N6p8K9
6225BL5l0k6rl7J00r7O5j1L9l8RK0k6JJ1J8l0n3M5K4PK5k7MJ3n9K2nL7L9l6m6
6258a4NN0l6j2j6P2n1k1j8O6k1L6rq8ON8k0l4R0K6k5rm2J9K2l2K9n6N2qj5J6j
6291A9K8n2O0K3j07k7NJ13n5pL9j8o7k9Q2k6OmO9n8j3L1m6M8L6p2n2Q1l4M0j0
6322Ck6k6M9k0m2J12l9j4PQj0J9rLj7N1p5kO9l6qj7J0L1l3l9M2K5l4K4j6ol2o
$$ plain form
6356 -54 -29 14 -19 -18 -1 18 48 27 -17 46 -35 23 -43 24 12 31 -22 5 13 -39 -6 37 1 77 -14 4 15 -13 -25 -8 -19
6387 -19 -3 57 43 -1 45 -24 -34 51 -2 37 50 -93 43 -46 -12 -38 49 31 58 -2 -4 15 -33 5 19 47 22 -11 -23 -26
6417 -26 -26 -22 -23 52 23 -13 -45 -51 30 9 29 -30 65 33 4 -9 -10 -53 -17 -33 -11 -12 1 2 22 31 -61 23 -22 14 9 6 -5 10 -12
6452 -12 2 -6 -4 29 0 19 20 0 -6 52 10 3 29 36 -28 29 -17 55 -4 0 -18 19 27 -55 -30 9 12 -23 -21 15 4 7 -19 36 10 0
6488 0 66 53 10 26 -39 8 -3 -43 19 17 24 -1 -8 55 11 -33 -37 -16 -12 -2 -17 -31 1 -4 15 -16 35 -8 2 17 -50 56 0
6521 0 35 -7 3 -7 -46 26 -18 -30 0 -9 22 -5 -20 -7 54 9 51 -35 8 45 64 -30 15 7 41 25 42 -56 -73 -53 10 10
6553 10 -13 6 -33 -13 -46 7 35 -3 6 15 -56 28 25 20 20 2 8 -23 6 -31 27 -2 -3 28 62 9 -38 -26 60 56 22 6 -34 -1
6587 -1 21 25 57 42 23 31 -36 31 20 -19 30 -27 -37 -34 -37 -75 -26 25 0 -40 -23 23 -33 -38 11 53 -37 4 -3 12 63 -41 4
$$ packed form
6356e4K5M3l3JJ7J9L0k1m4O3q1N8o6O7j2J9n3K7Qn2L3M3l6P6r1J8J1k8j2J7j1
6387a9J6O0j4m4M6o9j0Q5n3L9J3j43J36q9L4k6Q7j8K7o0kJ9m8L8J4K8k5l3j2l
6417b6%MjP5k9l6l2oQ1k1K0n9R5l2k9j3jm3L6j6K2jJ3JK0Rr2Q4m5L6nlj1J5k2
6452a2J4qKL3k9J9Jk0oN8m2pK6Po4N7m6P2n9Mj8L7Qq2K5L9Ll5KL6j1Lk6N5k6j0
6488@O6j3m3J6o5M7j1m0O2kPk5pO3m4m4mK1MJ0j5j4L2nJ9l1N1m3J0J5o7J06n6
6521@L5m2J0j0l9P2m4j2L0rL1k7j5J3O1m5M2q6M3L7J9r4M5qL4j6J7r8j7K0O3%
6553A0k3J9l9K0l3N3K8l8RRp1Q4ln%j8Ol1K9l7N8k9jL1L4n3m7J2Q6ml4j6m0L3
6587aK2ML2j5j9Qo7O7j1l9M9n7j0Lll8M9N1k5m0J7M6n6nM9M2r0M1pJ5N1j04M5
$$ plain form
6620 4 40 12 18 -4 -15 -24 12 6 2 13 -19 -10 12 -2 -23 -59 -78 16 -5 -10 -70 -35 45 39 -29 50 -56 -5 4 -38 32 -2 -18 2
6654 2 -21 8 11 16 -14 29 19 -35 47 -10 28 -81 21 -5 35 14 31 -2 -61 16 -10 22 1 -2 -41 48 32 60 -10 -25 44
6685 44 -47 10 40 3 -34 -8 12 49 29 10 17 -37 26 -10 33 2 -19 5 0 24 -7 48 18 -49 -8 -18 13 18 41 4 -23 54
6717 54 -5 0 -87 -29 -5 -15 -42 47 -24 76 -11 -23 32 3 1 -69 17 9 46 -3 -12 -22 -28 25 -13 -14 -25 -15 -1 13 -1 36 0
6750 0 7 -5 -16 16 0 53 -11 28 38 -25 -1 11 76 -4 29 -46 -14 53 -50 1 -6 -30 43 0 -22 5 -4 47 25 -47 0 -5
6782 -5 0 26 -32 26 -7 4 13 -39 -19 41 23 61 0 3 32 -14 -19 11 -22 29 7 -26 -23 -5 23 19 21 -14 70 -7 58 -23 -53 -36
6816 -36 9 -74 -2 -21 21 25 44 28 -22 -7 -3 1 11 33 -29 6 -26 -16 19 8 6 -12 66 -10 -36 -24 19 -38 8 -13 2 -29
6848 -29 11 -4 -8 46 8 2 -1 19 -35 -39 -21 -15 -3 14 -30 15 8 5 -7 -40 3 38 -16 27 -20 4 28 -7 10 23 24 -18 8 40
$$ packed form
6620DL6k8Ok2j1rL6omJ1l2RK2j4k1l6j9R4k1no0L5Q0oo8P9j06N1Rm2P0l4j6K0
6654Bk3K9LNl0M3j0n4Q2n7L8j09J02k6M0k1J7l3n9P7k6L2k1ll9Q9j6K8p0j5O9
6685D4r1N7L0l7l7K6K0L7k0j9Pn4O3l6M3l1k1K4nK4l1N5l0o7M1j0L1NK3l7k7P7
6717E4n9Nq7N8K4j0k7Q9p1J00q7j2N5k9kp0Q6qL7m9rj0oN3l8jj1J0J4J4j4L7l6
6750@Pj2j1L2j6N3o4L9J0o3K4J2O5q0L3p5L2O7j03N1pk4P3m3k2K7rN1k2p2M7n
6782eNK6n8N8l3J1Rn2K0O0j8L8o1LK9m6nL0l3N1k2l3LJ8K8mKl5Q4p7O5q1l0J7
6816c6M5q3P2j9M2MJ9j6n0J5MMJ0K2o2L5l2J0L5j1kj8P8p6k6J2M3n7M6k1J5l1
6848b9M0j5mN4l8olK0n4mJ8OJ2J7m4M5plj2l3M3L5n4M3m7K4K4l5J7J3Jm2K6L2
$$ plain form
6882 40 12 -5 71 26 17 33 -35 22 25 -8 -18 4 -42 -5 -2 19 -8 23 19 6 30 -2 23 -50 -19 -77 28 13 21 10 -2 12
6914 12 28 12 -33 23 31 19 10 7 41 48 13 -11 -2 4 26 -68 41 79 18 15 -54 -19 23 16 -16 25 7 -21 -40 16 -44 18 12 21 -35
6949 -35 -30 -40 15 42 23 -24 37 -66 8 18 -31 40 -23 44 21 21 21 -18 -21 11 29 -30 -14 37 2 -45 -47 -20 9 -52 21 10
6981 10 20 -42 -58 16 -12 10 -56 -13 5 21 -50 29 19 7 -15 16 -13 5 9 -44 30 15 7 21 21 -12 9 0 -1 -88 6 93 1
7014 1 -14 17 61 -11 31 -42 -34 -19 27 -11 52 -18 24 -29 1 46 -13 -42 17 13 -10 6 -4 29 21 8 -10 18 -9 -24 7 1 -2
7047 -2 -22 -9 -40 2 50 26 -9 -11 -25 -2 28 -32 41 -39 -1 -32 24 -38 10 -17 -11 -39 20 -1 -5 35 -18 -45 -21 28 -33 -25 -27
7080 -27 -44 11 17 -34 24 -35 -4 -32 -3 -31 30 -29 4 31 7 -3 -23 30 -75 35 4 -18 -4 12 24 34 57 -7 -47 0
7110 0 67 -30 15 -16 70 70 -16 32 39 -33 -5 18 -15 -6 -13 15 4 2 5 34 -11 38 58 5 63 -17 25 -15 18 -16 -14 5 -5 -17
$$ packed form
6882D0k8j7P6m5rJ6o8N7Ll3j0K2m6L7LK1k7L1mj3K4l2K5p3L1n8J05j5Qj1j2J4
6914A2J6j6m5N6Qj2rlL4Pl5k4ROK2r4J09L8o1lo9L5M2pl2M1j8k8j9N6o0O2oRn6
6949c5Nj0N5K7j9m7O1j03P4J0m9P1o3O7k3%%l9lL2J8n9J6N1l5m7kK7K9o1P3j1
6981A0J0o2j6P4k8K2o6M3J8J6p1P9j0j2k2L1k9J8Mn3P4j5qJ4%l3K1rjq7R4Q7r2
7014Aj5L1M4p2M2p3QJ5M6l8O3p0M2n3L0M5n9k9N9mk3J6j0L3qj3j8K8k7j5L1ol
7047bk0J3l1M2M8k4l5kj4K3L0o0P3q0L8l1N6o2M8k7Ok8N9k1mM0n3k7K4M9o1Qk
7080b7j7N5On1N8n9L1k8K9k8O1n9L3K7k4j0k0N3j05J10l1k2J4J6J2J0K3o4m0M7
7110@O7r7M5l1Q6%q6M8Pp2K8K3l3RpK8j1kLK9m5M9K0n3N8q0M2m0L3l4KJ9j0j2
$$ plain form
7144 -17 -11 69 5 28 59 -22 27 -5 -54 8 -19 5 -46 10 -12 -8 72 -29 20 15 22 53 0 24 21 -4 31 37 -16 -8 -20 12 -9
7177 -9 7 -10 5 53 -29 -35 4 -44 -10 31 29 -7 8 28 -40 2 11 24 25 -12 6 26 20 22 52 -4 15 32 38 -9 46 -35 -8 46
7211 46 -44 21 15 -25 -9 -2 -11 -20 25 21 -7 -7 36 6 -27 -12 42 -15 -24 52 -7 49 -41 11 28 5 0 35 -31 -7 12 -25 1 5 -45
7246 -45 29 27 39 44 26 110 38 41 -11 41 21 -28 34 30 34 -32 -38 -25 27 -1 -53 25 -23 20 29 -22 -3 -20 6 -66 8 24 -20 -45
7280 -45 -26 47 19 -54 -50 17 -17 30 34 22 30 11 22 12 -38 33 -8 -10 -10 10 -27 8 37 -2 42 25 -5 -50 24 -36 1 19 14
7313 14 17 -13 -3 5 -41 -30 -30 -32 22 22 39 17 -14 24 -8 -4 16 3 -50 17 -16 -11 34 30 -20 20 -24 -3 -49 33 8 17 -8 21 6
7348 6 -27 -45 25 9 16 -36 0 -5 23 2 -28 73 23 36 -12 18 -35 -32 33 2 -20 39 -6 -3 38 36 37 18 7 7 -36 6 -10 -30
7382 -30 -22 -37 78 36 17 -4 -28 -25 36 11 -28 -26 -51 -8 19 10 -3 47 13 9 -41 -83 -44 18 10 -12 15 33 -1 -16 -59 -22 -4
$$ packed form
7144a7OQ0o4K3L1q1M9l2m9O2k7K4n1N6k2MQ0j01M9nPL1n3K4lk5L5On3Qj2L2k1
7177iJ6j7J5M8q2oL9m8L4M1kl6J5K0o8M2RJ3Jl7J8K0oKL0n6J9J7Om7N5q1K7N4
7211D6r0O5om0J6PrrM5mk8%M3l0l3J5N4n7rP6n9N6r0N2J7k3nL5o6K4J9l7K6Mn0
7246d5P4kJ2Nj8Q4p2Ln2N2k0m9O2mMo6oJ3N2k8n2P8m8M3Rn1J9j7K6p2P4J6m4k5
7280d5J9P3k8p3MO7l4M7Mj2Qj9J1j0n0P1m1k%K0l7L5K9l9M4j7l0m5P4o0L7J8n
7313A4Ll0J0Qm6J1%kN4%J7k2l1L8l2MK0j3n3O7l3NM5mn0M0m4K1m6Q2k5Rk5K9j5
7348Fl3j8P0j6Pn2L6nK8k1l0J01n0J3m8L0n3LO5l1k2N9m5LM1kJj9j1%m3M2j6k0
7382c0Qj5J15m2j9k1k4LO1k5l9Kk5M3K7rj3N0l4mn0m2L9O2qk2K7J8l4j5m3L7J8
$$ plain form
7415 -4 3 -3 9 45 -16 -12 12 -21 -6 8 30 33 41 -28 49 12 2 -10 -42 -6 14 30 27 20 53 -6 -4 -28 -46 -3 4 -75 17 -28 3
7450 3 -5 -22 -55 10 36 -6 11 37 3 -13 -23 7 36 -2 5 -16 -13 10 15 22 37 -24 -14 19 6 -2 -10 8 23 -8 10 -18 45 18
7484 18 -5 -27 -19 -82 -58 34 -2 11 -36 31 38 24 -11 -9 -20 -4 -2 25 -41 22 2 -20 42 -18 16 16 -2 6 -26 7 37 19 8
7517 8 16 17 -16 27 -47 -9 20 46 -3 -22 24 18 -21 -64 -28 1 -11 -40 14 -22 7 -30 -22 41 -24 37 45 -25 -40 57 45 31 32 2
7551 2 -10 -72 38 -7 -1 48 3 -17 2 -39 1 12 1 -16 -17 -6 -31 -44 36 -14 -59 -25 8 -84 29 -14 -27 30 -17 1 -1
7582 -1 -16 38 14 15 -37 -13 -25 -26 12 19 -2 11 -57 13 37 4 46 7 18 13 -25 -21 -16 -72 -51 -12 -21 19 21 2 -10 -22 14 -2 13
7617 13 -18 -1 -20 13 -1 2 41 55 8 -47 17 -11 -39 68 18 49 -29 10 -4 -8 -9 9 15 -25 9 0 -45 24 3 -1 24 -15 24
7650 24 40 34 -9 6 13 -8 32 21 1 -35 1 -1 -60 29 6 -42 5 9 8 8 6 15 27 -46 -2 -1 66 8 5 1 -18 -21 24 11 -11 -55
$$ packed form
7415dPoJ2L6o1MK4l3J5J4K2LQo9P7l7j0j2l2L6K0J6lpL3n9Kk4j8M3Pp9R2m5L1
7450Cqj7l3O5K6m2J7K6l4j6j0L0K9l8Pk1LK3NPJ5o1J0L3j3qqJ8J5l1J8k8O3k7
7484A8k3k2Qo3K4R2l6J3m7O7Pj4l5Kj1J6KK7o6O3k0k2O2o0L4%j8Ql2L3L0j8j1
7517HQJl3M3p4L8K9K6m9j9M6ol9m3L6K9j2k9N4l6K9l7QO3o5O1Qp0j5R7j2j4Jl0
7551Bj2o2J10m5OM9m5k0J9m1M0J1j1j7jJ1k5j3Q0n0m5L4L3r2J13m3j3N7m7J8k
7582aj5N4k4Jn2K4j2jL8Pk1J3o8P0K4l3M2l9J1nl8MNn6K1L9rM0Kj9j2j2L6j6J5
7617A3l1J7j9L3j4LL9J4m7n5O4k8k8J07n0L1p8L9j4mjJ8Om0L4rm5O9k1mK5l9L9
7650B4J6om3J5Pk1M0j1k0l6L6kn9Q9k3m8M7Mj%kRJ2p3M4JO7n8lmj9lM5j3k2m4
$$ plain form
7686 -55 4 -40 33 9 -6 42 -2 75 -41 14 8 -8 -34 -28 27 9 -14 29 2 43 52 19 0 22 -9 -37 -54 -3 28 40 22
7717 22 23 51 -51 -24 23 10 45 9 37 -2 0 -28 36 -22 -24 23 -24 28 17 7 -92 -35 -2 30 -43 -24 13 -18 37 43 -18 25
7749 25 -1 -26 6 -17 6 -10 14 20 3 16 6 -12 40 -32 -42 11 38 62 16 77 21 -7 -10 -34 -14 18 6 19 38 19 12 -3
7781 -3 23 -19 1 -2 -25 8 -46 39 -12 11 -27 17 -6 -29 -5 53 7 0 96 6 0 -2 10 14 28 -13 42 46 -79 -8 13 -53 -30
7814 -30 25 21 6 -2 32 43 15 -23 7 8 25 -2 -27 7 50 -48 -14 -12 55 20 2 3 6 16 -23 -32 13 30 14 6 -22 5 12 -10 10
7849 10 -14 18 20 -19 6 -35 -50 26 -50 -8 35 -27 -59 -6 32 -12 -6 -8 -64 -39 -6 -40 45 20 70 5 38 28 -40 -19 24 4
7881 4 26 -43 0 -19 26 12 29 34 7 25 26 -43 -17 -16 -18 -3 -20 31 28 -16 -50 -9 -6 -9 -10 -22 2 7 5 13 14 30 -4 36 9 1 -16
7918 -16 -35 99 2 -1 2 -8 20 -19 17 -38 9 -34 -19 13 -23 24 -29 -23 3 46 -14 33 8 1 29 30 -7 8 33 -23 -26 -4 0
$$ packed form
7686e5N9m4P3k4j5M8m4P7j16N5oj6k6ON5j8k3M3k7M1Rl3j9K2l1k8j7N1L1J2j8
7717B2JK8j02K7M7j3L5l6K8l9Kk8O4n8kM7m7N2j1j0r9N7L3L2p3J9L7l1N5Oo1M3
7749B5k6k5L2k3K3j6K4Oj7J3j0j8N2p2j0N3K7K4m6O1n6k8lk4K0L2j2J3J9j9pj5
7781cK6m2K0lk3L3n4Q5n1K3l8M4k3k3K4N8m6pR6r0okJ2MJ4m1N5Mj25P1K1o6K3
7814c0N5mj5qL4J1k8l8L0JJ7k7k5L4M3r8L4KO7l5j8JLJ0l9rM5J7j6qk8K7Pk2K0
7849A0k4L2Kl9K5m1j5P6p6M2M3o2l2N3L8m4Okn6K5L3l4Q5k5N0o5L3j0o8K1M3k0
7881DK2o9M3j9M5j4J7Nk7J8Jo9K6JkJ5j7N1lm4l4M1Lljj2K4NkQJJ6l4M0k7qj7
7918a6j9J34r7lLj0K8l9L6n5M7m3J5L2l6M7n3OK6M3o0M7k5pK8Jl7J5K5n6lK2M
$$ plain form
7951 0 -34 -8 2 -12 -35 11 3 -40 -48 30 -5 -20 7 -10 -20 0 -3 24 -22 -41 11 -25 7 -39 9 8 -33 -51 23 -61 -6 22 20
7984 20 11 59 -31 21 -36 29 28 -28 -21 38 24 0 7 38 9 17 -24 37 -5 39 -5 -42 -57 -7 -21 -21 11 7 -15 33 36 13 37 4
8018 4 -26 23 8 -25 36 -36 32 36 12 60 5 11 15 34 -30 17 8 -5 -39 -31 -31 2 -16 -20 54 -31 14 32 -7 5 51 30 -12 68
8052 68 30 13 15 15 41 -1 -29 -7 -37 -18 28 -13 16 -31 16 46 -7 -16 -23 0 19 18 3 -37 40 -7 -29 -38 13 -15 -62 4 -12
8085 -12 18 -26 22 -17 38 37 22 41 14 25 21 -52 -44 8 -35 -23 -16 -6 -9 -41 -54 9 -9 32 47 -43 -12 -58 24 -34 -29 14 14 -6
8119 -6 16 -29 -18 40 15 -27 -41 24 19 -20 -26 67 14 20 55 46 65 32 14 13 11 -4 -7 9 24 36 8 30 4 -14 -16 -1 -27 -26 4
8154 4 3 20 -11 10 9 11 -4 5 -2 -39 36 13 -5 -22 7 -26 -13 -18 11 35 7 -2 -23 -49 38 -35 54 0 10 1 41 -14 35 1 30
8189 30 23 -19
$$ packed form
7951@l4K6J0j4k3M6qm3qP8l5j5K7j7j0K0lK7m6j9N2l6L2m6M8jm1j8P4q4N5K8k
7984B0rM8r0N2n7O5jn6PN9j4k4PL1k9Qm1O1m2M4m4l7j5N0j4%L2mk2M8Lk3K4l3
8018Dl0M9j5l3O1p2O8Mk4M8n5OMJ9o4M7rj3l4Q%L3j8mP4q5M5J8l9J2M6k1m2Q0
8052F8l8j7K%K6m2k8K2l0J9M6m1K9m7M7L0n3rpK3J9jj5m0P7m7k2rN1k8m7O6j6
8085a2L0m4M8l9N5jj5J9k7J1mp3QN2m3J2PJ0ll2j3O3j8M1J5r0L1m6Q2n8NM3%k0
8119fK2m5J1N8k5m2j4O5nl9oR3n3OL5rJ9l3j8jkj5lJ6J5J2k8K2k6j8kJ5k6JL0
8154DjJ7l1K1jKj5Rpl7P5k3j8j7K9l3J3nK9K4k8rk1k6Q7p3Q9n4J0rM0n5M9l4K9
8189C0pm2
8191a9
$$ Imaginary data points
##PAGE= N=2
##DATA TABLE= (X++(I..I)), XYDATA
$$ plain form
0 0 0 0 0 0 0 0 0 0 0 0 0 0 0 0 0 0 0 1 -8 8 -8 8 -8 9 -16 16 -16 24 -24 30 -32 39 -40 48 -56 61 -66 75 -86
39 -86 96 -105 117 -129 145 -160 176 -193 214 -235 259 -286 314 -346 383 -423 469 -521 580 -649
59 -649 729 -827 948 -1098 1294 -1564 1954 -2576 3728 -6586 30435 36537 3372 20940 -1205
74 -1205 -2231 -14105 -31239 -12744 -15387 -31364 3325 10731 9027 20068 5828 12756 27785
87 27785 962 -1041 -2456 -21189 -8563 -10169 -20141 2524 -3169 -10174 7806 5530 12976 16647
101 16647 -9370 1239 13062 -5802 -2264 -2524 -8332 1845 -11481 -8676 14441 -4004 -13037
114 -13037 898 -2660 5255 2951 -10240 6996 5607 -7124 8702 5957 -818 3834 -9968
127 -9968 -3161 8447 -9321 -7171 -2770 -10542 3416 1638 -6491 8016 1422 -4374 6699 -109
$$ packed form
0@%%%%%%%%%%%%%%%%%JrJ6j6J6j6J7k5L2l2M0m8N4o2P1p9Q8j04J17j27J41j61
39h6J82k01K22k46K74l05L36l69M07m49M94n45O00o60P29q06Q92r90J101j229
59f49J378j556J775k046K392k858L518m530O304j0314L7021O102l3165J7568k2145
74a205j026j1874j7134J8495k643j5977L4689P406j704J1041j4240O928J5029
87B7785k6823k003j415j8733J2626j606r972K2665n693p005J7980k276P446L671
101A6647k6017J0609J1823j8864L538k60n808J0177j3326K805K3117j8445r033
114a3037J3935l558P915k304j3191J7236j389j2731J5826k745o775M652j3802
127i968O807J1608j7768K150M401p772J3958j778q129J4507o594n796J1073o808
$$ plain form
141 -109 2883 4238 -13983 -3875 5863 -6878 -2788 -3278 -4586 6882 -2214 -1083 15133 2547
155 2547 -2453 6439 2802 8077 2662 -10492 2227 1510 -8978 -2 -2655 -4284 1922 -6784 951
170 951 10938 -1945 -152 3394 -1901 7063 1719 -6764 3627 -967 -4325 3681 -1753 2402 5455
185 5455 -6587 2153 8984 -1255 507 -2224 -3545 5356 -4132 -6245 4964 -2993 -4837 1028
199 1028 -1748 4658 1438 -8100 3524 4685 -2815 2706 -456 -25 5024 -3429 676 6756 -3339
214 -3339 -1764 325 -3335 3733 -714 -6227 2629 -19 -1529 3618 -1986 1376 3825 -5134 603
229 603 4239 -2754 -166 -2125 -1986 5989 -1063 -2913 5364 243 -304 2261 -1562 3652 797 -6717
245 -6717 2074 2723 -2773 783 -1877 -162 3887 -3631 -703 3788 -3555 -1412 -82 -2571 3120
$$ packed form
141a09K992J355j8221J0108R738j2741M090m90j308J1468r096J131J6216j2586
155B547n000Q892l637N275n415j3154J2719p17j0488Q976k653j629O206q706P735
170I51R987j2883J793L546n295Q964n344q483J0391m594l358Q006n434M155L053
185E455j2042Q740O831j0239J762k731j321Q901r488k113J1209p957j844N865
199A028k776O406l220r538J1624J161p500N521l162M31N049q453M105O080j0095
214c339J575K089l660P068m447n513Q856k648j510N147n604L362K449q959N737
229F03L636o993K588j959J39P975p052j850Q277n121n47K565l823N214k855p514
245f717Q791O49n496L556k660J715M049p518K928M491p343K143J330k489N691
$$ plain form
260 3120 -675 -3997 3463 930 -328 3013 -1911 1081 2920 -3977 108 2016 -2734 -1 -2114
275 -2114 -2006 4040 -1816 -3555 2406 -903 -899 -45 -3190 2064 502 -5105 1465 2062 -1435 951 -1450
292 -1450 809 3847 -2672 -580 3191 -1678 -32 154 -1841 2644 -817 -3497 1954 -500 -1366 914
308 914 -2673 369 2363 -2764 611 2071 -768 1949 -325 -766 4019 -640 -2055 2204 -169 415
324 415 582 -2082 2626 1779 -2882 1522 1523 -740 865 -1676 56 2586 -2619 -856 2196 -881 713
341 713 252 -1005 2863 184 -1820 2149 31 -461 1314 -1696 737 1821 -2131 427 1177 -853
357 -853 1350 -903 -1324 2518 -873 -1722 1062 -882 -10 -197 -2438 1509 792 -2779 605 661 -319
374 -319 1163 -1289 285 2394 -1884 -636 1403 -1099 19 -774 -1575 1843 -289 -1768 1369 -154
$$ packed form
260C120l795l322P460k533j258L341m924K992J839o897M085J908m750K733k113
275b114J08O046n856j739N961l309MQ54l145N254j562n607O570N97l497K386k401
292a450K259L038o519K092L771m869J646J86j995M485l461k680N451k454q66K280
308I14l587L042J994n127L375J460k839K717k274m41M785m659j415M259k373N84
324D15J67k664M708q47m661M404Jk263J605k541J732K530n205J763L052l077J594
341G13m61j257L868k679k004L969k118m92J775l010K433J084l952K558P50k030
357h53K203k253m21L842l391q49K784j944Q72j87k241L947p17l571L384N6r80
374c19J482k452J574K109m278J248K039k502J118p93q01L418k132j479L137j523
$$ plain form
390 -154 -239 885 -1695 73 626 -2572 -478 94 -1100 908 -733 -647 2796 495 -173 1652 -97
407 -97 692 117 -2161 776 140 -2552 -72 162 89 1193 -996 404 2348 -946 -234 883 -960
424 -960 7 -871 -1465 1643 -57 -1123 1462 440 800 1550 -776 656 1056 -1410 65 66 -988 638
442 638 -893 -889 1847 -10 -497 736 -566 685 381 -1635 666 330 -1557 283 207 100 915 -1215
460 -1215 -80 1634 -689 -352 398 -753 423 -399 -848 1439 -39 -907 932 -28 352 679 -1265
477 -1265 96 591 -1115 300 148 -595 820 -442 -395 1563 -114 -375 479 -516 742 486 -1213
494 -1213 609 466 -914 403 -89 -105 544 -1417 -383 987 -772 -445 123 -497 742 55 -512 1306
512 1306 83 -675 664 -97 252 379 -1160 183 702 -623 412 229 -368 824 -257 -351 1022
$$ packed form
390a54q5J124k580J768N53l198K094N72j194K008j641Q6L443k301o68J825j749
407i7P89n75k278K937o36k692K480K34p3J104k189J400J944l294P12J117j843
424i60R67q78n94L108j700j066K585j022L60P50k326J432M00k466J475Jj054J626
442F38j531MK736j857m87J233j302J251l04k016K301l36j887J840p6j07Q15k130
460a215J135J714k323L37P50j151J176q22m49K287j478q68J839r60L80L27j944
477a265J361M95j706J415j52p43J415j262M7J958j677k61Q54r95J258k56j699
494a213J822j43j380J317m92j6O49j961J034J370j759L27N68o20J239o87n67J818
512A306j223p58J339p61L49J27j539J343N19j325J035j83n97J192j081r4J373
$$ plain form
529 1022 -399 -577 76 -733 334 99 -1268 253 337 -516 480 -122 98 783 -832 -105 1046 -446
547 -446 -359 -190 -597 527 -290 -877 642 -157 -568 499 -82 357 526 -858 310 695 -483 191 -220
566 -220 -622 496 -380 -448 721 -297 -65 480 -171 660 427 -825 326 241 -353 334 -399 -157 592
585 592 -675 -69 863 -290 -83 -17 -355 683 -96 -676 562 -22 -217 472 -145 295 407 -663 317
604 317 572 -452 131 -187 -330 552 -273 -193 635 -262 -10 283 -389 386 110 -847 146 129 -300 192 -393
625 -393 -66 688 -342 112 741 -138 29 11 -381 465 -284 -819 222 -156 -231 252 -270 165 415 -542
645 -542 275 467 -281 163 -224 -286 418 -307 -337 381 -194 51 270 -225 447 206 -557 240 108 -287 190
666 190 -544 -196 404 -439 -98 347 -238 204 55 -174 585 -86 -476 322 -77 -181 119 -449 155 272
$$ packed form
529A022j421j78O53q09J067k35j367J521Q4q53R96o02K20O85j615P27J151j492
547d46Q7J69m07J124q17n87J519p99m11J067n81M39J69j384J168L85j178O74m11
566b20m02J118q76o8J169j018K32N45o51Q31k33j252J151q5n94O87p33K42P49
585E92j267O06R32j153K07O6l38J038p79n80J238n84j95O89o17M40J12j070R80
604C17K55j024N83l18j43Q82q25Q0Q28q97K52K93o72P75k76r57R93j7m29M92n85
625c93L27P54j030M54O29q79J67j8l92Q46p49n35J041l78p5M83n22M35K50r57
645e42Q17J92p48M44l87o2P04p25l0P18n75K45K19m95O72k41p63P97j32l95M77
666A90p34L48O00q43L41M45n85M42j49k29P59o71l90P98l99j04L00n68O04J17
$$ plain form
686 272 -382 298 352 -153 280 9 -36 529 -262 -247 262 -208 55 113 -334 266 153 -355 312 100 -133 183
708 183 -357 -71 397 -354 -84 157 -144 113 -9 -193 437 -55 -363 319 -98 -88 37 -376 162 215 -439
729 -439 131 144 -202 184 -87 -9 466 -168 -111 333 -158 78 128 -292 270 121 -254 180 -18 -156 181 -284
751 -284 -13 368 -285 -55 106 -161 168 -58 -263 337 -28 -255 239 -38 8 101 -298 170 218 -281 82
772 82 94 -148 202 -145 -63 319 -224 -59 256 -134 49 38 -283 184 82 -232 184 -48 -67 197 -221 -61
794 -61 203 -190 9 116 -137 159 -97 -153 292 -33 -116 226 13 54 128 -295 150 142 -264 66 42 -86 148
817 148 -105 -11 213 -138 -67 145 -112 84 58 -151 184 44 -126 111 -63 -52 236 -189 -12 195 -224 1
839 1 48 -92 113 -78 -139 240 7 -135 126 -91 69 94 -170 89 118 -170 58 38 -76 135 -154 -45 227
$$ packed form
686B72o54O80N4n05M33k71m5N65p91J5N09m70K63N8m47O00j13n08O67k12k33L16
708A83n40K86M68p51K70K41l01K57j22j84O30m92l08O82m17J0J25m13N38N3o54
729d39N70J3l46L86k71P8M75o34N7M44m91K36N0m20N62j49l75M34j98j38L37m65
751b84K71L81o53K30J61k67L29k26k05O00l65k27M94k77M6R3l99M68M8m99L63
772H2J2k42L50l47Q2L82n43J65L15l90J83j1l21M67j02l14M16k32j9K64m18J60
794f1K64l93J99J07k53K96k56n6M45l25q3L42k13M1P4m23M45qm06L30k4j28K34
817A48k53R4K24l51P1K12k57J96k6k09L35j40j70K37j74J1K88m25J77K07m19K25
839AM7j40K05j91o1L79k33j42K61k17J60K5k64K59K9k88K28k0j14K11k89J09K72
$$ plain form
862 227 -71 -28 76 -112 115 -13 -161 195 16 -198 131 -22 -27 131 -193 31 178 -163 61 33 -90 184
884 184 -83 -73 174 -77 -77 85 -79 94 109 -103 124 99 -96 104 18 -62 138 -115 -47 177 -74 27 73
907 73 -105 107 -22 -170 155 36 -80 66 -28 59 83 -108 50 129 -52 -5 25 -133 90 -17 -197 113 -94
930 -94 -102 46 -113 53 115 -136 150 22 -74 73 2 -106 110 -124 -92 128 -86 -31 12 -39 106 89 -116 142
954 142 -26 -73 49 -22 21 44 -140 34 50 -83 90 -14 -64 66 -16 -40 54 -60 -24 5 -82 39 30 -97 44
979 44 52 -101 23 -31 20 121 -52 4 99 -11 -6 32 -88 97 -13 -92 83 19 16 19 -55 -44 54 -108 38 63 -74
1006 -74 50 -4 -36 93 -42 -1 52 -68 -49 13 -68 65 15 -114 50 93 -38 66 3 15 101 -78 -15 56 -28
1031 -28 39 19 -54 14 23 -88 146 48 -26 0 -92 7 14 -55 76 67 -59 21 28 -10 65 -78 -46 66 -47 14 44 -114
$$ packed form
862B27k98M3J04j88K27j28j48L56j79k14L29j53nJ58l24K24J47l41K24k8j23K74
884A84k67J0K47k51%J62j64J73J5k12K27k5j95K00q6q0K00k53O8K24k51J01M6
907G3j78K12j29j48L25j19j16J46r4Q7K4j91J58P9j81M7L0j58K23j07j80L10k07
930i4qJ48j59J66O2k51K86j28r6J47p1j08K16k34L2K20k14N5M3n1J45j7k05K58
954A42j68m7J22p1M3K3j84J74J6j33J73j04n0J30q2k4R4j14L6K9q7J21rj27J41
979D4Qj53J24n4N1J01j73N6R5j10NL8j20J85j10p9J75o4lLp4J1R8j62J46K5j37
1006g4J24n4l2J29j35M1N3j20J9O2q1J33n0j29J64M3j31J04o3J2Q6j79O3P1q4
1031b8O7k0p3O8Rj11K34r8p4K6r2R9Po9J31rj26Q0Pl8P5j43L2J12j13O1L0j58
$$ plain form
1059 -114 37 45 -57 42 -2 -65 83 -52 9 75 -64 27 100 18 29 1 -64 58 -32 -3 54 2 -38 23 -92 -23 60
1086 60 -126 3 11 -39 10 -47 -81 53 44 -8 19 24 53 14 -20 91 68 -49 71 57 -60 66 -45 34 68 -53 9
1113 9 4 -61 -14 -36 -11 108 -62 -24 64 5 -32 -15 -75 -61 72 -74 -19 -10 -60 1 -29 11 108 -36 -25 60 10 53 9
1142 9 -30 97 12 -49 65 4 32 52 -25 40 75 -16 13 -18 -23 44 -15 -99 59 41 2 26 -68 -21 42 -71 -34 12 -28
1171 -28 -40 -50 -91 41 16 -71 54 -28 -6 62 -87 19 -21 -46 74 38 -83 10 -2 0 57 45 47 -12 12 59 17 -36
1199 -36 35 3 -44 63 -4 -58 129 -61 -17 -41 -78 41 -49 -39 41 17 -22 50 -49 -29 52 -56 -3 34 17 9 32 -23
1227 -23 62 30 -49 51 -49 25 24 -26 36 41 -39 9 69 -2 20 -22 -27 87 40 -46 49 38 21 26 -69 -10 59 -70 58 -7
1257 -7 14 51 -20 -53 49 -8 13 -30 -129 15 -15 -20 44 20 -43 -26 22 35 15 54 58 48 -3 52 32 -74 23 -20 -67 10
$$ packed form
1059a14J51Qj02R9m4o3J48j35O1O6j39R1P3q2J1k8o5J22r0K9N7n2m0O1j15O9Q3
1086F0j86J29Qn0M9n7l4J34rn2K7NK9l9l4J11k3j17J20j4j17J26j11P9L4j21O2
1113Ino5M7k2K5J19j70L8Q8n9l7J7o0J4J33j46N5Rn0O1l0M0R7j44J1Q5n0M3m4
1142Il9J27q5o1J14o1K8K0p7O5L5r1K9l1nO7n9q4J58j8l9K4r4M7O3j13L7M6m0
1171b8j2j0m1J32k5q7J25q2K2O8j49J06m0k5J20l6j21R3j2KN7j2Kn9K4M7m2n3
1199c6P1l2m7J07o7n4J87j90M4k4l7J19r0J0Q0k4l9P2r9K0Q1j08N3L7j7qK3n5
1227b3Q5l2p9J00j00P4jn0O2Nq0M8O0p1K2m2nJ14m7q6R5j1j7Nr5N9O9j29J28o5
1257gK1L7p1l3J02n7K1m3r9J44l0nO4k4o3J7M8J3k0L9Mj0n1N5k0j06R7m3m7P7
$$ plain form
1287 10 11 -3 40 -25 63 31 -46 -9 3 12 54 -57 35 55 -60 -14 20 -52 -30 14 -49 -3 3 -14 2 -70 -4 21 -26 21 51
1318 51 -47 -19 22 1 14 -20 -7 44 -13 19 10 -58 -23 6 -38 -8 6 -54 43 52 -105 21 0 -2 39 -25 -1 60 -76 36
1348 36 22 -25 45 33 22 14 11 -20 75 -5 17 42 -12 68 50 -36 50 42 -32 -48 -3 -2 24 -17 38 -30 -14 5 -6 -66 -25 19
1380 19 -23 14 11 -20 30 1 -17 19 -15 10 -23 31 -5 -28 34 42 17 1 38 -10 2 18 -11 8 41 14 57 -10 -57 60 6
1411 6 -56 19 -1 -17 -9 -39 2 -7 -46 -26 -22 -9 -7 -14 -60 17 6 -4 52 -22 5 -4 45 10 8 -10 13 -41 -2 46 -49 6 77 -20
1445 -20 29 6 -9 57 -39 -72 55 22 -56 -17 -46 51 -2 38 7 -15 -91 50 -74 20 40 -14 -21 96 8 -44 53 -66
1473 -66 -19 -14 -32 28 -28 -18 65 -46 -22 -22 -13 69 -2 -36 2 -11 -18 31 2 11 -12 -4 39 -14 4 7 43 16 41 -2 -37 27 -11
1506 -11 -72 67 28 -23 -35 17 26 -8 -21 -13 26 -29 0 53 10 60 -36 -17 10 -20 -21 39 5 22 -6 -48 21 -80 4 25 30
$$ packed form
1287A0Jj4M3o5Q8l2p7L7J2RM2j11R2K0j15M6L4p2K2M4o3M6Oj7J6p2O6K5m7M7L0
1318E1r8K8M1k1J3l4J3N1n7L2ro8L5K9m4L0J4o0R7Rj57J26k1kM1o4K4O1j36J12
1348C6j4m7P0j2j1qll1R5q0K2K5n4Q0j8q6Q6qp4j6M5JK6m1N5o8J6J9j1o0M1M4
1380A9m2L7ll1N0k9j8L6l4K5l3N4l6k3O2Qk5j6L7m8J2J6k9J9L3k7M3o7m7J17n4
1411Fo2P5k0j6Ql0M1rl9K0MJ3Kpm6P7j1j0N6p4K7rM9l5kj8K3n4L9M8r5N5P1r7
1445b0M9k3j5O6r6l3J27l3p8L9k9R7n3M0l1k2p6J41j24R4K0n4pJ17q8n2R7j19
1473f6M7Nj8O0n6J0Q3j11K4%RQ2p1l4L8j3pM9k9Rk3QM3n3J8LL6k7K5m3l5O4l8
1506a1o1J39l9n1j2N2Rl4j3QL9n5K9N3m3N0r6J9K7l0jO0l4J7k8m2O9j01Q4K1N
$$ plain form
1537 30 -15 14 6 26 8 -14 34 -42 8 85 1 -56 49 -53 7 -26 27 33 41 37 -12 -16 -42 60 -34 6 -17 -17 11 27 -15 7
1569 7 47 -10 9 -7 -18 39 -52 3 43 -22 86 -10 -54 -20 2 -12 -19 44 9 -8 -54 -45 60 -42 10 -7 8 15 70 -25 36
1600 36 37 -16 -18 10 -22 -3 6 -5 36 59 -1 27 38 20 -36 56 88 -27 37 19 5 25 -37 38 -15 -5 -27 11 -5 -79 -31
1631 -31 -34 -10 -9 13 46 -17 -1 3 -40 -14 -53 6 -28 61 10 22 14 -28 57 20 -15 17 -54 28 36 5 33 53 -17 19 51 -3 -9
1664 -9 -6 -14 39 10 -38 18 -2 -35 88 -25 -17 -19 -61 -23 -19 16 -41 -17 -21 -76 -69 53 49 -39 -8 12 10 -4 -48 51 47 63 4 11 39
1699 39 64 28 -36 -35 63 18 16 23 19 -40 -8 15 -4 -24 15 -38 5 22 21 -51 -45 -32 -25 14 -16 -30 1 -11 25 -20 -19 -46 33 35 -12
1734 -12 -19 -38 17 -25 16 -44 -27 3 43 -5 32 32 7 27 -13 -8 -53 18 -18 -44 -51 -2 39 -1 -42 -25 19 30 39 -35 -50 30 -25
1767 -25 -6 -17 -22 29 20 18 -12 26 51 35 36 54 -35 -24 57 -29 70 14 11 8 9 -3 17 26 -16 37 9 20 50 -88 42 23 34
$$ packed form
1537C0m5K9qK0j8k2M8p6N0P7q4n7J05j02O0l3N3OQmm9mk6J02r4M0k3%K8J6m2K2
1569GM0n7J9j6j1N7r1N5M0o5J08r6m4L4K2j4pO3l5j7m6RJ05j02N2j7J5PN5r5O1
1600C6Jn3kK8l2J9Rj1M1K3o0K8J1j8n6R2L2j15O4j8j4K0o2P5n3J0k2L8j6p4M8
1631c1lK4JK2L3o3J6Mm3K6l9N9l4Q9n1J2qm2Q5l7l5L2p1Q2Ql1K8K0p0L6L2n4o
1664iLqN3k9m8N6k0l3J23j13Qkm2L8ML5n7K4mn5PJ22mq8L1K0kj4m4R9mJ6n9PK8
1699C9K5l6o4JR8m5kPmn9L2K3j9k0L9n3M3J7jp2OJ3PL9l0j4L1j2L6m5Jk7P9Km7
1734a2pj9N5m2M1o0J7L0M0m8L7%k5K0m0Nm5P1l6k6pM9M1m0m1J7M4J1Rp4j5Q0n5
1767b5J9j1nN1rkl0L8K5j6JJ8q9J1Q1q6R9n6llJj2K0Rm2N3k8J1L0j38J30j9J1
$$ plain form
1800 34 30 3 -11 -45 39 -67 -1 -6 15 8 22 29 -45 44 55 21 15 68 -26 -4 14 -9 1 -6 -13 66 39 1 25 34 -19 13 -1 0
1834 0 50 15 46 -23 21 -20 4 6 9 8 41 39 0 -7 -11 -5 -66 -4 -14 72 26 14 -29 28 13 33 -38 -79 11 33 -11 39 -19 9
1868 9 49 24 29 -31 18 -88 75 7 -16 -38 32 17 -31 -6 -29 -44 -1 -14 -51 -52 9 -24 5 -23 -16 4 -30 11 -32 21 9
1899 9 38 -20 54 48 -30 11 56 25 26 34 20 6 39 46 67 22 -5 -17 -20 -36 -40 -2 -52 -40 -35 -17 -12 16 -35 3 -32 -35 -43 32 -56 14
1935 14 23 4 23 45 -26 9 -14 19 3 -54 -31 -24 35 53 37 17 37 11 -4 32 -3 -26 35 29 21 59 -31 -25 16 4 16 -14 -70
1968 -70 -8 -32 -11 -60 23 -11 -25 56 67 -9 -57 3 55 -26 -3 -4 -10 76 -31 -9 11 5 52 33 42 -71 -10 37 6 7 63 5
2000 5 -29 7 43 5 -15 -19 2 -34 -13 45 -59 10 -14 11 -36 -44 -65 17 29 29 -29 -17 -1 -10 -14 -70 -26 -19 29 7 14 -48 67
2033 67 10 -78 8 -42 13 15 -4 2 0 -30 36 -29 -26 16 9 -3 -32 -32 -45 -25 -13 -22 25 -10 -19 28 -23 1 -13 29 -5 0 18 2 -8
$$ packed form
1800C4mk7j4l4Q4j06O6nK1pJ4Pp4Q9J1l4oN3r4K2J8k3J0ppP9k7l8K4Rn3L2j4J
1834@N0l5L1o9M4m1K4KLjL3kl9pmOo1O2j0Q6m6j2m3N7j5K0p1m1R0K2m4N0n8K8
1868IM0k5No0M9j06J63o8k3k2P0j5m8K5k3j5M3j3l7jO1l3K9k8PK0l4M1m3N3j2
1899IK9n8P4op8M1M5l1JQj4j4L3PK1m5k7j2lj6mL8n0J2NJ8NK8n1L8l5lqP5q8P0
1935A4Rj9J9K2p1L5k3L3j6n7K3PN9J8j6k0K0k6j5L6l5k3O1oqL8r0OM1j2J2l0n6
1968g0O2k4K1m9Q3l4j4Q1J1p6m8O0N2q1K3joQ6j07K2K0oM7j9Rj13O1M7l1JN6n8
2000El4L6L6l8k0mK1l6K1N8j04O9k4K5m7qk1Q2J2%n8J2J6rmn6M4PM8k2Po2J15
2033F7n7q8Q6n0N5Kj9Okl0O6o5LM2pj2k9%j3K0J2rM7l5rM7n1K4j4M2l4NJ8j6j0
$$ plain form
2068 -8 -41 18 -12 -42 38 5 -36 54 21 58 -24 24 28 -22 1 0 -22 -36 -51 25 1 49 -42 -22 -33 -45 30 25 -17 -9 -34 -63 -36
2101 -36 19 11 -21 -6 22 6 36 2 7 2 6 -29 -5 -28 10 -55 16 3 20 35 14 -28 -18 -49 -29 19 -30 -39 -39 -36 25 -38 24 -11
2135 -11 -31 -67 28 9 -43 21 9 17 -29 25 -9 5 -19 -6 24 -45 32 13 -72 -2 -62 -2 17 -2 15 18 -5 -25 -25 33 -49 -22
2167 -22 15 -40 -9 -26 -44 0 -70 -54 9 -111 -18 22 -25 -44 21 -11 33 -6 -62 -6 -53 -28 -4 -60 34 -35 -51 12 29 -19
2197 -19 23 -5 24 21 -40 23 57 -56 15 -20 3 14 -1 -33 -45 8 -33 -6 -57 11 8 -71 -21 -17 10 21 -68 -10 -3 -14 -29 -48
2229 -48 -28 -8 -29 14 30 12 46 7 -27 32 -21 -29 23 25 -10 33 21 2 36 31 1 10 36 31 11 -7 -24 52 -5 34 -30 11 -51
2262 -51 -6 2 -39 26 78 26 -1 8 3 -3 1 6 3 61 42 0 -17 38 -23 -27 13 62 -30 32 7 13 -50 -3 -11 3 24 75 6 54 26
2297 26 -6 8 17 12 3 -48 -13 -18 -79 -10 11 8 41 7 -56 48 19 -22 -26 -40 -32 -1 24 8 26 -16 10 -55 6 78 26 -6 0 43
$$ packed form
2068hl3N9l0l0Q0l3m1R0l3L7q2M8Mn0K3jk2j4j5P6k4M8r1K0j1j2P5nm2Qk5k9K7
2101c6N5ql2J5K8j6L0l4NnMl5K4k3L8o5P1j3J7J5k1m2J0l1K0M8m9r%LO1o3O2l5
2135a1k0l6R5j9n2O4j2Qm6N4l4J4k4J3L0o9P7j9q5P0o0O0J9j9J7Lk3k0%N8q2K7
2167b2L7n5L1j7j8M4p0J6O3j20R3M0m7j9O5l2M4l9n6N6m7K5K4n6R4o9j6O3J7m8
2197a9M2k8K9lo1O3L4j13P1l5K3J1j5l2j2N3m1K7n1O8lp9N0MK7J1q9N8Pj1j5j9
2229d8K0K0k1M3J6j8L4l9l4N9n3qN2Kl5M3j2j9L4nl0RK6nk0j8j7P6n7L9o4M1o2
2262e1M5Qm1O5N2n2k7RnoMNlN8j9m2j7N5o1mM0M9r2O2k5Oo3M7qJ4K1N1o9M8k8
2297B6l2J4Rnrn1L5no1O9K1lL3l4o3J04k9m1mj4QL1K5j6J8m2K6o5O1P2n2l2OM3
$$ plain form
2331 43 -48 -10 -5 5 10 48 -3 13 36 -26 -15 -30 -37 46 7 -8 37 0 42 17 -36 -17 -51 -33 -13 11 -29 8 33 2 -38 -22
2363 -22 41 -21 11 9 -33 -5 -19 8 44 1 -29 23 54 -54 -9 -49 -10 0 30 -39 21 -10 61 -4 2 -72 -32 -1 6 27 15
2394 15 4 -35 44 -13 0 9 -50 -31 55 -14 -8 3 19 44 -57 0 -12 -56 41 -17 -37 -44 2 -7 -13 16 -11 -50 -31 -60 -3 6 28
2427 28 6 20 22 32 -51 42 -22 -28 -36 -13 0 21 -14 50 17 70 -21 0 8 -13 -43 27 2 58 33 38 10 9 -20 -19 53 7 -9 -25
2461 -25 -5 10 8 -13 51 8 -33 -6 -5 14 -62 -27 -37 13 -13 20 -4 -11 6 27 -38 -41 -34 -3 -20 -19 13 -17 38 8 16 7 9 -21 -35
2496 -35 -6 -24 -3 2 7 -7 15 22 16 -27 22 41 -48 18 15 -11 8 -112 -50 13 1 -3 50 -37 -9 7 28 -53 -34 49 -39 32 -7
2529 -7 12 2 -4 -46 78 -52 -9 25 -9 -32 -28 -4 33 -27 -23 -72 -34 28 31 12 -72 -24 -19 -29 4 -24 -19 22 -23 -27 -54 21 -42
2562 -42 -8 9 24 -61 20 -21 -6 -4 -21 -26 -29 -27 -32 7 10 66 -2 18 26 -8 -26 -15 -4 -2 -14 35 33 65 14 16 14 6 -20 -3 -41 -48 6
$$ packed form
2331D3r1L8NJ0NL8n1J6K3o2J1j5pQ3l9j5M5l7M2k5n3J9l4J8K0K4m0L7K5l1m0J6
2363b2O3o2L2km2K8j4K7L6m3l0N2L1j08M5m0L9J0L0o9O0l1P1o5Op4M0L1PK1j2
2394A5j1l9P9n7J3Rn9J9Q6o9OJ1J6K5j01N7j2m4R7n8k0pM6roK9k7l9J9k9N7RK2
2427B8k2J4KJ0q3R3o4oqK3J3K1l5O4l3N3r1K1Qk1l0P0k5N6k5Nk8jk9JP2m6j6j6
2461b5K0J5kk1O4m3m1K7JJ9p6L5j0N0k6L3k4pJ7K1o5lPL1j7JL2l0N5l0QrKl0j4
2496c5K9j8K1NNj4K2Pom3M9J9q9O6lk6J9j20O2O3j2mN3q7K8J6K1q1J9Q3q8P1l9
2529gJ9j0om2J24j30M3L4l4k3MK4L7o0Mm9L8O2Lj9q4M8Nj0L3k8NM1m5mk7P5o3
2562d2L4J7J5q5Q1m1J5Kj7nlKnL9LN6o8K0Ql4j8J1J1Kj2M9kL2n1Kkqk6J7l8pN4
$$ plain form
2599 6 -5 -26 56 -28 -24 -3 -30 13 -16 -53 41 22 15 -34 12 2 31 -18 -14 10 -56 39 -18 9 -63 1 -13 37 65 10 -35 -9
2631 -9 -12 -47 35 48 31 1 -28 -3 -38 -69 -50 -43 14 27 -26 37 -46 5 43 -35 2 -6 2 25 21 -2 -42 38 24 31 -34 -11 -5 14
2665 14 52 -29 -30 27 -2 84 -26 -72 -5 7 -62 11 45 26 -4 -3 2 -52 -30 -31 9 -4 37 -81 -13 -23 -9 8 -16 -2 -30
2696 -30 -1 30 71 11 -20 20 -26 -4 0 -2 6 -5 15 1 -1 -18 53 58 11 21 14 2 -40 28 -19 -50 -60 -29 56 -2 -10 2 -45 -41
2730 -41 -63 -18 -16 5 -17 -36 -24 14 2 28 44 -3 -42 21 -30 15 11 -7 -2 32 -48 -38 78 0 -7 23 15 27 12 8 -29 30 86
2763 86 -11 -21 -51 -27 -33 33 38 5 -25 4 11 29 37 25 35 2 -15 -18 25 19 -30 -7 -7 -33 -3 13 14 -12 45 8 -48 -3 1 -3 -49
2798 -49 15 12 43 -43 11 23 -28 -16 -8 14 3 -2 32 43 -36 -15 42 19 -15 -8 -65 6 -66 23 62 25 -23 -47 58 11 12 14 20
2831 20 -17 -1 57 -5 9 12 -12 -10 9 -14 39 -10 29 -64 -30 -30 11 -3 -17 42 1 24 -36 2 6 18 -24 -23 -27 -28 24 12 -48 -42
$$ packed form
2599Fj1k1Q2q4MK1k7M3k9l7R4j9pm9M6j0K9m9MK4o6R5n7K7p2O4j4N0K8n5m5K6
2631ill5Q2J3j7l0k9K5l5l1J9PN7J3n3O3q3N1L8p8L7qQK3mk3m0Q0j4Po5K3OJ9
2665A4L8q1jN7k9Q6j10m6O7J2o9P3L4j9l0JNn4K2jM0j3M1j18O8j0J4J7k4J4k8
2696c0K9L1M1o0l1M0m6K2MkQj1K0j4kj7P1Nm7J0pj2m2O8m7l1j0L1Q5n8qJ2m7M
2730d1k2M5KK1k2j9J2L8j2K6J6m7l9O3n1M5mj8NL4q0J0J16p8pL0qJ2j5ml7N9N6
2763H6r7j0l0K4oO6Nl3l0K9PJ8Qj2J0l3j7lM3om9K3%k6L0J6Jk6N7l7n6M5Mmm6
2798d9O4lL1q6N4J2n1J2QK2j1nL4J1p9K1N7k3l4Pn7P1p2Q9L9l7m8k4J05m7JKO
2831B0l7J6N8o2J4Lk4KJ9k3N3m9L9r3L4%M1j4j4N9m1K3o0L8MJ2m2JmjN2j2o0O
$$ plain form
2865 -42 -1 -33 14 23 48 40 -2 2 -29 -47 26 -76 31 18 -67 -62 -3 52 -7 40 -27 15 14 -37 -21 -64 -3 -25 76 -27 -30
2896 -30 -17 -76 0 -7 -49 2 46 65 -22 23 15 -3 -5 -49 -14 -11 -57 69 -8 14 31 9 37 28 -34 -8 -24 -48 67 -8 39 -4
2928 -4 8 6 -2 -59 -7 -13 -91 28 -16 -18 -43 15 17 3 -7 -55 22 -43 -45 -6 31 -20 8 -28 7 74 -14 46 -2 -6 11 -39 -18 46
2962 46 -12 -10 29 -27 4 1 11 19 -22 -70 -1 15 6 3 18 6 -39 -62 -21 0 -2 30 -16 -1 -64 -39 -10 15 41 -5 1 30 11 17
2996 17 66 -20 -38 -27 20 42 -12 0 16 -42 29 28 -18 8 53 5 15 -20 17 48 -31 46 -5 -17 17 18 1 -16 -8 -26 12 21
3028 21 -4 -9 60 40 -18 -12 24 -12 37 -53 -47 3 -14 22 -6 4 16 28 -16 -42 -32 4 11 -54 6 -14 31 5 -15 18 -21 5
3060 5 -4 4 -47 -42 6 10 -35 -1 -11 24 18 -10 0 -48 -12 27 33 38 60 -1 15 -2 -38 7 13 -6 62 16 -20 15 41 -12 22 3 -28
3095 -28 -36 8 -26 -29 -38 -91 19 3 4 -48 29 20 27 70 18 33 39 -16 8 -41 48 19 -4 -13 36 -30 40 18 -2 37 12 12 21 56 9
$$ packed form
2865d2M1l2M7RK5qm2Ml1j8P3j02J07j3q5NN9N5n9M7o7M2jn1J6m3O1k2J01j03l
2896c0J3n9P6pm2N1M4J9q7M5qj8km4L5Lm6J26p7K2J7k2K8ro2K6j6k4J15p5M7m3
2928dJ2kqn7N2op8J19m4kk5N8Kj4j0m8P7o5kL9L7n1K8l6L5O7q8O0m8mJ7n0K1O4
2962D6n8KL9n6L1lJ0Qm1m8O9J6rlJ5j2m5k3M1K1kL2m6J5o3K5K9K5K6m6OK9j9O
2996A7M9q6j8J1M7K2n4J2J6n8P1jm6K6M5m8J0l5L7L1p9P7n1j2L4Jj7j7Qj8L8R
3028B1k5nO9k0n8OL6l6M9r0ON0j7L6k8J0J2J2m4k6J0L6Po5O0k0M5k6k0L3l9K6
3060ErQn1NM8Mm5L4j0L5ok8J0m8L6L9ONK2o1J6j7l6M5Oj9O8m6l6L5K6n3L4j9l1
3095b8qM4l4lrn3J10j6Jn2P7rPM3n2J5On5K4m9Q9k9k3rM9o6P0k2k0L9k5%RL5m7
$$ plain form
3130 9 -2 16 11 -12 -11 -13 2 -92 23 -5 -23 62 -22 -25 -88 -41 -25 15 -43 -30 21 21 -30 11 -18 10 -39 -20 -23 -31 42 -54 31 19
3164 19 38 12 -18 -50 33 -54 5 23 12 -3 -20 17 10 22 89 -37 21 51 16 28 -5 -16 -31 -9 -7 -21 -16 19 -37 -29 -80 -20
3196 -20 -56 28 -34 20 95 22 19 30 13 22 64 14 38 46 1 -51 16 1 -12 43 60 -20 -37 -24 5 -27 18 -24 -32 -30 -40 11 -18
3229 -18 -51 -55 -9 -24 -5 40 -6 -20 18 86 -18 16 2 -3 23 -30 -5 -14 23 -3 2 54 8 9 13 -70 -9 0 -79 34 -7 10 -31
3262 -31 -2 6 -11 -17 40 -28 12 1 11 -11 -14 -14 9 21 1 -40 -16 31 -75 -7 9 62 11 74 22 31 -58 12 -16 56 -61 -5
3294 -5 33 19 18 52 4 -24 -19 -47 -24 -26 1 0 -40 4 -17 -16 -32 -2 -52 3 -14 -19 -30 -6 -9 -13 -16 4 3 30 24 -40 41 -38 -4 -1 59
3331 59 -14 -9 30 -1 58 41 -17 70 -49 -6 19 -24 21 46 -31 -20 -68 -33 4 4 0 -41 -32 -49 -20 -4 -33 -34 15 -16 38 45 6
3364 6 29 16 39 -22 -4 -3 4 -33 13 35 54 -41 3 11 -14 49 9 22 -39 -31 32 31 -26 14 -8 -12 -13 -43 -79 -45 -8 -41 -8 -19
$$ packed form
3130Ij1J8nk3JkJ5r4J15k8j8Q5q4lo3M7J6M0n8J3N1%n1M1k9K8m9J9lqP3r6Q5j2
3164A9J9k6l0l2Q3q7N9J8j1j5j7L7pJ2O7j26N8L0l5J2l3j1j5K2Kj4NL5n6Qn1O0
3196b0l6Q4o2N4P5p3lJ1j7RM2n0K4Qm5n2O7j5j3N5J7q0j7J3K9l2M5m2qKj0N1k9
3229a8l3mM6j5J9M5m6j4L8O8j04L4j4nK6n3K5rL7k6NN2m6JMq3O1Rp9J13m1J7m1
3262c1K9Qj7oN7o8M0j1J0k2l%K3J2k0m1K4M7j06O8J6N3n1O3n2Rq9P0k8P2j17N6
3294eL8j4jL4m8k8Nk8K3kK7jm0M4k1Jj6L0n0N5j7nj1K4lmlK0jK7oo4Q1p9L4LO0
3331E9p3NL9l1N9j7n8Q7j19M3K5m3M5K5p7J1m8L5L7%mm1Rj7K9J6k9jM9l1N4Pl9
3364FK3j3K3o1J8JPl7M6K2J9r5M4Qk5O3m0J3o1QO3jn7M0k2mjl0l6L4L7l3L3j1
$$ plain form
3398 -19 9 9 -4 5 21 41 -32 43 39 15 36 47 54 -52 -14 -56 -39 22 -1 -9 3 54 0 -37 16 20 39 -27 5 -5 29 20 -23
3431 -23 -47 -39 74 15 -19 -41 -41 -6 -14 -34 6 -39 -10 24 8 35 -8 29 -46 -41 -18 2 26 -11 28 14 -38 12 36 10 -22 61
3463 61 27 34 -33 23 32 -55 22 12 -95 14 17 -23 23 5 -25 -11 -3 -22 -48 7 -29 37 -57 9 -7 -9 50 37 9 12 26 7
3495 7 -16 9 -3 34 -33 -21 -3 6 -68 -11 13 23 -13 -22 3 24 30 -22 -11 -1 1 -14 -51 0 64 31 0 -23 0 -91 -4 26 -31
3528 -31 48 1 -10 16 -55 43 57 62 0 -36 -32 25 -23 -42 29 -37 15 37 -30 -15 22 -21 -32 38 47 -13 -35 -12 36 -34 -51 -24
3560 -24 -45 23 -18 -14 0 15 -46 -3 -14 44 -49 56 15 22 -2 -16 25 -27 35 -27 -3 12 25 77 -20 -47 67 -13 35 -39
3590 -39 -18 -48 5 -1 5 58 -21 38 -5 -9 -45 -10 19 1 -6 5 -41 13 17 -42 -40 -33 9 -15 38 -60 25 -70 -21 -2 7 -7 -65 -19
3624 -19 -20 8 17 -22 29 22 29 -5 18 19 65 6 -21 35 -57 26 15 -22 56 -18 -60 6 -15 10 -38 7 -8 -68 -8 -21 12 -38 27
$$ packed form
3398a9K8%j3RJ6K0p3P5mk4K1J1Pj06L8m2J7O1k3qJ2N1n4l7N3MJ9o6L2j0L4rm3
3431b3k4QJ13n9l4k2%L5qk0M0m5K9L4j6K7m3L7p5NK3K0K4l7L9j4n2N0K4k6l2Q3
3463F1l4Po7N6Rq7P7j0j07J09Lm0M6j8l0J4Qj9k6N5l6O6r4O6j6kN9j3k8LJ4j9
3495Gk3K5j2L7o7J2J8Rp4N7K4J0l6rK5K1On2J1J0Kj5l7N1O4l3l1k3K3r1Q7L0n7
3528c1P9m7j1K6p1R8J4No2l6MN7m8j9P1o6N2K2o7J5L7m3j1P0Ro0k2K3M8p0j7K7
3560b4k1O8m1MJ4J5o1M3j1N8r3J05m1Pk4j4M1n2O2o2K4J5J3N2r7k7J14q0M8p4
3590c9K1l0N3oON3p9N9m3ml6L5K9j8pJ1m6N4Mn9KPM2k4N3r8Q5r5M9J9Rj4n8M6
3624a9jK8Rl9N1pPl4K3JM6n9k7N6r2Q3j1l7P8p4m2O6k1K5m8M5j5o0O0j3L3n0O5
$$ plain form
3657 27 -14 -24 -27 2 19 -38 16 67 -23 -9 60 54 40 -22 -6 23 10 32 -10 3 21 -7 13 17 9 -74 -20 2 16 30 -12 54
3689 54 50 -35 15 -28 -5 1 -7 -36 35 7 -35 -1 40 -45 -24 -16 -5 -24 -26 -3 -81 9 -7 -15 10 -10 36 -7 -29 23 18 24 -12 60
3723 60 9 1 -51 -21 -20 -29 19 9 -8 -29 25 32 -32 -30 -10 -29 4 -17 20 12 19 18 -17 -20 -39 4 13 -12 -72 -11 -17 -8 50 -53 24 -25
3759 -25 7 40 29 5 -16 -10 31 -25 8 -8 1 -69 -42 -54 -55 -3 -60 24 -1 -17 -36 11 19 18 19 10 -14 -11 41 25 50 55 43 54 -7
3794 -7 -22 14 52 42 -17 17 9 6 -5 37 -12 -15 7 -70 -8 40 -25 -28 19 -18 -4 -13 33 7 25 -9 29 16 -67 -54 -9 28 -51
3827 -51 -16 13 24 -16 16 0 13 9 -19 8 15 18 -30 -24 21 -54 22 -31 8 19 20 -38 -15 32 49 -16 1 2 -21 13 19 14 -11 -30
3861 -30 -20 -5 17 10 1 -27 7 41 -28 3 44 16 -9 2 36 -11 -22 -10 -21 -43 17 -18 -27 -26 10 -21 11 7 26 9 -19 0 -4
3894 -4 -9 11 -24 32 -45 9 -60 -70 12 11 1 -15 32 -49 -10 13 -57 -45 10 -25 -26 13 -44 10 3 2 -41 4 -28 -14 77 -16 -29
$$ packed form
3657B7m1j0lK9J7n7N4N1r0J4O9oj4o2J6K9j3K2m2J3J8k8K0Mqq3N4K2J4J4m2O6
3689E4mq5N0m3K3Oqk9P1k8m2L4M1q5K1QJ1j9kK3p8R0j6qK5k0M6m3k2N2nOl6P2
3723F0n1qn2L0JrM8j0j7k1N4Po4KK0j9L3k1L7qPjl5lj9M3Rk5o0O1oRN8j03P7m9
3759b5L2L3j1k4k1OM1n6L3j6Rp0K7j2jN2n7Q4k5j6j9M7QjJrk4LN2j6K5Nj2J1o1
3794gj5L6L8j0n9L4qlj1M2m9lK2p7O2M8o5lM7l7J4rM6k6J8l4L8j3q3J3M5L7p9
3827e1L5K9J1m0L2j6J3mk8K7PLm8OM5p5P6n3L9J1Jn8K3M7J7o5J7Jk3L4Onk5j9
3861c0J0J5K2prk8L4L4o9L1M1k8k5J1L4m7j1J2j1k2O0l5rJL6l1L2mJ9j7k8J9m
3894dnK0l5N6p7N4o9j0Q2jj0j6M7q1L9K3p0J2N5l5jL9n7N4pjm3M5l2J4R1r3j3
$$ plain form
3927 -29 -33 -43 -4 15 -3 -8 31 -60 -31 -29 33 33 -23 3 7 9 -25 -9 13 20 -19 -23 -31 -25 -36 -1 -10 50 11 -8 -17 -17 28 39 21 -9 2
3964 2 14 52 -63 65 -26 3 1 -12 9 28 -11 -5 -17 -7 34 -11 -27 -14 3 -48 -16 -14 -28 5 21 -58 1 2 -2 -42 -10 -10 4
3997 4 23 3 1 0 1 6 -28 14 -25 -3 10 -25 47 24 -8 -21 9 4 25 34 -15 6 -9 16 15 31 -14 48 -63 18 -42 -75 -52 3
4031 3 -54 45 25 -18 -7 45 13 -6 23 58 -19 -19 -21 76 8 7 2 -4 -5 16 -35 36 18 -25 34 1 14 -16 5 -40 51 -14 20 -23
4065 -23 -29 -1 33 -3 -24 1 -23 16 6 -14 -25 4 6 6 -9 -8 -11 -27 55 -8 -47 16 23 115 7 24 1 11 -32 0 -42 32 -12
4098 -12 0 -58 -48 63 27 -50 0 20 -29 26 15 13 12 -5 -8 -61 7 -36 15 4 7 27 15 -20 -91 57 -9 32 3 -21 9
4129 9 17 -1 7 0 -19 30 11 -34 -38 -4 11 -11 -41 -54 -37 -35 25 23 27 -31 3 -39 -23 29 -13 0 28 25 42 17 17 -6 12 58 38
4164 38 -36 -76 -18 57 37 23 -31 -40 8 -9 14 -4 39 12 -22 20 3 88 -61 -25 1 -56 -26 35 10 32 -15 -5 -53 27
$$ packed form
3927b9mj0L9J9j8nL9r1K9KO2%n6K6MKl4J6K2Pl9mqOj1L5rO0l9j9r%M5J1j8l0J1
3964BJ2L8j15J28r1K9kj3K1J9l9Oj2J0M1m5j6J3J7n1L2Kj4L3J6p9N9Jmm0L2%J4
3997DJ9k0kjJNl4M2l9K2J3l5P2k3l2j3L0nK1Rm9K1j5K5jJ6m5O2j11Q1o0l3K3N5
4031Cn7R9k0m3J1N2l2j9K9L5p7%kR7o8jnojK1n1P1j8m3N9l3J3l0K1m5R1o5L4m3
4065b3oK8L4l6k1K5k4L9j0k0j1K9K%j5Jlj6Q2o3l9O3PR2j08J7k3J0m3L2m2P4m4
4098a2J2n8J0J11l6p7N0K0m9N5j1kjj7ln3O8m3N1j1LK0j2l5p1J48o6M1k9k4L0
4129IQj8Qpj9M9j9m5mL4J5k2l0j3J7KO0kMn8L4m2J6N2m2J3K8lJ7k5%k3J8M6k0
4164C8p4m0N8P5k0j4n4rM8j7K3j8M3k7l4M2j7Q5j49L6K6n7L0O1k5K2m7J0m8Q0
$$ plain form
4194 27 -16 11 9 -26 -35 0 -27 -38 -17 -9 14 12 -1 3 8 -12 -24 1 -61 -51 37 -23 16 50 -7 24 4 -35 -30 9 31 -11 -38 16
4228 16 -37 -16 -18 -2 -50 -39 -17 -13 41 32 -49 -45 -21 -11 -20 -13 -118 23 -5 6 44 -21 -27 62 36 0 32 8 2 -60 9 3 -10 -10
4262 -10 -9 14 28 23 5 46 9 -15 -45 -12 -37 -52 -19 37 1 -25 -51 42 -8 0 -1 59 114 59 -6 10 -19 -14 -11 24 21 -32 -34 -20
4296 -20 -57 4 18 23 8 -10 0 -7 21 21 -28 26 18 17 4 5 -19 -19 -42 -51 -21 -47 -43 -10 -29 -8 -31 -81 -40 -35 -4 -22 11 -21 39
4331 39 -19 -41 -3 21 -20 -25 -52 -1 -35 82 -14 -29 -39 -86 -11 21 38 13 -31 -23 33 58 11 32 -54 -1 -22 39 -15 20 60
4362 60 20 11 -28 2 -3 16 -21 47 -32 -28 59 3 -1 37 30 36 54 4 -7 19 -17 20 -35 12 -86 -19 17 3 -25 -32 21 -8 -50 -43
4396 -43 -25 -24 8 -13 -16 -18 23 -31 14 -17 -12 28 -16 -39 25 -48 -29 47 -8 -27 -7 27 -5 -43 41 6 -15 25 18 -49 36 9 4
4429 4 -19 -49 -2 54 -31 6 -31 38 -18 -23 -10 -10 6 -47 -23 -40 2 -26 -41 -11 -16 0 -21 77 -25 24 39 14 17 -5 -6 -1 -13
$$ packed form
4194B7m3K7kl5rL5k7j1K1QK3kj3MNk0j2K5o2J0Q8o0L9L4n7L1k0l9NL9K2m2k7N4
4228A6n3K1kJ6m8J1K2MN4rq1MK4J0rPj05J41k8J1L8o5oQ9k6l6L2k4oo2O9oj3%
4262a0JK3J4nj8M1l7k4l0L3k5j5L3N6l6k6k6R3n0QjO0N5n5o5J6k9NLL5ln3kJ4
4296b0l7O1J4Nj5j8J0pK8%m9N4qjj3Jk4%k3rL0k6ML3j9K1k3n0M1NL1j8L3l2O0
4331C9n8k2L8K4m1nk7N1l4J17r6j5j0m7P5L2J7k5m4QN6K5m7K1q6N3k1O1n4L5M0
4362F0m0rl9L0nJ9l7O8p9MQ7n6mL8pOJ8n0j1K6l6L7n5M7r8O7L6j4k8pN3k9m2P
4396d3J8JL2k1lkM1n4M5l1NM0m4k3O4p3J9P6n5j9K0L4l2l8Q4l5k1M0po7Q5k7n
4429Dk3l0M7N6q5L7l7O9n6nJ3%J6n3K4j7M2k8j5L0nJ6k1R8j02M9J5k5Lk2jNj2
$$ plain form
4462 -13 19 -11 -11 -20 46 3 28 32 14 32 -3 0 -34 -3 14 38 -6 -10 -58 -63 -5 -35 8 -9 -65 14 37 39 -11 11 -66 14 26 -36
4496 -36 -9 -26 -40 31 -8 -5 49 33 49 39 2 23 41 31 -7 -2 -31 69 -20 -8 -25 -43 3 -12 -12 -42 -29 -40 -53 -17 -49
4527 -49 -23 35 -30 -5 -70 1 -8 -14 -26 31 -9 41 -78 28 19 -26 48 1 21 50 26 -4 21 38 36 15 35 64 2 -50 24
4558 24 14 46 -23 9 -34 8 24 -29 30 31 -14 -6 -75 -11 -23 6 0 22 0 11 -17 17 12 -2 -6 59 11 -27 13 -4 -29 48 67
4591 67 -27 17 -45 -2 1 -32 15 -39 -4 -17 -10 50 -57 -3 -3 18 -33 -3 4 -32 -29 -54 8 -28 -13 9 -1 -46 -1 -52 29 -68
4623 -68 16 -18 -16 -17 42 29 -34 -6 13 14 -30 60 28 -45 -7 41 15 17 8 10 3 23 -4 -7 23 30 1 7 15 -52 -10 0 -20 -38 -42 16
4659 16 19 -20 25 -22 48 30 75 8 -69 -46 -30 -5 25 2 26 -14 -32 -9 45 22 24 9 -3 -59 -31 37 -21 67 -52 -30 43
4690 43 -22 28 -10 20 -15 -20 11 -10 26 -36 -15 -16 -4 38 -36 -20 -7 5 -12 -10 -15 -27 5 0 -1 -15 28 42 24 20 28 87 -24 13
$$ packed form
4462a3L2l0%rO6m3K5Mj8J8l5Ll4L1J7K4m4mm8nN8l0M3j7n6P9K3Kn0K2p7Q0J2o2
4496c6K7j7j4P1l9LN4j6J6j0l7K1J8j0l8Nk9J00q9J2j7j8M6j5%l0J3j1j3L6l2
4527d9K6N8o5K5o5P1roj2N7m0N0j19J06rm5P4m7K0K9k4l0K5J7kk1K0K9o2n2P4
4558B4j0L2o9L2m3M2J6n3N9Jm5Qo9O4j2K9oK2k2J1k8L4nj4mO5m8l8M0j7k5P7J9
4591F7r4M4o2M3Ll3M7n4L5j3PO0j07N4%K1n1L0Pl6Lk5O2l6J5K2j0m5M5n1Q1r7
4623f8Q4l4KjN9j3o3K8J9Jm4R0l2p3L8M8k6KrKpK0k7lL0Pk9OQo7M2J0k0j8mN8
4659A6Ll9M5m7P0j8M5o7p7K3J6K5L0k3K4m0j8K3N4k3Kj5j2n6K8O8n8Q8j19K2P3
4690D3o5N0l8L0l5nL1k1L6o2K1jJ2M2p4J6J3J2j7Knj2L2njj4M3J4j8mQN9j11L7
$$ plain form
4724 13 68 48 -34 4 44 2 -9 -39 -34 19 -12 -7 -19 7 39 -42 44 -21 -29 -41 -3 -20 34 12 28 -38 49 29 -22 -5 -9 -35
4756 -35 61 -19 -56 23 10 7 30 10 -18 5 -30 -22 -21 -27 45 -59 -36 22 -27 -64 2 -33 19 3 -64 14 6 2 56 19 52 -48
4788 -48 20 -45 -11 3 -39 -6 -22 3 41 -39 -13 -28 -21 21 -1 19 -18 -11 7 -19 -71 30 4 -20 -2 -26 28 -48 -39 6 7 -53
4820 -53 -42 38 -11 15 -44 -1 35 -23 -67 -9 58 43 43 -37 -18 -19 29 -25 6 20 28 15 -19 14 -48 -61 -26 2 -11 2 15 28
4852 28 18 -48 -8 -4 -3 -38 -13 19 -55 -3 -11 -86 4 -13 12 -20 30 27 -29 6 -14 -19 -14 18 -16 20 7 -31 12 17 -68 34 -4
4885 -4 0 46 69 66 3 -3 -23 -38 -21 44 2 33 -5 -15 39 18 63 -9 -10 -29 -38 -32 -14 58 -27 8 -12 6 -37 24 -5 24 4 -22
4919 -22 -3 -14 -10 5 -43 5 27 -6 25 7 -7 43 50 -7 55 -39 52 -45 -15 17 -35 33 9 -11 26 59 29 14 34 -5 -2 8
4951 8 -30 -19 9 8 -2 4 5 43 37 -57 -42 -6 4 20 -78 9 -7 20 -4 -56 -15 33 21 48 38 -10 3 2 -14 -12 23 -18 -5 10
$$ packed form
4724A3N5k0q2L8M0m2j1l0NN3l1Nj2K6L2q1Q6o5qj2L8j7N4k2J6o6Q7k0n1J7mk6
4756c5R6q0l7P9j3lK3k0k8K3l5QJoP2j04K3N8m9l7O6l5N2j6o7P8qmN4l7L3j00
4788d8O8o5L4J4m2L3j6K5L8q0K6j5PM2k2K0l7PJ8k6n2J01k6k4J8k4N4p6RM5Jo0
4820e3J1Q0m9K6n9M3L6n8m4N8O7j5%q0J9jM8n4L1J4Qj3l4L3o2j3L5K8j3J3J3J3
4852B8j0o6M0MJl5K5L2p4N2qp5R0j7K5l2N0ln6L5k0nNL2l4L6j3l8M3Nq5J02l8
4885dMM6K3lo3ok0j5J7O5m2L1l8j0N4k1M5p2jj9rOJ8P2q5L5k0J8m3O1k9K9k0k6
4919b2J9j1MJ5m8M8K2l3L1j8j4N0Pn7O2r4R1r7L0L2n2O8k4k0L7L3l0j5K0l9LJ0
4951Hl8J1K8jj0OJL8or4J5L6J0J6r8Q7j6K7k4n2M1M8j2K7j0m8J3jj6KL5m1J3J5
$$ plain form
4985 10 1 -22 19 -26 -7 -29 -5 -56 55 -20 -57 -72 16 8 -43 40 6 -2 5 -21 53 -4 9 -33 -17 16 14 13 19 14 2 -2 26 6
5019 6 -36 -4 -76 -43 -11 18 -6 -34 18 -30 22 -13 -29 -4 -1 -11 3 -50 -18 2 8 6 4 -13 -34 15 4 -9 4 -7 19 9 48
5052 48 -3 -3 30 49 -5 5 -1 -4 -36 -5 -33 -21 -8 5 -55 14 5 7 -39 6 -24 -40 25 1 -4 -3 -63 7 78 -2 -1 -66 33 9
5086 9 -45 21 21 -24 27 -20 40 57 -1 20 56 -1 36 67 28 -11 25 13 22 -29 -37 -12 -23 13 -32 0 30 -54 -58 -14 5 -35 -21
5119 -21 -8 -15 -34 -11 -34 1 -21 25 4 38 60 2 0 6 -66 -34 -2 55 -39 8 9 34 41 -32 -6 -2 37 -5 -1 15 -8 10 -51 5
5153 5 2 -24 23 -10 9 31 -52 -15 52 -24 -6 -31 31 -45 41 -71 36 3 39 40 29 26 -4 9 -22 68 23 1 8 -5 42 12
5185 12 53 -8 32 -3 -11 -8 -21 -18 11 1 -17 19 19 -26 -2 -13 -10 -23 5 -19 1 -48 -20 3 5 12 -55 -49 -18 9 28 3 17 -26
5219 -26 8 -48 -9 -27 -29 85 16 -3 -7 -24 -39 2 19 22 54 -21 -33 -53 -5 8 -22 -11 -4 -4 -43 27 -23 -51 -35 -15 7 -41
$$ packed form
4985A0rk3M1m5J9k2K4n1J11p5l7j5Q8qn1Q3l4qPk6P4n7J3m2J6L3kjOnj2mK8k0
5019Fm2L2p2L3L2K9k4k8N2m8N2l5j6K5Lj0J4n3L2K0Okkj7k1M9j1j3J3j1K6j0L9
5052D8n1%L3J9n4J0oll2L1k8J2J3J3o0O9rKm6M5l0j6O5k4nJo0P0P1q0Jo5R9k4
5086In4O6%m5N1m7O0J7n8K1L6n7L7L1l9l9L6j2Rn1qK5j1L6m5L2L0q4mM4J9m0J4
5119b1J3pj9K3k3L5k2M6k1L4K2n8kOp2L2L2N7r4M7JK5Pp3K6ML9m2MJ6k3J8o1N6
5153Elk6M7l3J9K2q3L7O7p6J8k5O2p6Q6j12J07l3L6Jj1ll0J3l1R0m5k2Pj3M7l0
5185A2M1o1M0l5qLj3LK9j0j8L6%m5K4j1Lj3K8k4K0m9K8K3KPo7OL1K7J9k5J4m3
5219b6L4n6L9j8kJ14o9j9mj7j5M1J7LL2p5j2k0M8J3l0J1P%l9P0n0k8J6K0K2m8
$$ plain form
5251 -41 -11 -29 -46 30 9 36 -5 -15 43 45 -31 36 8 -27 -11 -27 40 -5 -12 -7 -75 39 -28 -34 -5 12 -8 -27 -1 -6 31 -52
5283 -52 -36 -7 -71 -98 -49 -26 -64 -44 -8 -13 25 -6 35 -2 3 11 0 66 35 -77 71 26 -39 46 6 -39 8 33 16 35 -16
5314 -16 -25 -53 40 -12 -17 -4 -13 13 41 -56 -13 16 5 1 9 -38 -24 68 19 -75 39 -9 -37 -1 6 -1 -29 31 41 -2 7 34 8 62
5348 62 23 34 41 -64 15 43 58 -24 50 24 -79 22 -23 44 0 -12 -11 -20 27 -73 -5 -81 -23 33 -16 61 -32 49 -24 -28
5378 -28 -41 -23 16 -9 78 28 -19 -19 -6 57 3 25 31 -19 68 -11 -5 -15 4 1 39 -10 0 -38 -18 34 46 5 33 6 -1 -20 -24
5411 -24 -17 -23 -79 -5 4 -42 -23 -11 61 -41 -4 -41 -7 -35 3 -30 -40 -18 48 25 -25 -58 -22 25 -21 31 47 -29 19 -10 38
5442 38 10 -6 -3 42 -21 -46 43 -53 22 -76 -21 18 -15 -39 11 14 5 -33 23 12 6 -26 -19 14 19 5 -26 -8 -44 6 22 -7 -29
5475 -29 21 24 -16 66 -6 -23 -14 -26 -29 -12 -1 36 -27 -13 -50 4 -38 -15 44 -9 37 2 -52 -9 -32 -9 -19 -6 -13 21 -27 -30 6
$$ packed form
5251d1L0j8j7P6k1K7m1j0N8Kp6O7k8l5J6j6O7m5pNo8J14o7oK9J7k0j9K6nL7q3
5283e2J6K9o4k7M9K3l8K0L6nL8l1M1l7NQj1O6l1j12J48m5o5Q5m0m5M7K5j7J9n1
5314a6rk8R3n2nJ3rK6K8r7M3K9j1mQm7J4R2m9r4J14m8k8L6Ppk8O0J0m3RK7k6N4
5348F2l9J1Pj05P9K8J5q2P4k6j03J01m5O7m4j2JrM7j00O8p6N8N6m9P7r3Q1p3m
5378b8j3J8L9k5Q7n0m7%J3O3n4K2On0Q7p9Oj0J9lL8m9J0l8K0N2J2m1K8k7pj9m
5411b4Pon6P4Rm6J9J2P2j02L7l7L4k8L8l3j0K2O6k3n0l3L6M7m6N2J6p6M8k9M8
5442C8k8j6LM5o3k5Q9r6P5r8N5L9l3k4N0Lrl8N6j1ol2PL3Nj4l1J8l6N0J6k9k2
5475b9N0Lm0Q2p2j7Rj2lJ7J1L7o3J4l7N4m2K3N9n3M6l5n4M3k3K3j0J3pL4m8lL6
$$ plain form
5508 6 4 26 -27 0 16 52 77 31 56 16 12 60 -17 16 -20 -17 22 -1 14 32 55 -60 -28 28 -20 19 29 24 -2 -1 -4 -11 -1 5
5542 5 -3 4 -5 -67 -32 11 36 -19 8 33 22 29 -1 -26 26 45 39 29 -45 -53 58 -10 21 -37 -20 -62 35 -17 15 -29 31 -65 2
5575 2 -20 -53 -14 -13 35 -21 -41 -1 -24 27 -1 3 35 -39 -8 33 -70 3 11 -29 -4 6 36 -1 -3 2 37 -38 -8 48 50 -3 11
5608 11 -13 33 -36 43 -7 -12 45 -22 25 -19 13 5 -27 3 -21 9 -4 -32 2 -79 26 15 -3 15 44 1 31 -34 16 -25 -15
5639 -15 17 -29 45 44 19 -12 8 8 -9 -14 5 -26 7 -5 3 -33 17 -3 -15 25 -21 10 -37 -9 -46 -1 32 -48 -45 -57 -37 10 34
5672 34 36 47 51 3 -9 -30 -10 -17 4 4 -6 -15 6 12 22 -10 -10 -23 16 -28 3 -40 9 6 -47 14 -3 -41 7 -24 25 21 -23 10 -16
5707 -16 -63 -14 11 -35 4 -75 44 -46 16 -2 -24 37 11 -18 25 1 -27 -19 -3 29 33 10 8 46 -9 -41 -22 32 -32 2 -5 13
5739 13 -28 34 3 -29 1 -7 -44 -4 21 2 6 -4 28 6 25 10 -33 50 22 2 6 -57 25 20 -49 -21 44 -7 36 -12 -8 3 -17
$$ packed form
5508FkK2n3K7J6L6K5m6K5m0mM8p7L3l6LL9k3J5J8K3j15L2N6m8L9J0nk6JlpJ0O
5542EqPro2L5M3K5n5K7K5j1Pl0k5N2J9oj0p4qJ11o8L1n8J7m2R7n2L2m4O0r6O7
5575Bk2l3L9JM8n6k0M0k3N1k8ML2p4L1M1j03P3Qm0K5J0L0l7kNL5p5L0N6Kn3J4
5608A1k4M6o9P9n0nN7o7M7m4L2ql2L0k4L0j3k8L4q1J05j1j8J8K9m3L0o5N0m1J0
5639a5L2m6P4jk5l1K0%j7nJ9l1L3j2Ql6N0k0j2M0m6L1m7K8l7M5L3q0Lj2K0M7K4
5672C4KJ1Mm8j2k1K0pK1%j0rK1OJ0l2%j3L9m4L1m3M9ln3O1j7l8M8l1M9mm4L3k6
5707a6m7M9K5m6L9p9J19r0O2j8k2O1k6k9M3k4k8QJ6L2Mk3kL8n5l2J9N4o4L4pJ8
5739A3m1O2l1l2L0ql7M0K5j9Mj0L2k2J9j5m3Q3k8k0Mo3Q2no9K8O5n1M3m8MJ1k0
$$ plain form
5772 -17 15 -19 51 -8 14 -71 -41 17 35 21 7 -19 15 -39 3 25 24 22 -21 -38 21 9 30 2 -5 -11 -41 17 16 3 -60 71
5804 71 22 12 4 -44 19 -1 20 15 -15 -34 31 22 -1 -80 23 39 -22 -16 -11 -82 14 -4 17 3 -14 27 -4 -12 -36 6 -1 22 -4
5837 -4 -16 42 -76 -67 -16 -39 -2 -35 49 -3 -40 38 31 -26 -7 57 -8 -14 73 7 30 -9 12 -59 -10 -28 5 -23 -50 8 -34 -8
5869 -8 -6 -59 -48 -47 8 2 26 14 13 -7 -47 -26 -31 -26 54 -31 16 -6 43 47 20 -16 15 15 40 -29 -20 -40 22 -19 -3 60 -16 33 34 32
5905 32 2 12 -3 -6 -26 -11 -60 -13 28 23 -23 -45 -19 -2 -14 -56 22 -40 7 -14 6 13 -1 32 -27 20 49 14 3 49 -37 37
5937 37 42 53 -47 -30 22 -11 3 19 0 -18 22 37 -11 -25 -35 20 -6 36 -4 -9 -51 28 47 -2 12 -27 -8 16 -58 26 74
5968 74 -65 -40 50 46 33 23 -17 22 -20 -7 -46 23 -15 18 16 3 -7 2 -14 25 -14 13 6 -31 -17 50 33 -6 -52 15 -16 -20
6000 -20 -2 65 18 24 33 25 -22 -22 -13 13 -44 10 -64 4 27 -20 -13 15 12 14 1 30 8 37 -37 -7 7 11 -11 -13 -10 -7 30 35 4 -5 -51
$$ packed form
5772a7L2l4P0n9K2q5L0N8J8j4j4k6L4n4M2K2jkm3j7N9j2K1k8pol0N8jj3o3J31
5804G1m9j0qm8O3k0K1nl0j9O5rk3p9J03J6o1ONp1R6j8K1j4j7M1l1qk4M2pK3k6
5837dj2N8j18RN1k3L7l3Q4n2l7P8pn7J9O4o5oQ7o6K3l9K1p1M9j8L3k8k7N8m2K6
5869hKn3J1JN5oK4j2jk0m0K1nNQ0q5M7k2M9Mk7l6L1%K5o9Rk0O2m1J6O3p6M9Jk
5905C2l0J0j5lk0J5m9M7M1nm6k2K6J7j2m2P8o2M7k1K0Pj4L3n9M7K9l5j1M6q6P4
5937C7NJ1j00J7N2l3J4J6j9j8M0J5m8j4j0N5k6M2m0nm2P9J9m9J4l9J9K4p4Q4M8
5968G4j39K5R0mj3j0m0L9m2J3l9O9l8L3kj3j0Rj6L9l9K7pl7J4O7j7l9m6O7l1m
6000b0J8O7m7ORqm7%RK6n7N4p4O8K3m7PK8lKj3K9k2K9p4L0J4Mk2kLLL7Nl1rm6
$$ plain form
6037 -51 -13 15 32 17 -10 23 -14 17 31 -29 -17 -15 -20 5 5 -9 -5 -4 -6 4 55 34 -20 -30 36 3 12 17 23 7 9 -9 -64 -3 -9 -11
6073 -11 -15 0 7 11 2 6 13 -27 -20 -19 -16 36 27 -11 -25 24 19 -26 27 -29 -6 20 18 -11 -12 -48 -31 -31 -54 -11 2 -40 34 6 -14 52 19
6110 19 -2 34 23 9 -30 3 15 -28 -20 0 14 -104 -43 -44 -45 -3 -14 11 2 -39 4 -31 6 26 27 18 -8 -21 -1 -5 -5 -32 -4 -7
6144 -7 -15 -36 -4 -25 -5 1 46 65 -47 20 10 6 40 -45 -51 -52 -35 -57 -26 47 -68 35 -29 34 22 6 -51 -2 41 1 -2 44
6176 44 1 29 7 -79 62 8 -13 -17 -19 -3 3 -33 11 44 -9 38 9 -5 18 -33 3 -24 -3 -26 -18 7 -39 10 -21 0 5 -14
6208 -14 31 -66 65 -13 -69 1 -23 17 -25 -9 -38 -68 -29 40 -18 -55 -21 9 51 -20 -12 24 -11 -16 -32 -40 61 -34 21 -2 16
6239 16 -6 -8 -11 -47 8 -7 19 -33 23 13 -6 38 -61 -29 -58 -47 4 -15 -31 -51 -3 -23 -47 -11 8 7 -20 -26 46 -18 39 -12
6271 -12 11 -3 -33 -13 35 -24 33 2 -2 -8 -31 16 3 38 -40 -52 -32 -1 19 -5 -47 -20 40 -18 -55 17 3 -24 -17 29 -58 43
$$ packed form
6037e1L8K8J7j5k7L3l7L1J4o0J2KnK5%j4MJkJ0N1k1n4j0O6l3RNOj6Kj8n5O1ok
6073a1mJ5PMrMPm0PJLN2rl8j4M9nm5N3n6K3K6kk9jl6J7%k3M3J3m2P4k8k0O6l3
6110A9k1L6j1j4l9L3J2m3QK0J4j18O1jjM2j1K5rm1M3l5L7K0Jrk6j3K0m%k7K8l
6144gqk1L2k1K0OM5J9j12O7j0mL4q5ojJ7k2L1P3j15J03o4O3j2j6n7M9M3m0lM6
6176D4m3K8k2q6J41n4k1mkJ6Ol6M4L3n3M7k9j4K3n1L6k7K1k3QK5m6M9l1K1Nj9
6208a4M5r7J31p8n6P0k4M0m2J6k9l0L9O9n8l7L4L0M2p1QL6l5nj6qJ01r5N5k3J8
6239A6k2kll6N5j5K6n2N6j0j9M4r9L2k9J1N1j9j6k0M8k0k4L6J9jk7oP2o4N7n1
6271a2K3j4l0K0M8n9N7l1mok3M7j3L5p8j2K0L1K0k4m2K7O0n8l7P2j4k7PM6q7J01
$$ plain form
6303 43 2 -5 -10 23 -27 -52 39 8 -11 17 45 54 6 -11 -36 -73 -16 -27 -29 -28 16 0 0 -46 -33 10 -26 -69 5 15 17 24 24 7 -21
6338 -21 -66 24 -9 8 -10 -34 20 25 -23 -21 7 -5 -37 12 -6 -24 9 17 71 -31 -22 58 28 13 -5 17 -10 -2 -5 -34 32 3 -5
6371 -5 35 38 34 -30 -20 -4 -32 -34 -33 -46 1 -11 -42 -20 -48 -37 23 -59 0 5 -3 8 -56 3 27 58 -8 42 0 39 -50 17 -23 31
6405 31 53 -17 27 38 47 1 -1 29 -3 34 -6 -6 -2 -69 3 -7 -49 -27 -16 4 -44 6 -47 5 25 17 -4 -27 6 12 48 17 29
6438 29 32 -59 -15 -3 -18 37 -25 -35 -21 -33 44 -53 -34 4 44 23 -27 9 12 0 14 18 45 -16 -31 45 -64 14 -10 -47 17
6469 17 -7 19 -20 -3 -23 14 -49 1 -16 2 15 -1 49 30 6 10 41 -8 -102 28 -2 -13 25 -25 -44 -1 -17 -97 18 -72
6499 -72 1 -26 12 53 -59 -2 -50 -18 14 -17 0 17 -48 -30 -21 21 -21 24 -10 44 19 -19 -10 -49 -5 -39 -15 6 8 10 -11 -11
6531 -11 35 -17 -31 16 25 -33 -31 -1 1 6 23 3 31 -49 -59 -15 -9 -46 0 -26 13 5 -42 -24 40 2 -28 -22 27 -34 13 27 46 102
$$ packed form
6303D3m1pnL3n0k5R1l1j9K8K8Rm8j7k5l7N7j1kJM4j6%m6J3M3l6m3P4J0KP%j7k8
6338b1m5R0l3J7j8k4N4Nm8KK8j2l2M9j8j8L3QN4j02RQ0l0j5j8K2k7Qlk9O6k9q
6371eM0Lmo4J0J6k8kJj3M7j2l1K2k8J1O0q2N9NqJ1o4N9K4L1o6N0m2L9q9O7m0N4
6405C1K2p0M4J1Rm6kL0l2L7m0%Mo7P2j0m2K2J1K0m8N0n3N2K0qk1k3L3OL6l1J2
6438B9Lr1M4J2j5N5o2j0J4j2P7r7J9L8M0k1n0L6Lj2J4MK7o1j5P6j09P8k4l7O4
6469A7k4K6l9J7k0L7o3N0j7J8J3j6N0j9k4ML1m9r4J30l0j1L8n0j9M3j6q0J15r0
6499g2P3k7L8M1j12N7m8L2L2l1J7J7o5J8RM2m2M5l4N4k5l8Rl9M4l4K4K1KKk1%
6531a1M6n2j4M7Rn8KL0KNJ7k0K8q0j0M4Ol7M6k6L9qm7J8O4l8l0OM9o1M7J4J9N6
$$ plain form
6565 102 10 37 56 22 -2 52 14 -1 14 47 -49 24 7 -13 -6 -53 9 -46 -9 -45 10 5 12 -3 -23 47 31 19 -30 5 -36
6596 -36 19 1 -18 31 4 2 -5 -8 62 22 -3 -29 -37 23 1 2 62 5 -1 48 0 14 -11 29 -45 2 13 57 -43 -75 -36 37 -10
6629 -10 -7 -56 15 2 -39 -41 13 -37 -15 25 -65 13 24 1 5 5 55 47 -39 -27 33 0 -9 -36 20 9 4 -1 5 37 7 5 73 20 12 -30
6665 -30 -17 -51 18 15 -4 -10 37 7 -14 -28 -6 22 22 11 31 6 43 55 -31 -30 -11 39 -5 -13 -41 -27 -19 13 -51 -46 30 -38 10 47
6699 47 -28 -22 -13 67 -48 -27 -24 13 2 7 10 -4 26 -53 -29 -65 -4 3 -32 -1 0 -22 2 -20 -17 5 3 40 -6 -33 8 21 -42 -30
6733 -30 -25 74 -59 48 -28 11 50 11 17 -2 -51 2 22 -34 42 8 -11 -26 -31 -23 -17 82 5 -17 8 -38 27 6 6 -39 16 0
6765 0 16 -13 13 -15 -5 -29 22 8 13 42 -2 -10 -30 65 -6 15 -3 57 -59 32 6 -13 -1 45 -43 -39 -39 -41 -45 -52 28 -6 -3 0 -6
6800 -6 -21 -11 -39 20 24 -38 -27 41 23 52 -11 12 27 -23 2 -15 6 -33 14 15 18 29 -47 -10 6 9 -53 15 21 -3 -39 50 -17
$$ packed form
6565A02r2K7J9l4k4N4l8j5J5L3r6P3j7k0Pm7O2n5L7l6N5nPj5k0P0j6j2m9L5m1
6596c6N5j8j9M9k7kplP0m0k5k6qO0k2JO0n7oM9m8J4k5M0p4M7J1M4j00l2L9P3m7
6629a0Lm9P1j3m1kN4n0K2M0r0P8J1k3M%N0qq6J2O0l3rk7N6j1nnOL2l0kO8n3qm2
6665c0J3l4O9lj9oM7l0k1j4K2K8%j1K0k5L7J2q6JJ9N0m4qk8J4QL2o4NP6o8M8L7
6699D7p5ORQ0j15K1LL7j1NLj4L0p9K4l6O1Pl5L1Jk2K4k2LK2kL7m6k7M1J3o3J2
6733c0NR9j33J07p6L9L9l9Oj9m9N3K0n6P6l4j9j5nQOR9p7k2K5m6O5k1%m5N5j6
6765@J6k9K6k8J0k4N1j4NK9m4qk0R5p1K1j8O0j16R1k6j9J2M6q8M%kmpQ0l4LLo
6800fj5J0k8N9Mo2J1O8j8K9o3K3J5n0K5j7K1l9M7JLJ1p6L7J6Lo2O8Ok4l6Q9o7
$$ plain form
6833 -17 -39 -4 -47 -30 12 -19 -40 -1 -72 -21 -52 -13 -57 19 -21 1 -30 -20 1 -2 24 36 25 0 15 14 28 21 14 25 12 -3
6865 -3 -28 -10 -16 25 18 -14 -13 -49 -17 40 5 -54 16 -39 17 23 -50 34 14 -31 -29 -45 14 -37 -21 -12 -2 51 29 32 25 16 49 16 41
6900 41 26 37 21 58 -5 -37 -35 -35 31 57 49 -15 33 -2 21 -31 -51 -34 -11 55 30 29 -30 -14 -25 17 42 12 -28 23 -13 18
6932 18 -34 17 37 -18 18 16 3 34 -28 54 -6 28 -32 -7 -31 -9 -79 5 36 -17 -41 20 9 -34 37 5 -9 -46 1 -15 9
6963 9 18 14 45 -5 21 33 -13 6 3 19 -61 44 12 12 24 43 -9 28 26 -12 26 18 13 -12 -62 -9 31 -5 -4 3 -40 -48 33 9 -65
6998 -65 -60 -44 35 -15 -1 10 -56 -32 -38 -22 -31 -69 -12 -41 -67 -1 -31 -28 -4 32 33 7 19 62 52 -25 21 17 -28 7 4 45 105 57
7032 57 -5 2 -27 33 -17 -16 -5 19 -9 -13 -51 57 -44 11 -13 -57 30 19 15 -8 -18 -56 -3 48 10 41 59 36 44 15 -5 25
7064 25 15 -21 15 -18 -14 49 33 -5 0 -7 -8 9 49 26 -29 -27 3 -14 -27 -30 68 -15 25 -44 -43 -47 31 30 -12 -43 13 -26 2 29 1
$$ packed form
6833a7k2L5m3J7M2l1k1L9p1N1l1L9m4P6m0K2l1J0K1lK6J2j1k5J5jJ4ppJ1j3j5
6865ck5J8oM1pl2Jl6L2N7l5n9P0n5N6Op3Q4k0m5Kj6N9n1J6RJ0N3k2LprL3l3K5
6900D1j5J1j6L7o3l2K%O6K6qo4M8l5K3n2k0J7K3O6k5jn9J6j1M2K5l0m0N1l6L1
6932A8n2N1K0n5L6kj3L1o2Q2o0L4o0K5k4K2p0Q4L1n3k4O1j1m3P1l2j4l7M7j6K4
6963IRmL1n0K6J2m6J9lJ6q0J05l2%J2J9n2L7kl8L8qnk5n0N3M0l6JPm3qQ1k4p4
6998f5NJ6P9n0J4J1o6K4oJ6rl8N7k9k6O6l0LK4L6Jk6J2M3j0p7M6mm5L5lM1O0m8
7032E7o2Pk9O0n0JJ1K4k8ml8J08j01N5k4m4Q7j1mk3j0l8N3N1l8L1J8k3Qk9k0L0
7064B5j0l6L6l3MO3j6l8NpjJ7M0k3n5KL0j7j3lR8q3M0o9JmP8jm2l1N6l9K8K7k8
$$ plain form
7099 1 11 -3 4 -40 -64 15 9 32 -2 14 25 0 24 -18 -72 13 64 13 -3 0 -5 -13 48 -30 16 -27 -50 3 6 7 62 54 -9 16 -12
7134 -12 1 -72 14 -33 -7 76 -33 -21 -73 -25 -8 -39 -18 4 -13 31 34 -6 -37 -58 -55 -24 -73 10 -3 8 -18 25 -21 1 10
7165 10 24 22 -9 18 -30 17 -18 39 -4 -15 -12 14 10 -51 -18 -54 11 3 7 -6 4 31 -20 -11 28 15 -8 36 16 12 -8 24 35 -19
7199 -19 -6 30 -64 7 -30 21 33 -47 28 4 -10 8 -5 0 1 36 -44 7 28 -65 -21 2 3 38 2 0 22 10 11 18 89 -11 2
7232 2 27 13 19 -19 11 -11 24 9 43 -1 71 42 3 22 -23 -12 -4 -3 14 75 23 -18 -32 -15 -23 42 8 36 4 -19 -8 -28 -16
7265 -16 -34 -15 9 -19 -2 19 -25 8 39 30 26 -27 27 21 13 -15 14 9 -18 -34 42 5 80 9 -25 -29 47 8 -24 -18 -17 30 14 -51
7299 -51 26 -2 -33 34 -25 4 23 -19 -15 1 -21 43 -31 42 -6 35 -33 -20 -20 53 -6 32 35 -35 73 -14 -29 41 -1 19 -21
7330 -21 29 -26 -49 -13 -8 -33 -34 -5 33 -41 -47 -27 -60 31 -29 8 25 -9 66 17 1 -18 13 -50 -56 -3 -51 14 75 8 25 42
$$ packed form
7099AJ0j4Pm4k4P9oK3l4J6J1k5K4m2n4Q5N1n1j6LnqO1p8M6m3k3N3LJN5qo3K5k8
7134a2J3p3Q6m7K6Q3j09J2n2M8J7l1K1K2j7M4Lm0l1k1LL1m9Q3j3J1k6M3m6K2R
7165A0J4kl1K7m8M7l5N7m3j1LK6mo1L3l6O5qMj3J0K7n1RL9j3k3M4k0mk0L2J1n4
7199a9J3L6r4P1l7N1J2q0P5k4j4J8j3NJL5q0N1K1r3M4K3JL5l6kK2j2JPP1j00J3
7232BK5j4Ol8L0k2L5j5L4m4P2k9l9J9m5J1QJJ7O1n2m1j4J7qO5l4K8l2k3J1k0J2
7265a6j8J9K4k8J7K1m4L3L1rmn3N4oqk8K9nk7j6P6l7P5p1l4mP6l9l2OJM7j6o5
7299e1P7k8l1O7n9K9J9m2MJ6k2O4p4P3m8M1o8J3%P3n9L8Lp0J08q7j5P0m2K0m0
7330b1N0n5k3L6Nk5jK9L8p4oK0l3R1o0L7J7l4P5m9j6j9L1o3oN3m8O5O1o7J7J7
$$ plain form
7362 42 -23 -45 7 37 -5 -48 -30 -3 -23 10 -3 11 -3 -23 31 -29 -14 -10 -25 -33 -17 -5 14 23 -50 -32 -9 26 40 36 -50 50
7394 50 28 -8 -34 -46 -4 10 -6 62 -23 1 29 10 -68 -16 45 -2 71 28 57 5 -8 -41 44 21 -1 -22 11 -27 8 -39
7424 -39 -16 -44 -16 -2 -47 -36 20 -8 34 -17 -21 15 43 25 40 21 60 54 -30 -49 27 12 30 19 13 -33 14 43 -28 -7 24 -12
7456 -12 -33 2 -32 26 -17 28 -15 13 -22 1 26 22 11 -55 5 -37 2 -67 62 11 -18 -19 -45 -16 -32 6 69 7 39 -71
7486 -71 43 -4 19 -13 -27 -11 2 5 23 -12 -5 -6 -27 2 -32 28 -10 7 -42 83 34 -48 3 -12 13 30 -38 -20 37 -1 -3
7517 -3 -51 23 33 -25 38 -10 11 -35 16 9 -15 57 68 16 38 -39 32 1 20 -39 25 18 -26 -12 32 12 33 40 45 -61 -14 -52
7549 -52 -10 -53 -36 -50 -54 -45 -43 13 -12 23 8 -20 24 -53 39 22 22 -11 -30 50 -8 14 61 55 12 30 -41 32 0 52 -2 -2 -29
7582 -29 47 -44 -5 -9 -31 -40 5 0 5 -7 -30 57 -17 -46 -35 -27 -21 -30 16 -3 34 26 -21 -30 12 13 45 44 46 -14 12 44 -21 20 13 38 -37
$$ packed form
7362D2o5k2N2L0m2m3J8K7k0L3j3J4j4k0N4o0J5Mj5qJ6J2J9Rp3J8K3L5J4mq6J00
7394E0k2l6k6j2M2J4j6O8q5K4K8j9p8N2O1m7P3m3K9n2j3l3Q5k3k2k1L3l8L5m7
7424c9K3k8K8J4m5J1N6k8M2n1mL6K8j8J5j9L9oq4j9P6j5J8j1om6M7K9p1K1L1l6
7456a2k1L5l4N8m3M5m3K8l5K3K5mj1o6O0m2L9o9J29n1k9jk6K9j6L8O3o2L2j10
7486g1J14m7K3l2j4J6J3LJ8l5Pjk1K9l4O0l8J7m9J25m9q2N1j5K5J7o8J8N7l8k
7517cm8P4J0n8O3m8K1m6N1pk4P2J1n2K2p7P1l1J9n9O4pm4J4M4k0K1PNj06M7l8
7549e2M2m3J7j4mRKN6k5L5j5k8M4p7R2j7%l3j9Q0n8K2M7om3J8p1P3l2N2n4%k7
7582b9P6r1L9mk2rM5nNj2k3Q7p4k9J1QOrM6j9L7qm7rM2JL2jKo0K6L2o5M1pK5p5
$$ plain form
7619 -37 -21 -39 2 4 -8 3 41 23 22 2 12 -13 -7 -21 -73 -18 19 2 -27 -3 -42 -9 -29 -6 6 11 48 -9 25 -23 9 -18
7651 -18 36 -4 -25 20 35 9 -21 -39 -28 13 18 39 -42 -38 -55 -26 -49 -8 22 -27 18 8 -60 10 0 -37 -30 27 -50 -21 45 17
7683 17 0 22 51 31 21 2 -17 -25 -65 -24 -10 67 -11 -27 13 16 32 21 23 -4 -8 -6 9 6 -19 -9 -16 6 -5 -17 -42 -23 27 -30
7717 -30 -38 12 7 17 18 -21 -24 39 -36 -3 -44 39 -46 -18 -41 33 6 -30 0 -7 -42 42 -18 -5 87 1 -3 3 -29 64 45 -3 -18 -4
7751 -4 -3 -29 -86 -20 -5 -23 -1 20 -10 9 -31 -12 7 6 -85 34 -11 -5 -13 30 30 0 27 24 44 -14 30 57 1 -14 16 -42 -11
7784 -11 -9 30 -4 -7 -1 -1 66 48 -8 14 21 19 41 -9 10 -42 -2 -17 -76 -20 -8 28 -14 -40 10 33 -34 -53 0 -15 -8 21 15 66
7818 66 22 33 50 38 45 2 19 -19 35 27 42 -42 -20 10 23 1 11 -3 -5 27 -7 36 17 -6 3 22 -30 1 40 37 -27 -45 41
7851 41 -23 25 10 -30 -20 -49 39 -6 16 -34 -61 -11 36 52 -32 -34 -24 -24 12 4 5 -18 18 44 62 -15 -3 -18 -76 -4 6 -4
$$ packed form
7619c7J6j8M1Kj2J1L8j8jk0J0k5Oj4n2N5L7j7k9K4l9L3k0K3J2NL7n7L4m8L2k7
7651a8N4m0k1M5J5k6l0j8J1M1NK1q1Mj7K9k3M1L0m9M5j0o8P0j0l7PN7p7K9O6k8
7683A7j7K2K9k0j0j9j9qm0M1J4P7p8j6M0LJ6j1Kk7mKJ5lk5J0pK2j1j2k5J9N0n7
7717c0qN0nJ0Jl9lO3p5L3m1Q3q5K8k3P4k7l6L0pl5Q4o0J3R2q6mOl2R3j9m8j5J4
7751dJk6n7O6J5j8K2K1l0J9m0J9J9jr1J19m5OqM3%l0K7lK0n8M4K7n6j5L0n8L1
7784a1KL9l4lO%O7j8n6K2PkK2n0J9n2M0j5n9N6J2L6m2k6N0K3o7j9N3j5PK9oN1
7818F6m4J1J7j2Pm3J7l8N4qJ5q4K2L0J3k2J0j4kL2l4M3j9k3RJ9n2L1L9lo4j8Q6
7851D1o4M8j5m0J0k9Q8m5K2n0k7N0M7J6q4kJ0%L6qJk3L6K6J8p7J2j5n8P2J0j0
$$ plain form
7883 -4 -47 16 18 -49 7 5 27 29 -63 -2 61 -27 -32 56 9 1 3 -19 -6 -24 51 70 18 5 55 33 -5 43 5 39 36 33 19 -54 -61
7918 -61 13 -23 9 50 14 43 -7 -21 -13 -23 -22 9 28 -3 -17 40 -27 -24 -49 35 -8 -28 29 -39 30 35 29 26 -6 0 82 6 5 42
7952 42 -26 13 -5 6 -10 27 -5 2 37 -12 14 -43 7 11 14 0 33 24 7 2 -15 11 -20 -10 32 11 -25 2 -59 46 44 36 3
7985 3 -33 -20 76 80 -23 32 6 49 -2 -35 -39 -23 7 26 -2 -1 2 -19 -7 8 2 15 -24 -13 22 36 -33 -7 -9 41 1 -4 -23 76
8019 76 -14 8 10 -24 -5 -1 62 -21 13 -10 -32 -35 25 21 19 21 3 16 19 18 -41 -36 34 -34 16 48 -36 24 6 40 -31 -14 -39 -37 -2
8054 -2 17 -38 -11 14 -11 32 -38 -24 -35 -22 -21 69 -13 40 42 -11 -41 50 28 36 18 -28 48 38 -7 2 -7 35 39 6 -47 18 -26 -69
$$ packed form
7883dm3O3Ko7N6kK2Kr2O1O3q8nQ8m7qKk2J3j8P5J9n2j3N0k2l8M8l8L4llj4p3p
7918f1P4l6L2M1l6K9n0j4Qj0JL1J9l1j4N7o7Lk5Q4m3k0N7o8O9Noll2OQ2p6jL7
7952D2o8L9j8J1j6L7l2PL5m9K6n7N0MLj4L3rj7nj7K6l1J0M2k1l6K7o1J05kql3
7985Cl6J3R6Mj03N5k6M3n1l3mJ6L0J9k8JLk1J2J5oJ3l9J1L5J4o9K6kN0m0nj9R9
8019G6r0K2Kl4J9MO3q3L4k3k2lO0mkKj8J3Ljn9NP0o8N0L2q4O0j8L4p1J7k5KL5
8054bJ9n5K7K5k5M3p0J4j1J3JR0q2N3Kn3l0R1k2Qj8m6P6j0m5RrM2Ml3n3O5m4m3
$$ [...]
8191A4
##END NTUPLES=NMR FID
##END=
