##TITLE=1H_DE-80H_X3
 200.13MHz, d2o
 8 sc
 
 19ns.26.2.2025
##JCAMPDX= 6.0         $$ Bruker NMR JCAMP-DX V2.0
##DATA TYPE= NMR FID
##DATA CLASS= NTUPLES
##ORIGIN= UXNMR, Bruker Analytische Messtechnik GmbH
##OWNER= pz
$$ XWIN-NMR		Version 3.5
$$ Mon Jun 23 12:17:12 2025 Russian Standard Time (UT+4h)  Yarkov@DPX200
##.OBSERVE FREQUENCY= 200.1313
##.OBSERVE NUCLEUS= ^1H
##.DELAY= (6, 6)
##.ACQUISITION MODE= SIMULTANEOUS
##.ACQUISITION SCHEME= undefined
##.AVERAGES= 8
##.DIGITISER RES= 18
##SPECTROMETER/DATA SYSTEM= spect
##.PULSE SEQUENCE= zg30
##.SOLVENT NAME= CDCl3
##.SHIFT REFERENCE= (INTERNAL, CDCl3, 0, 14.3821)
##AUDIT TRAIL= $$ (NUMBER, WHEN, WHO, WHERE, WHAT)
$$ ##TITLE= Audit trail, XWIN-NMR		Version 3.5
$$ ##JCAMPDX= 5.01
$$ ##ORIGIN= Bruker BioSpin GmbH
$$ ##OWNER= Yarkov
$$ C:/Bruker/XWIN-NMR/data/yarkov2/nmr/H-C/1/audita.txt
$$ ##AUDIT TRAIL=  $$ (NUMBER, WHEN, WHO, WHERE, WHAT)
(   1,<2025-06-23 12:16:11.51 +0400>,<Yarkov>,<DPX200>,
      <created by zg, POWCHK disabled, PULCHK disabled
       configuration hash MD5:
       00 E9 B6 7A A2 85 ED C7 34 08 36 98 17 FE 4E 26
       data hash MD5: 16K
       78 B4 75 9A 6C 01 41 A1 AD 9D C4 86 E3 C2 40 1A>)
$$ ##END=
$$ 
$$ hash MD5
$$ 12 E2 25 AA 39 B1 DC 37 C4 FE E6 0A 97 43 9F E8
##$RELAX= 
##$RELAX= 
##$RELAX= 
##$RELAX= 
##$RELAX= 
##$RELAX= 
$$ Bruker specific parameters
$$ --------------------------
##$DU= <C:/Bruker/XWIN-NMR>
##$EXPNO= 1
##$NAME= <H-C>
##$PROCNO= 1
##$TYPE= <nmr>
##$USER= <yarkov2>
##$AMP= (0..31)
100 100 100 100 100 100 100 100 100 100 100 100 100 100 100 100 100 100 
100 100 100 100 100 100 100 100 100 100 100 100 100 100 
##$AQSEQ= 0
##$AQ_mod= 1
##$AUNM= <au_zg>
##$AUTOPOS= <>
##$BF1= 200.13
##$BF2= 200.13
##$BF3= 200.13
##$BF4= 200.13
##$BF5= 200.13
##$BF6= 200.13
##$BF7= 200.13
##$BF8= 200.13
##$BYTORDA= 1
##$CFDGTYP= 0
##$CFRGTYP= 5
##$CHEMSTR= <none>
##$CNST= (0..31)
1 1 145 1 1 1 1 1 1 1 1 1 1 1 1 1 1 1 1 1 1 1 1 1 1 1 1 1 1 1 1 1 
##$CPDPRG= <>
##$CPDPRG1= <>
##$CPDPRG2= <>
##$CPDPRG3= <>
##$CPDPRG4= <mlev>
##$CPDPRG5= <mlev>
##$CPDPRG6= <mlev>
##$CPDPRG7= <mlev>
##$CPDPRG8= <mlev>
##$CPDPRGB= <>
##$CPDPRGT= <>
##$D= (0..31)
0 0.7 0 0 0 0 0 0 0 0 0 0.03 0 0 0 0 0 0 0 0 0 0 0 0 0 0 0 0 0 0 0 0 
##$DATE= 1750666571
##$DBL= (0..7)
120 120 120 120 120 120 120 120 
##$DBP= (0..7)
150 150 150 150 150 150 150 150 
##$DBP07= 0
##$DBPNAM0= <>
##$DBPNAM1= <>
##$DBPNAM2= <>
##$DBPNAM3= <>
##$DBPNAM4= <>
##$DBPNAM5= <>
##$DBPNAM6= <>
##$DBPNAM7= <>
##$DBPOAL= (0..7)
0.5 0.5 0.5 0.5 0.5 0.5 0.5 0.5 
##$DBPOFFS= (0..7)
0 0 0 0 0 0 0 0 
##$DE= 6
##$DECBNUC= <off>
##$DECIM= 32
##$DECNUC= <off>
##$DECSTAT= 4
##$DIGMOD= 1
##$DIGTYP= 9
##$DL= (0..7)
0 120 120 120 120 120 120 120 
##$DP= (0..7)
150 150 150 150 150 150 150 150 
##$DP07= 0
##$DPNAME0= <>
##$DPNAME1= <>
##$DPNAME2= <>
##$DPNAME3= <>
##$DPNAME4= <>
##$DPNAME5= <>
##$DPNAME6= <>
##$DPNAME7= <>
##$DPOAL= (0..7)
0.5 0.5 0.5 0.5 0.5 0.5 0.5 0.5 
##$DPOFFS= (0..7)
0 0 0 0 0 0 0 0 
##$DQDMODE= 0
##$DR= 18
##$DS= 0
$$ [...]
##$SUBNAM2= <"">
##$SUBNAM3= <"">
##$SUBNAM4= <"">
##$SUBNAM5= <"">
##$SUBNAM6= <"">
##$SUBNAM7= <"">
##$SUBNAM8= <"">
##$SUBNAM9= <"">
##$SW= 18.0517328524113
##$SWIBOX= (0..15)
0 0 2 0 0 0 0 0 0 0 0 0 0 0 0 0 
##$SW_h= 3612.71676300578
##$TD= 16384
##$TD0= 1
##$TE= 0
##$TE2= 300
##$TE3= 300
##$TEG= 300
##$TL= (0..7)
0 120 120 120 120 120 120 120 
##$TP= (0..7)
150 150 150 150 150 150 150 150 
##$TP07= 0
##$TPNAME0= <>
##$TPNAME1= <>
##$TPNAME2= <>
##$TPNAME3= <>
##$TPNAME4= <>
##$TPNAME5= <>
##$TPNAME6= <>
##$TPNAME7= <>
##$TPOAL= (0..7)
0.5 0.5 0.5 0.5 0.5 0.5 0.5 0.5 
##$TPOFFS= (0..7)
0 0 0 0 0 0 0 0 
##$TUNHIN= 0
##$TUNHOUT= 0
##$TUNXOUT= 0
##$USERA1= <user>
##$USERA2= <user>
##$USERA3= <user>
##$USERA4= <user>
##$USERA5= <user>
##$V9= 5
##$VALIST= <valist>
##$VCLIST= <CCCCCCCCCCCCCCC>
##$VD= 0
##$VDLIST= <DDDDDDDDDDDDDDD>
##$VPLIST= <PPPPPPPPPPPPPPP>
##$VTLIST= <TTTTTTTTTTTTTTT>
##$WBST= 1024
##$WBSW= 4
##$XGAIN= (0..3)
0 0 0 0 
##$XL= 0
##$YL= 0
##$YMAX_a= 18557
##$YMIN_a= -19963
##$ZGOPTNS= <>
##$ZL1= 120
##$ZL2= 120
##$ZL3= 120
##$ZL4= 120
##$ABSF1= 10
##$ABSF2= 0
##$ABSG= 5
##$ABSL= 3
##$ALPHA= 0
##$AQORDER= 0
##$ASSFAC= 0
##$ASSFACI= 0
##$ASSFACX= 0
##$ASSWID= 0
##$AUNMP= <proc_1d>
##$AZFE= 0.1
##$AZFW= 0.1
##$BCFW= 1
##$BC_mod= 2
##$BYTORDP= 1
##$COROFFS= 0
##$CY= 83.5205535888672
##$DATMOD= 1
##$DC= 2
##$DFILT= <>
##$DTYPP= 0
##$F1P= 10.8118882576601
##$F2P= -7.23987719738617
##$FCOR= 0.5
##$FTSIZE= 0
##$FT_mod= 4
##$GAMMA= 1
##$GB= 0.15
##$INTBC= 1
##$INTSCL= 1
##$ISEN= 128
##$LB= 0.25
##$LEV0= 0
##$LPBIN= 0
##$MAXI= 10000
##$MC2= 0
##$MEAN= 0
##$ME_mod= 0
##$MI= 1.114404
##$NCOEF= 0
##$NC_proc= 0
##$NLEV= 6
##$NOISF1= 3.799351
##$NOISF2= 2.8
##$NSP= 1
##$NTH_PI= 0
##$NZP= 0
##$OFFSET= 14.38212
##$PC= 1
##$PHC0= -1713.766
##$PHC1= 10.1666
##$PH_mod= 1
##$PKNL= yes
##$PPARMOD= 0
##$PSCAL= 0
##$PSIGN= 0
##$REVERSE= no
##$SF= 200.129724274929
##$SI= 16384
##$SIGF1= 3
##$SIGF2= 2
##$SINO= 400
##$SIOLD= 16384
##$SREGLST= <1H.CDCl3>
##$SSB= 0
##$STSI= 0
##$STSR= 0
##$SW_p= 3205.1282051282
##$SYMM= 0
##$S_DEV= 0
##$TDeff= 0
##$TDoff= 0
##$TI= <>
##$TILT= no
##$TM1= 0
##$TM2= 0
##$TOPLEV= 0
##$USERP1= <user>
##$USERP2= <user>
##$USERP3= <user>
##$USERP4= <user>
##$USERP5= <user>
##$WDW= 1
##$XDIM= 8192
##$YMAX_p= 0
##$YMIN_p= 0
$$ End of Bruker specific parameters
$$ ---------------------------------
##NTUPLES= NMR FID
##VAR_NAME=  TIME,          FID/REAL,        FID/IMAG
##SYMBOL=    X,             R,               I
##VAR_TYPE=  INDEPENDENT,   DEPENDENT,       DEPENDENT
##VAR_FORM=  AFFN,          ASDF,            ASDF
##VAR_DIM=   8192,          8192,            8192
##UNITS=     SECONDS,       ARBITRARY UNITS, ARBITRARY UNITS
##FACTOR=    0.0002768,     1,               1
##FIRST=     0,             0,               0
##LAST=      2.2672688,     0,               0
##MIN=       0,             -19963,          0
##MAX=       2.2672688,     18557,           0
$$ Real data points
##PAGE= N=1
##DATA TABLE= (X++(R..R)), XYDATA
0 0 0 0 0 0 0 0 0 0 0 0 0 0 0 0 0 0 0 0 0 0 0 0 0 0 0 0 0 0 0 0 0 0 0 0 0 0 0 -1 2 -4 5 -6 8 -8 8 -8 8 -9 10 -12 12 -14 15
53 15 -18 19 -20 22 -24 25 -29 30 -33 34 -35 32 -24 2 61 -280 1928 10231 -12852 -8976 -4849 -17192 984
76 984 -5108 -10597 12807 1370 -1819 15542 2169 7964 11506 -10830 1676 4077 -12150 1014
90 1014 -7451 -13861 5974 -6391 -5433 13441 -1345 1251 7106 -5761 8004 2976 -15206 2385
104 2385 -1897 -10564 3945 -5906 -3594 7028 -8942 2924 12317 -6620 3018 3524 -7888 7113
118 7113 120 -5950 8651 -4038 -2162 10183 -5738 880 5557 -10590 2280 3391 -7081
131 -7081 5536 -3684 -6279 11021 -2612 -1885 11279 -4048 -988 3278 -7108 4825 -1827 -13231
145 -13231 5961 903 -6017 7369 -955 1585 8412 -5226 6257 10131 -8224 1378 1110 -7800
159 -7800 4416 -3653 -7164 5955 -4669 -1397 7616 -5755 2953 6199 -7674 4867 5243 -4111
173 -4111 4576 -4475 -3417 10512 -5045 -3842 8389 -3818 -148 1989 -5264 7117 -841 -10408
187 -10408 7080 1001 -5354 3747 -5547 -837 5298 -7546 2828 5700 -7090 3892 1639 -4752
201 -4752 7942 -800 -4442 5938 -3562 486 4899 -8426 1614 4485 -7528 3015 2020 -3873
215 -3873 4445 -4825 -2764 9108 -4758 -2744 6061 -3797 1788 2147 -5097 6098 -316 -6658 6886
230 6886 -593 -3736 4427 -4776 140 5224 -5483 3306 3597 -6291 4363 548 -4811 5651 -2941
245 -2941 -4057 4879 -4462 -40 3421 -7182 2694 3191 -6346 4144 1080 -4166 4007 -3805 -1202
260 -1202 7158 -5534 -1093 5761 -3981 2010 1292 -4594 5482 -1332 -5900 5584 -2043 -3591 2763
275 2763 -5527 772 4215 -6149 2053 2713 -4275 4181 -952 -3213 6768 -2592 -3037 5411 -2321
290 -2321 1287 2539 -5439 4670 3045 -5851 3606 242 -3266 3315 -4590 -1292 5667 -5203 -572
305 -572 4095 -3420 3600 1271 -4122 6122 585 -3382 5029 -1881 -326 4265 -5296 1417 4710
320 4710 -4861 1678 1226 -3253 4388 -2157 -3190 6317 -2357 -2078 4278 -3056 1357 2014 -5078 3708
336 3708 1359 -4860 3911 -426 -2445 4358 -2951 -458 4441 -4269 817 2411 -4805 2753 453
351 453 -4380 4368 -436 -2510 4125 -2633 13 3431 -5491 789 2695 -5595 1020 149 -3313 3321
367 3321 -2684 -1819 6090 -2899 -1483 4309 -2689 1251 1154 -4243 3833 -43 -4891 3951 -771 -2330
383 -2330 3252 -3528 -212 3557 -4503 813 1527 -4178 2951 -399 -3925 4241 -736 -2238 3455
398 3455 -1887 1829 3501 -4695 2494 3916 -3758 1528 76 -2015 2988 -3927 -2157 4877 -3475
413 -3475 -1669 2973 -2076 2676 1298 -3521 4269 526 -3332 3509 -1677 -1721 3087 -3738 156 3564
429 3564 -2873 2142 1409 -2842 4503 18 -3777 3169 -1686 -2174 1964 -3409 1263 2655 -4585 2515
445 2515 3313 -2399 2728 -175 -1700 3417 -3170 -1762 3356 -3895 -836 2380 -2570 2541 1117
460 1117 -2889 3762 58 -2293 3424 -2206 -1696 2406 -3621 384 2355 -3497 1729 769 -2701 3663
476 3663 -834 -2988 3161 -2017 -1293 2680 -2582 1469 2056 -3580 3211 2574 -2570 2500 -557 -1254
492 -1254 3248 -3106 -1133 3150 -3505 -224 1836 -2574 2453 -235 -3672 3468 -124 -2007 2709
507 2709 -2116 -70 2833 -3353 1193 2716 -2977 1469 144 -1918 3485 -1821 -2829 3261 -1588
522 -1588 -591 2147 -2721 1480 1362 -3810 2294 1019 -2802 1775 -1777 -1132 3512 -2612 -774 2881
538 2881 -2081 1426 1462 -2546 2877 -268 -3658 2495 -855 -1850 1620 -3178 179 2771 -3197 1302
554 1302 2223 -2285 2370 365 -1562 3272 -1942 -2058 2816 -2190 -169 1864 -3136 1227 1346 -2535
570 -2535 2810 459 -1927 2901 -1275 -786 3226 -2431 -605 1978 -2374 1525 786 -2826 2522 -410
586 -410 -2586 3036 -609 -1178 1764 -2493 928 2175 -3309 1384 1711 -2307 2051 259 -952 2984
602 2984 -2046 -1028 3276 -1994 -145 1331 -2854 1469 614 -2737 2410 -242 -1881 2497 -1656
617 -1656 -431 2879 -2783 -191 1999 -1729 1830 152 -2410 3173 -339 -2259 2773 -826 -894 982
633 982 -3018 1037 1594 -3778 855 1013 -1922 2002 -713 -1015 2970 -1919 -741 2755 -1930 337
649 337 860 -2944 1712 632 -2370 2071 -596 -1016 2771 -1902 -357 2512 -2416 91 1298 -1916
665 -1916 1806 -396 -2591 2905 -234 -1459 2572 -1031 42 1696 -2606 1096 1251 -3363 1058
680 1058 226 -1997 2045 -1069 -1041 2798 -1585 212 2786 -1797 926 1028 -2436 1857 -8 -2372
696 -2372 1898 -1031 -1097 2347 -1875 84 2275 -2184 996 1492 -1771 1810 -464 -1973 2693 -861
712 -861 -1349 2236 -1381 136 1495 -2302 1529 1126 -2867 1394 157 -1657 1660 -1884 -1049 2371
728 2371 -2037 -111 1959 -1713 1303 623 -2016 2636 184 -1991 2071 -807 -451 1844 -2399 253
744 253 1878 -2461 803 841 -1808 1786 -804 -1702 2753 -862 -944 1927 -1549 778 1357 -2451 1416
761 1416 1033 -2176 1390 -334 -1077 2035 -1874 -835 2441 -1715 -35 1241 -1825 1442 249 -2087
777 -2087 2320 -85 -1562 1964 -991 -180 1873 -2195 450 1429 -2308 1059 290 -1960 1716 -778
793 -778 -1428 2231 -1186 -360 1822 -1887 902 1394 -2183 1493 647 -1782 1760 -604 -974 2041 -1973
810 -1973 -439 2079 -1936 179 944 -1793 1559 -157 -1845 2447 -431 -1368 2046 -910 83 1448
826 1448 -2170 982 1199 -2270 1226 237 -1614 1754 -1025 -1086 2072 -1517 -373 1424 -1858 990
842 990 877 -2197 1672 560 -1442 1741 -735 -467 2127 -1980 -270 1986 -1850 296 438 -1644
858 -1644 1824 -427 -1754 2426 -421 -958 1700 -1280 441 1347 -2189 1043 1088 -1847 1466 -92
874 -92 -1231 1994 -1097 -960 1929 -1561 -67 1060 -2106 1119 725 -2075 1574 237 -1029 1804
890 1804 -1048 -296 2128 -1788 -18 1525 -1739 720 159 -1732 1813 -516 -1572 2023 -830 -719
906 -719 1523 -1604 477 1182 -2033 1267 746 -1692 1598 -283 -1006 2009 -1217 -449 1817 -1764
922 -1764 250 961 -1971 1138 209 -1883 1731 -218 -1049 1841 -1021 4 1932 -1685 547 1435
938 1435 -1705 974 85 -1597 1688 -883 -1430 1848 -1024 -482 1362 -1509 863 1101 -2052 1325
954 1325 621 -1519 1340 -662 -752 1864 -1587 -359 1769 -1481 461 740 -1648 1522 102 -1686
970 -1686 1659 -530 -989 1421 -1482 7 1571 -1817 591 1046 -1337 1436 -58 -1263 2142 -644
986 -644 -1134 1626 -1224 -75 946 -1964 854 808 -2017 1148 256 -1117 1603 -914 -443 2042 -1362
1003 -1362 56 1579 -1407 772 547 -1656 1437 -241 -1554 1529 -947 -773 1498 -1526 169
1018 169 1364 -1645 871 738 -1341 1571 -170 -1222 1860 -839 -766 1424 -1416 181 901 -1847
1034 -1847 1055 623 -1783 1336 5 -992 1406 -1154 -328 1639 -1702 99 1294 -1567 797 301
1050 301 -1347 1749 -310 -1152 1793 -833 -383 1360 -1535 389 922 -1849 918 413 -1335 1457
1066 1457 -452 -796 1949 -856 -398 1495 -1191 572 676 -1784 1158 276 -1829 1152 -411 -911
1082 -911 1259 -1460 -134 1612 -1561 316 1025 -1235 1172 90 -1285 1792 -491 -1058 1566 -972
1098 -972 -72 1195 -1562 671 900 -1514 1140 98 -1131 1596 -748 -734 1745 -1025 -199 1141
1114 1141 -1356 805 605 -1653 1226 178 -1381 1221 -669 -648 1334 -1565 -207 1173 -1665 341
1130 341 574 -1414 1219 -116 -1073 1743 -539 -653 1624 -921 196 1114 -1412 860 642 -1537
1146 -1537 1068 -98 -1148 1384 -811 -485 1521 -1156 181 1170 -1273 876 518 -1427 1377 -152
1162 -152 -1193 1258 -926 -538 1158 -1499 136 1089 -1548 641 485 -1143 1308 -378 -957 1760
1178 1760 -747 -467 1311 -1016 447 916 -1458 1080 542 -1351 1217 -196 -729 1346 -1072 -334
1194 -334 1344 -1291 143 790 -1315 996 224 -1283 1452 -118 -785 1265 -859 -52 1267 -1532
1210 -1532 274 871 -1361 710 -27 -1114 1365 -646 -980 1488 -826 -266 1064 -1156 642 746
1226 746 -1426 1102 310 -1090 1228 -502 -622 1248 -1151 -196 1098 -1403 348 614 -1406 980
1242 980 76 -1069 1316 -397 -534 1343 -936 73 1217 -1302 502 687 -1228 932 -72 -1053
1258 -1053 1273 -689 -719 1323 -962 -89 895 -1156 727 481 -1248 1179 151 -943 1191 -495
1274 -495 -309 1164 -1208 33 906 -1413 372 407 -1209 1037 -204 -967 1287 -610 -421 1211 -1038
1291 -1038 244 896 -1327 661 476 -1151 896 -279 -773 1326 -816 -528 1193 -994 139 669
1307 669 -1189 872 277 -1281 1087 -11 -714 1111 -709 -47 1224 -1104 287 943 -1097 658
1323 658 207 -1037 1063 -376 -939 1141 -795 -283 977 -1039 367 788 -1183 846 410 -912
1339 -912 1158 -395 -681 1254 -867 -338 975 -1055 265 462 -1239 885 138 -1100 1047 -210
1355 -210 -577 1159 -788 0 1091 -1067 404 651 -1081 706 86 -918 1071 -474 -608 1123
1371 1123 -826 -79 858 -1032 447 499 -1154 840 76 -883 1014 -467 -482 1151 -872 -23 936
1388 936 -986 485 401 -1029 897 -94 -1017 965 -526 -556 864 -965 108 899 -1127 563 658
1405 658 -891 957 -42 -609 1181 -587 -507 984 -922 -173 524 -1204 462 234 -1125 947 16
1422 16 -618 1113 -440 -135 1126 -804 131 780 -966 561 174 -1086 887 -230 -869 886 -503
1439 -503 -208 902 -914 263 768 -1025 521 360 -793 857 -282 -637 1084 -629 -371 816
1455 816 -796 276 592 -995 739 209 -941 947 -250 -629 885 -763 -222 872 -958 305
1471 305 613 -875 828 294 -731 1009 -198 -461 934 -721 -265 597 -1094 206 503 -1022 607
1488 607 216 -622 1040 -232 -360 1064 -643 -148 825 -938 246 248 -1027 664 15 -832 859 -178
1506 -178 -430 882 -666 -20 712 -982 272 371 -919 715 18 -662 1037 -240 -387 909 -624
1523 -624 51 668 -1084 290 272 -1022 519 -122 -616 919 -508 -314 1027 -646 65 733 -801
1540 -801 479 202 -965 795 -99 -718 796 -476 -257 841 -738 31 713 -901 348 271 -816
1557 -816 772 -176 -594 992 -362 -254 863 -708 190 565 -904 445 241 -874 647 -305 -642
1574 -642 799 -612 -330 813 -636 192 603 -751 550 211 -728 894 -157 -624 876 -487 -176
1591 -176 748 -800 200 509 -913 507 173 -733 745 -312 -486 856 -521 -145 811 -690 285
1608 285 568 -864 565 178 -738 703 -284 -539 720 -725 -205 732 -740 202 424 -754 617
1625 617 152 -659 903 -154 -424 752 -497 -1 711 -838 258 439 -827 528 46 -654 745
1642 745 -376 -430 861 -585 -22 656 -740 490 357 -737 697 67 -624 727 -327 -373 711
1659 711 -743 -77 537 -764 253 234 -782 700 -33 -609 829 -260 -265 735 -545 71 596 -817
1677 -817 363 368 -738 618 -144 -535 739 -473 -307 705 -702 8 461 -735 379 251 -704 701
1695 701 -67 -465 795 -392 -203 820 -638 45 471 -770 329 77 -760 594 -197 -518 752
1712 752 -383 -112 680 -659 251 613 -721 535 286 -633 591 -212 -447 718 -571 -159 660 -708
1730 -708 109 363 -741 501 135 -670 701 -142 -430 759 -464 -81 596 -724 193 349 -709 447
1748 447 32 -645 689 -223 -455 654 -467 -173 515 -715 171 392 -765 534 237 -445 804 -146
1766 -146 -213 857 -518 -64 563 -816 91 76 -862 423 -42 -659 727 -140 -233 843 -411 72 591
1785 591 -722 183 192 -796 453 -111 -605 663 -316 -275 740 -475 67 562 -736 326 250 -781 427
1804 427 1 -550 673 -222 -165 852 -425 90 617 -655 301 179 -800 421 -238 -658 642 -342
1822 -342 -225 750 -461 172 624 -599 394 216 -728 546 -138 -525 653 -420 -224 685 -482 144
1840 144 500 -678 403 176 -729 473 -188 -532 657 -414 -146 760 -523 240 569 -598 394 124
1858 124 -703 525 -258 -615 575 -474 -112 633 -559 269 568 -596 485 174 -624 600 -231 -446
1876 -446 649 -468 -118 585 -560 210 455 -661 516 90 -688 571 -291 -423 543 -514 -80 641
1894 641 -592 301 436 -500 528 130 -573 616 -263 -410 616 -476 -108 552 -691 215 294 -660
1912 -660 526 69 -558 645 -284 -359 602 -531 -22 540 -592 295 307 -641 561 13 -588 582 -320
1931 -320 -302 598 -609 -89 531 -629 290 320 -539 607 38 -531 695 -238 -257 647 -517 63 459
1950 459 -691 261 183 -707 492 -99 -493 626 -351 -176 693 -438 133 583 -586 371 224 -607 546
1969 546 -140 -488 629 -446 -315 669 -593 88 440 -609 383 155 -601 563 -109 -425 690 -263
1987 -263 -165 591 -513 192 429 -637 353 144 -610 566 -142 -417 588 -427 -154 600 -634 135
2005 135 444 -619 459 141 -576 642 -84 -297 690 -403 -81 529 -691 132 319 -735 392 31
2023 31 -627 620 -160 -303 670 -337 -3 569 -564 220 388 -653 407 -9 -534 555 -212 -331
2041 -331 593 -466 -34 530 -621 216 341 -619 474 29 -562 577 -217 -276 651 -403 22 519 -594
2060 -594 291 253 -608 423 30 -557 587 -345 -345 609 -492 70 500 -546 363 334 -518 587 51 -412
2080 -412 608 -354 -295 536 -567 17 417 -629 334 193 -565 534 -31 -420 716 -292 -125 663
2098 663 -525 101 466 -625 266 205 -634 428 -125 -473 583 -345 -142 649 -535 123 475 -654
2116 -654 342 161 -597 480 -166 -361 554 -379 -212 578 -480 195 438 -556 396 106 -556 469 -212
2135 -212 -485 566 -461 -150 497 -530 217 451 -453 519 209 -447 554 -215 -371 566 -562 -205
2153 -205 389 -643 224 327 -584 457 210 -353 686 -114 -297 623 -416 -114 498 -575 165 267
2171 267 -601 464 54 -442 610 -236 -307 566 -524 -116 344 -685 202 242 -603 507 132 -415 571
2190 571 -192 -248 540 -476 -26 419 -585 159 169 -620 466 -30 -414 640 -210 -137 629 -409 101
2209 101 494 -513 281 263 -542 426 -72 -458 529 -308 -264 524 -489 53 383 -559 305 181 -588 440
2229 440 -90 -476 574 -293 -172 545 -410 68 446 -552 319 180 -589 533 -73 -381 561 -353 -163
2248 -163 544 -483 131 429 -495 384 163 -492 556 -135 -315 603 -400 -151 469 -547 30 282 -629
2267 -629 302 113 -539 477 -184 -362 618 -307 -70 572 -475 191 368 -529 394 42 -493 543 -173
2286 -173 -336 513 -391 -66 476 -480 194 353 -525 439 113 -459 548 -191 -290 538 -439 -86 473 -501
2306 -501 142 296 -535 361 55 -453 536 -187 -281 486 -441 -54 454 -508 266 306 -505 431 24 -314 570
2327 570 -169 -296 515 -464 -87 323 -612 173 206 -568 397 16 -388 510 -206 -180 627 -340 39 388 -587
2348 -587 236 177 -538 357 -102 -333 491 -274 -254 468 -397 81 409 -496 259 164 -479 429 -52 -335 511
2369 511 -259 -161 504 -449 78 321 -499 285 110 -521 403 -143 -400 452 -377 -136 498 -391 161 409
2389 409 -447 358 118 -481 453 -116 -408 454 -338 -136 438 -469 81 328 -400 348 175 -405 477 -137
2409 -137 -287 462 -311 -143 461 -360 169 345 -459 317 82 -473 370 -212 -347 402 -386 -99 465 -466
2429 -466 176 353 -440 384 138 -395 504 -191 -248 447 -385 -107 407 -499 155 248 -501 397 45 -383 475
2450 475 -160 -234 456 -341 -11 432 -429 204 229 -412 389 -10 -437 408 -263 -273 416 -418 -63 306 -522
2471 -522 204 212 -431 407 40 -334 511 -153 -225 416 -352 13 368 -506 163 131 -481 398 0 -359 476
2492 476 -209 -133 454 -420 44 374 -401 260 112 -388 348 -44 -289 467 -198 -194 395 -418 39 313 -497
2513 -497 269 151 -373 405 -62 -299 478 -229 -96 443 -370 52 324 -434 305 98 -388 366 -110 -293
2533 -293 449 -299 -56 320 -379 133 246 -442 262 171 -403 414 -101 -204 412 -295 -145 407 -397 60
2553 60 286 -426 306 50 -447 361 -149 -298 423 -282 -110 402 -320 167 292 -361 386 76 -312 433
2573 433 -96 -265 457 -354 -178 322 -408 146 142 -430 275 125 -303 459 -69 -151 463 -323 -5 326 -445
2594 -445 116 154 -459 270 -9 -342 385 -162 -153 462 -263 14 344 -406 172 156 -420 332 -4 -359 373
2615 373 -153 -128 424 -270 58 340 -383 172 151 -436 267 -24 -400 357 -215 -163 444 -337 0 249 -385
2636 -385 246 189 -378 352 -63 -312 351 -257 -225 338 -392 19 247 -394 225 202 -302 406 52 -237 420
2657 420 -208 -93 422 -385 57 292 -418 205 128 -380 350 -137 -301 394 -222 -134 335 -352 82 246 -345
2678 -345 293 124 -319 342 -119 -266 350 -275 -63 344 -409 66 219 -370 291 84 -270 305 -74 -229
2698 -229 395 -257 -68 333 -347 139 233 -346 316 39 -332 315 -145 -244 303 -303 -87 292 -401 116 179
2719 179 -346 286 89 -279 395 -84 -187 356 -284 -50 265 -428 77 103 -445 258 -1 -287 381 -143
2739 -143 -134 370 -295 28 271 -396 142 167 -345 263 -57 -309 361 -148 -120 357 -283 -70 251 -366 130
2760 130 39 -377 317 -18 -291 344 -150 -147 389 -257 83 302 -320 178 102 -364 234 -88 -271 323 -229
2781 -229 -176 362 -241 9 284 -283 277 126 -349 307 -75 -214 373 -181 -40 311 -301 53 306 -373
2801 -373 158 70 -359 319 -104 -282 353 -245 -78 348 -291 93 262 -338 256 91 -339 332 -133 -232 348
2822 348 -218 -50 329 -295 84 179 -332 231 29 -287 324 -66 -188 352 -210 -18 340 -317 133 163 -390
2843 -390 286 39 -260 349 -158 -192 276 -303 -43 329 -376 150 187 -312 262 38 -240 347 -136 -175 433
2864 433 -262 -3 257 -360 130 76 -395 220 1 -248 357 -99 -174 368 -220 11 269 -318 166 61 -355
2885 -355 200 0 -244 278 -142 -171 268 -273 18 227 -332 166 69 -385 340 -16 -193 378 -141 -78 279
2906 279 -252 64 276 -314 186 100 -299 287 -47 -216 326 -184 -195 312 -304 66 242 -299 267 130 -295
2927 -295 324 -64 -171 274 -169 -91 244 -354 41 136 -412 153 91 -292 266 -72 -100 323 -254 -29 293
2948 293 -327 79 193 -280 197 118 -280 305 -111 -229 337 -201 -85 263 -330 112 179 -372 261 49 -240
2969 -240 350 -75 -155 304 -185 -37 291 -328 145 157 -320 202 -2 -289 312 -115 -119 290 -283 -56 260
2990 260 -331 153 208 -299 274 -24 -231 376 -143 -136 278 -273 28 273 -358 72 65 -336 204 -54 -245 312
3012 312 -202 -48 308 -242 63 182 -291 172 166 -311 249 -45 -219 256 -221 -151 265 -275 -1 246 -277
3033 -277 188 146 -264 270 5 -223 321 -140 -124 297 -288 55 181 -372 152 66 -352 274 -64 -202 249
3054 249 -150 -119 284 -288 79 185 -291 287 82 -253 269 -86 -215 327 -205 -129 271 -294 126 166 -326
3075 -326 247 48 -213 305 -23 -225 349 -205 -44 310 -237 84 147 -342 223 23 -235 259 -81 -197
3095 -197 286 -245 -4 318 -321 47 200 -292 224 43 -218 279 -114 -170 280 -202 -32 219 -323 74
3115 74 140 -341 184 -6 -264 262 -61 -130 324 -254 18 202 -325 156 131 -206 261 15 -248 293 -205
3136 -205 -79 230 -271 -32 194 -322 207 127 -300 321 12 -155 271 -132 -157 282 -253 64 217 -288 147
3157 147 94 -292 232 -58 -301 245 -165 -100 272 -232 95 251 -305 145 98 -229 250 -35 -182 281 -208
3178 -208 -110 288 -296 82 173 -337 132 37 -218 223 -45 -177 276 -186 -47 313 -281 116 199 -282 194
3199 194 92 -198 263 -87 -211 320 -262 -100 261 -244 64 194 -263 140 92 -223 277 -79 -152 272 -208
3220 -208 -104 246 -298 46 129 -298 176 52 -293 288 -124 -134 229 -231 -4 247 -252 120 201 -276 231
3241 231 50 -218 271 -120 -150 253 -277 -4 223 -269 86 108 -319 228 -17 -192 267 -145 -148 341 -170
3262 -170 26 233 -302 69 159 -241 255 3 -198 296 -148 -164 271 -202 -12 243 -301 86 101 -264 243
3283 243 -6 -182 276 -138 -107 215 -311 -11 201 -313 104 123 -301 255 -20 -207 248 -96 -121 282 -251
3304 -251 91 210 -321 191 97 -275 292 -54 -231 300 -198 -123 221 -241 -6 200 -261 144 53 -238 272
3325 272 -30 -165 352 -153 -25 244 -259 32 219 -238 150 127 -248 284 -99 -134 265 -149 -9 196 -251
3346 -251 8 165 -236 211 54 -188 274 -67 -134 233 -228 -35 194 -287 63 44 -327 182 51 -249 215
3367 215 -99 -166 296 -179 -13 267 -163 145 159 -232 223 28 -231 220 -170 -90 223 -179 -61 170 -218
3388 -218 120 129 -261 221 84 -209 315 -66 -108 275 -220 -38 138 -292 110 104 -272 200 -23 -219 295 -107
3410 -107 -68 277 -206 52 201 -209 147 146 -233 193 3 -181 179 -116 -119 223 -224 2 107 -316 123 73
3432 73 -278 210 -36 -193 301 -128 -98 243 -107 53 162 -236 72 79 -241 193 -67 -168 239 -112 -103 198
3454 198 -180 -46 127 -213 145 133 -226 258 -32 -152 273 -101 -47 223 -191 -9 149 -283 136 125 -266
3475 -266 205 -40 -171 214 -179 -35 179 -263 29 132 -227 142 55 -174 241 -72 -85 275 -191 -44 164
3496 164 -269 28 67 -219 156 74 -251 220 -42 -102 207 -165 3 192 -270 25 129 -238 158 -14 -260
3517 -260 195 -126 -106 184 -191 -12 157 -194 91 120 -180 195 21 -150 253 -112 -161 175 -198 -39 151
3538 151 -256 120 43 -181 222 5 -192 201 -89 -47 275 -232 7 175 -225 123 101 -191 229 -46 -179
3559 -179 248 -99 -162 169 -212 8 195 -238 128 30 -213 136 -13 -116 202 -148 -54 265 -235 -9 173
3580 173 -249 101 100 -218 175 -27 -126 211 -137 -36 187 -235 27 151 -188 164 71 -175 226 -51 -86 207
3602 207 -150 -50 153 -208 76 93 -184 172 24 -211 211 -46 -130 241 -127 -11 205 -196 96 153 -238
3623 -238 171 3 -144 238 -49 -111 245 -190 -22 211 -207 69 89 -194 194 58 -200 201 -65 -101 262
3644 262 -101 -41 216 -184 -6 83 -225 72 -27 -220 158 -96 -129 236 -121 -3 189 -151 100 103 -203 166
3666 166 20 -148 131 -66 -129 215 -136 36 160 -171 143 76 -202 143 3 -179 143 -125 -102 219 -147
3687 -147 44 154 -223 119 56 -191 181 -53 -164 194 -118 -113 116 -244 -6 142 -219 103 74 -187 153
3708 153 -29 -83 190 -49 -48 164 -122 -27 111 -233 58 54 -183 161 -50 -140 178 -133 -62 201 -140 12 119
3731 119 -215 141 25 -219 151 -54 -130 163 -188 -81 212 -205 103 108 -217 113 52 -100 189 -58 -150 222
3753 222 -96 -53 224 -160 13 83 -157 134 13 -197 187 -52 -58 173 -201 -44 136 -173 27 68 -171 115
3775 115 45 -197 227 -101 -90 236 -158 -64 137 -178 57 30 -230 112 -12 -189 179 -61 -108 162 -122 28
3797 28 175 -134 73 108 -182 180 -31 -132 147 -107 -103 109 -131 -46 130 -195 94 88 -135 88 -2 -88 174
3820 174 -72 -27 98 -170 35 152 -195 134 79 -254 152 -47 -157 148 -117 -86 175 -123 19 138 -129
3841 -129 83 82 -169 156 12 -158 163 -136 -93 150 -167 -8 125 -164 102 54 -154 106 -59 -91 157 -125
3863 -125 -49 140 -174 75 112 -173 95 -10 -158 104 -25 -102 143 -104 -77 139 -147 37 150 -185 43
3884 43 35 -138 157 -32 -87 173 -122 -104 96 -173 41 93 -178 90 9 -143 179 -74 -88 204 -146 53 161
3907 161 -209 103 130 -203 160 27 -167 214 -66 -101 175 -106 2 75 -187 56 47 -107 104 19 -87 117
3929 117 -33 -65 199 -118 10 175 -193 65 29 -181 116 -35 -150 119 -64 -111 138 -113 -7 143 -151
3950 -151 87 50 -151 136 38 -109 114 -71 -109 105 -133 -28 151 -204 81 74 -203 137 -34 -105 165 -23
3972 -23 -49 133 -139 4 47 -242 115 101 -144 159 -9 -80 142 -118 -69 143 -199 -36 162 -133 70 30
3994 30 -104 106 -27 -109 127 -83 -8 228 -97 13 86 -111 129 54 -168 141 10 -64 153 -51 -25 188
4016 188 -190 26 106 -123 89 26 -132 165 -39 -103 136 -93 -44 102 -116 5 110 -164 129 7 -120
4037 -120 129 -25 -118 129 -129 7 110 -93 79 59 -163 96 8 -126 178 -74 -69 140 -140 2 69 -151
4059 -151 99 43 -117 101 14 -113 157 -98 -83 132 -104 -19 135 -126 69 48 -151 92 7 -148 102 -86
4081 -86 -101 171 -137 5 116 -79 65 73 -151 124 11 -91 204 -54 -73 162 -150 -23 143 -162 35 139
4103 139 -133 155 25 -175 142 -96 -39 99 -59 -9 89 -151 94 34 -137 86 -53 -39 118 -66 -92 118
4125 118 -115 70 106 -138 87 78 -104 172 -42 -111 178 -121 -16 154 -83 -18 120 -146 103 -9 -140 133
4147 133 -37 -128 104 -61 -57 161 -120 34 93 -181 89 35 -85 119 -19 -63 165 -187 -50 128 -168 72
4169 72 41 -122 92 28 -106 165 -77 -15 185 -102 -40 122 -157 25 64 -142 96 -24 -138 135 -18 -113
4191 -113 140 -88 13 96 -133 27 67 -108 107 7 -81 214 -59 -49 145 -52 -33 67 -135 57 41 -130
4213 -130 150 19 -85 176 -30 -78 107 -92 3 117 -78 83 26 -117 141 -80 -132 155 -44 -52 145 -81
4235 -81 -31 90 -95 47 52 -148 125 7 -168 90 -70 -14 153 -114 -7 89 -66 60 26 -113 81 -38
4257 -38 -111 103 -112 -28 93 -169 53 72 -106 102 51 -136 156 -69 -94 130 -65 -49 121 -130 -24 67 -135
4280 -135 115 14 -115 138 -45 -56 202 -106 39 172 -146 16 103 -119 117 47 -136 102 -35 -93 164
4301 164 -58 -32 153 -123 46 95 -127 73 0 -174 100 -40 -73 107 -114 0 101 -93 65 103 -161 89
4323 89 -21 -109 87 -86 -44 86 -103 -37 152 -142 56 62 -110 105 3 -83 112 -83 -38 118 -107 -32 65
4346 65 -89 68 10 -144 111 -6 -90 135 -118 -36 113 -99 21 140 -164 46 22 -129 87 -23 -130 123
4368 123 -72 -29 80 -127 37 67 -135 76 24 -57 178 -52 -84 153 -121 -30 117 -133 31 54 -92 34
4390 34 41 -154 127 16 -98 153 -121 25 116 -52 -14 101 -97 108 -4 -106 116 25 -79 66 -65 -96
4412 -96 93 -77 34 101 -115 83 44 -100 164 -80 -62 133 -72 -16 63 -89 13 36 -137 20 52 -35 124
4435 124 -37 -66 161 -121 35 123 -103 12 39 -126 97 36 -74 77 -33 -38 140 -89 -2 113 -156 48
4457 48 -17 -64 72 -34 -101 129 -44 -23 78 -28 -11 82 -64 64 42 -115 125 54 -46 207 -36 -68 98
4480 98 -109 17 57 -128 71 6 -83 106 -50 -80 51 -35 -42 128 -140 26 86 -83 17 38 -144 141 -45
4503 -45 -100 114 -61 14 80 -104 35 77 -79 121 95 -82 57 -39 -54 65 -65 -15 80 -169 26 46 -85 77
4527 77 -1 -136 83 26 -44 100 -53 -83 65 -122 11 78 -86 85 -26 -102 85 3 -89 92 -133 -34 137
4550 137 -70 12 59 -125 140 15 -59 104 -41 -22 130 -87 41 88 -158 81 80 -109 46 30 -65 67 -74
4573 -74 -105 126 -115 -53 79 -44 44 27 -37 107 1 -145 68 -54 -53 123 -72 42 41 -144 85 33 -98 92
4597 92 37 -83 136 -13 -57 158 -57 -74 59 -182 -5 92 -119 123 -52 -89 98 -35 -57 90 -98 10
4619 10 98 -139 40 4 -59 52 -15 -117 196 -5 -27 85 -90 44 57 -100 54 -1 -54 80 -15 -63 131 -10
4643 -10 -88 90 -151 61 45 -137 2 65 -92 91 -23 -47 111 -35 18 102 -99 7 19 -100 37 63 -71
4666 -71 131 37 -64 149 -50 -29 32 -71 24 20 -74 77 33 -69 88 -11 -10 77 -94 -7 96 -98 38 -40 -116
4691 -116 80 17 -114 117 27 -41 64 -52 -51 89 -138 -11 3 -121 66 8 -79 96 -16 -85 100 -85 1
4714 1 59 -68 44 74 -103 40 -19 -76 83 -46 -55 108 -82 -26 -26 -22 46 45 -87 62 18 -83 102 -10 -49 56
4740 56 -83 -77 75 -63 24 18 -134 36 -1 -95 123 -61 -44 86 -10 -33 101 -78 54 44 -117 72 -12 -41 118
4765 118 -44 -14 108 -86 -54 45 -119 127 90 -71 119 -4 -20 116 -38 -18 136 -55 44 65 -81 64 47
4788 47 -162 76 25 -13 124 -86 -28 87 -68 1 31 -60 93 30 -68 93 -18 15 29 -91 -11 88 -104 -2
4812 -2 32 -100 39 7 -42 82 13 -46 59 -90 -69 82 -30 29 40 -75 85 34 -76 85 -43 -4 67 -65
4836 -65 -14 54 -145 12 43 -42 62 21 -48 32 8 -12 128 -58 -1 76 -54 17 7 -102 26 -44 -56 81 -15 -33
4862 -33 135 -53 2 40 -19 17 17 -51 24 -9 -107 97 -29 -31 136 -55 37 48 -7 54 32 -61 37 36 -83 52 3 -43
4890 -43 81 -78 42 55 -53 52 38 -66 65 7 -36 126 -99 -22 57 -54 -17 -18 -123 11 63 -125 77 -4
4914 -4 -40 80 -36 -59 82 -76 -43 47 -64 26 75 -48 86 -17 -49 62 -46 -34 72 -26 26 14 -50 104 25
4939 25 -104 81 -27 -73 48 -100 -10 92 -45 11 60 -6 82 43 -118 53 -56 -42 65 -61 -40 61 -34 71
4963 71 7 -87 37 49 -37 96 24 -8 63 -13 -17 86 -53 40 33 -123 63 -8 -61 70 -26 -32 117 -41 46 7 -51
4990 -51 43 42 -59 30 22 -116 38 -45 7 112 -63 -6 91 -38 73 53 -124 10 -13 25 66 -33 6 91 -14 -7 82
5017 82 -43 23 70 -35 76 -60 -80 40 -31 1 61 -36 -48 77 -62 58 50 -100 22 -21 -52 51 -51 -103 29
5042 29 -65 2 77 -59 95 21 -98 26 -22 -24 55 -52 20 110 -87 -22 12 -6 56 23 -120 102 -1 14 71 -29
5068 -29 23 81 -73 53 0 -100 103 34 -82 15 -40 -64 19 -33 25 85 -158 6 76 -99 49 -11 17 52 -33 -100
5094 -100 63 -20 -23 89 -37 -23 44 -106 65 30 -19 31 -18 -38 99 -16 9 48 -76 13 67 -88 10 27 -109
5119 -109 50 -11 -10 58 -49 12 16 -28 4 6 -23 -4 7 -23 38 -48 -22 6 -26 13 38 -33 25 -9 -78 51 -14 -14 9 -17
5149 -17 1 80 -46 -10 108 -94 -15 28 -36 42 -19 -55 38 36 -8 22 -35 -17 28 -62 50 -15 -71 98 29 -74 38
5176 38 -62 34 71 -24 8 47 -59 49 33 -44 102 18 -38 71 -46 2 89 -18 10 33 -41 9 -14 25 47 -14 -77
5203 -77 1 -26 35 59 -73 22 18 -76 30 63 -58 34 -41 -15 55 -98 -12 96 -98 -18 -4 -49 62 28 1 51 -28
5230 -28 -62 72 -58 -24 55 -52 30 76 -79 46 15 -30 29 -25 -6 61 -82 3 91 -69 49 49 -92 83 -39
5255 -39 -46 48 -10 -26 64 -9 -15 62 -23 -16 14 -102 62 18 -46 111 13 -19 56 -40 60 27 -87 -33 50 -36 30 9 -51
5284 -51 65 7 -8 23 -31 -49 74 -59 42 29 -117 41 -17 -70 60 -68 -46 55 -43 16 42 -94 5 10 -16 39
5310 39 32 -2 110 -13 -12 61 -1 12 54 -26 66 -13 -58 81 0 -8 44 -31 -81 24 -110 24 42 -89 55 27 -73
5337 -73 75 31 -43 42 -10 2 25 -98 39 -20 -87 29 3 -59 8 -10 -64 12 -29 1 101 -41 -10 89 -13 -7 21
5364 21 -40 58 -6 -61 82 -76 -18 21 -114 -5 16 -61 49 -19 -75 81 -31 -32 -16 -44 38 9 -40 96 21 -66 76
5391 76 2 -42 39 -28 -22 65 -64 -15 40 -76 84 33 -37 54 -34 -51 12 -79 11 94 -10 -35 47 -49 31 -1 -13 61 0
5420 0 -43 96 27 -26 39 -36 30 6 -50 24 28 -28 36 -8 -80 66 -58 8 -6 -86 26 9 -75 39 16 -21 -10 -13 -33
5449 -33 46 -71 -25 54 -67 18 66 -32 -7 -25 -79 103 -52 -23 53 -15 -4 54 -55 32 28 -6 -5 -14 -20 32 -10 -36 24 21
5479 21 11 -3 -24 -23 25 -75 53 -9 -69 86 17 19 84 -2 8 109 -64 90 52 -53 51 3 -57 33 11 -55 49
5506 49 -72 -30 61 -51 22 47 -103 33 55 -28 2 44 -68 53 -69 -26 -26 -76 23 27 -62 28 22 -24 64 -27 -41 80
5534 80 -102 36 92 -87 40 3 4 -31 37 -46 4 -15 -41 10 -17 -6 56 -78 40 18 -80 35 -25 -36 80 -39
5560 -39 -7 39 -32 28 71 -71 48 21 -66 47 -10 -81 46 -49 -47 83 -15 20 -32 -68 37 35 -58 96 -14 -99 88
5587 88 -25 -32 18 -63 -10 28 -54 58 -27 -63 0 -24 -46 26 -15 36 49 -22 26 -31 -13 -32 40 -12 36 -5 10 79 -57
5616 -57 1 5 -50 35 47 -68 70 21 -80 75 3 -50 51 -20 -38 -34 -36 26 9 -44 49 23 -40 79 -26 -25 90 -46
5644 -46 29 48 -34 -33 22 -60 88 6 8 91 -34 11 41 22 19 25 -30 2 34 -34 49 43 -10 67 -34 -78 5 -36 58 53 19 -13
5676 -13 30 -57 -4 2 -47 64 -50 41 120 -41 26 94 -53 10 -14 -18 -31 -28 -99 21 1 37 23 -8 -2 30 -53 81 22
5705 22 -77 17 -12 -35 7 -34 -33 0 -71 54 14 -32 54 20 -54 30 -22 -22 30 -26 -26 1 -4 4 -30 -32 8 51 -69 -29 -20 -46 80
5738 80 0 -26 28 -49 -34 18 -15 55 12 -27 40 -33 -32 -5 -41 22 56 -71 -4 -17 -27 -12 -1 -62 59 -32 -6 60 35 4
5768 4 53 -30 20 -1 -115 89 -40 -31 47 -41 -79 21 -72 -30 33 -75 28 12 -57 26 11 -30 52 -12 -22 31 -7 -27
5796 -27 4 -10 -9 11 -20 24 -15 26 23 -1 16 22 -68 -2 3 0 31 24 -15 81 2 -3 31 -41 -43 15 -30 -2 37 3 15 -59 12 60
5830 60 1 -59 3 -43 -10 52 -81 -15 7 -63 23 -7 -65 8 22 -80 -20 -19 -42 32 -24 13 17 -23 42 33 -16 49 -3 14 67
5861 67 -43 -12 36 -69 -15 -58 -50 -8 30 -58 1 -31 -70 53 -40 32 -2 -51 -4 43 -6 -18 -69 -30 30 -74 -46 25 -29
5890 -29 36 3 -7 45 26 -46 26 40 -2 49 -33 -15 -1 -21 -1 56 -45 5 73 -1 4 28 -51 14 -79 -27 45 -25 48 16
5920 16 -81 -40 6 -38 93 36 -36 80 -64 22 36 -11 -22 39 -10 34 -1 -26 17 49 -22 57 32 -65 39 31 3 11 -32
5949 -32 7 -9 -79 57 -9 -16 28 -41 -17 6 -42 14 53 -2 -33 4 -3 18 18 -8 21 -35 -57 28 -39 47 5 -38 -17 10 -6
5980 -6 -10 -33 -29 -23 -25 3 4 -48 37 20 -3 62 40 -55 9 -9 -47 35 -36 -43 33 1 47 22 -15 -21 -12 -12 37 -16 -18 23 -42 2 42 -61
6016 -61 20 12 -33 -27 22 -34 37 51 -43 75 -25 57 5 -49 -28 23 -32 71 -27 -20 18 -73 -7 33 0 -43 6 -41 -14 7
6046 7 6 16 -13 4 22 33 -5 6 -20 11 47 22 83 -2 -91 27 58 -77 56 30 -47 111 -76 14 38 -23 63 -2 -22
6075 -22 76 -15 -74 8 19 3 -20 -1 11 24 23 45 43 28 -36 -16 -35 43 -13 -21 -39 -75 -16 -20 -112 29 51 -23 49 46 -8 59
6107 59 13 24 37 -7 2 3 25 14 -30 -38 19 -15 -12 52 1 -55 24 13 46 37 -84 38 -34 -51 12 11 -15 16 -17 11 1 -8 -69
6140 -69 33 -42 39 53 -20 17 34 -14 -49 -20 25 73 11 3 10 -37 -2 -20 -5 27 -18 17 116 -24 -20 -19 -41 11 -25 -27 -43 28
6172 28 21 2 -23 -6 13 -60 76 42 -58 -11 -11 12 12 -41 -22 33 -3 -27 17 -38 -27 19 -53 23 -38 22 5 29 -15 35 7
6203 7 -50 4 7 -10 40 -40 35 66 -49 7 50 -35 6 -46 -18 59 -32 -59 30 -37 -3 -6 13 -34 -1 4 33 1 -78 54 39
6234 39 2 -1 -15 12 39 -27 38 -70 4 9 3 43 31 -93 -39 -16 -10 34 -28 2 -22 11 -6 56 -10 -42 45 -17 -50 -56 -42 -14
6266 -14 72 -75 10 -70 5 45 -16 49 65 -43 36 30 10 3 1 17 26 -1 15 45 -51 -4 51 -30 -25 -18 -36 40 32 -69 80 -12
6298 -12 17 44 -31 44 12 -71 13 -31 -44 12 19 -21 28 42 -51 8 -9 33 29 42 5 -24 -4 10 7 24 16 55 38 18 3 -82
6330 -82 19 -12 25 43 -34 0 -49 -3 15 2 4 12 -11 10 18 -44 9 1 -16 1 20 37 111 8 -59 26 -25 12 -38 28 52
6361 52 1 -31 44 -18 -8 66 -10 24 28 -68 32 21 -15 58 59 -42 50 48 -39 21 -33 -53 9 -14 11 47 -107 1 43 -43
6391 -43 -10 -61 -7 12 15 -3 52 -62 0 -9 -35 24 19 -31 33 -17 -5 29 -49 -29 -7 -12 57 25 -22 14 -12 23 -21 8 13 16 -14
6424 -14 -44 -8 11 -11 0 29 6 -28 -90 -38 42 -11 20 -2 -7 55 -32 -48 -53 42 18 15 15 65 3 21 26 -16 20 6 22 -14 -32
6457 -32 -28 -20 -43 6 50 -34 -24 31 -71 -22 12 -57 -24 -40 -55 30 55 -10 18 -26 -89 36 -7 15 44 -24 -13 7 -38 26
6487 26 30 23 -2 -30 27 19 -24 -11 11 31 2 67 -48 15 11 -17 -6 -102 -8 56 -67 34 -49 11 22 11 -38 -19 -15 -33 39
6518 39 14 41 49 0 -81 19 -11 -10 -16 -5 7 -42 -46 25 -28 7 41 -13 -2 50 11 40 24 12 3 29 4 -3 -24 -1 27 -55 -39
6551 -39 21 -23 20 37 13 -8 -12 25 -81 -1 -6 57 12 0 11 -15 28 -22 6 18 51 -14 16 -47 17 32 -22 5 15 22 12
6582 12 45 9 41 -39 -16 30 -8 18 -5 16 -48 -7 -11 -43 2 -8 50 -25 -6 30 -8 19 -5 -25 20 15 -57 57 -13 -22 40
6613 40 44 -4 35 40 9 -14 25 64 34 -12 22 35 -28 0 7 50 13 -24 -1 -12 12 59 -27 -18 -17 -14 -10 19 13 -55 33 -15 14 31
6647 31 -44 -1 22 -14 16 9 -41 40 31 27 75 -8 8 38 14 6 1 -25 53 -30 9 14 -10 24 -17 -30 -41 -8 -50 1 -10 -68 47
6680 47 31 -38 19 -28 -5 7 -12 -33 -25 -40 -23 -13 -10 -22 -19 -21 23 -5 30 -30 14 2 38 -62 70 27 20 20 -3 8 -58 -18
6712 -18 -35 -28 -19 10 -17 -20 30 33 -15 -2 -62 -34 26 -4 38 -38 -55 2 28 31 -11 48 -86 63 23 -4 22 -7 1 87 24 -47
6744 -47 -16 -62 -5 -10 41 42 48 -8 12 31 -23 38 -11 -9 -19 -11 33 -33 24 -31 -72 27 -27 -60 24 33 -36 20 39 -64 50 -37
6776 -37 -41 18 -25 36 22 -39 -23 4 2 -57 1 18 57 28 -35 -13 13 16 -36 -18 10 -25 4 34 -14 1 24 -56 -58 -14 12 -16
6808 -16 20 -37 -10 -47 -24 44 -25 -44 21 -64 -58 16 -6 21 32 3 53 32 28 -8 67 30 -9 30 -14 47 -44 -12 -29 -26 5 -37
6840 -37 -50 19 50 -40 2 -13 11 8 -37 -40 -8 -43 -53 -4 31 3 35 21 6 20 43 79 -32 -35 -21 -30 -32 -17 30 30 22 36 -9
6873 -9 29 20 -37 3 -61 43 32 34 -12 -23 -23 15 -40 -5 -32 -37 -11 -16 30 14 -16 34 65 32 -8 16 1 -13 14 -8 51 -7 39
6906 39 41 29 40 38 61 41 38 7 -41 -65 15 23 4 -4 66 -18 29 16 -52 4 51 -18 28 -23 -9 11 -38 4 1 32 -7 31 -69
6939 -69 41 7 23 14 -26 -64 31 -32 29 28 7 28 16 -20 6 3 46 33 -37 -24 8 17 53 12 -38 -20 40 -18 -8 -10 -34 -23
6971 -23 -35 -71 -22 23 -6 -40 12 -6 -32 4 24 26 -9 35 42 43 9 8 35 13 -13 48 -26 -3 -11 4 -4 18 -8 -33 33 -76 15
7004 15 8 -34 83 -11 -66 -13 -20 -16 -27 42 0 55 35 4 12 31 0 -2 15 10 -7 50 18 -10 -25 -16 -14 -10 -1 -37 -23 60 17 29 -15
7039 -15 -45 -15 -33 40 -17 -31 36 -9 -23 26 -43 28 41 6 25 4 -20 -20 6 -65 -58 58 -5 -16 -30 73 27 -84 7 13
7069 13 -33 -8 -42 63 -8 36 -1 12 5 -48 35 1 -1 14 -26 11 -21 -15 -33 19 -38 -30 53 9 -63 22 -49 21 -20 -64 -6 -2
7101 -2 1 -36 -16 46 14 -50 73 -26 -44 -45 0 -9 16 -31 -2 9 20 33 -30 34 51 30 14 26 -24 -12 24 2 -16 32 -9 -1
7133 -1 -15 -69 20 -25 27 7 -29 -14 6 -26 -29 -16 -8 12 -5 0 13 64 -34 -40 11 -22 27 -13 -6 -14 -4 38 26 -41 -20 12 20 9
7167 9 -11 21 -46 17 -7 6 -54 29 -36 12 20 70 -39 40 53 -73 -8 -10 18 22 -17 10 -14 -10 26 -11 -36 -17 -4 -47 2 11
7199 11 6 -2 -1 -4 35 44 28 16 -8 22 51 61 -21 59 14 -51 29 25 11 -32 34 16 -24 15 -53 -22 0 -31 -8 14 -9 -2 -41 10
7233 10 11 18 12 -48 -5 -41 53 -35 42 10 -54 0 -63 -32 37 40 32 -4 -22 34 39 -7 4 -9 -45 57 -81 -35 -64 -24 -23 19 -16
7266 -16 -4 -30 12 -1 -16 -11 82 38 32 39 32 14 -20 6 -70 61 -58 20 24 -44 -14 37 49 -23 -76 -9 21 15 -22 26 23 -17 -16
7299 -16 -8 2 24 -54 17 28 -2 33 -19 66 -11 -29 17 -10 -13 -2 -1 19 -6 57 -21 0 -78 -20 28 -38 -25 17 -27 7 -18 -15
7331 -15 11 30 -1 -19 -28 31 29 -10 -8 -26 -11 36 -15 -22 0 -23 -7 1 27 68 34 -8 8 24 -10 35 -6 -79 14 -38 -32 -28 -2 62
7365 62 -15 -19 -17 -20 50 -1 17 21 17 23 -27 17 10 -88 15 39 15 21 28 37 32 5 42 -19 -19 -16 -7 23 33 0 -32 -22 -40 -25 -4 10 19
7402 19 -24 -4 16 -13 3 -45 -26 64 -7 -61 1 3 9 34 2 -6 16 4 -30 11 -10 19 -48 4 46 30 -35 9 -44 11 -40 21
7434 21 -10 -19 -26 -31 -67 18 3 -39 -22 11 15 -44 -4 3 12 -29 -30 -40 -38 -51 30 -28 6 -29 38 -1 54 -4 34 6 10 -5 44 -35 24
7469 24 -2 3 -2 -7 23 -6 14 67 91 -32 -46 41 60 2 31 11 36 -43 -26 -5 20 26 -39 9 48 -10 -57 -3 48 9 -9 -39
7501 -39 -6 21 64 -17 36 71 19 -31 -36 23 -9 -97 36 7 -8 -15 12 32 11 9 -14 -23 -29 3 -25 -35 18 22 -43 61 -53 5
7533 5 30 23 -13 -7 -53 22 -45 16 43 -54 -64 24 7 11 37 48 2 23 -8 -25 41 -6 8 -16 9 -12 -14 28 19 -5 9 72 -45
7566 -45 25 -19 32 11 -37 13 13 -11 -54 8 25 27 -12 52 33 -11 15 9 25 16 -28 12 81 25 -37 6 -67 2 25 -19 29 31 10
7599 10 22 10 15 -73 -9 0 7 36 -78 -30 -42 7 4 46 3 -61 -25 -45 32 -7 -41 -1 -30 50 23 19 -6 54 17 36 3 48
7631 48 37 -4 40 -14 -26 -42 -20 2 24 15 -7 18 -12 -36 -22 -36 -5 -34 25 38 0 4 12 -1 -15 10 -18 0 -74 -8 -11 -19 -31
7664 -31 -6 -44 -40 -3 18 -14 36 -40 1 8 -6 59 -26 19 -2 -69 -11 -30 -46 -7 1 -8 29 -1 -81 19 -7 -29 -48 -34 13 19
7696 19 -9 -2 12 -34 3 5 9 47 53 21 -5 -32 62 -17 81 0 -7 53 26 37 -18 -17 12 -8 4 -22 -6 -20 -4 37 -43 2 -10
7729 -10 27 -16 60 1 -1 -11 -25 -31 -16 42 11 -11 11 -26 -28 -9 -28 60 23 40 -44 -14 53 15 -19 -3 -14 6 -66 -2 24 13
7761 13 -9 -29 -46 -39 2 -21 5 10 -34 -7 47 -43 8 15 -35 -13 37 1 0 -28 4 9 45 43 -19 34 -6 -14 25 35 40 38 25 1 3
7796 3 -1 -25 23 7 1 46 -5 -26 37 -13 12 49 -37 -36 1 -5 26 -39 -63 26 -11 -69 -35 -3 59 -45 27 0 7 -5 -20 37 -2
7829 -2 -26 10 -11 -54 -9 23 12 -7 35 42 47 8 27 37 -5 25 24 25 23 14 -1 32 17 -4 -30 32 -35 4 -27 13 -4 -9 -6 -32 30
7864 30 -62 -14 -4 5 -38 4 11 26 -8 -13 -58 -29 -34 49 -28 8 18 -38 16 31 -8 7 41 -7 -21 -57 11 13 12 -18 -17 2 23 -44
7898 -44 14 -22 -28 29 -4 2 34 -15 -1 22 0 -30 -32 -3 -6 -2 -53 16 22 21 51 26 -14 -35 28 -18 25 30 -35 -13 -9 10 4 -25 35
7933 35 -8 -8 -43 -32 -22 5 0 -1 21 -5 28 -25 -42 -23 -18 -28 14 6 -37 45 -82 7 -27 -18 -36 -11 -14 49 28 85 28 -22 -49
7966 -49 -13 14 -10 62 -62 -22 -30 4 4 6 -20 20 -41 -19 -39 -33 -13 -45 17 12 18 44 6 5 -14 46 11 29 0 25 -1 26 -45
7999 -45 -18 41 39 -26 32 -39 4 -30 -3 -23 -16 14 37 5 15 25 -1 18 -84 -38 -10 -8 -1 22 -7 -10 -5 3 38 -4 26 -38 57
8032 57 4 57 -4 -57 5 69 -27 7 25 11 31 25 -7 -2 52 -62 -15 34 43 15 35 -1 41 -5 10 17 -28 -45 55 7 48
8063 48 -1 0 16 -2 12 -40 45 34 -68 1 25 -1 4 -46 59 16 4 -6 31 0 46 15 5 42 -73 -16 -29 -3 -10 45
8093 45 28 6 -4 36 66 63 10 9 17 -17 83 -27 -5 7 -58 44 -12 -21 26 -32 -7 9 -29 5 -1 -3 -17 -22 17 29 -68 16
8125 16 8 -23 -28 -83 3 -15 28 24 -12 25 13 -19 -31 10 -5 34 -8 34 -2 -10 12 14 -49 -16 -13 -32 -66 -2 -14 -38 -14 -40 -78
8158 -78 -48 10 -5 -29 26 11 25 9 -8 10 -43 5 8 8 45 22 68 34 22 1 14 -6 -1 19 36 -26 1 -20 0 29 5 -54
8190 -54 -9
8191i
$$ Imaginary data points
##PAGE= N=2
##DATA TABLE= (X++(I..I)), XYDATA
0 0 0 0 0 0 0 0 0 0 0 0 0 0 0 0 0 0 0 0 0 0 -8 8 -8 8 -8 8 -9 16 -16 16 -22 24 -24 32 -32 40 -41 48 -56 58 -65
41 -65 73 -81 89 -98 111 -121 135 -147 162 -179 197 -219 240 -266 294 -326 364 -406 456 -519 593
62 593 -687 809 -977 1218 -1599 2297 -4005 18557 14964 -1596 15384 -4857 -880 -3590 -19053
77 -19053 -2457 -5475 -19963 5775 2584 -1437 13330 62 4700 17014 -3966 2462 2715 -15005
91 -15005 1385 -851 -13840 5463 -1698 -7405 6769 -3569 3453 10955 -10861 1333 9787
104 9787 -7036 2771 268 -6700 7285 -5575 -5159 12615 -6428 -7330 5190 -7133 1931 3531
118 3531 -8836 6863 1996 -6938 10720 644 -4298 7492 -6140 -1006 7272 -9333 -589
131 -589 558 -11321 5527 1612 -7535 8372 -915 -4178 8217 -3237 1759 5774 -11023 1841
145 1841 5443 -9777 969 -1715 -6860 5939 -4422 -1702 12108 -4551 -1618 8657 -2410
158 -2410 5503 3542 -7933 5962 240 -8127 4802 -4357 -4821 5282 -7353 544 8695 -6099
172 -6099 1293 2460 -4852 8518 31 -7254 8028 -1492 -4267 5823 -3442 2840 5239 -8409
186 -8409 5097 6639 -6549 3018 -1598 -4757 6836 -4826 -3809 6884 -6202 -1465 4049 -5905
200 -5905 4795 2589 -8168 5299 1739 -3531 5524 -4149 -755 8080 -5750 363 6403 -5939
214 -5939 860 11 -5210 6821 -1987 -6516 6819 -2033 -2297 5668 -4016 1809 3796 -6628 4259
229 4259 2532 -6689 4086 -1532 -3923 6898 -2691 -1414 5702 -4855 1704 4245 -5816 4588
243 4588 2046 -6554 5118 528 -3057 4561 -4315 102 6356 -6569 582 4722 -6370 928
257 928 133 -3594 5834 -3377 -4452 7481 -2493 -2175 4923 -3341 2342 2579 -5715 4828 1582 -5791
273 -5791 4144 -1578 -2795 5658 -4145 -2106 3868 -5033 838 1199 -6292 4371 475 -6683 4272
288 4272 405 -2090 3181 -4321 1843 5920 -6609 685 4560 -4242 1735 -544 -2633 6021 -3478
303 -3478 -4237 5604 -3390 -2082 2470 -5258 1933 1950 -5579 3813 912 -3264 5448 -1611 -1664 6368
319 6368 -3066 -1175 3196 -3857 2491 1002 -5529 5171 1291 -4742 4186 -394 -1008 3589 -4462
334 -4462 1251 4566 -5607 1210 3151 -3537 3051 -236 -2245 5484 -2391 -2134 5074 -3223 -281
349 -281 3352 -3948 2521 1800 -4221 3965 146 -2915 4770 -2098 -1412 5015 -3247 -12 3249 -3775
365 -3775 2006 323 -4770 3995 -987 -4906 3643 -1502 -1126 3382 -3449 2192 4096 -4728 2226
380 2226 2481 -3644 2259 -1719 -2600 4568 -3145 -2094 4268 -2673 653 2137 -4261 2579 471 -5601
396 -5601 2047 -1041 -2938 2757 -3446 -203 5462 -2696 831 3714 -2208 2712 -86 -3891 3818
411 3818 -1737 -4609 2670 -1977 -466 2781 -3892 1838 3643 -3731 2045 932 -3063 2823 -2427
426 -2427 -2724 4394 -2355 -1396 3248 -2079 2663 2404 -3904 3319 1360 -3859 2546 -1038 -1897 2794
442 2794 -3714 -228 4244 -3263 823 2275 -2801 2840 170 -2954 3526 -1601 -2498 3366 -2434
457 -2434 -260 2558 -3839 1080 2244 -3081 2391 73 -2586 3724 -1214 -1441 4328 -1964 -649
472 -649 2653 -2473 1958 801 -4293 2795 501 -3444 2812 -734 -1307 2340 -3251 928 3486 -4009
488 -4009 599 1944 -2563 2508 -181 -2094 3811 -1640 -1518 3697 -2185 -204 1603 -4180 1236
503 1236 1583 -3375 1777 -682 -1914 3762 -1731 -1121 4193 -1943 -374 2088 -1849 2563 174 -4003
519 -4003 3542 1045 -2499 2525 -895 -70 2569 -3132 1108 3060 -3677 428 733 -2502 2393 -1358
535 -1358 -2724 2898 -1691 -893 2812 -2615 717 2151 -3194 1930 1635 -2381 1904 -1483 -1953 3364
551 3364 -2584 -1940 2641 -2420 139 1481 -2332 2672 406 -3116 3535 599 -1906 2204 -2151
566 -2151 -638 2069 -3315 665 1811 -3398 1392 915 -1920 2835 -784 -1667 3225 -1583 -403 2466
582 2466 -2758 573 1526 -2742 2174 868 -2427 2092 -975 -1203 2985 -2521 -1033 2377 -2427 442
598 442 1293 -2310 2235 3 -2395 3632 58 -1578 2198 -1726 347 2279 -3005 1116 1737 -2878
614 -2878 1489 270 -1723 2674 -1769 -1689 3187 -1462 -410 1568 -2522 1548 1326 -2693 2558 907
630 907 -1854 2200 -871 -252 2948 -2593 -600 2207 -2305 605 274 -2740 2173 -199 -2276 2912
646 2912 -317 -893 2002 -2084 763 2311 -3057 543 1102 -2228 1645 -599 -1669 2800 -1528 -1354
662 -1354 2784 -1512 -139 982 -2811 1383 724 -2888 1875 -72 -1854 2344 -1079 -334 2648 -2129
678 -2129 213 1891 -2360 1079 154 -2775 1922 -360 -1778 2519 -1018 -341 2397 -1837 1117 2252
694 2252 -2442 1087 885 -1991 1658 -1028 -1540 2492 -1850 -898 2684 -1591 86 909 -2150 1829
710 1829 218 -2739 2024 -385 -1762 1914 -1207 116 2251 -2101 951 2055 -1930 1364 191
725 191 -2069 2137 -794 -1692 1994 -1503 -453 1624 -2277 1236 1880 -2496 1406 989 -1145 2026
741 2026 -1222 -939 2786 -1878 -924 1997 -1767 247 291 -2295 2140 228 -2469 2013 -376 -1057
757 -1057 1894 -1648 76 1998 -2227 710 1274 -1885 1677 -96 -1810 2470 -533 -1190 1851 -1519
773 -1519 201 1590 -2464 1018 1455 -2206 1240 192 -1146 2052 -1297 -848 2651 -1555 -297 1673
789 1673 -1832 888 514 -2083 2004 -159 -2104 1862 -900 -926 1811 -1829 308 1718 -2084 1171
805 1171 1122 -1821 1829 -186 -1440 2212 -1060 -964 1753 -1772 184 1253 -2244 1205 837 -2128
821 -2128 1558 -55 -1270 1855 -1403 -441 2343 -1710 40 1556 -1568 1273 388 -1810 2187 -272
837 -272 -1840 1751 -996 -529 1445 -2212 502 1569 -2196 938 721 -1435 1840 -667 -1151 2446
853 2446 -1156 -743 1643 -1558 547 850 -2333 1379 543 -2046 1426 -491 -999 1925 -1594 -381
869 -381 2247 -1597 320 1061 -1590 1676 155 -1892 2126 -187 -1276 1653 -1217 48 1488 -2216
885 -2216 624 1295 -2020 909 166 -1372 1866 -751 -936 2253 -1140 -255 1622 -1600 761 834 -1999
902 -1999 1348 137 -1687 1626 -835 -928 1849 -1531 -271 1620 -1763 598 731 -1767 1613 25
918 25 -1646 2087 -416 -820 1747 -1222 289 1411 -2162 786 897 -2155 968 -90 -1200 1713
934 1713 -1037 -584 2250 -1270 -3 1599 -1467 957 503 -1783 1566 -125 -1595 1591 -874 -670
950 -670 1694 -1594 20 1530 -1648 812 534 -1509 1672 -395 -1596 1902 -614 -740 1340 -1434
966 -1434 708 1262 -2067 1027 959 -1690 1135 -378 -922 1722 -1513 -717 1876 -1568 -20 1001
982 1001 -1506 1385 513 -1636 1838 -61 -1044 1695 -1089 -247 1646 -1825 105 1069 -1735 925
998 925 42 -1668 1686 -474 -1240 1747 -787 -198 1399 -1483 890 1270 -1865 1091 521 -1423 1332
1015 1332 -693 -935 1626 -1469 -509 1598 -1511 377 887 -1493 1386 250 -1445 1738 -430 -964
1031 -964 1648 -1214 -138 1333 -1735 570 896 -1674 1140 21 -1344 1705 -685 -933 1660 -1163
1047 -1163 -134 1160 -1589 868 791 -1713 1289 348 -1131 1547 -698 -470 1749 -1519 -186 1373
1063 1373 -1572 427 296 -1591 1420 -195 -1533 1659 -450 -608 1458 -1178 380 1345 -1758 756
1079 756 813 -1534 1059 -338 -1217 1609 -955 -814 1519 -1193 229 1091 -1498 1150 789 -1568 1361
1096 1361 87 -777 1516 -1070 -355 1746 -1445 2 1088 -1381 800 171 -1545 1587 -369 -1412
1112 -1412 1420 -837 -402 1203 -1485 394 1088 -1630 971 520 -1257 1405 -333 -863 1658 -865
1128 -865 -384 1327 -1291 410 845 -1624 1018 302 -1360 1380 -213 -688 1625 -941 -59 1578
1144 1578 -1365 304 857 -1418 879 -103 -1475 1336 -680 -1194 1348 -965 -338 990 -1458 697
1160 697 805 -1578 1098 335 -1170 1312 -564 -635 1474 -1199 -144 1304 -1352 515 616 -1455
1176 -1455 1212 155 -1231 1383 -406 -442 1370 -1173 30 1345 -1425 402 666 -1075 1150 -157
1192 -157 -1171 1531 -639 -858 1233 -1033 -24 798 -1523 703 668 -1461 1043 140 -865 1414
1208 1414 -621 -335 1563 -1064 52 1100 -1224 727 435 -1393 1183 -93 -1063 1263 -783 -490
1224 -490 1250 -1340 150 1131 -1238 658 507 -1023 1322 -174 -937 1554 -638 -463 1087 -1101
1240 -1101 237 676 -1518 720 375 -1326 1043 -192 -768 1351 -826 -242 1318 -1118 221 864
1256 864 -1201 818 226 -1176 1298 -341 -943 1225 -809 -339 1067 -1240 311 765 -1291 799
1272 799 288 -1007 1286 -330 -615 1464 -709 -213 1058 -1069 455 545 -1481 898 176 -1239 983
1289 983 -373 -546 1155 -1031 -91 1278 -1168 321 663 -1038 953 -29 -1036 1215 -443 -726
1305 -726 1212 -900 -70 902 -1302 421 627 -1221 812 -11 -860 1263 -531 -523 1345 -759 30
1322 30 928 -982 708 559 -1307 915 85 -935 898 -666 -413 1133 -1110 -49 1011 -1077
1338 -1077 486 407 -993 1100 -113 -861 1272 -468 -440 1092 -922 137 803 -1273 574 354 -1177
1355 -1177 929 -256 -895 1176 -682 -425 1105 -913 181 744 -1105 785 397 -1074 996 -77
1371 -77 -744 1045 -637 -205 1026 -1135 184 843 -1118 560 195 -932 1048 -322 -762 1248 -561
1388 -561 -319 1017 -843 433 672 -1093 790 301 -1011 871 -352 -695 926 -808 -224 910
1404 910 -1011 225 548 -1021 889 298 -889 1071 -154 -482 981 -812 -114 835 -1240 137
1420 137 601 -1073 532 -73 -811 1142 -358 -592 1192 -557 -32 902 -909 490 534 -1028 793
1437 793 137 -912 883 -514 -521 994 -806 -128 876 -951 413 399 -990 869 63 -875 932
1454 932 -388 -431 919 -856 66 915 -1030 372 466 -894 826 -123 -763 1031 -576 -504 882 -856
1472 -856 -51 664 -978 568 421 -863 961 94 -597 1067 -445 -311 869 -975 10 588 -1082
1489 -1082 397 230 -867 909 -34 -627 1080 -349 -185 863 -806 179 616 -1023 522 266 -835
1506 -835 818 -250 -606 958 -615 -337 804 -717 40 439 -965 640 216 -879 938 -8 -415
1523 -415 934 -540 -22 935 -870 182 489 -999 453 37 -889 871 -211 -533 933 -481 -42
1540 -42 870 -783 344 602 -877 547 111 -795 766 -402 -492 934 -630 -142 743 -822 281
1557 281 307 -984 623 55 -840 732 -340 -392 862 -606 9 861 -673 351 432 -818 629 -48
1575 -48 -721 804 -354 -451 842 -674 -34 745 -824 423 480 -804 679 32 -674 862 -400 -351
1593 -351 855 -677 -12 628 -809 368 277 -875 655 -121 -732 695 -446 -306 747 -728 179
1610 179 708 -812 465 484 -742 699 -67 -601 831 -473 -397 719 -754 2 517 -835 423
1627 423 235 -791 727 -68 -486 816 -438 -204 822 -580 134 543 -757 426 165 -842 689
1644 689 -174 -604 695 -531 -119 652 -738 232 622 -699 551 262 -592 783 -189 -482 818 -498
1662 -498 -244 645 -734 172 378 -789 485 102 -709 728 -115 -461 780 -472 -165 751 -680 239
1680 239 468 -775 547 129 -632 752 -169 -422 698 -600 -137 591 -826 176 380 -757 471
1697 471 100 -536 781 -285 -330 788 -524 -59 605 -705 286 338 -758 505 -12 -683 658 -323
1715 -323 -368 758 -616 57 644 -647 397 423 -664 687 39 -628 822 -328 -368 684 -619 -30
1733 -30 481 -837 307 320 -704 572 -29 -571 791 -302 -256 706 -612 -43 532 -732 368 323
1751 323 -712 692 38 -521 721 -389 -230 645 -720 13 470 -768 365 187 -653 695 -19
1768 -19 -417 889 -229 -86 612 -704 118 334 -869 194 110 -738 576 -116 -444 854 -319 -11
1786 -11 759 -518 185 450 -727 451 73 -731 590 -138 -442 704 -431 -75 663 -625 133 353
1804 353 -785 312 -35 -665 607 -190 -409 771 -358 -13 693 -607 322 446 -693 415 -35
1821 -35 -701 587 -294 -411 674 -438 -28 622 -541 324 404 -657 541 8 -628 635 -206 -354
1839 -354 658 -407 48 604 -652 290 364 -780 386 -52 -599 556 -402 -325 672 -428 78 686
1857 686 -550 413 380 -645 542 -60 -591 557 -500 -416 654 -569 -87 496 -560 343 299 -652
1875 -652 611 -76 -566 674 -303 -312 586 -568 139 576 -599 366 303 -614 526 -79 -526 592 -452
1894 -452 -320 539 -625 117 588 -539 475 318 -548 621 28 -429 658 -446 -220 588 -656 6
1912 6 421 -678 361 170 -615 655 -79 -424 650 -372 -210 589 -573 112 471 -659 457 261
1930 261 -554 655 -129 -444 632 -456 -192 509 -638 126 386 -665 457 230 -501 671 -87 -287
1948 -287 722 -429 -81 602 -626 117 335 -691 387 55 -610 614 -195 -362 630 -472 -118 529
1966 529 -633 220 377 -608 517 62 -458 661 -285 -308 649 -538 -127 468 -658 221 290 -626 555
1985 555 69 -477 605 -299 -264 642 -506 -12 470 -656 247 327 -530 505 12 -497 644 -290 -279
2004 -279 560 -595 -36 427 -634 265 318 -562 593 11 -408 768 -245 -267 631 -506 30 414 -634
2023 -634 273 192 -724 474 -53 -483 684 -302 -121 681 -548 128 525 -603 406 193 -612 548
2041 548 -55 -477 625 -384 -142 577 -549 61 366 -640 340 131 -631 550 -127 -378 637 -361
2059 -361 -146 603 -551 114 422 -612 375 184 -593 565 -194 -481 589 -412 -172 500 -640 227
2077 227 408 -563 458 189 -496 652 -154 -334 657 -432 -137 430 -654 116 279 -733 398 101
2095 101 -471 646 -139 -305 678 -404 -12 614 -569 177 296 -613 436 70 -528 620 -268 -309 636
2114 636 -390 43 528 -515 257 287 -598 454 -31 -504 585 -270 -309 603 -461 0 508 -555 345
2133 345 361 -611 515 -29 -599 488 -416 -272 515 -603 15 447 -540 412 409 -421 638 68 -299 690
2153 690 -312 -318 461 -599 -18 351 -579 278 207 -562 553 -12 -398 644 -222 -143 576 -508 -9 346
2173 346 -616 317 107 -578 489 -80 -380 615 -338 -165 531 -566 49 342 -681 279 191 -472 555
2192 555 -19 -212 703 -248 -52 596 -502 148 264 -642 261 31 -516 551 -116 -311 672 -374 -75
2211 -75 512 -574 73 242 -634 365 65 -512 548 -205 -314 575 -358 -71 433 -582 162 223 -587 440
2231 440 71 -476 554 -109 -240 640 -314 19 563 -477 255 259 -539 400 -6 -504 506 -195 -332 604
2251 604 -423 -9 377 -580 194 324 -565 468 9 -414 596 -245 -254 540 -387 25 370 -592 251 211
2271 211 -642 382 20 -351 553 -188 -215 568 -411 84 428 -587 287 218 -507 402 -47 -403 534 -318
2291 -318 -205 499 -451 33 378 -596 261 208 -532 553 -51 -369 570 -259 -145 559 -461 72 380 -563
2311 -563 373 127 -469 491 -122 -396 525 -341 -224 458 -519 50 321 -488 343 131 -422 499 -21 -282
2331 -282 576 -325 -129 465 -563 84 351 -644 246 98 -470 488 -95 -211 553 -312 4 577 -370 177
2351 177 303 -533 279 -1 -531 448 -210 -287 522 -304 -108 498 -469 190 279 -553 360 -2 -410 476 -89
2372 -89 -247 570 -306 15 456 -481 228 227 -505 332 66 -413 447 -201 -334 512 -332 54 474 -465 222
2393 222 261 -469 381 39 -384 487 -226 -220 514 -449 -26 385 -434 234 208 -499 392 -57 -401 476 -147
2414 -147 -233 502 -339 77 367 -465 251 190 -470 399 -81 -418 478 -287 -230 405 -437 13 344 -497 274
2435 274 187 -461 446 -32 -301 547 -229 -157 456 -484 41 264 -456 251 103 -395 446 -83 -287 474 -246
2456 -246 -148 419 -384 83 322 -480 321 117 -392 421 -63 -272 426 -293 -118 350 -514 86 178 -485 275
2477 275 113 -368 521 -74 -197 528 -268 -71 459 -348 88 269 -488 290 38 -436 450 -83 -250 450
2497 450 -341 -127 371 -430 196 263 -462 333 57 -344 436 -151 -172 403 -338 -59 356 -427 87 202 -417
2518 -417 304 3 -353 435 -159 -212 444 -329 1 423 -448 182 197 -448 381 29 -371 422 -153 -207 437
2539 437 -362 -24 312 -413 143 186 -435 351 -18 -305 415 -162 -220 461 -346 30 352 -393 251 163 -440
2560 -440 315 -38 -407 373 -201 -201 345 -366 49 360 -390 257 243 -340 387 34 -278 408 -185 -185 334 -448
2582 -448 56 252 -424 235 154 -388 410 -10 -270 424 -189 -122 415 -377 63 283 -480 194 46 -394 337
2603 337 -78 -227 412 -207 -119 421 -351 128 256 -403 246 8 -405 293 -122 -284 433 -179 -17 377
2623 377 -362 132 277 -408 240 46 -413 260 -167 -276 417 -302 1 378 -348 171 266 -352 301 122
2643 122 -324 366 -113 -215 316 -330 -59 240 -399 92 196 -369 332 78 -263 423 -147 -179 403 -288
2663 -288 -10 295 -386 204 163 -339 269 58 -348 389 -186 -201 297 -313 -65 303 -379 248 213 -379 352
2684 352 46 -318 390 -157 -192 347 -311 33 311 -397 236 133 -367 350 -79 -310 390 -209 -103 312
2704 312 -333 82 313 -416 206 190 -329 412 -38 -249 401 -229 -128 301 -377 42 241 -428 278 147
2724 147 -310 331 -42 -219 385 -185 -80 337 -298 76 179 -370 191 51 -379 319 -118 -211 434 -197
2744 -197 -100 323 -365 101 240 -393 201 92 -355 328 -30 -240 397 -233 -69 306 -308 64 143 -369 206
2765 206 16 -382 350 -99 -163 331 -235 11 337 -227 135 189 -368 268 -29 -344 280 -124 -214 334 -266
2786 -266 -20 359 -369 96 216 -325 252 20 -261 366 -82 -143 386 -252 -9 293 -328 83 109 -406 218
2807 218 26 -241 324 -156 -155 374 -265 3 311 -322 182 177 -355 282 28 -249 318 -188 -112 326 -309 -10
2829 -10 219 -374 163 120 -301 242 18 -240 329 -245 -58 293 -349 87 260 -308 176 136 -296 297 -14
2850 -14 -241 343 -199 -175 320 -297 61 259 -338 228 107 -288 356 -33 -151 359 -151 -61 360 -368 68
2871 68 190 -393 160 23 -286 279 -146 -226 317 -185 -51 393 -241 34 211 -359 290 104 -300 265 -108
2892 -108 -210 320 -224 -24 273 -287 91 228 -380 241 52 -318 320 -64 -212 352 -138 34 305 -266
2912 -266 143 163 -360 188 -14 -284 263 -181 -179 330 -259 -36 274 -310 151 160 -329 310 8 -281 320 -107
2934 -107 -138 330 -260 14 287 -295 147 115 -306 246 -46 -266 299 -102 -139 366 -244 12 295 -308 218
2955 218 125 -277 239 18 -208 339 -144 -122 323 -244 27 238 -330 173 123 -369 260 -37 -164 361 -140
2976 -140 -73 280 -288 56 204 -327 177 89 -344 329 -45 -224 288 -229 -98 285 -288 60 202 -329 225
2997 225 80 -285 309 -41 -178 293 -236 -41 259 -294 77 159 -327 185 31 -328 293 -62 -154 287 -190
3018 -190 -93 347 -284 96 185 -312 177 38 -267 275 -103 -147 293 -240 -45 295 -283 118 168 -326 225
3039 225 22 -251 273 -76 -80 323 -265 -51 278 -273 124 189 -360 181 12 -293 244 -134 -178 274 -231
3060 -231 11 271 -269 143 145 -337 281 33 -232 325 -171 -146 259 -222 -44 225 -355 133 102 -282 280
3081 280 38 -247 318 -197 -119 329 -239 57 241 -318 139 109 -263 246 -75 -202 243 -195 -100 259 -256
3102 -256 50 188 -292 194 121 -275 291 -24 -194 312 -162 -98 289 -244 -24 182 -301 218 100 -263 279
3123 279 -105 -157 297 -224 -76 326 -232 52 203 -345 203 102 -231 319 -81 -182 311 -233 -111 230
3143 230 -306 67 175 -293 177 36 -251 317 -62 -151 335 -151 -48 278 -275 109 203 -245 272 -10 -272
3164 -272 279 -67 -187 260 -240 -48 275 -344 126 166 -233 264 89 -173 291 -114 -183 244 -248 1 214
3185 214 -251 96 111 -260 203 10 -263 327 -102 -180 309 -234 0 264 -293 167 155 -287 239 -25 -238
3206 -238 307 -101 -166 252 -261 9 209 -311 103 110 -293 249 -37 -187 280 -87 -64 327 -222 28 203
3227 203 -326 135 103 -259 189 -33 -252 242 -202 -113 235 -296 8 265 -315 215 174 -165 267 -25 -199
3248 -199 260 -205 -103 259 -226 44 238 -332 183 123 -286 288 -63 -138 279 -163 -51 247 -274 115 203
3269 203 -293 193 76 -280 275 -28 -179 267 -167 -96 233 -263 36 153 -284 120 49 -241 264 -67 -211
3290 -211 257 -195 -54 258 -239 99 193 -225 194 65 -230 261 -131 -134 212 -235 19 271 -224 93 176
3311 176 -257 220 40 -229 288 -75 -212 210 -287 -81 227 -246 33 134 -226 231 68 -163 294 -119
3331 -119 -167 274 -175 -13 247 -254 83 128 -280 156 -7 -215 281 -141 -157 253 -185 -28 147 -284 101
3352 101 92 -251 229 -54 -186 237 -63 -129 274 -219 4 194 -244 118 109 -270 187 -67 -163 304 -135 3
3374 3 278 -217 43 200 -285 180 72 -151 206 -91 -147 239 -179 -110 193 -271 65 140 -300 171 77 -137
3396 -137 312 -2 -150 280 -90 -69 257 -191 5 180 -269 142 9 -232 238 -64 -186 234 -182 -18
3416 -18 281 -219 29 128 -260 134 69 -205 245 -106 -190 284 -199 -67 230 -251 43 108 -268 168 14 -231
3438 -231 189 -82 -105 230 -123 -81 280 -212 97 160 -208 200 59 -191 215 -137 -117 213 -208 -20 195
3459 195 -212 125 112 -236 216 55 -136 236 -69 -129 236 -175 -1 182 -203 140 10 -284 151 -19 -205
3480 -205 203 -54 -105 215 -229 13 226 -245 69 132 -184 244 -13 -175 229 -74 -65 297 -205 33 165
3501 165 -223 98 43 -254 142 -23 -232 272 -165 -91 203 -222 102 193 -260 115 42 -211 180 -55 -186
3522 -186 173 -123 -63 185 -233 35 168 -230 165 98 -173 237 -45 -143 212 -176 -62 222 -199 58 138
3543 138 -226 162 46 -213 208 -102 -134 232 -116 -51 224 -203 65 119 -279 178 17 -211 226 -34 -142
3564 -142 257 -177 -37 173 -211 54 130 -234 96 8 -160 233 -114 -77 207 -122 -18 228 -260 76 110
3585 110 -148 171 -2 -214 179 -94 -80 210 -201 -24 209 -208 71 82 -192 145 -38 -199 227 -70 -67
3606 -67 182 -138 -37 144 -236 70 44 -217 155 -37 -134 192 -136 -63 226 -129 13 152 -190 103 147 -198
3628 -198 218 -53 -103 210 -73 -101 212 -184 -49 123 -211 28 45 -234 155 18 -157 203 -74 -81 173 -219
3650 -219 38 171 -225 45 11 -234 168 -61 -116 205 -131 -36 205 -192 13 181 -183 104 31 -148 180
3671 180 -28 -112 188 -172 -44 171 -212 36 146 -226 92 87 -202 170 -74 -139 179 -143 -15 212 -233
3692 -233 26 118 -211 112 88 -193 220 -47 -191 245 -153 -77 176 -190 89 44 -170 178 10 -119 234
3713 234 -59 -82 241 -118 -21 165 -212 84 122 -211 119 2 -181 143 -114 -55 157 -132 9 205 -153
3734 -153 99 97 -224 164 16 -130 165 -62 -81 160 -158 20 154 -161 112 109 -149 93 -23 -140 223 -116
3756 -116 -83 216 -197 -31 100 -200 111 125 -146 187 -40 -87 173 -95 -116 145 -153 -18 141 -260 141
3777 141 31 -145 174 -39 -115 142 -61 -100 203 -119 8 84 -179 88 65 -151 162 -54 -131 198 -66 -93
3799 -93 175 -149 35 67 -164 142 27 -128 187 -53 -112 126 -189 -40 102 -184 66 126 -198 128 29 -164
3821 -164 135 -9 -134 170 -151 34 152 -161 53 160 -153 82 3 -97 126 -109 -132 149 -154 -74 132
3842 132 -164 52 123 -125 144 64 -154 167 -54 -63 101 -134 -57 151 -202 19 104 -178 124 0 -119 162
3864 162 -109 -104 132 -63 21 103 -127 97 62 -176 158 -6 -154 188 -134 -64 225 -83 38 135 -151 63
3886 63 62 -208 144 -58 -119 179 -71 -68 177 -136 -30 91 -134 97 16 -208 115 13 -110 163 -106 -36 151
3909 151 -113 76 110 -135 126 72 -112 121 25 -38 225 -87 -61 185 -139 -5 72 -160 71 53 -148 173
3931 173 -26 -89 201 -76 -42 189 -116 -17 101 -155 116 45 -217 107 -71 -115 187 -124 -82 180 -178 -6
3953 -6 137 -157 84 35 -176 140 -23 -95 82 -81 -71 147 -185 46 69 -174 103 31 -119 116 -33 -117 135
3976 135 -115 -55 101 -165 6 40 -147 100 -16 -137 141 -111 -119 110 -84 -54 104 -121 79 80 -127 187
3998 187 2 -152 153 -3 -82 158 -124 55 158 -206 95 33 -155 83 -26 -128 147 -58 -83 120 -114
4019 -114 0 98 -139 104 47 -113 88 -29 -53 140 -46 -66 92 -102 -1 121 -145 61 55 -222 126 -65
4041 -65 -106 148 -57 8 171 -97 48 124 -179 65 91 -81 120 -86 -52 139 -9 2 126 -143 6 91 -165
4064 -165 63 46 -147 126 -83 -82 183 -128 -64 166 -65 34 53 -136 82 -21 -144 131 -17 -132 136 -163
4086 -163 -79 148 -157 54 97 -178 99 53 -83 144 -13 -17 137 -116 -39 79 -160 26 5 -178 62 -28 -144
4109 -144 104 -32 -42 214 -125 -28 141 -138 77 56 -125 126 -16 -81 84 -27 -103 166 -103 9 157 -130
4131 -130 52 40 -106 66 -16 -101 156 -81 -87 114 -76 -40 149 -97 47 42 -161 151 16 -67 193 -78 -61
4154 -61 109 -93 -34 125 -178 106 60 -160 92 -50 -80 114 -110 -76 127 -134 -29 119 -183 58 55 -148
4176 -148 69 14 -91 87 -80 -65 138 -156 19 149 -177 52 11 -182 115 -40 -134 115 -183 -28 160
4197 160 -127 8 51 -133 22 31 -113 128 -47 -90 173 -97 -12 155 -112 42 95 -170 43 -10 -114 130
4219 130 -93 -66 164 -56 -44 157 -99 57 62 -179 117 -59 -119 41 -55 -114 61 -131 -2 84 -175 52 56
4242 56 -89 112 -31 -134 114 -63 -74 161 -102 36 141 -145 69 78 -158 95 43 -130 107 -55 -87 135
4264 135 -124 -34 163 -164 11 54 -145 131 -2 -109 131 -16 -59 45 -135 3 57 -190 51 49 -174 87
4286 87 -45 -52 189 -55 -78 120 -167 13 95 -140 4 23 -144 100 5 -125 140 -42 -44 92 -140 18 41
4309 41 -161 100 -22 -132 39 -34 -70 134 -40 -91 105 -169 -29 100 -117 146 5 -128 133 -35 -94 161
4331 161 -68 -58 83 -151 -3 80 -45 118 21 -95 90 -59 -84 183 -121 -80 89 -54 27 66 -125 66
4353 66 15 -83 157 -59 -10 170 -87 -13 137 -73 50 102 -113 87 14 -159 151 13 -42 146 -120 -11 136
4376 136 -109 43 58 -115 123 52 -69 152 -39 -38 43 -85 -5 126 -102 26 -2 -133 106 -56 -93 144 -57
4399 -57 -61 72 -94 41 106 -103 42 41 -134 90 -44 -64 116 -59 -17 161 -109 34 63 -110 55 -7 -132
4422 -132 123 62 -85 109 -97 -78 146 -94 -32 92 -96 59 -37 -138 119 -20 -109 100 -59 -30 135 -103
4444 -103 21 86 -148 86 56 -121 95 -8 -111 131 -51 -79 94 -106 -9 61 -157 95 9 -141 86 -58
4466 -58 -14 55 -66 33 125 -16 6 70 -46 89 32 -140 99 -23 -105 114 -50 51 50 -118 -17 49 -117 82
4490 82 23 -95 51 -64 -49 103 -74 -8 50 -139 34 107 -110 122 14 -111 68 -65 -77 101 -62 14 74
4513 74 -105 33 59 -124 100 66 -70 38 -42 -66 164 -102 -1 61 -144 70 55 -98 17 10 -45 115 -32
4536 -32 -63 120 -86 61 21 -154 102 37 -136 69 -79 -100 128 -62 24 154 -106 17 94 -117 74 68 -93
4559 -93 111 -65 -65 88 -51 -12 96 -102 9 27 -109 42 22 -119 72 -38 -32 144 -134 -23 113 -123 -2
4582 -2 78 -68 80 -12 -108 116 -40 -40 113 -100 -23 106 -120 -72 59 -120 37 13 -136 87 -3 -65 78 -60
4606 -60 27 54 -104 69 81 -156 43 18 -96 79 -63 -67 130 -104 -55 90 -93 16 19 -66 67 36 -59 157
4630 157 -61 -51 98 -57 0 91 -114 92 49 -124 73 -11 -67 57 -34 -49 79 -22 18 89 -86 38 88 -99
4654 -99 100 -23 -111 89 -26 -48 46 -82 -53 74 -143 112 40 -92 51 17 -96 83 -67 15 131 -56 20
4677 20 80 -60 38 81 -95 147 -11 -83 139 -39 -50 45 -54 -43 51 -91 56 66 -110 71 -48 -49 56 -42 -21
4702 -21 49 -70 5 69 -71 -14 11 -121 114 -54 -94 91 -63 -16 110 -4 40 109 -82 22 42 -76 138 13
4726 13 -72 75 -6 -3 51 -68 -47 12 -61 -37 0 -105 56 -72 -96 59 -33 -35 132 -75 -22 53 -56 81 -29 -65
4752 -65 53 -72 -26 94 -48 -48 111 -69 51 132 -104 35 15 -107 95 -41 -18 106 -86 -49 41 -102 16
4775 16 68 -64 59 -32 -93 35 13 -58 93 -116 -16 108 -47 9 27 -33 44 -29 -102 60 5 -66 98 -65 -44
4800 -44 80 -99 9 74 -63 60 4 -52 96 -41 -42 61 -112 11 40 -83 74 62 -99 33 13 -68 112
4823 112 -70 -78 58 -102 -30 -17 -100 66 12 -57 45 -4 -92 80 -75 -4 -3 -79 41 41 -112 95 48 -85 28
4848 28 21 -8 128 -52 -21 137 -88 15 11 -22 41 30 -79 99 -51 -59 54 -101 -33 77 -126 -22 36 -29 88
4873 88 -14 0 50 -23 -15 138 -67 14 91 -68 -48 40 -111 86 25 -84 64 -40 -86 115 -21 -34 96 -86
4897 -86 40 55 -83 96 -50 -40 123 -56 -72 69 -34 -42 126 -75 23 45 -92 22 -34 -39 89 -42 -19 94
4921 94 -83 -9 60 -105 4 26 -97 58 -31 -52 39 9 -21 75 -85 42 104 -25 59 -43 -107 97 -20 -86 84
4946 84 -102 -60 45 -68 22 10 -78 12 2 -78 62 -20 -104 73 -55 -23 78 -22 -34 55 -91 42 19 -83 51
4971 51 -13 -39 66 -17 -62 56 -52 -6 32 -82 48 3 -25 87 3 -6 0 -13 -14 38 -6 46 3 -66 21 83 -91 58
4999 58 12 -13 27 -63 -21 47 -79 37 81 -19 43 5 -75 71 -2 -54 77 -22 -37 79 -35 3 60 -102 31 20
5025 20 -100 15 -15 -92 46 -84 21 77 -27 51 27 -68 35 -14 -62 43 -34 -32 42 -63 -9 76 -22 17 79 -97
5051 -97 49 9 -27 56 -56 -22 68 -51 43 83 -68 -10 -7 -89 24 -9 -77 49 -56 -16 64 -16 3 19 -40 39 21
5078 21 -49 14 28 -51 61 -44 -42 33 -44 12 41 -29 44 31 -69 99 -3 -46 90 -21 -22 100 -66 -3 45 -54 89
5105 89 5 -68 97 16 -69 96 -4 -19 52 -46 37 16 -120 28 19 -62 35 -39 -38 53 -47 -31 46 -60 -32 13 -121
5132 -121 18 19 -56 99 -3 -53 47 -58 49 42 -60 18 34 -91 13 20 -18 70 -23 -65 40 -25 -21 89 -48 19
5158 19 -44 -66 20 29 -105 63 -11 3 97 -46 24 40 -84 50 22 -2 -1 -58 -13 45 -73 -86 82 -94 8 55 -57
5185 -57 21 -8 -94 14 -27 -1 96 -1 19 63 -50 26 73 -110 -20 28 -98 62 -47 -71 27 -77 -26 65 -64 38
5211 38 87 -65 13 14 -85 28 -54 -7 46 26 -40 98 -25 -9 67 -59 43 35 -55 87 -18 -62 60 -61 16 148
5237 148 -82 34 40 -89 41 33 -18 3 7 -51 8 -70 -25 20 -28 17 64 -91 70 51 -76 79 -29 43 68 -5 60
5264 60 25 -83 86 73 -59 79 -36 -34 92 -29 -2 48 -13 19 56 -52 47 39 -31 43 23 -56 -7 10 4 73 -55
5291 -55 -66 6 8 7 74 -47 36 -25 -27 71 -24 16 60 -40 -4 25 -38 28 19 -45 59 20 -84 54 -56 -52 78 -38 -38
5320 -38 84 -37 58 -3 -54 64 15 -93 108 4 -48 51 -19 45 -43 -98 2 -10 -14 63 -27 -36 45 -78 -55 43 -58
5347 -58 6 43 -17 39 8 -72 34 -14 -54 -3 -28 -46 41 -94 22 38 -56 48 38 -64 36 -38 -41 105 -89 -33 48
5374 48 -87 -24 27 -77 20 50 -9 56 -15 -53 83 -19 19 49 -84 -6 25 -69 12 2 -60 96 -22 -47 22 -39 17
5401 17 33 -87 -5 15 -40 32 -20 -56 31 -12 -57 18 25 -24 71 -2 35 11 -23 103 -19 -55 69 -32 24 3 16 -34
5429 -34 73 -103 -57 71 -67 3 -26 -81 57 1 -2 51 -32 -21 28 -73 59 24 -94 78 30 -57 20 -8 -37 108
5455 108 -4 -28 15 -49 30 -2 -38 24 32 -35 73 -64 -36 113 -27 5 -22 -113 9 42 -15 116 2 -31 93 -47
5481 -47 -57 35 -44 -7 76 -17 58 -22 -22 69 10 -6 30 -60 -35 31 -58 23 7 -60 39 -6 -32 8 -45 -60 38 -102 -33 83
5511 83 -40 -28 -13 -51 2 -11 -51 58 -15 -34 65 -36 -14 42 -60 -13 96 -98 26 -25 -1 39 -76 -96 15 -32
5537 -32 -22 73 -23 12 -47 -64 81 10 -10 82 34 -20 24 5 -32 59 -83 36 37 -35 15 11 -53 34 -44 -28 24 -13 29 58
5567 58 -70 -11 62 -60 57 9 -2 14 -26 -37 57 -75 -75 6 -50 -22 39 -52 -22 -42 -68 66 -15 15 31 -79 -30 26
5595 26 -66 16 60 -45 55 9 -71 19 -55 -74 98 -22 -13 59 -50 81 3 -73 76 8 -97 41 -37 -22 58 -109
5621 -109 13 26 -19 10 22 -63 -19 -3 -68 46 -61 12 -5 -46 39 45 -9 33 72 -43 57 18 -90 56 0 -24 91
5648 91 -72 -21 -8 -41 0 -31 -43 49 3 -99 -15 -45 -5 80 -35 -38 20 -72 -20 -4 -43 35 1 0 114 -2 23 45 -26
5677 -26 44 31 -32 19 42 -6 27 -67 7 58 -106 -9 2 -44 33 30 -44 75 67 -19 22 -17 -14 52 -31 -27 16 -73 -3 9 -154
5708 -154 43 -10 -51 27 8 -57 56 -67 -29 57 -40 62 71 29 -8 8 2 25 9 15 18 -20 -6 40 4 -2 56 -61 70
5737 70 31 -46 36 -7 0 35 7 -34 38 -19 74 0 -24 9 -54 -25 62 -44 -67 -43 -23 26 9 -34 -16 28 -21 52 33 -63
5767 -63 55 -21 -18 54 -9 -19 11 -11 8 47 -21 71 1 -65 35 -56 -11 -3 -45 27 19 -73 46 5 -101 33 5 6 -34 -32
5797 -32 -32 73 -46 -2 -13 -20 80 -2 -19 23 1 -13 65 -31 -13 56 19 -18 54 -10 32 11 -50 13 -28 -37 5 -52 -25 26
5827 26 -55 36 53 -47 33 -11 -26 -5 32 -48 19 -16 2 53 -24 -12 14 -66 38 35 28 12 -23 -29 17 -45 -10 61 -27 -1 -25
5858 -25 -61 6 21 -10 30 43 40 26 -59 -1 33 -61 44 -8 -94 61 1 26 39 -16 -52 43 18 35 71 -43 56 18 -61
5887 -61 -3 -48 35 25 12 17 14 26 25 7 -71 -12 -10 -20 30 15 -1 17 -19 -5 37 12 2 54 -34 28 -15 -19 26 -90 -1 -62
5919 -62 14 -6 70 -40 -27 24 -30 63 65 -42 17 39 -5 23 -60 0 50 -6 -5 -7 -52 -17 -10 -13 38 19 -2 19 5 15 63 -43
5951 -43 20 52 -72 11 -9 -51 2 10 14 16 -42 -47 6 21 4 54 -19 28 27 -46 17 -8 26 45 -29 -18 2 -67 21 8 -58 1
5983 1 -5 -44 71 -36 -17 45 -65 -66 82 -3 -43 58 -63 65 11 7 55 -5 -74 50 -22 -44 1 28 37 -36 -27 37 4
6012 4 -40 -22 -71 -33 92 15 1 -15 -1 63 40 -65 74 -25 -23 2 25 -50 37 -14 -31 42 11 21 44 21 35 -4 33 41
6042 41 -3 -33 -32 2 89 82 -25 21 -53 -22 12 3 -7 57 44 6 -10 -32 1 73 -24 -10 60 10 50 18 -2 -16 -24 2 31 27
6074 27 12 2 -26 30 -8 0 1 31 -5 26 8 -64 21 -10 41 8 -64 21 -11 -77 5 41 -27 54 18 -6 41 13 -10 40 -39
6105 -39 22 -7 -2 37 -19 -16 18 -33 -24 53 -27 58 51 -78 8 -48 -17 0 10 -25 -9 -47 4 13 -9 3 -20 -10 58 7 38 110
6137 110 -27 -14 116 14 0 -25 0 35 -20 -78 59 30 -13 38 -20 17 20 -47 24 8 -11 38 101 55 -10 -10 -48 23 -33
6166 -33 -23 53 -83 -32 -13 -48 23 38 -39 16 24 40 12 -4 -19 -3 -68 28 40 21 33 32 -52 29 10 8 17 3 16 16 -36 10
6198 10 9 -36 -3 -14 5 63 54 -27 8 4 -75 17 5 5 31 -25 -10 -14 -70 20 21 2 49 -41 -1 49 -26 4 -10 -15 26 56 13 17
6232 17 19 -21 49 -51 -49 30 -36 18 5 4 43 18 -20 28 -2 -21 33 -2 -2 13 -14 21 -29 -17 18 -27 -49 22 -37 -15 60 -13
6264 -13 -11 30 -61 16 3 10 13 20 17 13 -29 14 37 -5 23 46 -14 -5 34 25 48 -7 6 11 0 -127 -18 -5 5 -21 -94 78 47
6297 47 -21 -24 -36 -26 30 34 -13 69 45 14 -7 18 36 38 7 60 3 9 24 -61 -19 17 -14 -2 32 -57 5 26 42 54 54 -15 -59
6330 -59 -37 -8 2 -2 -13 17 -33 22 15 7 -18 -45 25 17 -17 -29 -25 -41 -47 33 53 0 -54 15 87 10 -29 66 -39 36 -19 14 47
6363 47 -37 -16 -45 -39 -59 -1 48 -22 68 6 -15 20 -48 -7 44 -19 35 -38 0 44 -42 -43 18 -44 -50 43 -18 54 42 -34 37 17
6395 17 53 -26 -1 -2 46 -58 -18 35 -42 -9 62 3 -21 -9 1 11 -58 30 8 -6 59 24 -22 12 -19 -45 -3 3 -48 67
6425 67 -8 1 21 -19 -39 38 -10 2 19 11 6 -3 -45 -7 -16 -43 10 -15 9 -18 -40 -7 1 -45 41 5 11 57 25 29 -6 -59 58 48
6459 48 -11 0 -24 -23 51 -15 -10 2 -8 -16 9 78 67 1 -2 51 39 -11 53 -10 22 9 41 6 13 5 6 -2 31 76 4 23 17 52 -84
6494 -84 0 -46 -30 19 18 9 -25 -25 6 -43 -38 42 5 12 1 -14 -9 67 -68 -19 2 27 48 -51 -62 33 -4 32 6 35 -16 58 -17
6527 -17 76 7 -17 57 -5 -42 48 -61 -22 -28 -22 29 -30 -8 19 -26 -9 -8 -3 -55 10 -15 -23 32 -5 17 -23 -44 41 1 -6 17 -3
6560 -3 -6 36 -30 -63 20 9 -18 1 -44 9 40 -10 8 24 18 8 -12 10 -2 -2 -19 4 -59 22 70 0 5 -23 12 22 -20 -37 15
6593 15 -24 -36 -35 -22 20 25 19 -9 0 -53 -20 -7 6 -2 -43 -28 -40 -91 -8 -17 29 -7 -48 -4 7 14 -43 -35 -2 -27 3 23 28 -56 -53
6628 -53 27 -19 -45 53 -6 -35 3 28 -40 -36 23 6 -49 -29 67 -34 -13 -11 -74 42 4 10 11 -43 -27 -16 -32 44 29 -20 -29 48
6660 48 40 -39 -8 13 14 -4 13 32 8 34 10 -27 14 -9 -38 -10 -4 -72 2 -21 -15 -48 -10 -36 -11 -1 -47 34 -6 12 20 -5 46
6693 46 12 -27 29 -33 -30 56 1 -5 59 -34 10 -5 -25 -19 -7 -11 -7 -7 8 63 4 22 17 35 6 6 2 -18 -18 -46 60 9 -5 36 21
6728 21 -49 -15 26 46 16 -21 -22 70 -10 21 73 -19 47 28 -70 -43 -23 11 9 11 12 57 -38 16 43 28 29 -37 -43 -3 12 -12 0
6761 0 -30 -57 -7 24 -26 31 25 2 -82 39 9 4 4 9 -24 17 -6 -8 35 12 27 -28 -67 -31 41 60 26 49 -54 -20 7 26
6793 26 7 -26 30 54 -7 49 2 -5 -18 17 -43 7 -23 -56 -3 14 -6 46 6 7 -39 -86 20 -12 43 83 4 6 -29 -50 -32
6824 -32 10 -29 -25 50 4 -34 -3 13 -11 -41 -46 30 12 -26 -42 -53 -25 29 27 17 34 -3 -2 -23 -26 19 7 -46 -16 27 -52 32 -35
6857 -35 -9 -35 27 7 44 16 24 -19 -15 6 -25 -51 74 -40 0 21 -62 -11 57 -46 -13 11 -70 1 -35 8 -6 -1 -37 -22
6887 -22 -26 31 -4 5 33 13 -5 0 -19 8 25 -47 -9 39 21 43 -15 13 37 43 46 -48 -67 3 0 -52 13 -32 -19 58 -27 5 -48
6920 -48 -59 -72 -6 -42 6 -4 -69 9 -3 11 -39 -56 1 -46 -27 -16 24 3 -4 33 -24 -3 -25 22 24 -2 19 40 -68 -51 -7
6951 -7 -46 9 -6 19 -24 -45 14 10 28 -7 69 -45 17 40 -71 -39 -26 25 2 12 6 -27 -75 -30 -12 -11 -62 30 -60 38 7
6982 7 13 7 -18 -10 -8 10 8 53 -21 38 10 -31 -3 36 -36 34 33 -14 22 28 2 -8 -6 26 -24 -88 -65 -5 -12 8 -11 -17 11 3 -13 -30
7018 -30 -38 -48 1 8 -48 -1 68 59 11 17 33 -25 -32 11 -33 17 -26 -23 16 31 -13 23 3 -17 -52 19 -49 -4 -61 -3 -51 -28 -17
7051 -17 -11 -14 57 -35 14 34 -46 -26 27 -75 -56 -31 -3 5 14 -25 17 39 -1 37 21 28 1 -31 0 20 22 7 9 -28 11 21 2
7084 2 -11 -27 -3 28 -36 -48 -28 -37 -24 33 -20 -7 4 27 32 4 -17 8 -19 -18 -4 -32 21 12 -17 -15 -14 19 16 16 -27 -40 21 -22 11
7119 11 -53 -7 -28 -31 -30 -54 7 5 -42 -14 -32 -18 19 -66 -47 22 -46 5 -17 12 34 12 -41 -16 -33 -37 19 58 12 10 -37 -40 -1
7152 -1 -7 -28 6 66 15 -26 8 -35 -19 -10 -1 59 0 33 -6 -37 -6 -2 51 18 -24 -48 20 1 22 -3 -39 -58 1 58 6 -27 16
7185 16 -31 -6 -26 17 -41 -42 5 37 13 10 24 6 16 38 10 0 -18 -38 -28 24 46 6 -2 13 16 47 16 21 43 -6 7 -30 12
7218 12 -27 -35 -13 31 19 -51 10 6 30 32 -16 61 -8 -61 49 -25 -34 -28 33 13 54 -22 -36 30 -26 42 -24 36 2 -21 25 12
7250 12 39 -27 15 14 -1 -15 50 4 -1 16 -38 -12 25 9 4 -51 28 34 -18 28 -32 -23 24 42 13 -49 26 23 20 21 -3 21 42 37 54
7285 54 5 -10 -21 -25 3 38 14 -60 76 3 6 22 36 -39 -12 25 91 10 -19 13 -30 -8 11 -13 -38 40 -48 -32 21 36 -36
7316 -36 -15 -2 -12 57 -28 21 32 18 22 35 21 1 -6 -20 52 33 -10 -36 3 -22 -6 24 2 8 19 19 -34 -58 -29 -57 2 68
7348 68 -12 -31 -1 -5 -16 16 2 -24 13 16 45 50 -21 -12 -39 19 95 15 66 -6 24 -15 -17 2 -18 36 -5 0 23 -6 5 -20 -12 -4
7382 -4 25 25 11 -24 10 -39 -24 11 63 4 7 -2 -40 32 -33 1 26 31 27 6 -3 30 -17 10 -9 43 11 30 -25 -39 23 -4 28 26
7416 26 -9 20 51 -38 -8 -28 7 28 -42 1 -15 17 -27 -39 19 -2 1 -39 10 -27 -7 -5 -22 0 -37 21 35 -22 37 -36 -34 -22
7448 -22 -26 52 -27 -21 17 16 -57 15 12 -20 -5 5 -48 14 -17 41 -6 -34 -21 19 -35 12 -6 -10 -26 42 -4 13 -29 -30 -21 -6 -19 0
7482 0 2 43 -17 10 57 -37 9 6 -34 47 -51 -4 25 -7 6 -16 9 -46 -4 5 20 39 36 -16 33 -8 2 -41 -9 -32 46 12 -3
7515 -3 19 13 4 -33 -25 -38 29 -81 -14 13 2 21 -35 -21 33 1 18 3 24 -49 -39 -13 35 -14 -22 19 -29 39 20 -6 -22 -23 43
7548 43 15 3 4 -32 1 -44 17 -1 -25 34 43 -41 6 -1 -21 -3 6 -29 -15 8 17 49 22 8 0 -16 -53 -17 35 18 74 35 -40
7581 -40 29 -24 33 -5 -36 -55 3 -22 -51 6 30 39 -24 -14 16 -32 -35 -14 24 38 12 -39 -7 -56 23 46 -50 -8 -27 -18 -55 -3
7613 -3 18 6 25 34 -55 34 18 30 -13 14 37 7 7 13 -22 -46 -27 62 11 -60 -6 -20 28 37 31 13 27 -14 19 16 -50 -36 5 -20
7647 -20 26 -10 -27 2 -6 17 -36 25 10 1 -24 -9 -10 -28 5 -34 -20 19 -3 36 8 51 -21 -25 -10 52 -32 1 44 -18 -36 16
7679 16 -1 34 -13 21 32 -59 11 -2 -72 -23 -38 1 -23 -18 -36 58 -5 -2 25 25 3 -34 -39 -11 -33 -7 -7 -17 23 39 -4 -19 31
7712 31 -12 7 7 71 44 -54 -34 51 -76 -58 6 -10 40 -8 25 -33 -17 -24 1 -6 -55 15 24 -11 34 23 -17 46 -56 32 -17
7743 -17 -5 -33 -3 20 -9 8 -10 8 30 20 3 27 44 0 -7 33 19 13 -18 51 14 9 -37 -14 -32 4 4 -49 4 -24 14 -12
7775 -12 40 36 32 7 1 40 -2 2 4 -23 6 -8 53 -14 19 -23 -11 6 -25 3 -5 0 29 8 3 52 7 -3 -27 -20 20 29 -19 18 17 -48
7811 -48 -1 -15 10 -36 -16 -4 -2 -13 -15 -23 20 44 49 -36 11 60 -15 37 14 22 30 -16 -50 -39 -6 54 27 -38 1 -1 20 45 22 -22
7845 -22 38 -21 20 2 29 1 35 -41 41 -11 -18 12 17 13 55 -49 -21 43 1 -19 28 11 -13 17 -13 26 31 20 18 -30 -30 4 0
7878 0 23 -37 -1 -12 -10 14 30 -6 39 41 3 -11 55 8 38 24 -7 -25 -5 10 14 -1 -66 19 -14 -11 0 -23 -25 20 -15 -4 -21
7911 -21 -48 16 -14 29 51 -19 52 13 0 -75 22 -14 10 -37 -35 57 -5 -1 -17 8 -25 16 -14 -15 -1 -31 -26 36 19 -11 -11 -22 30
7944 30 -4 -7 -10 -26 10 -30 -11 -22 12 11 13 13 48 -6 13 33 43 17 26 12 33 -41 5 56 -5 -21 17 -18 -40 8 17 -19 -22 -32
7978 -32 36 34 -20 -29 11 13 -11 27 -14 4 -34 50 41 19 77 13 13 -27 4 -41 64 37 5 -77 -30 -3 20 -26 -13 36 -18 27
8010 27 -52 11 76 25 4 38 -29 -19 -54 -40 24 17 43 -69 -46 -16 23 10 -19 33 -18 -2 -8 43 31 51 -13 27 57 20 -9
8041 -9 14 6 -14 13 -7 12 -2 6 -17 -1 5 8 -7 22 -17 7 1 59 -47 14 -18 24 2 10 -4 -13 -18 23 4 -28 -20 43 -10 -2 -16
8076 -16 -30 8 11 -12 -3 33 -16 -5 36 -60 31 -10 48 -24 -13 39 39 31 -42 46 32 4 11 9 -33 1 13 -78 -42 -19 -11 71 -16 22
8110 22 11 65 11 5 -3 -16 -28 -31 -32 11 -2 13 2 -4 -16 29 -11 46 0 -2 62 43 47 8 24 10 39 -3 -7 27 -42 15 -33 -34 43
8145 43 19 23 20 -6 -35 28 -19 -5 -34 -26 2 -21 16 -22 -15 -10 -57 36 12 -21 16 0 52 9 -11 20 -40 10 7 -27 17 -30 -4
8178 -4 -21 -57 0 -10 42 44 -7 -4 2 34 -21 10 -14
8191a4
##END NTUPLES=NMR FID
##END=
