##TITLE=1H_DE-80H_X3
 200.13MHz, d2o
 8 sc
 
 19ns.26.2.2025
##JCAMPDX= 6.0         $$ Bruker NMR JCAMP-DX V2.0
##DATA TYPE= NMR FID
##DATA CLASS= NTUPLES
##ORIGIN= UXNMR, Bruker Analytische Messtechnik GmbH
##OWNER= pz
$$ XWIN-NMR		Version 3.5
$$ Fri Jun 20 15:32:52 2025 Russian Standard Time (UT+4h)  Yarkov@DPX200
##.OBSERVE FREQUENCY= 200.1313
##.OBSERVE NUCLEUS= ^1H
##.DELAY= (6, 6)
##.ACQUISITION MODE= SIMULTANEOUS
##.ACQUISITION SCHEME= undefined
##.AVERAGES= 8
##.DIGITISER RES= 18
##SPECTROMETER/DATA SYSTEM= spect
##.PULSE SEQUENCE= zg30
##.SOLVENT NAME= CDCl3
##.SHIFT REFERENCE= (INTERNAL, CDCl3, 0, 14.3821)
##AUDIT TRAIL= $$ (NUMBER, WHEN, WHO, WHERE, WHAT)
$$ ##TITLE= Audit trail, XWIN-NMR		Version 3.5
$$ ##JCAMPDX= 5.01
$$ ##ORIGIN= Bruker BioSpin GmbH
$$ ##OWNER= Yarkov
$$ C:/Bruker/XWIN-NMR/data/yarkov2/nmr/H-C/1/audita.txt
$$ ##AUDIT TRAIL=  $$ (NUMBER, WHEN, WHO, WHERE, WHAT)
(   1,<2025-06-20 15:31:40.57 +0400>,<Yarkov>,<DPX200>,
      <created by zg, POWCHK disabled, PULCHK disabled
       configuration hash MD5:
       00 E9 B6 7A A2 85 ED C7 34 08 36 98 17 FE 4E 26
       data hash MD5: 16K
       9D 1D 32 65 B3 FC F5 52 F4 F7 EF 29 5D 99 0B F2>)
$$ ##END=
$$ 
$$ hash MD5
$$ E3 FA F4 90 E6 0A 17 31 C6 B5 73 0B E3 29 D9 1E
##$RELAX= 
##$RELAX= 
##$RELAX= 
##$RELAX= 
##$RELAX= 
##$RELAX= 
$$ Bruker specific parameters
$$ --------------------------
##$DU= <C:/Bruker/XWIN-NMR>
##$EXPNO= 1
##$NAME= <H-C>
##$PROCNO= 1
##$TYPE= <nmr>
##$USER= <yarkov2>
##$AMP= (0..31)
100 100 100 100 100 100 100 100 100 100 100 100 100 100 100 100 100 100 
100 100 100 100 100 100 100 100 100 100 100 100 100 100 
##$AQSEQ= 0
##$AQ_mod= 1
##$AUNM= <au_zg>
##$AUTOPOS= <>
##$BF1= 200.13
##$BF2= 200.13
##$BF3= 200.13
##$BF4= 200.13
##$BF5= 200.13
##$BF6= 200.13
##$BF7= 200.13
##$BF8= 200.13
##$BYTORDA= 1
##$CFDGTYP= 0
##$CFRGTYP= 5
##$CHEMSTR= <none>
##$CNST= (0..31)
1 1 145 1 1 1 1 1 1 1 1 1 1 1 1 1 1 1 1 1 1 1 1 1 1 1 1 1 1 1 1 1 
##$CPDPRG= <>
##$CPDPRG1= <>
##$CPDPRG2= <>
##$CPDPRG3= <>
##$CPDPRG4= <mlev>
##$CPDPRG5= <mlev>
##$CPDPRG6= <mlev>
##$CPDPRG7= <mlev>
##$CPDPRG8= <mlev>
##$CPDPRGB= <>
##$CPDPRGT= <>
##$D= (0..31)
0 0.7 0 0 0 0 0 0 0 0 0 0.03 0 0 0 0 0 0 0 0 0 0 0 0 0 0 0 0 0 0 0 0 
##$DATE= 1750419099
##$DBL= (0..7)
120 120 120 120 120 120 120 120 
##$DBP= (0..7)
150 150 150 150 150 150 150 150 
##$DBP07= 0
##$DBPNAM0= <>
##$DBPNAM1= <>
##$DBPNAM2= <>
##$DBPNAM3= <>
##$DBPNAM4= <>
##$DBPNAM5= <>
##$DBPNAM6= <>
##$DBPNAM7= <>
##$DBPOAL= (0..7)
0.5 0.5 0.5 0.5 0.5 0.5 0.5 0.5 
##$DBPOFFS= (0..7)
0 0 0 0 0 0 0 0 
##$DE= 6
##$DECBNUC= <off>
##$DECIM= 32
##$DECNUC= <off>
##$DECSTAT= 4
##$DIGMOD= 1
##$DIGTYP= 9
##$DL= (0..7)
0 120 120 120 120 120 120 120 
##$DP= (0..7)
150 150 150 150 150 150 150 150 
##$DP07= 0
##$DPNAME0= <>
##$DPNAME1= <>
##$DPNAME2= <>
##$DPNAME3= <>
##$DPNAME4= <>
##$DPNAME5= <>
##$DPNAME6= <>
##$DPNAME7= <>
##$DPOAL= (0..7)
0.5 0.5 0.5 0.5 0.5 0.5 0.5 0.5 
##$DPOFFS= (0..7)
0 0 0 0 0 0 0 0 
##$DQDMODE= 0
##$DR= 18
##$DS= 0
$$ [...]
##$SUBNAM2= <"">
##$SUBNAM3= <"">
##$SUBNAM4= <"">
##$SUBNAM5= <"">
##$SUBNAM6= <"">
##$SUBNAM7= <"">
##$SUBNAM8= <"">
##$SUBNAM9= <"">
##$SW= 18.0517328524113
##$SWIBOX= (0..15)
0 0 2 0 0 0 0 0 0 0 0 0 0 0 0 0 
##$SW_h= 3612.71676300578
##$TD= 16384
##$TD0= 1
##$TE= 0
##$TE2= 300
##$TE3= 300
##$TEG= 300
##$TL= (0..7)
0 120 120 120 120 120 120 120 
##$TP= (0..7)
150 150 150 150 150 150 150 150 
##$TP07= 0
##$TPNAME0= <>
##$TPNAME1= <>
##$TPNAME2= <>
##$TPNAME3= <>
##$TPNAME4= <>
##$TPNAME5= <>
##$TPNAME6= <>
##$TPNAME7= <>
##$TPOAL= (0..7)
0.5 0.5 0.5 0.5 0.5 0.5 0.5 0.5 
##$TPOFFS= (0..7)
0 0 0 0 0 0 0 0 
##$TUNHIN= 0
##$TUNHOUT= 0
##$TUNXOUT= 0
##$USERA1= <user>
##$USERA2= <user>
##$USERA3= <user>
##$USERA4= <user>
##$USERA5= <user>
##$V9= 5
##$VALIST= <valist>
##$VCLIST= <CCCCCCCCCCCCCCC>
##$VD= 0
##$VDLIST= <DDDDDDDDDDDDDDD>
##$VPLIST= <PPPPPPPPPPPPPPP>
##$VTLIST= <TTTTTTTTTTTTTTT>
##$WBST= 1024
##$WBSW= 4
##$XGAIN= (0..3)
0 0 0 0 
##$XL= 0
##$YL= 0
##$YMAX_a= 125079
##$YMIN_a= -95349
##$ZGOPTNS= <>
##$ZL1= 120
##$ZL2= 120
##$ZL3= 120
##$ZL4= 120
##$ABSF1= 10
##$ABSF2= 0
##$ABSG= 5
##$ABSL= 3
##$ALPHA= 0
##$AQORDER= 0
##$ASSFAC= 0
##$ASSFACI= 0
##$ASSFACX= 0
##$ASSWID= 0
##$AUNMP= <proc_1d>
##$AZFE= 0.1
##$AZFW= 0.1
##$BCFW= 1
##$BC_mod= 2
##$BYTORDP= 1
##$COROFFS= 0
##$CY= 83.5205535888672
##$DATMOD= 1
##$DC= 2
##$DFILT= <>
##$DTYPP= 0
##$F1P= 10.8118882576601
##$F2P= -7.23987719738617
##$FCOR= 0.5
##$FTSIZE= 0
##$FT_mod= 4
##$GAMMA= 1
##$GB= 0.15
##$INTBC= 1
##$INTSCL= 1
##$ISEN= 128
##$LB= 0.25
##$LEV0= 0
##$LPBIN= 0
##$MAXI= 10000
##$MC2= 0
##$MEAN= 0
##$ME_mod= 0
##$MI= 1.114404
##$NCOEF= 0
##$NC_proc= 0
##$NLEV= 6
##$NOISF1= 3.799351
##$NOISF2= 2.8
##$NSP= 1
##$NTH_PI= 0
##$NZP= 0
##$OFFSET= 14.38212
##$PC= 1
##$PHC0= -1722.08
##$PHC1= 17.76659
##$PH_mod= 1
##$PKNL= yes
##$PPARMOD= 0
##$PSCAL= 0
##$PSIGN= 0
##$REVERSE= no
##$SF= 200.129724274929
##$SI= 16384
##$SIGF1= 3
##$SIGF2= 2
##$SINO= 400
##$SIOLD= 16384
##$SREGLST= <1H.CDCl3>
##$SSB= 0
##$STSI= 0
##$STSR= 0
##$SW_p= 3205.1282051282
##$SYMM= 0
##$S_DEV= 0
##$TDeff= 0
##$TDoff= 0
##$TI= <>
##$TILT= no
##$TM1= 0
##$TM2= 0
##$TOPLEV= 0
##$USERP1= <user>
##$USERP2= <user>
##$USERP3= <user>
##$USERP4= <user>
##$USERP5= <user>
##$WDW= 1
##$XDIM= 8192
##$YMAX_p= 0
##$YMIN_p= 0
$$ End of Bruker specific parameters
$$ ---------------------------------
##NTUPLES= NMR FID
##VAR_NAME=  TIME,          FID/REAL,        FID/IMAG
##SYMBOL=    X,             R,               I
##VAR_TYPE=  INDEPENDENT,   DEPENDENT,       DEPENDENT
##VAR_FORM=  AFFN,          ASDF,            ASDF
##VAR_DIM=   8192,          8192,            8192
##UNITS=     SECONDS,       ARBITRARY UNITS, ARBITRARY UNITS
##FACTOR=    0.0002768,     1,               1
##FIRST=     0,             0,               0
##LAST=      2.2672688,     0,               0
##MIN=       0,             -95349,          0
##MAX=       2.2672688,     125079,          0
$$ Real data points
##PAGE= N=1
##DATA TABLE= (X++(R..R)), XYDATA
$$ [...]
1735H39k77j781K077p07j230J957j316Q1J628k061P95J158k093J171qj666K024
1752E91r85r79K190j231j45J561j524J003O77k248J645K04j832J509o91o39K021
1769A127j713J30K022j866N19Q71j697J535m61j876K080q35r76J881j212K50J631
1786A410k057J080J049k213J299m68j430J668j035r90K127j325J27J653j529J269
1802F35Q53k155J570O4j694J257r83o52J926j827J62J941j777R92Q48j446J521
1819A235l34j785J893j138q24J385j603K92J486j816J298R92j584J460r3j304
1835d40J868j375j127J829j703n6J145j653J273Q85j737J878J45j167J604j193
1851A76m08J502j914j16J279j666J014O19j450J771l83j166J934p63r49J531j735
$$ plain form
1735 839 562 -1219 858 151 -1079 878 -438 -357 1271 -790 5 1163 -930 241 233 -1433 591
1752 591 -394 -1373 817 -414 -559 1002 -522 481 1158 -1090 555 759 -1073 436 -255 -894 1127
1769 1127 -586 -456 1566 -300 219 1090 -607 928 467 -1409 671 -164 -1140 741 -471 -221 1410
1786 1410 -647 433 1482 -731 568 100 -1330 338 -697 -1687 440 -885 -758 895 -634 635
1802 635 1488 -667 903 967 -727 530 -453 -1105 821 -1006 -844 1097 -680 312 1160 -286 1235
1819 1235 901 -884 1009 -129 -953 432 -1171 -879 607 -1209 89 1081 -503 957 864 -440
1835 -440 1428 53 -1074 755 -948 -1004 141 -1512 -239 646 -1091 787 932 -235 1369 176
1851 176 -232 1270 -644 -760 519 -1147 -133 486 -964 807 424 -742 1192 429 -520 1011 -724
1868g24K47J231k174J129P96j609J678j80j006K015j219n78J612j729J07R35j925
1885a394J228N64j661J705j8j024J712j124l96J783j960J49J167j621Q78K28j495
1902a279J913n21r60J960q71o13J511j659M54R58j944R89M12j522J534k07j009
1919h54K044j063l95J570j565K74Q56j966J070M20j784J526r9r22J867j230k16
1936d67J808j827N27R21j752J084J42j605J688n27j058J876j110o6J429j557N39
1953D5J000j906J043K04j528J637o66q38J876j091k36J515j481M85Q59j826J262
1970C54K00j566J438m71r45J770j271kJ555j710M42J112j563J133M1j455J770
1987H32o79j098J954j203k59J338j690P17R39j895J276J73j264J628o94q95J832
$$ plain form
1868 -724 -477 754 -1420 -291 505 -1104 574 394 -612 1403 184 -394 1218 -511 -404 531 -1394
1885 -1394 -166 398 -1263 442 424 -600 1112 -12 -408 1375 -585 -436 731 -890 -12 216 -1279
1902 -1279 634 113 -847 1113 242 -371 1140 -519 -65 893 -1051 -62 350 -1172 362 155 -854
1919 -854 1190 127 -268 1302 -263 11 867 -1099 -29 391 -1393 133 34 -888 979 -251 -467
1936 -467 1341 -486 41 962 -790 294 436 -1169 519 -8 -1066 810 -300 -366 1063 -494 45
1953 45 1045 -861 182 386 -1142 495 -171 -1009 867 -224 -460 1055 -426 59 918 -908 354
1970 354 554 -1012 426 -45 -990 780 -491 -493 1062 -648 -206 906 -657 476 517 -938 832
1987 832 153 -945 1009 -194 -453 885 -805 -88 851 -1044 232 405 -859 769 75 -820 1012
2004A012j183k60J365j715N91P95j701J307J43j269J587n70n43J556j379l0J381
2021A087j852L70Q22j693J433j01j140J877o35n00J631j119o7J041j734N81N38
2038E39j763J139j40j097J779o52m51J787j032lJ229j669O98M60j844J180k12
2055e2j312J659p46l57J714j267K04J474j552O63O26j652J217m08j315J522q74
2072d56n51J548j325M65J223j473J026O72j534J321k60j257J416j134p11J369
2088C39j448K06J319j549J236O61j389J494k3j100J504r69o84J201j599J19J093
2105D11j512Q38M79j284J611j21j160J821q34n52J341j238J30R04j826Q77N07
2122C92j535J360j50r80J669r83m37J717j320L24J098j673Q81N03j682J243l81
$$ plain form
2004 1012 -171 -431 934 -781 -190 605 -1096 211 354 -915 672 102 -441 1115 -264 -294 1087
2021 1087 -765 -395 427 -1266 167 66 -1074 803 168 -332 1299 180 113 1154 -580 1 539
2038 539 -1224 -85 -225 -1322 457 -195 -646 1141 109 106 1335 -334 364 824 -1020 160 -52
2055 -52 -1364 295 -451 -808 906 -361 -157 1317 -235 428 1054 -598 619 211 -1104 418 -456
2072 -456 -1007 541 -784 -319 904 -569 457 1129 -405 916 656 -601 815 -319 -1030 339
2088 339 -1109 -903 416 -1133 103 764 -625 869 846 -254 1250 281 -403 798 -801 -682 411
2105 411 -1101 -263 216 -1068 543 422 -738 1083 249 -303 1038 -200 -70 834 -992 -115 392
2122 392 -1143 217 67 -913 756 -227 -664 1053 -267 57 1155 -518 363 866 -816 427 46
2139D6r85J363r46k80J430j225N68J115j420Q58L29j388J325n46j115J389j137
2156f19l70J181j243M02J111j427J317M45j365J340j55j086J521j143m41J222
2172F90j424L20J007j491J002L79j293J470k41p32J421r25k94J366j504K99O77
2189G27j702R94J58j365J502l92p69J597q49k60J264j396M44P09j626R02N8j132
2207a136J351m28n56J688j045qJ240j306L28P57j604R75K2j389J385k76p58J726
2225I66j006R4J199j348L25P40j708Q24K1j354J497o07p02J679j001N5J396j446
2243c76M86O35j560Q80O1j229J294m44o52J660j043l4J389j398O55N80j474R43
2261C73R1j210J307n20p45J399j111j01J163j321N25O65j303J134Lq94J364o22
$$ plain form
2139 46 -939 424 -522 -802 628 -597 -29 1086 -334 524 853 -535 790 244 -871 518 -619
2156 -619 -989 192 -1051 -649 462 -965 352 797 -568 772 617 -469 1052 -91 -532 690
2172 690 -734 -414 593 -898 104 483 -810 660 419 -313 1108 183 -111 1255 -249 50 727
2189 727 -975 19 177 -1188 314 -78 -847 750 -99 -359 905 -491 -47 662 -964 -62 -4 -1136
2207 -1136 215 -213 -769 919 -126 -134 1106 -200 128 885 -719 256 278 -1111 274 -2 -760 966
2225 966 -40 54 1253 -95 230 970 -738 86 107 -1247 250 -357 -1059 620 -381 -326 1070 -376
2243 -376 110 745 -815 65 126 -1103 191 -253 -905 755 -288 -322 1067 -331 324 904 -570 373
2261 373 464 -746 561 41 -704 695 -416 -517 646 -675 -150 515 -788 346 349 -545 819 197
2279A97o88J392j173j79J061j579O54N59j414J214J03j027J471m97l58J347r73
2296A10m4R06j464M19N88j568J107o6q08J321n73n38J425r30J24Q75j420N80M90
2315E34j410J168p6j024J372o64o33J576j212J96J037j387O89M56j251R69O1j074
2333f73J302o51m76J318j288J36R62j346P02M34j302J214l2r33J308o67m25J316
2351H99j157k0Q09j364O87L85j362J303j00r87J608p17j76J247r64J16Q03j374
2369c64M64L05j324R99k64p82J373o24k53J428j160L69Q88j420O80J68j249J008
2387B42k64r42J191m99j93J290j013L25Q03j308O80J15j275J058l57p84J245o76
2405c62l8J080r26K70R36j265O28K00j256R80k36r20J305q17j00J221j025L69
$$ plain form
2279 197 -491 901 -272 -451 610 -969 -315 244 -1170 44 147 -880 591 94 -264 1083 110
2296 110 66 972 -492 -73 515 -1053 54 -12 -820 501 -72 -610 815 -115 9 884 -536 44 534
2315 534 -876 292 216 -808 564 -100 -733 843 -369 -173 864 -523 166 622 -629 340 401 -673
2333 -673 629 -22 -498 820 -468 -332 630 -716 -14 420 -882 332 300 -633 675 8 -417 899
2351 899 -258 -278 531 -833 -146 239 -1123 180 80 -907 701 -16 -192 1055 91 207 1010 -364
2369 -364 100 405 -919 80 -184 -966 407 -217 -470 958 -202 167 1055 -365 315 483 -766 242
2387 242 -22 -964 227 -272 -465 825 -188 137 940 -368 312 427 -848 210 -147 -931 314 -362
2405 -362 -400 680 -246 24 960 -305 323 523 -733 247 11 -909 396 -421 -521 700 -325 44
2423D4Q10j231O63J60j181J020k95p27J141o02j42J082j143L81P95j295Q18R7
2441C95j166J151k77q66J121o60j18J099j142L40P77j199Q45K11j167J074m67
2458d9o43J409r86p9J080j211M48N42j234Q99K20j165J297m47o75J112q82r5J070
2477F11j079M14P24j207P03L41j137J138l10q63J182q99n3R50r73K67P88j221
2495f24R50J01q39J023m61o58J230r69r3R41j096L27O05j067R35P3r35J083l94
2514A32o01J072p88j62Q26j032M71O14j166R10M2q91J107n13n47J029p95L6Q49
2533E93j138N12M50r93Q54K3q18R47m98l50R20p14j54J075j204N20N82j148Q31
2552B90J9r10R26l33m44R13p14j07Q13r60M99M49j043R05j24q16J085m96m23J093
$$ plain form
2423 44 854 -377 286 446 -735 285 -10 -737 404 -198 -340 742 -401 -20 775 -520 298 395
2441 395 -771 380 103 -763 358 -302 -420 679 -463 -123 654 -545 300 511 -656 418 -49
2458 -49 -692 717 -269 -348 732 -479 -31 511 -723 176 396 -769 528 81 -594 518 -364 -459 611
2477 611 -468 -54 670 -537 166 507 -630 508 198 -665 517 -382 -435 515 -458 -191 597 -624
2495 -624 326 427 -412 611 150 -508 722 -247 -340 601 -495 -168 437 -630 305 378 -557 526 132
2514 132 -469 603 -185 -347 479 -553 -82 532 -634 276 318 -573 534 21 -526 503 -292 -256 593
2533 593 -545 -33 417 -576 278 301 -517 430 -68 -418 502 -212 -366 709 -495 25 607 -541 290
2552 290 309 -601 325 -8 -452 461 -253 -360 453 -507 -8 441 -602 303 179 -637 448 -48 -471 622
2572F22r04J97O38r12M82K50r24P76j90q64J009l14l69J054o94P7J014j126L51
2591A73M67j016Q22k88p89Q84n56m17J113q82J62J041j023M73L42r55P54j20p59
2610e74R03n53l69J028r05J08Q85j000M79M65r93Q79n1p27R91m57k68P81q61L6
2630b03O18r10N55K89j002Q09Rp27J188n77j67Q66q58P8N48j008L63K53r58O42
2650a92P3o53J107l26j37Q74p22K20N60j168N41J15j025O50j0p41J064m18j01
2669b89R10o96K41P19j057N09J84j078P77k31o57R13n32k29R91o67J21O47r27
2688c51O45J56r82Q03k96n73R01m87k85Q95p79K83O68r55N59L61j019P71k99n47
2708e31R11n37k38R05q56J54P66r64M93K16p95P19j44o06R18n33j71Q36q26J44
$$ plain form
2572 622 -282 -85 553 -359 123 373 -551 225 35 -829 180 -134 -503 551 -143 -66 948 -178 173
2591 173 640 -376 446 158 -631 253 -303 -720 393 -489 -327 714 -309 164 506 -449 305 185 -574
2610 -574 329 -224 -593 435 -470 -362 523 -477 2 467 -526 353 302 -425 566 109 -159 622 -239 -203
2630 -203 415 -495 60 349 -653 156 165 -562 626 49 -118 748 -110 -32 516 -492 -129 124 -834 -192
2650 -192 -119 -772 335 9 -128 746 24 244 804 -364 177 292 -733 -83 -93 -834 230 -188 -289
2669 -289 621 -75 166 885 -172 337 521 -557 220 -11 -668 245 -287 -516 475 -192 -71 576 -351
2688 -351 294 450 -532 271 -25 -598 303 -184 -469 426 -353 -70 598 -357 202 563 -456 315 16 -531
2708 -531 380 -157 -395 510 -346 -192 574 -390 103 319 -476 243 99 -507 411 -122 -293 543 -283 -139
2728a39O63q78N93P4p56P84m10n46Q56n38j73Q39o01L01N64q14N39J39q12O98
2748C83l58m61P45n70k89Q04o49K59P06q66O70P7q01O74j56o09Q00o59j85P69
2768B84o95L54M90p94O97K4p08P83k15n82Q55p21k13P65q17K34M92o85O21J56
2788C25p49Q32j48n50P54n84j92Q36r52K98M91q50N36K56p85R77m13m71Q68o32
2808a53o4P96q06J58M53q79O23J93q68P58k68k74O73n31j03P41q89M42L56r08
2828e50O84M1n98Q32l18m56Q69o93K6O33p62L12K64p28O70L4o49P27k22l81Q31
2849E66o67n1O45q16K86L33q30N78J25o44O95j52n09R29o88K2N96q26L26K08p93
2870f67Q14l2n82Q69m34j99P91o54r1O99p26L09K42p10N36J31n84O64m61k87R01
$$ plain form
2728 -139 524 -354 239 313 -443 341 -69 -615 241 -297 -470 369 -232 69 633 -181 358 497 -315 383
2748 383 25 -436 309 -261 -550 254 -395 -136 570 -296 374 451 -350 324 168 -441 359 -300 -485 284
2768 284 -411 -57 433 -361 336 360 -348 435 220 -362 493 -228 -441 324 -493 -259 233 -452 169 325
2788 325 -424 408 260 -290 464 -120 -312 524 -428 -130 361 -489 47 303 -482 495 82 -389 479 -153
2808 -153 -217 579 -227 -69 384 -495 128 321 -547 211 -57 -331 342 -189 -292 449 -440 2 358 -550
2828 -550 134 175 -423 409 91 -365 504 -189 -163 470 -292 20 284 -444 226 260 -389 338 116 -265 566
2849 566 -101 -152 493 -323 -37 296 -534 44 169 -475 220 68 -441 488 -200 -178 418 -408 -82 126 -667
2870 -667 147 115 -467 402 -32 -231 560 -94 -185 514 -212 97 339 -371 165 296 -288 376 -85 -372 529
2891E29q13J84N00p73L46K86o84O74l4n81P34l84l33P51o61l2N67p36L12M01p26
2912d73P06On78P25l81l11P65p13R3N21p81L99L68o97O37J36p68Q50l43m79P20
2933D02n54j44O03q24M14L75o96P12j30n56Q52m59l54Q84p93J00O13q12L50K67
2953B50p69Q09j27n89Q09m37k36O45o74J25N62q23N99J76o63N36p9n42P53l93
2973f8k25P89p82J37N17p34M54K25q52P28q6n54Q33n17j41P70p07K8O59q60N30
2994A44K29q79Q09k23n55R03n49j62P11p55K49M50o71M14J67p21O84k04m30P03
3014C14m26p3P43p54M7O40q47M44J51o62P56k40m97O54l81l02R14p54L18M07p60
3035c08N45J33q31P43k25l81O48m50k76R02q53L77M32r57O44Q2n77N81j63m23
$$ plain form
2891 529 -284 -100 400 -373 -27 259 -425 249 215 -366 368 -16 -349 402 -259 -291 276 -460 -148 253 -473
2912 -473 233 239 -339 386 5 -306 459 -254 -161 360 -421 -22 346 -351 286 422 -346 504 161 -318 402
2933 402 -152 -296 307 -517 -103 272 -424 288 158 -398 454 -5 -359 525 -268 -168 445 -367 -17 250
2953 250 -519 290 163 -426 383 -54 -290 355 -319 -194 368 -455 144 320 -343 193 114 -428 325 -68
2973 -68 -293 496 -286 -149 368 -366 88 313 -539 189 103 -451 382 -135 -276 494 -213 -185 474 -386 144
2994 144 373 -506 303 80 -475 428 -121 -283 428 -327 -78 372 -299 115 282 -439 245 41 -389 314
3014 314 -112 -185 558 -196 -149 491 -356 88 239 -423 333 93 -404 250 -131 -433 481 -273 45 452 -308
3035 -308 237 370 -461 282 57 -324 324 -126 -402 500 -353 24 456 -501 143 225 -352 229 66 -357
3055c57O92m72p1Q26q45J33M78p10N33O8p31P12k73m40Q71n12j96P00o85J89M07
3076C17p54N53J97p02O58j54m23P47n85n8N82o44J05N79q16N16K61p33O79k55
3096G0l88O69m48j23O81q55M06K83o33M38K47p37Q34l49l75O06o17j0N48o66L36
3117h3K99n49N82n6n96O89k51m28P99m63j96O11o17J92L77o51M49J4n53O98k49
3138A8l45O71n80O2O20p72K90L33o94O16L6p12P73k63l78P26n75N0N16p52K89
3159g1M04q06N79J46p14O11j72l50P13m22m2O09p81M18L58q05N57j05n50O82l89
3180a30l62Q31o21J21N28o71L45L18o05L82J09n89P04l40l93O27n40Q1N67o25
3200b63J94L45p24O82j67m89O89k56k92O95m78KM53p50L87K61q47O95l1m73O06
$$ plain form
3055 -357 335 -137 -208 618 -227 -94 384 -326 207 275 -456 256 -17 -457 414 -98 -294 406 -279 -90 317
3076 317 -437 116 313 -389 269 115 -308 439 -146 -204 378 -266 -161 418 -398 118 379 -354 325 70
3096 70 -318 351 -97 -220 461 -394 12 295 -338 100 347 -390 444 95 -280 326 -291 -301 247 -419 -83
3117 -83 216 -333 249 193 -403 286 35 -393 406 -57 -253 358 -259 -67 310 -341 108 122 -431 267 18
3138 18 -327 344 -236 -174 446 -326 -36 297 -397 219 255 -457 316 53 -325 401 -174 -124 392 -360 -71
3159 -71 333 -473 106 252 -462 149 -23 -373 340 -82 -124 485 -296 122 480 -325 232 127 -423 259 -130
3180 -130 -492 339 -282 -161 367 -304 41 359 -246 136 245 -344 360 20 -373 254 -286 -205 362 -263
3200 -263 -69 276 -448 234 67 -422 267 11 -281 414 -64 -62 391 -359 28 289 -558 137 106 -367 239
3221B39l91j17P84o35m6O56p27K23K53p18N85j63l84P47k81l00P01n88J61M42
3241D41p35M23J43o96N56kn70P29l37j95O19n95J69L40o65M21K73o14N88j49l44
3262b00O35n78j26O10o48J03M79p30M09J63o77R12j96n34P83l80j31N70n75K3
3282h8L55p07M45K17p30Q74j23n88P68m07j58N34n10M4N13p83M38K44p21O83q4
3303B16m91N97l36j97O07n62j9N13o09M59Q7o42N83j30m13N95m66j43O04n13J26
3324a34M85o89M28K51n20N79j71m91O49n02j97M86o13J64N18n21L94K14n90N71
3344C11j87k99N70m16k92O51p24K06M35n43M50R5n99O99k81m43N81k62j87N13
3364B78n99K30N16p68L73J62n30N91k22l73O61m29j24O45o43J16M04o22M53K8
$$ plain form
3221 239 -152 -269 515 -120 -166 490 -237 -14 239 -479 106 -57 -441 306 25 -275 426 -162 -1 441
3241 441 -294 129 272 -424 132 130 -440 289 -48 -243 376 -219 -50 290 -375 46 319 -295 293 144 -200
3262 -200 435 -143 -269 341 -307 -204 275 -455 -46 117 -560 352 156 -378 405 25 -106 464 -111 -88
3282 -88 267 -440 5 222 -508 366 243 -345 423 16 -142 392 -118 -74 439 -344 94 338 -383 300 216
3303 216 -275 322 -14 -211 396 -166 -185 328 -281 178 265 -377 206 76 -337 258 -208 -351 253 -260 -134
3324 -134 351 -338 90 341 -179 400 229 -262 387 -115 -312 174 -439 -275 243 -278 116 330 -260 311
3344 311 124 -175 395 -21 -313 338 -386 -180 255 -288 162 257 -342 357 76 -367 214 -48 -235 278
3364 278 -321 -91 425 -343 30 192 -338 253 31 -342 319 -110 -234 411 -232 -116 288 -334 119 147
3384A47n41O58k17m64O87m96p0O74n74J75M02o86N32M4o55O95k88l77P39o22j5
3405b52N11n40J64L63n06M15n5l46M20j97l99O90m14j33N06m50J34M25p32M32
3425C6J15m91O56m04j76O41m67K2L89o59M13J13m14L53l9m04N39j97k93N60l07
3446a4j37N36o00J45J47m81M46K8m77O45l14k27P19n93J8N04n66K89K62o51M81
3467A60Ln49N59k40k92O73n26lO11n71J08M42o01N18q5m40M91l49j90N71n72J33
3489a49L75m90K35J95m12M38J0n39N97k48l27O62n57j3M59m88K51K13o49N76J7
3510A56m16N07k60j20M00n15J45L56n75L82K00o50M90km65P32l83k12N96m37j1
3531h2L79n19L12M5m78M27J00n81O60l43j66N71l85Q3K14m80L09J61n10N38j31
$$ plain form
3384 147 -394 264 47 -417 270 -226 -296 378 -196 -21 381 -305 227 271 -384 311 23 -354 385 -237 -252
3405 -252 259 -281 -117 246 -260 155 100 -246 174 -23 -422 268 -146 -279 227 -223 -89 336 -396 36
3425 36 151 -340 316 -88 -264 377 -90 -68 321 -338 75 188 -226 127 88 -316 223 26 -267 293 -14
3446 -14 -151 385 -215 -70 77 -404 42 70 -407 238 -76 -303 416 -177 -159 345 -221 68 330 -321 160
3467 160 163 -386 173 -67 -359 314 -212 -215 396 -175 -67 375 -226 292 207 -233 258 -91 -281 290 -282 -149
3489 -149 226 -264 -29 166 -246 192 202 -337 260 12 -315 347 -210 -223 236 -252 -1 212 -437 139 156
3510 156 -260 247 -13 -133 267 -248 -103 253 -322 60 260 -390 100 98 -367 365 -18 -230 366 -71 -82
3531 -82 297 -222 90 135 -343 84 184 -397 263 -80 -246 325 -60 23 237 -243 66 227 -283 255 124
3552A24n84P84l29j61N23n06J8L85n13L21J34m67M13j5m75N81k71j30N61n35n4
3573a96M61n21L68R3n17M72j27k34L95k84j35O15n07m5L66m56K48K26n96L81O4
3594G1l77N88l24j29M79l45J30J27n05K86N6m47N43k14l62P11n03J58M36n91J98
3615a4M43o21L38J63o19L86m3l90N55l44n5N76n67J28L23n43M06j6m13M27j10
3636A0l07N90n39O4L79m16K07K23l63K02J50m14M94k06k49M58l19j68M79m51J10
3657f6J52l75L64J96l39K69rl16N33m13j53L88n65J32L71n63M55J54n63O15j33
3678A34k35M28l78n4M36n43K40J15m49L22J54m74N18j08l12M25l78j7M51m73K30
3699C2K71n21K89J80l45M09k85k53M51m13K0L10m43L22J96n15M33K5m84O14l03
$$ plain form
3552 124 -460 324 -5 -166 357 -149 -131 254 -259 62 196 -271 142 127 -348 233 -38 -168 393 -142 -196
3573 -196 265 -256 112 205 -312 160 33 -201 194 -90 -225 390 -117 -162 204 -252 -4 222 -374 7 71
3594 71 -306 282 -42 -171 308 -37 93 220 -285 1 57 -390 153 -61 -423 288 -215 -57 379 -212 -14
3615 -14 429 -192 146 309 -310 76 33 -357 198 -146 -201 375 -192 -64 259 -284 122 106 -307 120 10
3636 10 -297 293 -246 -182 197 -219 -12 211 -152 50 200 -214 280 74 -175 283 -36 -204 275 -176 -66
3657 -66 86 -289 75 271 -68 201 192 -124 409 -4 -157 231 -334 -202 169 -394 61 215 -348 267 134
3678 134 -101 327 -51 -105 331 -212 28 143 -306 16 170 -304 214 106 -206 219 -159 -176 275 -198 32
3699 32 303 -218 71 251 -94 315 30 -223 228 -185 -165 145 -298 24 220 -295 138 163 -321 293 -10
3720a0j91M50m28M7L84n20J05K25l59M01O4l16M62k54j90M83l88rL13n54K86J37
3742A38m42L57Ql07M50j25j68M63m99O8M61m38Q1K37p11N08o3k35L33k14j28L84
3764A58m38J45L50l24J53K10l80K95K2m35N86l59k76M85l23q1M50m49J68L43n23
3785b23N91j75m09M95l62q1M57n90K32K52m45J95K13l61K56J54l96M79k70j55
3805a43M79n03J0K92m62J80L53m03K08J18k52M50k36j71M09n02J11J99n17M46
3825F6Ol94M03Q1m27M84k13j71M44l17k7K31m55K62J36m87N01o9l26M50o5l29
3847b16M39l98L0K45l21K52J43m26L42j6l10N17l30l2L52m01L0K44k20Q8J39l84
3869b33M25j25k02L38k18q8L83m20J5L82m84J98K10m38L25l8j81L49l34o5N03
$$ plain form
3720 -10 -201 249 -179 -132 252 -268 -163 62 -297 104 168 -148 314 60 -130 353 -35 -44 269 -285 1 138
3742 138 -304 53 61 -246 204 79 -89 374 -125 -57 404 -34 47 284 -427 81 18 -217 116 -98 -226 158
3764 158 -280 -135 215 -109 44 254 -126 169 191 -244 342 -17 -293 192 -131 -212 238 -211 -43 300 -223
3785 -223 368 193 -216 279 -83 -164 293 -297 -65 187 -258 -63 150 -211 45 199 -197 282 12 -143
3805 -143 336 -167 -157 135 -327 -147 206 -197 11 129 -123 327 91 -80 329 -173 -62 137 -380 66
3825 66 72 -322 81 162 -265 219 6 -165 279 -38 -65 166 -289 -27 109 -378 123 54 -272 178 113 -216
3847 -216 223 -175 -145 100 -221 31 174 -252 90 74 -236 281 -49 -81 271 -130 -100 144 -76 12 151 -233
3869 -233 192 67 -135 203 -15 -103 280 -140 -125 257 -227 -29 181 -257 68 30 -151 198 -136 -201 302
3890C02l56N0J64m77J87J53k25J99N7k80N65l43P9J86l37N0L31n02J93R1m20N77
3912B44j58k98M31l91J35L18l62J22K44m13K18J0m55M64q8k48K38j39n3M08k93
3933f6K09J42n25L44J46m33K19j07j89M15l61M4M54m82K88J08m00K21J84l94L93
3954B10k51j37L65l62L7L52m09R1J70k66K21O7l81N86k87j40K52k86K6M13n35
3975b64K15J66l46J84K41m17L39j46j81L88k46J6K75l85N6K65m69M29J1l03L86
3996B14j79j33L97l58k4K76l55J81J89m75K79J9k64K96j30j56N04l11RK72l63
4017a12J38J00l39K59R2l22L70k40j50L51k46N1K77l04mL07m16J95J73l96L18
4038A02j39n6L21m21J71J75l09J23J53l95M20o7k89L27j7j86L66m70K76Q1m79
$$ plain form
3890 302 -54 -4 160 -317 -130 23 -202 -3 54 -226 339 -4 75 261 -76 -26 305 -197 -4 87 -333 244
3912 244 86 -212 219 -172 -37 281 -81 41 285 -128 90 100 -355 109 21 -227 11 -128 -181 227 -66
3933 -66 143 285 -240 104 250 -183 36 -71 -260 155 -206 -162 292 -190 98 206 -194 27 211 -183 210
3954 210 -41 -178 187 -175 -138 214 -195 -104 66 -200 21 88 -293 293 6 -134 118 -168 -142 271 -264
3975 -264 -49 117 -229 -45 196 -221 118 -28 -209 179 -67 -51 224 -161 -105 160 -309 120 131 -172 214
3996 214 35 -98 299 -59 -83 193 -162 19 208 -267 12 31 -233 63 -67 -223 281 -30 -21 251 -112
4017 -112 26 126 -213 46 138 -184 186 -54 -204 147 -99 -48 229 -75 -79 228 -188 7 180 -216 102
4038 102 -37 -93 228 -193 -22 153 -156 -33 120 -275 145 78 -211 116 99 -87 279 -191 85 166 -313
4059c13L12M8k76M18m7j92L05k21j74M20m46K24J18l51J43K16m40L05N1l39M15
4080A76k82o2M94l96O7P9k01J81M2l28L83j58k55N26l69mK62j55MJ19k93J09K89
4103B28m73K57J42l97M58k81j4K47l56K32K65n28L21J26m34N26k11l65L76j13
4123Fk52K81j62l7L13l71L71j4k15K79l8k24J78k02n6K02k65J05K25l71K63J02
4145A18k95K93q5j32L22j39j69J88k84J38R1k65K60Q2k94L47p5n8J99l44l1L19
4167A86l35r5L26j75J40n5k70L67l6k65N20l26R3J77m11R5J54l64L04o6j98L03
4189F9j13k18N60k52k18M20l32J54J46l49J08J26l23K30n2p6L23j84q8K04j99
4210f4J60P8l93L03Q6l64K80K4k15L06l10J8L48l91J20K31k66J32jj83K91k89
$$ plain form
4059 -313 -1 47 -229 189 142 -50 255 34 -140 280 -166 58 176 -175 -32 184 -256 49 100 -239 176
4080 176 -106 -168 326 -70 -3 76 -125 56 98 -230 153 -5 -260 266 -103 -107 155 0 4 123 -170 -61 228
4103 228 -245 12 154 -243 215 -66 -80 167 -189 43 308 -220 101 227 -207 319 108 -257 119 6
4123 6 -246 35 -127 -164 149 -222 149 135 -80 199 161 -63 115 -87 -143 59 -206 -101 124 -247 16 118
4145 118 -177 116 31 -101 221 82 -87 101 -183 -45 46 -219 41 123 -171 176 101 43 242 -102 -133 186
4167 186 -149 -244 82 -93 47 -8 -278 89 53 -212 308 -18 75 252 -159 -64 90 -274 30 -36 -234 69
4189 69 -44 -262 298 46 -172 248 -84 70 216 -133 -25 101 -222 8 -44 -120 203 19 -69 135 -64
4210 -64 96 174 -219 84 170 -194 86 110 -105 201 -109 -91 257 -134 -14 217 -49 83 82 -101 190 -99
4232i9q8L49k42Q3J69m09J08L04l95L93o4l55L52j09j19L57l15K5K53l22J51q
4254A9k81L00j14j15L30j47j07L16l15J05J42l34J73J86l54K33Q0l81K58j7n0
4275g3K79k99p7L58l17J60J67l65L40j7l71K80o6j43L93k21q6L03l84K9K61l81
4297b30L37j64j61L33n4k37K72j98K1J77l33L21Q2k25J63K3k18L36k57o7J37j44
4319h6q4M18m15K51l0k34L44r1j28L52k37j28L32l60J43J70m44J32J87l35L19
4340G6k1k81K05J03l56L55l32J75K53m05K89P1k96J61J23l04L50k04p5L59l13
4361f7J50Q1l33K17Q4l06L05k00%K04j77j50L96l86K16J77m88L51j1l04L54n7
4383E6k09L98k19k33L23k92O4J75j70J05L2k02L06j11k32L74l09PK80l31J57J81
$$ plain form
4232 -99 -187 162 -80 3 172 -237 -129 175 -220 173 109 -246 106 -3 -122 235 -80 -55 198 -124 27 19
4254 19 -262 38 -76 -191 139 -8 -115 201 -114 -9 133 -201 -28 158 -196 37 117 -264 -6 -23 -73
4275 -73 206 -93 -170 188 -129 31 198 -167 173 156 -215 65 -1 -144 249 28 -58 245 -139 -110 151 -230
4297 -230 107 -57 -218 115 61 -176 96 -102 -81 96 -237 84 166 -59 104 127 -91 245 -12 -79 58 -86
4319 -86 -170 248 -167 84 54 -180 164 73 -55 297 60 -68 264 -96 47 217 -227 -95 92 -243 76
4340 76 55 -226 -21 82 -274 81 -251 -76 177 -228 61 132 -164 -3 120 -184 166 -38 -113 246 -67
4361 -67 83 164 -169 48 132 -174 131 -69 -69 135 -42 -192 204 -182 34 211 -277 74 63 -241 113 56
4383 56 -153 245 26 -207 116 -176 -112 63 -107 -2 30 -172 134 23 -209 165 -144 -137 143 -188 -31 150
4405A50k82J22J00k15K69k7k23L36l68J08K83m27J7K76l11K82k8k87L81Jk31K95
4427B21k80j06K58k84J62J24l61K98J01k37L96k60k68L61j53R6M4k55J06J47l12
4448b02J93M3k47K94N8k35L03l89M3K69k58K8J94l45L32m3k35L69k12k6K41j70
4470Er1K23l00J39Q1k83K38J13m00M56j43r1L56l54r1J81j50K0K06m02K39Q7k83
4493b44L82j17j69K89k55N6K41l27O4Q4j98J53R1k31L89j87o4J87j66P4J15k79
4515a12M9J50k85K32n8k41M95j80r4J82j61O2J95l38R7mk05L28r4k33L81k22k9
4538h5J82l5j40K13k93J83P1l57L60j77p7L20j90j25L56k96J08J06k68K60P3l53
4560a64K43o6k26K91j59j09M13k81PJ53k55J45J21j46J34M7m05M10j32j05K50
$$ plain form
4405 150 -132 -10 90 -125 144 117 -106 230 -138 -30 253 -174 -157 119 -192 90 62 -225 156 157 -74 221
4427 221 -59 -165 93 -191 -29 95 -266 32 133 -104 292 32 -236 125 -28 68 112 -143 -37 110 -202
4448 -202 -9 34 -213 81 139 -96 207 -182 -139 130 -128 -100 94 -251 81 38 -197 172 -40 -66 175 5
4470 5 -86 137 -163 -24 57 -226 12 125 -275 181 38 -53 303 -51 -142 39 -111 -91 115 -287 -48 39 -244
4493 -244 138 21 -148 141 -114 -58 183 -144 -80 4 -194 -41 50 -181 208 21 -43 144 -22 52 167 -112
4515 -112 -63 87 -198 34 -24 -265 230 50 -44 138 -23 39 234 -104 -7 -11 -216 112 18 -215 166 -56 -85
4538 -85 97 62 -78 135 -158 25 96 -261 99 -78 -155 165 -25 -150 206 -90 18 124 -144 116 189 -164
4560 -164 79 13 -213 78 -81 -190 223 -58 -51 102 -153 -8 113 -33 101 148 -257 153 21 -84 166
4581A66k08j43M47l74K32Lk41L21j58j96K36j45o6K08k94J73J76k41J58mj60K14
4603A04l6j84L69k18j00J45k72K02J50k45J02Q2k63K83Rk59K61k49J22K51l19
4624f5M9R8k44K78%l01L70j94j21L50k21j22K70k10j7K11l04K39j25j23K17k8
4646Gr4K25j91K7J38j67J3J85l41J80J52k90K74r1j25J44q9Rm2q9J08K01k30J55
4670F9O5k75K80k1k17J23L9j87L39l27P8J68j18Q9M8k62K18j7j44K50j92KJ00
4693A08j58Q7L7k28J82o7k03M01p4j69J95r4J6J49l40K24o5k03L15m2q8J61J6
4716A60k35J57j50J2J37k73J83J69k57J43J7k32J70J1k04L38j96q2J90j51K29
4737A36n8j00J22j6j72K43k45o1L14l16O9L66m05pL83m37K06J18k08K62k83J0
$$ plain form
4581 166 -42 -185 262 -112 120 123 -118 203 45 -151 85 -60 -126 82 -212 -39 137 -104 54 50 -110 104
4603 104 68 -116 253 35 -65 80 -192 10 160 -85 17 99 -164 119 128 -131 130 -119 3 254 -65
4624 -65 -16 82 -162 116 116 -185 185 -9 -130 220 -1 -123 147 -63 -80 131 -173 66 -59 -182 35 7
4646 7 -87 138 -53 -26 112 -55 -42 143 -198 -18 134 -156 118 27 -98 46 -43 -34 -76 -165 -57 144 -86 69
4670 69 134 -141 139 118 -99 24 63 -124 215 -112 -34 134 16 105 153 -109 109 92 -52 198 6 8 108
4693 108 -50 37 74 -154 28 -39 -242 159 85 -84 111 17 33 182 -158 66 1 -202 113 71 -17 144 160
4716 160 -75 82 -68 -56 81 -192 -9 160 -97 46 63 -169 1 12 -192 146 -50 -132 58 -93 136
4737 136 78 -22 100 84 -88 155 -90 -151 163 -153 -84 282 -123 -130 253 -184 22 140 -68 194 -89 -79
4759g9J42j54PK16l05K23l7j72K63R6k77K19o9j64K49j97m1K79k68J22R0l22K30
4782E1J12l14K22o7j78K92k06qK50k30L5J42k30K00q3j09K99j18k07K21j79J20
4804A5M8r4JR4j11O9j18j6R8K5r4J64j50mJ79j43J24j7j27M7O8j60K58q6j67K15
4830A18k00J08l3l4R4l2p2J05N4k46K65j80j88L70j20n2Q3j37Q9J02j80J61k3
4853E2o6J22o5k05K78k33M8J68j45O6m6j23J32l9p9K43j36j26M24l17L4K03l18
4876a28J65k9j22K54k31JK43k50J30Q4j51k5J17j51J57J9k16K68j31k1J48j63
4898c2o6J49j23OJ26k01K40J5j47J79r0j45R8l7M5R1q4K1J12k53J20J59k73J86
4922I6q7j20J50j56M9J29j10J04l4j89J67K3q9M2N8pO8r0j32K20k52J08J68k68
$$ plain form
4759 -79 63 -91 -84 132 -173 50 13 -159 104 200 -77 142 73 -91 158 -39 -80 199 -69 53 143 -179 51
4782 51 163 -151 71 4 -174 118 -88 -96 154 -76 -41 101 -129 71 -12 -121 178 60 -147 74 -105 15
4804 15 63 -31 -30 64 -47 22 -96 -112 -14 11 -83 81 -69 -73 106 -37 87 70 -57 -10 58 -102 156 70 -97 118
4830 118 -82 26 -7 -41 53 21 -51 54 108 -138 127 -53 -241 129 9 -43 40 -97 -8 94 -86 75 52
4853 52 -14 108 43 -162 116 -117 -69 99 -46 20 -26 -149 -17 -56 -135 108 -28 -154 270 -47 -13 190 -128
4876 -128 37 8 -114 140 -91 -90 153 -97 33 117 -34 -59 58 -93 64 83 -133 135 4 -17 131 -32
4898 -32 -98 51 -72 -66 60 -141 99 114 -33 146 56 -89 9 -28 17 108 24 45 157 -96 24 183 -90 96
4922 96 9 -111 39 -117 -68 61 -49 55 21 -168 -1 22 -67 -25 33 26 94 4 -128 92 -160 -52 116 -152
4946a52P0J20k57L05o2l1Q9j23J6K06k24N7J99j27p8N4r9JL1j44L10j44k00J98
4970A5j7L7J7j08J01qo4O0o0J1J15j19l4J76j69OJ99j95J79j32n3J37k28j1J84
4995C9q2jJ13j28L0M7l3m3P1j29K30L8k05J29p2p3J56j42O5J26k65J41O3k07K21
5020H9j12q2J58%j72K38j66J14m5j43K08n7j15l8R3q0J97j37P0Q6k54J28L6j39
5044a23J35R8n4M7r2mR3r0j0J07k56J44M6j31J34Q0j84J84p9j34J95k43J52q8
5068g3k3M8J95j99J62Lk27K09j8j5jo1j1J48j97N0M0k2J01m2n8P1lj10k5j3O7
5095dJ13j63O1J01k53K09Kj07J02q5j29K66j42j27K90j58J11K6k94L52k9k93K01
5118E0l1j42J78j59J47J2q8J7J35j76J66j61K6R5n1j01J77k30L0K87j47LJ88l19
$$ plain form
4946 -152 -82 38 -219 86 24 -7 82 -41 -25 181 -43 14 213 86 8 62 -37 -36 -5 -149 161 17 -183 15
4970 15 -2 35 52 -56 45 37 -27 33 -27 -16 99 -20 -54 122 -47 -41 158 -37 142 10 -43 94 -134 -145 39
4995 39 -43 -44 69 -59 -29 18 -15 -58 13 -116 114 152 -53 76 4 -69 87 -55 10 136 -129 12 75 -132 89
5020 89 -23 -105 53 53 -119 119 -47 67 22 -121 87 30 -85 -123 -30 -110 87 -50 20 106 -148 -20 16 -123
5044 -123 12 110 56 103 11 7 100 10 0 107 -149 -5 41 -90 44 124 -60 124 45 -89 106 -137 15 -73
5068 -73 -96 -48 147 -52 110 113 -114 95 77 62 61 0 -11 137 -60 -10 30 8 109 67 9 80 77 -33 -58 -71 -4
5095 -4 109 -54 7 108 -145 64 66 -41 61 -24 -153 113 -29 -156 134 -24 87 113 -181 171 142 -151 50
5118 50 19 -123 55 -104 43 55 -33 -16 119 -57 109 -52 -26 69 18 -83 94 -136 -106 181 34 37 225 -94
5142i4K06p1j00R7J4j23K2rj78L48j89K9J10k21K37N3k62J47L4n2J96k83K1K90
5166B22l39J76N3j66J26Q0j84J30m4j38K22k43J55N9k40J61p0r6K05p2p9J66j28
5189d4J5P3p2j5J77j54J0J22j98P6l5m8J39Jj23R7n1R1J08l45R4J39j55J51k8
5214B5j88L73l36J35J17j77R3k4n0l8J01j61J98r5j04K10j52O4J06k19J35J36
5236A49k19N7j6l0R8r7j7R5q0j1K89l29Q5J55k88K25p3j05M8J18%K2pl0J26k27
5262f2J4J75k73K73o6l4M2k3nm2L0j9N9o6j05K08j37J5M2p4J24rj53R6o9O4jr3
5290h9J53m3j95J98J09k54K65j12q8R5L3r5Q2p0Q1M9k04J45q2q7J59l7rJ20k19
5315i5O1J03j10P8or0J72o9p3k7J58j37R7r0J0O5k02J34N0r8J26Q4k02J31q3j13
$$ plain form
5142 -94 112 41 -59 38 52 -71 -49 -58 -236 112 -77 -48 62 -159 78 131 -131 16 50 -2 194 -89 -68 222
5166 222 -117 59 112 -54 72 152 -32 98 54 -84 138 -105 50 109 -131 30 -40 -136 69 -3 -82 84 -44
5189 -44 -29 44 -28 -43 134 -20 -10 112 -86 -10 -45 -93 46 47 -76 21 -30 61 169 -176 -82 57 -98 53 25
5214 25 -163 210 -126 9 126 -51 42 18 -32 -70 31 -130 68 -27 -131 79 -73 -9 97 -122 13 149
5236 149 -70 -13 -29 -59 39 -58 -75 20 -60 -71 218 -111 -26 129 -159 66 -7 -112 -64 54 54 76 69 39 165 -62
5262 -62 -48 127 -146 127 61 27 69 46 41 -1 29 10 69 3 -102 106 -31 -16 26 -48 76 67 -86 10 -59 5 4 -89
5290 -89 64 21 -174 24 133 -121 144 32 -56 39 72 -23 59 -11 70 119 -85 60 -22 -109 50 13 4 124 -95
5315 -95 -34 69 -41 37 31 -59 113 44 -29 -56 102 -35 62 -28 -18 47 -155 -21 29 -69 57 141 -61 70 -13 -126
5341a26K60k43l2K86k33J63jk49K06L5j00J12j9j10J22j24l9K02j63P5q8j10K08
5364C2L2j23J85j88n8L07k49Q6Lj38J20lp7R3J02k53J99j08M5J39j17M0J7j08
5388b2K4N5j21L5M9m6K44j77o2J88j46lO8l9pl5r3J97n1m5J47j29j11L5J7O8q5
5415d5j03K89n8j67Q3N6j7J9L2k50K23j36L3N9l3J05r6k9J56P9j73L0nr6J67k70
5441a47K17P7k18Q3L9j01J43j60r8K62r7r7J58k41K34M9k56J67j5q2J79rj98J95
5465H4j45L3P4l4n6J19j42J76k1k07K81j58n0O7R1j60Mq7k9K40j7j16J52j76J98
5490A21k51N1N7mK9J42k16Q1J89k43Qlj50K18n2j46K10j16M9K38k56L1R9k34J59
5515A1M6j17J11P7k35K74j47l5O3q5J44m9r3O9m0l1K9p5j0J44Qq5Q7o8M1J59j54
$$ plain form
5341 -126 134 -109 -141 145 -88 75 74 -175 31 66 -34 78 59 -51 71 -53 -92 110 -53 22 -66 -176 32
5364 32 64 -59 126 -62 -120 187 -62 24 27 -111 9 6 -71 22 124 -129 70 -38 7 146 29 69 86 -22
5388 -22 2 57 -64 -29 20 -26 218 41 -21 167 21 18 86 47 40 5 -88 109 58 13 160 31 -80 -45 -28 40 -45
5415 -45 -148 141 83 -84 -1 55 38 57 89 -161 62 -74 -41 18 -15 90 -6 -35 121 200 27 57 52 -44 123 -147
5441 -147 70 147 -71 12 51 -50 93 -67 -165 97 0 -97 61 -180 54 103 -153 14 -1 -83 96 87 -111 84
5465 84 -61 -28 46 12 -44 75 -67 109 88 -119 162 4 -46 21 112 -48 -44 -131 -160 80 63 -53 99 -77 121
5490 121 -130 -79 -22 -26 3 145 -71 10 199 -44 -36 -39 -189 29 -23 -169 41 -75 -26 212 -44 -13 86 -148 11
5515 11 57 -60 51 128 -107 167 20 -15 48 -37 107 58 -35 34 -6 -37 -8 -83 -93 51 59 -26 61 -7 34 193 39
5542C9N7r2L3L2l8o8P1n3r6Q6j9mM7o7J87j18o8J19l7OL8Q4j13N4j51R4j4o5R1
5571C5j9n6Q7n2o9N1l0nM2l4P5p9n4J7M8J10p7N3o5l5j5L3J08r7P7L0q3K5N5q5
5601iR9j32K0L7L9p2P3o9P1O3k43J27N4j89J96p8N4m1r5p5J49o6j1J94j64J12
5627D4L2p9m6lL4J63k08jQ8j70J48Q8j36rJ22j42J14p0R0k9q0O8J4l3J5j7j13
5654a16J40mk62L38n6k1j52K9N4Q4q2K8M3j25J72p1j88L13j24j35J95q0RQ2j12
5679d1k4J71k18J22m6o8J76J8j79Q9k1j31J68k4j7j0m0J57m3j05P2Q9j71j0O6
5704b0K2M5j24L8J05j46P5J03m9K6p1M1J62k79P4N8j59J25Q1j09Q5r2o5rJ69j23
5730c7J34q8O1j7l3Pp6P4R5j36Lq8L6P6j8K6j15J27j28J40k2j11K8J38j42K10
$$ plain form
5542 39 96 4 37 69 31 -37 34 -19 -115 -29 -48 -52 -5 -72 115 -3 -71 48 11 17 55 139 26 80 -71 23 9 -56 35
5571 35 16 -40 47 -5 -74 -23 -53 -58 -16 -50 25 -54 -108 -91 -43 67 -10 43 -22 -57 -72 -39 69 -28 49 79 -4 21 76 -9
5601 -9 90 -42 -22 15 54 -18 55 -14 57 120 -123 4 58 -131 65 -13 41 0 -95 -170 -21 -87 -98 96 -68 44
5627 44 76 -3 -49 -52 -18 145 -63 -64 24 -146 2 90 -46 -55 67 -75 39 -31 59 30 -50 18 32 -1 14 -3 -116
5654 -116 24 20 -242 96 40 19 -133 -104 -50 34 -48 -20 23 -102 70 -1 -189 124 0 -135 60 -20 -11 71 -41
5679 -41 -65 106 -112 10 -36 -104 72 90 -89 0 -21 -152 16 -8 -25 -35 -75 82 39 -66 6 95 -76 -86 -20
5704 -20 2 47 -77 -39 66 -80 -5 98 49 75 4 45 207 -72 2 60 -99 26 107 -2 83 -9 -74 -83 86 -37
5730 -37 97 9 70 53 20 27 -49 25 120 -16 -13 -101 -65 11 -7 19 -96 31 -97 43 21 -90 -62 76 -66 144
5756A44p3Oo9N7r7J90j32r9Q0j45K46k0p5l8M2J3M4J7r8J24j01P2r8m8K6j2kJ10
5784F4r3k0R0o3R0l2j27J15p1N5J7j0j31J79j07Jj5L3k9J11j39J79j53Q8RJ04
5810A45p1j03k9P8k5O7K9j30o0N8k0j19K17q9Q1P4j26k4J37j70J5Pj10J61L4L6
5836F3j62J37j01R4l9j6O7m5j9Q2j65J33jk24L20j20L4N5j16J63q8m6j02K01j12
5861gP7m3m1lo9M1q3J52m2P5m0J8o2n2O0J42j76QN7K7M3j10ro5J00j37K43q9q9
5890g4L1J1J46j31L6j5n6o3J47oj40J13m3jK3K6O5j25K8M4m2k0N8j04J02O%j8
5918bq0K6J2M0p6J72q5oKn8P7M6n8M1j7j19J0J24j39L34k50N0j07J14k2L3j39
5945g7Q3M7o6O9q6J4RK8J3q0m5J62q4p8O9R8p1M4q6J7R1j64J76l3on3J2k7L4%
$$ plain form
5756 144 71 77 8 65 -32 158 26 -73 7 -138 108 88 13 -25 17 30 74 91 -7 117 16 88 -10 -58 -32 -44 -46 64
5784 64 -29 -49 41 -22 68 36 -91 24 -47 8 25 15 -116 63 -44 -43 -58 -25 -54 57 -82 97 -56 32 41 145
5810 145 74 -29 -58 20 -5 62 91 -39 -99 -41 -61 -180 37 -52 29 103 -23 -47 90 -80 -65 -58 -168 -7 27 63
5836 63 -99 38 -63 31 -8 -24 43 -2 -21 61 -104 29 28 -196 124 4 38 93 -23 140 52 6 -96 105 -7
5861 -7 70 27 -14 -17 -86 -45 -128 24 -18 57 17 35 -27 -79 -19 123 -53 -45 12 39 82 -28 -37 -102 -2 -139 104 15 -74
5890 -74 -43 -32 114 -17 19 4 -52 -115 32 26 -114 -1 -44 -45 -22 4 69 -56 -28 16 -26 -46 12 -92 10 16 16 -2
5918 -2 -82 -56 -44 -4 -80 92 7 1 3 -55 22 68 10 51 34 -85 -75 49 -90 244 -6 44 -63 51 29 62 -77
5945 -77 6 53 -13 56 -30 -16 -7 21 34 -46 -91 71 -13 -91 -22 76 5 49 -37 -20 71 -93 83 50 44 -9 3 -24 10 10
5975A0j6P3l7o1P0n0%L0j19P6J09m9M5o0q2P3j00J22r2Q0o8J5j4O4M3j17J05n
6003D5l2m7J07j12O4o1J0N2n9Q4o4j10N4L9r9K22j25rkl7K01m4j50O0Q8o8jKm5
6032c7P8O6j50J3K8N4Oj94R7J05r7R3K0j08R2j02Q2j0J0L7on0o5M5J4n6L0n4L9
6061b0M2J9J8K1r7P1K1r0m7L7M8j18Q7R9j21pL9m7N2n7n3J13n9K5R3j12j3J73
6089A17j89K5Q9j33J98k3j53J26n1r9J97j71M5n1N9L1O1m2p6J03j75Q5L9m1Q8
6114E9Om0Lm3nK0J08l2k3j20L9K1L5j02J24n6j6Q2k8n2k6N7n0J7J26j30O0M4j41
6143f3R8Nlm5L6o9M2Jo0O6j7P9r0OK3r9J26J9q6j8J07p2P2M8j13n4L9R4j15m8
6173i1N3J75q0j98J78m9o6R9l0L9N4p1j45J11O1j11J40j12MO1q9J50l9j90K46
$$ plain form
5975 10 -6 67 30 -31 39 -11 -11 19 -100 -24 85 36 81 21 -61 12 -88 34 -58 22 -46 -31 -45 19 62 -55 50 45
6003 45 13 -34 73 -39 25 -36 -26 26 -33 51 -13 -123 -69 -30 -129 93 -32 -41 -43 -80 121 77 -73 -13 75 7 6 8 -37
6032 -37 41 107 -43 -30 -2 52 58 -136 -39 66 -31 62 82 -26 66 -36 46 36 46 83 77 27 -38 7 21 -35 -5 -59 -20
6061 -20 22 41 59 80 -17 54 75 -15 -62 -25 23 -95 -8 91 -30 -37 2 -45 7 -50 -103 10 -49 -24 69 -43 -56 117
6089 117 -72 -47 42 -91 107 84 -69 57 6 -93 104 -67 -22 -73 -14 17 78 36 -40 63 -112 -27 12 -29 59
6114 59 65 25 28 -15 -20 0 108 76 53 -67 -28 -7 28 -74 50 -6 -22 60 32 -20 -46 11 -39 -22 104 -26 34 78 -63
6143 -63 35 40 37 -8 28 -41 1 2 -58 8 -9 70 -20 -14 9 -90 36 55 -31 -49 58 -14 58 106 -7 -61 -22 72 -43 -91
6173 -91 -38 137 57 -141 37 -12 -78 21 -9 30 84 13 -132 -21 40 -71 69 -43 -39 22 -67 83 44 -146 100
6198A00j44J10Op8KpJ1l4J00k6j34J35l3k3K7j0J26k51K9J07Qm9J28j48O0J50
6224A62p0n0q0jN8j27K26j32j4P4N0p4k4n2J13rnr6J39j41J1J10j65J94j46N1
6250BK7lj09L9p5R8k4O1N2q1N3r4K8J9j0mm3Q1j12J44l3p8k5N5O4J05r3J2q0M1
6280A7o5J35n7m6J32j90M7N1j6n0J19Qj23nm0J37j45m8K03j91J65k9J7o3m5N1
6306c1M3N0j28P4p2P4k0j55J58J27k37Q3k0Q4l7O4o8m0P3J3R3j18p0O8q0J09P4
6333A11k54J98q1J9o2L9Lp6J17j08R6J1o8J2J3J03m0p1N7q6J09J8q7K3R6j41K8
6360b1O3J3M4j34k3R2j3o0L6m5J62m5j16J12m5n8l4J08n6K5j8o4M6o3J17J1o2
6387b8P9m5QM0l5K0oj34K2O5K4NN3j08O8K3lk7m7OJ47j19r9J13J39j28m2q5J79
$$ plain form
6198 100 -44 66 72 -6 -4 -11 0 -34 66 40 -94 41 8 -15 12 2 128 -123 -94 13 21 -28 100 -48 12 162
6224 162 92 42 -38 -39 19 -108 118 -14 -28 46 96 22 -2 -54 59 50 45 -51 88 -53 -42 68 -97 97 -49 2
6250 2 29 26 -83 -44 -119 -21 -45 16 68 -13 40 -54 -26 -7 -17 -21 -64 17 -95 49 16 -62 -87 -32 32 137 44 56 -24 17
6280 17 -48 87 30 -16 116 -74 -27 24 8 -42 77 85 -38 -43 -83 54 -91 -139 64 -127 38 9 26 -37 -82 -31
6306 -31 12 62 -66 8 -64 10 -10 -165 -7 120 -117 -34 -54 30 -7 57 -11 -51 22 35 128 10 -60 8 -72 37 111
6333 111 -143 55 -26 -7 -69 -30 -27 -103 14 -94 2 13 -55 -43 -30 73 33 -38 19 -67 42 60 -27 -4 92 -49 -21
6360 -21 42 55 99 -35 -58 34 21 -39 -3 -48 114 69 -47 65 20 -38 -72 36 -20 5 -13 -77 -31 -94 23 34 -28
6387 -28 51 6 14 54 19 39 33 -101 -79 -14 10 15 68 -40 28 51 48 21 -26 -20 127 8 -91 22 161 33 -9 -94 85
6416H5l8k09K19n8p0N8K4K1l1Np3r8K76q8m3J1K8oK0n4k5l6Q6m5L5j6kK8q2N8
6446b0O0m1Q1o2k4J0R7L3j23L5q6Q2k0r9J53Ol5l1Q5j11N1K7j64J51q5J0J0m5
6474e5L6l1P3k6jK7J0j0j22J66q1j2k1J53j30K9j0O4n2K7O4j29l2J6J40j2j19
6501c8K7PP8j65J41j34M8J63q2q1R7j7j97Q9J9N4Nl8L1j04J12P3j65M0R7oj43
6528h9K47k06K8L7O0Mr6O2n2m0R0k08K01j8J2j91J53q0O3J28j74K6J58j21j8O1
6554C7j2r2O6K7m5N1j46J32j60Q6r6K27J6J0o3m7N6m8J8q7R1l4q7J17J05nn3r2
6582b8o2J46j31J67j70M3N0j42J57j45R2J8q6J70j94K01j41j8N4M7o0oO5k9P4
6607G2j33m1J36j96J75jp3J43j28k8R6j92J86r6N6O7p8J18Jo5lm2k6LJ3k9M6M1
$$ plain form
6416 85 47 -162 57 -1 -71 -13 11 32 1 6 -67 -165 111 23 -20 -9 19 13 33 -21 -46 -82 4 -41 -6 -22 -24 4 -78 -20
6446 -20 40 -1 80 18 -6 4 101 134 11 46 -40 42 22 -77 76 82 47 16 101 -10 41 68 -96 55 -30 -20 -10 -55
6474 -55 -19 -50 23 -3 -4 23 33 23 -99 67 -14 -26 -47 106 -24 5 -5 59 7 34 98 -31 -63 -47 93 81 -38
6501 -38 -11 -4 74 -91 50 -84 -36 127 45 -36 61 44 -153 -64 -45 9 14 -24 7 -97 15 88 -77 -37 60 54 -89
6528 -89 158 -48 -20 17 77 81 -15 47 -5 -45 45 -163 38 20 32 -159 -6 -86 -23 105 -69 -43 115 -6 -24 37
6554 37 25 -67 -1 26 -19 32 -114 18 -142 -56 -152 75 91 101 38 -9 47 -1 17 -70 21 -13 -100 17 122 117 64 -28
6582 -28 -90 56 -75 92 -78 -35 15 -127 30 -115 -23 -5 -91 79 -115 86 -55 -73 -19 28 -32 -38 27 -2 72
6607 72 -61 -102 34 -162 13 12 -61 82 -46 -74 22 -170 16 -80 -24 43 -35 83 84 19 16 -26 -52 -49 -36 -65 -19 22
6635B2n4O5J8k4o3jj9J01p5lq0O4jK4J1O2q5l6J55r2m2J28l8j47R1k2M4pK3l1
6665a2J76k48Q9L3q2N9m1L7k6lK3J0q1R1j02J42P1j57n4J14k2p0R1n8m7K7RM0
6693IL6m5k3M6j46R3L3pJ8J11p1m8Ol3P1j8rJ9n0Q1p0M3o3QOm0P8K3l3j8k0k7
6725d0J9L8q2J99l9j27J6Q9p2J3p7OJ56j54R3L5m9nj5Q1j12P7j05P8R6j22N2o7
6753a8m9J12p2lL7L7j00R2l8q2Q9k6R3j2j52J59K3j02J29n9j47J47p5r0P8n3J09
6780B7k8k0j58K14Lp4K4Rj1mKP5M2j54k7J14j7m3P1J2o9J44q1l8m5P4Qp4l4J00
6810D2K3Qr8K6j03O0RM3l0Q4m1j70J01j2J17k0r3m3J52P6J0j04n4Q6j15J0l0Q9
6838B3J5o9M6Q0q9J5mr5J56q0K0j55J05k9J21j25K0Qj9Q5N3l3qr4P4J8m3q8k4
$$ plain form
6635 22 -32 33 51 27 -36 -37 -56 45 -30 -33 -113 -49 -50 -26 -15 47 -38 -74 81 -11 -53 75 37 -110 -19 -41 3 -4 19 -12
6665 -12 164 -84 5 38 -44 15 -26 11 -15 -18 5 15 -66 25 -77 65 136 -21 -75 39 17 -53 38 -20 -67 -40 -31 9
6693 9 45 0 -23 23 -123 -30 3 -4 14 125 54 6 12 -21 50 32 23 42 -8 73 3 46 -17 -9 -3 -43 35 58 25 7 -13 -40
6725 -40 -21 17 -65 134 95 -32 -16 73 1 14 -63 -57 99 -55 38 73 24 19 4 85 -27 50 -55 23 119 -3 49 -18
6753 -18 -67 45 -27 -30 7 44 -56 36 -2 -84 5 -21 72 60 -92 67 90 -12 117 58 -89 58 -17 -107 -29 -82 27
6780 27 -1 -21 -179 35 38 -36 -12 -3 -14 -18 -16 59 101 -53 -80 34 17 -26 45 57 -12 132 51 13 -32 42 50 -24 -58 42
6810 42 65 73 -25 1 -102 -42 -33 10 -20 64 23 -147 -46 -58 59 39 -54 -97 55 131 141 37 -17 69 -46 -36 -66 23
6838 23 38 -31 15 95 6 21 17 -78 78 -2 18 -137 -32 -61 60 -65 -45 -37 -56 29 82 49 41 -53 21 39 -4 -92 -116
6867a16J49q0O7n2J3J3J5J9J3J2P5P0o0l1j41l8j12K32q1j17P2K8m4P9m7O2KP8
6895H0r8J5m1J08k3K6l9K0N7m4Q4o5r4p6O2JJ38m4j57Q2M1p3%P6%l7P3j15L2p3
6925h4J92j05KO1p0N1%j16J14o1pK8p1R4N9j15O1o2r5K27o2l9q3j4K3Q8o8Q7K7
6954F2O3j67L5P6p4K7N8m1o4J4J37j29K6m7rL7L7m7M8o7o5J49K7r7%M7L9j75K3
6983g7N1J5J08j13M2j08J05J5l7m3N9K8L4j46J98o3j25J76j28O3j22J41r0R9j75
7008i3N9J6q5M0N0N2L1k5m7Nq3J05Nl7j13Q3J3J3J13p1r1N5J4q4J18o0J3npJ09
7038I3j33%P9j08l8J01qo0J8J30n7l9J08j3l8O2r7K3M9o6J1r0J63o6j6n3J00k3
7066C2k6J17j09q9J30Qr5j08J2J56q4J86k04P1n6P1J5L2j01K6o1K4L7j2J8L7K9
$$ plain form
6867 -116 33 -47 20 -32 -19 -6 9 28 41 53 128 198 138 107 -34 -72 -184 48 -33 -150 -78 -50 -94 -15 -62 0 2 80
6895 80 -18 -3 -44 64 41 67 28 48 105 61 145 80 -14 -90 -28 -27 111 67 -90 -8 33 -40 -40 36 36 -1 72 -43 -11 -84
6925 -84 108 3 5 66 -4 47 47 -69 45 -16 -23 5 -66 28 87 -28 33 -29 -124 103 41 2 -81 -95 -72 16 -52 35 62
6954 62 125 -42 -7 69 -5 22 80 39 -25 -11 126 -3 23 -24 -33 4 41 -6 42 -25 -90 59 86 -11 -11 36 75 -100 -77
6983 -77 -26 -11 97 -16 26 -82 23 38 1 -42 17 45 79 -67 131 68 -57 119 -9 54 -68 73 -17 82 -93
7008 -93 -34 -18 -103 -63 -13 39 70 45 -2 3 -80 25 30 -7 -120 -37 -24 -11 102 31 -60 -5 9 -75 43 -17 -4 -9 -16 93
7038 93 -40 -40 39 -69 -107 -6 -14 -74 -56 74 17 -22 86 73 35 97 0 23 72 6 17 -73 90 24 8 -45 55 32
7066 32 6 123 14 -75 55 63 -32 -140 -128 28 -56 130 -74 -3 -59 12 27 59 -42 -16 -77 -53 -16 -28 -10 27 56
7093E6nl6l9p6J51j02K0k0K3K1k1K6K3J38j21p9N0N2j72K14j85k3M9m7R9M5n6
7120a5K2P5j53QM9Q2m1J12j28N6m4n5P0J3L0kl9j05J04p5O3%J3Mq7NR6n5m1J23
7150H5j07O1pn4R6j69M6R8pN6r4O2j39O2J7j09K7n4J63Pj28J00k2M4L7%p3L8R
7179D5jkn5J4K4n3J35j98J19J11j17o5p7L0Q1jK1qj1L1k2l0o4K15n6J3j25J04
7207E8j18Q1m7M9j04O8J09j12R8j07k2k2J97n3j78P4q7J65J1NPp3RJ4p6n9Lj1
7235a21P1k8lJ11j15OQ5K1j09J19o4o4Q2O2n5m2P5J7m4l8N6qQ6j1p8M6j38L5R4
7264D8q1M4Nj13J21j6R0q7r2J6J14Jj81O2N9q4J31R3j42L5j49J34J15Jj52K8R5
7291I5j40O8q9j5J65q2k3O4N9o3o3l6Pp1K11n7j8m4n6Q6m8R6j0l9m4n0J90j20
$$ plain form
7093 56 51 15 -24 -100 51 -51 -31 -51 -28 -7 -28 -2 21 159 38 -41 9 61 -111 103 -82 -105 -56 -103 -4 41 -15
7120 -15 7 82 -71 -63 -14 68 27 139 11 67 23 -32 38 51 81 79 40 -65 39 -36 27 27 40 44 -43 -38 58 3 -38 85
7150 85 -22 39 32 -22 74 -95 -49 49 42 98 4 66 -73 -11 6 -103 -76 -130 33 40 -88 12 -10 34 71 71 -2 36 45
7179 45 44 42 -13 1 25 -28 107 -91 28 139 22 -43 -120 -90 -9 -10 11 3 -8 23 1 -29 -93 122 66 79 -46 58
7207 58 -60 21 -26 23 -81 -13 96 -16 82 -25 -47 -69 128 75 -103 -29 -116 49 60 65 72 -1 8 22 -54 -113 -110 -121
7235 -121 -50 -78 -81 30 -85 -79 6 27 -82 37 -27 -91 -9 53 -2 -44 31 48 4 -34 22 14 100 89 11 57 -81 -46 48
7264 48 -33 11 16 -97 24 8 98 11 -81 -65 49 50 -131 -69 -10 -94 37 130 -12 23 -126 8 123 124 -28 0 95
7291 95 -45 23 -66 -81 84 2 -21 43 102 39 -24 -60 -53 -124 87 30 12 -32 -88 -2 -50 46 36 -3 -47 -97 93 -27
7319b7J8P0l3O8o2j20J82j25mPJ23q2K8K1j01P0j7j80J96rN1j31J52m5m7L6nn9
7347b5p9Q6J6J3o6R4p4n8J0P3n4R0M5j04j5N1L4j41L3PJ18j5l3k3m5JJ14j60Q6
7376b1L8j45J97j22N6O6p6j8J91j74N1m6R3j23K5l9k7J55q2Jk4J2O2Qr8M0o4O6
7404Bq4JL4r4j8J94o5R1k0p8J47j85J49k30K61j20O7p3N4q6P5M2j57J01L2om8
7431a4J05j20l7L3P8o0O3l0k3K0q4K5J22l6O0m4r6J05j75P9N3K9k5j29mJ24m3
7458b4m7J04q2K4m2Q6p4Q6j08m2J42p2Q4J13j71J26j24q9J11J8k1K8k4K8n0P2
7484E2p4o3J88k0m8j52J89q2Q7q5m1J30j27J16k0r3K9K7O9j7j20N9k0N0l3r3J69
7511G7j04%P5n9m5J08r4J17n6q5k8J50J9j7j20O0N3n0N2j7R8n5o5m8M7QJ4Pjj28
$$ plain form
7319 -27 -9 61 28 96 34 -86 96 -29 -33 -26 97 15 43 64 -37 33 16 -164 32 23 74 -57 95 50 3 39 34 -25
7347 -25 -104 -18 -2 11 -55 39 -35 -93 -83 -10 -64 26 71 -33 -48 3 37 -104 -71 -64 54 39 6 -17 -62 -61 53 -107 -21
7376 -21 17 -128 69 -53 3 69 -7 -25 166 -8 43 -3 90 -33 -8 -47 -74 81 -1 0 -24 -12 50 58 -40 0 -64 2
7404 2 -82 -81 -47 -141 -159 35 -30 61 41 -37 110 -75 74 -156 105 -15 52 -21 33 -53 22 64 -93 8 40 34 -14
7431 -14 91 -29 -66 -33 45 -15 48 18 -5 15 -69 -44 78 42 102 58 -38 67 -108 -29 24 53 28 -101 -105 19 -24
7458 -24 -71 33 -49 -25 -67 19 -55 31 -77 -119 23 -49 35 148 -23 103 -21 -110 1 19 -2 26 2 30 -20 52
7484 52 -22 -85 103 83 35 -117 72 -10 77 -8 -49 81 -46 70 50 -43 -14 13 82 65 -55 4 -16 34 1 -92 77
7511 77 -27 -27 48 -11 -56 52 -42 75 19 -66 -94 56 75 58 -62 -2 51 1 53 36 134 79 14 -34 13 21 35 42 41 -87
7541h7o5J17P8j6j6P1q5k3k2l3J30J8k6p6q0j1J87q3R4l6nm1m7Q8J2q3m9R5q9
7570h3o4K41j67M4J3KQ8q4K7o2k5N4o2O4r8J83%j15J01j04J54M9j28j3o1P2K3
7597D9j01J97j05k4j26JJK2R3l7J5l0r3K42n0p3K4n1j4M9J3j61K81k15R2P2j42
7624g1R6mj22Q9R0J2j07N8j61K21o3j01KR0o1N8n2O6l7L1k5j0j55K01j2r5J56
7651I4l6K5r8pQ3J9r1O5J0j6K3j29J3P6n6J2j53J73Kk0r9J40n6j2P7m2k3O8l6
7680Fj8M1j8J20j09K6L9l7n3qj9k2K27j03j56K5M1k5%J59r3o4k0J13m1j4n6j31
7708a90K47n9jM7L1j49N5P9j6q5j7kP9m0M6l3n5N2K6p0RL5J39j54P6m7L5j50K28
7737A16r9QL0j7QK9m8n4J17r8J3N8k9n3j5J06k4j16L7J37k24R0J32j32O8O6j64
$$ plain form
7541 -87 -152 -35 43 27 11 82 -3 -26 -48 -81 49 67 41 -35 -115 -126 61 -22 72 36 31 -10 -57 31 43 -40 -89 6 -83
7570 -83 -147 94 -73 -29 -16 -14 74 -10 17 -45 -70 -16 -78 -14 -112 71 71 -44 57 -47 107 156 28 15 -46 26 49
7597 49 -52 145 40 16 -110 -109 -108 -86 7 -30 -15 -45 -138 104 54 -19 5 -46 -60 -11 2 -159 122 -93 -1 71 -71
7624 -71 25 21 -101 -12 78 90 -17 41 -120 101 38 -63 -61 29 -32 26 -26 40 3 34 9 -1 -156 45 33 -62 94
7651 94 58 83 -15 -22 61 80 -11 54 64 48 71 -58 -45 31 -25 -13 -166 7 9 -11 -110 30 -26 -38 39 -3 -26 42 6
7680 6 -12 29 11 131 22 48 87 50 -3 -11 -30 -52 175 72 -84 -59 -18 -43 -43 116 23 -41 -61 52 11 -3 -59 -190
7708 -190 57 -2 -3 44 75 -74 -19 60 44 -41 -58 -60 19 -21 25 -8 -63 -11 15 -55 -46 -11 128 -26 50 3 38 -112 116
7737 116 17 25 55 38 46 75 27 -27 90 -8 5 63 34 -19 -34 72 48 -68 -31 106 -118 -28 104 -28 40 106 -58
7764e8R9Rm5n3R7P5m6m7J1J11j22O1pj37J7J05Rr0P9n1l4k5kQ8k3k09K65mr0M9
7794C2q0P2p2O4O5j42J22M1j82J7J12j6r7J15j8N0j39mJ46j15J2J09j74J17q5
7819e0kQ4q6M3J6N4j59J02j0l0N6NK4J4j12J16j36j6O4j4l8J40q4J54j17p9J58
7846I7q9k9n7Q9jM7j27m3J49l4n8K7n5J97%j02P3n4j4j6Kj05J14J1k5K5m6n2J59
7875H3j86P1O5m5k1N8j39Q1J36n8j42k9M0M5O7Mj6o8j1J3P3L3j33J28q3Q8M3n0
7903D7o9O6o2O7P4o5j08J0N3r2J43n4j1j10Q0M2k2j3J11q1m5J14p5l2JnQ7m9q5
7932h3K00k62J28M7qpJ5No7K2RP9p2O7j71J15j06P7j1l6P7j07J38n6N1K5m0j39
7960a10J50q7J6O4JJ5K3j77J17M7j27J18k9m1j2P3j57O1rJ29j15R7J3k8j26J12
$$ plain form
7764 -58 41 50 5 -48 49 124 78 31 42 153 31 92 85 -52 -35 70 79 -11 68 17 -17 -42 -44 44 21 -188 77 73 -17 32
7794 32 -48 24 -48 16 81 -61 61 102 -80 -63 49 33 -64 51 33 83 -56 -60 86 -29 -17 92 -82 35 -50
7819 -50 -52 32 -54 -11 5 59 -100 2 -8 -38 18 23 47 61 -51 65 -71 -87 -23 -37 -75 65 -19 135 18 -61 97
7846 97 8 -21 -78 11 10 57 -70 -113 36 2 -56 -29 -84 113 113 11 84 30 16 0 2 -103 11 22 -3 22 -24 -76 83
7875 83 -103 -32 33 -12 -33 25 -114 -33 103 45 -97 -126 -86 -41 26 30 14 -54 -65 -52 21 54 -79 49 -34 54 97 47
7903 47 -22 44 -18 49 123 58 -50 -40 13 -79 64 10 -1 -111 -31 11 -11 -24 87 6 -39 75 0 -32 -31 -36 51 2 -83
7932 -83 117 -145 -17 30 22 15 30 35 -32 -10 -1 78 6 73 -98 17 -89 -12 -23 -59 18 -89 49 -7 44 69 29 -110
7960 -110 40 -47 -31 33 34 49 72 -105 12 59 -68 50 21 -20 -32 41 -116 -55 -64 65 -50 47 60 32 -94 18
7986A8l2L4o6n8pJ21N5m9l7j23J82Mj17J58p4L2j0k6Q0p5k1r2K60k02L5J52j76
8013c4J05m4j56J92o1k5J37j19L4Pm9k9K9l1J73j02q7J00o8k1N5j36J41o0Q4K3
8039E8j2l8Q3p8n2NN4L0j8o6J0J64j46l0J26p0N5k3r6J66l3n6O3m4j4J11k46J20
8067B3Q3j79J84K6j84j5k9P2J8m8J4J91k01lQ5l7n9N8k5P3n6m0J72p4q3J07o0
8094A3j6L9K1j16J07p7M9Q3j76J53l7l6k9k7K25q4j24J59k15m2K56j30K8j9m5
8119d0J37L4j24l3m4J12K8j0q0Q6j16J43p2O0j58N9qr6K22j52kL2Q0L9j26k6L
8146e2O9rL6n5m4J35q8J00k7P8j88O8k3nJ19q2m0K3kLj02K2Q8j58J68m2lk%j5
8176b8nn7K26k16K7R2K0j19N6J77k17Q6K4p3j4
$$ plain form
7986 18 -14 20 -46 -104 -111 10 65 16 -21 -144 38 42 -75 83 9 41 31 5 85 10 -11 -103 157 -45 -10 142 -34
8013 -34 71 27 -129 63 2 -23 114 -5 29 36 -13 -42 -13 -44 129 27 -60 40 -28 -49 6 -130 11 -49 35 58
8039 58 46 8 91 13 -39 -34 20 50 32 -34 -24 140 -6 -36 90 20 75 52 -44 122 89 33 96 52 38 149 -97 23
8067 23 106 -73 111 137 -47 -62 -91 -19 -1 -49 -35 156 -45 -48 37 0 -59 -1 -26 47 -9 -49 123 49 -34 73 13
8094 13 -3 36 57 -59 48 -29 20 103 -73 80 43 7 -22 -49 176 92 -32 127 -88 -130 126 -4 24 5 -40
8119 -40 97 131 7 -26 -70 42 70 60 -20 66 -50 93 21 81 -77 -18 -26 -122 100 -52 -54 -22 58 97 -29 -55 -52
8146 -52 17 8 44 -11 -55 80 -8 92 65 143 -45 23 0 -5 114 32 -8 15 13 16 -86 -64 24 -134 34 -8 -11 -13 -13 -28
8176 -28 -33 -90 136 -80 -53 39 59 -60 -4 173 -44 42 66 -7 -21
8191b1
$$ Imaginary data points
##PAGE= N=2
##DATA TABLE= (X++(I..I)), XYDATA
0@%%%%%%%%%%%%%Qj6J6j6J6k4L2l3M1m9N7p2Q3r2J07j25J47j69J93k18K44k77
35a47L16l55L96m45M95n51O15o84P57q37R26j021J126j243J371j510J661j830
53i60K020k230K467k739L047l400L814m310M913n663O631p928R769j2607J7611
68A0435k9063J06205L7502j01197L1569m2899j6952n2990l4982M1718r215l5480
80i5349Q8822M2983N776Q014k5818L1905L1860p2900j9761j0063m1040J6223q666
93d8014j1668N4078j4657j3798M9041J4521K2942o312o3709L0445L0172m8026
105d985m692k492o652J3723l9888J8307O4252m9678l5929L5747J5044K1794k3003
118A548l0991N3919j356l7711L5648M658j5207r797l9453L1691L2609n5226o617
$$ plain form
0 0 0 0 0 0 0 0 0 0 0 0 0 0 0 8 -8 8 -8 8 -16 16 -17 24 -25 32 -40 43 -49 58 -67 80 -89 104 -114 130 -147
35 -147 169 -186 210 -235 260 -291 324 -360 397 -440 486 -535 591 -652 719 -791 870 -960
53 -960 1060 -1170 1297 -1442 1605 -1795 2019 -2291 2622 -3041 3590 -4338 5431 -7176 10435
68 10435 -18628 87577 125079 23882 55451 12552 -4400 -57390 -92372 -50654 -59869 -95349
80 -95349 -6527 36456 42232 50246 24428 56333 88193 15293 -4468 -14531 -55571 -39348 -48014
93 -48014 -59682 -5604 -20261 -34059 14982 29503 52445 46133 -17576 12869 43041 -4985
105 -4985 -9677 -12169 -18821 -5098 -44986 -26679 37573 -12105 -48034 -12287 2757 24551 1548
118 1548 -29443 24476 23120 -14591 21057 25715 10508 711 -38742 -7051 25558 -29668 -36285
131c6285J4999n739L3789r670j3844M1222j7808j7319K8697p038Q333j2352n3969
144d6984L2727L2071l5803j720j111R546L0272k9290J0533N3405l4866k4007K4349
157A9122O451J3897l4480m2615M1232O20l6079J7909J70J566Q794k3762L5640
170H465L5006m1967l469J2606m948K1701k5338k6266L0871j2693j1190K2684q019
183b557J5474J953l6654L3558K7129l3150o735r927M981K5238l7054o624L8905
196A4537k4111j2920J7900L561K1539k2027l2379M4884J0703k6759R613n177Q439
209G803J0982l0456J8020K3429l7180m321P250k299K2182k3368k0627L4985k503
222C897p570J1951j2769J5050J644l4973K4455J9269k7618k433l996J2503K7629
$$ plain form
131 -36285 -21286 -27025 6764 -2906 -16750 24472 6664 -10655 18042 11004 19337 6985 -46984
144 -46984 -14257 17814 -17989 -19709 -20820 -11274 18998 -10292 241 53646 18780 -5227 19122
157 19122 25573 39470 4990 -37625 3607 4227 -31852 -13943 -13773 -12207 -3413 -27175 8465
170 8465 43471 1504 -1965 10641 5693 27394 2056 -24210 6661 -6032 -17222 5462 -2557
183 -2557 12917 14870 -21784 11774 38903 5753 -982 -10909 -5928 19310 -17744 -24368 14537
196 14537 -9574 -22494 -4594 -1033 20506 -1521 -33900 10984 21687 -5072 4541 -636 7803
209 7803 18785 -11671 6349 29778 -7402 -11723 -4473 -6772 15410 -7958 -28585 6400 3897
222 3897 -3673 8278 -4491 10559 12203 -22770 1685 20954 -6664 -9097 -13093 -590 27039
235B7039l1954o312L5376j6114r773P201n337J6666j9544k8644L7678P019k3334
248a0033P026n918J1134J2858l0200J0922J7997k7030K989M731l983K3168j7076
261c415j5659L0998j428n534M588j7471J6140N225l3183J5203J4236j8679J128
274g851p590J0415K5124l0822r091L0666r634p138M6n266K1819j2950k4112L2344
288E960O722j8406N270n200J2963J0559k8880R191J7323k0105M049K42o213J8754
302A2229j6305j4678K3633n153m456M026j4934J9011R557k6433J3487J3255j0497
315B742M485j1358N274K2693k7281r463K5249o622l580k780n406K4433r116k4312
329a5042K3915L760j5260K988q511J0446Q935k5873R445J6915j4090N367j069
$$ plain form
235 27039 -4915 -11227 24149 8035 -1738 5463 126 16792 -2752 -31396 6282 13301 -10033
248 -10033 -3007 -8925 2209 15067 -15133 -4211 13786 -13244 -10255 -5524 -9507 13661 -3415
261 -3415 -19074 11924 10496 4962 9550 -7921 8219 13444 -19739 -4536 9700 -8979 -7851
274 -7851 -15441 -5026 20098 -10724 -19815 10851 1217 -5921 -5875 -11141 10678 -2272 -26384 5960
288 5960 12682 -5724 -454 -5654 7309 17868 -11012 -1821 15502 -4603 -554 -312 -6525 12229
302 12229 -4076 -18754 4879 -274 -4730 -704 -15638 3373 12930 -13503 -16 13239 2742
315 2742 7227 -4131 1143 23836 -3445 -12908 12341 5719 2139 -641 -6047 18386 9270 -15042
329 -15042 8873 12633 -2627 361 -8150 2296 11231 -14642 -5197 11718 -2372 2995 1926
342A926m534J9091j2298j1961J7616p019k092M140j5573J4580P635k3633R067
355c055R304o179N343j4796K553K2978k1179j0163J8493m997j268n615o533K4978
369I864o564k2830K0994P095p708K839j0053J0821Q366k5285O323J3375j4650
382g413K836k608j932J9508j0349q918J7021o569n00M144j6322R190L869j9762
396a7805R008O783l034R744j0699M501K4632j4013q696J0960o653K06q332j1562
410a4960J9433n649k0368J7575Q543j090L391j1413J1568J0514k2595K622Q387
423E958j3047K078m517j84J9455r701p072J7053k900K434L396j5802P930K744
437G825j7360P585J988n286P741j1259K983K1001j2911p766Q323m327N574n575
$$ plain form
342 1926 -2608 16483 4185 -7776 9840 2821 729 4869 -10704 3876 11511 -12122 -3055
355 -3055 6249 70 5413 -9383 -6830 16148 -5031 -15194 3299 -1698 -2966 -8581 -15114 9864
369 9864 3300 -19530 1464 8559 851 3690 -6363 4458 12824 -12461 -6138 7237 -7413
382 -7413 -4577 -7185 -9117 10391 42 -8876 8145 1576 1076 5220 -11102 -1912 1957 -17805
396 -17805 -8797 -2014 -5048 4696 -6003 -1502 23130 9117 421 11381 4728 4934 -3398 -14960
410 -14960 4473 -1176 -21544 -3969 4574 3484 6875 -4538 7030 17544 -5051 -2429 5958
423 5958 -7089 -5011 -9528 -9712 9743 42 -7030 10023 7123 9557 12953 -2849 5081 7825
437 7825 -9535 -1950 38 -5248 2493 -8766 -5783 15218 2307 -5459 2864 -1463 4111 -1464
451a464j1167J7962l171j6030J4418N330j162M66j3572J0639J1550j9455J425
464d231P229q270M676l777n41J6111j1279q045J3826l412J726Q66j4422R508M974
479D939j2224Q304P33m553Q347r899K019J6809j2984o661O812k834Q414m958j1855
494i591J5520j618j3271J0486L30k095J02j4143J0462J2399j6189J531O817l615
508b875Q224m708k178J3804j1117p316J1536l991J474j152j2988J1176O276j0460
522d295O641p98l061Q397r651P71J2899j3301n770N820k232P956n930j1324J5377
537A499Q90r328R501l48L12J847j1743R881J0051j6671p99M064l558P292o852
552c962l800J2875q062l302J1796l498K507k12j1559J0612M555j1402L868l423
$$ plain form
451 -1464 -12631 5331 2160 -13870 548 5878 4716 5182 -8390 2249 13799 -5656 -4231
464 -4231 2998 -5272 -596 -4373 -4914 11197 -82 -8127 5699 2287 4013 4879 -9543 -35 4939
479 4939 -7285 1019 1752 -2801 5546 -4353 -2334 14475 1491 -5170 1642 -1192 7222 2264 -9591
494 -9591 5929 4311 -8960 1526 1856 -239 -137 -14280 -3818 8581 -7608 -6077 740 -2875
508 -2875 5349 641 -1537 12267 1150 -6166 5370 1379 2853 1701 -11287 -111 6165 -4295
522 -4295 2346 1548 -1513 6884 -2767 -1996 10903 -2398 -8168 -2348 -4580 3376 -2554 -13878 1499
537 1499 2389 -6939 2562 2214 2526 4373 -7370 2511 12562 -4109 -4908 -844 -4402 2890 -3962
552 -3962 -7762 5113 -2949 -6251 5545 2047 4554 4342 -7217 3395 7950 -3452 416 -3007
566c007j670R710q938O12J2200r695k125N938j750P761p190j2236J4137J030r108
581d331N614k334J914L123j1071R158Q895j5106l93M024j073O830q200l646J3070
596F474n940k228R136m770K198p59j0501R889K262j1153L163k602L72J0240q467
611b686j25J0758p628l93L503m092O467p642j1493J3295J197p580M438k235N428
626A212N460j0429P968P852j3239n31K230j807N097j0785m498J2770m845j857
640e402P443l710M392J125p961R810J481j0471K815l125K60Q001r699q79R694
655C774n223K150K868l478P937n387r914J1480j90p951J110m428N764M957j1482
670h013O630Q356r047K049K188L0N790j0924m002J1934n551l566M259m367N916
$$ plain form
566 -3007 -4677 5033 -3905 -3293 8907 -788 -2913 3025 1275 9036 1846 -10390 3747 4777 -4331
581 -4331 1283 -1051 863 3986 -7085 2073 10968 -4138 -4531 -507 -1580 5250 -2950 -6596 6474
596 6474 534 -1694 7442 2672 4870 4111 -6390 3499 5761 -5392 -2229 -4831 -4459 5781 -2686
611 -2686 -2811 7947 319 -74 3429 -663 5804 -1838 -13331 -36 1161 -6419 -1981 -4216 1212
626 1212 6672 -3757 4211 12063 -1176 -1707 523 -1284 3813 -6972 -11470 1300 -3545 -5402
640 -5402 2041 -1669 2723 3848 -4113 5697 7178 -3293 -478 -3603 -3343 4658 -5041 -5920 3774
655 3774 -1449 701 3569 91 8028 2641 -7273 4207 4017 -3934 -2824 -7252 -1488 3469 -8013
670 -8013 -1383 6973 -2074 -25 2163 2193 7983 -2941 -6943 4991 -560 -4126 133 -4234 1682
685A682J146p333R936J506q223M357k597L55O223j0580j460P939n248K032Q20
700E55m270Q769l271q000J0590J0n811J054m873O055M393j2436M254P209o829
715b601J994k2J79P113r464l305J1469m097l391K153m268O463K21q489Q189J167
731C311o536M744k569J258O498r535o2P636m513J726r72m895Q705l067p819Q662
747B572n93l848J614m813O312M457j1885L401O700n147J753k164k91P813q381
762b500l163J0501l469k475J314l851P031j5r054P119J229n201M089l440J239
777f46O146q901L48O734m306J787j349m477Q988k282p221P307o73j893J972n872
793d338N843M341j1246K717N535l981K106l521k18Q775o990l648Q955l219j139
$$ plain form
685 1682 2828 -4505 5431 6937 -1286 3071 474 829 7052 -3528 -4988 2951 -2297 -265 555
700 555 -3715 5054 1783 -6217 4373 4383 -1428 -374 -5247 808 5201 -7235 -2981 4228 -2601
715 -2601 -607 -629 -450 6663 -2801 -6106 5363 1266 -2125 28 -4240 2223 2444 -6045 2144 3311
731 3311 -3225 1519 -1050 208 6706 -2829 -2891 4745 232 1958 986 -3909 4796 1729 -6090 2572
747 2572 1979 -1869 -255 -5068 1244 5701 -6184 -2783 3917 -1230 523 -1641 -1932 5881 -2500
762 -2500 -5663 4838 1369 -1106 208 -3643 3388 3373 -5681 1438 2667 -2534 1555 -1885 -646
777 -646 5500 -3401 -3053 3681 -625 1162 -187 -4664 4324 2042 -5179 2128 1455 -438 1534 -4338
793 -4338 1505 5846 -5400 -2683 2852 -1129 977 -2544 -2762 6013 -977 -4625 4330 1111 -28
808b8L62m713P569l06r064O330J572l751L789m254J771O396q372K50N916m170
824g03K343j855m392Q906k233o519O248p02o10J873o604N320M446r970K277M217
840B042k907K481m435k34Q945o637l586P456k746K39L7m904P536j48q215N953
856H77Q58k716L526n330J743O254p853K92M476l710L277j988m355Q772k077n972
872c926N710j220N37J590p120N124M494q981J887L028k165L237n054o88R095o014
888d66l355O313k375J452o02n294P234M7p532N031J18j807L308n239J968O396
904E197o951N05L684l425L803k573m926P910k328n084M756j508J480K325p201
919d336N339M963p733J708J544j947L451n980j392Q390n492k833N226j923K824
$$ plain form
808 -28 334 -4379 3190 2884 -6180 150 1722 -2029 1760 -2494 -723 5673 -2699 -2449 3467 -703
824 -703 1640 -215 -4607 4299 2066 -4453 1795 1093 483 2356 -4248 1072 5518 -4452 -2175 2042
840 2042 -865 1616 -2819 -3053 5892 -745 -4331 3125 379 618 655 -4249 3287 3139 -5076 877
856 877 1735 -981 2545 -2785 -1042 5212 -2641 -2349 2127 -1583 1694 -294 -4649 4123 2046 -3926
872 -3926 1784 564 1101 2691 -4429 695 5189 -3792 -1905 1123 -1042 2195 -2859 -3547 5548 -466
888 -466 -3821 2492 117 1569 967 -4327 2907 2954 -4578 453 571 -1236 2072 -3167 -1199 5197
904 5197 -1754 -1249 2435 -990 2813 240 -4686 3224 896 -4188 568 -940 540 2865 -4336
919 -4336 1003 5966 -1767 -59 1485 -462 2989 -2991 -4383 4007 -1485 -4318 908 -1015 1809
934A809m97n420P484M57o878M271p72j301L211o137J852N904o369R29K932k788
950a313M567k628m616P283j791m275L766k677K015K137p162M593M583o659J782
965c95P35j127M380n892j561P983m710k385M102k335L346r57n555P207L69o144
981b939L657j123l88L472o080J911N393n833J311K251k760M674k720m584O681
996B923k034l370L093l359K590K420o902M162M321n190K130j44o69M961o118k085
1012c271P069m346k145K618k681L895q25n519P086J034n005L590j435N48L381
1027C994o561J546M595n698J223J172k837N022k537l773O763j727k245K862l689
1042a890K718K358p030L347L136m823K280j162n49N667n558j591O828l316q23
$$ plain form
934 1809 1312 -4108 3376 3833 -3045 1226 454 -847 2364 -3773 -1921 3983 -2386 -1457 1475 -1313
950 -1313 3254 626 -3990 3293 1502 -2773 993 -1684 331 2468 -4694 -101 4482 -2177 -395
965 -395 340 -787 3593 -2299 -3860 4123 -587 -2972 1130 -1205 2141 1184 -4371 2836 3205 -2939
981 -2939 718 -405 -793 2679 -3401 -1490 3903 -1930 -619 1632 -1128 3546 826 -3758 2923
996 2923 889 -2481 612 -2747 -157 2263 -4639 -477 3844 -1346 784 640 -29 4932 -1186 -3271
1012 -3271 3798 -548 -2693 -75 -2756 1139 314 -5205 1881 2915 -2090 1500 65 613 3994
1027 3994 -2567 -1021 3574 -2124 -901 271 -2566 2456 -81 -3854 2909 1182 -1063 1799 -1890
1042 -1890 828 3186 -3844 -497 2639 -2184 96 -1066 -1615 4052 -1506 -3097 3731 415 -408
1057d08J835k992M462r52n918O058J06m442K988k219Q53L564o255J732M552m703
1073a739J938P01k665M711k585l801N851k235j938K524m110K930K761o274L378
1088e53K807l749K993j695o11N644n475j764N905l272n09J063l297M843p54n726
1104d150N690kl293K948k708J396L611o214J536L834m428J815k38k742M942k717
1120g20l241N455k254q46K730l974L378K443o089L216J869l329K698k464p22N412
1136C562m846j249N400k749P57P77l129N063o67n338M812n29k828K403l277J204
1152f34L417o038J668L529l950K290k86k562N170k600k839M872k551m51K366m349
1168b948L272K187n622L060J337k637L249k786o06N412m451j109M423l040J215
$$ plain form
1057 -408 1427 -1565 2897 1945 -3973 2085 2191 -2251 737 -1482 -629 2935 -3320 -1588 2964 -1739
1073 -1739 199 900 -1765 2946 361 -3440 2411 176 -1762 762 -3348 -418 2343 -3931 -553
1088 -553 2254 -1495 1498 -197 -808 4836 -639 -2403 3502 230 -279 784 -2513 2330 1576 -4150
1104 -4150 1540 1538 -1755 1193 -1515 -119 3492 -2722 -1186 2648 -1780 35 -203 -2945 1997 -720
1120 -720 -3961 1494 -760 -1606 1124 -2850 528 2971 -3118 98 1967 -1362 1336 -1128 -1850 3562
1136 3562 -1284 -2533 2867 118 875 1652 -1477 3586 2919 -2419 2393 1864 -964 1439 -1838 -634
1152 -634 2783 -3255 -1587 1942 -2008 282 -4 -2566 2604 4 -2835 2037 -514 -965 1401 -2948
1168 -2948 324 2511 -3111 -51 1286 -1351 1898 -888 -1494 3918 -533 -1642 2781 -259 956
1183I56K25l608M869n87n047M468o39j691K639l524J473L405n480J722K787l521
1199a553K393j003k415M812k575k428M274k466K26K148m072L109J974m896K872
1214D00N54k226L061l034q93N061m114q89L568k642J841J01l395M913l72m418
1230b484M002q15j318K370l738J534L110m998J628K232l171K771j097k359M908
1245B575k458k119L845k657M78J959m086L049J659m265K950K42j958L157k991
1260f20r55M466l801q21K686k670J945Ol440M852l98l667L876q50p11K318l820
1277a604J552K743m732J468J785l018K824j298j768M502k418j500L501k644P98
1292A91J710m165K870J104m076K859l37j662L371l079m48M356l459n7K279k631
$$ plain form
1183 956 1181 -2427 2442 1855 -3192 1276 637 -1054 1585 -1939 -466 2939 -2541 -819 1968 -1553
1199 -1553 840 -163 -2578 2234 -341 -2769 1505 -961 -735 1413 -2659 450 2424 -2472 400
1214 400 954 -1272 1789 -1245 -2138 2923 -1191 -2080 1488 -1154 687 788 -2607 2306 1934 -2484
1230 -2484 1518 703 -615 1755 -1983 -449 2661 -2337 -709 1523 -1648 1123 26 -2333 2575
1245 2575 117 -2002 1843 -814 -336 1623 -2463 586 2245 -2020 930 1172 -786 2371 -620
1260 -620 -1575 2891 -910 -1731 955 -1715 230 236 -3204 1648 1250 -2417 1459 609 -102 2216 -1604
1277 -1604 -52 2691 -2041 -573 1212 -1806 1018 -280 -2048 2454 36 -1464 2037 -607 191
1292 191 1901 -2264 606 1710 -2366 493 156 -1506 1865 -1214 -1662 2694 -765 -822 1457 -1174
1308a174K438n22l300M289p25l147L134j150l20K351l874J814K908m378J722J226
1324A292k432K725j603j790M192k579j528L285k660J028J314l745L005P86l443
1339b153K965n51j347L339l017k55L790l382K43J505k565K439o53l215L927o57
1355D13k669K938j477L31K373l696J898K557l971J645P40k145K433j909j507L783
1371A737k431j036K776k451J395J248l374L088N31l051K588r10j321K962k969
1386a218l07L350l154O69J565k495K855l30k802L765o46k300K614j888K29J993
1402A900l951J791J936l524J671M16j588K922j743j239L892k404n27K273k609
1417g84J371O36l503K768O8k761K745j055p35L135k822L77L036k794R15R10k624
$$ plain form
1308 -1174 1264 742 -2558 1731 1006 -2141 993 -157 -477 1874 -2000 -186 2722 -1656 66 1292
1324 1292 -1140 1585 -18 -1808 2384 -195 -1723 1562 -1098 -70 1244 -2501 504 1290 -2153
1339 -2153 812 261 -1086 2253 -764 -1019 2771 -611 -368 1137 -1428 1011 358 -2857 1070 413
1355 413 -2256 682 -795 -464 1909 -1787 111 2668 -1303 342 1082 -1063 1370 -539 -2046 1737
1371 1737 -694 -1730 1046 -1405 -10 1238 -2136 952 1483 -1568 1020 110 -1211 1751 -1218
1386 -1218 -1525 1825 -1329 -660 905 -1590 1265 935 -1867 1898 1252 -1048 1566 -322 -93 1900
1402 1900 -2051 -260 1676 -1848 -177 239 -1349 1573 -170 -1409 2483 79 -448 1825 -784
1417 -784 587 1223 -2280 488 556 -2205 540 -515 -1250 1885 -937 -560 2476 -318 597 1507 -1117
1434a117K534q13k948L467j103j842K348j698P13K234l466J935K019l187J730
1449H06k7j662K460k145j273L198k360k89K188k253J860P93l050K746J93k529
1465a344K507j511p64K510k888J41K620k599J072R99k144K834o42k506L253r93
1481E45j498K233k323R32J626l477J632J637k719J620j19j372K834k159q89L306
1497A809k151j47J818k197J730N64l046K626l01j963K054j371o02K596k632L55
1513h58K433k363J254P80k181K520q34k343K881j287j246J818k254J086J774l095
1529a915J928J355k170J760n15j124K612k401j031K697k228J72J413k039K181
1544F95M60k411K748j69j638J986j720l45J915k827L68J733k423J566L08j762
$$ plain form
1434 -1117 1417 604 -2344 1123 20 -1822 526 -1172 -459 1775 -1691 244 2263 -924 806
1449 806 779 -883 1577 -568 -1841 1357 -1003 -1292 896 -1357 503 1296 -1754 992 1185 -1344
1465 -1344 1163 -348 -1112 1398 -1490 -1349 1271 -1328 -256 743 -1401 1433 791 -1715 1538 545
1481 545 -953 1280 -1043 -111 1515 -1962 -330 1307 -1412 208 89 -1283 1551 -608 -1497 1809
1497 1809 -342 -489 1329 -868 862 1426 -1620 1006 705 -1258 796 -575 -1177 1419 -1213 -858
1513 -858 1575 -788 466 1246 -935 1585 751 -1592 1289 2 -1244 574 -1680 -594 1180 -1915
1529 -1915 13 1368 -802 958 443 -681 1931 -470 -1501 1196 -1032 -860 553 -1486 695
1544 695 1155 -1256 1492 1323 -315 1671 -49 -394 1521 -1306 -938 795 -1628 -62 246 -1516
1560a516K904o81j828K665j255p84J620k495J110J310k999J540J093k000J828
1575E12o31r17K935k197o70K467k163L23R43j985K066Q5k516K893l63j392K247
1592A637j738j8K136k737M48J478k508J512k07j784K644r10j369K501j156k36
1608c07J506k229J334Q40k642J356O52j904J865j149n27K732k026k34K266j887
1624c54N08P73k181K140k63k293K159n56r59J895j559J75K082k320R34J227k085
1641f77J406m08j691K322j115j530K180j375J83J637k245J487J312k503J722L57
1657A062j488J698j447q55K516k199k16J803j886Q08P96j916K165j46k064K354
1673I85n11r87J747j843K63J741k399P08J057j991J636k83j516K551j058j096
$$ plain form
1560 -1516 1388 707 -1121 1544 289 -495 1125 -1370 -260 1050 -1949 -409 684 -1316 512
1575 512 -119 -1036 1899 -298 -968 1499 -664 -341 602 -1383 683 768 -1748 1145 782 -610 1637
1592 1637 -101 -119 2017 -720 -272 1206 -1302 210 3 -1781 863 -47 -1416 1085 -71 -307
1608 -307 1199 -1030 304 1144 -1498 -142 510 -1394 471 -678 -1205 1527 -499 -733 1533 -354
1624 -354 154 927 -1254 886 623 -1670 489 -67 -1026 869 -690 -515 1567 -753 181 1408 -677
1641 -677 729 321 -1370 952 -163 -1693 487 -888 -705 932 -1313 174 1486 -1017 705 1062
1657 1062 -426 1272 -175 -1030 1486 -713 -929 874 -1012 -204 592 -1324 841 695 -1369 985
1673 985 474 -513 1234 -609 -346 1395 -1004 -296 761 -1230 406 123 -1393 1158 100 -996
1689i96K148j379J46J234k326J244Q86k252J448K0j144J917j281l67K337k041
1705d06m9J699j877R98L58k229K222m65j722K026p57n28J746j751M86J628k148
1722g69R56P37j850J813o00j459K202j103j035J970j526L43J174k204J397Q50
1738H96j957J363j60j081J820j401l43K169j809l5J431j661J255K31j987K101
1754H32l84j565J930r37n55J663j723O56J472j966R83N46j638J706p09j433K074
1771I52j224o72J791j468N28R67k094J501O97k071J466m53j110J801j468k21K123
1788A045j671L05J421j561J328J92k021J980o39j541J541r42m31J624j739Q15
1804b94J644j832J311M19j486J550q92j563J846j278p20J476j420Q86J187j814
$$ plain form
1689 -996 1152 -227 -81 1153 -1173 71 957 -1295 153 173 -971 946 -335 -702 1635 -406
1705 -406 -455 1244 -633 365 723 -1506 716 251 -1471 555 -202 -730 1016 -735 -249 1379 -769
1722 -769 187 924 -926 887 287 -1172 1030 -73 -1108 862 -664 -321 853 -1351 46 896
1738 896 -1061 302 142 -939 881 -520 -863 1306 -503 -538 893 -768 487 718 -1269 832
1754 832 448 -1117 813 -124 -679 984 -739 -83 1389 -577 406 952 -686 1020 311 -1122 952
1771 952 -272 -944 847 -621 -93 874 -1220 281 978 -1093 373 -80 -1190 611 -857 -1078 1045
1788 1045 -626 -321 1100 -461 867 1059 -962 1018 379 -1162 379 -563 -994 630 -1109 -294
1804 -294 1350 -482 829 1248 -238 1312 420 -1143 703 -575 -1295 181 -1239 -353 834 -980
1820i80J716N58j627J422p35j087J542j802m84J794j631L36J432j446J711L76
1836A095j557K130p40j310J481j474m75J356j986O12J449j818J491M56j134J941
1852A517q99r78J522j351l88J043j673O77Q66j760J801M64j578J782n67q06J652
1869A324j720l64J571j908N74Q44j564J663J68j444J999m50j058J586j467j67
1885d13J269k056P69Q04j838J552J37j059J853p24q69J911j429k39J171j861Q00
1902b22P14j865J547K72j289J733p07o51J893j694j96J357j682M99O63j636J547
1919B83j7j405J984n59p10J643j313k1J212j890O63P32j719J346j01j109J777
1936G96r17n92J770j307l9J291j837R45O51j674J251L5j078J523r34m67J525j480
$$ plain form
1820 -980 736 1294 -333 1089 354 -733 809 -993 -1477 317 -1314 -978 454 -992 719 1095
1836 1095 -462 1668 928 -382 1099 -375 -850 506 -1480 -868 581 -1237 254 710 -424 1517
1852 1517 618 -360 1162 -189 -577 466 -1207 -530 336 -1424 377 841 -737 1045 478 -328 1324
1869 1324 -396 -760 811 -1097 -523 321 -1243 420 588 -856 1143 693 -365 1221 -246 -413
1885 -413 856 -1200 -431 373 -1465 87 224 -835 1018 294 -575 1336 -93 -332 839 -1022 -222
1902 -222 492 -1373 174 446 -843 890 183 -468 1425 -269 -465 892 -790 -291 372 -1264 283
1919 283 266 -1139 845 286 -424 1219 -94 -115 1097 -793 -130 602 -1117 229 128 -981 796
1936 796 -121 -713 1057 -250 -289 1002 -835 110 761 -913 338 373 -705 818 -116 -583 942 -538
1954e38J06J321j761R54N93j537J471k72j363J783p81n73J337j419L29J214j881
1971a017J139O23j583J498k61j194J657r56p27J487j369J95J198j655R86P22j602
1988h59J458Q6j175J474j074n84J484j518P1J199j515J020N74j447J654m30j158
2005g40J660q64o05J371j524J95J059j603J053N11j342J426j93r43J730j137n81
2022e27J526j627K30Q62j578J016N03j660J761k27r91J825j154k12J470j490L07
2039C4Q58j766R61J43j603J648m82q27J669q14j38J427j424O24R30j788J004J34
2057E90j557J243m54j037J679r45k12J563j317N99J104j511J013R2j707J563p85
2074g9j113J512j243j38J568j289O66J034j293J238J61j302J329p45j111J452
$$ plain form
1954 -538 -432 889 -872 82 675 -862 609 337 -1026 757 -24 -597 740 -679 -350 864 -1017
1971 -1017 122 745 -838 660 399 -795 862 -94 -821 666 -703 -508 690 -965 21 743 -859
1988 -859 599 685 -490 984 -90 -674 810 -708 -637 562 -953 67 641 -806 848 418 -740
2005 -740 920 56 -549 822 -702 -507 552 -1051 2 513 -829 597 404 -539 1191 54 -527
2022 -527 999 -628 -398 464 -1114 -98 405 -1255 506 279 -712 1113 -41 -253 1217 -273 34
2039 34 892 -874 87 230 -1373 275 -207 -1034 635 -179 -317 1110 -314 310 1240 -548 456 590
2057 590 -967 276 -178 -1215 464 -481 -693 870 -447 152 1256 -255 758 850 -857 706 -79
2074 -79 -1192 320 -923 -1061 507 -782 -116 918 -375 863 1024 -278 1051 306 -805 647
2090F47j206m25J217j619P78J085j491J340M31j262J580n15p13J515j399l68J182
2107G77j683L88P62j594J221J63j145J692l07n27J466j149p1J172j645M97O32
2124F49j683J257j36j163J632m93p04J555r92l9J158j587O73O79j611J153R1j248
2142h09J302o78p74J502j166m9J286j356O73O63j407J332Q8j140J562q05q25J366
2160G65j385j64J141j515P90P98j322J591K0q66J512n95q09J333j490k07Q69j626
2178a160M22P99j431J416J88r45J609o21n04J316j357j42Q79j636O96N54j456
2195a373J458J5q37J671p20m04J406j420K9J032j583N90O09j410J425j26r36J517
2213I43m80n75J284j370J1J090j692P63M74j425J201k8j038J505p56m82J493j493
$$ plain form
2090 647 -559 -984 233 -1386 -608 477 -1014 326 757 -505 1075 560 -153 1362 -37 -405 777
2107 777 -906 -518 244 -1350 -129 34 -1111 581 274 -253 1213 64 -7 1165 -480 17 649
2124 649 -1034 223 87 -1076 556 63 -641 914 -78 -117 1041 -546 127 806 -805 348 439 -809
2142 -809 493 -185 -959 543 -623 -672 614 -742 -69 594 -813 519 607 -533 1029 224 -601 765
2160 765 -620 -784 357 -1158 -368 430 -892 699 719 -147 1365 770 -39 1294 -196 -403 466 -1160
2178 -1160 -738 61 -1370 46 234 -711 898 277 -227 1089 -268 -410 469 -1167 -471 83 -1373
2195 -1373 85 100 -737 934 214 -190 1216 -204 -175 857 -726 -136 473 -937 488 362 -574 943
2213 943 463 -112 1172 -198 -187 903 -789 -26 448 -977 224 196 -842 663 -93 -575 918 -575
2231e75J51J167j542P11M45j321J342j68r76J333p71l77J482j299J77J065j495
2248f51R87N26j414J220l20j066J349q14n03J302j220J91J141j297R67N12j467
2265e57J291l43j032J427j115n14J330j452M00R21j274R50L76r91J301j92q93
2282c67J349q48n86J340j480L07P19j306P50M39j323J335k06p79J531r32j73J197
2300I67j438M45Q36j507P76J67j182J191l17o96J426r09p2J247j153K02Q29j434
2318f22Q42J96j206J328m01q63J270o59l78J275j309L70P76j340R60K11j145J185
2336D90l11q25J404r93j66J080j441N05P33j389J008Q9r85J394l26n37J226q06
2354A50k69J087j397L11L00j101P83K65j064J319k32o57J512q60j45J098j370
$$ plain form
2231 -575 -424 743 -799 -88 357 -964 378 210 -766 567 -204 -581 901 -398 -221 844 -651
2248 -651 336 862 -552 668 348 -718 631 -183 -686 616 -604 -413 728 -569 398 910 -557
2265 -557 734 391 -641 786 -329 -843 487 -965 -565 356 -918 32 408 -583 718 526 -367
2282 -367 982 134 -452 888 -592 -285 434 -872 -122 317 -1006 329 123 -656 875 -57 -230 967
2300 967 -471 -26 810 -697 79 246 -936 255 -62 -758 668 -241 -313 934 -219 -17 812 -622
2318 -622 220 416 -790 538 137 -726 544 -115 -493 782 -527 -157 619 -721 239 450 -695 490
2336 490 179 -646 758 -235 -401 679 -762 -257 476 -913 95 184 -801 593 267 -270 956 150
2354 150 -119 968 -429 -118 182 -919 -136 129 -935 384 152 -505 1007 147 2 1100 -270
2371b70K97N53j435Q06M8j005J260l63n21J247p70k3J152j283L20N50j252Q94
2389B05n4q47J137n13o31J462j081Q4R92j126M78N11j285R80l5j091J137m71n72
2408g20J313r20j3J114j230N31M87j195J057r8j064J225m80o45J348j140J24R72
2426F66j184O14N21j265R64M0j032J155o39m54J127r79J90R20j181P54M13j233
2444f03J070n4j138J220o05o67J221q96J20R25j122O13N71j226J177j47j069J088
2462D78n26n47J032q15j9J199j265O70L45j138R85j29r13J067n98l34J023r18
2480d03Q3R68j060N80M72j234J002l1r77R98n32n26J087r81L06P96j133O32M48
2499D95j163J040o4r14J162o50l90J141j038K49Q80j385P15L42j063J018j79q19
$$ plain form
2371 -270 27 580 -855 -49 -1 -1006 254 -109 -630 617 -153 -176 976 -307 13 563 -689 205
2389 205 151 -696 441 -72 -703 759 -322 -238 754 -372 106 617 -668 312 277 -814 323 -148 -720
2408 -720 593 -327 -340 774 -456 75 562 -633 424 326 -738 487 7 -638 710 -430 -306 666
2426 666 -518 96 617 -648 316 356 -676 479 -160 -614 513 -466 -276 644 -537 217 630 -603
2444 -603 467 413 -725 495 -110 -777 444 -452 -332 593 -529 84 655 -571 606 459 -610 478
2462 478 -48 -595 437 -378 -397 802 -463 207 552 -586 399 270 -643 424 -174 -508 515 -403
2480 -403 -320 648 -412 168 640 -594 408 377 -600 398 -134 -660 427 -554 -248 548 -585 47 495
2499 495 -668 372 308 -606 556 -94 -484 657 -381 -132 748 -637 78 420 -643 375 196 -623
2517f23J133o96j23J006j020J08Q46j207P50L27j081J076j73q24J042o49j94J146
2535H44j220K84O43j166O69K33r80R15j69o32J223p35k13R82r84J90O24j149O70
2554B9J96r88J078k24o05J187o51k68R22j090K17P32j313P45L86j061J059j85
2572A66o26J110n99k10Q98q89J49O06j220P79R9r07Q44k66m00R48p68k4R09r11
2592c12K00Q42j169P08J17r02R73m21o13R36o44j41R80j058K70P16j010O93L19
2611D84q13R95m22o15R91p32k37O65r32L35O50r16Q33J42q86R64l26n02J034q39
2631a27k52R36j129K29N10r33P16L0o76J157k46m95Q57n92k10Q29r63L35M17j145
2651g52P23R7q35J042l84m23J113n93k6P26p34K21M15r56O76o1r32P70j50o04
$$ plain form
2517 -623 510 -186 -309 697 -323 -215 631 -576 174 501 -580 496 323 -501 541 -108 -302 844
2535 844 -376 -92 551 -615 54 287 -693 222 53 -579 644 -91 -304 678 -306 -116 508 -641 29
2554 29 225 -763 315 91 -514 673 22 -246 676 -414 -197 535 -778 -33 353 -708 351 166
2572 166 -460 650 51 -159 739 -150 -1 605 -615 164 263 -644 200 -66 -466 482 -286 -310 599 -312
2592 -312 -112 730 -439 269 386 -516 457 36 -577 359 -285 -426 554 -504 -234 482 -528 165 484
2611 484 -329 666 244 -371 620 -112 -349 316 -616 -281 369 -547 286 428 -458 506 180 -322 712 -127
2631 -127 -379 557 -572 -343 167 -766 -50 -20 -696 461 215 -280 577 -15 -225 604 -359 -24 393 -752
2651 -752 -29 68 -767 275 -109 -532 581 -12 -38 688 -46 175 590 -366 310 249 -683 87 -63 -667
2671f67R08n94J65P94p24L27L49q94N10J23j081J068m51n25R82p04L1Q84q01L93
2691I3M81q51N15J96j035Q74l53m56Q31n83j6Q02p57L24N16r77O07J28q18P99
2711C20m90l62Q91o54K2Q81r91L37N52r15O30o9p70Q74m00l97Q56n40O0P60q41
2732b46M79K26q15O37m7q20P94m29m08R34o77O8P22o52L42N31r60O80k4p17O76
2753B94n08l56R79q93R5P78p85N14L06o90O76j88o08O95n05k19P52p23M3O64p86
2774d65N71L63p61P16j9o56P20m20m60P67p36N4O54q99M88M62q04Q28k2p59J016
2795F38n32l47P55p28mN61q13M81K19p07P79j83n48Q49m84l85P93p15P9O33p90
2816d49N12L15q78R04k11n16P03n10j96P11o65K5O87q45N28J80o85Q17k26n91
$$ plain form
2671 -667 241 -353 -188 606 -118 209 558 -336 174 297 -784 284 -167 -692 290 -414 -383 501 -300 93
2691 93 574 -277 238 434 -601 273 -80 -536 295 -288 -304 498 -259 65 581 -396 211 339 -479 320
2711 320 -170 -532 359 -295 -273 608 -383 -46 506 -409 221 152 -618 256 -144 -541 315 -225 -165 595 -246
2732 -246 233 459 -356 281 234 -586 208 -221 -629 305 -372 -304 418 -234 108 639 -321 359 335 -382 294
2753 294 -214 -570 409 -484 -389 389 -396 118 424 -266 410 222 -386 309 -196 -415 337 -386 -343 321 -465
2774 -465 106 469 -292 424 405 -251 469 49 -411 356 -380 -326 328 -571 -83 379 -425 403 381 -378 638
2795 638 106 -241 514 -214 -218 343 -470 11 230 -477 302 119 -429 420 -64 -449 344 -371 -292 341 -449
2816 -449 63 378 -500 404 193 -323 380 -130 -326 385 -280 -255 432 -413 115 295 -390 427 201 -390
2836c90Q63n40j86Q12r80L22N81q76L84M00q04O95j29o21P69m63k08O77o84J10
2856b68N72q05M89K72p56O87p7n69P84l91j78P88q43K51N95j007N74K10q03P00
2876B25j30o56Q08n12k4Q10q25K76O83r07M80Q9o81O19k11o01Q31n30j35O51n78
2897c18J57M79p62O01J43q55Q40k52m31Q15n78j34P23o37J61N26p90N87J03p69
2917c91O40j83n75J003o31k16R52q88K01M10n72M56N6p33P20j98n01Q05n31j30
2937c06Q03p56l9P19p28M58J11p62P26j78m54Q46n61r3P37q36L60L22p24N38J8
2958B01o21P65k27l86P23n94pN35p40K31N46q89N51mm51P90k75m02P59o34j2N95
2980D54p80L20L83q85P08L7p71O97j59l95Q47o23M4O56q89L42L87p83N73n3n69
$$ plain form
2836 -390 473 -67 -253 559 -421 -99 482 -394 -10 390 -414 281 152 -469 300 -163 -371 306 -378 -268
2856 -268 304 -501 -12 260 -496 191 114 -455 329 -62 -240 548 -295 -44 551 -456 118 328 -475 225
2876 225 95 -561 247 -265 -289 521 -304 -28 655 -252 228 317 -364 255 44 -557 274 -256 -391 260 -318
2897 -318 -161 318 -444 157 300 -555 285 33 -398 417 -161 -295 428 -209 -48 478 -312 275 378 -391
2917 -391 249 66 -509 494 -137 -353 599 -289 -88 322 -250 206 262 -471 249 51 -450 355 -176 -306
2937 -306 497 -259 -298 421 -307 151 262 -500 226 48 -406 440 -121 -214 523 -313 47 369 -355 183 201
2958 201 -420 345 118 -268 455 -139 -146 389 -351 -120 426 -463 88 84 -367 423 148 -254 505 -129 -141 454
2980 454 -326 -6 377 -508 200 237 -534 163 4 -391 456 -167 -123 533 -356 -14 373 -410 163 110 -459
3001d59Q73m35l58Q22m85k24O52q00M03L19p15O10Qo54P00k92k58P07p68P3P62
3022D81p67K54N06q78M60P5n66P36l38l92P37n41n8P35p52L11K61o78P41p3p63
3043e09Q92l61m80R01o32n5O38p32K84M10p93O24m4o75Q62l07l59P73o72J18N90
3064D73p65L36M09q35O80p8p50R01n63j96O85n50J8N71p96M40M61q63P04o5n45
3085c28O47m66j55O49n69J83N06p92M11K28o80N69r4n49P45l80l06P57o86K73
3105c7M57p72L49L32p09N82k3n07P68n25k15O75n99J66M93p43K95L13p59P48j88
3126A01m92Q05m69j63O29n89QO04p25L60J78p02O58r9n32P51m04k01Q07p82J72
3147h5L48o61M36K27o51O38j22n30Q46n25j19O77p92J52O18r04L90L03p08O71
$$ plain form
3001 -459 414 -21 -379 443 -42 -266 386 -414 -11 308 -407 203 211 -443 257 -35 -293 414 -354 -281 481
3022 481 -286 -32 474 -404 56 131 -435 301 -37 -429 308 -233 -291 444 -308 3 264 -414 327 254 -509
3043 -509 383 22 -458 443 -189 -244 394 -338 -54 356 -437 187 143 -532 330 23 -336 437 -235 -117 473
3064 473 -292 44 453 -382 298 220 -530 371 -192 -388 297 -253 -235 336 -460 -20 441 -422 282 217 -328
3085 -328 319 -147 -302 347 -222 -39 467 -325 86 314 -366 203 109 -440 305 -75 -381 376 -310 -37
3105 -37 420 -352 -3 329 -380 202 179 -328 440 -85 -300 375 -224 -58 435 -308 -13 300 -459 289 101
3126 101 -391 414 -55 -218 411 -178 -170 434 -291 69 247 -455 203 104 -428 323 -81 -282 525 -257 -85
3147 -85 263 -398 38 265 -386 252 130 -400 446 -79 -198 479 -313 -161 457 -447 -57 246 -462 209
3167B09q7n89P93m81j14P50p96J97N54q18N66O9o40N68K6n73P55n94j26O93p28
3188c66K65M91p00M17K52p92Q82l68m76Q28o20j10O17n67J19M33p15M49J41o27
3208d47O19Jn04O31m82q6O85q12L60M38p66L92J49o64P52l17l62O78m77p6P89
3229E01p94K58M56q83O15Q0n46N66k24m56O91m15o0N88o30L09L99o70L85K42p54
3250c42O48l42n05Q10m95j11N81o03K43M03o68M83J36n40O69l63m66P99n82m3
3270b88O33p08K67M87p85M67K25n20L97j72l34P26m47o4N03n55L32L10p67M91
3290A98m3n89O46k12l66N75m42q1P25n96L24R1p14O22P3o89O30k52m16Q23n00
3311a93J2O62p06L88L41p52M83p0n71N81l83j82P00m71j9N78o16K22K93n50L85
$$ plain form
3167 209 122 -467 326 -155 -269 481 -315 -118 436 -382 184 253 -387 181 207 -366 389 -205 -331 362 -366
3188 -366 -101 390 -310 107 359 -433 449 81 -395 433 -187 -297 320 -247 -128 305 -410 39 180 -447
3208 -447 172 173 -331 300 -182 -268 417 -395 -35 403 -363 29 178 -486 266 -51 -413 265 -212 -288 501
3229 501 -293 -35 421 -462 153 233 -313 253 29 -427 264 -151 -211 377 -253 56 455 -215 170 412 -342
3250 -342 306 -36 -541 269 -226 -337 244 -359 -116 287 -381 102 238 -302 367 4 -462 337 -245 -288
3270 -288 345 -363 -96 391 -394 73 298 -222 175 3 -331 395 -52 -116 387 -168 164 474 -293 198
3290 198 155 -434 212 0 -366 209 -233 -314 411 -185 139 230 -484 138 211 -478 152 -100 -516 307 -193
3311 -193 -181 481 -225 163 504 -248 235 165 -406 175 -208 -390 310 -161 -180 398 -218 4 297 -253 132
3332A32O6n22O97m37j69N93n05n5M57o62M02K80o71N67j09m56O48j96l73Q61o97
3353a49Q1M88q51M29K88o94N99j18m18O55l67k45O79n42nM34o29M07J75o84O25
3374A58q8m55P67k85m19P08m95j11N85q34N86K02o46M75l2m78P00m60j43O12m85
3395a38L7M76p18L43L12n88N84j68l96N93l71l59O49m83j4N29o28K74K89o60O83
3416B46j19m90P79n03j60O17o01J37L94o08L38K15n15N14q1m01N28l41k28P00
3436D21o31P3M26p12M92J99p14N87n9l15N38l10j93N23m91J65L01n89K59J31m98
3457c97O25k09m35P85m35j32N47o30K59L51n13L67J19o08N73j37n20O15l31k48
3477c54O98o75K55M07m88L78Q2n72M56j30l19N92m26j26N86n12M1L92o50M15K04
$$ plain form
3332 132 198 -324 373 -64 -233 360 -145 -200 257 -405 -3 277 -394 173 64 -392 256 60 -313 548 -149
3353 -149 -68 420 -431 -2 286 -408 191 73 -345 310 -57 -302 377 -165 -170 264 -365 42 217 -467 158
3374 158 70 -385 382 97 -322 386 -109 -220 365 -469 117 319 -327 148 116 -362 338 -122 -265 347 -138
3395 -138 -101 375 -343 0 312 -276 308 140 -256 337 -34 -393 256 -227 -241 288 -340 -66 223 -437 246
3416 246 127 -363 416 -87 -247 370 -231 -94 300 -308 30 245 -270 244 163 -238 290 -51 -279 421
3436 421 -210 -137 289 -423 69 268 -446 141 82 -233 305 -5 -198 325 -166 -1 300 -289 -30 101 -397
3457 -397 228 19 -416 369 -66 -198 349 -281 -22 329 -184 183 302 -306 267 130 -390 225 -106 -354
3477 -354 344 -331 -76 331 -157 221 303 -269 187 57 -262 330 -96 -222 364 -148 -107 285 -365 50 254
3498B54o17N46j27k68O09m85j00N37o93L34K30n65L77J53n49P21k64l86O37l65
3518b1j02L86n19K95J09n72N58n7n49O69k40j79O42n00n4O21o86K08L72o79L49
3539E1Q4n36O80l40j80N11l21j01M80m67J81K28n68M55J9l45M31k61k70O18l64
3560a5j11L72m50P0L97n57M30M0m10M11j93k60N88n47l8O24o81L98J66n14M47
3581A67N1m50M74k36k13N32m62J36K55m88J88K44n58M04J24n00N20j96k00N31
3601C23l17r7M69n65L05J61n78L70N3l00M21l45o3M90n37K1N35n84J62M83o10
3622b03K59L6l47M56j58l83L95k85J01N02o55M00J38m15L41J3m43N33m03r8K93
3643G7k83J18L87n52M48Q1l94M24k2m57M21m12j62N30m51p1M17m44L04K39n08
$$ plain form
3498 254 -363 183 56 -212 397 -88 -188 349 -344 -10 220 -345 32 185 -364 357 93 -293 344 -21
3518 -21 -123 263 -256 39 148 -424 134 77 -472 197 -43 -222 420 -80 -134 487 -199 9 381 -298 51
3539 51 135 -401 279 -61 -241 270 -51 -152 328 -139 42 270 -298 157 176 -169 262 1 -269 349 -15
3560 -15 -126 246 -204 -134 263 -294 136 176 -234 177 -16 -276 312 -235 -273 351 -330 68 234 -280 167
3581 167 218 -232 242 6 -207 325 -137 -1 254 -234 -46 198 -360 44 168 -332 188 -8 -208 323
3601 323 6 -91 378 -187 118 279 -299 71 124 -176 245 -100 -163 327 -210 -189 346 -238 -76 407 -203
3622 -203 56 92 -255 201 43 -340 55 -230 -129 373 -282 118 256 -159 182 195 -248 285 -118 -216 77
3643 77 -206 -88 299 -253 195 276 -118 306 284 -173 248 -164 -326 204 -247 -318 99 -345 -41 198 -310
3664c10N01m4l44M62j70k30M14l70p8L82n36K46K71m93L68l4k82N10k83k99O01
3685B82l81J38L12n34K91K31n43M12j80k86M15j05l45O18l90M8K39l29K05j4l90
3706c06M64k29k78M94k90j38N78n74J22L71l80K46J32m76M98j35k25L46k58p8
3726a16L98l29k36M49n00L46K00m95L80j6k14M83k32j57L23l59NL88o66K89%k16
3748b75L42j38k04N43k83n8L88l31N9J81m92K57J21l72L63j76j77L79k18K0L25
3769B54m35J70K35m03L03j5l90N01k06k02K73l01N7L33l02O4J96l24J70K28m73
3790b67M55r0l02M22k24k55M24m00R1K72m27M47lk93L80n4l86M24k76r0L89o62
3812d25K71L25m50L61O3l60L88m7k62M53m68J14L10m56J60J66l48L87j23k50M36
$$ plain form
3664 -310 191 147 -197 265 95 -135 279 -91 -169 213 -323 -77 194 -299 69 35 -247 263 -20 -319 282
3685 282 -99 39 351 -183 108 339 -204 208 28 -258 157 52 -293 325 -65 -17 222 -107 98 84 -306
3706 -306 158 -71 -349 145 -145 -283 295 -279 -157 214 -166 80 212 -264 234 99 -126 220 -38 -116
3726 -116 282 -47 -283 166 -334 12 212 -283 97 81 -133 350 118 -39 284 -75 -70 318 -348 -59 -59 -275
3748 -275 67 -71 -275 268 -15 -73 315 -16 43 224 -268 -11 110 -262 101 -75 -252 127 -91 -71 254
3769 254 -181 -11 224 -179 124 109 -281 220 14 -188 85 -216 -159 174 -128 -64 132 -192 -22 206 -267
3790 -267 188 98 -204 218 -6 -261 163 -237 -146 126 -301 146 143 -150 230 176 -210 214 -62 -152 237 -425
3812 -425 -154 171 -279 82 145 -215 173 126 -136 317 -151 -37 273 -183 -23 143 -205 182 59 -191 245
3833B45j94j40L12l68J18L03l79j48M04m65L39Q5k88L55r4l00N04l60o2L77n24
3854b80L63J56n37L54n3k71N08k71k3L07l78J2K88l20K32J55n08L42j3l48M26
3875A41j80j20M11m19l6N01n21L6M34n80L37M0k80L44k52M3M37m25L7L16m11J59
3897A2J44n79N28j73k13M04j72o3L27k79R9K51m05J52J85n35L71J3k71L46l00
3918a58q3L51k00J62J35l47K14J12m16L34m9l96M43k53m2L13l10J49L72m97K24
3939E8J63l76L41j54k80L44q4j17K08j41o1L11m18J85K91m28M04k05j97M17k76
3960a5k66M57l19P5K11l98L09J99m68K41O2k24L02k19r7L66l51J45J41l91L60
3981A20k2j96K00J7k66L75k72r2M56n29K44J02l53L19J01l65K98j33l48N35j92
$$ plain form
3833 245 51 -89 223 -145 -27 276 -103 -251 153 -312 27 112 -176 179 85 -215 289 -71 -133 244 -280
3854 -280 83 239 -298 56 3 -268 240 -31 -54 253 -125 -113 175 -145 87 242 -266 76 63 -285 141
3875 141 -39 -159 252 -167 -203 298 -223 -187 247 -333 4 44 -236 108 -144 -101 336 -89 -52 264 -147 12
3897 12 156 -423 105 -68 -281 123 -49 -112 215 -64 35 286 -119 33 218 -317 54 67 -204 142 -158
3918 -158 -241 110 -90 72 207 -140 74 186 -230 104 55 -341 102 -151 -193 120 -190 -41 331 -166 58
3939 58 221 -155 186 32 -248 96 12 -105 103 -38 -99 212 -206 -21 270 -158 246 41 -156 261 -15
3960 -15 -281 176 -143 -68 143 -255 54 253 -215 26 88 -136 166 -53 -150 216 -135 10 151 -240 120
3981 120 98 -98 102 119 -147 228 -44 -136 320 -209 35 137 -216 103 204 -161 137 4 -344 191 -1
4002aj74M70m52K48J64m58L85L8l84L16J5m05M37l33kL48l05R5K12m70L64O6l71
4025a97L24o7j52L04k79j03L43l35R5L36m89K30J62m23L87k3l04M08k33k77M48
4046A55k58J82Ml39L41N2l34L73o6k43K46k34q3L37l15J47J44k84J62O1j22K28
4068A54j91o6L39l12n1L95m46J81J74m34L40m6k41L27j22lK03k88j00M46l54J66
4090G1L2l49L28N2k99K74p5j96L07l78J20L50l84J25K57m21L28Ok90K83j09k29
4112a97L30k13q5L27k81J36J97l40L52l8l94L88j02l23L85k28j20L15l68L15J31
4133A87l56L22Ll46M42k78j17L56l60N5J72l75K57J99l34K77m7k20L96j56j10
4154c3K83l24j0K35m11J62J70m28M39Ok11L56r1k52L38l00j37L12k88J26J56l41
$$ plain form
4002 -1 -175 295 -157 91 255 -203 182 220 -164 152 167 -238 199 -134 -136 212 -93 2 214 -256 108 174 -197
4025 -197 127 60 -92 212 -67 -170 173 -162 -67 269 -220 10 172 -251 136 113 -191 217 -16 -293 155
4046 155 -103 79 83 -256 85 137 -197 176 110 -133 113 -121 -204 133 -182 -35 109 -175 -13 48 -74 154
4068 154 -37 -103 236 -76 -127 268 -178 3 177 -257 83 37 -204 123 1 -2 201 -87 -187 259 -95 71
4090 71 103 -246 82 134 -165 109 34 -162 145 -233 -113 237 -147 -22 235 -186 142 148 -142 141 32 -197
4112 -197 133 -80 -165 162 -119 17 214 -126 226 188 -206 182 80 -243 142 -86 -206 109 -259 56 187
4133 187 -169 153 156 -190 252 -26 -143 213 -147 -92 80 -295 -38 161 -173 104 57 -163 233 77 -33
4154 -33 250 -74 -84 151 -260 -98 72 -356 83 89 -122 234 143 -109 229 -71 -208 104 -184 -58 98 -243
4176b43K52R3l67M83j57j89M07l24k6L19m40J17J89l57K55J19l48M90l16j57M50
4197B50l56J55J98l84J36J40l13K21k4j55J70j06q4K82k52P6J36k76K18Rl07L13
4219D7R4l71L21p2j48K86k25R3K40m19K73p5j80J92q0j85M53k25j69L49l62Q3
4241h0J34j53J25J40k81J87l8k71M52j81j02L34k72l4K50l52J03J31l90M15r2
4262B5l9J62k24l5K69k38Q1K01l60L10K8l80K86n0l49M98j91j55K50k85J90P8
4284G2j51j2J71l28M14k46j5J84j77j5K04j34J83J03m19K83n7p7K28k60j52M23
4306B22j86j11J87k25R4J31k41K98L0l72K55l0l07M15k76K0K15k44Q0J88m26L07
4328B4k9k43L17j38j4J58o7p6K16k97K56m4k17K72k2k45K79j33k07M16j98r7M11
$$ plain form
4176 -243 9 102 -265 218 61 -128 279 -45 -71 248 -192 -75 114 -243 12 131 -217 273 -43 -200 250
4197 250 -106 49 247 -137 -1 139 -174 47 23 -132 38 -68 -152 130 -122 -46 90 -186 32 41 -266 47
4219 47 141 -230 91 19 -129 157 -68 25 265 -154 119 44 -136 56 -24 -209 244 19 -150 199 -163 -80
4241 -80 54 -99 26 166 -115 72 34 -237 215 34 -68 266 -6 -40 210 -142 -39 92 -298 117 25
4262 25 -14 148 -76 -111 158 -80 1 202 -158 152 180 -200 86 36 -313 185 -6 -161 89 -196 -6 72
4284 72 -79 -91 80 -248 166 -80 -95 89 -88 -103 101 -33 150 253 -166 117 60 -17 211 -49 -201 222
4306 222 36 -75 112 -113 -19 112 -129 169 199 -173 82 52 -255 160 -116 -96 119 -125 -45 143 -283 24
4328 24 -5 -248 69 -69 -83 75 8 -68 148 -149 107 63 -154 118 96 -149 130 -3 -210 206 8 -89 322
4351C22l58Q4J24l28J41Q2k81K63L1k30L52k69oK70m10K43K10l79L40j69l87M19
4373F4j39j75N07l51J6K30k35J79O1k82L14k2l45L01k2k19K28k62q5M59l88K15
4395D9J87m91M44j86p3K91k32r6K01k32J16J90l78J45K37l13J40K9j41L35k86
4416f4j52K62r0p9J89k58J98Q6j98K76j28k59L58k04qJ06k46J77J24l36K97M7
4438I8k66L24q8r6K04k12j44L75m23K39J51l00K53k4k15K92j72j49L27l3k94L28
4460A75k26k33K82k52K60L4l64L66l9j63M07k63l4J53k26mK12l10K71R3l65K36
4482A0M6j75K65m9j36J08j74O7J66k65J30J31l82M43j52j49N70m25m9K45l35J78
4504F8n7k51K40J21m33M18J8l28L06j80Q4K09m10J62J88m07K47O0k38L20j57j28
$$ plain form
4351 322 -36 48 172 -156 -15 67 -214 49 80 -150 202 -67 -73 197 -213 30 240 -139 201 32 -355 64
4373 64 -75 -250 257 -94 -78 152 -83 96 157 -125 189 167 -178 123 101 -118 110 -152 -237 222 -166 49
4395 49 236 -255 189 3 -70 221 -11 -107 94 -138 -22 168 -210 -65 172 -141 -1 28 -113 222 -64
4416 -64 -216 46 -44 -123 66 -192 6 92 -106 170 42 -217 141 -63 -71 35 -211 -34 90 -246 51 98
4438 98 -168 156 68 -28 176 -36 -180 195 -228 11 162 -138 115 91 -124 168 -4 -153 174 141 -153 175
4460 175 -51 -284 -2 -254 6 40 -324 42 3 -160 247 -16 -50 103 -123 -127 85 -225 46 139 -226 10
4482 10 56 -119 146 97 -39 69 -105 -38 128 -137 -7 124 -258 185 33 -116 454 29 -20 225 -110 68
4504 68 11 -240 0 121 -312 106 124 -204 102 -78 6 215 -195 -33 155 -252 -5 55 -183 137 -20 -148
4526a48L38l53K31J55k98N1J78l12K76M5m16K88l7r9L23k00j49M43l34l0J52k79
4548a75J62J42l62K31m5j66K12r8oL14l25R8J69j68J0J36k70K92j41j95M07j87
4570C5k07M82m10J62J00k97K06k5j64K04j50l4K01j60Q2N2j52K46q1j95K04K3
4592A22k24J83p6j25K88l59J45J17k05J12J78k76J80J36k82K12j13j47L17k93
4612a10l0K81l69K37Q2k65K60j8j86K27nk00K84k18PJ92k75J53Q3k78K60k4j59
4635g1J44m8j33K36j86K2K44k67O5R5k11J37k7l12M49k13j03K91j68J42O9j94
4657c9P3N8k50K34Kl12K99j28r3K09nj67K02k14J97m6j81L41j56j61K53j21j07
4680a12L57l40K4J99k90J39J32k10J00j4j56L31k54L2K94l09M2K39l14J66J17
$$ plain form
4526 -148 190 -163 68 223 -75 -24 154 -158 118 163 -253 35 -2 -101 222 22 -127 316 -18 -48 104 -175
4548 -175 -13 129 -233 -2 -47 -213 -1 -99 -105 209 -116 -18 151 -17 -7 129 -141 151 10 -185 222 35
4570 35 -172 310 -100 62 162 -135 71 46 -118 86 -64 -98 103 -57 25 77 -75 171 90 -105 99 122
4592 122 -102 81 5 -120 168 -191 -46 71 -134 -22 156 -120 60 196 -86 126 13 -134 183 -110
4612 -110 -140 141 -228 9 91 -174 86 68 -118 109 104 -96 188 -30 -23 169 -106 47 130 -148 112 88 -71
4635 -71 73 25 -108 128 -58 -36 208 -59 6 101 -110 27 0 -312 137 -76 -179 112 -56 86 155 -39
4657 -39 34 92 -158 76 78 -234 65 -63 -156 53 48 -119 83 -131 66 20 -161 180 24 -137 116 -5 -112
4680 -112 245 -95 -71 128 -162 -23 109 -101 -1 -15 -171 160 -94 -62 232 -77 -35 204 -110 56 173
4701A73l59K45rj01R2j06n0L28l47J20R7j99J67J8o8K19k64j61J53j02N3J70j94
4724a25L2K76l13J79L3j94J85p2k76M24k48j01K52j88J25K29l23J69l5j62J65
4745C2K0r4J41k13JK23k30Q0K05k56J89K9j30J17k3j56J81k19Q5L7j10J3J16j60
4769a22J03Jj47K13o0j09J50k8M2Q4k58J86Mk34K62p7j18J59m7j29K39j94M9K57
4793B26l64J27J27k62K08M5k22J94r5k8K07j62j02J91j42j0K05k19Q5J67l50K27
4815E3k5j33K11m3j80K59j15j0J67l77K32J12l19K30Pj23J72j79r5K52k18J16
4837fO5j00J85j93oK01j97r4K97k73K7K33k68N9J34k34K05k2l5J06l5k15K48k0
4861F2o7P0k31J50n5n7J18L2j80L10j82j10K57j39j2J21j18K0Q5j99J17Nk88M01
$$ plain form
4701 173 -186 59 50 -51 41 -65 -115 213 -134 -14 83 -116 51 69 1 220 -44 -205 -52 -154 -101 69 -125
4724 -125 -93 183 -130 49 82 -112 73 1 -275 149 -99 -200 52 -136 -11 218 -105 64 29 -133 32
4745 32 52 -42 99 -114 -113 110 -120 -40 165 -91 98 127 -3 114 91 -65 116 -103 -18 19 -91 -78 38 -122
4769 -122 -19 -18 -165 48 -12 -121 29 1 43 127 -131 55 59 -175 87 10 -108 51 4 -125 114 -80 -31 226
4793 226 -138 -11 116 -146 62 107 -115 79 -16 -44 163 1 -101 90 -52 -62 143 -76 9 176 -174 53
4815 53 28 -105 106 63 -117 142 27 17 184 -193 39 151 -168 62 69 -54 118 -61 -156 96 -122 -6
4837 -6 59 -41 144 -49 -55 146 -51 -145 152 -121 -94 139 -129 -70 64 -170 35 13 -22 84 49 -166 82 62
4861 62 -5 65 -166 -16 -71 -128 -10 22 -158 152 -30 -140 117 -22 -34 87 -31 -11 74 -125 -8 -3 -291 110
4885A10j65l2K86k47qK30k29J28R3l52L50k0k11J32r4p1K69k36R6Q4j95P6L4j87
4909a59K41m1k55K24M1l4J50j29o5K9m6L7N5p7J62o9k11K48r3r1J37L6j44J44
4933I0j96J00L6j84K46j1m8J6l3k15L04m9q8K27k41P0Rk19K89j02j80K06k1l3
4957b7K30k03m1J07q2J35M8r9N6n1j54J80n6j42J90j33k3K70k68P7P3j58Q1J28
4981A38k68J26p2L9J3R6j9N6k22Q5P2q2J19M2j81J66k14J7J34j0J17j75j13J66
5005C0Q3j39J61j61l9J54o8j58K86j74q5J45q7J88q8k34K95j73k9J17j12m0L35
5028B07k59KK22k01J30q7r0Q5j00J3J65p8p9J43j10l3K53j76K8J18k42L4P3n5
5052c7Q6k05J74Q4j45N2J59j80N3K4o0J07j17k7O6q2r8J14j4j7O0j15R2L6l1K8
$$ plain form
4885 110 -55 -87 199 -48 -56 174 -55 73 166 -186 164 144 -67 65 -29 -100 169 -67 29 113 -82 -6 28 -159
4909 -159 82 41 -214 10 51 17 167 38 -27 2 -44 -7 48 -29 133 64 -147 101 8 -83 54 90 -54 90
4933 90 -106 -6 30 -154 92 81 33 49 16 -199 105 56 -32 195 -46 24 33 -186 103 1 -179 27 6 -27
4957 -27 203 0 -41 66 -16 119 167 68 124 73 -81 99 43 -99 91 -42 -65 205 -63 14 87 -71 10 138
4981 138 -130 -4 -76 -37 -24 72 53 109 -113 -28 44 -38 81 123 -58 108 -106 -89 45 35 152 -23 -136 30
5005 30 113 -26 135 -26 -65 89 21 -137 149 -25 -110 35 -52 136 48 -186 109 -64 -93 24 -88 -128 207
5028 207 -52 -50 172 -29 101 14 -76 9 -91 -78 87 9 -70 73 -37 -70 183 7 35 153 -89 -55 18 -37
5052 -37 49 -156 18 102 -43 9 168 -12 41 65 5 112 -5 -32 34 -48 -146 -32 -46 -63 -3 -118 -26 10 -21 7
5078GK0j07J47o1k8J71j30J17q1r2o6R1j16J98q0j66K80j10r9J87j46R9J20j16
5102C9p8J06j47R2nJ0L4j0j60K17k14N9J02j09Q6L3k44L27j58p2J94j08o9J58
5126H3j46KJ22j62J96p0q8J25r9K2J53j44M4J52k34oJ63l37K90k0j68J78k9q4
5150e7K27k66j00K28j31qJ14k23K66L8j69K40k24p6K32p2l1J49j95J3O7k20K07
5173IR3j31Q7q7n1J04j6m8J49j40n9J57j00J14j82J3K03q0n9J30j13l0J49k39
5197a27O1K09l71O5K87k14R0kq2K41j17r9J36k39L39j21k23K11J9n6J65k16jP3
5221B8j12L9R7j81J03J4m4N1l2k3J38k4j45J72Pj80J64j96J07K5r8J06Q3k96K58
5246F1K2j02J87j62m5J87k08J55jj80J55Mj21J66j44j02K19j99M8J02k26J73J24
$$ plain form
5078 7 27 -80 67 6 -22 149 19 136 55 -37 -103 -12 -128 70 -10 -176 104 -6 -105 82 -64 35 155 39
5102 39 -39 67 -80 12 7 17 51 41 -119 98 -116 -57 45 -64 22 55 -189 138 -20 -92 102 -6 -75 83
5126 83 -63 -61 61 -101 95 25 -63 62 -37 -15 138 -6 38 190 -44 -50 113 -224 66 46 -122 56 27 -57
5150 -57 170 -96 -196 32 -99 -107 7 -216 50 88 -81 159 -65 -141 91 19 -12 137 -58 -45 22 -198 9
5173 9 102 -29 58 -29 -80 24 8 -40 109 -31 -90 67 -33 81 -101 -88 115 35 -24 106 -7 -37 112 -127
5197 -127 -66 143 -228 -163 124 -90 0 -2 -84 157 40 -59 77 -162 177 56 -167 44 63 7 172 -44 -45 28
5221 28 -84 -45 52 -129 -26 -12 -56 -5 -37 -60 78 54 -91 81 88 -92 72 -124 -17 8 -90 16 99 -197 61
5246 61 83 -19 168 6 -39 148 -60 95 94 -86 69 73 -48 118 -26 -128 91 -108 -60 42 -184 -11 113
5269A13j96J05J8j46M0K7k8K92l62P4P7p9J00P4k60J79j11oJ20p6M9O4j54N0J14
5294G8j53J04N0j37J05q1L1J3qq3J21l9L8Qj55J0M9n6J38l1jJ05o5r3J71j44K6
5321AK0r2J65p9m6Q3R2j66K48l11m3J59k3K7P8p4O5q7l8j0j00R4R6J2p6J66j74
5348a3m2J32n5P7p2m6Q0j40RJ84p2q2N3r6J00Qn6P5Q4j56P7N9k28J01o8Q2J58
5375A53k41j3K12j23n3N3j42K57Mk07K63k11L0J46k40J88pj69J00L9j21J26n7
$$ plain form
5269 113 -83 22 40 -106 -66 -39 -67 225 -137 -63 14 -65 35 109 -151 28 -83 -89 31 -45 4 68 -86 -36 78
5294 78 -75 29 79 -58 47 -34 -3 10 2 -81 40 1 39 47 -108 -98 -49 -105 33 2 1 106 41 -52 119 -25 1
5321 1 21 -71 94 15 -31 52 144 -22 226 -85 -128 31 8 35 113 39 104 17 -21 -31 -131 -37 59 71 -5 161 -13
5348 -13 -55 77 22 99 27 -19 61 -79 -70 114 42 -40 13 -83 17 25 -31 44 128 -28 49 108 -120 -19 -87 -5 153
5375 153 -88 -101 111 -12 -65 -12 -154 103 107 -100 163 -48 -18 128 -112 76 69 -100 0 39 -82 44 -13
$$ [...]
8191d1
##END NTUPLES=NMR FID
##END=
