##TITLE=1H_DE-80H_X3
 200.13MHz, d2o
 8 sc
 
 19ns.26.2.2025
##JCAMPDX= 6.0         $$ Bruker NMR JCAMP-DX V2.0
##DATA TYPE= NMR FID
##DATA CLASS= NTUPLES
##ORIGIN= UXNMR, Bruker Analytische Messtechnik GmbH
##OWNER= pz
$$ XWIN-NMR		Version 3.5
$$ Thu Jun 19 15:06:47 2025 Russian Standard Time (UT+4h)  Yarkov@DPX200
##.OBSERVE FREQUENCY= 200.1313
##.OBSERVE NUCLEUS= ^1H
##.DELAY= (6, 6)
##.ACQUISITION MODE= SIMULTANEOUS
##.ACQUISITION SCHEME= undefined
##.AVERAGES= 8
##.DIGITISER RES= 18
##SPECTROMETER/DATA SYSTEM= spect
##.PULSE SEQUENCE= zg30
##.SOLVENT NAME= CDCl3
##.SHIFT REFERENCE= (INTERNAL, CDCl3, 0, 14.3821)
##AUDIT TRAIL= $$ (NUMBER, WHEN, WHO, WHERE, WHAT)
$$ ##TITLE= Audit trail, XWIN-NMR		Version 3.5
$$ ##JCAMPDX= 5.01
$$ ##ORIGIN= Bruker BioSpin GmbH
$$ ##OWNER= Yarkov
$$ C:/Bruker/XWIN-NMR/data/yarkov2/nmr/H-C/1/audita.txt
$$ ##AUDIT TRAIL=  $$ (NUMBER, WHEN, WHO, WHERE, WHAT)
(   1,<2025-06-19 15:05:17.23 +0400>,<Yarkov>,<DPX200>,
      <created by zg, POWCHK disabled, PULCHK disabled
       configuration hash MD5:
       00 E9 B6 7A A2 85 ED C7 34 08 36 98 17 FE 4E 26
       data hash MD5: 16K
       10 3D BA CD 42 57 8E 9C 68 F2 B1 90 4E A8 8A CE>)
$$ ##END=
$$ 
$$ hash MD5
$$ 8C D6 89 09 8B A3 5E 3A 77 43 A6 81 A7 36 78 EC
##$RELAX= 
##$RELAX= 
##$RELAX= 
##$RELAX= 
##$RELAX= 
##$RELAX= 
$$ Bruker specific parameters
$$ --------------------------
##$DU= <C:/Bruker/XWIN-NMR>
##$EXPNO= 1
##$NAME= <H-C>
##$PROCNO= 1
##$TYPE= <nmr>
##$USER= <yarkov2>
##$AMP= (0..31)
100 100 100 100 100 100 100 100 100 100 100 100 100 100 100 100 100 100 
100 100 100 100 100 100 100 100 100 100 100 100 100 100 
##$AQSEQ= 0
##$AQ_mod= 1
##$AUNM= <au_zg>
##$AUTOPOS= <>
##$BF1= 200.13
##$BF2= 200.13
##$BF3= 200.13
##$BF4= 200.13
##$BF5= 200.13
##$BF6= 200.13
##$BF7= 200.13
##$BF8= 200.13
##$BYTORDA= 1
##$CFDGTYP= 0
##$CFRGTYP= 5
##$CHEMSTR= <none>
##$CNST= (0..31)
1 1 145 1 1 1 1 1 1 1 1 1 1 1 1 1 1 1 1 1 1 1 1 1 1 1 1 1 1 1 1 1 
##$CPDPRG= <>
##$CPDPRG1= <>
##$CPDPRG2= <>
##$CPDPRG3= <>
##$CPDPRG4= <mlev>
##$CPDPRG5= <mlev>
##$CPDPRG6= <mlev>
##$CPDPRG7= <mlev>
##$CPDPRG8= <mlev>
##$CPDPRGB= <>
##$CPDPRGT= <>
##$D= (0..31)
0 0.7 0 0 0 0 0 0 0 0 0 0.03 0 0 0 0 0 0 0 0 0 0 0 0 0 0 0 0 0 0 0 0 
##$DATE= 1750331116
##$DBL= (0..7)
120 120 120 120 120 120 120 120 
##$DBP= (0..7)
150 150 150 150 150 150 150 150 
##$DBP07= 0
##$DBPNAM0= <>
##$DBPNAM1= <>
##$DBPNAM2= <>
##$DBPNAM3= <>
##$DBPNAM4= <>
##$DBPNAM5= <>
##$DBPNAM6= <>
##$DBPNAM7= <>
##$DBPOAL= (0..7)
0.5 0.5 0.5 0.5 0.5 0.5 0.5 0.5 
##$DBPOFFS= (0..7)
0 0 0 0 0 0 0 0 
##$DE= 6
##$DECBNUC= <off>
##$DECIM= 32
##$DECNUC= <off>
##$DECSTAT= 4
##$DIGMOD= 1
##$DIGTYP= 9
##$DL= (0..7)
0 120 120 120 120 120 120 120 
##$DP= (0..7)
150 150 150 150 150 150 150 150 
##$DP07= 0
##$DPNAME0= <>
##$DPNAME1= <>
##$DPNAME2= <>
##$DPNAME3= <>
##$DPNAME4= <>
##$DPNAME5= <>
##$DPNAME6= <>
##$DPNAME7= <>
##$DPOAL= (0..7)
0.5 0.5 0.5 0.5 0.5 0.5 0.5 0.5 
##$DPOFFS= (0..7)
0 0 0 0 0 0 0 0 
##$DQDMODE= 0
##$DR= 18
##$DS= 0
$$ [...]
##$SUBNAM2= <"">
##$SUBNAM3= <"">
##$SUBNAM4= <"">
##$SUBNAM5= <"">
##$SUBNAM6= <"">
##$SUBNAM7= <"">
##$SUBNAM8= <"">
##$SUBNAM9= <"">
##$SW= 18.0517328524113
##$SWIBOX= (0..15)
0 0 2 0 0 0 0 0 0 0 0 0 0 0 0 0 
##$SW_h= 3612.71676300578
##$TD= 16384
##$TD0= 1
##$TE= 0
##$TE2= 300
##$TE3= 300
##$TEG= 300
##$TL= (0..7)
0 120 120 120 120 120 120 120 
##$TP= (0..7)
150 150 150 150 150 150 150 150 
##$TP07= 0
##$TPNAME0= <>
##$TPNAME1= <>
##$TPNAME2= <>
##$TPNAME3= <>
##$TPNAME4= <>
##$TPNAME5= <>
##$TPNAME6= <>
##$TPNAME7= <>
##$TPOAL= (0..7)
0.5 0.5 0.5 0.5 0.5 0.5 0.5 0.5 
##$TPOFFS= (0..7)
0 0 0 0 0 0 0 0 
##$TUNHIN= 0
##$TUNHOUT= 0
##$TUNXOUT= 0
##$USERA1= <user>
##$USERA2= <user>
##$USERA3= <user>
##$USERA4= <user>
##$USERA5= <user>
##$V9= 5
##$VALIST= <valist>
##$VCLIST= <CCCCCCCCCCCCCCC>
##$VD= 0
##$VDLIST= <DDDDDDDDDDDDDDD>
##$VPLIST= <PPPPPPPPPPPPPPP>
##$VTLIST= <TTTTTTTTTTTTTTT>
##$WBST= 1024
##$WBSW= 4
##$XGAIN= (0..3)
0 0 0 0 
##$XL= 0
##$YL= 0
##$YMAX_a= 28146
##$YMIN_a= -23177
##$ZGOPTNS= <>
##$ZL1= 120
##$ZL2= 120
##$ZL3= 120
##$ZL4= 120
##$ABSF1= 10
##$ABSF2= 0
##$ABSG= 5
##$ABSL= 3
##$ALPHA= 0
##$AQORDER= 0
##$ASSFAC= 0
##$ASSFACI= 0
##$ASSFACX= 0
##$ASSWID= 0
##$AUNMP= <proc_1d>
##$AZFE= 0.1
##$AZFW= 0.1
##$BCFW= 1
##$BC_mod= 2
##$BYTORDP= 1
##$COROFFS= 0
##$CY= 83.5205535888672
##$DATMOD= 1
##$DC= 2
##$DFILT= <>
##$DTYPP= 0
##$F1P= 10.8118882576601
##$F2P= -7.23987719738617
##$FCOR= 0.5
##$FTSIZE= 0
##$FT_mod= 4
##$GAMMA= 1
##$GB= 0.15
##$INTBC= 1
##$INTSCL= 1
##$ISEN= 128
##$LB= 0.25
##$LEV0= 0
##$LPBIN= 0
##$MAXI= 10000
##$MC2= 0
##$MEAN= 0
##$ME_mod= 0
##$MI= 1.114404
##$NCOEF= 0
##$NC_proc= 0
##$NLEV= 6
##$NOISF1= 3.799351
##$NOISF2= 2.8
##$NSP= 1
##$NTH_PI= 0
##$NZP= 0
##$OFFSET= 14.38212
##$PC= 1
##$PHC0= -1714.172
##$PHC1= 14.16658
##$PH_mod= 1
##$PKNL= yes
##$PPARMOD= 0
##$PSCAL= 0
##$PSIGN= 0
##$REVERSE= no
##$SF= 200.129724274929
##$SI= 16384
##$SIGF1= 3
##$SIGF2= 2
##$SINO= 400
##$SIOLD= 16384
##$SREGLST= <1H.CDCl3>
##$SSB= 0
##$STSI= 0
##$STSR= 0
##$SW_p= 3205.1282051282
##$SYMM= 0
##$S_DEV= 0
##$TDeff= 0
##$TDoff= 0
##$TI= <>
##$TILT= no
##$TM1= 0
##$TM2= 0
##$TOPLEV= 0
##$USERP1= <user>
##$USERP2= <user>
##$USERP3= <user>
##$USERP4= <user>
##$USERP5= <user>
##$WDW= 1
##$XDIM= 8192
##$YMAX_p= 0
##$YMIN_p= 0
$$ End of Bruker specific parameters
$$ ---------------------------------
##NTUPLES= NMR FID
##VAR_NAME=  TIME,          FID/REAL,        FID/IMAG
##SYMBOL=    X,             R,               I
##VAR_TYPE=  INDEPENDENT,   DEPENDENT,       DEPENDENT
##VAR_FORM=  AFFN,          ASDF,            ASDF
##VAR_DIM=   8192,          8192,            8192
##UNITS=     SECONDS,       ARBITRARY UNITS, ARBITRARY UNITS
##FACTOR=    0.0002768,     1,               1
##FIRST=     0,             0,               0
##LAST=      2.2672688,     0,               0
##MIN=       0,             -23177,          0
##MAX=       2.2672688,     28146,           0
$$ Real data points
##PAGE= N=1
##DATA TABLE= (X++(R..R)), XYDATA
0@%%%%%%%%%%%%%%%%%%%%%%%%%%%%%%%%%%%jKoJ2j4J5j6J6j6J6j7J8k1K7l0L1
$$ 0 0 0 0 0 0 0 0 0 0 0 0 0 0 0 0 0 0 0 0 0 0 0 0 0 0 0 0 0 0 0 0 0 0 0 0 -1 1 -5 7 -7 8 -8 8 -8 8 -9 9 -12 15 -15 16
51A6l3L4l9M6m8N4o2O5p1Q1r0J01j14J29j47J66j86J95n05Q66j5436j479K20o940
$$ 16 -17 17 -22 24 -24 30 -32 33 -38 43 -47 54 -60 69 -78 88 -98 97 -408 458 -14978 -16457 -16237 -23177
75b3177J4722L390n17J4532l644j652J1899n651l18p86j5127L396L64j1125Q909
$$ -23177 -8455 -5065 -5582 8950 5306 3654 15553 9902 9584 8798 -6329 -2933 -2569 -13694 -4785
90d785k15q022R525J929L586Q448q146K598N709j0893M333L164j1526J461r11
$$ -4785 -5000 -13022 -3497 -1568 2018 10466 2320 4918 10627 -266 4067 7231 -4295 -2834 -3745
105c745k494Q437m258n88P975p073K927Q221p742Q52J13p061N855j333m557N993
$$ -3745 -6239 2198 -2060 -2648 5327 -1746 1181 9402 1660 2512 2625 -4436 1419 86 -4471 1522
121A522n558j561Q442m281J399L377p471M125K060m734O209k842m953P200k838
$$ 1522 -4036 -5597 2845 -1436 -37 3340 -4131 -6 2054 -2680 3529 687 -4266 2934 96
136I6o62N394o867o1K423n411M969j21o544O199o56j787Q255k326r95L745m984
$$ 96 -566 4828 -2039 -2100 323 -5088 -119 -240 -6784 -585 -1241 -3028 5227 2901 1906 5651 667
153F67L226J956q111K885j112o552N995k9k746M474l357J982N795m872K931K118
$$ 667 3893 5849 -2262 623 -489 -7041 -1046 -1075 -3821 653 -2704 -722 5073 201 3132 5250
169E250p562L528J390m508L625l381k476N594l838J189M942o583J485L465m341
$$ 5250 -2312 1216 2606 -1902 1723 -1658 -4134 1460 -2378 -1189 3753 -2830 -1345 2120 -2221
184b221M040n47m493M679k753j257O351m777j076M104m375K755K366m799L555
$$ -2221 1819 1272 -3221 1458 -1295 -2552 3799 -978 -2054 2050 -2325 430 2796 -2003 1552
199A552j228l531O435k242l015M467m092m1L857l927K256M37m757N266J72l592
$$ 1552 324 -3207 3228 986 -2029 2438 -1654 -1695 2162 -1765 491 928 -3829 1437 1609 -1983
215a983N087k450k501M441k713P77K044n242K749J384m511M428n07m339L954j651
$$ -1983 3104 654 -1847 2594 -119 658 2702 -2540 209 1593 -2918 1510 1003 -3336 618 -1033
231a033o00L890m139Q81K871m416L446J906m627L108p32k373M254k988j078L470
$$ -1033 -1633 2257 -1882 -1001 1870 -2546 900 2806 -1821 1287 555 -1818 2436 -552 -1630 1840
247A840m436J178L648m057K101Q81l357L900j008k069M161l577j129M607l432
$$ 1840 -2596 -1418 2230 -1827 274 1155 -2202 1698 690 -1379 2782 -795 -1924 2683 -749
262g49O27K427l778K350L97k860L923k158k948M337k642r11L740l215P98J983
$$ -749 -122 2305 -1473 877 1274 -1586 2337 179 -2769 1568 -1074 -1985 1755 -1460 -662 1321
278A321l027L212L5l662L698j408k566M029k339p84K791l091J949J917l719K922
$$ 1321 -1706 1506 1541 -2121 1577 169 -2397 1632 -707 -1491 1300 -1791 158 2075 -1644 1278
294A278J81l557L458j161k001L014k734K65L107l499J994K073l771K638N78k811
$$ 1278 1459 -2098 1360 199 -1802 1212 -1522 -1257 1850 -1649 345 2418 -1353 1285 1863 -948
310i48K893j828j474L176l193K16L061l825J322K045l167K428j37k189L183j997
$$ -948 1945 117 -1357 1819 -1374 -1158 1903 -1922 -600 1445 -1722 706 569 -1620 1563 -434
326d34j059L648l063j24K985l194J168J185k757K516o29k211L518j888j234L370
$$ -434 -1493 2155 -908 -1032 1953 -1241 -73 1112 -1645 871 242 -1969 1549 -339 -1573 1797
342A797k523n0K240k833J567P65k951K992m57k392L517j217j069K872k475M06
$$ 1797 -726 -776 1464 -1369 198 963 -1988 1004 547 -1845 1672 455 -614 2258 -217 189
358A89J716l288J774N87l421K654r4k150L069j244o11K651k606R01K024l628J550
$$ 189 1905 -1383 391 978 -2443 211 117 -2033 1036 -208 -819 1832 -774 127 2151 -1477 73
375G3Q86l050K391k37j641K756j805p2K854k928O34J860l325J326Q79k432K127
$$ 73 959 -2091 300 63 -1578 1178 -627 -699 2155 -773 -139 1721 -1604 -278 601 -1831 296
392B96p20j201L053j596q3K736k632L81J801k553J393l2k483K228r33j403K875
$$ 296 -424 -1625 1428 -168 -251 2485 -147 234 2035 -518 875 843 -1640 588 -345 -1748 1127
409A127j807o50K397j914R09J391k513J800N7k172K746q39j858K175j586k96J968
$$ 1127 -680 -1330 1067 -847 62 1453 -1060 740 797 -1375 1371 532 -1326 849 -737 -1033 935
426I35k252J049R27k536K364M80k199K203q08j341K204j525R2J514k581J345J441
$$ 935 -1317 -268 659 -1877 487 967 -1232 971 163 -1178 1026 -499 -407 1107 -1474 -129 1312
443A312k198K043J65j990K035q82q13J872k380j56J669k288J188J223k129J686
$$ 1312 -886 1157 1322 -668 1367 485 -328 1544 -836 -992 677 -1611 -423 800 -1329 357
459C57R1j107K334j333r18J899k188J22J719k066P17O50j669K130k45j442K086
$$ 357 448 -659 1675 342 -576 1323 -865 -743 976 -1090 -373 277 -1392 738 493 -949 1137
476A137j547q53K119j629M9J173j987J562P77j463K212n74j567K169j082p26J522
$$ 1137 -410 -1263 856 -773 -724 449 -1538 24 801 -662 1550 976 -591 1578 496 -230 1292
493A292k083J05J043j880J706L88k076K036k27j032K091j256n72J444j891R97
$$ 1292 -791 -686 357 -1523 183 571 -1505 531 304 -728 1363 107 -465 979 -912 85
509H5J118k191J286K47j707J884m38j207J551j600l1J937j827P16J042j870J461
$$ 85 1203 -988 298 545 -1162 722 284 -923 628 -972 -1003 934 -893 -177 865 -1005 456
526D56N84j332J522j207r85J961j584q6J598k008O39J191j369J533k13j512J776
$$ 456 1040 -292 1230 23 -962 999 -585 -671 927 -1081 -442 749 -620 913 700 -812 964
543I64j064q09J941j791m78J461j414J125R05j562J614j50j248K234j032j176
$$ 964 -100 -909 1032 -759 -1237 224 -1190 -65 840 -722 892 742 -506 1728 696 -480
559d80J384j625k8J398j740Q42N02j734J985J47j200J669r71o42J700j454K73
$$ -480 904 -721 -749 649 -1091 -249 253 -1481 504 651 -549 1120 149 -493 1207 -247 26
576B6Q46k072J072O99j570J469k36j333J538p47j69J503j774K12J137j626J214
$$ 26 872 -1200 -128 571 -999 470 234 -1099 439 -308 -477 1026 -748 -536 601 -1025 189
593A89N75j557J263k88o83J783j197m31J372j721M47J140j675P70K30j298J706
$$ 189 764 -793 470 182 -501 1282 85 -346 1026 -695 -248 892 -783 -13 217 -1081 625
610F25l70q56J750j321m08J702j549L03P29j821J210K98j224J694o20j024J850
$$ 625 255 -601 1149 -172 -580 1122 -427 -124 605 -1216 -6 292 -932 762 142 -882 968
627I68q90j71J152j732M21O35j556J290J12j531J610l02n04J713q94k03J022j584
$$ 968 78 -93 1059 -673 -252 383 -1173 117 229 -1302 308 6 -498 1215 321 118 1140 -444
645d44P51O15j801Q73oj300J621l15n39J343j192K66J401j586N32N22j735J046
$$ -444 307 922 -879 -6 -12 -1312 309 -6 -545 798 -394 -128 1273 -313 219 741 -994 52
663E2J66j126J403p73n13J679j088J79J182j683M67O04j320J145l42j188J425
$$ 52 218 -908 495 -278 -791 888 -200 -21 1161 -522 -55 549 -771 374 32 -1156 269
680B69p10l89J702j214pJ142j281Q88M67j505J232m07j041J533p47o15J270j155
$$ 269 -441 -830 872 -342 -349 793 -488 400 867 -638 594 187 -854 679 -68 -683 587 -568
698e68K30J072j327R13K99j396J359p3j025J268r01m53J283j187L64Q23j546R82
$$ -568 -338 734 -593 320 619 -777 582 509 -516 752 -149 -602 681 -506 -142 681 -865 117
716A17N25j323J248k63j057J272q38k11J158j384L22R43j392J033M67j312J230
$$ 117 642 -681 567 304 -753 519 -319 -530 628 -756 -434 509 -883 150 617 -695 535
733E35k77p00J359j039k42J093j266L21R66j404P59K36j128J406l88p84J339j030
$$ 535 258 -442 917 -122 -364 729 -537 -216 750 -654 105 341 -787 619 231 -553 786 -244
751b44k58J310j193M08O32j266R47P5j096J314o35q77J439q78j48J077j213M30
$$ -244 -502 808 -385 23 655 -611 336 411 -685 629 -6 -883 556 -322 -470 607 -606 -176
769a76N60j134J092P5j147J241m79n44J149q49m3R05j199O60O79j353R47K3j046
$$ -176 384 -750 342 417 -730 511 32 -512 637 -212 -255 650 -549 111 790 -563 384 407 -639
788f39J138m96n65J134j051J07J052j241N92O02j213R19N5r38J200p17m34J147
$$ -639 499 3 -562 572 -479 -372 680 -561 31 633 -580 339 394 -544 656 -61 -495 652
806F52j061R4R98j304N03N15j073R69j41q26J239o88m12J278j040J8R37j053N10
$$ 652 -409 -315 683 -621 -118 397 -676 293 152 -674 565 -123 -535 743 -297 -279 658 -395 115
825A15L21j009J014k57q59J263o42m62J141j002J34Q17j100O75K82j140J029j44
$$ 115 436 -573 441 184 -675 588 -54 -516 625 -377 -243 574 -526 149 431 -709 320 176
843A76p73J146o51k38J058j044K71O79j168O79K28j063R41j93p00J023o32j52
$$ 176 -597 549 -102 -340 718 -326 -55 624 -544 135 363 -700 241 48 -652 371 -261 -413
861d13J016j047L84P30j161O57K26r33R83l36n72J019p21j04J000j128K67O54
$$ -413 603 -444 -60 670 -491 166 392 -541 442 106 -466 553 -168 -272 728 -400 -133 521
879E21j090O74J32q71J023l85n13J099p58j21R85j008L30N47j007O74Pq98J006
$$ 521 -569 105 237 -634 389 4 -509 590 -168 -289 696 -312 18 565 -442 232 239 -659 347
898C47l94n78J074o73j39R36r12L83M56j017P81j2q45R41l70m79J009o70j4P87
$$ 347 -47 -625 449 -224 -363 573 -339 44 500 -517 264 252 -593 348 -22 -501 508 -162 -176 611
918F11r85N39M02j108Q27qq06R03m60l76R27q16J10Q34j053O13M22r05P57j51
$$ 611 -374 165 567 -541 286 278 -528 375 -85 -461 466 -350 -240 594 -459 154 576 -329 428 277
938B77o40P80n08l26R01q81J05O29q46M60L08q04P92q2o43R65n51k39Q29q19P2
$$ 277 -363 417 -91 -417 484 -397 -292 337 -509 -49 259 -545 247 165 -478 487 -64 -303 526 -293 -221
959b21O32q17M38K50q14R18k46o07R56n34k49P66o77O5O09q85N89K11p51P88k37
$$ -221 411 -406 32 282 -532 386 140 -467 489 -45 -294 472 -205 -140 469 -416 173 384 -367 421 184
980A84n06Q35n27j93P45q08K26M26q60O82J02p92P60k74m41Q31n95j21O58p73
$$ 184 -322 513 -14 -207 538 -270 -44 382 -478 204 306 -486 274 0 -441 390 -205 -326 332 -441
1000d41L39M33q11O35J23o98P88k86m06P37n90j25O39p97K45M40p73O61M7n29
$$ -441 -102 331 -480 155 278 -420 368 82 -324 413 -177 -302 337 -460 -215 225 -548 113 160 -369
1020c69Q13l89l18Q64o17l3O08q30L29K76p30N81j4o11P97l50k90Q00n49l8N36
$$ -369 444 55 -263 601 -16 -49 559 -271 58 334 -396 185 171 -440 357 7 -283 517 -32 -70 466
1041D66p78L70K69p50O57j47n83P71l63k47O83o06J77M51p60M45J96p55O94j15
$$ 466 -312 58 327 -423 234 87 -496 275 -88 -335 348 -258 -81 370 -390 55 251 -504 190 75
1061G5n60P24l82k12O72o41K57M08p18M87K23o10N80j12m34O98n05j18N35n76
$$ 75 -485 239 -143 -355 317 -324 -67 341 -377 110 333 -277 303 191 -243 455 -50 -168 367 -209
1081b09R6M40p36L81K81n73N95k13l86Q10n67n6N94o94J90M21p01M01L1n55O53
$$ -209 -113 327 -409 -28 253 -320 275 62 -324 486 -81 -137 457 -237 -47 374 -327 74 105 -450 203
1102B03k59k48O30m62o8N81o21J93L72o51N38m6n34O41l01k28N91n16M4M93n95
$$ 203 -56 -304 326 -136 -204 377 -244 -51 321 -330 208 162 -372 269 -32 -260 331 -185 -141 352 -243
1123b43L01J88n89N00on42O08k77k59O41n20J00M11n66K92L01n74M44k1l78N18
$$ -243 58 246 -343 157 151 -391 217 -60 -319 322 -198 -98 313 -253 39 340 -234 210 189 -189 329
1144C29l05j73M69m86M6M30o13K85J86m99M83r2l02O63m15j61N30n65J80L45o70
$$ 329 24 -149 320 -166 -120 310 -303 -18 168 -331 152 60 -242 421 6 -155 375 -190 -10 335 -335
1165c35L36J45n37N16j44l55N40l53o7M87m90J63L14n00L76N9n20O36j74l72N95
$$ -335 1 146 -391 125 -19 -374 166 -187 -254 233 -257 -94 220 -280 96 155 -365 271 97 -275 320
1186C20l75q3M58n30K30L14o21L56P1m17M73j68k79N65l58m0M26n76K64K74o37
$$ 320 -55 -138 320 -210 20 334 -287 69 140 -277 196 28 -251 314 -44 -84 342 -234 30 304 -333
1207c33M58R5n68N48k12k49N28m12K0L81n49K25K58n37M70n4l45N61k98j44N08
$$ -333 125 220 -348 200 -12 -261 267 -145 -125 256 -293 -68 190 -347 123 69 -276 285 -13 -157 351
1228C51m99J20L73n31J77L04o25M48p0l26N32k81j75M74m69J49L29m85K92J33
$$ 351 -148 -28 345 -186 -9 295 -330 118 48 -278 254 -27 -202 272 -197 -48 281 -204 88 221
1248B21n10M71j44k62N26k97k28N00m25P1L36m98K68J08m54M54r3l66N88l55j10
$$ 221 -289 182 38 -224 302 5 -223 277 -148 -77 259 -239 29 137 -317 137 44 -322 266 -89 -199
1269a99M72m74K12K95n18L56L4l67M31j67l34N26m15k3L96m95K00L13n30M48k3
$$ -199 273 -201 11 306 -212 144 178 -189 242 75 -259 267 -148 -171 225 -270 -70 243 -287 161 138
1290A38l68M67j90j61M35m23m0M94n75K78J59n36L92Nl55N14k84j98N35l68RL70
$$ 138 -230 237 47 -114 321 -102 -142 352 -223 55 214 -322 70 75 -280 234 -50 -248 287 -81 -72 298
1312B98n08J97K05m72M07k5l54N50l49r7M68m92Q9L52n19L13J39n24M15m0l21
$$ 298 -210 -13 192 -280 127 102 -252 298 -51 -148 320 -172 -83 269 -250 63 202 -322 93 53 -268
1333b68M43k36j54M87m15R5L46n29L58O7l96L94r6l28L87k47r8M08m34J01L10
$$ -268 175 -61 -215 272 -143 -48 298 -231 127 194 -202 192 96 -232 155 -92 -190 218 -216 -115 195
1354A95m65K95J18m28M72j94j73M98l29o3M27m70R3K88m99L00K0l90M37k13k01
$$ 195 -270 25 143 -285 187 -7 -180 318 -11 -74 353 -117 -24 264 -235 65 85 -305 132 -81 -282
1375b82M93l39k8N07n46K48K30m37K82Ql70L85j78j80M29l74M8L50m05J78K53
$$ -282 211 -128 -156 351 -195 53 283 -154 128 136 -234 151 -27 -207 222 -152 -104 246 -159 19 272
1396B72n16L20jl65M44j55j96L86l69L4L46l87J96J79l98L71j0l87M96k68k12
$$ 272 -244 76 75 -290 154 -1 -197 189 -180 -146 200 -187 9 188 -210 161 151 -236 260 -8 -220
1417b20M71l95%M00m90J94J56m14L93l3k77M74j70j56M39m84M9L66n27K01J56
$$ -220 251 -144 -144 256 -234 -40 116 -298 95 62 -215 259 89 -67 372 -112 -63 303 -224 -23 133
1438A33l79L80j46k75M43j93j08M11m08R9L36m66K58Q4l77L45r9k55L49j66j60
$$ 133 -246 134 -12 -287 156 -37 -145 266 -142 -43 293 -173 85 169 -208 137 38 -217 132 -34 -194
1459a94M06m57J98K68m06K58M7m29M98j67k46M09k35j65M63l47J30L01m21L05
$$ -194 212 -245 -47 221 -185 73 120 -309 189 22 -224 185 -50 -215 248 -99 31 332 -89 216
1479B16o1l42M65k01k81L86k87j3L53m15J52K13m00L21M3m12M32j76j72L66l90
$$ 216 155 -187 278 77 -204 182 -105 -118 235 -180 -28 185 -215 106 149 -263 169 -7 -179 187 -203
1500b03O6L17m37J37K52l95L06l5l15M77j60k25M31l27L1L01l94K22J82l89L50
$$ -203 -137 180 -257 -120 132 -263 43 8 -307 170 10 -215 216 -111 -80 221 -173 49 231 -158 192
1521A92k7k71L48k55j47M26l78k8L63m75J80J38l35M03Jl42M10j44k46L79l16
$$ 192 165 -106 242 -13 -160 266 -112 -140 223 -252 -72 66 -269 134 135 -207 203 59 -187 192 -124
1542a24K1L15m08J58J76m24M03p0k69M30k80r7L70k64K4J93l92K22K29m46M37
$$ -124 -103 212 -196 -38 138 -286 117 47 -222 208 -72 -169 201 -63 -39 154 -238 -16 213 -233 204
1563B04j04k23L82k63j03L70l85N7K73m65K87J23l63L55j80k27M72k75r8L53l02
$$ 204 100 -123 259 -4 -107 263 -122 -65 208 -257 30 153 -210 145 -35 -262 210 -65 -163 190 -112
1584a12O6K57l75K15M8k81L13j54j70M34l73K8K83l72J51K01l64K79K5l14L81
$$ -112 -46 211 -164 51 99 -182 131 -23 -193 241 -132 -104 179 -193 -42 159 -205 74 99 -215 166
1605A66r3k23L70k70k2L05l24J17J83m07K84pl96M26j33p8K57k90J0L21l37J18
$$ 166 73 -150 220 -50 -72 233 -91 26 209 -198 86 79 -317 109 -24 -102 155 -135 -125 196 -141 -23
1627b3J71l13J97J41l41K76j06j40L51k48o5L00l62J54J96l86K78o8k69M04j75
$$ -23 148 -165 32 173 -168 108 2 -138 213 -35 -100 200 -162 -8 188 -198 80 12 -257 147 -28
1648b8j39L71k50j0K96l25J71R5l27L20j28k93L80j65j24K88k80L7K84l76J81
$$ -28 -167 204 -46 -56 240 -85 86 181 -146 174 46 -247 133 -32 -156 132 -148 -111 173 -203 -22
1669b2J04k26K51m1k21K86j36j07K62k58O2K05l04J87k4k09K57m9j94L25k03l1
$$ -22 82 -144 107 66 -155 131 -5 -112 150 -108 -46 159 -145 42 18 -191 66 17 -177 148 -55 -86
1691h6K44k81M8J98k93J80J43l03K55p8j73L61k72m6L00k92M1J33k49K20m1k51
$$ -86 158 -123 -75 123 -170 10 153 -150 105 27 -146 215 -57 -103 197 -95 -54 79 -170 50 9 -242
1713b42L03m1j88L53k44OK73l32J25J55k60J95p6k12L02j04k08L30k69J7K44k95
$$ -242 61 20 -168 185 -59 -53 220 -112 13 168 -92 103 27 -185 117 13 -195 135 -134 -117 127 -168
1735a68K18J03k92K11O4k98L38j72k09L49k38j5K56l07J26K04l26L04r8k30L18
$$ -168 50 153 -139 72 136 -162 176 4 -205 144 -94 -109 147 -160 -34 170 -156 148 50 -180 138
1756A38j47q8J97j79o0K35k92J40J49j79J93Oj41K73j50j57K92l15oJ97k43R8
$$ 138 -9 -97 100 -79 -139 96 -196 -56 93 -86 107 113 -28 245 95 -62 230 -85 -91 106 -137 -39
1778c9J53k55K46J0k41L72k04j10K92l79P5K21l04J22L8j67K27k7j84M09k05j31
$$ -39 114 -141 105 115 -126 246 42 -68 224 -155 -80 141 -163 -41 -3 -170 57 30 -154 255 50 -81
1800h1K67l29J18P7k36J36J03j87K74p9k13L37j19p7K20l47J23J81l16J89J5k88
$$ -81 186 -143 -25 52 -184 -48 55 -132 142 63 -150 187 68 -9 211 -136 -13 168 -148 41 56 -232
1822b32L04qr8J98j34o6J76k47J01J51l15J80M1k20K80p6j53K89k21K9J55k80
$$ -232 72 64 -34 164 30 -36 140 -107 -6 145 -170 10 51 -169 111 35 -118 171 -50 -21 134 -146
1844a46J63L5l70L69p5j99L17o2j39K92k12L9K03l06M6J99k34K21j22j87K37j46
$$ -146 17 52 -318 51 -24 -223 94 32 -107 185 -27 12 215 -91 -45 154 -80 141 19 -168 69 -77
1866g7o9L12j66n7K81l11J51R6l14K85r6j82K58j65r0L20k48L7K74l25J45K9k74
$$ -77 -146 166 0 -57 224 -87 64 160 -154 131 35 -147 111 -54 -144 176 -72 -35 239 -86 59 88 -186
1889a86K82o3j66J92j53o1L07k17M5K05k49R7J35l38K39m7k16L04k23j9K80k97
$$ -186 96 33 -133 59 -94 -155 152 -65 -20 185 -64 33 168 -170 69 22 -194 110 -113 -132 148 -149
1911a49Q4K11k02J74j2k02K44j04j57K55k01nK42l02J20J46k46J92M2k87K43j18
$$ -149 -65 146 -56 118 106 -96 148 44 -113 142 -59 -64 178 -124 -4 142 -104 88 130 -157 86 -32
1933c2j26K93j93kJ62k32J56J11l34K03P1j82K41q5j31K32k03J7J39j87Q0R6k62
$$ -32 -158 135 -58 -60 102 -130 26 137 -197 6 77 -105 136 51 -80 152 -51 -34 105 -82 -2 94 -168
1956a68K06N4k97K93j54q4K98k06L9J94k26J04J13k17J00M6k76L06j59j22K82
$$ -168 38 92 -205 88 -66 -150 148 -58 -19 175 -51 53 166 -51 49 95 -181 125 -34 -156 126
1977A26j63m7J84k40J47Q8k58K70n7j59K49j25j07K37k20J2J74k99J64R2k54K42
$$ 126 -37 -84 100 -140 7 95 -163 107 50 -109 140 15 -92 145 -75 -63 111 -188 -24 68 -186 56
1999E6m1j66K42j17p8K66k56K4J89k85J59N6k00K95r2j36K28j88m2L18k95O0J65
$$ 56 15 -151 91 -26 -104 162 -94 -70 119 -166 -7 49 -151 144 52 -84 144 -44 -86 232 -63 -3 162
2022A62k92J15O7k18K89r7j78K98j97j7K88j95n5K00k89K71j03k20K60o2j52J99
$$ 162 -130 -15 52 -166 123 26 -152 146 -51 -68 220 25 -30 170 -119 152 49 -171 89 27 -125 74
2044G4k06K2J93k19P4J78k27J21O1k00K94j04j71K40k20o7L10l04J76P6k11J19
$$ 74 -132 -110 83 -136 -62 116 -111 10 71 -129 165 61 -110 130 -90 -157 153 -151 25 101 -110 9
2066IN4j93K80q2j55K28j57o4K62l17J27R5k31J74L8k20K12m3j19K90j86j3J37
$$ 9 63 -130 150 68 -87 141 -16 -80 182 -135 -8 87 -144 30 68 -152 60 17 -102 188 2 -11 126
2089A26k48J12O9k62J98Rk27L17j25o3K31j62J8J22j34R6Qk14J19K6j78K82k19
$$ 126 -122 -10 59 -203 -5 4 -223 94 -31 -94 137 -25 -7 115 -19 77 85 -129 -10 16 -162 120 -99
2112i9n1K78j90R6J14k14J46P8k27K24r8j64J96j65o2K71k08RK19k25R6J33l49
$$ -99 -150 128 -62 34 148 -66 80 158 -69 155 57 -107 89 -76 -138 133 -75 -66 153 -72 24 157 -192
2135a92K99j30j38K96k02r9K98j94K3J50j69R4Q3k42K02J9k40K35j72L0J83k31
$$ -192 107 -23 -161 135 -67 -166 132 -62 -39 111 -58 36 119 -123 79 98 -142 93 -79 -49 134 -97
2157i7J6J76k22J76L8j91K40j30r2J80j11j04K26k11J31N6j92J71M0k06J39K1
$$ -97 -81 95 -127 49 87 -104 136 6 -86 94 -17 -121 105 -106 25 81 -111 60 100 -106 33 54
2179E4j86K71j33l9J88k83J03J23k00J70Rj61J55M4j75K55k05l5J87k75Q5J46
$$ 54 -132 139 6 -33 155 -128 -25 98 -102 68 77 -84 71 115 -60 195 -10 -45 142 -133 -48 98
2201I8k76K01K0k21K21j06n7K97k22QJ77k43Q8R8j99J51L3k02K33j25r1K49k12
$$ 98 -178 23 43 -178 43 -63 -120 177 -45 -37 140 -103 -15 83 -116 35 68 -134 99 -26 -117 132 -80
2224h0K6K23k56P4J21k14J27N4j15J61j14l7J34j36l9J64k47J57J10k69J99k3
$$ -80 -54 169 -87 -13 108 -106 21 75 -40 121 7 -30 104 -32 -71 93 -154 3 113 -156 43 20
2246B0j61K28o6j10J82j61J4J18j97Q5J12j97J65j3j13K01q4m7J68j77K5J43k75
$$ 20 -141 87 21 -89 93 -68 -54 64 -133 -48 64 -133 32 19 -94 107 23 -24 144 -33 -8 135 -140
2269a40J46L7k16K16o2j05K07p8q6K32j54j6J87k36P4N5j50J38q2r9J78j62PK23
$$ -140 6 43 -173 43 -19 -124 83 5 -81 151 -3 -19 168 -68 6 61 -89 49 -33 -132 46 -116 -109 114
2293A14k14L4J49k47J34R8q4N7k5j01K41j76p6K45k74N4J56j98R3J05k00K28p2
$$ 114 -100 -66 83 -164 -30 68 -16 41 16 -85 156 -20 -96 149 -125 -71 85 -113 -20 85 -115 113 41
2316D1j62K40j34l8J42j49M5J22k11J28L9j30J38J8j38K00k04MJ63k25J03J02
$$ 41 -121 119 -15 -53 89 -60 -15 107 -104 24 63 -67 71 89 -49 151 -53 -49 114 -111 -8 94
2338I4k88K10O0j76J88p7o9J73j19j1J75j97L1J32k20J52k5j88K12p6p5K49j65
$$ 94 -194 16 76 -100 88 11 -58 115 -4 -15 160 -37 -6 126 -94 58 33 -155 57 -19 -94 155 -10
2361a0p9K02j51P4J1j53J45K8j69J74l9j44K63j41m2J57j53J1J06k53K01k5j78
$$ -10 -89 113 -38 36 47 -106 39 67 -102 72 33 -111 152 11 -31 126 -27 -16 90 -163 38 13 -165
2384a65K08l3q8J42r3L1J12k04P5J59j88J04m4j19J72n7r9J56o2l2J17j15K9R6
$$ -165 43 10 -78 64 -29 2 114 -90 -15 144 -44 60 16 -103 69 12 -87 69 7 -25 92 -23 6 102
2408A02j64J72p4q3J07r4k8K06j86L4R8j58J00J10k63J37j8j26K38j18j15J58
$$ 102 -62 110 36 -47 60 -34 -62 144 -42 -8 90 -68 32 142 -121 16 -2 -128 110 -8 -123 35
2430C5p5MK13k55J28Mj59J54Pj51K04j21mR9j26M1J34j90J48k0j48J59r2r6J68
$$ 35 -40 -36 177 -78 50 54 -105 49 56 -95 109 -12 -16 83 -43 -2 132 -58 90 70 -78 81 -11 -107 61
2455F1p9j1J30j78O3Q7j24Q8Q2k08J33l5q9J12j8n8J29j36K9Q2j40J44Pj61J46
$$ 61 -18 -29 101 -77 -14 73 -51 37 119 -89 44 9 -80 32 14 -44 85 -51 -22 60 -80 64 71 -90 56
2480E6J4j40J22o2p3K51k11M2J05k04J13Lj72K15k6j26J68j07o9K08j80K6Q4j31
$$ 56 70 -70 52 -10 -83 168 -43 -1 104 -100 13 16 -156 59 33 -93 75 -32 -101 107 -73 -47 37 -94
2504i4J28L5r2O6nn7R5r6m4J23j48N6Q5q1N0l5k8R3l1m9J19p0p4J34j67Q4Q4j45
$$ -94 34 69 -23 43 38 -19 76 -20 -64 59 -89 -33 52 -29 21 -14 -42 51 20 -29 90 20 -54 80 -87 -3 81 -64
2532f4R2K3q0J01j03n1J54j00RQ8p0j3Q9j07N2L5j09J20j04l0J14q0k3J22j27
$$ -64 28 51 -29 72 -31 -82 72 -28 -19 69 -1 -14 75 -32 20 55 -54 66 -38 -68 46 -34 -57 65 -62
2557f2J12j3p2N2L2p1P0j12k9J94j63O0J03j96Q9Q6j46J36K5j29Q7j4l2J07j42
$$ -62 50 37 -35 17 49 -22 48 -64 -93 101 -62 -2 101 -95 -6 80 -66 70 95 -34 53 39 7 114 -28
2582b8rN2n4oJ03j43P3L5p6J03m4m8M7pJ1%o6R5pj00Q1L4j34J02J7o4J18j51R4
$$ -28 -37 15 -39 -45 58 -85 -12 23 -53 50 6 -42 5 -2 9 9 -57 38 31 -69 12 46 -88 14 31 -33 85 -66 28
2611B8P9j87J25L2j62J15Jq9J14kj17J01j02M8O9j21R4N5j53J06o3m7J19p1j8
$$ 28 107 -80 45 77 -85 30 31 -58 56 54 -63 38 -64 -16 53 -68 26 81 -72 34 -29 -76 43 -28 -46
2636d6R8o5K0N0j07N6L7r5J43q3m3Q3p4l5J20q8M5O3j55J29pj31J06K1p3Q9o4
$$ -46 52 -13 7 57 -50 6 43 -52 91 8 -35 48 -26 -61 59 -29 16 79 -76 53 46 -85 21 42 -31 58 -6
2663fJ7O5j21Q9j1o4J7P5j32P2m0k7J69j48J9O5p7L9M2l6O0Kj41P2L0o3Q8p3J8
$$ -6 11 76 -45 44 33 -31 -14 61 -71 1 -39 -66 103 -45 -26 39 -38 1 43 7 67 69 -72 0 30 -33 55 -18 0
2692@N4l2l7K3r8J35L3r2M4m3j8O4m3LL9j2j3J8o4O7J0o3O6m1o2O0j0l8J22j46
$$ 0 54 22 -15 8 -90 45 78 -14 30 -13 -31 33 -10 -7 32 20 7 25 -39 28 38 -25 41 0 -62 -2 -12 -50 72 -74
2722g4N2M7l9R2j2l0K8l5lk7n5J9N8o7O4J7o5P2K3j11J00q2J0J26j55M6N7j17
$$ -74 -22 25 -14 78 66 36 64 29 26 -1 -56 -37 21 -46 18 35 -30 42 65 -46 54 -28 -18 108 -47 -1 56 -61
2750f1N5M2r3J7P4o5O2%j04Q4o1L5M8j31R5N9j29R9Km2J01j31K9N9j05N9NJ5K2
$$ -61 -6 36 -57 -40 34 -31 31 31 -73 11 -50 -15 33 -98 -3 56 -73 26 28 -14 87 -44 -15 44 -61 -2 3 18 40
2779D0l5k3L1L3p0Q3k9n1J9m4M4M4l4n3J07j38R9j0o7R0L3j16J11l5p4J30j16
$$ 40 5 -18 13 46 -24 59 30 -21 -2 -46 -2 42 8 -45 62 -76 23 13 -54 36 69 -47 64 29 -45 85 -31
2806c1L1K9l3N0m8o4J04p0QO2o4QQ6q2pM3k2OK7r6J02k8l4L5n3nJ14j07O2L1j62
$$ -31 0 29 -4 46 -2 -66 38 -32 -24 38 -26 -18 68 -14 -21 22 0 6 33 -63 39 11 -23 12 -41 -46 68 -39 23 54 -108
2837a08J55k0n7N5j0p9J32o4k6J07j29Q2k8o4N5m2J7Q1o3K9J7n0L4J2q1O4O2j13
$$ -108 47 27 -30 25 15 -64 68 4 -22 85 -44 38 10 -54 1 -41 -24 57 -6 23 40 -10 24 36 -45 19 81 -32
2865c2R1n7k0K1k3oO0j5m9J2m5P6L6j16P4K1n0L4m6j5P8p5qJ20j28Q1J9j31J20
$$ -32 59 2 -18 3 -20 -26 34 19 -30 -18 -63 13 49 -67 7 28 -22 12 -34 -49 29 -46 -54 66 -62 19 38 -93 27
2894B7k2l5N5l5rqj9M5J1l3L3P2j76J01J4k0J5l6J5ml8P7J5o2N9j5p9R7Qo1Q2
$$ 27 5 -30 25 -10 -19 -27 -46 -1 10 -23 10 82 -94 7 21 1 16 -20 -5 -9 -47 30 45 -17 42 27 -52 45 53 -8 74
2925G4q4N7J9o2n0J31j58P8K0l3oK0j9M0j2l2MQk0N8o6mO4p1Q9pn6J5J0J4o7J
$$ 74 -10 47 66 4 -46 85 -73 5 25 -8 -14 6 -13 27 15 -17 -13 -5 -25 33 -33 -37 27 -44 45 38 -18 -3 7 21 -46 -45
2957d5Q8l0k5O0k2o9Q3o0K9qmmO4n3Q1m6j07R2J8pn9j9L1O8r5K4N6p7J0M6J6o8
$$ -45 43 13 -12 48 26 -43 40 -20 9 1 -3 -7 57 4 85 39 -68 24 42 35 -24 -43 -12 56 -39 -15 41 -36 -26 20 36 -32
2989c2N3n9M1Nk8L6l0%L9Nl3Rn0O5M3r4O9m5M3j5Jj0K9m5l7J4J7M1j0l1mk3J8
$$ -32 21 -38 3 8 -20 16 -14 -14 25 30 -3 6 -44 21 64 -30 39 -6 37 22 23 13 42 -3 -40 -26 -9 32 22 -9 -13 -36 -18
3022a8N6p8j3L3j9P7Mo1O8j1o3Q3p1M5n9M6l0L4n2OP4j06N3L7l1M9j4j1j5m1j0
$$ -18 38 -40 -53 -20 -39 38 42 -19 49 38 -25 58 -13 32 -27 19 -11 23 -29 -23 51 -55 -2 35 4 53 39 28 13 -28 -38
3053c8Q8m2n9P9n5O1Jm4l1N3k1J4p2O6J4m1P2k0j06N2M1Pl2L9l1k1J9N8k1l3N3
$$ -38 50 8 -51 28 -27 34 35 -9 -40 13 -8 6 -66 0 14 -27 45 25 -81 -29 12 19 -13 26 -5 -26 -7 51 30 -3 50
3084E0J8j69J40JLj4l3P%l6M4j0ON4q2l1K8N4n2P3n7l5L3k7J4jK9k4j2K3pP0r6
$$ 50 68 -101 39 40 43 29 -4 3 3 -33 11 1 7 61 -21 -52 -24 30 -22 51 -6 -41 -8 -35 -21 -22 7 -17 -29 -6 -13 57 -39
3117c9L8j6k7O9m8J7PJ8PJ0q0O2MMk1k4K9o2O1j3N5p7O2K0n5k0K8l7R2Mo0k1K9
$$ -39 -1 -17 -44 25 -23 -6 1 19 26 36 -44 18 22 26 5 -19 10 -52 9 -4 51 -26 36 56 1 -19 9 -28 64 68 8 -13 16
3150A6nj7Nj6M6n0J0L7n9N5l3npL9k7Qk9L4NK5j9j7J3K1nm0K7Qk1L1K1k1j7K2
$$ 16 11 -6 -1 -17 29 -21 -11 26 -33 22 -11 -16 -23 16 -11 -3 -32 2 7 32 13 -4 9 30 25 -15 12 20 -1 30 51 30 13 35
3184C5Nj2l3J0nKR0j52O3mL0j7Pk6O3o0k3L6jK1K1j03P1Pl8K0J6j7j6J1pL1r3
$$ 35 40 28 -5 5 0 2 92 -60 3 -1 29 12 19 -7 56 -4 -27 9 8 29 50 -53 18 25 -13 7 23 6 -10 1 -6 25 -68
3217f8O3K7L9m6Jm6mR4l8J5n1M0Kl6rkL6pN0n9jK9n7P7n3N2J0j05JJ37j11K7M2
$$ -68 -5 22 61 15 16 -30 -34 60 22 37 -14 26 28 -8 -17 -19 17 10 60 1 0 29 -28 49 -4 48 58 -47 -46 91 -20 7 49
3250D9o4l0M9o5R4j5p4O0J7oknl3O9j7J4o5L0j7J5J0j1L0l9rJj4M0J1k1J6o7Q
$$ 49 -15 -45 4 -61 33 18 -56 4 21 15 13 8 -25 44 27 41 -24 6 -11 4 14 3 33 -6 -15 -14 -28 12 23 2 18 -49 -41
3283d1lO0o1O9kM7o9K2L4n7L8q4M8O7l2Lk8k7M0Ll9%Mm2j9Q8l4K6K8l6M4Nk8k4
$$ -41 -44 16 -45 24 22 69 0 22 56 -1 37 -47 1 68 36 39 11 -16 24 27 -12 -12 -8 -50 -69 19 -15 11 39 3 47 52 24 0
3317@k1j7L7J2j9O8p5RL0o9N5JRJ2n8M1j0L4J8j7q4O1L2l5O4q4kM2q4Q6Nl1k8
$$ 0 -21 -38 -1 11 -8 60 -15 -6 24 -45 10 11 20 32 -26 15 5 39 57 40 -44 17 49 14 78 -6 -8 34 -50 36 41 10 -18
3350a8O2q4O2j2k5k3O4m2j3P8j18J34j73J03J3l4Q0l0m8K1l4J8M8n3k1L6J3k0
$$ -18 44 -40 22 10 -15 -38 26 -16 -29 49 -69 65 -108 -5 8 -26 54 24 -24 -3 -37 -19 29 -24 -45 -9 4 -16
3378a6jl8K8mj5N9K9p7M1j7k8P5l2K9n4J5K1M1p4L6j0j0j9j5rR7m3k6O2q3J00
$$ -16 -17 -55 -27 -31 -46 13 42 -35 6 -11 -39 36 4 33 -21 -6 15 56 -18 18 8 -2 -21 -36 -45 52 9 -17 45 -38 62
3409F2m7m7M3LN9m9k9n6J10l2o1K0K6k2N7p4L3J3n8M1OL1Rn5JM3o1N9l4J1K4r
$$ 62 15 -32 11 14 73 24 -5 -61 49 17 -44 -24 2 -20 37 -37 -4 9 -49 -8 -2 29 38 -17 -16 27 -34 25 -9 2 26 17
3441A7J0j9m7J6L1nkj7k9J7K9L4n5J5nL2l5J8j0K0j3L6p2K4Q5n8K9l7K6k2o0L8
$$ 17 27 8 -39 -23 8 3 1 -16 -45 -28 1 35 -20 -5 -10 22 -13 5 -5 15 2 38 -34 -10 75 17 46 9 35 13 -47 -9
3473iK5N6q2jL0j3n6K3O5j2j9K5kl0K4m5oO0o7L2LqK9q1O3K5n6J8M7n3oL1m3N5
$$ -9 16 72 -10 -11 19 6 -50 -27 38 26 7 32 30 0 24 -21 -27 33 -34 -2 1 -7 22 -59 4 29 -27 -9 38 -15 -21 10 -33 22
3507B2m3K2m6M0K0L1l6l5K4m1P8nm7O2n5L0l7J7j9L6L9l2lr5Q4P5j10L5l6J1N6
$$ 22 -21 1 -45 -5 15 46 10 -25 -1 -42 36 31 -16 46 -9 21 -16 1 -18 18 57 25 22 -73 11 86 -24 11 -25 -14 42
3538D2l1L3r6N1oJ7k1NM8r6J23n6m0K1L9l1Pn1M7j8%L9lm4L2j9k4O6pp1R6j08
$$ 42 11 44 -52 -1 -7 10 -11 -6 42 -54 69 13 -27 -6 33 2 9 -42 5 -13 -13 26 23 -21 11 -8 -32 34 27 -44 52 -56
3570e6Q3mo7J8L2K9n1M4m6N8rj6M1l2J2Jj11M3M6k9mjl1J04o8j4L5mJ3l5k5O2
$$ -56 27 23 -44 -26 6 35 -16 28 -18 40 31 15 56 24 36 37 -74 -31 15 -14 -18 -19 -50 54 -14 -28 7 3 16 -19 -44 18
3602A8k8n5j7P7j3L1K9l7JLJ2po5L3J3j9O4n9L5j0n0M5O6m9n2M8M0n7qjQj0L2
$$ 18 -10 -65 -82 -5 -18 13 42 5 6 9 21 14 -51 -18 -5 -24 40 -19 16 6 -44 1 67 18 -34 14 54 -3 -11 -12 -4 -14 18
3635A8j3k7K6M1l5m2O7l6J8K8r0kK8J4K8o1OO2o3K9K7l2l1K4j1J8M2n5j5QJ7P2
$$ 18 5 -22 4 45 10 -32 35 -1 17 45 -45 -47 -19 -5 23 -38 -32 30 -33 -4 23 -9 -40 -16 -27 -9 33 -22 -37 -29 -12 60
3667F0J4j02N5k5l4N0ML2n1k7N2%o2J9n7L9L7j7oJ0k3O4q3M3P1o9m5M9n1M0N5
$$ 60 74 -28 27 2 -32 18 22 54 3 -24 28 28 -34 -15 -72 -33 4 -13 -19 -9 -32 32 -51 -8 63 -6 -51 -2 -53 -13 42
3698D2j7k1rL7o3lM1M9k0l6PrJ5P1j89J12O9j39R1l6m1R3o3nM5j7K2l0K5J2j4
$$ 42 25 4 -5 32 -31 -34 7 56 36 0 7 -2 13 84 -105 7 76 -63 28 -8 -49 44 -19 -24 21 4 26 -4 21 33 19
3729A9j2K2J8k7n7O6o1O0m5j7M6k2L3J5l4NJ1p5L2M4j6M8n8LM1m2M7j9r6M0l4
$$ 19 7 29 47 20 -37 29 -32 28 -17 -34 12 -10 23 38 4 9 20 -55 -23 21 5 53 -5 -2 39 -3 44 25 -71 -31 -65
3760f5K2QM5K5J4j6nM5j04P3Rm7qj9L7k6qk0Q6m8n0N7nl8PpR3k1l0L1p4l1O8k2
$$ -65 -43 -35 10 35 49 33 28 73 -31 42 51 4 -4 -23 14 -12 -20 -40 46 -2 -52 5 0 -38 -31 -38 55 34 4 35 -39 -70 -2 -24
3794b4L2k5J7J6l5RK3j6QK6k3N6j2pl3qk8K6k7JqP6k9l1qoO2p6O4k9L6m5M0o5
$$ -24 8 -17 0 16 -19 -10 13 -3 5 31 8 64 52 45 12 4 -24 2 -25 -24 -32 44 15 -16 -24 -30 32 -44 20 -9 27 -18 22 -43
3828d3J5pO8mj8j6N9o7J0L7j01J07l0Mm0P1n9K1rJ4m9l0M9jk5O3j4q7J21Lr3O0
$$ -43 -28 -35 33 29 11 -5 54 -13 -3 34 -67 40 10 14 -26 45 -14 7 -2 12 -37 -67 -18 -19 -44 19 5 -82 39 42 -51 9
3860Ilj1Nk3J06p6l6NL0k4%L4K0K1o8j5O7n3M2k1LJjK2J7l3J7J9r8lP0l8M0lm8
$$ 9 6 -5 0 -23 83 7 -29 -24 6 -18 -18 16 36 57 -11 -26 41 -12 30 9 12 13 12 34 51 18 35 54 -44 -47 23 -15 25 22 -26
3895b6L2K2K5n4l5Q7n0jj2L6m0Q4q4j2M0J2k6J7kK0K2l1QL3r2M4Jk7L6m3JM0l2
$$ -26 6 28 53 -1 -36 51 1 0 -12 24 -16 68 -16 -28 12 24 -2 15 13 33 55 24 32 65 -27 17 18 -9 27 -16 -15 25 -7
3928grJ5K1m7N1l1k6M1m7J5P1Po7l7J01n3N2r5N0L5m2nlML9o9P7l4qL4o8M8j3
$$ -7 -16 -1 20 -27 24 -7 -33 8 -39 -24 47 54 -13 -50 51 -2 50 -45 5 40 -2 -7 -10 -6 33 -36 41 7 -1 33 -35 13 0
3961@nM9n2LM6m7R2o1nK0MPm9L1j8J8k0m4M0J9m7r2J13N3o8L8m4L3k1M3j1k6M1
$$ 0 -5 44 -8 -5 41 -6 86 25 20 40 44 51 2 33 15 33 13 -31 9 28 -19 -111 2 55 -13 25 -19 14 -7 36 25 -1 40
3994D0m0L1qk7lON3q1RPJ4k0Lonj4P0J3o2J4p9P0O9n9J0L0k8N4j07L3L0o1M9p
$$ 40 0 31 23 -4 -7 -1 52 -29 -20 -13 1 -19 -16 -22 -27 -41 29 42 -20 -6 -85 -15 54 -5 5 35 7 61 -46 -13 17 -44 5 -2
4028bK1o4M1qj8J01o6jJ2k7N6n9K3k3lK4Pm4Q3n0J7k5n0R1m0l1O2k4n4R2J3j2
$$ -2 19 -45 -4 -12 -30 71 5 4 16 -11 45 -14 9 -14 -17 7 14 -30 53 3 20 -5 -55 36 -4 -35 27 3 -51 41 54 42
4060D2j8J3o3RK2jLm0N8l5M0l1kj1oJ9P8l3q5K0j0k9Q4l2mj6Q8n6k9K2m1R7n1
$$ 42 24 37 -26 -17 5 4 7 -33 25 -10 30 -1 -3 -14 -20 -1 77 44 -41 -21 -31 -60 24 -8 -12 -28 60 4 -25 -3 -44 53 2
4093BP6or5M8rl6J0Ok3J7J2L0Jk8m8O6q6M4J3j8L3L8Kn6m1K2Q4k3j8M5p2MQ7q4
$$ 2 78 72 -23 25 16 -20 -10 -4 -27 -10 2 32 33 5 -43 23 -63 -19 -6 -24 9 47 49 -7 -48 -26 58 35 17 62 -10 -6 81 -3
4127cJ4K2p6N0jJ7J1o6rK3k4N8Jj0J8orJ0Km1L0o6KN2j2M4nqj9ok1K4k1j4P7n7
$$ -3 11 33 -43 7 6 23 34 -32 -41 -18 -42 16 17 7 25 19 10 20 22 -19 11 -55 -53 -1 -13 31 26 18 -1 -7 -28 -4 -25 -39 38 -19
4163a9Nj1K3O5q6K7LN3n9L7l1k4JL0Ol7K0%pK0n2Q2o8N0j7o3L2K5l6Q2r8M1P3
$$ -19 -14 -25 -2 63 -23 4 7 60 1 38 7 -17 -16 14 20 -17 3 3 -4 16 -36 46 -22 28 11 -52 -20 5 -31 51 -47 -6 67
4196F7k1o1J2J4M4p2K7n2O0Ml4J5J3j3M1l0O0n0mL2m7Ql3j1J6L1k4Rj6J7M9m9
$$ 67 46 -15 -3 11 55 -17 10 -42 18 22 -12 3 16 3 44 14 74 24 20 52 5 13 -20 -31 -15 16 -8 1 -15 2 51 2
4228Bj3qJ9j0j0K0K6m3KN5j5l6j2N4l8J9rK0k5n3P1l2rL8L3k2o2L1kJ2j8J7J7
$$ 2 -11 -19 0 -10 -20 0 26 -17 -15 40 25 -11 -23 31 -7 12 3 23 -2 -55 16 -16 -25 13 46 24 -38 -7 -9 3 -15 2 19
4261A9L2rp3L7l1oN8l0l0j4Q7q9R7o7L3M3r6K7j4jM8Onj9j5KK3p7m6J28o2J24
$$ 19 51 42 -31 6 -25 -31 27 -3 -33 -47 40 -49 48 -19 14 57 -39 -12 -26 -27 21 27 22 3 -12 -10 13 -64 -110 18 -44 80
4293H0n4n8N3l7L7nJ6k9ok5J00J8j01L4M4p2P7q0L7lk0qj4Poj0NJ8j3J1qK9mn9
$$ 80 26 -32 21 -16 21 16 32 3 -3 -28 72 90 -11 23 67 -5 72 -8 29 26 6 -2 -16 -9 -15 -25 -20 -2 -15 -4 -12 17 13 -46
4327d6L8N1K3r9P1k0o3J22p1j7K1n7J00o2OM6k7l6J02q0l5l9J30m4J8l1mNl1Q1
$$ -46 -8 43 66 -33 38 18 -45 77 6 -11 10 -47 53 -9 -3 43 16 -20 82 2 -33 -72 58 14 32 1 -3 2 -29 52
4357E2qj6J8Mq7R2o3j9OP6o3J7oJ9J0k8J6n9pO1n4k1J19p9jl1J70j09l9Q2q9P3
$$ 52 44 28 46 50 -37 55 -8 -27 -21 55 -8 9 3 22 32 4 20 -39 -46 15 -39 -60 59 -20 -21 -52 118 9 -30 52 -37 36
4389C6j03O5kJ3l8J5K3KPL8m1n7Q2n2k9J1N5l0K0Qp6J02q7J6L1L1J8l7k5K4j9
$$ 36 -67 -2 -4 9 -29 -14 9 11 18 56 15 -42 40 -12 -41 -30 25 -5 15 23 -53 49 -38 -22 9 40 58 21 -4 20 1
4420Aj0o1O8P1p5K4K3p7N5j1M6m4k4Rl8M2oM6L6j17O6q4N3J9k2k5LJ9J4j8M6m0
$$ 1 -9 -70 -2 69 -6 18 41 -36 19 8 54 10 -14 -5 -43 -1 -7 39 75 -42 24 -60 -7 12 -10 -35 -32 -13 1 -17 29 -11
4452a1K5M9m8p3N5J02m2l8m4M6jM0o9%P5r0jJ5k7M5K4n9N1j5J0J2j7JO0r3Q3j7
$$ -11 14 63 15 -58 -3 99 57 19 -25 21 20 60 -9 -9 66 -24 -25 -10 -37 8 32 -27 24 9 19 31 14 15 75 -18 65 48
4484D8m5M3n2on7R1m4K7m6JQ0j0k8M8p3P0k0k1RK5o7P4m3OJ6j9pm0O6lm0m2N5
$$ 48 3 46 -6 -12 -69 22 -22 5 -41 -40 40 30 2 50 -23 47 27 6 15 40 -27 47 4 10 26 7 0 -40 26 23 -17 -59 -4
4517dm8R0j8j7%O0r9M3Nl1M5n8n0O8K4MMjRj3%k5L2k3K2n6J0l0M0P1j26O3Ll8
$$ -4 -52 38 20 3 3 63 -36 7 12 -19 26 -32 -82 -14 10 14 18 17 26 13 13 -12 20 -3 19 -37 -27 -57 -17 54 -72 -9 -6 -44
4551d4K4nM6m1O7o2K6m2O0K6p4K2j5K9j0l5M7n4P8k0j6m6M8Pl6PJ3J1o9P0l3K4
$$ -44 -20 -25 21 -20 47 -15 11 -31 29 55 -19 3 -12 17 7 -28 19 -35 43 23 7 -39 9 16 -20 -13 0 11 -58 12 -21 3
4583CL5o1RN0J4q6R7p9joL1J8pjK6n5M8j4Jrk5RK7j3n2O3Mo6N7n5j0K8Mj4jm1
$$ 3 38 -23 -14 36 50 -36 61 -18 -19 -25 6 24 17 16 42 -13 35 21 22 13 -12 -3 24 11 -41 22 26 -40 17 -38 -48 -20 -16 -30 -31 -72
4619g2J20q1P1m0J7m1N4l2O1k2r4N9j0J5q6O4RkP4q5K4l6M3J8j9K6ol6J7m2J5
$$ -72 48 -33 38 -2 15 -26 28 -4 57 35 -59 0 -10 5 -81 -17 -8 -10 64 -21 3 -33 10 28 9 35 29 -7 10 -32 -17
4650a7qO1l9j4%RKM2k3n0ml0O1KN4m8j1N0l4j3L2J5l9J9k0k6PkL8m5N7n4K9l0
$$ -17 -25 36 -3 -17 -17 -8 -6 36 13 -37 -41 -71 -10 -8 46 -2 -13 37 3 -10 22 37 -2 17 -3 -29 -22 -24 14 -31 26 -28 1 -29
4684b9L4J1m5K8K8N0p5JQm4QM4n3K0M0%n4N1n7M9l9L8l0K2o0P3k0j0L5l8k1l7
$$ -29 5 16 -29 -1 27 77 2 3 11 -33 -25 19 -34 -14 26 26 -28 23 -34 15 -24 14 -16 6 -54 19 -1 -11 24 -14 -35 -72
4716g2L0P0m8M7p3P2l9J4J3j5j0L7J3J0m3k5J8oN7q0N7k4m2J9K4o0N0N3j9m7p5
$$ -72 -42 28 -20 27 -46 26 -13 1 14 -1 -11 26 39 49 6 -19 -1 -7 50 -30 27 3 -39 -20 4 -56 -6 47 28 -19 -94
4747i4R7k5J8j6k8O1K5m0l3N7jk7j5jQQ6o4QPr9J01k8K4pO0o4j7pM2p0L3mk7O0
$$ -94 3 -22 -4 -20 -48 13 38 -2 -35 22 21 -6 -21 -22 -14 72 8 16 23 -76 25 -3 21 14 74 10 -7 -14 28 -42 -9 -13 -40 20
4781B0K1m9K2Rq6P6k6L5L3Oo0pJ3p0O1N2l6m6M1l6N5n0M2k4L0L1k7j5M6o3l0l1
$$ 20 41 -8 14 23 -63 13 -13 22 55 61 1 -6 7 -63 -2 50 14 -32 9 -27 28 -22 20 -4 26 57 30 15 61 -2 -32 -63
4813f3O6K6K4q9J4P6r6R8r7P0pl7oN4m4jJ0l%J6j1K4l5LN7l9ml5QJ0pL7n6M4J3
$$ -63 3 29 53 -36 -22 54 -42 56 -41 29 22 -15 -21 33 -11 -12 -2 -5 -5 11 0 24 -11 -8 49 10 6 -29 -21 -11 -18 19 -37 7 20
4848B0j6ok3rN6j5J6l1K1jn0O3%r8N1M1m8O4m3J1J2m1M6m5l8L5L0m5M9m8kK4L8
$$ 20 4 -2 -25 -34 22 7 23 -8 13 12 -38 25 25 -73 -22 19 -29 35 -8 3 15 -26 20 -25 -63 -28 2 -43 6 -42 -44 -20 18
4881A8l2oK7K1ll9K7K7n9O0j8o5P1n7J7O1k5j9Lm4LO9p6P7n1rL7J3kJ3l6l8K9
$$ 18 -14 -20 7 28 25 -14 13 40 -19 41 23 -42 29 -28 -11 50 25 6 9 -35 -32 37 -39 38 -13 -22 15 28 26 39 3 -35 -6
4914fQl2oM3j9K9m1L8k7Nm0P7l9K1j8J1N8o9N7oj03O2nJjO0m4j7m0N4J5n2M1k4
$$ -6 2 -30 -36 7 -12 17 -24 14 -13 -8 -48 29 -10 11 -7 4 62 -7 50 44 -59 3 -2 -1 -2 58 14 -3 -43 11 26 -26 15 -9
4948ioql7O5O3o9k1P1m9O2j12L3lJ0mO5k8p2J16q4K8lM4p4JnO2q3L3N1k3jJJ1
$$ -9 -15 -23 -60 5 68 -1 -22 49 0 62 -50 -17 -20 -10 -14 51 23 -49 67 -17 11 8 52 -22 -21 -26 36 -47 -14 37 14 13 14 25
4982B5km9N8j1l1k0M0J1J9q1l7Q8l9K1J1L8p0K1M2Rj2p2L3K7n0N4k1j3J9n0K3
$$ 25 23 -26 32 21 -10 -30 10 21 40 -41 -78 10 -29 -8 3 41 -29 -8 34 43 31 -41 -8 19 -31 23 2 -11 8 -42 -19
5013a9M8ol7k6llJ12p2k0N4j1K1l3L6K6l1r6Q3l6J7Kl0K9kJ2J0j7m3NK0j7P1k3
$$ -19 29 23 -14 -40 -43 -46 66 -6 -26 28 17 38 5 41 67 36 -60 23 -13 4 6 -24 5 3 15 25 8 -35 -30 -10 -27 44 21
5046B1l6M4n6O6j3l3l1k8R8j8m4j4P3pl6pML8ln3L8j3pP6o2J9M7r0L6J0j2j1P
$$ 21 -15 29 -27 39 26 -7 -38 -66 32 14 -30 -44 29 22 -14 -21 -17 21 18 -35 3 -10 -17 59 -3 16 63 -27 9 19 7 -4 3
5079ClJ4ok0L8K6k6n0KlK3l9L5N0m0J6J0l6L8M0p8O4o5J6L9o1L1J4m6oK9l7j7
$$ 3 0 14 8 -12 26 52 26 -24 -22 -25 -2 -41 -6 44 4 20 30 -6 32 72 -6 58 -7 9 48 -13 18 32 -14 -20 9 -28 -45
5112d5J13q2O6q0OQ5o9J3j0Ko5K8K3M9j0j6jo3K4L5k1J8N8l7Ok3J0Mm4M1o0M7
$$ -45 68 -14 52 -28 -22 63 -6 7 -3 -1 -66 -38 -15 34 24 8 7 -56 -32 3 -18 0 58 21 27 4 14 18 -26 15 -45 2
5144BJ0Jn6P9Lq0Q8on2J13k3q6Q%k9P4p9k2K4JM9j9j0L2K2o5PoJ3RL2p8O3JJ5
$$ 2 12 13 -43 36 39 -41 47 41 -11 102 79 -7 1 1 -28 46 -33 -55 -31 -30 19 0 -10 22 44 -21 -14 -20 -7 2 34 -44 19 20 35
5179C5n1j2K1M3j0l5L2j3LK5j0m3L4K5p0J06q0M5o8jM3j9N4o2O4r4L0PK0J2m3
$$ 35 -16 -28 -7 36 26 -9 23 10 13 38 28 -15 19 44 -26 80 0 45 -23 -24 19 0 54 -8 56 -38 -8 -1 19 31 -12
5210a2%K7J6k6ojp7N3K2pK4Nj0L1PJ5k5on8O3k2K2Pn0nK0L8l8J2l9K9l7K5L4j6
$$ -12 -12 15 31 5 -1 -2 -79 -26 -4 -11 13 18 8 39 46 61 36 30 -28 35 13 35 42 -8 -13 7 45 7 19 -20 9 -28 -3 31 15
5245A5j1KMl9K1j7J4J7pJ1Jj5kl6Q1K5j07M3L3k0jm2J8M6j0q2J34l1l0%m0J15
$$ 15 4 6 10 -29 -8 -25 -11 6 -1 10 11 -4 -6 -42 39 64 -43 0 33 13 12 -30 -12 34 24 -58 76 45 15 15 -25 90
5277I0r7J9jJ2j0l0J2PKJL2jm9K8k6k2M0%lK3Lo2NQJJ5k2NKp4K8K5O7n6K3pJ3
$$ 90 -7 12 11 23 13 -17 -5 2 4 5 37 36 -13 15 -11 -33 7 7 4 27 30 -32 -27 -19 -18 -3 -25 -20 -18 -92 -64 -39 28 -28 -5 -12 1
5314Aj7MK0PL9o1n4N2k0kJ1NL9o7M4l9OkpP1k6L0m4J6K5m8K8J6m1M6k1l1M5Lm3
$$ 1 -16 -12 8 15 54 -7 -61 -9 -29 -31 -20 -15 24 -43 1 -38 -32 -34 -41 30 4 34 -10 6 31 -17 11 27 -14 32 11 -20 25 28 -15
5349a5M6l2K2K5n5Q5p5m2N1oKoJ4q2J09o2M6lK9j5m9k6O3j8Rj2n5P7j5J6k7Kj0
$$ -15 31 -1 21 46 -9 76 1 -41 10 4 6 0 14 -68 41 -21 25 22 51 36 -13 -39 24 6 15 3 -52 25 10 26 -1 1 -9
5382ipL5l7K1k5K5L1l1l3K0NM8m3m6Q5oj3j2l8O2l5j6lJ10p3pN3j00Q1j06L4L1
$$ -9 -16 19 -18 3 -22 3 34 3 -30 -10 -5 43 0 -46 39 33 20 8 -30 32 -3 -19 -22 88 15 8 61 -39 42 -64 -30 1
5414AK1K4l0nk8L0n6K2J1j3Rk9J18p0N7l3n0O9q2J9J5j2J5m4P5l8j6l4L1L8o6
$$ 1 22 46 16 11 -17 13 -43 -21 -10 -23 -14 -43 75 5 62 29 -21 48 -34 -15 0 -12 3 -41 34 -4 -20 -54 -23 15 -51
5445e1J4L1J7q3J04K3q4N4m4K3K4j5n6N6Kl5jj7Q1n7K0Kn2l4Q6k5PJ9J8k7nM8
$$ -51 -37 -6 11 -72 32 55 -29 25 -19 4 28 13 -43 13 15 -20 -21 -38 43 -14 6 8 -44 -78 8 -17 -10 9 27 0 -5 43
5477D3j8K8m4M3p1Q3q8l8M9N5m3j5L1l7O6l6j7QK1mRk2J1J2o8M7korN9m5n3rP
$$ 43 25 53 9 52 -19 64 -24 -62 -13 42 -1 -16 15 -22 44 8 -9 -1 20 16 25 3 14 26 -42 5 3 -3 -12 47 2 -51 -60 -53
5511e3O7p1K0P4J8k6Kn6L2rJ9j8j4L8L0k7m9N6q1M7K2l1Nj1L7K1k2m0J7J6l1%
$$ -53 14 -57 -37 37 55 29 31 -25 7 -2 17 -1 -15 23 53 26 -23 33 -48 -1 21 -10 -5 -16 21 42 20 -20 -3 13 -18 -18
5543a8J8k2K8j2L7m6rK0K4jj7pj9N4l4M3q8N7J1m1NN3n5Nk1L6J5Ql7M9r5K3O4
$$ -18 0 -22 6 -6 31 -15 -24 -4 20 19 2 -5 -24 30 -4 39 -49 8 19 -22 -17 36 -19 -14 -35 1 16 24 -13 36 -59 -36 28
5576B8j6mM1ql4J2m0N0j9j8l4M3qj9K0RM%QJ5l7l3L8kM3r3k6M1J27o2K0qpk9m5
$$ 28 12 8 49 41 7 19 -21 29 10 -8 -42 1 -7 -26 -6 3 7 7 15 30 -7 -40 -2 -4 39 -54 -80 -39 88 26 46 38 31 2 -43
5611d3L5K4j6k3J3ml1P3lK1l5%ol4j8M4K7K1Mo2Pm0N4J4n5O8k0l7K5K7l5M3j07
$$ -43 -8 16 0 -23 -10 -14 -45 28 25 46 11 11 5 -29 -47 -3 24 45 49 -13 -6 -46 8 22 -33 35 15 -22 3 30 -5 38 -69
5644f9M5L3M3prn4MJ9p7R6l5M5o6K2j5O1l9o7P2j3j6L8J2j5k3M1oJ5l2j2M2j1
$$ -69 -24 9 52 45 36 -18 -14 5 -72 24 -11 34 -32 -10 -25 36 -3 -70 2 -11 -27 11 23 8 -15 26 20 35 3 -9 33 22
5676B2l0j4RK9r5J25Ll1j6l2n1M4L9k1J0%j1K7l2M0pj1L4M7q8N7Nq4Q0m3o0O2
$$ 22 -8 -22 -13 16 -79 46 49 18 2 -30 -81 -37 2 -19 -9 -9 -20 7 -25 15 8 -3 31 78 -10 47 52 -32 48 5 -55 7
5708GoJ4j3J3j2oj3O2o5j1J6K0J6L0q6L9M8n1M0k5p8P7jk6l3J9K5nKnk1K1M7k9
$$ 7 1 15 2 15 3 -3 -16 46 -19 -30 -14 6 22 52 -34 5 53 2 42 17 -61 16 15 -11 -44 -25 0 -5 -3 -8 -29 -8 39 10
5742A0k0M8ql2j7J1L8K4m8lk6L3P1q4K0l3L0j7k3K0p5P3K8m9K2%M8q9jL0L4l6
$$ 10 -10 38 30 -2 -19 -8 30 54 6 3 -23 10 81 -3 17 -16 14 -3 -26 -6 -81 -8 20 -29 -7 -7 41 -48 -49 -19 15 -21
5774b1L4l7M9mj6K5k7L9j9m9L7j6lJ9K7j4k1k5pO8o9M0m0N3j3M7j15O2j5l1oO9
$$ -21 13 -24 25 21 5 30 3 42 23 -26 11 -5 -8 11 38 24 3 -22 -29 39 -30 10 -30 23 10 57 -58 4 -11 -42 -48 21
5806B1j6L9k5Rn9P7q7N0J2k4j1K1K4r0N3mjN9m0q3O7J8J8j6Mj7L6l0l1QK3o6R7
$$ 21 5 44 19 28 -31 46 -41 9 21 -3 -14 7 31 -59 -6 -10 -11 48 8 -75 -8 10 28 12 16 -1 35 5 -26 -18 5 -61 36
5839C6L7n6o9K0QJ05r4j8L5j3N9q1J5M3k5J0opj4l5P9m5Nm8N5L4m0N0l9nLOL3
$$ 36 73 17 -52 -32 -24 81 -13 -31 4 -9 50 -31 -16 27 2 12 6 -1 -15 -50 29 -16 -11 -59 -4 30 -10 40 1 -4 -1 5 38
5872C8ml0k8J9j9M8k0%L7j37J07K9o7kk2M8K9k4k9L4rj1P3q4j9R8n3O3p4L7p5
$$ 38 34 4 -24 -5 -24 24 4 4 41 -96 11 40 -27 -29 -51 -3 26 2 -27 7 -2 -13 60 -24 -43 55 2 65 -9 28 -47
5903d7M7l3MQ4q9J1RJ4J9J0l2J0o7Q7m2j6N0J4nk2J6j1m2L4j6K7PK6k1j3m4K0
$$ -47 0 -33 -29 55 -34 -23 -14 0 19 29 -3 7 -60 27 -15 -31 19 33 28 6 22 11 -31 3 -13 14 21 47 26 13 -31 -11
5935a1P6p2k2M6MJ7k4rj7kL8p2P1n3qK3KPPk7M4j5p2J14o7nP2k3l7K5n8P7Lk8
$$ -11 65 -7 -29 17 21 38 14 5 -12 -14 24 -48 23 -30 -38 -15 -13 -6 1 -26 18 3 -69 45 -22 -27 45 22 -15 10 -48 29 32 4
5969DNM9j04M3j7k9O3M5Kq1K1m6P5j4JMjrj9N6m6nj6ml3P4K4p2j8Q6j13L8L1k2
$$ 4 9 58 -46 -3 -20 -49 14 59 61 -20 1 -45 30 16 17 21 20 11 -8 48 2 -3 -19 -23 -56 18 42 -30 -48 38 -75 -37 -6 -28
6003b8J02q0n7R1k9J1k9%K4l4L6l5K7l4P5m1l2j5O2o9Q9m0%J5Mm0J1j8N7j7j8
$$ -28 74 -6 -63 28 -1 10 -19 -19 5 -29 7 -28 -1 -35 40 -1 -33 -48 14 -55 34 -6 -6 9 13 -27 -16 -34 23 6 -12
6034a2L1p7L5M8%l9L1l6J4k5m0O7M8o0K8l1J9K2l0rL8m3J0N6r7N1Jk3M4nl1K7
$$ -12 19 -58 -23 25 25 -14 17 -19 -5 -30 -70 -3 45 -15 13 -18 1 23 -7 -16 22 -21 -11 45 -52 -1 0 -23 21 16 -15 12
6066A2l4Q6p4k3O9m9P0m1k1k8O4m8K3jl9P0L0j11LM4mqo6R7oj4k6K6l5K7%KK9
$$ 12 -22 64 -10 -33 36 -13 57 16 -5 -33 31 -17 6 5 -34 36 66 -45 -42 2 -2 -10 -76 21 15 1 -25 1 -34 -7 -7 -5 24
6099B4j8K8q0K0O9k9n8M4M0n3M6k0K3j8k4J1j5J5oRk5o0J17m9l1L2Nl7Q2j12J12
$$ 24 6 34 -46 -26 43 14 -44 0 40 -13 33 13 36 18 -6 5 -10 5 -1 8 -17 -77 40 -9 -40 -8 -3 -40 42 -70 42
6130D2n1L3rj1lJ9n7L9K4n5L8L6k9%J4k6qk7J6%K9j0Ol1L4l4j8N6j9j9L6n3M9
$$ 42 -9 24 15 4 1 20 -37 2 26 -29 9 45 16 16 30 4 -4 -31 -15 -15 14 4 10 -21 13 -21 -39 17 -2 -21 15 -38 11
6163A1L1Om0j3pm2J05m5rk5K9k0j2O1On1O3n6J9l1PL2m5J4K8Qk6rJ3j9O2QJ2m5
$$ 11 42 48 8 -5 -12 -54 51 6 -3 -28 1 -19 -31 30 36 -15 48 -8 11 -20 -13 19 -26 -12 16 24 -2 -11 2 -17 45 53 65 20
6197B0k0K2j5nL1l8l8k3P6l3k6N3KJ7pj9m8Q6m3J3j1k8P0m6N0j2l5M8j4l1Mk2
$$ 20 0 22 7 2 33 -5 -43 -66 10 -23 -49 4 6 23 16 -3 -51 35 -8 5 -6 -34 36 -10 40 28 -7 41 27 -4 0 -22
6229b2PN7q0R5m5J3j1l3k6N9j7nmO3j1m2kj0oQ9r3J9M1J1o3K5M2o5Nl1J7L3j3
$$ -22 -15 42 -38 57 12 25 14 -19 -45 14 -3 -8 -12 51 40 -2 -4 -14 -20 69 -24 -5 36 47 -16 9 51 -14 -9 -40 -23 10 -3
6262cL7k3qk3K7j7J5J0K6n3m2N0j3J8j5M3n3M1j4o4N5L3l9K4%Rn7M2j1J0l4l5
$$ -3 34 11 3 -20 7 -10 5 15 41 -12 -54 -4 -17 1 -14 29 -24 17 3 -61 -6 27 -12 12 12 21 -36 6 -5 5 -29 -64
6294f4Q9pl0j0L5q2Q0n3P7l6j2M9J9p4K1k0M1k1k0M8om5PqoO4mn5M6Kn8K6L9L2
$$ -64 25 18 -12 -22 13 -69 11 -42 35 -1 -13 36 55 -19 2 -18 23 2 -18 30 24 -21 -14 -22 -28 36 32 -23 23 25 -33 -7 32 64
6328F4m7j0j0K5K3qqk6j1kl3Q9o5M5n6k3M2L9p8L4L7n5M2J1k0K3K9m6j7K2rk5
$$ 64 17 7 -3 22 45 37 29 3 -8 -10 -43 46 -19 26 -30 -53 -11 28 -50 -16 21 -34 8 19 -1 22 51 5 -12 10 1 -24
6360b4K6J6L8o8KJK%PJ9oJ5l4j4OpJ1qL3j6NoJ6l9N4l2Q2j28O2L9j02K7L3j9l
$$ -24 2 18 56 -12 -10 -9 -7 -7 0 19 13 28 -6 -20 -14 -21 -10 -18 15 -1 4 -2 14 -25 29 -3 79 -49 13 52 -50 -23 10 -9 -12
6395a2J8l0M5K3k8j4oPK3Rp4N0j7K4J1K0n8lK1Rl3l4N3K5J7p3k1O8kk7K9o2O0
$$ -12 6 -24 21 44 16 2 -4 3 26 35 -39 11 -6 18 29 49 -9 -12 9 18 -15 -49 4 29 46 -27 -48 20 18 -9 20 -42 18
6428A8MJ6m0k3j5M1Pj7L1J5k1Qm8k3MJ23q7K8J2MK1q2M8j1m4P4%o4N6l5k3J7m7
$$ 18 22 38 -2 -25 -40 1 8 -9 22 37 16 24 -24 -47 -43 80 -7 21 33 37 58 -24 24 13 -31 43 43 -21 35 0 -23 -6 -53
6461e3Q3l1J8l2m2J3J8P0r0R0k5n1L5Rj4JQJ9ql7O3l8j4jM6l5K0QkPo4J2K4Jm
$$ -53 30 -1 17 -15 -57 -44 -26 44 -46 44 19 -32 3 12 -2 -1 7 26 18 -19 44 6 -8 -9 37 2 22 30 28 35 -29 -17 7 8 4
6496Dj0PN1q2L6j7K7k6Mk6J0K8n1M4L0k8l3K2Nk3NlN1Qm2P1o9M8km4m1M7j8k4
$$ 4 -6 1 52 -30 6 -11 16 -10 -6 -32 -22 6 -45 -1 29 1 -32 -10 -5 -28 -23 -26 25 33 -9 62 -7 41 39 -5 -46 1 -17 -41
6530d1O9l0Kl7L0L0J5J8j17J9N5k6M1pK5o0L4n6J04k0m8N7m8o2M4P0o4N1o7M2
$$ -41 28 -2 0 -37 -7 23 38 56 -61 -42 13 -13 28 21 46 -14 20 -36 68 48 0 57 9 -53 -9 61 -3 48 -19 23
6560B3K7o9N0Ol6k0OK9pPnKL1q7O8k6Pk5N1o4J6L0j1j7L0Olol1mK0rOj8L1l7Q5
$$ 23 50 -19 31 37 1 -19 -13 16 9 16 11 13 44 -43 25 -1 6 -19 32 -32 -16 14 3 -14 16 22 19 13 -18 -22 -2 -11 -5 -23 8 -29 56
6597E6n1M8k0n6K6L1k0JJ0j9K0n0O8ql0J1Pk6MK9kL9no0KK6n2KpQ0p3R0o0J2n2
$$ 56 5 53 33 -23 3 34 14 15 25 6 26 -24 44 36 6 17 24 -2 2 31 29 68 63 3 5 31 -21 -19 -26 54 -19 71 11 23 -29
6632b9p%J4P4l6j6j8L6o8Q9r3R4n5m7R7r4M8j5rN4j2Rk5J5QKk7L6k5j5mL1Ok7
$$ -29 -36 -36 -22 52 16 0 -18 18 -50 39 -54 40 -15 -62 35 -59 -11 -26 -35 19 7 16 -9 6 14 16 -11 25 0 -15 -19 12 18 -9
6666iLj5J2M6q2L0j6K0J2l9kL7l6L9j5K2m2R5j27O9M1j04M0J1J5n9O9p3N4J7k8
$$ -9 -6 -21 -9 37 -45 -15 -31 -11 1 -38 -40 -3 -39 0 -15 7 -35 60 -67 2 43 -61 -21 -10 5 -54 15 -58 -4 13 -15
6697a5L8j3Nk1l6J13q2J1J2Nm4K5j4pL2k7K6m8N2l8j8L6k9L2o0Q5l3jK4p5K1L9
$$ -15 23 10 15 -6 -42 71 -11 0 12 17 -27 -2 -16 -23 9 -18 8 -40 12 -26 -44 -8 -37 -5 -65 20 -13 -14 10 -65 -44 -5
6729eM3m1k6K2LJ6l6J9j3J0QML0jk1j5K0n8M2l1J3J3l2rL5pM2k1k4R6n1j4Qmj1
$$ -5 38 -3 -29 -7 -4 12 -24 -5 -18 -8 0 4 34 33 12 -3 17 -41 1 -30 -17 -4 -36 -45 -10 -17 25 4 -20 76 25 11 19 15 4
6764DK1p4M8m1L5J6Lm3lM8K5j01N7L4Qk6pl0j2J4J3M6L6p2l2Q9m6p3L8rO3L3o6
$$ 4 25 -49 -1 -42 -7 9 12 -31 -34 14 39 -62 -5 29 37 11 4 -26 -38 -24 -11 35 71 -1 -33 56 10 -63 -25 -34 29 62 -4
6797dkRj7k7M7m7L1P7j29L9O6j9j6j4j3M1r4J04K0k6Jm4M8p8J8O2k8k0J9N0o6
$$ -4 -6 3 -14 -41 6 -41 -10 67 -62 -23 43 24 8 -6 -19 22 -72 32 52 26 27 -17 31 -47 -29 33 5 -15 4 54 -12
6828a2P1j8jl2k0O3L1r8O2Kl2%J5j6rPo8N6j2k4M9p1P8lj9o0Q8ppJ4j5L1Pq0K0
$$ -12 59 41 40 8 -12 51 82 -16 46 48 16 16 31 15 6 13 -55 1 -11 -35 14 -57 21 18 -1 -61 27 20 13 27 12 43 50 -30 -10
6863a0k1m5P2M5o1Q1n0oJ9l1Lj6L6k4K7l2KMJ3rL5l9qRJ4op4O4j3MK5rM6Pq7J4
$$ -10 -31 -76 -4 41 -20 61 11 5 24 -7 -4 -20 16 -8 19 -13 -11 -7 6 -3 32 -7 -15 -6 8 2 -72 -8 -21 -17 8 -1 45 52 -35 -21
6899b1L2m3M8n0N0r3P8m1O4qpm5O6jj7M4j06M1KM9m6j4rJ08p6M7o6%L7p5J06%
$$ -21 11 -32 16 -34 16 -77 1 -40 24 16 9 -36 30 29 12 56 -50 -9 -7 42 -4 -18 -27 81 5 52 -14 -14 23 -52 54 54
6931E4r3J6Ql1J2M9l5K1rmN9p1%m9P7k5J5J00k5q0oQ8n0m8M5m7M9k9m9Q5m6L9
$$ 54 -39 -23 -15 -46 -34 15 -20 1 -8 -12 47 -24 -24 -73 4 -21 -6 94 69 -11 -17 71 21 -27 18 -29 20 -9 -58 27 -19 20
6963B0j5k8ML4kj7j7L0J5ol5J06j27Q7o7Q0j05J00r9N1m7L2P3q1N5q9M6M4j4o4
$$ 20 5 -23 -19 15 13 -4 -21 9 24 18 -17 89 -38 49 -18 62 -43 57 -42 9 -38 -6 67 -14 41 -48 -2 42 28 -36
6993c6O2j6j0m3P3l4M1j3lK3n3J2j3k5L6k0J2K9Rq4P4o6K2N3k0l7L4kK3k4ooL
$$ -36 26 10 0 -43 30 -4 37 24 21 44 -9 3 -10 -35 1 -19 -7 22 31 -53 21 -45 -23 30 10 -27 7 5 28 4 -2 -8 -5
7026eP2m4n8L6Nj0k2J4pj0N4k4K0l5K0K7pl3P4j25L9K4K3k5N7j37j4J23k7k7J4
$$ -5 67 23 -35 1 6 -4 -26 -12 -19 -29 25 1 21 -14 6 33 26 -7 67 -58 -19 5 28 3 60 -77 -91 32 5 -22 -8
7057hooJ8qm2N8N9o7m2R8n4k2Q0q5J0ML2l5P3r4M9o0Q4l4k6PJR8j18M6l6O0k4
$$ -8 -14 -20 -2 -10 -52 6 65 -2 -44 54 0 -22 58 -27 -17 -13 19 -16 57 -37 12 -48 36 2 -24 -17 -16 82 -36 10 -26 34 10
7090A0m6P4j5J4n9J4jj4j4O0o0P0k1J3m3K9Ok8qM0j1k7M1J7l6ln0M3K4m8J2L9
$$ 10 -36 38 23 37 -22 -8 -9 -23 -37 23 -37 33 12 25 -18 11 17 -11 -19 21 10 -17 24 41 5 2 -48 -5 19 -29 -17 22
7122B2mkk4K3%l5J6jJ8l8L6j1n9P4n5nj4J17o3J0oJ4l5O5j34R3J1j4L3n4L6k1
$$ 22 18 16 -8 15 15 -20 -4 -5 13 -25 11 0 -59 15 -40 -45 -59 58 -5 5 -1 13 -22 43 -91 2 13 -1 32 -22 14 -7
7154gmM2JJ9Rn2nj4j0K5M8n6o0Q9k1J2q5J9N9j7J7j1L1p7l5R6Pnn5K2K0k2J2J4
$$ -7 -11 31 32 51 60 8 3 -11 -21 4 52 -4 -64 25 4 16 -69 -50 9 -8 9 -2 29 -48 -83 13 20 15 -40 -18 2 -20 -8 6
7188Fk3M0l2j4J9K1Ln7K7lJ6Ml5J3K7l0j3KQ1l8k4j4L8ko2L0N5jk2j1J2oM7o3
$$ 6 -17 23 -9 -23 -4 17 20 -37 -10 -13 3 7 -28 -15 12 -18 -31 -29 52 14 -10 -24 14 12 -50 -20 35 34 12 1 13 7 54 -9
7222iL0k3J4k9L0l1j6O6l1J4n4K1K8L3j05N3l7mJ01l8J4k9QnL9k7m7L5L9o3j8
$$ -9 21 -2 12 -17 13 -18 -34 32 1 15 -39 -18 10 43 -62 -9 -46 -50 51 13 27 -2 6 1 40 13 -34 1 40 -23 -41
7253d1M8J4q1O2Pp6J02mj6p5K1oO5n9M1n8O1L4J2m3m2Ok5L1pL3M8j07N3m0M6K7
$$ -41 7 21 -60 2 9 -67 35 31 15 -60 -39 -45 20 -39 2 -56 5 39 51 8 -34 -28 -53 -22 -29 4 52 -55 -2 -42 4 31
7285C1r7L1N7j8joN6r6K2lN8j9n6M3k1M0Lj9J0j5m6J58j49N9j0Lm6N7j9j7K9q
$$ 31 -66 -35 22 4 3 -3 53 -43 -21 -24 34 15 -41 2 -19 21 24 5 15 0 -46 112 -37 22 12 15 -31 26 7 -10 19 11
7317A1n3J5O4q4K2N7n3O1r3N0L1o4J4n2J16j6q3R4Qo7MO4j6L0k9j1Oj7j3K8q1
$$ 11 -42 -27 37 -47 -25 32 -21 40 -53 -3 28 -36 -22 -74 42 26 -57 37 45 -22 -18 46 30 60 31 20 26 9 -4 24 -57
7348e7R5m7J0K7q5MP1m3%M7l0K6J5K7j4o0j3N9M3n6m1K8j7O6r2K9P7j7p4K8l9
$$ -57 38 -9 1 28 -57 -53 18 -25 -25 22 -8 18 33 60 46 -14 -27 32 75 19 -22 6 -11 55 -37 -8 69 52 -22 6 -33
7379c3J8M0MrJKj6l7l1M6J1L6k9j4J20n7j34P7K4Qk3K5jm2K2n3R6n9MK4J7K7r5
$$ -33 -15 25 29 20 21 23 7 -30 -61 -15 -4 32 3 -11 109 52 -82 -5 19 27 4 29 28 -14 8 -45 51 -8 -4 20 37 64 -31
7412c1J21j09M9lJ8p9M7k4J4N1j08M8%J8n1M7j8nJ8J2j7lm1R0r2M7K7l5J6M0p8
$$ -31 90 -19 30 27 45 -34 13 -11 3 54 -54 -6 -6 12 -39 8 -10 -15 3 15 -2 -5 -46 44 -48 -1 26 -9 7 47 -31
7443c1K5K7m5M5l5K3j9l5M5N4n8j5kN0n6J6jK2J6Pm4m%nL4K3n0Rk2O0j2j7o5O8
$$ -31 -6 21 -24 21 -14 9 -10 -45 0 54 -4 -19 -21 29 -27 -11 -12 10 26 33 -11 -15 -15 -20 14 37 -13 -4 -26 34 22 5 -60 8
7477Hj9k6M8J4qk1jqL0L5o7K5n3O6j8P3p1j3k3R3n9L4l7j0NL9L1o2Ko2N4oj0O6
$$ 8 -11 -37 11 25 17 -4 -5 -13 17 52 -15 10 -43 23 5 78 7 -6 -29 64 5 39 2 -8 -3 36 67 5 7 -55 -1 -7 -17 49
7511D9o8l4O0J5n6kL5n2K4M0MJ2l3m5Q8o2L9p1K6N9j1k9jK7K3l2NN5q5JJ6k7K9
$$ 49 -19 -53 7 22 -34 -36 -1 -53 -29 11 15 27 -6 -51 37 -25 14 -57 -31 28 17 -12 -13 14 37 5 10 65 -20 -19 -3 -30 -1
7544aL2j5LJ0o7O0N3o5k2M5J1l9JK0oj0jK5r1P6j2k4M5n3nM8r2J10k0No3K7O2
$$ -1 31 16 19 29 -38 22 75 10 -12 33 44 5 6 26 20 10 9 34 -57 19 7 -17 28 -25 -30 18 -74 36 16 21 -42 -15 47
7577D7k0l2MP3j33J05k3j1qL6p8K9PK1k6K8l0Kk3M1l3L8k9M7m2m4M5lM2Qp6j4
$$ 47 27 -5 -1 72 -61 44 21 10 2 38 -40 -11 -4 17 -9 19 -11 -9 -32 9 -24 14 -15 32 -10 -54 -9 -12 30 38 -38 -52
7609e2M5n7N5j9J0O8q3K4L4p4N3j0L3mm6KK9k6O6o1K0j7MM9m9L1m4O0q6J9K3K
$$ -52 -7 -64 -9 -28 -18 50 -33 -9 25 -49 4 -6 27 23 -23 -21 8 -18 48 -13 7 -10 -6 43 -6 25 -19 41 -45 -26 -3 -1
7641al7O8j05R0l0mOJ13j75R4K2l8omk9K6Rj4K5oJ0LLNk2j6j3O5m7nlM7mm1L2
$$ -1 -38 30 -75 15 -15 -19 -13 100 -75 19 41 3 -3 -7 -36 -10 -1 -15 10 4 14 17 20 25 3 -13 -26 39 -8 -13 -16 31 27 -14 18
7676A8Ol0%Ok1N5p7RqN0K5L0q6rL9j6k9M1l6K1l0kM9oK3om5K4Rn0K1K7m6N5ql4
$$ 18 24 -6 -6 0 -21 34 -43 -34 -42 8 33 63 -23 -32 7 -9 -38 3 -33 -12 -42 -44 5 -1 22 16 -29 -5 4 -46 -25 2 -44 11 3 -31
7712c1M2k7M0l2MK3kj7l6N0pK2JOLp8OJ5m4N8J0m2L1kj0Q5p9NrJ0KK0J1l2K7l1
$$ -31 11 -16 24 -8 -4 19 17 0 -36 14 7 29 30 36 39 -39 -33 -18 -62 -4 6 -36 -5 -7 -17 68 -11 -6 -15 -5 -3 17 28 -4 23 -8
7748hM4J1q5P7o3K2K4n5N5l8m4O3l7qK2O3p5K2j3j3M9k4M9o9K5J0J1l7Nj4J05
$$ -8 36 47 -38 39 -24 -2 22 -33 22 -16 -60 3 -34 -42 -20 43 -32 -10 -23 -36 13 -11 38 -31 -6 4 15 -22 -17 -31 74
7779G4o4m2M5O3r7M6rk9M2n7K0L5n8j6P8J5n5mrM2k2J5M1m7JJ7m3J6J6k9Pj7J8
$$ 74 10 -32 13 76 -21 25 16 -13 29 -28 -8 27 -31 -47 31 46 -9 -13 -22 20 -2 13 54 7 8 25 -18 -2 14 -15 -8 -25 -7
7812goPj9lL1rM0n9R7l6j8Ql8j1J4k1mJ9nM8k0pOM5q0N2k2k3JN5l9Ml2N9mjp2
$$ -7 -13 -6 -25 -28 3 -6 34 -25 72 36 18 26 -12 -23 -9 -30 -34 -15 -20 28 8 1 7 52 -28 24 2 -21 -20 35 -4 0 -32 27 23 22 -50
7849e0PJ8J4kpK0m0l7Q7Rj09R7M5m0Km0M5j4J0pl9L5pll9J6M6m1P0o4K9oMK5n0
$$ -50 -43 -25 -11 -13 -20 0 -40 -77 10 19 -90 7 52 12 14 -26 19 5 15 8 -31 4 -3 -6 -45 -29 17 -24 46 -18 11 5 9 34 -16
7884a6N0L0j3o7N4r4O8O2j36J17l2q0M0L6p2M4l3oN8o0O0q%o3K7J4OJ0j7k0N4
$$ -16 34 64 51 -16 38 -56 12 74 -62 55 23 -57 -17 19 -53 -9 -42 -48 10 -50 10 2 2 -61 -34 -20 -14 -4 -21 -41 13
7915A3Pm4j7J6JN1k4Kl8J0J0oJ1M2q5J6kRK1jRnl8M4m6J9oM0orJ2j7j1k8pQ2k6
$$ 13 20 -24 -41 -25 -24 27 3 5 -33 -23 -13 -19 -8 34 -51 -35 -37 -28 -7 -8 1 -4 -42 2 -44 -25 -31 9 3 -6 6 -11 -22 -50 -57 25 -1
7952aL5l3kMN1l8k3j2oM5n0M3j6K1j8M1o1n1J05nm6j0J8K8k8K1jj7K4l6%L9l5
$$ -1 34 1 -1 3 54 16 -7 -19 -25 20 -30 13 -3 18 0 41 -20 -71 34 29 -17 -27 -9 19 -9 12 11 -6 18 -18 -18 21 -14
7985a4M2o9L2rj8O1m5kK7J7J7o1m7K8O4j6RJ1k9J5rj4JN9l5N1m0m7J1Oj5K3N3
$$ -14 28 -41 -9 -18 -36 25 -20 -22 5 22 39 -22 -69 -41 23 7 16 27 -2 13 4 -10 -9 50 15 66 26 -21 -10 -4 -19 4 57
8018E7j09L4J0n4QM3Nl6J8J1L2q1R3n7J5l5NO8j9p0O7J5o7N1M6n4L9J6p3R2p3
$$ 57 -52 -18 -8 -62 -54 -11 -6 -42 -24 -13 19 -62 31 -26 -11 -46 -41 27 8 -62 5 20 -47 4 50 -4 35 51 -22 70 -3
8049cj9M8k2K8l0OrNk6kj2K9Pk6M4lmm3J8M3l0O0o0Oj6P1p4l5N7m4M6j5J1Nk0
$$ -3 -22 26 4 32 2 8 -1 4 -22 -24 -36 -7 0 -26 18 15 11 -32 -14 29 -1 59 -1 5 -11 60 -14 -49 8 -36 10 -5 6 11 -9
8084iQj7N6m1L1NLp3Q7q2K0N9j17J09r4K3L3j5N6nj2k5L2p6L6kLL1n6mN7Po6J07
$$ -9 -1 -18 38 -3 28 33 36 -37 50 -32 -12 47 -70 39 -55 -32 1 -14 42 37 25 0 32 -44 -8 -10 -7 24 -32 -36 21 28 -38 69
8118F9l0o2L1L1p1P4j05O6j3O0m3l3K8K7L9n2K4k2j6n4O4k1P8n2n8N6Qr0NN8j3
$$ 69 39 -23 8 39 -32 42 -63 3 -10 50 7 -26 2 29 68 16 40 18 2 -52 12 -9 69 17 -41 15 23 -67 -62 -4 -17
8149a7kMJ2lJ7J7qRm0K6L7n0J9Rk0o6Q1k9n7O4p4O5m2N0Q7p1nm3NP1n3M7k4Kp0
$$ -17 -19 -15 -3 -6 11 28 20 29 -11 15 52 2 21 30 10 -56 25 -4 -61 3 -71 -6 -48 2 89 18 13 -30 -25 46 -7 40 16 18 -52
8184e2N3L6o1M8J6m8J9
$$ -52 1 37 -24 24 40 -8 11
8191A1
$$ Imaginary data points
##PAGE= N=2
##DATA TABLE= (X++(I..I)), XYDATA
0@%%%%%%%%%%%%%%%%%%%%qJ6j6J6j6J6j9K7l2L2m0M8n0N8o6P4q4R2j04J19j31
$$ 0 0 0 0 0 0 0 0 0 0 0 0 0 0 0 0 0 0 0 0 0 -8 8 -8 8 -8 8 -11 16 -16 16 -24 24 -26 32 -34 40 -44 48 -56 63 -68
41f8J44j60J79j98K18k42K66k93L24l56L91m31M76n26N82o46P19q02R00j018J159
$$ -68 76 -84 95 -103 115 -127 139 -154 170 -186 205 -226 250 -276 306 -340 379 -423 477 -541 618
62F18j334J560j866K300k966M138o816K5448P064k0047P729j7790l443l460q987
$$ 618 -716 844 -1022 1278 -1688 2450 -4366 21082 28146 8099 15828 -1962 -5405 -8865 -17852
77a7852L458j471l070K1257J439j567J1657n036k288O797j1095r40k853j3778
$$ -17852 -14394 -15865 -18935 2322 3761 2194 13851 8815 6527 13324 2229 1289 -1564 -15342
91a5342N475K678n732J0016k308k588J1610k174P83O295r885P51L111p090O451
$$ -15342 -9867 -7189 -12921 -2905 -5213 -7801 3809 1635 2418 8713 -1172 -421 2690 -4400 2051
106B051k05q285P336o74j672Q292n240j061M460p379M748M752q943L256J029m634
$$ 2051 1846 -6439 897 223 -1449 6843 1603 542 5002 -2377 2371 7123 -1820 1436 2465 -2169
122b169O475k170k662M116p968O74P094p406J292L057n722N322J701k197O238
$$ -2169 4306 2136 -526 3590 -4378 -3704 3390 -4016 -2724 333 -5389 -67 1634 -563 5675
137E675n179k522P402n303r91L507p440J033J876l872N960j497m433P308j571
$$ 5675 496 -2026 5376 73 -918 2589 -4851 -3818 -1942 -5814 146 -1351 -5784 1524 -47
152d7n60O937m742n28L152n096L869P25p129L790j690m004O625k356k088M460
$$ -47 -607 6330 1588 1060 4212 -884 2985 3710 -3419 371 -1319 -5323 1302 -1054 -3142 1318
168A318m141K830M538n233L563N54o252N322O1m290L821l869j152N021m202K364
$$ 1318 -2823 7 4545 -688 2875 3429 -2823 2499 2560 -1730 2091 -1778 -2930 2091 -2111 253
184B53L163o957L497K786m623L951j627l594M404l266M50N065o063Q74M049m706
$$ 253 3416 -3541 -44 2742 -1881 2070 443 -3151 1253 -2013 -1563 3502 -2561 -1687 2362 -2344
200b344L311J521m687L461j865j847N777l961j398M289m553J473L345m420K374
$$ -2344 967 2488 -2199 1262 -603 -2450 3327 -634 -2032 2257 -2296 -823 2522 -1898 476
215D76l67l808N482j241k655M901l150o90M472l250J474J093n113L463J24m074
$$ 476 109 -3699 1783 542 -2113 2788 -362 -1052 3420 170 1644 2737 -2376 1087 1211 -2863
231b863M446j859l194M538j989L69L179m395K038J752m447L984J89m672L772j047
$$ -2863 1583 -276 -3470 1068 -921 -552 2627 -1768 270 2022 -2425 1559 1748 -2924 848 -199
247a99j472L988l108J98K711m546K476K192m934K648J51l077M112j336j042L674
$$ -199 -1671 2317 -791 -593 2118 -2428 48 2240 -2694 -46 105 -2972 1140 -196 -1238 2436
263B436l527O91L709m139J508J350m074K745j67k370L842k568j417M351k992Q2
$$ 2436 -1091 -400 3309 -830 678 2028 -2046 699 532 -1838 2004 -564 -1981 2370 -622 -540
279e40K962l761J272J061l009L358j055k800M213k040j247L904k876p1K164l157
$$ -540 2422 -1339 -67 994 -2015 1343 288 -2512 1701 -339 -1586 2318 -558 -629 1535 -1622
295a622K295N80l623L503q66k754M051j702j418K910k785R56J994l500K701P35
$$ -1622 673 1253 -2370 1133 267 -2487 1564 -138 -1556 1354 -1431 -475 1519 -1981 720 1455
311A455l482L576k66k405L291k045p17K590l308R44J965l920K325J073l041L046
$$ 1455 -2027 1549 1283 -1122 2169 124 -593 1997 -1311 -367 1598 -2322 3 1076 -1965 1081
327A081n90j671L146k390k73K933l522O85K065l252J866P17k404K911j214j492
$$ 1081 491 -1180 1966 -424 -697 2236 -1286 -601 1464 -1788 78 795 -1609 1302 88 -1404
343a404L435k723n84L067l144M20J775k785K101J58k198L415j362j544L636k191
$$ -1404 2031 -692 -1276 1791 -1353 -933 842 -1943 158 316 -1882 1533 171 -1373 2263 72
359G2o51K667k682P21J249k841K370k24k762L250j062j757L216j967l53K319k601
$$ 72 -579 2088 -594 127 1376 -1465 905 681 -2081 1169 107 -1650 1566 -401 -754 1565 -1036
376a036J491J206l224K248J38k644K821j056j311K492k014M10K316k960J256J248
$$ -1036 455 1661 -1563 685 823 -1821 1000 -56 -1367 1125 -889 -479 1837 -1123 133 1381
392A381l168K002J24k223K143j368n77K909k024O49K436k696J273J427k507J496
$$ 1381 -1787 215 339 -1884 259 -1109 -1686 1223 -801 -152 2284 -412 861 2288 -219 1277
408A277p67k072K140j686o33K746k290K73K507j967J378R04k366J715p33j770
$$ 1277 510 -1562 578 -1108 -1741 1005 -1285 -1012 1495 -472 906 1810 -556 1159 426 -1344
424a344K508j763j128K403j823N75J974k095J341L41k235K326o80k123K144j419
$$ -1344 1164 -599 -1727 676 -1147 -572 1402 -693 648 989 -1246 1080 400 -1723 421 -998
440i98o45K356j549P46J287k153J853P75k263J870p16j841K068j201k47J732k238
$$ -998 -1643 713 -836 -90 1197 -956 897 1672 -591 1279 563 -1278 790 -411 -658 1074 -1164
457a164Q01J508k200J568M62k254J631m32q25K021j662j39J957k054J087J441
$$ -1164 -363 1145 -1055 513 975 -1279 352 -80 -905 1116 -546 -685 1272 -782 305 1746
473A746k396J058J92j644J956r63j080J873j796J00K175j937O29Q67j929J608
$$ 1746 -650 408 600 -1044 912 -51 -1131 742 -1054 -954 1221 -716 -87 780 -1149 459
489D59J94j430J959j187r90K356j389j18J399k162O78P17j881J794m82j849K174
$$ 459 653 -777 1182 -5 -995 1361 -28 -146 1253 -909 -231 486 -1395 399 -83 -1932 242
506B42o05n17K143j489Q6J336j734J492M26k388J495k04j527K073q92p96J520
$$ 242 -363 -880 1263 -226 -140 1196 -538 954 1380 -1008 487 283 -1244 829 -63 -859 661
523F61j469P69J468k025J037N03k120J880m1j359J453j294l66J819j552M96J202
$$ 661 -808 -39 1429 -596 441 944 -1176 704 663 -696 757 -537 -903 916 -636 -140 1062
540A062k157J140Q05j572J584p27j302J924j262l07J684k044K43J345j476J345
$$ 1062 -1095 45 850 -722 862 135 -1167 757 -505 -812 872 -1172 -929 416 -1060 285
556B85L91j524J835n87p16K082j437q05J406j726M68R22j710J046L4j275K192
$$ 285 676 -848 987 400 -316 1766 329 -476 930 -796 -328 594 -1116 -70 -36 -1311 881
573H81l72j061J769j265k95J554j523N39L68j854J530K60j440J663p09j010J710
$$ 881 509 -552 1217 -48 -343 1211 -312 227 595 -1259 271 531 -909 754 45 -965 745
590G45j076JJ140j923N97R45j560J531R5j444J638o18l99J617j520j23J112j752
$$ 745 -331 -330 810 -1113 -516 429 -1131 400 495 -949 689 71 -328 1289 -231 -354 758 -994
608i94R41Q13j654J062o2q83J817p83n87J475j644O4J463j706N68M68j469J460
$$ -994 -53 760 -894 168 106 -777 1040 257 -330 1145 -499 -435 1028 -678 -110 358 -1111 349
626C49k1r15J672j112n74J776j307k7Q73j802P36L97j290J602m33j128J852o95
$$ 349 328 -587 1085 -27 -601 1175 -132 -159 714 -1088 -352 45 -1245 357 -76 -1204 648 -47
644d7k19J565j359J49P67j453J017K49j710J250k23r72J687p34l23J234j353O04
$$ -47 -266 1299 -60 89 856 -597 420 669 -1041 209 -14 -986 701 -33 -356 878 -475 129
662A29J003j594P74J85j602J338k33q37J304j038k8J515j339N28R18j763Q66L88
$$ 129 1132 -462 312 497 -1105 233 0 -837 467 -571 -599 916 -423 105 1023 -740 126 514
680E14j348J201o84q85J503r59J34J451j485N15J045j304J035Q2j331J195p29
$$ 514 -834 367 -317 -1202 301 -658 -524 927 -558 -43 1002 -302 733 815 -516 679 -50
697e0p50J589j132k02J250j302O97Q28j393Q91qj211J375n10q07J299j086j16
$$ -50 -800 789 -343 -545 705 -597 100 928 -465 426 418 -793 582 72 -735 564 -522 -638
715f38J284j160N98N18j436J151R2j105J290o22p85J329r84J74R64j467O91O58
$$ -638 646 -514 84 602 -834 317 409 -696 594 -28 -813 516 -468 -294 670 -797 -106 552
733E52j324J237mj158J283n29m13J305j236J25J040j538P97N47j413R65p3r26
$$ 552 -772 465 461 -697 586 57 -356 949 -287 -162 878 -660 137 684 -729 236 163 -763
751g63J307o61m21J297j225K02J078j319N69M47j255J122j95q42J285q13m33J295
$$ -763 544 -117 -538 759 -466 -264 814 -505 64 511 -744 378 183 -659 626 -187 -620 675
769F75j002J30Q14j272O41L06j082J140k31q15J346o68l86J170j073K23O99j176
$$ 675 -327 -197 617 -655 -14 292 -790 350 119 -696 650 -18 -404 766 -307 -84 615 -561
787e61Q23L28j345J215k50q37J273p22l52R72j120L88Q07j354R50J79j093J144
$$ -561 262 590 -755 460 210 -627 646 -76 -428 544 -576 -188 619 -735 215 394 -699 445
805D45j25p45J173q19j95R83j217M05N79j204Q15K12j014J046k27o85J198q26
$$ 445 320 -425 748 -71 -266 717 -500 -95 484 -720 95 307 -707 339 112 -573 625 -201
823b01j36J040j118L53N94j086P95J20r16J096m06n91J203r35j91R79j134M01
$$ -201 -337 703 -415 -62 532 -554 241 361 -555 541 135 -456 747 -188 -379 600 -534 -133
841a33N35j032Q42kr12J253m84n16J159q57p8Q33j075N61L97j181R65l1r27J127
$$ -133 402 -630 212 210 -702 551 67 -449 710 -147 -225 608 -467 94 491 -690 275 244 -683 444
861D44m48n92J155r07Q2Q13j171O35M31j089R95l6q46J051m60l92R61r46J22P91
$$ 444 -4 -596 559 -348 -266 547 -624 11 442 -647 348 312 -534 517 57 -335 626 -320 -198 593
881E93j059M57M11j039Q30l1p45J054n71l27J037r13J69P83j049N47L13r80Q47
$$ 593 -466 -9 402 -637 193 162 -583 471 -100 -427 610 -303 -134 649 -400 147 460 -520 327
900C27j96o81R89o26l20J001q73J42O93r36N92K65r20Q69l11o58J080o27l25J060
$$ 327 131 -550 439 -187 -507 494 -379 -237 456 -480 112 377 -543 326 15 -643 437 -190 -515 545
920E45q34K58O08r59O33K06r50Q01k42o25R75o85j58Q63q36L04O19r86Q14J64
$$ 545 -289 -31 577 -382 251 457 -493 308 66 -559 416 -269 -427 436 -400 -96 523 -463 351 515
940E15q40P81k67n00Q09p03j00P85r28L12M68q26O44R6o37P24k75m64Q88p53l1
$$ 515 -325 456 189 -311 498 -205 -305 480 -448 -136 332 -494 150 246 -391 333 58 -406 482 -271 -302
961c02P85r19L91M52r09O69lp00Q92m21l53Q22p39P0O65p94L33L97q00O67j0n82
$$ -302 483 -436 -45 407 -502 167 164 -536 356 -65 -418 404 -335 -265 400 -394 -61 336 -464 203 193 -389
983c89Q60m51l37Q42p03R9O32r02M97K58p23O86j49o39Q74m82l00Q09q17J37N61
$$ -389 471 20 -317 525 -178 -79 553 -349 148 406 -317 369 220 -419 455 -27 -327 482 -335 -198 363
1004C63q05N33K39p55O93j05m61P10m22k42O76p85J20M93q62M39K77p08P48q7
$$ 363 -442 91 330 -425 268 163 -298 412 -10 -252 424 -361 -241 252 -610 -171 106 -602 146 59
1024E9m88Q20m33j35P27p33J25N51r44N22J82o73P00k33m47R13n60j40P30p29
$$ 59 -429 391 -42 -177 550 -183 -58 493 -451 71 253 -420 280 47 -400 513 -47 -187 543 -186
1044a86K03L73o92M45J40o95P62k37m42Q18n64j23O29o34K45L16p32N13M9o73
$$ -186 17 390 -302 143 283 -412 350 113 -329 489 -75 -198 431 -203 42 358 -374 139 188 -485
1064d85P93l71l13P00n19j06N55o71K98L02n47N70j0o04P92l75l10P07o25RN21
$$ -485 308 -63 -376 324 -195 -301 254 -417 -119 183 -364 206 196 -408 384 9 -301 406 -219 -210 311
1085C11p16L18K83o46N85m8l91O53k68k19O18n62J05M02o05K88K13o08N53j00
$$ 311 -405 -87 196 -450 135 87 -304 349 81 -138 480 -82 23 425 -180 108 321 -287 266 166
1105A66m66O55m50j11O07o87J80M69o39K65K21o27O24j64m00O35m39j46N93n78
$$ 166 -300 355 -95 -206 401 -286 -106 363 -276 -11 210 -417 207 43 -357 278 -161 -307 286 -292
1125b92J19L80o30M94Q1m89N67k11l88O80m62p3M94n15J99L25n94M50J67n05N66
$$ -292 -173 207 -423 71 152 -337 230 19 -369 311 -151 -224 270 -245 -46 279 -315 135 302 -203 363
1146C63j91l87O24l94j19M97n91J22L44n88L85R4n56N87j74k89O08l96l5M64n93
$$ 363 172 -215 409 15 -104 393 -198 -76 268 -320 65 159 -397 190 16 -273 335 -61 -96 368 -225
1167b25J87L24o00M58p0m70N75k56j92N20m62P5M44n58K48K53n42M43o9l35N46
$$ -225 -38 286 -314 144 74 -396 179 -77 -269 251 -211 -136 308 -250 -2 251 -291 152 83 -252 294
1188B94k80j45N16m60J6L93n93L06J94n48M83j20l15N06l02j85N50n08J06L93
$$ 294 14 -131 385 -75 -59 334 -259 47 241 -307 176 56 -259 247 -55 -240 310 -198 -92 301
1208C01n25L29J17n07N02r6m28N88l72j11N02n06J52K80n42L85N6m80M75q2l11
$$ 301 -224 105 222 -285 217 121 -307 281 -91 -202 300 -206 -54 226 -316 69 125 -355 120 38 -273
1229b73N31m02J2N15n71K10L36o15L63M3l97M42j93k76N01m01J5M01m41J94K46
$$ -273 258 -144 -132 383 -188 22 358 -257 106 149 -248 194 1 -275 226 -175 -160 241 -200 -6 240
1250B40n04M30M5m08M78k49k20M79l47l3L61m76K13J86n25M66n9l64M71k00k59
$$ 240 -264 166 211 -197 281 32 -188 291 -56 -89 272 -204 9 195 -330 136 77 -287 184 -16 -275
1271b75N21l79l1M18m96L37J35n03M79p4m23O10l28j96M11l70LL91n28L12J23
$$ -275 246 -133 -164 254 -242 95 230 -273 206 132 -291 319 -9 -205 206 -164 -161 230 -298 14 137
1292A37m38N62j89k45M62k82j53M64n50K46K42n15L37J09m39M12j13l11M99l54
$$ 137 -301 261 72 -173 289 7 -146 318 -232 14 256 -259 78 187 -252 160 47 -264 235 -119
1312a19r4M74m80J57K12m92L58R0m13N23j75k54N13l63k9L52l93J16K73m52K74
$$ -119 -213 261 -219 -62 150 -342 16 106 -307 216 41 -213 300 -63 -92 260 -133 -17 256 -196 78
1333G8K0l68M74k82k03N41l86J5L86m74J71K89m88L86j2l43N09k79k10M42l94
$$ 78 98 -270 204 -78 -281 260 -126 -111 275 -199 -28 261 -227 159 147 -196 313 34 -176 266 -128
1354a28L4L52n61K63J96n19M86l4l64N13k38j11M21l52qL09m61K57O7l92L69n9
$$ -128 -94 258 -303 -40 156 -363 123 89 -275 238 0 -111 310 -42 -50 259 -202 55 122 -270 99 40
1376D0l44N00k50j28M34l79J15K91m67K83J40m53M08j26k42M14l00j54M99m48
$$ 40 -304 196 -54 -182 252 -127 -12 279 -188 95 235 -218 190 64 -178 236 -64 -218 281 -167
1396a67O7L09m38K78J04m17M16n8m00N06k80j38M16m12J56K59l97K97M6l45M72
$$ -167 -100 209 -229 49 153 -264 152 94 -306 200 -80 -218 198 -214 -58 201 -196 101 147 -198 274
1417B74j52l17M95l50j51M12m23J16K88m60K79J01l81M72j39k17M56l22k4L10
$$ 274 122 -195 300 -50 -201 211 -212 -96 192 -268 11 112 -269 203 64 -153 303 -19 -43 267
1437B67m11J59K25m95L80r2l35M07j45k04N01l69PL66m45K41J81m26L43p9l41
$$ 267 -144 15 240 -255 125 33 -302 105 -40 -244 257 -112 -105 261 -184 57 238 -188 155 76 -265
1458b65M10k19j63M43l59M2L50l84K12P9l89L54o2l63N01l26j14M59l64L5L35
$$ -265 145 -74 -237 206 -153 -111 239 -145 67 146 -243 111 49 -314 187 -139 -253 206 -158 -123 212
1479B12l68K19J36l71L75k9l82M87l18j38M02m05P5L40m47K90J37m01L73m6l08
$$ 212 -156 63 199 -172 203 174 -208 279 -39 -177 225 -180 -105 235 -212 78 215 -186 187 141 -167
1500a67M45l17j31M28l80J22K00l83K74L0l68L88r2k86M01k56j17L83l78M8L79
$$ -167 278 -39 -170 258 -122 0 200 -183 91 121 -247 141 49 -237 164 -92 -209 174 -204 -156 223
1521B23m21K85L6l38L45k1l07M27k58n6K64m39K06J84l53L09L6l59M07j31k15
$$ 223 -198 87 123 -215 130 109 -198 229 -29 -85 179 -260 -54 130 -223 86 122 -237 170 39 -176
1542a76M01k08n1K49l36J37K08l84K99kl49M40j92k05L48k51k7L19m61J26K04
$$ -176 225 17 -34 215 -121 16 224 -160 139 137 -212 228 36 -169 179 -72 -99 220 -241 -115 89
1563H9l36L14j3k64L72j16j88L67l27L7K36l17R9K12l97L07n6l24M48j39j76L76
$$ 89 -247 67 54 -210 162 46 -142 225 -102 -65 171 -146 -47 165 -232 75 19 -305 143 4 -172 204
1585B04l24O2L12m00J59J25l34L45k4l36M23k27j17L71l38L7K29l95K46Q6l01
$$ 204 -120 -58 254 -146 13 138 -196 149 125 -211 212 -15 -132 239 -99 -62 167 -228 18 104 -197
1606a97K66q6k16L86j76j52L54k85N0K43l64K14J09l87L64r4j96L15j92o9L26
$$ -197 69 -17 -233 153 -23 -175 179 -106 -56 187 -177 37 146 -241 123 29 -167 148 -44 -113 213
1627B13l33J01K34m28L34L9l26K95j34j56L40k56q4L81k94K5K43l41K43m0k67
$$ 213 -120 -19 215 -213 121 160 -166 129 -5 -161 179 -77 -161 220 -74 -49 194 -147 96 56 -211
1648b11K77p8k27L89k41k2K98k95J04J91l45K22J05k53K41j77j21K83k56QL24
$$ -211 66 -12 -239 150 -91 -113 185 -110 -6 185 -160 62 167 -86 155 -22 -143 140 -116 -108 216
1669B16m01J17K61l78K19P5k72L38j42j77L87k83j8K41k98P8K08l38K57pk69K99
$$ 216 -185 -68 193 -185 34 109 -163 175 33 -144 243 -40 -58 183 -115 -37 171 -167 90 83 -186 113
1691A13j61q5L57k43r1K78k95J31J00k96K64n2j70K72j36j02L17k55N0J83l20
$$ 113 -48 -133 224 -19 -110 168 -127 4 104 -192 72 20 -150 122 -14 -116 201 -54 -4 179 -141
1712a41J56J01k68K43m5k00K54j69j03L52k40L5K42l28K23P3l00K69r3k33L12
$$ -141 15 116 -152 91 46 -154 100 -69 -172 180 -60 -25 217 -111 112 185 -115 154 61 -172 140
1733A40k32n0L39l47N7K15k17J42L6j77J97r4j50K62k41j5K16k11P2K67l32K03
$$ 140 -92 -142 197 -150 -93 122 -95 47 83 -94 103 9 -141 121 -120 -135 81 -130 -58 209 -123 80
1755H0R6l19K91j01j77K71j99q1K32k59Q1K16l18L16k1k28L09j34j35L07l15J0
$$ 80 176 -143 148 47 -130 141 -58 -139 93 -166 -85 131 -187 129 108 -120 189 55 -80 227 -88 -78
1777g8K32l14Q1J51k41J91Lk36L63k02o4L11l13N4J98k62P2J69k99K93k7k56L79
$$ -78 154 -160 -79 72 -169 22 25 -211 152 -50 -114 197 -116 -62 136 -126 -54 115 -184 109 82 -174 205
1800B05j36j81L22l11O4J77k91J28J01k73K17J0k36M24k26q8K67j99KK42l35P5
$$ 205 69 -112 210 -101 -37 140 -151 -23 78 -195 22 32 -204 220 -6 -94 173 -26 -24 218 -117 -42
1822d2J16k76K08K2j92K71j34j13L70k81MK29l14J43P8k82L06q5j73L64k01q3
$$ -42 74 -202 6 28 -164 107 -27 -140 230 -51 -47 182 -132 11 89 -193 113 28 -145 219 18 -65
1844f5L05l31Q9J60l42K06J09l96K57J3k00L11j56o6L12l02J36J02k71J17O1j98
$$ -65 240 -91 -2 158 -184 22 131 -265 -8 5 -195 116 -40 -106 206 -96 40 142 -129 -12 49 -149
1866a49K41j16j48K73j74J0K02k69Q1K08k73J94j9k16L09j50k18L90k05J2K38
$$ -149 92 -24 -172 101 -73 -63 139 -130 -49 159 -114 80 61 -155 154 4 -214 176 -29 -17 221
1887B21l09J14J24k03J21N0l06K47j17j37K90k47K8K94k84O6J62k32K16qk01K28
$$ 221 -88 26 150 -53 68 118 -188 59 -58 -195 95 -152 -124 170 -114 -48 114 -118 98 90 -111 117
1909A17j32j20K08j66NJ93k47J54J39k52J67K3j90K65k06j40L15k18R6P9j69J37
$$ 117 -15 -135 73 -93 -88 105 -142 12 151 -101 66 89 -101 164 -42 -182 133 -85 11 90 -79 58
1931E8J09k87K07%j93K97j79j55L01k71k4K28k11J50L8k18K41o9j93L20j35j29
$$ 58 167 -120 87 87 -106 191 12 -143 158 -113 -137 91 -120 30 68 -150 91 22 -171 149 14 -115
1953a15K98l21J3K77k76J16J50k96K11l4j95L35k23m7K16k43J07J81l12K55M3
$$ -115 183 -138 -125 152 -124 -8 142 -154 57 23 -172 163 -60 -107 109 -134 -27 154 -158 97 140
1974A40k62K91j11j00K07k54m3K69k59R3J52k53J85M4k27K24k9j91K72k12k4K14
$$ 140 -122 169 58 -42 165 -89 -132 137 -122 -29 123 -130 55 99 -128 96 67 -124 148 -64 -88 126
1996A26k12R6J18k70J90N1k52K97q4j93K63j98m9K03k30J09J53k83K46l9j87K62
$$ 126 -86 10 128 -142 48 99 -153 144 60 -133 130 -68 -117 86 -144 -35 118 -165 81 42 -145 117
2018A17q8j41K85k47K1J81k80J39J68l12K32%k91L11j66j02K81k13O1K53l15J28
$$ 117 29 -112 173 -74 -53 128 -152 -13 155 -157 75 75 -216 95 -71 -173 108 -105 -44 209 -106 22
2040B2J68k44J81q2j34J43m6k00K96k26M0K06k69J66J12k30J57J9j53J54p1r3
$$ 22 190 -54 127 45 -89 54 8 -192 104 -122 -82 124 -145 21 133 -97 60 79 -74 80 9 -84
2062h4J80k18M1J96k65J75P5j95J54Rj93K96j56q7K11k14K1J72k96J50J02j90
$$ -84 96 -122 -81 115 -150 25 100 -95 59 68 -125 171 15 -72 139 -75 -54 118 -178 -28 74 -116
2084a16J98l1j25K80j64n3J65j94K4J33k44J11K7k03K28n8j15L08j59o2K01k09
$$ -116 82 51 -74 206 42 -11 154 -40 -16 117 -127 -16 11 -192 36 -22 -137 171 12 -50 151 -58
2106e8N5J39k89J73N7k32K45j06j44J98j86L1J84j69J00J35l01K23O9k14J86r1
$$ -58 -3 136 -153 20 77 -155 90 -16 -160 38 -148 -117 67 -102 -2 133 -168 55 124 -90 96 5
2128Eo2J15r3o8K09j96J46Q8k42K42p7j50J62p2j18K48j59j58K30j90J66L6j87
$$ 5 -57 58 -35 -103 106 -90 56 144 -98 144 67 -83 79 7 -111 137 -22 -180 50 -140 26 62 -125
2151a25J97J9k45K92j42j33K23j58o9J88k04J24J05k43K65mj57K14j82m1K23k14
$$ -125 72 91 -154 138 -4 -137 86 -72 -141 47 -157 -33 72 -171 94 90 -67 147 -35 -76 147 -67
2173f7j3J68k25J45J19k26K43nk00J93j07j04K17k19k9J63k33J33J08k03J62L9
$$ -67 -80 88 -137 8 127 -99 144 139 -61 132 25 -79 138 -81 -110 53 -180 -47 61 -142 20 59
2195E9j74K16r5r5K04k32PJ83k41J68L2j68J71n1j21K73j48j34K88k37M0J58k42
$$ 59 -115 101 6 -89 115 -117 -110 73 -168 0 32 -136 35 -16 -137 136 -12 -146 142 -95 -55 103 -139
2218a39J85J09k32J95q4j35K54k07j6J64j95J2J61j97J76J9j96J61j3j00K03j33
$$ -139 46 155 -77 118 34 -101 153 -54 -70 94 -101 -89 72 -125 51 70 -126 35 22 -78 125 -8
2240hr4J96k09M8J60j87J51Jk33J92J9j76K48j44j7K07k94J63R7k73J83N8k64
$$ -8 -102 94 -115 -67 93 -94 57 58 -175 17 36 -140 108 -36 -53 154 -140 23 120 -153 30 88 -176
2263a76K91j23q7K31j60J6J76k15O2J23k01J01K5k59J68l5j03K43j78K8J44o7
$$ -176 115 -8 -95 136 -24 -8 168 -47 15 138 -63 38 63 -196 -28 -63 -166 77 -101 -73 71 4
2285DL5N0j81J34J0j89K50j53r7K59j46l0J45j78J34N6j34J13m5r8J42j03p8K64
$$ 4 39 89 -92 42 52 -137 113 -40 -137 122 -24 -54 91 -87 47 103 -31 82 37 -61 81 -22 -100 164
2309A64j84j8J64k05P7O3j79J47n5j40K14m2m9J64j59L8M6j55L9Q5j31J43L2j77
$$ 164 -20 -38 126 -79 -2 61 -118 29 -26 -166 48 6 -43 121 -38 0 46 -109 -70 15 -116 27 59 -118
2333a18J75j12K6J86k35K3J33k12J05N9j36J16N9j63K28j20n3J70j90Q9R9k13
$$ -118 57 -55 -29 157 -78 -55 78 -134 -29 30 -106 10 69 -94 134 14 -39 131 -59 30 129 -84
2355h4J18P6k35J86p2j09J84l4m8R3j41K9J31k44J34rj39J75O8j84J37l1j1J65
$$ -84 34 110 -125 61 -11 -120 64 30 -18 75 -66 -37 94 -150 -16 -25 -164 11 79 -105 32 1 -10 155
2379A55j97N0O2j41M1J7j43J87n1n3J81j53J3R9q2k4J81j76Q0K9j77J68m7j01
$$ 155 -42 8 70 -71 -30 -13 -156 31 -20 -73 108 -45 -32 67 -15 -39 142 -34 46 75 -102 66 19 -82
2403h2K27j16m3J38k58J21N8j40N8J14j85J97q2p6J62j20mJ18j55L6J11j47R6
$$ -82 145 29 -14 124 -134 -13 45 -95 -37 77 -108 89 7 -69 93 -27 -31 87 -68 -32 79 -68 28
2426B8k6n2Q8n6r1K14j21p9K48k49P3M7k5M6k4k2J18q9j05J23j09P7R0j36K9Q0
$$ 28 2 -50 38 -18 -109 105 -16 -95 153 -96 -23 24 -1 45 21 -1 117 28 -77 46 -63 14 104 -32 -3 77
2452G7j59J23L7k15J93j2j67J60p6K0J23j44Q3P5j61Q6j3q3R3k8j48J99j08L1
$$ 77 -82 41 78 -137 56 44 -123 37 -39 -19 104 -40 43 118 -43 43 30 -53 40 12 -136 63 -45 -14
2476a4Q5j66R8O8j48J15K4n6P6q0m7J22r7p1J53j54J16Pq2J15o8r4J37k7n1J18
$$ -14 71 -95 3 71 -77 38 62 6 82 2 -45 77 -20 -91 62 -92 24 31 -51 64 -4 -98 39 12 -39 79
2502G9j20k0J20j14R3O3j96J69q5o0J06l5p7J80j78L7R3j32M8O9j40J05J8j64
$$ 79 -41 -61 59 -55 38 101 -95 74 -11 -71 35 0 -77 103 -75 -38 55 -77 -29 40 -100 5 23 -141
2526a41J81j24kJ56n8K0Q2j86J56p0j00Q8o6k6J61j07%P4m7l0J00r6O4L7j63J34
$$ -141 40 -84 -86 70 12 32 114 -72 84 14 -86 2 -64 -90 71 -36 -36 38 -9 -39 61 -35 29 66 -97 37
2552C7l1m6J38j42j2O2n6J6J24j29P1mm0Q6k3j34J59p3j00J58j44N8P8j15L2P0
$$ 37 6 -40 98 -44 -56 6 -50 -34 90 -39 32 28 -12 74 51 -83 76 3 -97 61 -83 -25 53 -62 -30 40
2578D0p0Q0Rj25J33m6k2P6j58M9L0p6Q4n9j1Q0L0r3J38j01J1Q3j08N5N1j70O0
$$ 40 -30 50 59 -66 67 21 -1 75 -83 -34 -4 -80 4 -55 -66 14 44 -49 89 -12 -1 82 -26 29 80 -90 -30
2605c0J13j43O4lr9J29o6KJ13j01M9L9j48J02Rj14J39j04J8R6n4l9J29j42LP6
$$ -30 83 -60 4 1 -98 31 -35 -33 80 -21 28 67 -81 21 30 -84 55 -49 -31 65 11 -28 101 -41 -38 38
2631C8r2J11k6n7P6o7k1J36j48O0J1n1M0O2j20J20l3p6M0n2m8J65j00K6L0j08
$$ 38 -54 57 31 -26 50 -17 -38 98 -50 10 21 -30 10 72 -48 72 39 -37 3 -49 -97 68 -32 -6 24 -84
2657h4O7O7j04M5J4n5J07j9p6P8n4nK1kM1ko6P8m3j15J79q5m4J17r1k3J00p5Q3
$$ -84 -17 50 -54 -9 5 -50 57 38 -38 40 -14 -19 2 0 41 39 -27 51 8 -107 72 -13 -57 60 -31 -54 46 -29 54
2686E4j3j38J23j5MP9p2o5J25j27M1O1q6R3j4m0K3j0j07J73r3j09K04q0p6J35
$$ 54 41 -97 26 11 15 94 22 -43 82 -45 -4 57 -29 64 50 10 33 23 -84 89 -4 -113 91 11 -65 70
2712G0j30M0L9o8J35n0r0O4l9k0L5j8J6J11j68Q2Qp7Q0L0n3pL4l9Q8j51Q2O9j39
$$ 70 -60 -20 19 -49 86 36 -54 10 -29 -49 -14 -32 -16 95 -73 9 17 -60 20 50 -3 -10 24 -15 73 -78 4 73 -66
2741f6J06n2l6J12n0p7J28q9PL3q6N5P6j24O1M5j17R0k9l5P3J8l1J7q9M1P2p3
$$ -66 40 -12 -48 64 14 -63 65 -24 -17 16 -70 -15 61 -63 -2 43 -74 16 -13 -48 25 43 12 29 -60 -19 53 -20
2769b0P5l1o8J13n8%J05j14J0K0o8J0N5p4Nlm2J25l7k1J3J8j04J57o8l2K5m7R2
$$ -20 55 24 -44 69 11 11 116 2 12 32 -36 -26 29 -45 -40 -43 -85 40 3 -18 -5 13 -91 66 -2 -34 -9 -56 36
2798C6k0p3J07j7q4J29j54M4J0mqO8q6O4q9L9Q5r9R0l0Lm1P4r1L0O6j07M5l7L4
$$ 36 16 -57 50 33 -51 78 -76 -32 -22 -26 -34 34 -52 12 -77 -38 47 -52 38 8 11 -30 44 -47 -17 49 -58 -13 -50 -16
2828a6Q4j53Q8K7o3QP4m8J8K1j45O2NJ5M6J7n3P7r8j2O6o0N4on6O7k2k9J04r2
$$ -16 68 -85 3 30 -33 -25 49 1 19 40 -105 -43 -38 -23 23 40 -13 64 -34 -46 20 -40 14 8 -48 19 -3 -32 72 -20
2858b0L9K8o8qP9Kp2L7KK4Mo1M5o7K4J0kKL3o8PP0j21Q9J8n6K9L4o0J5LMO1p5
$$ -20 19 47 -21 -29 50 52 -20 17 19 43 47 -14 31 -36 -12 -2 -4 -2 31 -37 -30 40 -81 8 26 -30 -1 33 -27 -12 -9 -5 56 -19
2892a9L0J4r6J35l4j3L1m6jL5m2l5M2j8N6j8q0P0K5r7J35p1K7J3m8Pmq3Q4M6j19
$$ -19 11 25 -71 64 30 17 48 2 1 36 -6 -41 1 -17 39 21 -59 11 36 -61 74 3 30 43 -5 2 -2 -85 -1 45 -74
2923g4J02om3J22j34J1P4q3j2M1QL4K3o6k1O5j06Q1%j1N6j10P8po6L8kQM9m7o
$$ -74 28 22 -21 101 -33 -22 52 -31 -43 -2 6 40 63 -3 -24 41 -65 16 16 5 61 -49 29 22 -44 -6 -8 0 49 2 -4
2954dN0m6l0QM3k4Qj9K6k0pJ8j3Jl2O1p1J04r5N7N5j13K1N4m2M7k1JN0l0n5K6
$$ -4 46 0 -30 -22 21 -3 5 -14 12 -8 -15 3 -10 -9 -41 20 -51 53 -42 15 70 -43 -22 32 -10 37 16 17 67 37 -18 8
2986HMm2O7o8M7%n5R9n5k3M8l1kNj4k4O0p0N0j0L9mj3k5k8P2m7J4j9j4M3o4P1
$$ 8 12 -30 37 -31 16 16 -39 60 5 -18 30 -1 -3 2 -12 -36 24 -46 4 -6 33 29 16 -9 -37 35 -12 2 -17 -31 12 -52 19
3019A9j0m2P5m7J9L5r8J02l5n7nQ2o2M2Qk7J9m5J0N3q1M2j7m9M9k4kM1Pl6M1r
$$ 19 9 -33 42 -5 14 49 -49 53 18 -39 -44 38 -24 18 26 -1 18 -27 -17 36 -45 -3 -20 -69 -20 -44 -46 -5 2 -34 7 -2
3051bm8P4k9m1L0RnMJ8l7%j8P8j1n5N8j4l7O9n4K2J8m3jN3r8O4M5o5k2K2J6k5
$$ -2 -50 24 -5 -46 -16 -7 -12 -8 10 -27 -27 -45 33 22 -33 25 11 -26 43 -11 11 29 -14 -15 38 -60 4 49 -16 -38 -16 0 -25
3084b5L1KO6q7j1j4j8Q2j7k3p4K3K6L5k3QP8p8M0K5m2k2P4n8K8%j8K5o7L5L7n9
$$ -25 6 8 74 -13 -24 -38 -56 26 9 -14 -88 -65 -39 -4 -27 -19 59 -19 21 46 4 -18 56 -2 26 26 8 33 -34 1 38 -21
3116b1J6M9p0O2k5k7QJ1k6L8p5Q1%l7M5j6m2L7Lr6R0j4LL7r3M9O0k1k6K4n9R1
$$ -21 -5 44 -26 36 11 -16 -8 3 -23 15 -60 21 21 -16 29 13 -29 8 11 -85 5 -9 -6 31 -62 -13 47 26 0 24 -35 56
3148E6m6l7L7m8M5L2j3J7l0j%j0K0N3m9n1mQRN4j3l8l5L3j2M8o0M4K2n9N5j9K7
$$ 56 10 -27 10 -38 7 39 26 43 13 12 12 2 22 75 26 -25 -29 -21 -12 42 29 -9 -44 -11 -23 25 -35 9 31 -28 27 8 35
3181C5n1j1k5J00j09R6ml3ol2K1M0k7pP4k4p0P5l8L2j4k5j5M8r4M6rk4N5J2k1
$$ 35 -16 -27 -52 48 -61 35 31 -2 -8 -40 -19 21 -6 -13 61 37 -33 42 4 36 22 -3 -18 30 -64 -18 -27 -51 4 16 -5
3212el5N9m0K3M1kq5J0M0nmk0M4J1m9QK2k7K8q4M5MO5j00M8M9o6N3q3K4J6N9o6
$$ -5 -40 19 -21 2 43 41 -44 -34 6 1 -3 -23 21 32 -17 -9 13 -14 14 -70 -25 -21 44 -56 -8 41 -25 28 -55 -31 -15 44 -22
3245b2JL2K5m9%NLj5L1Rn3L7N5n4pO9q5R6o7J2Op2K8m2N2J0j2L1k4k2l9P2K1k7
$$ -22 -21 11 36 -13 -13 -8 -5 -20 11 20 -33 4 59 5 -2 67 -18 78 11 23 29 -43 -15 -57 -5 5 -7 24 0 -22 -61 11 32 5
3279EK2k1j8j3J0K5L2m1L4m7N8m9j4M3j7l8O0Oo5N4j9k0L7ll2P1m4oLo0N7k7O4
$$ 5 27 6 -12 -25 -15 10 42 1 35 -12 46 -3 -17 26 9 -29 31 37 -28 26 7 -13 24 21 -11 60 16 10 13 -47 10 -17 47
3312D7o9N6k4k0J%M1ko3J0M7j7K2pJ5pr1P5n8J0O6l5l7J5k1K4N7m8NPn3J02o7
$$ 47 -22 34 10 -10 -9 -9 32 30 -33 -23 24 7 29 22 37 30 -61 14 -44 -34 32 -3 -40 -25 -46 -22 35 -13 -8 -1 -54 48 -19
3345a9L0Mj3K2j6L3n3J2n0M1l2J5L4k4K9Jj4j5rK8M7l0k9mQl8R4m1qOL9l4k2K0
$$ -19 11 15 2 24 8 41 -12 0 -50 -9 -41 -26 8 -16 13 14 0 -15 -24 4 51 21 -8 -12 -4 -42 52 11 3 9 48 14 -8 12
3379A2j6J6q6Q0o9J2pQ0r3M9J0J0LJ0l4K7l6pM2l9N7n1PN4o7O1j3n0L0N1p4K4
$$ 12 -4 12 -74 6 -63 -51 -58 22 -71 -22 -12 -2 1 11 -23 4 -32 -39 3 -36 21 -30 -23 31 -36 25 12 -38 -8 43 -31 -7
3411gJ2p2J17k3m3L7m1l1J04j6n8J8qkL2q6J06o8nL1L3j3l9L0J8kr1L4N7p7M9
$$ -7 5 -67 50 27 -16 21 -20 -51 53 37 -21 -3 -11 -13 19 -67 39 -29 -34 -3 30 17 -22 8 26 24 -67 -33 24 -53 -4
3442dlJ1J9l6OL6p5K6pJ1M2RJ2l0p8O8q2N3j5O5lm9L9q4M2O8m8J7j1m8jK2J0j0
$$ -4 -7 4 23 -13 -7 29 -46 -20 -27 -16 26 35 47 17 -61 7 -75 -22 -37 28 25 -24 15 -69 -27 41 -7 10 -1 -49 -50 -28 -18 -28
3476b8O6rLMq5J17m4m5k4N1J0l2L5K6q2N0Pl8O0m3o7M8Oj4N8l6l9J06l4lj2l3
$$ -28 38 29 32 36 -49 68 24 -21 -45 6 16 -16 19 45 -37 13 20 -18 42 -1 -68 -20 -14 -28 30 -6 -45 61 27 24 12 -21
3508b1K4j5k9N5L7l8K2k2m2L8j6pQ1j02O2J2o0nM0k1jrN9M8q6PO5q5O0o7M4j0
$$ -21 3 -12 -41 14 51 13 35 13 -29 9 -7 -14 67 -35 27 39 -21 -26 14 -7 -8 -17 42 90 4 11 76 -9 51 -16 28 18
3540A8L7r9J3J0lK7k6K3M0q4J7N5j04O8K6r3N9kN6j4o8NQ5k8j8J9mkJ8j8L9r0
$$ 18 55 -44 -31 -21 -24 3 -23 0 40 -44 -27 28 -76 -8 18 -75 -16 -18 38 24 -44 -39 46 18 0 19 15 13 31 13 52 -38
3572c8L0N9o3J4O0l7N4p5m6P5l9M5m0J8m0L4m8N0J3Mm8Rj7L1nK2l9J3K2m2K1r5
$$ -38 -8 51 -12 2 62 25 79 4 -42 33 -6 39 -1 17 -23 11 -37 13 26 30 -18 -9 -26 5 0 22 -17 -4 18 -24 -3 -98
3604i8Q3JJ3M1r8J00k3n0M3QLj0l9L8l0P6l3o5J9J05m5p5J17q1l9M9n3K2J3j2
$$ -98 -15 -14 -1 40 -58 42 19 -31 12 20 23 13 -26 12 -18 58 25 -40 -21 84 39 -36 81 0 -39 10 -43 -21 -8 -20
3634b0J5l3N2K8l5n6Q9l0m5N4j1rj3j8M5L0j27J29qNo8j0Q7K4n8j4K0m5P8l2q1
$$ -20 -5 -38 14 42 7 -49 40 10 -35 19 8 -1 -14 -32 13 43 -84 45 37 42 -26 -36 51 75 17 3 23 -22 56 24 -57
3665e7R7m5m4J10mr0K7M3k8pn7K8N8l1KJ5n4P7l8r6J02o4J6P1o5N0M0m6M0n0K5
$$ -57 40 -5 -49 61 57 -33 -6 37 9 2 -55 -27 31 0 2 17 -37 40 2 -94 8 -56 -40 31 -34 16 56 10 50 0 25
3696B5j5n2N3L2p8P7k8k9M6L4n9M5q7N8oj0l9O5q9R3n3m0O3m7L5Kn7O3M7r5M1
$$ 25 10 -42 11 43 -35 42 14 -15 31 65 6 51 -36 22 16 6 -33 32 -57 36 -17 -57 6 -41 -6 -4 -61 2 49 -46 -5
3727e%k4N0ok5N4j9p2M7K3n7N6j5K7j4n4L4j5K8%J0Jj8LQJ1l2J8K1l5j3M6p3M3
$$ -5 -5 -29 21 15 -10 44 25 -47 0 23 -34 22 7 34 20 -34 0 -15 13 13 23 24 6 9 17 28 -4 14 35 0 -13 33 -40 3
3761CmMK1n6P7K0o3k4N0n7KL7l5L8M6r8P9oo1M1OL0Kk7k9O6r9P5jm4P7l8lK0%
$$ 3 -1 3 24 -32 45 65 2 -22 28 -29 -27 10 -25 13 59 -39 40 34 -27 14 20 50 52 25 -4 62 -37 38 37 -7 70 32 29 49 49
3796D9m4%jLM5o9rL5K4j4J2mMr0L6j6K2k1O0j4K6r9O5l5nO3Mp1J00l0o5J25m2
$$ 49 5 5 4 7 52 -17 -26 9 33 19 31 27 31 -59 -23 -39 -17 -38 22 8 34 -65 0 -35 -40 23 27 -44 56 26 -39 86 44
3829D4r2R4o4qpO1j8J5qm7PL8o2N3l2P1j3o1N0p3j6P5OPk6l1K4LML5j2o0J7J4
$$ 44 -48 46 -18 -26 -33 28 10 25 17 -30 -23 15 -47 6 -26 45 32 -29 21 -52 -68 7 13 20 -6 -37 -13 -10 -6 29 17 -43 -26 -12
3863a2K2J8l6J8J7j6L5q0K7O9m3rL7m3m2Q8o5L2j3l8J3j3K1K4l1RM8k2oqNm3N8
$$ -12 10 28 -8 10 27 11 46 -34 -7 62 19 10 47 4 -38 50 -15 17 4 -34 -21 -34 -13 11 -20 -11 37 15 9 1 6 -37 21
3896B1l4k0J22j00Q0p2j3K8n0N1J9n7QN5j11N0PJ4Q1p1m4K0R0j23M4m7M7mj8K5
$$ 21 -13 -33 89 -11 69 -3 -16 12 -38 13 32 -25 -17 38 -73 -23 -16 -2 79 8 -36 -16 74 -49 -5 -52 -5 -9 -27 -2
3926bj9m1J16m4m2P8j4n1j7PL2Lq3N2P5p6P3l8j3M2o1RJ8n5K4O4n1l0J05l6kk1
$$ -2 -21 -62 54 10 -32 46 32 -19 -36 -29 3 6 -77 -25 50 -26 47 9 -4 38 -23 -14 4 -51 -27 37 -14 -44 61 25 23 2
3958BP4p5k0m7J34j49O0m5R2n0P%K4Ll3PJ4N7m9pMj1k7lK6o%J2m6M6l3P0k2L3
$$ 2 76 1 -19 -66 68 -81 -21 -66 26 -24 -17 -17 7 10 -23 -16 -2 55 6 -1 3 -8 -35 -38 -12 -18 -18 -6 -52 -6 -39 31 9 42
3992D2m4M3r6P7o9M3K5Ql4J7o1N5n4L3J2%pJ8m5O0l7J4j1M3Rr0J8JO0k2n4M7L1
$$ 42 -2 41 -55 22 -47 -4 21 29 -5 12 -49 6 -48 -15 -3 -3 -10 8 -37 23 -14 0 -11 32 41 -49 -31 -30 30 8 -46 1 32
4025C2q2J15n2K8Qn2j6M6Jj7jLJ6Jl5M0m0j9oJK8L8j12Q9l7RN8r1N9n0L3J7l3
$$ 32 -50 65 13 41 49 -3 -19 27 28 11 10 13 29 30 -5 35 -5 -24 -30 -29 -1 37 -75 14 -23 -14 44 -47 12 -38 -5 12 -21
4058b1k2N5l3j1M1Kn3O0k8NMl2j0Q7p6J5L8l4j6j0J0P8o3J6%J1M0r3L9Mn7M4M3
$$ -21 -43 12 -21 -32 9 11 -42 18 -10 -5 -1 -33 -43 44 -32 -17 21 -13 -29 -39 -29 49 -14 2 2 13 53 -40 -1 3 -54 -10 33
4091C3m0KM5n3m4J13q6N5M0j26M8L7m8M9q2P%J10o3M8m3n7j3O4Q7j42J6Q1m2k0
$$ 33 -7 -5 40 -13 -57 56 -30 25 65 -61 -13 24 -24 25 -57 -50 -50 60 -3 45 2 -55 -68 -4 83 -59 -43 38 -4 -24
4121b4L3n4M6l6J5qN6mM6o2rOk2lN2l2j0K4k7j0mQOL7j1M9l8j01R6m4j3J03r7
$$ -24 9 -45 1 -35 -20 -28 28 24 70 8 -1 5 -17 -20 32 0 -10 14 -13 -23 -27 -19 -13 24 13 62 24 -77 19 -25 -38 65 -32
4154c2L1j8j2K1L1k5N8j00R1k5n0K7J5o9J6M7qJ8k5m6J10o0K2m5J9J2j3j7K9N4
$$ -32 -1 -19 -31 -10 21 -4 54 -46 45 20 -30 -3 12 -57 -41 6 -2 16 -9 -55 55 -5 17 -28 -9 3 -10 -27 2 56
4184E6m5J4m6k0l3Q2J4j5LK3oj2qkL2l3j7mPj9M0O8r0m7O8m0MJ27j06lJ4jj7R
$$ 56 11 25 -21 -41 -74 8 22 7 10 33 27 15 7 5 37 4 -13 -17 -10 -29 11 79 -11 -58 10 -30 -26 101 -5 -8 6 5 -12 -3
4218cmO9p7%L0m9J9J30j50%K7k3L4jm0N6J2j5m1L0p2K0L3J7n2P2l0l6N2m4oO3
$$ -3 -7 62 -15 -15 15 -34 -15 115 -35 -35 -8 -31 3 2 -38 18 30 15 -26 4 -68 -48 -15 2 -50 22 -8 -44 8 -36 -42 21
4250B1lo0L8L0o7R4o1j4P7m5p6R5n3J4n0O8k2qO0n4Lk0Q2o9L2po7Q4k7k7N1l9
$$ 21 18 -42 -4 26 -41 53 -8 -22 55 10 -66 29 -24 -10 -60 8 -14 -22 38 -16 -13 -33 49 -20 12 5 -62 22 -5 -32 19 -20
4282b0M3Qk7J7r%M6l9l6M3n9k5J1O8M0L1j29O6j6j6M6Kq3O2k6L1K3k5j6m1J9R
$$ -20 23 31 4 21 12 12 58 19 -17 26 -33 -58 -47 21 61 92 -37 29 13 -3 43 45 -38 24 -2 29 52 27 11 -30 -11 -2
4314bJ5J5n9M7q4K5P3m2K1jk2J2k1LL5m6O7Nj8K6l9m5M0K4n1L9K9nn0l3M0j3M
$$ -2 13 28 -31 16 -68 -43 30 -12 9 8 -14 -2 -23 -20 15 -31 36 41 23 49 10 -35 5 29 -22 17 46 41 -9 -42 -2 -15 -11
4347a1qK3k2M8o1J0N1m8J5K9j02N0J3N4q5Q1j3j8JKl4P8r1N9o3L5J7j7L3K1n0
$$ -11 -19 4 -18 30 -31 -21 30 -18 -3 26 -76 -26 -13 41 -44 37 24 6 7 9 -25 53 -38 21 -42 -7 10 -7 26 47 -3
4378cL8l2o0Q2n7M2Oo0J9M6J6o9j4O5j8lMn7O8nj4KJk7N9KL4n5qJ7M%J9m9j1m
$$ -3 35 3 -57 25 -32 10 16 -44 -25 21 37 -32 -46 19 1 -2 2 -55 13 8 -6 -4 -3 -30 29 31 65 10 2 19 23 23 42 -7 -18 -22
4414b2Q4k5J2n7O9j00RoM4l0m2PJ41m1j00Q6l2m8k8Q5L0n4J7PjK9k0j8K4j5J5
$$ -22 62 37 49 -8 61 -39 -30 -36 8 -22 -64 -57 84 43 -57 29 -3 -51 -79 6 36 -18 -1 6 5 34 14 -4 20 5 20
4445B0rk2K4L2l9j4Q0j05JR9k9mk3m7K1LnM8J2q3N7m9J7M8nJ2jMp5J3%j8L0l4
$$ 20 11 -11 13 45 6 -8 72 -33 -32 67 38 34 11 -36 -15 -12 -17 31 43 -40 17 -32 -15 33 28 40 39 43 -32 -19 -19 -37 -7 -41
4479d1M0k8k6P0l5OKn8R9pp7N3oPL8n2pk3N1K9k9j7J1L3k8l5L7l1Q3o4N4lm9M8
$$ -41 -1 -29 -55 15 -20 -14 -12 -70 29 22 -55 -2 -8 -1 37 -15 -22 -45 6 35 6 -11 0 33 5 -30 7 -24 59 -5 49 46 -3 45
4513D5Ql7o0J13m9q2Q9j8%j5j5L2j9lj8J6N7l8J8Pl5K3o6O8o6N8j0j5K2m2Q0m9
$$ 45 53 16 -44 69 20 -62 27 9 9 -6 -21 11 -8 -11 -29 -13 44 6 24 31 -4 19 -47 21 -45 13 3 -12 10 -32 48 -1
4545ak9K5lK6k8j0M4J9q8L5No4O4K0L2q1m1N3K6j6N1j02rM2K3o7Q7j5L4mp0K4
$$ -1 -30 -5 -8 18 -10 -20 24 43 -45 -10 -5 -69 -5 15 47 -34 -75 -22 4 -12 39 -63 -72 -30 -7 -74 13 -2 32 28 -42 -18
4577a8O7j22P0l2L4K0m5M8j4m9N7l9N4j5K2q4P5m8oK5Pl3P4j01M2Q1j19R2o3l3
$$ -18 49 -73 -3 -35 -1 19 -26 22 8 -41 16 -23 31 16 38 -46 29 -19 -25 0 7 -26 48 -53 -11 70 -49 43 -20 -53
4607e3P3K3n9K1l4L1M1p2K0k5J2nL1JJ6Mm3Oj8O6o7N4m9N1OKo3QJ7LL2J4J4q5
$$ -53 20 43 -16 5 -29 2 43 -29 -9 -34 -22 -27 4 5 21 25 -18 -12 -30 36 -31 23 -26 25 31 33 -30 -22 -5 -2 30 44 58 -27
4641b7M1m1M6M1r5K8L2j2j6l2K8N1m2j1Ok8j1M2m8P1Pl6K7j0nN4l7j9K3ml8M2
$$ -27 14 -27 19 60 -35 -7 25 13 -3 -35 -7 44 2 -9 -3 -31 -42 0 -48 23 30 -6 21 11 6 60 23 4 27 23 -15 27
4673B7k8n1M9jj0m5O1Qm7ON2k1m1M1OrJ1l8O3l8MJ9J8o5L4M8p5L0j4RK6mj8l0
$$ 27 -1 -52 -3 -4 -14 -59 2 10 -37 -31 21 0 -41 0 6 -3 8 -30 33 -5 -1 18 36 -29 5 53 -22 8 -6 3 29 25 7 -23
4707b3M3j3qK4l1PKM7l0l1L3n7L8JJ8k9k1O9m4m5R7l5lK7m4J0N9o0j0K2lm0J6
$$ -23 20 7 -1 23 -8 -1 1 48 18 -13 20 -37 1 2 20 -9 -30 39 -5 -50 47 12 9 36 -8 2 61 1 -9 13 10 -30 -14
4740a4k3Q5p5N2lMLn8K2j5M8Pm6k7J1Q9l9l1J1j1M4rn3O8l2nk4M9n1L3k1J2l9
$$ -14 -37 48 -27 25 22 26 29 -29 -7 -22 26 33 -13 -40 -29 60 21 -10 1 -10 34 25 -28 40 8 3 -21 28 -23 10 -11 1 -38
4773c8Q5l0j1p8Q9l2rQ1l0k1rK9k9n1J5O6l5J5L3n3r6J61l9J5n4P7l6K4m0p9J25
$$ -38 47 17 6 -72 17 -15 -24 57 27 6 -3 26 -3 -54 -39 27 -8 7 40 -13 -109 52 13 28 -26 51 15 39 -1 -80 45
4804D5n9J9K4l4%K0Ll1NK1l5P2j08O2O4r2L1m1K1N5j10L5R0k8r4NO6l5L7N6n1
$$ 45 -14 5 29 -5 -5 15 18 -13 -8 13 -22 50 -58 4 68 -24 7 -34 -13 42 -68 -33 57 29 -65 -60 6 -29 8 64 13
4835A3J5K0l4j5M2n4m0N7K2jm0J8KrN0m5JL3j5L8p2K3j3j6l2kj0M6oNJn2Q3l0
$$ 13 28 48 14 -1 41 -13 -53 4 26 25 -15 3 5 -4 46 1 2 35 20 58 -14 9 -4 -20 -52 -54 -64 -18 -24 -19 -18 -70 13 -17
4869a7j3N0J2oK8l3m4M1j9L3m0k3L7%o1Q6k9j4K2OpQk5L4m8M0j1l9K7Kj3J3L3
$$ -17 -30 20 32 26 54 21 -23 18 -1 32 -8 -31 6 6 -55 31 2 -12 10 16 9 17 -8 26 -22 18 7 -32 -5 -3 -16 -3 30
4902C0p4L3K4k0ol9R1l1m3M8l9N0o1N4l6jJ4LL7m8O9p6Q6q1P3p2n8M6K5j7M5n1
$$ 30 -44 -11 13 -7 -13 -52 39 8 -35 13 -26 24 -37 17 -19 -20 -6 -3 34 -14 55 -21 65 -16 57 -15 -73 -27 -2 -19 26 -25
4934b5O9Ll7j5k8N4j3L8r4J0L8l6J1M2n0P7q8N8Nk8K0qO3j6m9k4L9rN6l2On6M1
$$ -25 44 47 10 -5 -33 21 8 46 -48 -38 0 -36 -25 17 -33 44 -44 14 19 -9 11 3 66 50 1 -23 16 7 63 31 37 -19 22
4967B2l4O2l9k2O3r7N6n3J6J7nl8P9Jp3JL0lJ8l1J3Rk7Q4m4j5l6J06l9J8n1RN
$$ 22 -12 50 11 -11 52 -45 11 -42 -26 -9 -14 -52 27 28 -45 -44 -14 -17 1 -30 -17 -8 -35 49 5 -10 -46 60 21 39 -12 -3 2
5000Bm2L4l3K5l8O7j1l9O3j3n8L2J3L6n9L3rk3N6l5N3l9J9p6M4l4J6O6q6N3oo3
$$ 2 -40 -6 -39 -14 -52 15 4 -35 28 15 -43 -11 2 38 -21 12 3 -20 36 1 54 15 34 -42 2 -32 -16 50 -36 17 11 -52
5032e2N0RN5m7j4n7O8p4O5K2q0P0J0l8j0K8K2l4P3n9lj3O6m0n2qL8l3K6qj3kL6
$$ -52 -2 7 62 15 1 -56 12 -62 3 25 -55 15 25 -13 -23 5 27 -7 66 7 4 -9 57 17 -35 -43 -5 -38 -12 -20 -33 -35 1
5065Al3OJ8L8L0k7n0N5l9NM2p7P3o6J01m0l3l7N1p%j1mJ3m3Q4k4k8M0m5JL3oj2
$$ 1 -32 -26 -8 30 60 33 -17 38 -1 4 46 -31 42 -24 77 37 4 -33 18 11 11 0 -4 9 -34 50 26 -2 38 -7 -6 27 21 9
5099Ij4J9K1nj7j3l7M2J4j0n8nJ4QJ8QJ3l8J9m2O9K5n2MM6o1j2k1R5L5n7J7l5
$$ 9 -5 14 35 30 13 0 -37 5 19 9 -49 -54 -40 -32 -14 -6 7 -31 -12 -54 15 40 -12 -8 38 -23 -35 -56 39 74 17 34 -1
5132al1P9k5j5k8N8l1k6KJ2J4l9O1k5lJ0m2lM4l7k1N2n7N1L4o0J9l9N4J3j2np
$$ -1 -32 47 22 7 -21 37 6 -20 -18 -6 8 -31 30 5 2 12 -30 -33 11 -26 -47 5 -52 -1 33 -27 -8 -47 7 20 8 3 -4
5165dJ6K8pj0j2l7J4J8l1L2%k2L9j0jj0N9o7K4j0nl3K7j1M6p2P5n3l4K2o1J14
$$ -4 12 40 33 23 11 -26 -12 6 -25 7 7 -15 24 14 13 3 62 -5 19 9 4 -29 -2 -13 33 -39 36 -17 -51 -29 -90 24
5197B4l4K1j2K0l1L9j3k1Ql4Q6n8j7N6k3o0K6M3l4mL7j3qK3Rl1N5k1n1qPJ8J2
$$ 24 -10 11 -1 19 -12 27 14 -7 1 -33 53 -5 -22 34 11 -49 -23 20 -14 -18 19 6 -2 21 30 -1 54 33 -18 -26 -19 -1 11
5230A1K2k6l0OkL2l3k6L1l1K5qM6m1L9k4L7Jj8l9M0K3o1J6%LN2lm6o5Q7M1n6J3
$$ 11 33 7 -23 -17 -19 13 -20 -46 -15 -46 -21 -29 17 -24 15 -9 28 29 11 -28 12 35 -26 -10 -10 -7 45 42 -4 -69 18 59 3 16
5264A6k8jk9Q8k6m2M4l6K3n3Jj0N4k3J6M4Nr4jK7N2l1JJ2o3Q4l6Mm1M0l8L4JK1
$$ 16 -12 -13 -42 46 20 -22 22 -14 9 -44 -43 -53 1 -22 -6 38 43 -51 -52 -25 27 -4 -3 9 -54 30 -6 -2 -43 -3 -41 -7 -6 15
5298A5L2J7q6mJ4jMQK9l0j4KK4Rk8k3N4K2o5L3j3J4Kl0NN3o4J0M3nqK4p9R1l9
$$ 15 47 64 -22 -26 -12 -13 -9 -1 28 -2 -16 -14 10 19 -9 -32 22 44 -21 12 -1 13 15 -15 -10 43 -21 -11 32 27 19 43 -36 55 16
5333A6l0M6l5K7jj3J7k4j2O4m4%Rk9l2M7J5K3q2l9N0J8J4k5Q5p4L6Ll5l9Q9p5
$$ 16 -14 32 -3 24 23 10 27 3 -9 55 11 11 20 -9 -41 6 21 44 -38 -77 -27 -9 5 -20 65 -9 27 30 -5 -44 45 -30
5365c0M1Nl3pL2J1k1k3j9Q9m3QLm6L4K%J2n9L7M1k6j4LL1m5M8nm2j2L1RRj1Oj1
$$ -30 11 16 -17 -24 8 19 -2 -25 -44 45 2 10 13 -33 1 3 3 15 -44 -7 34 8 -6 -3 28 -17 31 26 -16 -28 3 12 21 10 16 5
5401Ej1O3j4o9JL5L4l0ro7L8P4o5NJ8M2k4qj4k5K8%kK8o9N2M9l4p3N1PJ8n0n9
$$ 5 -6 57 43 -26 -25 10 44 14 5 -62 -24 50 -15 -10 8 50 26 18 4 -21 7 7 5 33 -36 16 65 31 -42 9 16 34 -16 -75
5435g5Q7Kl6K0L1p1M8l4K4k4N2j4J2n2O6p2kR3o1MLrN9n8NJ9k7O4n2K8m6Lm4N5
$$ -75 12 14 -22 -2 29 -42 6 -28 -4 -28 24 10 22 -30 36 -36 -38 55 -6 -2 1 -8 51 -7 -2 17 -10 54 2 30 -16 -13 -57 -2
5469bN8j04P5k6M8j7pqP7j21L5K1pM0m2r2P7N1j33M4K2J9j1jj1N8k6KM7jn3k2
$$ -2 56 -48 27 1 49 32 25 17 94 -27 8 29 22 62 20 -72 5 56 -77 -33 -11 8 -3 -4 -15 43 17 19 66 65 12 -10
5501a0J8L3l9K8Jn0N3m1o4Q3K9m9N5mo2L9lj4%k4K8m1J9J11j12k9N1k9K8ql3O
$$ -10 8 41 2 30 31 -19 34 -7 -71 12 41 -8 47 43 -19 20 17 3 3 -21 7 -34 -15 96 -16 -45 6 -23 5 -3 -36 -30
5533c0O0r3L5NL1j6l5K1N1j6l3k7J7K4j8N6m5O2j37J54j4p9M0m1M0N1l9k7K7n7
$$ -30 30 -63 -28 -23 8 -8 -43 -22 29 13 -20 -47 -30 -6 -24 32 -13 49 -88 66 52 -27 13 -28 12 63 24 -3 24 -33
5563c3K8jj3R3l8m7N7o0M8L0q8M1j3k7N6l6j6l0j8M9Jj7Q4k6K5n2j1K4j0Q4p8
$$ -33 -5 -6 -19 74 36 -11 46 -14 34 64 -24 17 4 -23 33 -3 -19 -49 -67 -18 -17 -34 50 24 49 -3 -14 10 0 84 6
5594FL1p5M0jm6M6J8o9RR0r9N8J7o1J11m5j1Mk6m1O6m7KQ5q4j5l3N4M3l2RL1o9
$$ 6 37 -38 2 1 -45 1 19 -50 -41 49 -50 8 25 -36 75 30 19 23 -3 -44 22 -25 -23 62 -22 -37 -70 -16 27 -5 4 35 -34
5627c4J9M3p2L6K1j9N0m4k2L1Rk7PK2p0P0m0L1k9K7omj0L0j1k0L1p7L2K5p8J00
$$ -34 -15 28 -44 -8 13 -6 44 0 -22 9 18 -9 -2 20 -50 20 -20 11 -18 9 3 -1 -11 19 8 -12 19 -58 -26 -1 -79 21
5659B1k1QQk6J5L0m0o7J14k0m5O9o8L6qnL8Mm0K8Pn4L3j1K7M9r8k5L0j9M0qMl
$$ 21 0 8 16 -10 5 35 -5 -72 42 22 -23 46 -22 14 6 1 39 43 3 31 38 -16 17 6 33 82 -16 -41 -11 -30 10 2 6 3
5693Cn1K0O5j2j5Knnj3nLJ3l0L7o%M2k3kn7M8Ml0k5Q8j4l5P1l9Kl6j6JPm4J14
$$ 3 -48 -28 37 25 10 12 7 2 -11 -16 -13 0 -30 7 1 1 43 20 18 -39 9 13 -17 -42 46 32 -3 68 29 31 -5 -21 -20 -13 -57 57
5729E7j2l4M7m5j6L1n7L0J3l5K6m1J2j2L4j8K5Kk4M9q8O5j6mJ1J2p5R2j2m8Q2
$$ 57 45 11 58 13 -3 28 -29 1 14 -21 5 -36 -24 -36 -2 -20 5 7 -17 32 -56 9 -7 -11 0 12 -63 29 17 -31 51
5760E1n1oN2o5K1PPK7o5L2m5M2m6J15p6j4O0m8m2O9n6K9l3P6m4M6r5P4rn3K3J2
$$ 51 0 -6 46 -19 2 9 16 43 -22 10 -35 7 -39 76 0 -14 46 -2 -44 25 -31 -2 -35 41 -3 43 -52 22 13 -40 -17 -5
5792eJ4l5oOL7k9N9m2l6J7N9m4J2Oj7Pl6N6J6q3J2j4L5M0J7l2k7K4mj%m5j5K2
$$ -5 9 -26 -32 -26 11 -18 41 -1 -37 -20 39 -5 7 13 -4 3 -33 23 39 -44 -32 -46 -11 29 46 14 -13 11 7 6 6 -39 -54 -32
5826c2Q5m8m6Q1m3k0J30j62P8Mm8J8Mj4j8J4J2N0m0K6n0L6Jj6O%k5M3o%k1NO1
$$ -32 53 5 -41 40 -3 -23 107 -55 23 27 -21 -3 1 -13 -31 -17 -5 45 5 31 -19 17 18 2 8 8 -17 26 20 20 -1 4 65
5859F5p1M8n4K7J5m7M5m5j4N1J5r2O9l2L8km7K6L5n2J9N4m8j8J9K2J2K9q0j8N2
$$ 65 -6 42 -12 15 30 -17 28 -17 -31 20 35 -57 12 -20 18 16 -31 -5 30 -22 -3 51 3 -15 4 26 38 67 -13 -31 21
5890B1j1K2n4j9M5O7n5%o4L3K3k0KJ5R1r2K8k0nj8J9o7O9L4j38K0J35q1L8m6m7
$$ 21 10 32 -22 -41 4 71 16 16 -48 -15 8 -12 -10 5 96 4 32 12 7 -11 8 -59 10 44 -94 -74 61 -20 18 -28 -75
5921g5R1p5P3k0M1l7k0K4rpK2J0lK5n6j5Nj2L1M1k5m5P2OK3m1NJ5K3n0j8KK0j7
$$ -75 16 -59 14 -6 35 -2 -22 2 -7 -14 8 18 15 40 -16 -31 -26 -38 -7 34 9 -36 36 42 65 24 29 44 67 17 -1 1 21 4
5955Dk5k6O5L2p3k6O0J2l2J7l7J25o0l7m3M0Rl8Q0n3J9rqJm8J05l8l7Q0l5k7O7
$$ 4 -21 -47 18 50 -23 -49 11 23 -9 8 -29 96 36 -1 -44 -4 5 -33 47 -6 13 4 -4 -3 -51 54 16 -21 59 24 -3 64
5987F4j05P3n7NL1k3PJ0m8nN0m9K5N3ol5n6N2lM0KK7n4J7JLl3LmRK1m4P0l9M6
$$ 64 -41 32 -25 -20 11 -12 -5 5 -43 -48 2 -47 -22 31 25 -10 -66 -14 -17 23 25 52 -2 15 16 19 -14 -11 -15 -6 15 -29 41 2 48
6022D8m0rk8M9nk0M1j3k5J5k8J9L2j35Q7K2m0J9L3l9K8k6K6J1r0O2j3m4J49q4
$$ 48 8 -1 -29 20 15 -5 36 23 -2 13 -15 4 36 -99 -12 10 -30 -11 22 -17 11 -15 11 22 -68 -6 -19 -63 86 2
6052Bl5K9k1L1l8M5L2m9J4jRk4J13j44K3rQm8Q3l4J8JPj7Rm9R7n5j3PN1o4k9N7
$$ 2 -33 -4 -25 6 -32 13 45 -4 10 9 18 -6 107 -37 -14 -23 -15 -63 20 -14 4 5 12 -5 4 -45 52 -3 -16 -9 42 -22 -51 6
6086FRq6K5N0m4R4k9Prn5O6rrk4l1L4m3J02m0o4N3J0M9n1l5k6J3J4K9%m8Q2m3
$$ 6 15 -71 -46 4 -40 54 25 32 23 -32 34 25 16 -8 -39 -5 -48 54 14 -50 3 13 62 11 -24 -50 -37 -23 6 6 -42 40 -3
6119ck2P9r4L8pM9l4rj8PM1JNm0KN3m4mQ2j03O1orJ8o8M4n3N1OnpNK0n4N0j2o3
$$ -3 -25 54 -40 -2 -9 40 6 -3 -21 -14 27 28 33 -7 -5 48 4 0 82 -21 40 34 25 43 -25 19 -34 17 23 18 11 16 36 -18 32 20 -43
6156d3J2O4l7kK5k8L6q0K6N6k8O3n2jj0k3J4J6m3j3P6n0l4J4k1P3J7n3M5Nqj8
$$ -43 -31 33 -4 -6 19 -9 27 -53 -27 29 1 64 12 11 1 -22 -8 8 -35 -48 28 -22 -56 -42 -63 10 27 -26 19 24 16 -2
6188bN8p1j0L5j6K9k1n0J24j05Ork2P6o9J8m2nL9j6J1J8K6M3j10P0J5j9kk4M0
$$ -2 56 -15 -25 10 -6 23 2 -48 76 -29 -23 -32 -54 22 -47 -29 -71 -76 -37 -53 -42 -24 2 45 -65 5 20 1 -1 -25 15
6219A5m0K0O4j00P3j5k7K6K0p5L6M9rJ8%n9j4NLP0p6j7K5J7QKl4L7o4K7Lk3N2
$$ 15 -25 -5 59 -41 32 17 -10 16 36 -39 -3 46 37 55 55 -4 -18 -13 -10 60 -16 -33 -8 9 17 19 -15 22 -42 -15 -12 -35 17
6252A7l4RJ2J3p5L5J11r9k5O1q3O3kl5M5k5O2o3N2l8jk6N8jo6J7N9lr2O6k8P5
$$ 17 -17 -8 4 17 -58 -23 88 -11 -36 25 -58 5 3 -32 13 -12 50 -13 39 1 0 -26 32 31 -35 -18 41 38 -54 12 -16 59
6284E9p2P3m0n3J05m8m2L8l1L4Lk3Rj7M5ln3L4k3k9L9J9o1K7J1LL8J0r3J9j2P5
$$ 59 -13 60 20 -33 72 24 -18 20 -11 23 26 3 12 -5 40 37 -16 18 -5 -34 5 24 -37 -10 1 4 42 52 -41 -22 -34 41
$$ [...]
8191d4
##END NTUPLES=NMR FID
##END=
