##TITLE=1H_DE-80H_X3
 200.13MHz, d2o
 8 sc
 
 19ns.26.2.2025
##JCAMPDX= 6.0         $$ Bruker NMR JCAMP-DX V2.0
##DATA TYPE= NMR FID
##DATA CLASS= NTUPLES
##ORIGIN= UXNMR, Bruker Analytische Messtechnik GmbH
##OWNER= pz
$$ XWIN-NMR		Version 3.5
$$ Wed Jun 18 14:27:27 2025 Russian Standard Time (UT+4h)  Yarkov@DPX200
##.OBSERVE FREQUENCY= 200.1313
##.OBSERVE NUCLEUS= ^1H
##.DELAY= (6, 6)
##.ACQUISITION MODE= SIMULTANEOUS
##.ACQUISITION SCHEME= undefined
##.AVERAGES= 8
##.DIGITISER RES= 18
##SPECTROMETER/DATA SYSTEM= spect
##.PULSE SEQUENCE= zg30
##.SOLVENT NAME= DMSO
##.SHIFT REFERENCE= (INTERNAL, DMSO, 0, 14.3821)
##AUDIT TRAIL= $$ (NUMBER, WHEN, WHO, WHERE, WHAT)
$$ ##TITLE= Audit trail, XWIN-NMR		Version 3.5
$$ ##JCAMPDX= 5.01
$$ ##ORIGIN= Bruker BioSpin GmbH
$$ ##OWNER= Yarkov
$$ C:/Bruker/XWIN-NMR/data/yarkov2/nmr/H-C/1/audita.txt
$$ ##AUDIT TRAIL=  $$ (NUMBER, WHEN, WHO, WHERE, WHAT)
(   1,<2025-06-18 14:26:20.79 +0400>,<Yarkov>,<DPX200>,
      <created by zg, POWCHK disabled, PULCHK disabled
       configuration hash MD5:
       00 E9 B6 7A A2 85 ED C7 34 08 36 98 17 FE 4E 26
       data hash MD5: 16K
       8E EA 66 4A C5 FA 55 10 29 55 4F 28 CB D6 C1 C3>)
$$ ##END=
$$ 
$$ hash MD5
$$ DA EE 18 C7 6E 0D 83 E5 F3 5F 77 B6 E2 AB 9A 0E
##$RELAX= 
##$RELAX= 
##$RELAX= 
##$RELAX= 
##$RELAX= 
##$RELAX= 
$$ Bruker specific parameters
$$ --------------------------
##$DU= <C:/Bruker/XWIN-NMR>
##$EXPNO= 1
##$NAME= <H-C>
##$PROCNO= 1
##$TYPE= <nmr>
##$USER= <yarkov2>
##$AMP= (0..31)
100 100 100 100 100 100 100 100 100 100 100 100 100 100 100 100 100 100 
100 100 100 100 100 100 100 100 100 100 100 100 100 100 
##$AQSEQ= 0
##$AQ_mod= 1
##$AUNM= <au_zg>
##$AUTOPOS= <>
##$BF1= 200.13
##$BF2= 200.13
##$BF3= 200.13
##$BF4= 200.13
##$BF5= 200.13
##$BF6= 200.13
##$BF7= 200.13
##$BF8= 200.13
##$BYTORDA= 1
##$CFDGTYP= 0
##$CFRGTYP= 5
##$CHEMSTR= <none>
##$CNST= (0..31)
1 1 145 1 1 1 1 1 1 1 1 1 1 1 1 1 1 1 1 1 1 1 1 1 1 1 1 1 1 1 1 1 
##$CPDPRG= <>
##$CPDPRG1= <>
##$CPDPRG2= <>
##$CPDPRG3= <>
##$CPDPRG4= <mlev>
##$CPDPRG5= <mlev>
##$CPDPRG6= <mlev>
##$CPDPRG7= <mlev>
##$CPDPRG8= <mlev>
##$CPDPRGB= <>
##$CPDPRGT= <>
##$D= (0..31)
0 0.7 0 0 0 0 0 0 0 0 0 0.03 0 0 0 0 0 0 0 0 0 0 0 0 0 0 0 0 0 0 0 0 
##$DATE= 1750242380
##$DBL= (0..7)
120 120 120 120 120 120 120 120 
##$DBP= (0..7)
150 150 150 150 150 150 150 150 
##$DBP07= 0
##$DBPNAM0= <>
##$DBPNAM1= <>
##$DBPNAM2= <>
##$DBPNAM3= <>
##$DBPNAM4= <>
##$DBPNAM5= <>
##$DBPNAM6= <>
##$DBPNAM7= <>
##$DBPOAL= (0..7)
0.5 0.5 0.5 0.5 0.5 0.5 0.5 0.5 
##$DBPOFFS= (0..7)
0 0 0 0 0 0 0 0 
##$DE= 6
##$DECBNUC= <off>
##$DECIM= 32
##$DECNUC= <off>
##$DECSTAT= 4
##$DIGMOD= 1
##$DIGTYP= 9
##$DL= (0..7)
0 120 120 120 120 120 120 120 
##$DP= (0..7)
150 150 150 150 150 150 150 150 
##$DP07= 0
##$DPNAME0= <>
##$DPNAME1= <>
##$DPNAME2= <>
##$DPNAME3= <>
##$DPNAME4= <>
##$DPNAME5= <>
##$DPNAME6= <>
##$DPNAME7= <>
##$DPOAL= (0..7)
0.5 0.5 0.5 0.5 0.5 0.5 0.5 0.5 
##$DPOFFS= (0..7)
0 0 0 0 0 0 0 0 
##$DQDMODE= 0
##$DR= 18
##$DS= 0
$$ [...]
##$SUBNAM2= <"">
##$SUBNAM3= <"">
##$SUBNAM4= <"">
##$SUBNAM5= <"">
##$SUBNAM6= <"">
##$SUBNAM7= <"">
##$SUBNAM8= <"">
##$SUBNAM9= <"">
##$SW= 18.0517328524113
##$SWIBOX= (0..15)
0 0 2 0 0 0 0 0 0 0 0 0 0 0 0 0 
##$SW_h= 3612.71676300578
##$TD= 16384
##$TD0= 1
##$TE= 0
##$TE2= 300
##$TE3= 300
##$TEG= 300
##$TL= (0..7)
0 120 120 120 120 120 120 120 
##$TP= (0..7)
150 150 150 150 150 150 150 150 
##$TP07= 0
##$TPNAME0= <>
##$TPNAME1= <>
##$TPNAME2= <>
##$TPNAME3= <>
##$TPNAME4= <>
##$TPNAME5= <>
##$TPNAME6= <>
##$TPNAME7= <>
##$TPOAL= (0..7)
0.5 0.5 0.5 0.5 0.5 0.5 0.5 0.5 
##$TPOFFS= (0..7)
0 0 0 0 0 0 0 0 
##$TUNHIN= 0
##$TUNHOUT= 0
##$TUNXOUT= 0
##$USERA1= <user>
##$USERA2= <user>
##$USERA3= <user>
##$USERA4= <user>
##$USERA5= <user>
##$V9= 5
##$VALIST= <valist>
##$VCLIST= <CCCCCCCCCCCCCCC>
##$VD= 0
##$VDLIST= <DDDDDDDDDDDDDDD>
##$VPLIST= <PPPPPPPPPPPPPPP>
##$VTLIST= <TTTTTTTTTTTTTTT>
##$WBST= 1024
##$WBSW= 4
##$XGAIN= (0..3)
0 0 0 0 
##$XL= 0
##$YL= 0
##$YMAX_a= 31449
##$YMIN_a= -24435
##$ZGOPTNS= <>
##$ZL1= 120
##$ZL2= 120
##$ZL3= 120
##$ZL4= 120
##$ABSF1= 10
##$ABSF2= 0
##$ABSG= 5
##$ABSL= 3
##$ALPHA= 0
##$AQORDER= 0
##$ASSFAC= 0
##$ASSFACI= 0
##$ASSFACX= 0
##$ASSWID= 0
##$AUNMP= <proc_1d>
##$AZFE= 0.1
##$AZFW= 0.1
##$BCFW= 1
##$BC_mod= 2
##$BYTORDP= 1
##$COROFFS= 0
##$CY= 83.5205535888672
##$DATMOD= 1
##$DC= 2
##$DFILT= <>
##$DTYPP= 0
##$F1P= 10.8118882576601
##$F2P= -7.23987719738617
##$FCOR= 0.5
##$FTSIZE= 0
##$FT_mod= 4
##$GAMMA= 1
##$GB= 0.15
##$INTBC= 1
##$INTSCL= 1
##$ISEN= 128
##$LB= 0.25
##$LEV0= 0
##$LPBIN= 0
##$MAXI= 10000
##$MC2= 0
##$MEAN= 0
##$ME_mod= 0
##$MI= 1.114404
##$NCOEF= 0
##$NC_proc= 0
##$NLEV= 6
##$NOISF1= 3.799351
##$NOISF2= 2.8
##$NSP= 1
##$NTH_PI= 0
##$NZP= 0
##$OFFSET= 14.38212
##$PC= 1
##$PHC0= -1717.525
##$PHC1= 7.966575
##$PH_mod= 1
##$PKNL= yes
##$PPARMOD= 0
##$PSCAL= 0
##$PSIGN= 0
##$REVERSE= no
##$SF= 200.129724274929
##$SI= 16384
##$SIGF1= 3
##$SIGF2= 2
##$SINO= 400
##$SIOLD= 16384
##$SREGLST= <1H.CDCl3>
##$SSB= 0
##$STSI= 0
##$STSR= 0
##$SW_p= 3205.1282051282
##$SYMM= 0
##$S_DEV= 0
##$TDeff= 0
##$TDoff= 0
##$TI= <>
##$TILT= no
##$TM1= 0
##$TM2= 0
##$TOPLEV= 0
##$USERP1= <user>
##$USERP2= <user>
##$USERP3= <user>
##$USERP4= <user>
##$USERP5= <user>
##$WDW= 1
##$XDIM= 8192
##$YMAX_p= 0
##$YMIN_p= 0
$$ End of Bruker specific parameters
$$ ---------------------------------
##NTUPLES= NMR FID
##VAR_NAME=  TIME,          FID/REAL,        FID/IMAG
##SYMBOL=    X,             R,               I
##VAR_TYPE=  INDEPENDENT,   DEPENDENT,       DEPENDENT
##VAR_FORM=  AFFN,          ASDF,            ASDF
##VAR_DIM=   8192,          8192,            8192
##UNITS=     SECONDS,       ARBITRARY UNITS, ARBITRARY UNITS
##FACTOR=    0.0002768,     1,               1
##FIRST=     0,             0,               0
##LAST=      2.2672688,     0,               0
##MIN=       0,             -24435,          0
##MAX=       2.2672688,     31449,           0
$$ Real data points
##PAGE= N=1
##DATA TABLE= (X++(R..R)), XYDATA
$$ [...]
705F70J496p19j958j044O21J301J072o53j867p95J166J702P60o07j593j109R33
722f24J554K04j048j268m31J094J839L57j352j362o0J052J424P6j568j681J35
739a659J452J340J49j295j316J58J519J179k44j286j132J25J355R57o64j445p55
756a562N43J515R83n81j507p21R13J413O64r00j660p33R73J464N04q84j402n45
774a523J069J442L94j021j242k69J002J271K4j255j091R6J202J176j11j345j246
791a427J67J419J134k75j326j041L77J382J048l64j295j043M06J303P37n69j366
808g33o63P36J253O03p07j241m55R88J356L48r81j447m33R35J297K17j013j233
826a173j26J128J236K22r89j221q0J014J040k9j139r23J60J106Q18l31j181q21
$$ plain form
705 670 2166 1447 -511 -1555 -934 367 1439 786 -1081 -1876 -710 992 1752 1145 -448 -1557 -624
722 -624 930 1134 86 -1182 -1613 -519 1320 1677 325 -1037 -1097 -45 1379 1455 -113 -1794 -1659
739 -1659 -207 1133 1282 -13 -1329 -1171 348 1527 1283 -3 -1135 -1010 345 1302 638 -807 -1562
756 -1562 -1019 496 1479 898 -609 -1330 -417 996 1660 760 -900 -1633 -660 804 1308 424 -978 -1523
774 -1523 -454 988 1382 361 -881 -1150 -148 1123 1147 -108 -1199 -1103 99 1275 1164 -181 -1427
791 -1427 -1260 159 1293 1018 -308 -1349 -972 410 1458 1094 -201 -1244 -838 465 1202 633 -733
808 -733 -1396 -660 593 1196 489 -752 -1207 -219 1137 1485 504 -943 -1376 -441 856 1073 60 -1173
826 -1173 -1299 -171 1065 1287 298 -923 -1003 11 1051 1022 -117 -1040 -880 226 1044 713 -468 -1289
844a289L42J336Q99l64j251p91L62J241Q05n39j231p67N69J258N65o62j242m95
862a254P00J221M40o34j147l05Q60J090K31j068j095k31J011J146M2r92j091q2
880a158J110J097j1r73r59N6J083R36k59j128r40K46J114P51l65j030p25M98J222
899E65O40o11j065n65N71J197O12p78j262n23N66J096N07o37j101k50Q97J032
917H91K48q20j108k06R11R72N6r46q87m4R27R67j47j010q40J41J065R97j14j125
937g2r05L64Q13P02k02j149p38N26J026N46l60r38o09N50J153M05p30r52m70M58
957e82J159M65p36j076j39O99R48L61p20j135k55Q61Q81J08o86r97l3R08Q81j52
977G60r67o58j9R90R20k24j038n34J99P94P31k07j194p34N25R30N30k40r46o70
$$ plain form
844 -1289 -947 389 1288 924 -327 -1118 -756 485 1290 751 -480 -1247 -678 580 1145 483 -759 -1254
862 -1254 -554 667 1107 473 -674 -979 -119 971 1202 134 -961 -1192 -181 965 1007 15 -1076 -1158
880 -1158 -48 1049 1038 65 -894 -838 245 1181 922 -206 -1146 -900 214 965 600 -430 -1155 -657 565
899 565 1205 594 -471 -1036 -465 732 1344 566 -696 -1219 -653 443 950 313 -788 -1038 -141 891
917 891 1139 319 -789 -995 -84 888 944 -2 -889 -933 -6 961 814 -196 -1036 -895 170 1167 1053 -72
937 -72 -977 -613 200 902 700 -449 -1187 -661 365 911 551 -387 -996 -446 707 1112 382 -570 -1040 -582
957 -582 577 1042 306 -770 -909 -210 738 1099 379 -756 -1011 -150 731 839 153 -844 -877 31 912 760
977 760 -207 -865 -884 106 1026 802 -236 -770 -571 223 954 747 -447 -1181 -656 274 804 564 -382 -1052
997a052N74J091L17n14p14n53M74J120J79q22q54j93M21J046L97p98r53R6Q13
1016G5P83K47p70j060q4R57N23j70o23p96j52J005R80l41p25l97J17P82Q53l75
1036H29j205n21L46O67N15j40j131m54O58R32K90k38p97o42N68J113J70p21o29
1055c90m16L77J089K21j004o47lN90P09M03p64r45J90Q42N65K6n91j021j35J064
1075A60M32l51n62o07R5J040P25l74p51k36J66N96O35l36j114m18N02N50L50k16
1095B86q67m85Q05R48J03l67n61m77N20R52m8q99n42k39L82Q55L45q42o15L46
1115d00N87N29J61p38q96J66Q68K69j57o02o68J04R48N66m15o07l33J05Q01P39
1135A027n10q99j56L67M88M67l59j048k73O65N54O2j37o41m62Q17Q04k4m75m99
$$ plain form
997 -1052 -478 613 930 416 -298 -851 -377 743 922 100 -754 -947 -526 520 917 119 -834 -738 75
1016 75 858 1105 335 -725 -809 148 671 501 -122 -918 -1070 -65 915 574 -151 -548 -431 351 1204 829
1036 829 -376 -897 -551 116 631 491 -640 -1094 -436 496 786 548 -249 -891 -323 790 960 239 -390
1055 -390 -806 -429 660 881 -123 -770 -773 -183 526 929 165 -780 -590 252 817 843 252 -769 -904 160
1075 160 592 241 -321 -928 -833 207 932 558 -193 -429 -263 333 968 632 -482 -900 -398 152 502 286
1095 286 -581 -1066 -261 687 790 423 -138 -615 -95 857 809 -90 -632 -871 -489 366 711 -131 -746 -400
1115 -400 187 716 877 139 -757 -591 277 546 389 -213 -881 -777 171 737 322 -285 -618 -513 288 1027
1135 1027 517 -382 -538 -171 317 784 425 -623 -896 -231 323 385 248 -393 -855 -38 766 742 267 -232
1155b32l66M23Q88n8r46n17O8M93O99J18p34n25L72O32M43Oo49p78R1Q48K62l83
1177A55n02m68J52R29N84m79o64j02J99O48M79n09r05k06M82M69K31k85p72k39
1197h03P09O34L1l78n26k61N76O71p4o03n03m4M12O96J4p41m94K81N33M63Pp24
1219a24n79L12O56K95j14n63n28J62Q61K97m53n85l39K01P28M49l68o45q3L93
1239b7M98K29m95p66j69M77O21O4l71n60j08O15O90q1n60n29n6M55N90o5o54l97
1261e99M0N84N35p2o20m41K66N38L43j69n88m22K47O81K23k63n91k35K07O45L11
1282F20l95o17j24L51N69J97m18o89j04M47M94K25m46n53nM71M97kn81n66O7M89
1304g3N75j8m95m50J08N38L87j62n86m51J85N71L87k11n42l14K82N84K71k54n30
$$ plain form
1155 -232 -598 -175 713 655 -291 -808 -740 -247 452 570 -164 -689 -317 315 758 764 115 -663 -572 276 538 155
1177 155 -347 -815 -663 266 850 371 -293 -395 -196 452 931 422 -483 -689 -207 262 493 208 -564 -803
1197 -803 -94 540 571 193 -333 -594 -18 653 579 -24 -527 -571 -159 537 551 -190 -684 -403 130 593 600 -124
1219 -124 -703 -391 265 560 446 -117 -645 -483 378 675 222 -363 -702 -501 227 676 308 -337 -420 -27
1239 -27 471 700 205 -561 -730 -253 368 432 61 -499 -607 8 698 617 57 -472 -528 -73 517 452 -202 -599
1261 -599 -559 25 560 488 -132 -573 -307 231 574 405 -183 -605 -358 323 546 283 -308 -543 -336 309 620
1282 620 225 -392 -516 -165 404 601 183 -506 -610 -163 331 556 110 -443 -448 23 520 518 -63 -629 -562 -73
1304 -73 502 484 -11 -461 -353 185 572 410 -176 -627 -442 129 516 305 -237 -551 -269 315 586 332 -198
1325a98l84L06N63J38k39n51k40M20O09J36l99n04j97L22O02O0l95l98lM09M67
1346E24Lm66n21l9M06M61k6m16l85R5M64M40j29n13m22K22M35M29j30n53l57J78
1368c00M62L04k29n70k35L08M90K64k50n28k05M19N23Q8l44n79j84M02M31P7l44
1389@m62J1M83M80ql80m59j7M10L44j1m23m07P0M49M53j87n05l40L1N28L53o9
1412C44m90k33J89M30K89k41n98k53L00L99K68k62m36j82L05M76R7k80m18j21
1432d17L42N20J4l93m26m8L20M58Ll45m23J6L87L17Q5m36m42J28N14L03j02m06
1454c1l37J1N37J73j33m40k34J25M47L27k04n36j54K28M41K46j68m20j93K85M01
1475C71N0k72m90j97L83N18j7l57l20o5L14N09L5l87l23j4L75L14N9n05n09Q1
$$ plain form
1325 -198 -582 -276 287 425 186 -365 -605 -185 424 560 161 -343 -540 -218 384 444 49 -349 -352 57 524
1346 524 527 61 -460 -499 -93 368 342 -74 -459 -364 100 540 411 -102 -524 -302 133 562 432 -121 -478 -300
1368 -300 162 466 237 -333 -568 -260 230 494 244 -284 -489 -70 453 541 197 -382 -566 -164 267 344 0
1389 0 -462 -451 32 512 504 124 -335 -352 58 402 391 -32 -439 -369 80 533 346 -159 -499 -468 60 413 344
1412 344 -146 -379 -190 240 529 288 -310 -563 -263 136 404 142 -294 -476 -171 305 402 122 -296 -417
1432 -417 -75 445 459 66 -360 -408 -88 370 373 28 -395 -379 8 325 410 -26 -468 -340 174 477 375 -31
1454 -31 -368 -357 180 353 220 -220 -454 -329 118 445 241 -295 -449 -221 220 466 298 -122 -315 -30 371
1475 371 421 149 -341 -538 -155 363 346 -11 -331 -396 -82 427 462 75 -248 -262 113 427 486 -19 -528 -447
1497d47M26K32n2k81l20J44N19K43k72k70k15Q9M70L05l46m39j98J23L06L50k10
1518A57n65j42M80L46J17o8l93k25L66L39j11k65l32k14K73M78K5m02j71R6K33
1539B2M82Kn03m60J79L51J79K8l11m20O7N84R8j24k42l53N8N63L27l50k97j07
1561b27Q0K69K76l06n60L3L08K45L39j92n17n7L76L24l6k54l96k02L72N21j88
1582B08l05j38o6K30M13k6m22k00J75J38L88o0m11m01K05L85J12p5l89l99L20
1603c18O38J14j93j62k01NL29J92l93k67j90K20L05K83k98m04R0L77J91P3j67
1624B24m64r6M29K57j61j71k65k33L80M25j18l17k19N3K72M74j05m46j94K03J50
1645G8J00k6l46l35L67L91L5Kk90l76J35N77J14l69l17m6J32L83K37l75l19Q3
$$ plain form
1497 -447 -21 211 159 -122 -442 -298 221 464 192 -78 -293 -204 266 571 225 -214 -412 -289 17 367 157
1518 157 -408 -550 -70 276 393 325 -68 -293 73 412 301 36 -296 -510 -237 241 266 -136 -307 -211 22
1539 22 504 506 3 -457 -278 73 252 280 -31 -451 -384 200 298 174 -68 -421 -363 200 527 177 -120 -227
1561 -227 -147 122 398 92 -468 -435 -127 118 457 265 -252 -309 67 391 355 101 -295 -497 -125 396 208
1582 208 -97 -235 -301 -71 342 316 -106 -306 -131 7 395 335 -76 -477 -272 113 225 150 -239 -638 -318
1603 -318 320 434 241 79 -122 -117 212 404 11 -256 -446 -226 79 362 64 -340 -250 127 318 391 224
1624 224 -240 -336 93 350 189 18 -247 -480 -100 325 207 -110 -329 -276 -4 470 365 -81 -275 -72 78
1645 78 178 152 -194 -529 -162 229 264 266 -24 -400 -265 312 426 57 -260 -306 -174 209 446 71 -248 -165
1667a65J02J65J16q6m59L4L33J90j3k29l46m0L99L74j28l29j38n4L37L18j01l27
1689d7j38O6P8K90Km35k44K32K75J74m1l06j59L66L14n0l38k05k36J81M16P0k82
1712a7k57l3J52L32K48k80m00J12K80J47k9k56l45K6K83J70o9j93j13n6L95K93
1734C90j40l37j83J19L01L02j91n20j42J69K28J07Nk41j89K79K93J81k23k56k33
1755b81K04K47N3k78k36l5K67K85j0l21k83J26K93K22J48j52m57k6J22K40M4k65
1777i3k58k2M44K11j70j82r9O6L72J56k07k59j92J04K00J79k27l08j84K50L85
1798A66J87p2l24j08J90J47L1j89k27k3N5L22m1j98j88n7K85L25R0l31k44R4K77
1821A67K11j55l57k40Q4K71J32j0j66j62l5K66K15L5k28j98J25K83P6k80l64j06
$$ plain form
1667 -165 -63 102 218 132 -327 -293 40 230 217 -12 -358 -398 1 375 247 -82 -220 -274 63 381 280 -47
1689 -47 -185 -119 -41 249 251 -184 -428 -196 79 253 212 -94 -253 113 427 377 39 -166 -402 -221 195 265 -17
1712 -17 -274 -307 -155 177 425 145 -255 -143 137 284 255 -1 -346 -320 -37 133 64 -129 -242 -298 97 390
1734 390 250 -87 -270 -151 150 452 261 -259 -401 -232 -4 103 108 -133 -322 -43 250 431 208 -48 -281
1755 -281 -77 170 223 -55 -291 -326 -59 226 216 -105 -388 -262 31 253 401 249 -208 -234 -112 128 172 -93
1777 -93 -351 -373 71 282 112 -70 -169 -103 269 425 218 -41 -233 -129 71 250 23 -285 -469 -219 166
1798 166 353 281 -43 -151 39 186 217 28 -199 -222 -167 155 114 -84 -272 -329 -44 281 371 40 -204 -110 167
1821 167 378 223 -134 -374 -290 -19 113 103 -63 -225 -260 6 221 256 28 -170 -45 238 314 34 -330 -436
1843d36K28K92P2j46j54o3K01J99J11j36l21j82J68M17k7j52k60j20K46J37p0
1864Dj75o3J48K71J37l1k20k09k8K35J34l4l16k25N6L77K69j52k13j26Q7K55Q3
1887B64j45k10j09M3J57J63j15j96j42K71J72Q8k98k99K4K90L81r9p9k24q1J28
1909a6J58rj83k00m4K94K49O9k78k28K7K58P5r1k95m8K33K01J07n1k39k32Q5J31
1933b7K27j17k98r4J11L29K06j88k50r1J43J69K0j53j68K9J83J08K3j25k28o7
1955b58J97K09M5k62k17J04K84K80m0l05j73NP1J40J2k98j7M7J82K32M6k91k27
1978b34J46L21j4k08k20k8J92K18K4j67j79n7OK01J69n1k55l0J66K23O2j64k84
2001a63p6K41L4p3j25jkK50J72j05j26j68m7J62K94q8k62k02J16K43J75r2l17
$$ plain form
1843 -436 -208 84 156 10 -144 -207 -6 193 304 168 -153 -335 -167 250 223 71 -189 -309 -63 74 4
1864 4 -171 -234 -86 185 322 291 71 -138 -166 69 203 169 -147 -372 -316 61 330 178 -35 -161 -74 181 264
1887 264 119 -91 -200 -157 0 163 48 -148 -290 -19 153 241 -57 -356 -332 -42 339 240 161 -63 -144 -16
1909 -16 142 133 -50 -250 -294 0 249 318 40 -188 -161 97 172 81 -214 -262 -29 172 279 228 -11 -243 -158 -27
1933 -27 200 83 -215 -309 -198 131 337 149 -101 -192 -49 120 140 -13 -181 -152 31 139 162 37 -191 -258
1955 -258 -61 148 193 -69 -286 -182 102 382 342 37 -136 -131 -60 80 92 -206 -223 -176 6 238 284 -7 -234
1978 -234 -88 233 219 11 -209 -237 -45 173 197 30 -149 -206 -200 1 170 119 -136 -166 0 223 285 121 -163
2001 -163 -239 2 36 -37 -162 -163 -165 85 257 152 26 -142 -189 -27 267 179 -83 -285 -169 74 249 157 -160
2024a60j33K04J98k9J7r0r0QK42J7j71j44j38J44K59P0k31j49J9K01K55Jk61k52
2048b13N6J45J8R9n0k73m9K41K74j27j07j63l9K48K13j70k56K3J8R8J93o3k70
2071a54q2J29J24J70P3l00j39J53K59l6j69j20j58J01L00k4k03p3N2N5K20L2j89
2094B1j28J8J49O5J55k28l34P1K52Q8q8o8j44QJ97J56j10j26Qq4J18K70j59k53
2118a46o2Q5J53J32p7k61m7K37J12j9k5j37j49J27K22L9j47j19j47R9K75Q7l11
2141g9o7O1J04J93J1k57j96J06J08M1N4o0k57J21K31J24j35p8k15JK38J71j45
2164G5j58j9K9J11J29p3j76lQ3Q6Q7k0k03j98K28K03j14q7r4r5K31K13l7k75%
2189g7m1P6K09J0j67j34j7J09O8J11k41k31J67J86J73l0j17k29J56J45P6j59q1
$$ plain form
2024 -160 -293 -89 109 80 97 7 -83 -75 167 184 13 -131 -269 -125 134 204 -27 -176 -157 44 299 300 39 -213
2048 -213 -157 -12 6 105 55 -218 -267 -26 248 121 14 -149 -188 60 273 103 -153 -130 -112 -14 179 116 -154
2071 -154 -236 -107 17 187 260 -40 -179 -26 233 197 28 -92 -250 -149 151 127 -76 -149 -97 -42 178 210 21
2094 21 -107 -89 60 125 280 52 -282 -211 41 129 41 -27 -171 -163 34 190 80 -46 -38 -122 -4 266 107 -146
2118 -146 -208 -123 30 162 85 -176 -223 14 126 107 82 -55 -204 -77 145 184 37 -82 -229 -130 145 232 -79
2141 -79 -146 -85 19 212 223 -34 -230 -124 -16 25 79 19 -238 -117 114 238 103 25 -190 -189 49 220 75
2164 75 -83 -102 -73 38 167 94 -82 -85 -2 84 171 151 -52 -250 -22 181 67 -20 -114 -209 22 235 198 -77 -77
2189 -77 -118 -42 167 177 10 -124 -141 -32 36 147 -94 -325 -158 28 201 171 54 -175 -19 126 202 43 -38
2212c8p3r2K94J11j47k04mQ0J44J51j01k28l6J92Q8q2k2j45p4J95R0m6j03l9j48
2237b37J84K43n4j60j16Q5O3J45o1k27j03N4J66O2Q3j16j03O2J51k4m2r8j52J36
2261e9K19Q6j67j33p3J3J13J40j14j66QJ19J02M9m1k17m8J39J35Lj27j59n7K12
2285b3J73l5j60om7J31R5K0j16j74N6M5J54j8j90j51J38J91j8n9j20p9J49J55
2309A11Q7j00n8j61M0Q2R0j12j56J8R7J47J09j01j77K8M1J16p4o6j06M5J42Q8
2333A30Rj23j50m1J91R2K3j55p0L5J47L2n6r2j14K8J56Q8o8k09L1K6J83Q4r1j61
2359g5o0P5J85m2m6j53NJ06J59K0j46r5j0K0Q2k1lp0KR2J48o3p4j91pJ21J11K0
2387I0j67r1J05J79Q4j13j71q0LJ90O7j1j44j7l9K06np2j08n2N8J73Rr1j19l0
$$ plain form
2212 -38 -111 -203 91 202 55 -149 -153 -73 71 222 121 -107 -143 49 137 55 33 -112 -186 9 99 53 -50 -89 -237
2237 -237 -53 190 136 -24 -140 -55 8 153 92 -135 -238 -184 -18 44 127 11 -92 -30 121 97 55 -43 -195 -59
2261 -59 160 246 79 -54 -127 -114 -1 139 25 -141 -133 -14 88 137 96 -121 -169 -30 105 108 -19 -178 -235 -23
2285 -23 150 115 -45 -51 -98 33 128 148 32 -142 -86 -41 113 95 -95 -246 -108 83 65 6 -114 -193 -44 111
2309 111 198 98 40 -121 -81 1 91 -21 -177 -159 -62 85 194 93 -84 -56 -15 101 27 -39 -145 -100 42 130
2333 130 139 16 -134 -175 16 108 131 -24 -94 -59 88 120 64 -28 -142 -114 42 130 62 -147 -116 -90 93 177 86 -75
2359 -75 -135 -60 125 83 37 -116 -111 -5 154 174 28 -67 -77 -57 25 4 1 -69 -67 25 173 110 36 -155 -162 -41 70 90
2387 90 -77 -168 -63 116 200 87 -84 -164 -161 29 96 85 -59 -76 -115 91 86 14 -94 -146 -88 85 94 3 -116 -146
2413a46J08J33O1j30j46k6J66J06Oj36j04l1J16J04L7j40q4M4Q5O4N9j86n1L9
2437e2R9J3j6j09n5K4J54P5r8j54NM1J05J21r7j13k4K5J64l7n2p5p6O4J00M0j03
2464c1m7J9J16N6nr7j27KJ01J21K3j54j31M1O5J44op4p3m9J70L4m9n9n3n6J59
2491D0O1j04j45N9P5OJ58q5j59OJ13J05j5n1j13j09J03Q5O1o8q0%M1J28m7j32
2517f7M5o8P9R2J6j12j01N2J12O8q2o3r9L9J48O2l4m2p1r2J84N4j24j06K4K2J04
2544D0ln7p6jJ17jM6q8m3n4J71K7k4nj15p4J68J20q6p6j4k0nJ68k0r5l5N6j8R7
2574A00l9j26r9J02J13Q0p1p6j28lK29Qo6mj36Q5J48l0r1j14K1P3M6M4M3j89J05
2601B5L1MJ6l1j63n7K36R5j15q2Ko3N7J32q3r6K9m7P7J57k5j30j5L2N7pJ0o1j26
$$ plain form
2413 -146 -38 95 156 26 -120 -146 20 126 132 -4 -108 -139 -23 81 118 -22 -106 -62 23 87 146 -40 -91 -52
2437 -52 47 60 44 -65 -120 -96 58 133 35 -119 -114 -73 32 153 56 -57 -81 -56 108 71 19 -56 -132 -68 32 72 -31
2464 -31 -78 -59 57 113 108 11 -116 -114 -13 108 131 -23 -154 -113 -48 96 90 16 -57 -106 64 98 49 -10 -63 -119 40
2491 40 101 -3 -148 -89 -14 -8 150 65 -94 -88 25 130 115 64 -49 -158 -55 30 91 23 -57 -57 -16 112 65 -67
2517 -67 -22 -90 -11 81 97 -15 -116 -64 48 116 34 -29 -128 -89 59 121 87 45 -26 -118 66 120 -4 -110 -86 -64 40
2544 40 37 -20 -96 -97 20 19 65 -23 -66 -120 51 78 54 49 -66 -140 28 148 62 -14 -28 -48 -53 115 95 0 -35 21 3 100
2574 100 61 -65 -164 -62 51 131 60 -16 -144 -147 82 90 24 20 -116 -31 117 87 -4 -118 -97 -24 22 66 109 -80 25
2601 25 56 60 76 45 -118 -175 61 156 41 -41 -39 -102 -45 87 4 -92 -63 -110 -33 124 99 -31 -46 -14 43 36 46 -15 -141
2630a41J22R0lo2j5m2j2K36j1j47p3l2j8J79M4j19q0L9K8LJ08l8r3k2K4J35k0
2657H0J0j11n5J70J8j30n0rl3M6J89l2j52L7mK2Q4K5j24o2R2PJ3O1j02q0K7J33
2685G0o6K1p6RK5J45j3j02q3O1o1J00Q0j08j03j5J47j1N6l9q8k5J05L6m1k3j49
2712a48O1Q4L9k1j39L7K7M5J13l0j31j0P7R9j4K2j70o4J07N6L9o1l1n4L9J20j
2739I1j03Pr2J06N8m2l5r2J3P4R4j5j01j18L1J61%Q9o4q8p6J21M6Lp4l3j4P6P2
2768I5p3p3K0O6pJ06l5j78J0N2K7N7n8j9p7L2J00K1p7j8r8J76O6k9j27j4m0J3
2796h2J04O9j06j15N9J25M0k5l1j71N0J14K8Oq6l0k4J61k9K5j30m7lJ07J59j36
2822C2n9J3L4M3Jr0n5o6P5Q6R5p6j31J4M5J22j7r8k7K2nQ5L0p6j12nQ9J45m3j09
$$ plain form
2630 -141 -19 71 68 6 -9 -51 -63 173 162 15 -58 -90 -108 71 115 -4 -84 -45 -17 -14 94 56 -37 -59 -35 100 80
2657 80 90 -21 -76 94 112 -18 -68 -77 -110 -64 125 93 -59 -22 -26 -4 80 105 -19 -81 11 18 31 92 -10 -90 -63 70
2685 70 4 25 -51 -42 -17 128 115 13 -70 -9 -70 30 110 2 -101 -116 31 20 76 37 -51 -76 29 65 24 1 -148
2712 -148 -87 -3 36 15 -124 -87 -60 -15 98 68 -63 -73 4 103 89 111 -59 -123 -16 40 79 18 -13 -67 -28 92 91
2739 91 -12 -5 -97 9 67 25 -10 -102 -89 -15 79 64 -37 -155 -124 37 37 126 62 -26 -102 19 65 68 -6 -39 -53 23 95
2768 95 22 -51 -31 35 28 134 99 -79 -69 -17 10 67 9 -10 -87 -55 45 66 -11 -29 -127 49 115 86 -41 -55 -95 -82
2796 -82 22 91 -15 -130 -71 54 94 69 38 -133 -83 31 59 65 -21 -51 -75 86 57 82 -48 -95 -98 9 168 32
2822 32 -27 -14 20 63 64 -26 -81 -147 -72 14 109 33 -98 -84 -39 83 66 -32 -59 -37 -42 43 73 -3 -115 -120 -31 114 71 -38
2852c8lJO1N2j7j36J7L0O7J7p7k4Jo0J68K6n2r2K6L2QP1m2j15OJ2P9L1J6j23L
2883e5O5N6k8n5p5M9k5J70j6n2j11L0J2J7Q4j11m2kJ20O8j7q4l4k3J10P6q9r3
2911e5l6L4R6M3j9m2l2p3J36k9L0j30o3J34R3K8j09l7l2K6K7R9j03m8M5P3LJ5
2939G4j07m7K3O3R6Or8n6N3jM6L6r0n7L1O4M7q4n1M7m4J12Mk8o1k4L0O3nm2ql8
2971d6NJ04Qm7n6j2L2M8Q2q2o9k9O1J19r6J7o5l2J25L8n1m7n6K5J0P4J8o3p5m
3001f4J40o2L2j07m2Q9LM0J5m7j28R6O4L0n5p8M2m0J43K6r7j00N3pP2K7Jj02m1
3030i7J88p8J03j33m9oP7O2k6k5p5L2L9O2p2M4l7m2O4J0j0j00k5M2P4pJ3l2r8
3059a02N8M1L5Qn6p6L5J44l9o9J3j7k8N7Q6j21p8Q8j0L4O0m2n9j2K6K6J9l3n3
$$ plain form
2852 -38 -41 -40 21 73 56 -80 -63 -33 34 51 -26 -50 -49 -109 59 85 33 -59 -33 -1 7 78 36 -79 -73 -61 18 49 65 -58 -55
2883 -55 10 66 38 -17 -92 -43 -68 102 86 34 -77 -47 -35 -18 66 -45 -87 -89 31 99 82 -2 -36 -59 51 127 38 -55
2911 -55 -91 -57 39 82 63 21 -11 -84 52 23 53 -77 -140 -6 87 115 6 -31 -63 -37 -10 89 -14 -62 -17 56 59 74
2939 74 -33 -80 -57 6 102 108 10 -46 7 6 52 88 -2 -59 -28 36 83 -1 -52 -5 -49 63 67 39 -22 -46 -16 47 42 0 -8 -46
2971 -46 -41 63 71 24 -32 -44 -12 36 118 36 -33 -62 -1 118 22 39 -26 -58 67 105 54 7 -49 -24 -14 60 78 15 -60 -64
3001 -64 76 14 46 -61 -103 -14 -11 29 44 -3 -131 -35 29 59 4 -74 -32 -72 71 97 0 -100 -47 -54 18 45 46 -56 -97
3030 -97 91 13 116 -17 -66 -72 5 67 41 16 -59 -27 12 74 2 46 9 -33 31 41 31 -69 -94 -52 22 15 28 -4 -102
3059 -102 -44 -3 32 40 -16 -92 -57 87 48 -21 -8 -25 -53 4 90 -31 -109 -21 -31 3 63 21 -38 -50 -24 2 21 -12 -65
3088f5K8N8J14j13l0l8lP0O0m5p2k2L8L9J7Pp8j36J03P1NJ2n8n5J10Q2o8jl8J2
3118Dj8P9L4j35j2N4kJ8N6l4j52J23M6p9P4m3r4RJ41j0l7l9o0L2Q5Q7r3o2PM8
3148B7k4O7J2j57K0O%K2P8r8n4J26N1J9j32K0m8Q6O3l4m0n0j7L1M4P2j29mK8l
3178a8Q8k5pp3L5N4p0N1k2p8%J09n0RnL1r4L0P7kj29M9J8K8Q6j4p9p6R3k9L7j
3210B3Lq3J4J13j7q1M1j10J39N1o1q2J9j6N7M0K2q3n0K9O5p1M4k3j10K1J27N6
3238G7l6Qr0m2J83J8o9m6j9n6P2J39j11m5k2L5M8N8n5p3k4P5k2KJ4J9j16Q5L6
3267D3j33N6l5K9O8OK0p2L3q8J13j3M0j6j07N6O9Op9j1K4r2J53rl2K1o5L1J07
3296A23n9j3r4OK2J9Q3r9o4QK1P3NK6p8m3P8P6o3l3m5QM4N8j5q5kM4k6J04rj03
$$ plain form
3088 -65 -37 21 135 22 -8 -46 -49 21 81 36 -36 -58 -20 19 36 43 -35 -171 -68 3 8 20 -38 -93 17 99 31 30 -8 4
3118 4 -14 65 99 -36 -48 6 4 22 78 44 -108 15 61 -18 56 13 -81 -72 69 59 22 -17 -77 -45 40 127 34 -28 -21 27
3148 27 3 70 82 -75 -55 -49 -49 -27 51 -47 -101 25 76 95 -37 -17 -65 21 84 50 10 -40 -57 -26 18 90 -39 -43 -15 -18
3178 -18 70 45 38 -35 0 54 -16 35 13 -65 -65 44 -6 3 -2 29 -65 -35 42 40 -89 -40 -22 6 92 78 -1 -77 16 -13 24 23
3210 23 26 -57 -43 70 53 -28 13 -97 42 93 32 -50 -31 -47 10 50 72 -11 -61 -32 33 -38 6 -17 -127 -106 21 77
3238 77 41 49 -41 -83 100 118 49 3 -16 -72 0 139 28 -17 -39 -4 44 102 47 -26 -50 25 3 5 19 38 -78 7 43
3267 43 -90 -34 -69 -40 28 34 54 -18 15 -73 40 27 67 51 -56 0 69 75 -4 -15 9 -83 70 61 29 50 -15 16 123
3296 123 64 51 -43 -37 -15 4 87 -12 -76 -68 -47 26 31 57 -21 -64 14 90 27 -6 -51 -43 1 59 44 -41 -43 1 -25 79 70 -33
3328c3k6R6nnM8p0q3J4J08l7L2k8r8R6MPk4l5N5m3P0j4Mr6L9J9P3k7j2m8lJ6K2
3361A6O9q2p9j1J32j6kj5l0q0J18N4j2k8j14Q1L6lQj27M3K5Q4j2K5j07mk6Q9K6
3391E8o6k5n9L8M4M1o3K2k3OR7K8k3j11L8k9O7p7K9rlQ1j9k5m1m6O3M3pro1O9
3423B8k9J3P0n0j6k4LkN2k5l1o4K0K3O6ro6QM1K3K6m1pn9N8KoOo1J1N0M5l8n4
3457c7J6N6k0O5o0K2q8K9N3k6qk8k1N2RO7Jp8L4p1K5N9l9n7QQO2k0K3r4l7Q2L3
3490B0J7J4k2p2Q9k5Rp0PM2m6Q3m0L9r8R4j5j6K5j6p4M8K3qj3m1L3n2L6J41o9
3521D3No5k6M6K5o0l7k0M5J0J8K8l8M5L0J2J5p5Kj06J45L2n7l2Lk2j0J08Nm9p0
3552e0J13o2N5M6j01l7N7l9%O2o9r3Q0M6J9k7mjj2nM4j0Jo7M9l8J14r2Nr0J22
$$ plain form
3328 -33 -59 37 32 27 75 5 -78 -64 44 7 39 11 -87 9 13 20 -4 -39 16 -27 43 29 33 -63 -24 -5 68 41 29 -19 -22 -6 16
3361 16 85 3 -76 -87 45 29 27 12 -18 -98 20 74 62 34 -80 1 37 34 42 -85 -42 -17 67 55 80 -27 -31 -57 32 58
3391 58 -8 -33 -92 -54 -10 31 -32 -10 -33 -27 70 98 75 -36 2 -27 40 -37 -8 -17 -20 61 42 17 -24 -70 -7 36 29 20 -41 28
3423 28 -1 12 82 32 16 -8 -5 -7 45 20 -11 -75 -55 -32 34 25 -41 -33 8 31 57 16 9 -50 8 10 4 10 -51 -40 10 55 17 -37
3457 -37 -21 35 15 80 20 42 -46 -17 36 10 2 -26 -47 5 14 81 82 4 38 -33 -8 51 12 -45 -37 -29 33 13 36 -58 -95 -13 20
3490 20 37 51 29 -43 46 21 30 -40 -33 9 -37 46 6 45 -53 41 26 10 35 19 -55 -7 16 8 -5 -46 -13 -65 -29 112 43
3521 43 48 -17 -43 3 28 -32 -69 -89 -44 -34 -16 12 -26 19 49 61 76 1 3 -103 42 74 17 -15 -12 -34 -44 64 69 20 -50
3552 -50 63 1 56 102 1 -36 21 -18 -18 44 -25 -118 -38 8 27 0 -4 -5 -17 -22 22 12 13 -54 -5 -43 71 -21 -16 -106 16
3583A6lJ8J9o0qN5lJ2n4O6j06N3j1OK9q3K6K4N9no6%K2Rk0K8n2j7kK9L1J3k3j00
3617i8M0J11or1Q7m4l1j4P0ko9O3J1l3Q8p1l7k6P9J1j8op0qJ33j5On3J0J2m6J48
3649A31j11o0N1j7n5N8J5o3N7K2p0L2k4M4r8P8K7K4k8o3KL1M0k5l5lK6j5k3R7
3679D5k1p2M6J7K3L3m2Kp1P3K4r6L4j9N4m8P6j1o2L4m0PP2k9l3j4n3J9P2L4j04
3710e0oM5Q2o2M5Rq1j1L2K6n2nL0o3N9L5q5J1L6OK1N4l9p7M4P7q7k5K2k6j22J34
3742b3N4ln9K3p1O5J07j26OK9m9LJ13p4Ok1J4k1N4k4j4OJ0J7Kmk3PK5J3k7Kk2
3775eo2K4J2P3Pn0K1q7Q6Om6m3K8l7J30o8NPl5K1JJ1L6l4n0P1M9lq7J1%MN5m5
3809Fq0L1P7n6M8PRr5L6M6m7m6L8l7K4N3k7kk2M7k0JP0j7o0M2o0%Q5m4n6J2K0
$$ plain form
3583 16 13 31 50 -10 -18 37 34 46 -8 58 -48 5 -6 0 29 -54 -28 -4 55 50 -16 -16 6 15 -5 23 -29 -46 -48 -19 12 25 2 -98
3617 -98 -58 53 47 -44 43 -1 -32 -46 24 22 -47 16 27 -6 82 11 -26 -52 27 38 20 14 -56 -64 69 54 60 7 17 29 -17 131
3649 131 20 -40 11 -6 -61 -3 12 -51 6 28 -42 -10 -34 10 -88 -10 17 41 13 -50 -48 -17 23 -2 -37 -40 -14 -29 -52 45
3679 45 24 -48 -2 15 38 71 29 31 -40 33 57 -39 -5 -24 30 -18 58 47 -15 19 -21 -14 58 29 -4 -18 -71 -52 20 54 -50
3710 -50 -56 -11 71 9 54 63 -18 -29 3 29 -23 -28 2 -61 -2 33 -52 -41 -5 1 22 76 37 -40 4 81 -6 -31 -9 -35 -157 -23
3742 -23 31 28 -31 -8 -79 -14 93 -33 -27 2 -47 -44 69 -5 1 -20 -6 -27 27 3 -11 -5 5 22 24 20 -3 4 29 42 15 17 -5
3775 -5 -67 -43 -31 42 49 -1 20 -67 19 25 -21 -64 -36 -73 57 -11 -6 1 -34 -13 -12 -1 35 1 -49 22 71 68 -19 -8 -8 -4 51 6
3809 6 -74 -43 34 -22 26 33 42 -53 -17 29 -18 -64 -26 -63 -39 14 -13 -15 -37 10 -10 -9 61 44 -16 26 -34 -34 51 7 -49 -37 -17
3842a7O1%m5k7J6OM8lm6m9J6J5L7n1oJ9J8K6m3J4J2m0j8P6j9K8j4r4Q5Koj7j9
3875c5L0mJ6R2m5j00j6P2OL8p3m2K4mQ9n1L1Jk7jK0rm8J4Ml6M6L0lm5KK6QL5m6
3910aj4oP5j9r3L9m3L4L3J5jm0K0L9mL2q0j2kJ3JQj4k4N8k4L2Oo4k1Q9n0R1o8
3944EJ9J4m7l2K7nM7o3nJ7J4k1K2l7K0QN6m2j2Oj4L0LK3o8k1KM4N6n3J5j5N8o
3978D5k8Lq5K6J4J1M6n3oOM7kK0q0o9P5L0oKl6%M3l8N1Pq2K4MOR4j37M7qL3M3
4013D7n6K0L0r3M9pj9K6J6k3k7P4Lk5j2n7L8j8Qj2L2j2LKL3o0l2M9K8J7oo7M1
4046a0%K6j5N4q8n1P1rM4m0nJ4kL2n1P2J7m7l4K8J3Nl6j4N5L2o8m4P4m5K5K5o6
4079c8Qj9J4N2l9J07q3r6N5K9L0J4l9j6K5M5j0o7K2o2R3m8O3n0L8o2j5P2j7l0
$$ plain form
3842 -17 44 44 -1 -28 -12 -6 42 39 -7 -56 -40 -25 12 -39 -45 -26 -8 18 -25 -11 1 -39 -57 19 0 28 14 -80 5 7 1 -16 -35
3875 -35 -5 -9 7 99 54 -46 -62 10 16 54 -19 -61 -37 -41 48 -3 28 29 2 1 21 12 -36 -22 -18 -54 -8 22 19 -26 -24 2 10 45 -1
3910 -1 -15 -21 54 35 -58 -19 -62 -28 5 20 19 -21 -1 38 34 66 -14 -26 -28 -15 -14 -6 -20 -44 14 -10 22 28 -36 -57 32 -18 73 5
3944 5 24 38 -9 -41 -14 -19 28 -35 -40 -23 -9 -30 -8 -45 -25 -17 39 -3 -15 -9 -23 7 10 33 -35 -56 -54 -10 46 -7 8 -7 51 45
3978 45 17 20 -65 -39 -25 -14 32 -21 -27 -21 26 24 44 -36 -105 -30 0 -6 -4 -40 -40 3 -35 16 23 -59 -35 -31 -25 69 -68 -21 -29 4 47
4013 47 -9 11 41 -52 -3 -10 -29 -3 13 -10 -37 37 40 15 3 -54 -16 -34 -26 -38 -6 -18 -15 -13 20 -40 -72 -23 5 22 16 -51 -10
4046 -10 -10 16 1 55 -33 -84 -13 -22 22 -18 -23 -9 -11 21 -30 42 59 12 -22 6 19 24 -12 -26 29 61 -7 -51 23 -22 3 28 -38
4079 -38 -30 -49 -35 17 -22 85 2 -94 -39 -10 20 34 -5 -21 4 49 39 -28 -6 -68 25 -23 40 -10 28 -34 -49 23 6 -24
4109b4Jm0J8P9m1lL9m2K5l8NL3l4m2K7M8l7pJ0J6k0J8N0q0L3OJ8l1M3Nm4O0o6
4142a5M8l9j4j9k2J04k3qO6r1lL1J5m8L0n0M3k3Q1j02kN9P5q4k1J2J3k5kN4q8
4173d8P0L7j00M5J8n3k8K3K5k1K9NjL0k8k9R8m9k0k9lR7p1L9m0j8k8O6K3l3n4
4204d8Q6j3Qk8m6J7j2N7j6pK6j2k1nk5O8M2j00K0Ql6O1k7jm5M1m5M8o2N2OJO0
4237E2Jo4o9J26k5k5J1l8J2J1K8Qk3l5O1p8P1j1m2k4J6M5o2R2l3o6L2RRKJ1o9
4269f7MP4K6l0J6n2j7N3%k3k8J7Kn0P1k0M0J3J3l9k0J9mo4P5J1m5nm6O3P0q6j2
4302d1N8l3Prm2P0o6k2P2J2K8l4k8l8JJ32j22J04n7J3k3L3J1J4k3l8M0lMk7%J1
4334DO6j03N7n2P8p3M5m7K6N7o3Pjll9R6j9k9m1K0P3m0o7K3LM0m6N0k1rk4M0L3
$$ plain form
4109 -24 -23 -63 -45 34 -7 -10 29 -13 12 -26 -21 12 -22 -64 -37 11 -26 -33 -23 -7 -27 -9 41 -39 -6 0 18 -13 30 35 -9 51 -15
4142 -15 33 -6 -20 -39 -61 43 20 12 78 -13 -16 15 30 -18 12 -38 5 -18 63 -39 -41 18 93 9 -12 0 13 -12 -14 40 -48
4173 -48 22 59 -41 4 22 -31 -59 -36 -11 -32 -3 2 1 31 3 -26 72 23 3 -26 -29 68 -3 36 -4 -22 -50 16 39 6 -48
4204 -48 38 25 33 5 -41 -24 -36 21 5 -2 24 12 -9 -14 -39 29 71 -29 -9 -1 -37 24 -3 -4 -49 -8 -53 -5 -67 -15 -9 -8 52
4237 52 53 -11 -80 46 21 -4 7 -31 -19 -8 20 28 5 -30 31 -47 24 13 -29 -53 -37 8 -54 38 5 -61 -29 -20 -11 -9 2 -67
4269 -67 -63 11 37 7 23 -29 -46 7 7 -16 -44 -27 -25 -75 -4 -24 16 29 42 3 -17 2 -2 -66 9 20 -25 -30 -76 -13 57 -29 -41
4302 -41 17 -16 -9 -18 -60 10 -56 -78 -6 6 34 0 -28 -66 -65 67 -55 49 -8 5 -18 15 26 40 17 -21 19 16 20 -7 -7 4
4334 4 70 -33 24 -28 50 -23 22 -25 1 58 -5 2 1 -2 -41 55 36 7 -34 -14 59 19 -48 -25 -22 18 -28 22 1 -8 -32 8 41
4367D1m6OJ4K8Ql4J9q6M1J6O0m8m1J1mM4m7KJ7k1RK6n7K7M7o0J5M5m4NK8l6rK6
4401BRK4j2n2J8O2n9L3K2r1O9k0l1N7l2kk4L4J1Lk8j9L7K1o5Kj7J4K7%J0Rp4L4
4435b8M4n7J2J8M1k3K3m5N4q2K5N9j7l5M1l0k8M3J2l2M0o3JL0J0j8K6J5p5K1j1
4466b9K9J6J1o8K4O4l0r6RO9mL7K7n7J3m8K3N3o4NM2Pk1Lk8L5l1jM9pnJ7m7mN
4501bK1n9N6n3O0l5J7k7lJ1M4n6Pl2kJ06o6O8mo8oL6Pj1mJ1nM8r8J1K4l7j7J3
4535d5P0l2J4k7j9K0P6k0m6K1j1On1N4l8MJ0K0K3m1m7Q5j0l7O0k3m1N2m5K6k0
4566a2k2J6nKJ5k2KL1NlN8p3J4k6L4q9J3N3K9k7k1K0L2n7N1kk8Oj0J0k3O5l4k7
4600b5Q2n1QK2p0J7l7O5l0O0J7o8J5Mp2L3ML5P5k1r8L4NN8o3Ol0l0L5Q2q7QM9
$$ plain form
4367 41 -5 1 15 43 51 17 36 -50 -9 7 67 19 -22 -11 -15 29 -18 -16 1 -20 -11 15 -42 -15 32 -28 -13 32 -12 -7 21 -15 -24 2
4401 2 11 35 23 -29 -11 51 -8 25 47 -44 25 5 -26 31 -1 -3 -27 7 18 21 -7 -26 11 32 -33 -31 -48 -34 -7 -7 3 12 -62 -28
4435 -28 16 -41 -29 -11 30 7 30 -15 39 -43 -18 41 24 -11 30 0 -28 15 27 -5 35 -28 -27 3 13 -5 21 36 -39 -18 -29
4466 -29 0 16 27 -41 -17 47 17 -79 -70 -1 -5 32 59 2 15 -33 -10 43 -21 -16 26 33 12 15 -13 22 -9 -10 39 32 27 44 -3 -7 -2
4501 -2 19 -40 16 -37 23 -12 5 -22 -25 -14 30 -26 -19 -51 -53 53 -13 55 51 -17 -23 13 20 9 5 16 11 59 -39 -28 -4 -41 -58 -45
4535 -45 25 -7 7 -20 -39 -19 57 37 -9 12 1 7 -44 10 -28 -24 -14 6 29 -12 -59 26 16 -21 39 16 -25 27 -18 8 -12
4566 -12 -34 -18 -23 -21 -6 -28 -26 5 10 7 65 -8 6 -20 14 -75 -62 -9 20 -7 -28 -8 24 -33 18 16 -12 -6 -16 -6 -29 36 2 -25
4600 -25 57 6 14 36 -34 -17 -54 11 -19 41 58 -10 5 9 -63 -30 -26 9 84 63 -35 -1 4 62 -1 5 -25 -55 -20 62 -25 -17 32
4633C2nk7jN0m0l8k1K6N1m6J8L4k5Rm3NQ5n3k9K2K4k0l9j3L1K7Op0J9P1p7P3k4
4666A2j2J7j0J0J2n8L6m3O6qK6m0pKo1Q0k3l2rk3J14j1o1N5l0m1K8M5J0K7q1k3
4698c3P4l4Qj3j0L4L1j6Nr0L5M4m5k5M7k5J5L7%k5RK5k2k7k9K5n3O4k1LlM9n0
4731a6L3k7K9m3M3l6K3m0K1K5M8k5mm6J4N7j05K6M0j7L7l8J5pl4M8J1j0l9K2k1
4762a6k3N8r5N8O9k5l1NJK4l1m5NNN7k3J7k5k7Q6m6JmJL2n0L2K2Pm6l9O7k4J6
4796A3L0q7M2N3p8J2O7l8l0rJ8m2M7Mk6kM1Oo0QPJR7n5m3jN0QNq6K3P3l0l6j4
4831c2J30p9k7K3j2K7n6M2L5r7M7O%l9K9prO1r0M3j0m3N1p3P4MJ5nJ8no6oN2p2
4865g1O1J2k0l5M4M4o4N3k7onmK6l6N2K4j7j4m3J7J1k7K0%L3l1k0k3QM2pl5K6
$$ plain form
4633 32 27 0 -1 49 9 -29 -50 -24 27 -19 -1 33 8 17 -26 -21 64 11 -18 4 28 8 -31 -44 -13 14 20 -50 -31 40 -37 36 12
4666 12 0 17 7 17 29 -29 7 -36 30 22 48 8 1 3 -58 22 -1 -33 -42 -65 49 38 -23 32 2 -39 -11 34 44 71 -10 -33
4698 -33 41 7 15 2 -8 26 57 41 46 -44 -9 35 -10 -35 12 -13 2 39 39 14 23 48 26 -1 -30 -5 -58 6 -15 -12 -15 34 -16
4731 -16 17 -10 19 -24 19 -17 6 -34 -13 12 60 35 31 -15 -1 56 -49 -23 17 0 37 -1 14 7 -27 21 32 22 -17 5 -16
4762 -16 -39 19 -76 -18 51 26 -5 0 1 25 -6 -51 -46 -41 16 -7 10 -15 -42 44 -2 -1 -5 -4 28 -22 10 32 39 -7 -46 21 -3 13
4796 13 43 -44 -2 51 -27 -15 52 14 -16 -25 -7 -49 -2 2 -24 -26 15 21 -39 -31 -24 -23 74 19 -24 -25 25 33 38 -48 -25 48 18 -18 -32
4831 -32 98 19 -8 15 3 30 -26 16 51 -46 1 7 7 -32 -3 -10 -19 42 -48 -5 -15 -58 -7 -80 -6 -2 13 8 26 21 -45 -51 1 -71
4865 -71 -10 2 -18 -53 -9 35 -29 24 -3 -9 -14 -18 8 -28 24 48 31 17 -26 -9 2 -25 -5 -5 28 -3 -23 -46 -38 4 -3 -38 -12
4898a2k1J1J7K8j5Rol9K4k8M8K3n9L1nL9j8mJ0k7ll7M4j4K6l2MJ3j2J2OnK8l4
4932Bl8N7j0j0J5k0Nj6L1k7n%oJ2Ok2M2n3N9k9lM0m0m1nN3M2k6o%j0onN1o2P4
4968D9q2M2J1J8l3K4n3N0k1k5mK5l1O3om8oN1Np1L8KJ0p8O4J2m1j5j4L4KK2K0
5001A4O0n5rnk1M1k2k2l1N9kj4OK2j6RK3k5l0K1K2o6M6L4j02N4PK0pjo4R8l3j2
5035aK4j0J4n6L2L0ml9L4j2j4PL4k9j6k0O0k5K5l4lj1L3OL2l4K6l7M0j00O3j9
5067djL8j8m1P6p1K2l2l1P6j9j8l7N2Qroj0k3N3L3m8J4J8Ll7j2K2j0Np%K8j0j8
5102a4M2p3R9j22Q0k0j3M4J4L0n7l1j7L8l9oP2J0k7l8O6o8j6j8P4j7J0K1l4J5
5132EOmo6M5oM6K4p8P1o0N3m7jK8o6J7P7m8j5R3m4n3O9l3J9rk7l2L1L2j9n2M3
$$ plain form
4898 -12 -33 -22 -5 23 8 17 11 -28 -4 -32 16 39 -20 11 6 45 27 23 33 6 3 -34 10 -4 22 -10 -6 7 -5 7 13 8 36 2
4932 2 -36 21 11 1 16 -4 1 -15 16 -11 -16 -16 -22 -10 -4 -26 16 -37 22 -7 -10 30 -10 -51 -56 -3 39 13 7 7 -3 -9 -14 37 -25 49
4968 49 -33 9 20 38 5 29 -24 26 5 -20 -24 1 -30 33 27 -21 -27 24 29 -42 -4 -2 8 -70 -6 6 -35 -50 -64 -30 -28 -6 14
5001 14 74 19 10 5 -16 25 3 -19 -50 9 7 -7 -1 21 5 14 37 12 -18 3 25 -41 5 39 -63 -9 -2 18 11 10 -54 44 11 -1
5035 -1 23 13 27 -29 3 33 29 -10 24 12 -2 5 39 10 -6 -26 34 9 34 0 -3 -14 19 25 57 23 49 12 52 -48 15 -4
5067 -4 -5 33 15 -26 50 -21 1 -31 -62 14 -5 -23 -60 -8 0 -9 -15 -25 -48 5 38 -10 4 22 25 -12 -24 -2 -12 -7 -14 -14 14 4 -14
5102 -14 28 -45 54 -68 12 -8 -21 23 37 67 10 -21 -38 0 -39 -45 27 37 10 -28 38 -30 -46 -64 10 -7 3 24 -10 5
5132 5 11 7 -59 -14 -20 26 50 -28 43 -17 36 -11 -12 16 -50 -33 44 -4 -19 74 30 -23 46 13 32 23 -4 -36 -5 27 8 -44 -1
5165aMk1k3R1Kp5N2j0k3K0n2L6LJ4j4K8ol9Q6o3K4p9O6L6k2J2m5M4o7M8k7NK0
5198B4qK8l6M4k0n9j5P5j1J1k4k4l2mJ05m5J4m7K4K0n7M9j6J6J6NJ4l1j0ok0K4
5230DJ9m7Q0o2J3k9OJ7j7O7o9Q3m0j7j3J3J0rK8qj5%l4NM5n9j8M4m0K7K5l1oO3
5264C5K1j00L6M2k6kp1J03j7m1JJ0L8J8J9q4QL6Rm7Nr9N9M8m2M3L3n3K1J0r0Q9
5296A2j2J4L3oj8l0J3J2NJ5qn9K2L4j7N5j05O5k6Qj0j1L8m6R0j9r3J9K3j8j0K4
5328fJ7N7j03L8K1m2N7n3L6m2PpNL0rn3J51j00L6n0K7J5r5J15j5j2j9j0k1J2N6
5359D3l8Nk2M3Jo5L3J7l1K4N1r5J1M0k7M2K0n6L1m1l3J13o2%k3L6j6k2J0P0l9
5390B0o7N2j2K5K6n2k1R8o8KJ9k9l0N0J7n2J7nJ1l5JR6p8m3L4k5M8m1J9pl1%O3
$$ plain form
5165 -1 3 -18 -41 50 52 -23 29 19 -4 16 -36 0 3 17 3 31 25 -14 72 9 33 -46 20 56 34 46 1 45 -22 26 -1 4 24
5198 24 16 44 8 52 32 -27 -42 33 22 33 9 -15 -47 -51 54 9 23 -24 0 20 -37 12 -4 12 28 33 47 16 6 0 -20 4
5230 4 23 -24 56 -6 7 -22 -16 1 -16 51 -18 65 25 8 -5 8 18 9 37 29 14 14 -20 -15 30 -29 -47 -3 -43 -16 9 -22 -28 35
5264 35 56 -44 -8 34 8 6 -65 38 21 -20 -19 -9 29 47 66 -18 -10 26 35 -12 -7 -106 -47 1 -41 2 35 -18 3 13 -77 12
5296 12 0 14 47 41 23 -7 6 18 23 38 30 -29 -7 27 10 65 -40 25 -1 7 -3 -14 24 -22 68 49 -44 -25 -2 -20 -30 -6
5328 -6 11 68 -35 3 24 -18 39 -14 22 -20 -13 -20 -15 15 6 -47 104 4 40 -10 17 32 -63 52 37 25 6 -4 -25 -13 43
5359 43 5 10 -12 31 32 -33 0 17 -14 10 61 -34 -23 17 -10 32 52 -4 27 -14 -47 66 4 4 -19 17 1 -21 -11 59 20
5390 20 -47 5 -7 18 44 -8 -29 69 1 3 22 -7 -37 13 30 -22 -5 -10 1 -34 -33 63 -15 -58 -24 -49 -1 -42 -23 -30 -61 -61 2
5423Bm3KM5k7N9j2rm5P3m2J2J2j8M2m8kM6j6L9m0j6K5m6K9p5N9mm3O7j1J8m4J9
5456Ho0N6j5J5J1l2LR8o7k7k7M0l8M6L6k3j5m0R4n7j5j4kK1K4Ol8N5m3n2l0J03
5488B1k8NJ7Qk9j2J7Rl0j3N6j8Ol3J5o1N6k7R1j11J10r9P9n9L9L8k1K3r4M3j0
5519a2j4P4o0oO0n6L9j3q0J01n1N4l1%m8K9P5q0N7k7Nj5k4J7k2J6k2M2m3j2K8
5550a9pL5j2J9j0m6N1jj4K0Nn0K1Mj6L0j0K1LK7m6K3o7J2nJ7k9L6N4o3JK8p%k1
5585a6K1l6J3j1K9o8P3n5L9j2mk8K5j7J06q2L7Rjm6m0P6q2R7j2lOm3M6q7M3L1
5617Hl8Q7r7M2ol3M1L1n5M8k9o2R3j4j8l6O7m7J1l5N7j2k0M3n5K3J5j7N0J6r1
5648c3N0j6L7j06J04j6p2K2J5M9n6L4k5M6l0L0q2P8qm7j3K3%J4L4l1Jj3JmrJ3
$$ plain form
5423 2 -41 -39 6 -21 38 26 17 -28 45 3 15 27 9 51 3 1 47 31 70 30 14 39 -7 22 -53 6 2 -41 26 15 33 -11 8
5456 8 -52 4 -11 4 15 -17 -14 84 17 -10 -37 3 -35 11 47 24 9 -31 63 6 -9 -23 -25 -4 20 26 -12 43 0 -52 -82 21
5488 21 -7 -2 15 23 -6 -18 -1 8 -22 -35 21 3 9 -24 -9 -70 -14 -41 50 -61 49 -50 29 -30 9 47 26 49 -45 -2 -12
5519 -12 -26 48 -12 -18 42 -14 25 12 -68 33 -18 36 5 5 -43 -14 61 -19 38 11 16 1 -23 -6 -28 -12 -34 8 -35 -47 -19
5550 -19 -26 9 -3 16 6 -40 11 10 -4 16 21 -29 -8 -4 -20 10 0 21 24 51 5 28 -39 -27 -32 -15 -44 -8 46 -17 -16 12 5 5 -16
5585 -16 5 -31 -18 -29 0 -68 5 -50 -11 -23 -27 -55 -30 -47 59 -23 14 23 22 -24 -64 12 -70 27 15 12 18 -25 21 -66 -23 8
5617 8 -30 57 -40 2 -4 -37 4 35 -20 28 -1 -63 30 16 -2 -38 29 -18 -7 -42 15 3 -17 26 -29 -6 9 -8 42 58 -33
5648 -33 17 1 38 -68 36 20 -52 -30 -15 34 -22 12 -13 33 3 33 -49 29 21 -26 -39 -16 -16 -2 32 1 2 -11 -10 -14 -23 -10
5680a0J8nk1qKJ9lJ5M6l9j0QoNj1N2nk9m1K1Pj6k7k9N5JM4j7m8K9l1j1O1j0k9
5715b3M3o3k5M1K4k9O6JRJ6n2L1j9l4K2l5K7o2O6k8K9k1k3P5rj6k3LJ2M6q5O4
5747B8k5kJ1m1N8o5K6LLj9lK3MoJ3k8j1M5m3O%O1o1L6l0j3M8o6O4qqoN4l6J4M
5783C0Kq3R9j6K2k7j6j4p3J8O8L2l6mK7l5J5k2L9o1L7L4q7nM6m6L0O0n5N1k9N5
5815E6l4J6p9J2L7J3j4j8J9l6N7ll8j0QLoL4Lk6M2m9m3k0O2L8r1L6mJ0J8k3J5
5848a5j7NM7m9K5j7m4J12k8j8m8N6K9k6j1k1kJ0K2Po3L7J2J7n3K3K0j5K5j3Pm0
5880b6L3l6MM1n8Q1q8P0n2j3LJ3O4p9k0M2%j4Q3m8m8K8Kj7O2L5j13P4Ln3M1k7
5912a3M3o1L2NJ9M0o2Rjm2L3jM9m2l8L6j8K1o9jN6j6K6j3qj0m8N8M9n7N6l5Lk7
$$ plain form
5680 -10 8 3 -18 -26 -24 -5 -8 7 53 14 4 12 6 11 0 52 47 18 -23 -2 5 -11 -38 -67 -12 -11 33 16 -32 -3 -34 -45 16 6 -23
5715 -23 20 -43 -68 -27 -3 -32 34 35 44 60 8 39 20 -14 8 -27 0 -62 4 -24 5 -16 -39 36 27 11 -12 -9 3 49 -36 28
5747 28 3 1 12 -29 29 -36 -10 -7 -4 -23 -26 -3 1 -5 8 -20 -31 14 -29 -23 -23 38 -23 13 -17 -30 18 -48 16 8 0 -6 48 12 26 30
5783 30 32 -51 48 32 54 27 11 -3 -76 -58 10 42 6 2 29 -6 9 -13 26 -35 2 36 -51 -56 -10 -56 -26 34 -21 30 1 56
5815 56 22 38 -41 -29 8 21 7 -11 8 -28 29 26 -12 -22 -14 -11 -17 17 20 -6 36 -13 -56 -76 -14 24 -67 -31 -35 -25 -7 -30 -15
5848 -15 -32 -27 20 -29 -4 -21 -65 47 19 1 -47 9 38 12 1 -20 -22 -12 10 17 -46 -9 3 20 -33 -10 10 -5 20 7 14 -26
5880 -26 7 -29 -25 16 -42 39 -49 21 -31 -44 -41 -28 36 -43 -63 -21 -21 -35 48 0 -48 -20 -18 -35 27 62 -51 23 26 -27 14 -13
5912 -13 30 -31 1 6 25 65 3 12 11 -31 2 1 50 8 -30 6 -12 9 -60 -61 -5 -21 5 -8 -16 -26 -74 -16 33 -24 32 -3 0 -27
5946b7K1J0J0m5j1J08q2Q2n6l9K8LJ2l2L3pKm8K9Rj3pjML6Kk3o5Q0j6%kK0j5o
5981fqJ2km1K9k5P7Pm5l4L4k5K4L3l1L5j5M4n5N1q4K2K8k2K6Rk5k7K4Pj9k5N0
6014B3Kq8Q1%n2N5J1l9kj2mJ5J9m1K6K0l2L0J4j0M2r0lO5j0J6j1p7L0LL2k1k2
6047c0J3J1Rn4J7K2JoKK4j4J7jn2J3J9M2m5qj6l2J15o1l9L8pK4L7n5nnqoJ2N3
6082B5J1k5k2j0Nk0K9o9P5jMk3j7O6Ln7J8J5l0PJ3j0lQL1n7mP0k4m6O8m9R1j3
6116E9r2M8n1M5K4nqMJ4p5K4k6P0l1pPj3kK1K3n1k5Q7k2j4k1j0P5n6j5KpL4j5
6150iM0Jl1J8m5O1k2n3J7N1j4m5k5K7M2n2K4lM4n6L0K1J2q7k6J23o1MP7p1K6k9
6182a1k2O3k8k5pJ3K4n0R0j6kk1m5J8Pj3L7k6j0nK3N3k6JRk7oL8n8K4K4qlp8J54
$$ plain form
5946 -27 -6 4 14 -31 -42 66 -16 66 10 -29 -1 2 14 -18 15 8 10 -38 -9 0 -13 -20 -21 -17 19 21 -2 -67 13 -3 -3 -5 15 0 -6
5981 -6 -14 -2 -4 -45 -16 -41 36 43 -2 -36 -2 -27 -3 30 -1 34 19 63 8 59 -25 -3 25 3 29 38 13 -14 10 17 -2 -27 23
6014 23 25 -63 18 18 -34 21 32 -7 -9 -21 -25 -10 9 -32 -6 14 -18 12 26 16 58 -32 -35 30 20 36 25 -52 -22 -19 13 -8 -30
6047 -30 -17 -6 3 -51 -34 -12 -11 -17 -15 9 -5 12 11 -41 -28 -9 33 -12 -20 -36 -68 47 -14 -53 -15 -22 2 39 -16 -21 -26 -34 -40 -28 25
6082 25 36 11 -11 -21 -16 -36 -7 -76 -1 -2 2 -21 -38 28 31 -26 -8 7 -23 -16 -3 -13 -16 -8 23 -34 -38 32 8 -38 30 -19 72 59
6116 59 -33 15 -36 9 33 28 20 24 38 -37 -13 -39 31 0 -7 0 -13 -15 6 29 -22 -47 40 18 4 -17 -27 48 -8 -23 -21 -28 6 -9
6150 -9 31 32 1 19 -26 35 13 -40 -23 28 14 -31 -56 -29 13 -39 -15 -18 26 -30 0 21 33 -54 -80 43 -18 -14 63 -8 18 -11
6182 -11 -33 30 2 -23 -30 -17 7 -43 47 31 29 8 -37 -19 -12 -25 12 -14 -24 -29 -6 47 21 22 31 4 -2 36 -22 2 26 18 15 -63 91
6217I1p1l4L6K3Rp8L4o4M8M4q6J9P0k1j7n7N7Kl8j0k9M9K2k6L1M0J9j07L2K4q
6248Dj6j6K6jN9j00N2J2l6J8J7J5k1j8P3q4J5o7M2j6MQ3o2kL7o2K1M6%m7j4J3
6280b5L1Ml1J6m0P6j8k6k5L2J7k3L6o1M7l0K4L8J7k5l6N1o1L9m1L7K1n6L3MJ5
6311D0r4M4J4j9M0k6oJ2mQj4%L5n0J7k4K5Kk9J8Jj0K5j6l8M7k4M1J1m0K0n5Q1
6344C2l2O5p2K0o7KM8l5N7k4qLllOm8O4k0O9q5N4m6j2M9m6M1j2JK9r1J30o1k3
6377a8J5OMLRK6k5n1O2n9P3n1O2l8L2l9l1PQK9k8N4p7P6mq4L9Mn1lk6L7L6K0n
6412A2j5j1K1J5n4N8J5o4j8K7KJl1O3M0j04J0J14o9ml8K2N0n5j1J3Pl7L7PN1q7
6444c3lO2l0NqJ7J7j00J05j3l3J8k4Ok1L9n0J0M5n6J4M0n9R5K2o1K9l3O5m9L3
$$ plain form
6217 91 20 -14 22 45 54 -24 10 -54 -6 38 -48 -29 41 20 3 -54 3 5 -33 -43 -72 -23 -1 -27 4 44 63 -44 -12 12 4
6248 4 -12 -28 -2 -3 56 -44 8 20 -16 2 19 34 13 -5 68 -16 -1 -68 -26 -42 -38 45 -17 -19 18 -44 -23 23 23 -24 -38 -25
6280 -25 6 10 -21 -5 -45 31 13 -13 -38 -6 11 -12 24 -37 10 -20 4 42 59 34 -2 49 -12 27 -14 23 44 -12 21 25 40
6311 40 -54 -10 4 -15 25 -1 -7 5 1 9 -5 -5 30 -20 -3 -27 -2 0 -29 -11 -10 -20 5 -11 -49 -2 -26 15 26 -14 6 -49 32
6344 32 0 65 -7 13 -54 -52 -4 -39 18 -6 -14 -11 -14 -17 -11 -59 5 -15 54 -31 23 -23 -35 14 -32 9 -3 -2 27 -64 66 5 -18
6377 -18 -3 3 7 10 19 45 20 -31 31 -28 45 -6 56 18 50 11 -20 -13 -5 24 -4 50 -27 49 45 -39 0 4 -47 -50 -76 -39 -3 17 12
6412 12 -3 -14 7 22 -32 26 41 -23 -41 -14 -12 -11 -42 21 61 -43 -33 81 12 8 -30 -8 42 -13 -24 -11 -4 -41 -4 3 54 -33
6444 -33 -36 26 -4 1 -7 10 27 -73 32 19 -14 4 -20 -14 -35 4 -46 -36 9 -47 -33 7 -52 43 65 4 33 0 65 16 49
6475D9l2o0O5j7l1K3M6m3N0r8R2nj9n3M6l6K0J0j9K4j4k3L1oom0K6O0k2p2O%N9
6508A1nL9m5K5J8r3R3l3K6m2m3Q0j9J4m4L0M8r9M9L9l2nJ7l5k1K5mL7m5Q6q6K5
6540A1j1MJ3l7K0nJl4P4jp3N4n9K0K2k2KM1k5K6o3N1l6M0n3L1k3MP3p8O2l8J9
6573A0k4m0P4l9M4j0p5O0l1L0qo8Q3J7l5PQ3p8N1pk2K6o0kJ9j1L8K0l0j6m2P5
6605C9j1n1j2R2n4q0P8j8L8mJ1j7ol7M4m2M8l3lO6m6k2O9m0jJj4K1J5nj7l7%J4
6639a4QK0K7m6m4N4j3K2lk5K4Pp3Q2k0j5NK8J2No0l0M9J0LJ2n1P2k7n7R0n8J8
6672A2mK4j6k1K7k4l2j8J13n6lkl8M9J1J5j9j8K7m5N6Kl4NnK5m0n5N4jkN0r7P4
6706A4m1J9O6p3K1l5j3O8l4j1j6N1j1N7n7M%k6j9M8l3j5M9r1Q1K0l2J6Qpj4j8
$$ plain form
6475 49 17 -43 22 5 -26 -3 43 0 50 -48 44 39 20 -33 13 -23 -3 7 -12 12 -2 -25 6 0 -6 -46 -20 40 18 -54 -48 -48 11
6508 11 6 45 0 25 43 -50 43 10 36 -6 -49 31 12 26 -18 12 60 -39 10 49 17 12 29 -6 -27 -2 -6 31 -14 72 -14 11
6540 11 0 4 17 -20 0 -5 -4 -38 36 35 -38 16 -43 -23 -1 -23 -21 20 -5 21 -42 9 -27 13 -40 -9 -32 -28 45 -33 29 -9 10
6573 10 -14 -54 20 -19 25 15 -60 0 -31 -1 -9 -77 6 23 -12 -5 78 0 51 44 22 48 -12 -14 5 -6 32 52 22 6 -36 39
6605 39 28 -23 -35 57 3 -77 1 -17 21 17 28 11 5 -32 12 -30 18 -15 -18 48 2 -20 49 9 8 9 -5 16 31 26 9 -28 -28 -14
6639 -14 -6 14 41 -5 -49 5 -8 14 11 -14 10 17 -56 26 6 -9 -4 24 36 41 -19 -49 0 10 13 25 -26 46 19 -38 52 -6 12
6672 12 8 32 16 -5 22 -2 -34 -52 61 5 2 0 -38 11 22 37 18 0 27 -18 38 40 6 11 6 31 -9 -64 -10 -11 -13 37 -60 14
6706 14 -27 -8 58 -15 6 -29 -42 26 -8 -19 -35 16 5 62 5 9 9 -17 -36 12 -21 -36 13 -78 3 23 -9 7 15 8 -6 -24
6738b4N8m7n4P4L8n3qJ9N1o4K9m1j0R3q6J5k8Q2n9Q6j17Q2l5J3k4J5J1kJ6k9J8
6769A9Mn2K4L5K7o1J9M3o4J3jJ0Nl2K1pl1KL7m%QrKj9O7o2k0P0n3Jk9L6Rj2j8
6805b2L6k5J03j02j0O8q3M6PprN3j2J0r6K7j4J0L3j41J42o2R8p0K7L7l4J9l1K5
6835B3oL7oo1m1M6o9J09k3m1M7k7N4l0J4Lo7M3J2l8L9m3K5j3KjJ04o7k6k5L2q2
6867g6N7lJ1J7L1o1J6mL1L1l2l8L2L4j10J16n7J2L4n6j0oO5k9Pj6NJj7K8k1RN
6900Fl5J4O7o2K3L7o6P7r6rP0nj3J4jj0J8j9o6R2l4l3J13o5k8L1m2%Q9l2n9Ml
6933b3L3l5K9l1O6k4oK3l2j7K3l0RL0k9N4l3K2j11J37n9K8k0kLk7K1Jm6M4L9o0
6965b3NJ2N9n4Lk4J0k4jK2K7JQLj1j0j2nO7J1m6J6p5J3O9j2m3N4k8Pl9lN1m3J1
$$ plain form
6738 -24 34 -13 -67 7 45 -8 -16 3 54 -10 19 -22 -32 61 -25 -10 -38 44 -15 71 -46 36 1 14 -10 5 16 14 30 1 19
6769 19 23 -29 -5 30 57 -4 15 58 -6 7 6 16 21 -11 10 3 -28 -26 11 7 7 15 6 8 -11 56 -6 -26 44 -9 -8 -37 -1 8 -4 -22
6805 -22 14 -11 92 -10 -20 48 -35 11 18 11 2 55 43 53 -43 -16 -30 -20 13 -128 14 -48 50 -20 7 44 10 29 -2 23
6835 23 17 54 48 -13 -54 -8 -77 32 9 -32 15 -12 42 12 26 29 -38 5 17 -21 18 -25 0 -13 -11 -12 92 25 -1 -26 6 -76
6867 -76 -19 -22 -11 6 37 -24 -8 -12 19 50 18 -20 12 46 -64 52 -5 7 41 -15 -25 -31 34 5 12 -4 1 2 -15 13 -8 1 6
6900 6 -29 -15 52 -10 13 50 -16 61 -35 -44 26 21 8 22 21 11 29 10 -56 36 2 -31 82 17 -11 20 -22 -22 67 35 -24 -20 -23
6933 -23 10 -25 4 -27 39 15 9 32 0 -17 6 -24 -15 15 -14 40 7 29 -82 55 -4 24 4 2 5 -22 -1 0 -46 -2 37 -23
6965 -23 -18 -6 53 -1 2 -22 -12 -36 -37 -15 12 13 21 24 13 3 -9 -14 53 64 18 34 -41 -28 41 29 -14 40 12 19 -20 -23 28 -15 -4
7000dO5p4J0Ml3M4k0oo2N8NR9m0p2OM4p5R0Jl3N5n7j7K9oJ4%Lq2P6n5oR6p0K1
7035Hk2J0lJ0klmJ5j3K3k0nM6Jl9j0L9m7O9j03P8m0j5K3L2Oo6O1k7M7o0j6L7m5
7069c5JL6L0L6j04Q3o3K2J0n9K5j1L3pK7Kq6N8lj0m0Q7o6M1k7j7J12q6K4klj6
7101hj1l0N0n0J14n5Kk6LKrM0J0J5m4J3J4l9L6Pn2M8nlm0nM8l2JJ9mM5q8qK4M8
7137C0l9N0n6l4N5L0o2oJ9KJ1QmL8j9k5L2p5O9l7K0lqK6j2j9K7n9O4j6N0j6o0
7170a9J0J9L0n2j0LJ8M3o5K6rL8l7N3n3j8K7oLJ9L0p4K6j6k0K1N4k3Pm8N4k0L
7203A4O5j05K0O%L3o3M3m2J26r1RKl9M5q2P2p3M9l2L2k3Q3j09J1N1jn0J9K8m4
7234d6J04j9M6q3rJ2K6oj2M3l7oj4kjj2PN0q6R4o3m8Q3k6L2o1M2k1L0K4r6N5j6
$$ plain form
7000 -4 61 -13 -3 1 -32 12 -8 -14 -76 -18 -13 86 46 -26 -20 24 -51 39 40 7 62 5 -12 17 11 25 25 28 -54 22 -33 -39 57 -13 8
7035 8 -14 -4 -7 3 1 -2 -6 9 -4 19 -1 -6 40 41 2 -8 31 -16 53 -50 28 -12 -27 -4 28 34 -32 29 2 49 -11 -27 10 -35
7069 -35 -34 2 32 68 -36 47 -16 6 16 -43 -18 -29 4 -3 24 26 -60 -2 -5 -15 -55 32 -34 7 -20 -37 75 -11 13 11 8 -8
7101 -8 -19 -49 1 -49 65 10 12 -14 -11 -9 -18 22 32 47 3 16 30 -9 27 34 -18 30 25 22 -18 -23 25 -7 -6 13 9 54 -34 -42 -18 30
7137 30 -9 41 -15 -49 6 36 -26 -32 -13 -11 0 8 4 42 23 -2 30 -45 24 -13 7 4 -4 22 10 -9 18 -41 23 7 57 41 -19
7170 -19 -9 10 40 -12 -22 -19 -1 42 -23 3 -6 32 -5 48 -5 -23 4 -2 1 20 50 -24 2 -14 -34 -13 41 18 25 -23 31 11 14
7203 14 79 -26 -6 0 0 33 -30 13 -29 97 6 15 17 -22 23 -59 13 -60 -11 -43 -11 -34 49 -60 -49 2 1 -49 -30 -2 -46
7234 -46 58 39 85 2 -7 5 31 25 13 56 19 13 -1 -3 -4 -16 -9 41 -45 49 -14 -62 21 -5 27 -34 8 -13 17 41 -55 0 -16
7267a6ljl5P0L2n9l6qN2J01r8pK5Mo9O9Ll3J6mN7m8pj4j8M0k5O8m0l6L5M6l5l4
7301hnlj9M4m2MM6l5J3j6j0lJ6k4M9k1j7K5l6P1p3L5M8l4M6n9j3K8J6kk7O8o9
7334gj3Oj6OP2q8Q4rm4l0O5n5j2L3N1k6jjo1N8n6M4j1J4n2R7m2L8m0l3K0Nl7R
7368c2P7n0K0L5kL2j07M6l2L0k0K2L1n5n3Q8m3j4PK5oKOn6R2mj4k0rj4l5P4k6
7401ej2M0K3n7QJL9m3M2ROk7K1l2j4l6NN8o5RM6n9L3Q3n7j4QL0l9lK5p0P4Jn3
7436b5j5K4l1O0mk0M7krn4N0k1jl0O3k6K5k6j1L4J1n0L4K5k2km4K5k8K5jk7J6
7469a0K7n4J3K9jJ9k1jN7r4M3j2o0N6pP5Ol6k3MQK9l3l4K1J0PK5m9J3P2q4K4k1
7503bL0j2N1m2J1o1KJ3l1O3m7nnM7J1o3K4L3m0p0P9j5N9k5j08J06m4L9M0k8oN4
$$ plain form
7267 -16 -19 -20 -55 15 47 -12 -48 -56 -4 97 -1 -8 17 21 -48 21 24 -9 7 3 60 12 5 -9 -27 13 -12 56 16 -20 15 61 26 -8
7301 -8 -13 -16 -35 9 -33 -29 17 -18 -5 -21 -31 -34 -18 -42 7 -14 -31 -6 -42 29 -44 -9 39 5 51 -8 -21 7 23 21 -6 62 -7
7334 -7 -20 -14 -30 -24 48 -40 44 35 -9 -39 26 -29 -41 -8 43 17 16 15 -46 12 -44 0 -11 3 -49 48 6 44 4 -29 -9 -4 -41 -32
7368 -32 45 -5 15 50 48 80 -27 19 -13 17 -3 19 50 -5 -58 30 -13 -27 -20 5 -1 1 7 -49 43 39 25 5 -4 -18 -53 21 -5
7401 -5 -17 23 46 -11 -3 -2 37 -6 36 45 51 24 45 13 -1 -37 -32 26 -39 -30 16 -43 -10 73 16 2 10 40 1 -2 23 -47 27 28 -25
7436 -25 -40 -16 -47 13 9 -11 36 34 25 -29 21 0 -1 -31 32 6 31 5 -6 28 39 -11 23 48 26 24 -20 5 -23 2 1 -26 -10
7469 -10 17 -37 -24 5 4 23 2 1 58 -36 7 -5 -65 -9 -16 59 65 29 6 10 18 47 14 -20 1 11 18 43 -6 7 79 -5 19 -2
7503 -2 28 16 67 25 36 -25 -23 -10 -41 22 -25 -30 -35 12 23 -40 -16 17 -23 -93 -14 -29 30 5 -103 3 -41 -2 38 10 4 58
7535E8k7j2Jn4J4R8j04%R8p5M3ol8K7m5N%Jj1J6Rm3j3L5j6O0j1K6m4L2k6M4k1
7568B1Ll8L1k2K6k1m7R5m8OK4rjMqJ5l1l9O2L7p4m7O4n8P2nj4l9O5Rm9OMJ9km9
7604c8J8o2Q1K5k3j0M6KL0j8n3Mjj4J4j6pj2K4K9j8pN2k4J8q2N9k4LK4k1J2LL3
7638D7m9K0k8Mj0J0K0jm9%K5j4l1M4PJ1RJ4k6j4j3J13j06L3m9Q1n0o5Q0L2LK3
7670G1j22O8j8J3kK5Rl0K6Nr5N4j6M1m5l4N3j9K4n0O8j7n5K6K2RPl9k5M6M7l4
7702A3Pj4j7K8K5k5o8P2l5Qj5Q1q8L5jl1K9K1pj7J6Lk3L8k6k1N6rqn8N9n7Ml0
7736e5P8l8l9N2JJ4Jj7n4RR0r2R7n0j6P4j3l2l9O9k6rj5J8J9lk4QJ9J4ro0N1n1
7770b8J7j6N5o7P4l6M2n0K9k2K8j2k8M0K7n1n2J9j1J3L9K5pMl1J3nl1N5k7J6J5
$$ plain form
7535 58 31 19 20 -34 -20 78 -26 -26 72 -3 40 34 -4 23 -22 -17 -17 -16 -27 -11 -2 -45 -58 -23 -39 21 10 36 -8 24 -2 42 21
7568 21 24 -14 17 -5 21 0 -47 48 0 6 30 21 20 24 16 31 0 -39 23 60 -14 -61 3 -55 17 12 -2 -41 24 33 -16 -10 -6 13 11 -38
7604 -38 -20 -82 -1 24 1 -9 37 39 69 51 -2 2 1 -13 1 -15 -22 -34 -10 19 1 -6 46 22 40 -42 17 -7 -4 20 -1 11 14 47
7638 47 -2 18 -10 -6 -16 -6 14 13 -36 -36 -11 -25 -56 -12 -5 6 15 29 3 -11 -24 89 -17 16 -33 48 -2 -67 13 45 48 71
7670 71 -51 17 -1 12 10 35 44 14 40 45 -50 4 -12 29 -16 -50 3 -16 8 -42 26 9 -46 -20 2 11 18 -21 -46 0 47 13
7702 13 20 6 -11 17 42 17 -51 21 -14 -6 -21 60 -28 7 6 -25 4 25 18 1 17 20 -3 35 9 -12 44 35 27 -31 28 -29 -25 -55
7736 -55 23 -15 -54 -2 -1 13 14 -3 -57 -48 42 -50 47 -3 -19 55 42 10 -29 40 14 5 -10 8 27 24 0 8 27 41 32 -28 23 -28
7770 -28 -11 -27 28 -39 35 -1 41 -9 20 -2 26 14 -14 26 53 2 -50 -31 -42 -29 10 35 28 32 1 14 9 -22 33 6 22 37
7802C7l6K6pMNjlJ1k7JJo0M9j4J8Mm2J5M4okQm3%J3Qk6M5qPk7J3M7n1l1J7QJ2
7840Ij0M1r6M8kl4L6N8k3n7P1j4l0kK8Lk9M6o2l4J04m4lk7RK6o1J11l1n9j6N0
7872Fo3P5m6j7N5j7j7J1N5m0qo2J17j0k8M0q2mM9K3k9kl0J3K4j4qn0L5P9l5j3
7904GL4j04Q5L1n3lL5j7O7j55L3P8l5J5k1j5L3jK0l8J9o4L8J5J8po0J00q4O1%
7935C2k3j2N8p0M0L2k0n4M8lj04O5j5L2k5J26r0Jk6K8j8LJ3j2L2m8k7MJ2K4J1
7966A4m4Q0j9m1K5MJ5k4lNMl0R8j20J2L6l9Q8o2k1L8l1%j7P%K6m2K3J9L7q0NK5
8000a2k6LR8j01N1L1r2K6N6j6j2LN%l4N7LQJ0l2m4J3J4l1L5oj8Q5q7K4k6pK1M7
8034D6r0j4L0M7Lo8K6L8j7l6K7K1j6m8O6l0jL9n1K6j1lN5k5lLj3j3j3J00m8n7
$$ plain form
7802 37 1 27 20 24 29 28 25 36 9 10 11 -49 0 -14 4 8 -34 -19 25 19 17 25 -18 -18 -5 3 -23 22 14 21 -6 7 54 3 -28 -11 -3 9
7840 9 -1 40 -56 -8 -10 -44 -8 50 27 -30 41 27 -3 -5 23 26 -3 43 -19 -53 51 7 4 -23 -14 12 -49 62 31 -28 -44 6
7872 6 -57 18 -28 -45 10 -7 -24 -13 42 2 -6 -68 49 39 11 51 -31 -35 14 37 8 6 -24 -11 13 -1 -9 -59 -24 55 20 7
7904 7 41 -63 22 53 0 -3 32 15 82 -73 -40 38 3 18 -3 -18 15 14 34 -4 15 -49 -11 4 22 15 -45 55 -29 32 32
7935 32 9 -3 55 -15 25 57 37 -17 31 28 -76 -11 -26 6 -19 107 17 18 -8 20 2 5 18 6 38 -10 -37 -33 -21 3 14
7966 14 -30 50 31 -10 15 19 34 10 7 12 16 -14 84 -36 -24 12 -27 61 -1 -22 16 -15 -15 -32 -25 -25 1 -41 -18 1 38 -42 -37 -12
8000 -12 -38 -35 63 -38 13 44 -48 -22 34 18 6 9 14 14 -20 37 40 48 58 26 -18 -5 9 -22 13 7 -11 74 -13 11 -15 -22 -1 46
8034 46 -44 -58 -28 19 22 -46 -20 18 1 -35 -8 13 -3 -51 15 -15 -16 23 -28 -2 -13 -16 39 14 11 14 1 -12 -25 75 27 -30
8066c0N1K6n9LPPl4Mj9K9K3%J0k0j6nj3K8OM8r6N2N2p9J4KL5k9k9N7p4N5K1J1
8100C8o4J9Q1j25K5j8K2lM0rl0k9Q3p0P5o5M9qKM7m4j5J7j8k6O3k2k8K1l5JO7
8132D1q0J3l0M9pN0l7j1L0k3L3L8o3nk0M6k6k3J6L6k6K0mJ0K3m2n9MO1j8M3j0
8164B9M3r3L1K2Qp9kQ3j09P1pK2pNm3L7m5K9kJ2M5m6Mj3n7J07%
$$ plain form
8066 -30 21 47 -12 -9 -2 5 -29 -25 -44 -15 8 8 18 -2 -18 -23 -36 -8 -2 46 -50 2 54 -25 -11 -9 26 -3 -32 25 -49 6 27 38
8100 38 -26 -7 74 -51 -26 -44 -22 -25 15 6 -24 -53 30 -40 35 -30 19 11 13 60 16 1 18 0 -26 37 15 -13 8 -27 -26 41
8132 41 -39 -26 -56 -7 -14 36 -1 -12 18 -5 28 66 3 -2 -22 24 -2 -25 -9 27 1 21 17 27 50 8 -51 -47 14 -4 39 29
8164 29 72 -21 10 32 40 -39 -41 42 -67 4 -3 19 12 17 -26 11 -34 -5 -7 5 50 4 8 -5 -62 45 45
8191D5
$$ Imaginary data points
##PAGE= N=2
##DATA TABLE= (X++(I..I)), XYDATA
0@%%%%%%%%%%%%%%%%%%%%nJ3j6J6j6J6j6K4l2L2l2M0m8M9n7O5p3Q4r2J04j17J29
42F8j43J58j75J93k14K37k61K86l14L47l83M23m68N16n72O38p13Q01r04J030j189
63f39J394j667K057k665L746o268K4686J0805k9514p682l067M459k090n963r485
78b1893L501J0202J0517O308L064p506o175N845J1739L37r869j2495m037Q348
92b114R770n438j4004o334M689Q319Q921M000l593m473K209O435P136Q08j1767
107D564j5460k511R102M930m721p325j476Q674J2315L929n858n526j539Q99M593
122D590M634l930j0015n342L961R178N127p079j3403l100J0193J0047K061k265
136D657k146J008M904K420m601p887p783n029L512R897L955n510m545M619J0509
$$ plain form
0 0 0 0 0 0 0 0 0 0 0 0 0 0 0 0 0 0 0 0 0 0 -5 8 -8 8 -8 8 -8 16 -16 16 -16 24 -24 25 -32 33 -40 44 -48 56 -61 68
42 68 -75 83 -92 101 -113 124 -137 149 -165 182 -201 222 -246 270 -302 336 -377 424 -480 550 -639
63 -639 755 -912 1145 -1520 2226 -4042 20644 31449 1935 -5747 -8814 -4355 -6445 -12408 -21893
78 -21893 -18392 -8190 2327 8635 11699 4193 -1982 3863 15602 15939 6070 -6425 -10462 -2114
92 -2114 7656 2218 -11786 -18120 -13431 -5112 3809 7809 4216 -257 1952 8387 15523 16331 4564
107 4564 -10896 -13407 -4305 625 -4096 -11421 -12897 -4223 8092 12021 6163 637 -902 -3 4590
122 4590 9224 5294 -4721 -10063 -6102 3076 8203 1124 -12279 -15379 -5186 4861 6922 4657
136 4657 2511 3519 8423 10843 6242 -1645 -9428 -14457 -10945 -1048 2907 -2603 -7148 -2529 7980
151G980P706k852j1730p367L102N286M08k957m955m714J065O977O265J120l711
166A623m778J663Q928M466o972r511j902M928N287k84o881o154J019N543N325
181B300L534n98n306l339M538O976R11o653q945k723O526O710j756o222j869L194
197b722M829K829j278m376l007J347M423M692K42o697p050J345P287L722m218
212A368p440k843N025P376K266l058l256q49J386L153K123k289n489l140K222
227c445N481K145m964o638M49P794O376o06n387m226O07L808K519j078l571m005
243d741j358L805N745J346m427m717J026N932M036k896o555k691L400M422R60
258C287k654l639j273K309M340K756j434n054l912K040O237K988l995o159j509
$$ plain form
151 7980 15686 12834 1104 -6263 -3161 2125 2533 -424 -5379 -10093 -9028 -2051 4214 5334 1623
166 1623 -3155 -1492 7436 11902 4930 -4581 -6483 -1555 3732 3448 -3433 -9587 -8568 -3025 2300
181 2300 5834 5236 -70 -3409 1129 8105 9016 2363 -6582 -9305 -2779 3931 2175 -4047 -5916 -2722
197 -2722 2107 4936 3658 -718 -3725 -2378 2045 6737 6979 282 -6768 -5423 1864 5586 1368
212 1368 -6072 -8915 -3890 3486 5752 2694 -562 -1411 -25 3128 5251 2962 -2527 -5667 -3445
227 -3445 2036 4181 -783 -7421 -6972 822 7198 6592 1205 -3021 -2414 1394 3913 2835 -736 -4741
243 -4741 -6099 -2294 3451 4797 370 -4347 -3321 2611 6647 3751 -2804 -5495 -2095 2327 3287
258 3287 633 -3006 -4279 -1970 2370 5126 3692 -1362 -5274 -3234 3003 5991 1996 -4163 -5672
273e672M268M830J89l906l117P68L153K668M40k416l682j227L124M304L24m764
289g16n096N10N919M746j522n134k844K056M037K002j418l457k460M85L187K998
305C293m17m043l346J567N041K564k976n021j182L924M571N28l435l718o66K284
321a032K927J181k124l982j614K777M858J783l332m501m21M050L593j002m213
336a052k672J172L233J886r27k739k378O52L529L444k05m049l791P56M444K762
352D065j948m541j878K709L876J298k057l193j354J433K747J510j180l105j632
367c250K296L988J129l286m397p10L464L858J08l305k705N43K660K416J09k560
383C58l092n41K507L142L53l020l035N90M111K967j511l740k083J353K842J298
$$ plain form
273 -5672 -1404 3426 3615 -291 -3408 -2640 513 3181 3621 1205 -2477 -3704 -580 3724 4048 -716
289 -716 -5812 -5302 617 5363 3841 -1293 -4137 -2081 1956 3958 2540 -917 -3377 -2892 295 3293
305 3293 2876 -1167 -4513 -2946 2095 4659 1683 -3338 -4520 -596 3975 4503 1068 -2650 -3316 -1032
321 -1032 1895 3076 952 -3030 -4644 -1867 2991 4774 1442 -3059 -3480 570 4163 3161 -1052
336 -1052 -3724 -2552 681 2567 1640 -1099 -3477 -2825 704 4148 3943 -106 -3897 -3141 1303 4065
352 4065 2117 -2424 -4302 -1593 2283 3581 1524 -1669 -3023 -1590 1157 2667 1487 -1618 -3250
367 -3250 -954 3034 4163 877 -3520 -4230 -766 3092 3200 -105 -2810 -2267 393 2809 2918 358
383 358 -2734 -3275 -768 2374 2727 -293 -3328 -2738 1373 4340 2829 -911 -2994 -1641 1201 2499
399B499j825k975j271J581L146K426p60l483k537J496L488J630j969l533j163
414c250K793L215qk872k818n83K050K867J141j560k032j46K119K677L5l712m004
431d088k3L211K915k45k472k017J152L142J713j083k462j932J14K642K214j007
447A774k915j848J006L099K153j754l573j199K195K642Q59j459k543p58K208K605
463B492N24j682k949j826J518L091P04k147k054K39K615K961l0l304k541M15J897
480g7J731J58k143k357N22K454J635l39k130k349Q29L759K242j397k587j619J95
497a473K136J045j931k606m38J552K455K123o39k782r81J831K172M41j679l170
513a944j504K100K465l05j853j279m5K224L013M39k318j839j91J147J915J79k891
$$ plain form
399 2499 674 -2301 -3572 -1991 1155 3581 2821 -662 -3199 -1703 1785 3415 1446 -2087 -3250
414 -3250 -457 2758 2750 -122 -2940 -3523 -1473 1394 2535 975 -1057 -1203 916 3593 3628 -84 -4088
431 -4088 -4111 -900 2015 1770 -702 -2719 -1567 1575 3288 2205 -257 -2189 -2075 567 2781 1774
447 1774 -1141 -2989 -1983 1116 3269 1515 -2058 -3257 -1062 1580 2439 980 -1563 -2321 -113 2492
463 2492 3016 1334 -1615 -3441 -1923 1168 1872 -275 -2329 -2090 525 3486 3456 152 -2389 -1974 -77
480 -77 1654 1812 -331 -2688 -2166 288 1923 1584 -546 -2895 -2066 1693 3935 2538 -49 -1668 -1473
497 -1473 663 1708 -223 -2829 -3267 -1715 740 2863 2224 -558 -1539 292 2464 2905 1226 -1944
513 -1944 -3448 -1348 1117 812 -1041 -2320 -2365 -141 2872 3311 993 -846 -1037 110 2025 2204 -687
530f87k425Q46K321J492k40k274k100J116L039J395p11j341j493L07K389J268
546B902j915k527r74N25K260J622j675k699k81K023K096J190p37k384n42K084
562I68J591m60j712k470j426J695K590P4j545r87J63J954K563k33k627j585P95
579f52J382J181j35k594k267Q26K007J135j40j270j582J148L099J121j443k052
595b36j381J47J998J116j738j940m1J263J840J363j203k442l87J764J374K45j260
612D82k477n77K224K171k00j258j412n81J584J969m68k199j158K84J497K026J86
629B093k207j540Q52J446Q31m26k117j546J365K428Q47p18j521j422N29K183Q44
646A921j514j655n43P09K049J174j545k060k09J309J407P07j096j980j73J923
$$ plain form
530 -687 -3112 -2266 55 1547 1307 -967 -3067 -1951 1088 2483 1772 431 -1062 -755 1634 2902
546 2902 987 -1540 -2514 -1989 271 1893 218 -2481 -2762 -739 1357 2547 1810 -574 -1116 968
562 968 2559 2099 387 -2083 -3509 -1814 776 850 -695 -1682 -1519 435 2998 2765 138 -1447 -652
579 -652 730 1911 1776 -818 -3085 -2259 -252 883 743 -527 -2109 -961 2138 3259 1816 -236
595 -236 -1617 -1470 528 1644 -94 -2034 -2075 -812 1028 2391 1188 -1254 -1641 123 1497 1742 482
612 482 -1995 -2572 -348 1823 1623 365 -1047 -1628 -44 1925 1457 -742 -1900 -1616 -119 1907 2093
629 2093 -114 -1654 -802 644 1475 1049 -1068 -2614 -1249 1179 2026 1308 -213 -1635 -1106 1077 1921
646 1921 407 -1248 -1791 -1082 967 2141 596 -1464 -1673 -364 1043 1750 654 -1326 -1499 424
662D24J325k62j427j881n05J880J845k10j431j027M3J747J857l82k154j370K84
679a244J130J102j81j839j065J216J739J041m49j638j402P27J877M32j201j445
695a200p63J021K127Q87j309j654m77Q18J516O71j271j808j20J314J310L09j081
712B90j594j40J680J294k89j279j294L2J580J359n74j560j179K74J424J468k22
729A270j681r94P49J330Q64m84j662j080P33J579N99o59j366o42R51J606M73j280
747C06j422l42R25J590N65j272j489j72J140J456J98j229j560j58J248J148J02
764A034j129j156P0J520J149k89j388r46K83J298R28o46j539q47M51J552J066
781A411m68j445q04O68J495O64o81j429p98P17J331N21r42j234m17J012J395L86
$$ plain form
662 424 1749 1487 60 -1821 -2326 -446 1399 1189 -242 -1269 -1226 521 2378 1996 -158 -1528 -1244
679 -1244 -114 988 807 -1032 -2097 -881 858 1899 1450 -188 -1590 -863 1014 1446 245 -1200
695 -1200 -1963 -942 1185 2072 763 -891 -1368 -550 966 1637 366 -1442 -1562 -248 1062 1371 290
712 290 -1304 -1444 236 1530 1241 -38 -1332 -1300 280 1639 1065 -495 -1674 -1400 24 1492 1270
729 1270 -411 -1405 -656 674 1538 1054 -608 -1688 -955 624 1223 564 -802 -1444 -493 1113 1586 306
747 306 -1116 -1458 -533 1057 1622 350 -1139 -1311 -171 1285 1483 254 -1306 -1464 -216 932 1034
764 1034 -95 -1251 -1181 339 1488 1199 -189 -1135 -852 446 1374 728 -811 -1658 -1207 345 1411
781 1411 943 -502 -1306 -638 857 1521 840 -589 -1387 -670 661 1182 240 -994 -1411 -399 996 1382
799A382r75j235j75J013J173J17j281j352l7J277J240O9j221j233M2J098J139
816A041l7j152r99L04J261Q70m25j297q19N11J256P00n76j335o72O38J332O84
834A285p06j305n69Q34J404N28q16j336m98O80J160L57r45j084j86J008J128K47
852A186r91j070m6J098J004m8j177j106J42J064R85k79j146r15K84J265J035l59
870I26j064q38K44J223O29m91j118o49N91J065N27o46j116n32P91J157N29p00
888E28j210l82P71J232K04q43j220k83Q98J130J79r51j017j40R10J074Q8r14q65
907h11J32R55P58k02j142j046L87J213P60k51j090o99L53J160O77m91j099o55
925a091M18J166O94n88j139m32M90R18M73o24j104k68R42R82K47p02j091k30Q16
$$ plain form
799 1382 407 -828 -1003 10 1183 1300 19 -1333 -1370 -93 1147 1216 -5 -1238 -1196 -98 1041
816 1041 1004 -148 -1147 -843 418 1288 863 -434 -1253 -742 514 1214 638 -697 -1369 -731 601 1285
834 1285 579 -726 -1295 -461 943 1471 655 -681 -1179 -499 661 1018 73 -1011 -1197 -189 939 1186
852 1186 195 -875 -921 177 1181 1133 -44 -1150 -1008 56 1041 762 -384 -1299 -1015 250 1285 926
870 926 -138 -976 -732 491 1120 629 -489 -1138 -547 518 1045 399 -717 -1249 -458 699 1228 528
888 528 -682 -1064 -293 939 1143 300 -920 -1203 -305 825 1004 53 -964 -1104 -194 880 968 54 -811
907 -811 -679 276 1034 832 -310 -1356 -969 244 1004 753 -337 -1036 -683 477 1154 663 -436 -1091
925 -1091 -673 493 1187 599 -540 -972 -482 436 909 285 -819 -1087 -145 837 1084 382 -709 -939 -123
944a23R93P7q97r46r6P52J117O2j003q40J37R49Q26n5j050r29L69Q43O78k71r22
965c29p13L89J122N21m13r75n56L75J203N74p10j073l64M06Q83N48o35j072j08
984i27P53R04L63n52j149l21Q29Q59j16o87q74j95J055R73j58q84o23O0Q09Q90
1004A009l5j156o84K99O59O61l4j026p71M24J021M03k87p70o64M56J181L72o52
1023D06p66l68K60J006N07r10r87j47N37P93N45n66j077k5R35O65R8n45r81k18
1043h38R20O60k98o99n51k14Q22J083j63r56k88J56O35P89j44j169p39N18N76
1062A00L52j05q08o64N29J079L35l42n34n92L54J093J81q73p30j72K20Q92M71
1081G86p58q20Q9P46N36L25n45j048p2R56N31j76m28p81k13R71P42m13o51m68
$$ plain form
944 -123 870 947 50 -896 -992 -240 877 939 -64 -904 -767 182 1008 953 -97 -1026 -657 186 864 593 -329
965 -329 -1042 -653 469 990 577 -398 -954 -579 624 1198 488 -585 -949 -543 340 888 253 -819 -927
984 -927 -174 730 1093 541 -608 -929 -100 759 643 -44 -918 -1113 -58 915 757 -127 -750 -690 119 1009
1004 1009 974 -182 -866 -567 92 753 719 -307 -1078 -654 367 770 483 -287 -951 -495 686 1058 406
1023 406 -360 -728 -468 538 1045 135 -852 -999 -462 331 876 310 -767 -792 143 808 906 361 -620 -838
1043 -838 82 742 444 -255 -806 -1020 -198 885 722 -234 -522 -366 269 1058 914 -255 -994 -476 100
1062 100 452 347 -461 -1125 -596 483 818 476 -58 -650 -296 797 978 105 -625 -797 -577 315 786
1081 786 28 -792 -703 43 579 904 359 -689 -761 195 726 550 122 -659 -872 99 841 428 -223 -691
1101f91L2O95Q76k61r17k82L41N19N48j60j095o28N56P33J30j77o30m98O13J070
1121G74Q3n34m70l52K73R01K23r69o43l9L92O11L89n82r17L45Q11M49O8m61q12
1142d60j01Q35L82l42o20n04NP75Q09l81o75j99K54N60O16k65j101m04O08M63
1162B55K66j61q95l72N71Q37jk36o14l65N54R50jp18m43j37L52P20J14p79o47
1183g50J57N30M31K54n40p89J62Q37M10m8n43o79M9P30M44l89o05l91J42O78O41
1204G31l13p27j74L14N98L93l38q89m09N60N58J69k86o18k79O37O99Q4n24m60
1224b74k73M15O78N6n90n54M9M04O07O0o45o44K28O47M97j21n28o01J00P39L57
1245F07k95n53m16J44O96M96l74n79k42K08O37K72l30p45j26L77N51K46l22p05
$$ plain form
1101 -691 -659 36 912 651 -266 -548 -207 312 860 700 -395 -1023 -467 266 396 219 -411 -909 -296 774
1121 774 857 323 -147 -499 -226 675 898 -71 -714 -753 -361 250 639 57 -860 -515 296 745 813 352 -460
1142 -460 -561 274 656 314 -306 -810 -805 -30 779 398 -277 -476 -222 338 954 689 -412 -816 -208 255
1162 255 521 360 -535 -907 -336 501 500 264 -350 -715 -161 789 788 70 -373 -510 -158 562 676 -103 -750
1183 -750 -593 -63 368 622 82 -707 -545 292 702 654 111 -568 -519 211 655 266 -339 -730 -588 90 731
1204 731 418 -309 -483 -169 429 822 484 -405 -814 -254 304 473 187 -431 -710 -73 626 710 186 -274
1224 -274 -547 -132 546 602 12 -542 -493 -89 518 578 -67 -711 -483 164 661 540 12 -589 -489 250 607
1245 607 312 -241 -657 -513 183 679 305 -274 -516 -308 329 601 271 -474 -600 -223 328 574 252 -453
1265d53r5M11N82N6l96n94j20N19O44M4n20l73r1M50N14m8o89n03R4N26N09l4
1287D33m83m45J64N83M04k40n89l98J01O30M17k42m86m13K53O22L03l89n63k54
1307e92L69O35J78l39o18j41M44M48J12m10n26j25M46N93O0m94n34M4M24M81k0
1328D35m70m22j6N62L93p2n46l31Q5N10L60j17o06l61K17N12M12j82m76k72K48
1349a37N55J40l34n64k90L62N40K24l04n51j41M01M43K01m37m67j29M66M51O6
1369D95m10m54m1L41M79k7m74l80L5N02L64jm64l78J62M28L38j57n29l32J30M93
1391A20K74j85m76k77L65M98K18k72n31j99L04N02K44l98m74j45L66L91Jl35m93
1412e02q0N18M40J56m18m11m5M11L96j32m72l74O4M81L91n9n15l22J00L97M60
$$ plain form
1265 -453 -548 -137 445 501 105 -489 -609 -90 554 598 78 -295 -386 64 578 530 -159 -662 -568 -42 467 433
1287 433 -50 -495 -331 252 656 416 -173 -571 -470 160 577 335 -151 -564 -311 311 614 225 -338 -592
1307 -592 -223 412 590 251 -367 -508 -64 384 496 86 -440 -565 -119 474 534 40 -494 -450 -26 455 435
1328 435 -35 -457 -473 89 482 410 -136 -467 -382 128 488 371 -235 -596 -379 133 545 363 -113 -385 -137
1349 -137 418 558 224 -340 -630 -268 272 496 192 -359 -500 -99 344 545 108 -359 -488 -22 429 495
1369 495 85 -369 -410 -69 410 383 -91 -471 -436 66 430 429 -35 -413 -251 177 515 358 -171 -503 -373 120
1391 120 394 209 -267 -544 -179 319 537 265 -266 -465 -161 341 585 187 -287 -432 -66 325 326 -9 -502
1412 -502 -582 -64 376 532 114 -297 -342 69 465 333 -139 -513 -449 32 423 364 -151 -473 -373 24 484
1433D84j49n14k00K63L35K58j73m75l37L31M63J29k50l95l22L27M94J59l62l32
1453b66j61L27M98R4l98m23k6L48L40K0l09n23J6M47L13p5l21l16L0M95L91j20
1475C81m16k81L4M26L09q0o04k01J57L15K80j33m92j73L36M05J55j22l48l44L87
1496iM77n1l52m19j87K73N31J15m37k27n9K46M42J44m07m16R1L21K94j0l34m77
1518d51MM96J93j64k10l28O4N79L99k29m21j44rL22L89k36n95j48J85L61K61j00
1540B18m58j68L59L71Rj95k56k83L15M58ol56l49l1R8N25J11n03k99K51K30L32
1562C73J13l66m51N4L35P0L2k50m10Q2N33L23j69k80j67oM60K34l45n28MJ54K01
1585dL87j91n09j33L87K32J23Pn21j89M09L99m8l23k34k52K61M75j51l51p3M8
$$ plain form
1433 484 335 -179 -379 -116 219 477 304 -171 -508 -177 286 415 165 -230 -552 -225 269 428 66 -266
1453 -266 -427 -100 398 492 94 -329 -355 -7 333 353 44 -479 -463 -16 297 222 -99 -415 -385 110 501 381
1475 381 -35 -316 -282 144 453 373 -231 -432 -275 40 320 187 -305 -478 -142 263 418 296 -52 -396 -9
1496 -9 468 417 65 -354 -541 -268 263 378 -59 -286 -345 -99 343 487 80 -336 -245 76 370 360 26 -451
1518 -451 -447 49 242 78 -132 -460 -396 183 582 353 -68 -212 -221 101 490 254 -341 -489 -304 57 318 218
1540 218 -240 -408 -49 322 331 136 -120 -403 -88 370 364 8 -341 -372 -274 251 362 -141 -440 -189 41 373
1562 373 486 120 -331 -277 58 128 160 -90 -500 -418 115 438 269 -11 -178 -184 276 510 165 -363 -359 -205 -4
1585 -4 383 192 -317 -450 -63 169 292 299 -222 -411 -2 397 349 26 -208 -460 -199 276 125 -226 -299 -251
1607b51K77M36P1m47m22J62K52J78N1m11m41J89N07R2p1j49l33M9M68J90k48k17
1629f8n2j8K86L11k97n09q7K58K13K01j29m66n8N12K22P7r6l46l05K59L43q0k49
1652g8j33j51K25M98K6m42k13J37J74K49Jm14k31J74L58K9L0l21l40J59N11J19
1674C67j22k84k61M1M21J40l33k39N9O6K20K67k28l94N0L19J10P0j04m40j57M74
1696D2K45j48k21k73n3L78M29p1l33l7j09J46K80j27k81j55J09K23J80J3m05k94
1718d62K51M43O0r8k40k08J36M12M7k73k74r6j4L78K29k17l29K1J33L14J56k13
1740A56l83J01L68J03q4l24k45j55M29J57N8j71j34o3K98L74r0l98k63N1K58K19
1762B62j37k81j77J67J96P8q5j28j07K53K55J21k06l54j97J69L66Q0k98k88k2
$$ plain form
1607 -251 26 462 533 86 -336 -174 78 256 307 -104 -545 -356 151 243 172 23 -310 -261 207 397 149 -68
1629 -68 -120 -138 148 459 162 -347 -434 -176 37 238 109 -357 -415 97 319 396 300 -46 -351 -92 251 171 -78
1652 -78 -211 -362 -137 361 387 -55 -268 -131 43 292 293 -121 -352 -178 180 209 239 -82 -422 -263 248 367
1674 367 245 -39 -300 -259 162 302 -31 -270 -211 -145 75 342 114 -280 -230 89 199 269 165 -275 -432 42
1696 42 287 139 -82 -355 -408 -30 399 328 -5 -42 -151 -5 275 148 -133 -288 -179 44 224 237 -168 -462
1718 -462 -211 232 292 194 -46 -254 -118 294 341 68 -206 -302 -316 62 291 74 -255 -234 -101 213 369 156
1740 156 -227 -126 242 345 261 -63 -308 -463 -34 123 181 10 -124 -187 111 485 395 -3 -266 -215 43 262
1762 262 125 -156 -333 -166 30 108 23 -105 -212 41 296 417 211 -143 -340 -171 195 275 -23 -311 -333
1783c33K78K51O5j97k66Q2J38K17J23k14k69j53K66J80q7l02j51J16M27K01r6
1804B76l64j55J24J97K04n2k87k49P9K07K27j35l26j71K40L97P5q1k77%J66J67
1826B62l5j88k60k0P8K39J18k65l03M0K64L68J34k18l63P4J48J43j50k31j31O
1848b90K00K06Q3j70j40j7K37J64l7l64j63J88L57N6k30l41j06J24J65K04m8j16
1870c8j10Q1K90J45j28l42j42J84K28k2j97k01o1L36K25m1k50r4O6J10J64P5k51
1893B7k58m2K82K69l5k45k53J9K60J05j32j55LJ46K17R6q2k42j93K2K02K34j90
1916E5k54j14K08L93J05k37l57n2J65K14M8j81q8m8J27K46l6j22k82k6J87K15
1938A66Mk86j23R4L42L1q0k14j00J6J88J64j02j03j86N7K09K08r7l32j06P7K07
$$ plain form
1783 -333 -55 196 261 64 -202 -120 18 235 358 144 -125 -278 -12 168 81 -221 -372 -256 171 372 276
1804 276 -88 -243 -119 78 282 230 -57 -306 -227 -20 207 72 -254 -425 -185 212 287 206 -71 -71 95 262
1826 262 227 39 -221 -241 -163 76 194 -71 -374 -334 -70 298 432 214 -149 -75 73 216 66 -165 -296 -290
1848 -290 -90 116 199 29 -111 -128 109 273 236 -128 -291 -103 254 310 80 -261 -367 -243 -78 126 78 -38
1870 -38 -148 -67 223 368 240 -102 -244 -60 168 146 -51 -252 -313 23 248 207 -43 -137 -71 39 203 278 27
1893 27 -231 -273 9 278 243 -2 -255 -236 24 129 -3 -158 -155 -9 208 304 222 -20 -213 -191 11 245 55
1916 55 -199 -313 -105 288 393 156 -201 -253 -88 126 174 -7 -95 -143 -16 230 194 72 -210 -236 -49 166
1938 166 170 -116 -239 -145 197 228 148 -66 -166 -150 38 202 100 -3 -189 -132 77 285 188 -144 -250 -173 34
1961C4J57j81j93R5J78J35O3j68k76p3P7J96L5o5j53j21K56L30p5k37j63m5K30
1984C6J06L1k22o1K7J11J13k2k04j98M0K94J80n4k18j63J29L56N2k53k41q0J3
2007b28J85K04j01j83k1L1K05K00j29l39l2K46J60pk06j94mL27Q6j44j40q6qJ61
2031a7K62Nk56r0lR1K22o8k41k04J23K04R1k2j29j30J42K58o6o0j65j59L1K39
2055E8J56j95k44l6J09L47Q2k27k68J11J59M1O1k0k33o4J57O9l3r2j59o5K94L20
2079C28j16j72j44L1J80J53q3k55n1P7M8Q9P0k36j29Q4K08R3L4j61k46J82K58
2102B42q2k34m6j6k0K20N4j97j11Q6OK12J65j78l06L5K23Q8K4j46k24j2K83M3
2126A09m7j13p4O7J26J67r5j66n7p7J63K77j03l06o9J58J38O8n1k08j27K14J65
$$ plain form
1961 34 191 10 -183 -88 90 225 288 120 -156 -229 -152 44 79 14 -139 -260 -4 326 251 14 -149 -194 36
1984 36 142 173 -49 -110 -83 28 141 119 -85 -283 -243 51 231 177 -41 -204 -75 281 333 80 -161 -241 -228
2007 -228 -43 161 60 -123 -144 -113 92 292 163 -176 -208 38 198 191 -15 -209 -213 114 200 56 -84 -170 -178 -17
2031 -17 245 250 -6 -96 -99 -8 214 146 -95 -299 -176 28 119 97 -32 -162 -20 238 172 112 -53 -212 -181 58
2055 58 214 19 -225 -261 -152 195 277 50 -218 -107 52 93 154 134 -99 -163 -6 63 30 -62 -221 -286 8 328
2079 328 212 40 -104 -73 107 260 177 -78 -129 -52 -4 85 155 -81 -210 -126 82 175 209 48 -198 -16 242
2102 242 160 -74 -120 -136 -156 64 118 -79 -190 -104 -98 114 279 101 -205 -170 53 141 165 19 -205 -217 66 109
2126 109 62 -51 -125 -58 68 235 140 -26 -83 -160 3 280 177 -129 -198 -40 98 166 115 -93 -220 -6 159
2149A59p1k1j02k21P6L17L6j52j99P9J9K35P1k41j49R1J74P5J5j82j51RJ60RM1
2174G7r2j42K3J93K35j44j99l2p1J82J78j45j79n4R9J40M1l7j59j10K23P9J9K4
2198A49j78k29J94K03m5j55l6l6J36J68K1j84r6OL6J68R1k11k05J27Q5J00N1j83
2222b3j32N9J57J33q2j32j49qK24J24j62j01Lm9J82P7p6j64n0J07J72R5rk88q3
2247a75K39P6j12k7j38p3J76K33L2j76j51LQ2J38Lj90r5R3J40L9m1p5k06P8J02
2272b5Q1Rj0j61J8J70P2n9j89o6N1J67N1o1j92K7L5J05J14n6j47n1R8J10O0j07
2298D4j57q0J77J23O1j11j41n0K6K18jj21r0J8J08J79l4j00k30L0P8J62k5j40
2322e6j46J55J52K2p5j55m6K1J99N4n1r7n0jJ43J9k9k24J5J02J30J59j27k16J5
$$ plain form
2149 159 88 67 -35 -256 -180 137 173 21 -178 -99 -80 155 226 -15 -164 -73 101 176 191 9 -142 -133 27 36 77
2174 77 -15 -157 -134 59 294 150 -49 -81 -152 30 208 63 -116 -170 -71 69 110 73 -86 -196 27 106 125 149
2198 149 -29 -258 -64 139 94 -61 -97 -133 3 171 192 8 -88 -82 -46 122 213 2 -203 -76 9 109 160 -23
2222 -23 -155 -96 61 194 112 -20 -169 -177 47 171 9 -92 -89 -138 44 121 45 -119 -169 -62 110 205 196 -92 -175
2247 -175 64 140 28 1 -137 -210 -34 199 231 55 -96 -93 -11 127 130 -60 -155 -62 78 117 76 1 -205 -127 -25
2272 -25 56 65 55 -106 -88 82 154 95 -94 -160 -109 58 109 48 -144 -117 -82 23 137 81 -66 -117 -19 91 151 44
2298 44 -113 -193 -16 107 168 57 -84 -134 -108 110 109 -12 -102 -84 24 203 169 69 -161 -131 -53 109 84 -56
2322 -56 -202 -47 105 127 52 -103 -149 -128 71 125 74 -23 -73 -74 69 88 59 -165 -150 -48 82 241 114 -102 -87
2347h7J35P2J3j24p5p8O3J32J03j86o9q9J95J81o8j58o9oJ55J6l4q1n9R6O6P7
2373A21j7j65p3L5J30Q4k2j30q1P7J74Q8j38j92o5J17J60K3q1r8k5J04M9Q8j73
2398a0j77J7J40J37J1p5j98P7J48L1k4r5j46P9O7L7Q5j57m9N2N6J09q5j07J2K4
2424d1J07N0q4j93L9K7J84Jl6j46o8N7K42m4m2j00j22J71J03l2p0j64K4R6J41
2449A00pj65p6P1R2R3j4j17j07N7R2P4k1j04j00K9J03J14m1r2q5J12N6J1J1j68
2475h2p9J62M2M7r3j01q4J47J14K8n4j89L6J43P8L8j46j11m8R7L6O7k4j67J9J73
2501D9P3l8p3l5QM7J07j09q2j08R2N1J74p9j23o5O6J01L6m8r8k4N6J05N0r0q4
2528d1r5J00R6Rj41M8p2P1J85mj92j25N6O7Q1K2n0j79M7J56k0ml5o3N3N2R3p0
$$ plain form
2347 -87 48 120 133 9 -66 -144 -81 51 154 -32 -101 -190 5 186 118 -40 -109 -115 40 56 22 -59 -118 -22 44 121
2373 121 104 -61 -134 -99 31 115 93 -37 -118 -41 133 221 83 -109 -174 -57 103 126 45 -53 -78 26 75 163 -10
2398 -10 -187 -170 -30 107 118 43 -155 -78 70 101 77 -18 -164 -85 -18 19 104 -53 -102 -50 6 115 30 -77 -65 -41
2424 -41 66 116 32 -161 -122 -95 89 90 54 -92 -160 -103 139 95 53 -47 -169 2 105 73 3 -161 -137 -41 100
2449 100 93 -72 -148 -77 15 108 94 -23 -130 -73 19 93 72 -32 -132 -103 0 114 73 -19 -104 8 64 75 86 -82
2475 -82 -161 1 43 90 -3 -104 -188 -41 73 101 47 -142 -106 37 115 153 7 -104 -152 -55 -19 48 24 -143 -124 49
2501 49 122 84 11 -24 -16 31 138 29 -53 -161 -69 -18 156 77 -46 -111 -45 56 92 44 -54 -78 -22 83 133 43 -41
2528 -41 -136 -36 60 69 -72 -24 -96 -25 160 156 -36 -161 -105 -38 43 65 15 -164 -117 39 19 15 -20 -83 -30 22 115 45
2556D5r2L8o9J25R5r1j56L8j0J20J10q9j65l0J59O7j4M4k07m8J05M3M2o0l3j09
2582a42R3J18K1j63k5L3OJ62L6j84j1L0O8K1P4j34j29PK26j3k2m1j04l9J43Q1
2608A12p9j6o2k0M5J98j17k11L0J34k8M7l6j45O3J38R8r0j7n9j10J17J79r2j16
2633c7J9r4O5J26Op3r1P6MK8J07j97k9K1J81l5J6p9r4j1J10P1o9n9m7k5K05P4
2661A69j11j00l2j3N3J08ok15O9M8L6P6k6j40l0J54L7q1K1p9nN9J46q1p6p3J0
2688h2J4J40R7j83k1L0M1L7M7r7j69M9J40j0n7m6q5R2J65L5j62J4m7N0L6J00q8
2715D0j49O5Q1n9P0n5q8n8J51K5MK6j17J4J09O1p6m8n0k1L7J07qj03m1M1K8J16
2743A02Rj62jM0P7rm2k9n9PP9K8n4m5J0M1J38k4j72M0m2M7K8J19p3q1o8Q5O8N5
$$ plain form
2556 45 -47 -9 -78 47 142 51 -105 -67 -77 43 153 64 -101 -131 28 95 81 125 -82 -130 -25 18 60 0 -33 -142
2582 -142 -49 69 90 -73 -98 -65 -59 103 139 -45 -56 -26 42 63 137 3 -126 -119 107 94 72 31 -73 -112 31 112
2608 112 33 17 -45 -65 -20 178 61 -150 -120 14 -14 33 -3 -148 -85 53 151 61 44 -15 -125 -8 171 79 -37
2633 -37 -18 -112 -47 79 85 12 -79 -3 1 29 136 -61 -90 -69 112 77 93 14 -80 -91 19 90 21 -38 -85 -110 95 169
2661 169 58 -42 -74 -87 -34 74 68 -147 -78 -30 6 82 56 -84 -114 40 77 -4 17 -62 -67 -8 138 57 -19 -92 -82
2688 -82 -68 72 169 -14 -35 -5 36 73 120 23 -146 -97 43 33 -24 -70 -155 -63 102 137 -25 -11 -58 -8 28 128 40
2715 40 -109 -44 37 -22 48 -7 -95 -153 -2 23 27 53 -64 -50 59 120 44 -4 -54 -75 -38 69 61 -42 -83 -42 -14 102
2743 102 111 -51 -52 -12 65 56 14 -15 -74 -67 12 40 -14 -59 -49 -8 130 106 -66 -26 -68 -21 7 126 53 -28 -96 -11 57 112
2773A12o1r2o6J57M7m0jn4m4K3P1l2j00n0J24m1J32j1j14PK4J6N6l1n9j57R1J44
2801E1k9o6Mn3J03Q3L5r8n5k9J4P8K9m8m5k3J24k0N7q3r3K5P1j6R7n9r5k9J2J14
2831E6m6j6r3Q4L1M3J7j10o4J00j3J15k2j62l6Q3J00K9p0q6K3lO4J07j05o6o6
2858a06O2J68k4j8j23K4L0J08l2j25p0R6L8MQ3n7j24m1J57J4m0k1r6N9L6N5K5
2885H2j31m0K2Q8N1m7o6o5P4J02JJ6j20q0R8K8J7M2j63L2P4JQ6j06l0m6P7J4L0
2914D1m3j06N7O3j1R4q1k6m9M2k2R2r3n5M6O4R0p2m9o0j2J08kN5p8o0Q2P5j5l4
2944D1l9p4M9%J00l9p7m7J05M4K4n3j18j2O1R2k7jp6k2R5J6J7lq2l7N4J00o2p7
2974d8n9O8O2L9l1nj44P0M7O7l9o2K7l1P8P3j02k3l0L2N9M7o2q0k0M7P5J7q4j17
$$ plain form
2773 112 51 -41 -107 50 97 57 56 2 -42 -19 52 20 -80 -130 -6 -47 85 74 -40 -33 -9 7 63 32 -27 -184 -93 51
2801 51 22 -44 -40 -93 10 93 128 30 -25 -54 -40 38 67 19 -26 -49 75 55 112 29 -64 -39 32 16 113 54 -41 -70 -58 56
2831 56 10 -6 -99 -15 16 59 76 -34 -98 2 -11 104 82 -80 -116 -33 67 96 26 -60 -37 -40 24 131 26 -40 -106
2858 -106 -44 124 100 82 -41 -17 13 121 89 -36 -106 -10 28 32 115 58 -66 -107 50 64 24 3 -93 -34 2 57 82
2885 82 -49 -89 -67 21 72 25 -41 -106 -32 70 71 87 -33 -113 -15 13 30 72 -91 -59 15 16 102 -4 -34 -80 -3 11 41
2914 41 -2 -108 -51 12 1 95 14 -12 -61 -19 -41 51 -42 -97 -51 13 103 31 -18 -78 -90 18 16 71 -7 -67 15 90 75 41
2944 41 2 -72 -23 -23 77 38 -39 -86 19 63 87 34 -84 -96 -35 57 30 29 -47 -69 26 42 59 56 -26 -63 -9 91 29 -48
2974 -48 -107 -39 23 62 31 26 -118 -48 -1 66 27 -35 -8 -39 39 112 10 -13 -43 -11 48 95 33 -47 -67 -20 55 72 -12 -129
3004a29RJ08Q2n0qm9m8QJ19J8j06l7L5O7J08l9q0j33N9K4J06J3j51LQ5L7L0p9
3032Bn4k2j8J49j1l5j7j5n8R0O4k0j39jQ7M4l1nn2r0Q8Q4j6o9j4k9Q2j4mqk9m
3064f5M6J02mj60J7M9O1KO6o4j22K7M9M8j1l7q7M9J24Nj18j0j4k0Q9K8n5j1q5
3093a01Q1JJ01p4j58J06N7RPO7j83L7P6L9p9k1N6p2Q0K3j3l1j1J9J4M5k6n1nN5
3123D8k2j5N3q6q3J45L2k7p7Jm3K9Q4J9r5J05j21k8J16j0j5r0L8M4k0P6Kj58N0
3152d8O9K7o1Q1j05r0J63O2o9m8J0n3O5L1M3j44l1L7P0M4m5j4o9L6kQ7J4o7m5
3181e2O0J0lk0Lm7MP0j0j2o0L3jN8M5j21k0J7N3jM1k3n4n1O8N1j8n5k6LN3P6o3
3214Hm5lJ9jM1J6j16RR7n7O7Jp1l9Q3J5j1K5j9j20N4R1l0p0m6J29k9O9o3n1K5
$$ plain form
3004 -129 -120 -12 70 20 12 -37 -85 -77 42 60 -46 -83 -48 19 127 88 8 -125 -66 -42 64 77 -74 -71 14 51 81 2
3032 2 -52 -74 -92 57 46 11 -6 -21 -79 11 75 55 -84 -85 2 46 15 10 -42 -132 -44 40 24 -45 -59 -88 -6 -20 -24 -32 -61 -65
3064 -65 -19 83 79 -81 -64 -15 46 48 114 50 -72 -45 4 52 41 4 -83 -34 90 95 -23 -33 -47 -67 22 50 -5 -16 -101
3093 -101 -20 -19 82 8 -150 -44 13 22 29 96 -87 -50 26 65 -14 -35 21 -51 29 52 39 8 -3 16 30 75 49 -2 -7 48
3123 48 26 11 64 -22 -105 40 72 45 -32 -31 -74 -45 39 58 -37 68 -53 -81 35 25 10 -80 -42 2 -18 58 60 -98 -48
3152 -48 21 48 -13 68 -37 -127 36 98 29 -19 -9 -62 3 34 77 -67 -98 -61 9 53 8 -6 -75 -39 -41 46 60 -7 -52
3181 -52 8 18 15 -5 -2 -49 -45 25 15 3 -57 -24 -25 33 78 -43 -63 -46 7 6 47 24 -30 -81 -13 38 20 -35 -61 -58 -5 71 8
3214 8 -37 -40 -21 -22 19 35 -81 -72 25 -32 35 36 -35 -74 9 24 13 38 19 -101 -47 44 14 -56 -102 27 -2 67 4 -47 -22
3245b2j1M6M5k3K1j23J5L4lK6L9r7k2J08k5j5l7M2l4N3O7%p5k6L7k6K9K4j23J7
3275e9K1P7J3k2o1m0N9Q3k1l1j0n3jR3j7q2K2K5j9K2N0r8PM5jO1k3n2Jk5R3q8
3307c1K8l4n5K2MJ35p0j7K0J7l6O0l4r1jJ4R9N1o3p5N7L9m2M4j02pJ2K5R0m2Q
3338B5m4k9K5N1J7r3O5l0OL0J9o8qLK9O0o4rj3q0R9M9q9J1O6n2RR7p9m3Nk1R0
3371C4k8K4l8k2N7j7L7p1J4k3J8N3j5K7o2QL4J4K5j04PJN8k7L2m1j9K3L6j2J5
3402C8l4p7M8R5n7Jo9J3nK2N1J1rm0m4Q8k1K3m1j8K3M1rnj9rK1L9m4l2jj08O0
3435f8P5K9j3n2lj1Q4prq5K6N5m2Q3j18M1%L2%m7K4RJ3LL7Qm9m0L7M1J7n9o1J5
3469c5kR7J8n3j2j39J41J9m1j3k9j1jP0K8m2o1M4K6N9l9Rm1l0M6jL7k1mr4N2Q0
$$ plain form
3245 -22 -33 13 58 35 56 -67 -52 -18 -21 5 44 -53 -75 33 8 -7 -44 -2 -36 17 84 84 9 -17 20 -6 23 47 -76 -59
3275 -59 -38 39 52 30 -31 -71 -12 71 50 19 9 -44 -45 48 31 -51 -29 -4 -23 -1 49 -49 -42 3 2 63 40 -12 -11 -36 57 -31
3307 -31 -3 -37 -92 -70 -66 69 -1 -18 2 19 -17 43 9 -82 -83 -69 30 81 18 -57 0 39 -3 41 -61 -68 -56 -31 59 17 25
3338 25 -19 -48 -23 28 45 -48 17 -13 -7 23 42 -26 -34 -31 -2 58 -6 -15 -28 -108 -9 40 -49 -38 28 -24 -15 82 3 -40 -35 -56 34
3371 34 6 30 -8 -30 27 10 47 -24 -10 -33 -15 38 23 50 -12 -4 30 44 69 -35 -28 -27 31 4 36 -5 -24 -1 35 23 38
3402 38 4 -73 -25 70 13 14 -55 -42 -47 -25 26 37 28 -12 -56 32 11 34 -7 -25 -2 39 30 25 6 -3 18 57 13 -19 -20 -128 -68
3435 -68 7 36 23 -29 -32 -43 41 34 25 -60 -34 21 -21 62 -56 -15 -15 17 17 -30 -6 3 16 19 56 64 15 -25 12 53 70 11 -50 -35
3469 -35 -37 60 78 25 13 -126 15 34 -7 -20 -49 -60 -61 9 37 -5 -66 -22 4 63 24 33 -8 -38 8 7 44 23 19 -75 -23 57
3501E7o2k3Nj8M7Q4m7k2m7j4Q0qk2m2k5K4k5R4j2q3j3N6RPOm4J0j4L7K4jp6K6
3534c2P8J7m7j5k7m6K8J27o0k6l4j7M9J32j46K9o1P6l0l5P7l8m2N9O7r0O8j20
3562e9J3J6O4l8j5Oj3j3P0J3lj26J21nLj6Nj0l8N2J2p2J9l0N0Q3m9j6m4M3l3K6
3594A6L4k9n0MpKK6O6j9r2J3M1RL3j6j03P1K9q0P9Rn0m9J12nq3L1K9Ll3P3n8j14
3627a08J02J7j9P0l9qo6P5k2jOo1KO0J7k1q1J03n1K2J00j38No3J16jl4K6n7mL7
3658a6j1M0Rn1Kl5R6l9rj2J4NN7Qn1m2O9l2J5Q8q6m9L9K0K3j7l3m8jJ40o3k5n
3691@k0o9R1K5p2k9N9j7M4K0Po4m1J11p4J1J8q1K2O1J18r3n4O5j08M0J13n2k9
3720BM0l0j0j3P1j16k7J33Kn7K1No9K6N6k6K2k8n1K2K2kJ9l4l5l7R6L5Qj26O0
$$ plain form
3501 57 -5 -28 -23 -41 6 90 43 21 -26 -40 40 32 10 -32 -57 -33 -58 36 24 -59 -72 -16 -7 0 6 -38 -28 -42 -5 19 18 -58 -32
3534 -32 46 63 16 1 -26 -72 -44 83 23 -3 -37 -54 -5 127 -19 10 -51 25 -5 -40 37 -1 -43 16 83 -7 61 -59
3562 -59 -46 -30 34 -4 -19 -13 -26 -39 31 44 41 -85 36 31 34 18 23 13 -25 27 39 -33 -14 -44 6 89 40 24 -20 23 -10 16
3594 16 50 21 -29 -25 -32 -30 -4 62 43 -49 -36 5 14 47 31 -72 -1 28 -52 27 36 -14 -63 49 44 -39 -8 21 24 -9 64 6 -108
3627 -108 -6 11 -8 62 23 15 -51 24 2 1 7 -54 -52 8 25 4 -77 26 -25 -3 97 -41 -36 -99 17 16 -18 8 -49 -53 -16
3658 -16 -27 13 22 -29 -27 -62 34 -5 -14 -26 -12 -7 50 58 7 -35 34 2 17 105 19 -30 9 29 52 35 2 -46 -47 93 30 5 0
3691 0 -20 -89 2 27 -45 -74 -15 -32 12 32 39 -25 -66 45 -29 -18 0 -81 -59 2 120 27 -27 38 -70 -30 83 31 2
3720 2 42 12 2 -11 60 -56 -83 50 52 -5 16 21 -48 -22 34 8 30 2 -49 -27 -5 -7 12 -22 -57 -94 2 37 45 -81 -21
3751b1J5Oj4O5p3l7R2K0l4k5m3k3P0K0k7qP3o0L7j1jp6L1Ol9K5Om1K0M4m7J0K3
3784a7N0m5j6Q0o9Jl0J6j0K2R1q1n0K3K3N7l4L1m8PJ0P7m7l6Np4J44o1l3L7p6
3815e3O3l9K5K1m1K0Mj0JN2n2r0N4M3L4N1m6m3nJ03o8j6ll9K2MR3q4k4J2k0L6
3847EM3n4j0L8J7m3L4K1j26J1k2N5K9OrlOJ4K5o8K7m2P8J0l6j5LK5j2lLL0o3P5
3881D9k1K0j0Nj3k7K3kk6J3k5L0j1KOk8n5J04qL1n5O5j00L2m0O3j7K9m6k1Q1r0
3913d2K2l3L6k7J23r4K5k3lNK1J3j7l1K3qR1q3j5k4N8M8J2o5j8j3L3OMl6q4P2
3945b4M0oNn5k4M5J8J0j8jJ4Oj5J7K4l0J7j05N7P7q7L3k4K2jK1K4q7M2L1m3L1
3977A4On1L2n5P6m4J6j4j2N7J4N0r8l3J8L7o1K9K6m5K0J3K2lL1j07O4L3o1J4k9
$$ plain form
3751 -21 -6 0 -14 51 -22 -59 33 53 19 -6 -49 -72 -2 18 -9 -17 56 -4 33 22 21 -55 -24 -18 -57 -32 -26 -67 -47 -3 -50 -40 -17
3784 -17 33 -12 -28 52 -17 -16 -46 -30 -40 -18 73 -8 -58 -35 -12 45 11 42 -6 1 11 88 41 5 10 -64 80 19 -14 23 -53
3815 -53 10 -29 -4 17 -24 -4 0 -10 -9 43 -9 -99 -45 -2 32 83 37 -6 -11 92 24 8 5 -34 -12 -8 85 1 -23 -11 -31 5
3847 5 48 -6 -16 22 39 -4 30 51 -75 -64 -86 -31 -2 4 -5 -8 -2 12 37 -31 -4 -46 32 42 6 -9 -6 19 7 4 7 37 -26 49
3881 49 28 48 38 43 30 3 26 24 -2 11 -14 16 5 7 13 -15 -70 34 26 57 2 67 -33 -1 -41 22 5 34 -12 -33 48 -42
3913 -42 -20 -53 -17 -44 79 -15 10 -13 -16 -11 10 23 6 -25 -2 -10 81 -2 -17 -41 17 65 77 12 -6 -19 14 20 24 -12 -96 -24
3945 -24 16 10 15 -40 -64 -19 -1 9 -9 -10 4 10 -5 12 36 6 23 -82 -25 52 -35 -2 -26 -4 -5 16 40 -47 -5 26 -17 14
3977 14 20 -31 1 -54 22 -22 -6 -20 -32 25 39 89 -9 -42 -24 13 -48 -19 7 -38 -18 -5 17 14 45 -62 2 35 -26 -12 -41
4008d1N4p0P2J3Oq4N3N4m5L0l4k9N2j2RL3m9l5J3o4O8pomk3K1P4j28R1k1J1Rl1
4041b0j3k0M1n2J02j8nkl1j2RK4o0N0j4k3M2m7P9jo6J2N6M4r3LlM3pK4m1kJ1j9
4075ik0K3J1j4k3J6k2L1n4Q2m5M2Kl0Pjr4J23m2N2j7k8OJ6j2L7l5j5J8m0L9M3
4107D7k6p4P5K5o2O7n9L4m4R6l2k5rk2k9J0J08m9ro5M4j6N5j2o4K6L4j3oj8K5
4138A2p3P0K1k3n8O8o5P8j6Nl5m1R6k8L0j8n9m7M2N1J7j7M0j12M0M4Oq9P9l7J0
4169il3J3m2L3j2P1M%j7jjj5J1J2rk4nP3j0l2K4p1j9J7J25j30m1P0Mo5J20Qo3
4202a4%l3OK8O0m9p0M5MJ6j6j2n6N4K2j4mPlqM3N7o4L1K5k1l1M5p8%L7K7k9J6
4236B1k5l4rJ07q3P5l6K2o3kR0m9nm0J9OON3o3o4Q1oJ3j0Mj0K1J6J1j06K9L2k3
$$ plain form
4008 -41 13 -57 15 28 34 -50 3 57 12 42 8 -21 31 19 28 61 12 -23 -10 -74 -6 -13 -19 -23 -46 -25 49 -79 12 -9 2 11 -20
4041 -20 -33 -53 -12 -64 38 20 15 13 -18 -30 -21 3 -57 -7 -21 -44 -2 -49 30 29 -37 -25 31 75 -18 -15 -18 25 18 42 1 -1 10 -9
4075 -9 -29 -6 5 -9 -32 -16 -38 -7 -61 21 -24 18 20 -10 -3 -4 -98 25 -17 35 18 -10 -4 12 0 37 2 -13 5 -35 4 47
4107 47 21 -53 22 47 -15 52 -7 27 -17 79 47 22 13 -9 -38 -28 80 31 22 -43 1 -15 40 28 -36 -10 24 11 5 -13 12
4138 12 -61 9 30 7 -51 17 -48 30 14 19 -16 -57 39 11 41 23 -36 -83 -41 10 27 10 50 -62 -22 22 28 -61 18 -19 -9
4169 -9 -42 -29 -71 -38 -50 21 25 25 8 7 6 -9 2 14 5 -19 -24 49 39 7 31 -40 -59 -42 83 -47 -88 -18 -14 -79 41 49 -14
4202 -14 -14 -47 -41 -13 47 -2 -72 -27 -23 -7 -23 -35 -91 -37 -15 -29 -33 -26 -29 -37 6 63 -1 30 55 34 3 48 -30 -30 7 34 5 21
4236 21 -4 -38 -47 60 -23 52 16 38 -25 -27 63 14 9 -31 -12 -6 0 53 -10 -74 7 1 14 4 8 -2 19 35 46 -60 -31 1 -22
4269b2O2M1o4ql6lJ5J1J6j8k7J5J9L7n3M0k2J8nm2N2m9jk2M8J1j5l0l9QO2m1K1
4302b1N3p1RP0l2Km7N7m5K2K1m6k3R5lJ7m8r4J07nl3J8j9M8k5J2rQ4o8m3M5l6
4334hL7J0m4qpK6K0m1M5p5N5k4K8k6j0rQ6j1n3K0n9M4L6n1RK3n7O9mkk1N4J2p5
4368a1l4Q9j1Mj6p3N0j5M2l7jK1K9l7L0K1o1J3J0l3RK4l3k0O4Pq1L6J4J1K1k2
4400A0mJ2n7L9L3k8K0m0nL2k9J3j4j7MN3j1M1l5o2j3O4k1pK9q1R1m4J9J2K4k8
4432@j8JM2o3N5Jl5KJJ3Mn1O3N0o3J5Lj5LP6q4j7O1o5K0K0Nl0J4j5J1mJ8m5L0
4467COJ0mj0Nj2J3l2Q6m6k4ok7M9J0K9l4m6J4k8P2l3k1L8mL5K0p7l0O3k8oK8m7
4501c4J5JN5K8m1Or8J16q0L3K0o1NJ8M9m2L7j1No5j0K4J8o4O4L4m4o1J49l7k4
$$ plain form
4269 -22 40 81 17 9 -27 -30 -15 -4 12 -6 -33 -18 1 38 -15 25 3 21 16 -26 26 -23 -24 -46 2 13 -2 -32 -71 -63 -1 -42 -21
4302 -21 32 -39 -30 40 8 10 -37 20 -25 -3 18 -28 -51 44 41 58 10 -84 23 18 -15 3 -16 32 7 19 10 94 26 -17 28 -8
4334 -8 29 39 -5 -13 -20 6 26 -15 30 -45 10 -14 14 -12 -22 -31 55 44 -9 11 -48 -4 32 -19 -10 13 -44 25 21 19 -2 52 64 -11
4368 -11 -45 44 33 37 21 -52 -2 -17 25 -12 -13 8 37 0 30 51 -10 3 13 -20 -11 13 -20 -40 24 31 -50 -14 0 11 32 10
4400 10 6 18 -39 0 33 5 25 -15 -20 12 -17 -4 -18 -35 -31 22 11 52 17 -45 -58 6 -15 -22 7 -74 17 -27 -8 4 28 0
4432 0 -18 -17 25 -38 17 18 -17 -15 -14 -1 3 -48 15 65 2 17 20 5 8 84 0 -17 44 -21 -1 19 24 -6 8 -7 4 0 18 -27 3
4467 3 9 19 15 5 10 -2 11 -21 65 19 -5 -11 -38 11 21 50 16 -30 -16 -44 28 -5 -26 12 8 43 63 -14 -44 19 -9 -15 13 -34
4501 -34 -19 -18 37 65 24 30 -68 48 -32 1 21 -40 -35 -17 32 -10 27 16 21 -44 -54 -30 -12 -76 -12 22 -22 -83 66 29 5
4532Ej5N1km5O7q3jN9k1k2k5j9K0N5l4K5rj6j6O3po2J9nO%OJ2N0m5o7K3N7Pl6
4567eL3l3Lm4O0J6r7O5K4k8mL4J3l8L7m4L0LoJ0qn1j1oLQ5m5J7o3j1P8qlOLm7
4603c2K5qj9M2o1K5M1p9L4L9m0M7k8k6O2o6P5j0l0O3p7qO8J3j0m7N7q3LL9kRK3
4636C9n7K6J3n5kQ5m3j00M9Q2l2n0J2M9j9M2r5P3n9k4M9K5j9m2K2K4j6j2O7Rj3
4667B8ROJ6m4oJj7l1%N4l1k1P7k7o4J0M7k6J4k5j4J7L1l8M2J9k9N5k8j9m0N9k5
4700@J5l9L9J9K5k7n3K5qRN1j5J3n6PoP3r5N0j02O1J8j6M8j42R8Mm3P9p3J4L5
4732Hl8L5K8MJ0m5m0j6N9j2noN7ol6l7nL2j9NM9k8k6R0q7L6l7N7q9K8J3K6j1L6
4766C0j02P5Lk2O2n0m2Q8n1Pk4M1l4K6m2N4%j5j8j6QJ5N9j1m9L6m5J9K1j7k4J7
$$ plain form
4532 5 -10 41 39 -6 61 -22 -23 36 15 -7 -32 -51 -31 24 -10 15 6 -10 -26 37 30 -32 -13 -18 -12 -12 -6 6 56 11 -56 -33 24 31 -5
4567 -5 28 -5 -2 -46 14 30 -67 -2 22 -6 -10 24 37 -1 36 -8 22 25 19 29 21 -30 -41 -47 -44 41 -4 13 -50 -61 17 9 6 12 15 -32
4603 -32 -7 -15 -34 8 -53 -28 13 -66 -32 7 -33 14 -14 -40 22 -44 31 21 -9 54 -23 -31 37 50 40 -7 50 -33 -30 9 7 16 39
4636 39 -18 8 21 -34 -36 49 6 -94 -45 37 5 -45 -33 16 -3 39 -56 17 -42 -66 -17 8 -11 -53 -31 -7 -23 -35 32 41 28
4667 28 37 43 59 15 9 10 -7 -38 -38 16 -15 -36 41 14 -50 -40 7 -19 -5 -30 -44 -27 4 -34 8 27 -2 53 25 6 -34 25 0
4700 0 15 -24 15 34 59 32 -21 4 -4 5 56 41 54 -2 5 -1 72 -23 27 -75 -14 4 -12 36 -106 -8 -4 -47 32 -41 -27 8
4732 8 -30 5 33 37 47 2 -38 -54 5 -7 -12 -18 39 33 -3 -40 -45 -13 -32 -27 22 -6 -32 58 -29 7 -30 27 -62 -34 -21 5 -6 30
4766 30 -72 3 6 -16 46 -4 -46 42 -9 -2 -26 15 -19 7 -35 19 19 4 -14 -30 -22 -7 52 41 -8 28 -17 2 23 6 -18 -1
4798ak2Ql5P7%m3M6k5m9m0Q8pn7M4L6m8J9L0n2O3o9L5k2N1j1l7M1m1Q2k1m2K9
4830B7m6L7o6L5K0P0p5O6p3nJ9%K0o7N9l1mO2m7M1k0l6K3k4K8jo6RK9J1k4ok4
4863e9M5M2k8L9l5mk7M1k4J3J0j7pk0L4O7p5O4l7M6q8M3j7O0o8m3N1kj6K0j7L0
4895B1o5OP0o8L4ql3M1l4J6L8m8k3N0l3K8jkmOM2j1Qn4J5J7QL0l6l0M8o5J1M2
4929A6k7J7m2M1RNJ7l9l0M5j1L3J4j08J22j49J52p8M2Oj16R3n4L2%K7o0L1jok8
4960d7J6R7m6l8N2q2N0N7m1Qj5j1M0r7O5o0N2J8j1%K3l0On0K2K2O5n8M6J0l5K5
4992E3J8l7l6k2O6q3qK6pJ4M4o5N8N9o9L5Jj6k4J2j4n3Q2n4J9L1l8J6l6k2M6K8
5024B4k6k3RM1jm0MJ5m9j6Q4Mk1m9M8lj0RK0l5m4P8qnk4QM1L4o6k4J9l7N6M0j8
$$ plain form
4798 -1 -23 -15 -50 27 27 -16 30 5 -44 -84 4 -3 -60 -16 20 -28 -9 21 -31 32 -37 -2 -24 27 16 -21 20 -21 61 40 -2 27
4830 27 -19 18 -48 -13 7 77 2 68 -5 -10 9 9 29 -38 21 -10 -14 48 1 42 22 -14 9 -15 13 12 -54 -45 -16 -5 -29 -35 -59
4863 -59 -14 28 0 39 4 0 -27 14 -10 3 13 -4 -11 -31 3 70 -5 59 22 68 -20 23 6 66 -2 -45 6 4 -12 8 -9 21
4895 21 -44 -38 32 -36 -2 -10 -43 -2 -36 -20 18 -30 -53 -3 -36 -8 -9 -11 -15 -9 33 22 30 -24 -9 8 16 46 10 -20 28 -37 -26 16
4929 16 -11 6 -36 5 14 19 36 -3 -33 12 1 34 48 -60 62 -87 65 -13 29 35 -81 12 -42 -10 -10 17 -43 -12 -13 -19 -47
4960 -47 -31 66 20 -18 34 -48 2 59 18 26 11 0 40 -57 8 -52 0 18 7 7 30 0 6 -44 -22 0 65 7 53 63 28 53
4992 53 71 34 -2 -24 42 -41 -49 -23 -30 -16 28 -37 21 80 11 46 47 31 7 19 5 -48 34 -20 -1 30 -8 8 -28 -50 -4 24
5024 24 -2 -25 -16 25 24 -16 -12 3 -46 -62 22 26 5 -44 4 1 -9 0 20 -15 -59 19 11 6 -18 -10 31 65 -1 -25 -6 -43 13 53 35
5059C5m9L2J6M9n8j1j4n2N7k0o2O3qk1L3J5Ll9k7M4N8k8J5k2l4m3R7m6K5Ll3N6
5091C4n1P6p8P8p0M1J1l2J7j09O2J7L1k4l6P9n6Nk7L0ok%J0j2n6O1L1o8N9m3j3
5123d1J7Ok1j5Q3J7j08L5j7N9j7oJ2k9QM6J2m2M8k9pJ2n2J2N0j9J9n5J5k9O1n2
5155b7K2j5M9m2j3N6m9J9JJm0mM0l2N3l5QK7Rj1Jl6l3J05k9ol7k7R3nj1k8K8L
5189C5q5L2M8p6O9j6J5j9J8j3m1K2K3j1j7k8M7k0J3j6nP0j3p3LK8j2N3l7j4rO6
5221C7ol2k3KN0l6nl4KM6oj1J8M6j0l6j0M9p3K7j3j7Ok8J7kO7j1l7J1K9n4J0L2
5255Ek0KK9%j4k8P6l0p2M8J8j7nN5j14J06K6r8N0oJ8n1LJ6K5k2Jk8kL9o4L1m8
5288g1lN6Qj10P5M1Np6R0j4Rl0K7K3n3Qj8O8k1K7j16P9N3l4Pk3kL6mo3P1m9J5
$$ plain form
5059 35 -14 18 34 83 25 14 0 -52 5 -15 -77 -14 -22 -43 -10 5 8 -31 -58 -14 44 16 31 9 -25 -68 29 -17 8 11 -22 34
5091 34 -17 59 -19 59 -11 30 41 9 26 -83 -21 -4 27 3 -33 46 -10 -5 -32 -2 -8 -10 -10 0 -12 -68 -7 24 -44 15 -28 -41
5123 -41 -24 -18 -39 -54 29 46 -62 -27 -44 15 -2 -8 4 -25 -17 29 41 -1 47 18 11 23 -29 -17 33 14 33 -22 -7 -36 25 -27
5155 -27 -5 -20 29 -13 -26 30 -19 0 1 2 -38 -42 -2 -34 19 -16 -8 19 28 17 18 -18 -51 54 25 19 -18 -45 48 43 32 4 32 35
5189 35 -50 -18 30 -46 23 7 22 3 21 8 -33 -11 12 1 -16 -44 3 -17 -4 -20 -25 45 32 -41 -38 -10 -22 31 -6 -20 -29 37
5221 37 31 -1 -24 -22 28 -8 -13 -47 -45 1 -5 -16 2 48 38 2 -8 41 -32 -5 -18 -35 -29 -57 -40 -42 25 14 -23 -12 17 -37 -27 5
5255 5 -15 -13 16 16 2 -26 50 20 -52 -4 14 -3 -8 47 -67 39 65 -33 17 11 29 -22 -19 -3 22 0 1 -27 -29 10 -54 -23 -71
5288 -71 -74 -18 -10 -120 -45 -4 1 -75 15 1 10 -20 7 30 -23 -15 -33 35 14 41 -75 4 57 23 30 7 5 41 37 -26 45 -4 11
5321A1p0N5N9r8L3M0m2j5L4ql2j0N9j3K7q9M3ON0ojr1M2O6m6K5m8L0k7N2K5r2
5353c1M0J8qqM1l8Pl1jnJ2NP9r9O9k7n4J1L2n8K1M7q4J07m9J3k9J1j6J6N1k6m2
5386b6N5qj1lRm4L0J5o1O7n9K4k7M1PK0k2J1O%n3L5k1L0n6N9l1k5j6M0L2k8K9
5419A9p9N3L9l5M1p1R2p4nN7n9N1k3J0n4M4L3q0L2K0j3O8p9Nk4L8K8r9J01m6J5
5450EK9m8K5Nj4Oj3o2P1l4LqM6l5rLJ9J1L9k7J0o1K9l4M7L6n2k4J5O6p8L2M7J0
5484E5j8n3m9O3PK5k9l9L6J0k9N7m7NROl1K7p4M7J5l9N6l5j0M0j6l2pP2rj1pr
5518a4J0O3k8K9m3Nk3l4KJ5K3QM5L5j05K6mRok2j7nO2L2j22O5N6r1O2j7q6N6L3
5551A9m2k4N9N2n3l4rl4P8J2nq0L7J5j8K5pj8O0j0N3l3l6k0M2n4J1K3oPk7N7n4
$$ plain form
5321 11 -59 -4 55 -43 -10 30 -12 -27 7 -1 -33 -43 16 3 30 -59 -16 -10 40 34 33 -58 -16 50 4 29 -19 11 -16 36 61 -31
5353 -31 9 27 19 11 52 14 21 -10 -11 -16 -4 1 80 -19 50 23 -31 -20 12 -46 -25 22 -62 45 -4 9 -20 -9 -25 -9 42 16 -26
5386 -26 29 21 10 7 16 -28 2 17 -44 23 -36 -12 -39 2 9 29 7 18 24 24 -29 6 -15 15 -41 18 -13 -38 -54 -14 18 -10 19
5419 19 -60 -7 32 -3 38 -33 59 -15 -20 37 -22 29 6 16 -38 6 39 -41 -9 11 -2 66 -13 -8 -32 6 34 -65 36 -10 5
5450 5 34 -14 11 16 2 8 -5 -67 4 -30 -27 -35 11 -24 -33 -30 -11 0 39 12 22 -39 -10 -44 3 39 -13 -37 -22 44 -34 -2 45 55
5484 55 37 -16 -65 -2 5 30 1 -38 -2 8 -21 36 -11 -6 3 9 -22 5 -69 -22 -7 -46 10 -25 -35 5 -11 -43 -50 22 13 2 -5 -14
5518 -14 -4 59 31 60 17 22 -1 -35 -33 -18 5 13 58 93 -12 14 10 19 13 -9 -26 -31 31 63 -59 6 62 -29 33 16 -70 -14 19
5551 19 -23 -47 12 64 11 -23 -32 -66 12 24 19 -61 -24 -9 -27 -2 -9 -27 33 23 76 43 7 -13 29 -25 -14 9 3 10 -17 40 -14
5584a4O8k6J0n7l9M3L2n%o6J06l4k4j7P5l7j3j8L3J3m6j5Q4j1%k3m9K8K8J9k6
5615A9m0K9o0O3l3M6o1N8o0QJ31r0Pp3j6R7p0o3J48jn6J9l1M7L8j1m7K2m7N5j7
5646A1M5k9n1M7l6P2p7M3k3l8M3pm7O6l7L0J1qj8m4J5j9J13m5lK0m2j1n4O6m2
5677d9M8O0o2MKK6l4mQ0p2N5m7M6o9M5Kl6OL2j8j9M5o9K3Ol1J9K0j5l4M6Jl3M3
5711A7mo5J03k4k4k5J8QO%j5k3lQ0k9n8M7k9l3L7J9K2K1m9j1L3N4r8K7N5j7k8
5743A2K8l8J9n3O3J6n9l3O3J4nl0j8L0p2O0ll4N7k8oLmk0O4j4mk0k0L8Kk7L9K0
5777D0j7Kk8J1l7L3K7m4M4M0n5km1J09j01J1jK0j9M4mm1M0k6n3J4m1P8K1L7n9
5808BjM6p9N4j5qn4N8J4k9Pk9N7m3J4L2m7k0N7Ml3J0k3k3O9J2q1J4N3n6J7k5P6
$$ plain form
5584 -14 54 28 38 -19 -58 -15 17 12 12 -54 52 18 -6 -23 52 15 2 -16 17 30 -16 -31 53 42 42 19 -30 -2 26 45 19
5615 19 -21 8 -52 11 -22 24 -37 21 -39 -31 100 10 17 -56 -72 25 -45 -108 40 39 -17 2 -29 18 56 45 -2 20 -27 28 11
5646 11 56 27 -24 23 -13 59 -18 25 2 -36 7 0 -47 19 -18 12 23 15 -3 -47 -32 -51 62 17 14 34 -8 -19 -73 -7 -49
5677 -49 -1 59 -3 1 3 29 -5 -9 71 -1 54 7 53 -16 29 31 -5 1 33 15 -4 41 -28 -5 1 -30 -11 9 -6 -40 6 7 -26 17
5711 17 13 -52 51 27 3 -22 -4 4 10 10 -5 -28 -31 49 20 -38 9 -20 -53 -16 3 25 46 -3 -14 19 73 -25 2 57 40 12
5743 12 40 2 21 -32 31 47 -12 -45 18 32 27 -3 -21 9 -63 -3 -6 -40 17 -11 -17 -14 -18 -38 26 12 8 -12 -32 6 8 -19 20 40
5777 40 23 25 -3 8 -29 4 31 -13 31 71 16 14 -27 82 -19 -8 -9 11 -8 36 32 -9 31 5 -48 -34 -75 3 24 61 2
5808 2 1 47 -32 22 7 -1 -55 3 17 -12 -5 -34 23 -20 -6 26 -21 -41 16 20 -13 -3 -26 -49 20 32 -49 -35 18 -38 -21 -46 30
5841C0m5m5K6J8R7k4k1n8k6M5j7RK5kJ3m4J0jl0J0O0k0K4o3K2NP1j12R0m7OL8
5873D4jr7O6l7M4o6O4Qo6M2rj6M6Lq2O1m2l7J1J12o3J7K2l4L5l5J0j7O4nm5j8
5905b1N5q6k2N7J8J9L8ok6m1Kj2K0L9l5K3j2p2P1j4Pk0L8qo6NP1l1K2m5k9J11
5937E0mo4M5m5O1rl2J6l1KJ4n2L1L7J5OJ5j3n0MJ9k4qK4lj2J4j3l0K2N5n8L5k3
5971fL7k4K6k3j1Nl8N0j6m0M2n7KK7K5Nm2L7rl2M9L0l3Lp7J06m6J6J3k2L7l5J
6004@K3kN3o8q7J07j5k8L8n1J0mOL0n0L0M2j5m5M4j4pl2JN7pPn3L2mO1o6rM7k1
6039A0k1J7j9JO3Lm6l9J1oN5%j4q3M2jPj9L3j6Rk0M1k9Nj3J0oO0n2l0N2j4j3N8
6074C6o7k2J2J7L5m4L0L2m3M8l8JmM4l9qNm9L5J2j3Rpj1RKK1l5P2m7n6L8lqL8
$$ plain form
5841 30 -15 -60 -34 -16 81 57 36 -22 -48 -3 -20 -11 14 12 25 -19 -9 -10 -40 -30 30 10 34 -29 -7 -2 69 -43 47 0 6 44
5873 44 43 -54 12 -25 19 -47 17 25 -41 1 -8 -24 22 25 -57 4 -38 -75 -64 48 -15 2 24 -10 25 -10 0 -17 47 42 -3 -21
5905 -21 34 -52 -74 -17 1 20 58 52 26 -15 -13 -25 -5 34 -1 22 10 -62 9 -5 2 -18 20 12 -54 -49 22 -9 13 -32 -61 50
5937 50 46 -18 27 -18 43 34 2 18 -13 -11 3 -49 -18 19 34 40 55 42 -8 -4 15 -9 -17 7 4 -8 6 -7 -37 -15 40 -18 17 -6
5971 -6 31 7 33 10 -1 4 -34 16 0 -40 2 -55 -53 -26 -1 4 -38 -1 -10 -42 7 37 4 7 -70 36 -10 6 19 -3 34 -1 0
6004 0 23 21 74 6 -81 26 11 -17 21 -30 -20 -24 -18 12 -38 -8 34 19 -26 18 4 -3 -35 -34 23 16 23 -30 2 -2 59 -7 -16 31 10
6039 10 -11 6 -13 -12 51 54 8 -31 -20 -26 29 29 15 -68 -26 -27 -20 -39 -6 -22 -13 -33 8 -21 -16 -29 -19 -25 35 -17 -47 5 -9 -22 36
6074 36 -31 -53 -41 -24 11 -33 -3 29 -14 34 -4 -3 -7 37 -2 -10 -5 -54 -19 -7 -20 -11 -18 -29 -20 -18 3 -32 40 -7 -63 -25 -28 -36 2
6109BL0Pq9P3n5JolP8j6j3O2r7Q5n9n4P4k8L5q2O7mj6K6m9L6rn2M9k7N7J7mk3
6143A3l1K3J2o2M0J8o9N5m0K0K1pk8K2N2q0K0L4n7L2l9L7L6rPm5M6n2J9M6n3P4
6175E5l9rM4j5n8m9R2j6K6o8N3j5J9n2L2l5N2l3J7L4l8om4L3k8Q1k9Pj2j9K0j8
6207a8J2k4J3nj1J0N6m8L5q9P0K6m3MlN5p4N5j9lL9o3kMR9n6n1%k2P1l7j7RM0
6241A3n3L1LJj8LL4L2o5L2k3j8K9k9J1QRJ1ONk5L9m8%j7N2K0n9Moj5%M1M3n3k4
6277b6O0rj9R2n6l5k5L4KM5o1m9K8O4%n6JK6j3J9m4N9l0k6K8j8M3NMk0j0m4K0
6310a1lk8M7j9k0K2J4j3qo7Q8l2J3K7k1M8l2K6m5K1Lj4rQ0p9NK8Jkj7RK6l1o2
6344e5M3J5K2oJ9j1K5l4p%j0J3l6M2O5j41O6p5R5j5j1NO3n5n8L5K4%j8LJ9l2k0
$$ plain form
6109 2 32 39 -50 23 -32 -31 -37 -40 38 22 9 71 -26 59 0 -54 20 -8 27 -55 12 8 -8 18 -31 5 -4 -56 -7 -34 23 40 36 13
6143 13 -18 5 17 -45 -5 13 -56 -1 -41 -21 0 -7 -35 -13 39 -41 -21 13 -44 -12 -51 -14 22 13 20 -25 21 -31 -12 34 -19 55
6175 55 16 7 51 36 -22 -71 21 5 31 -37 16 1 20 -32 0 -35 17 -16 1 35 -3 -9 -53 -20 -48 33 4 11 -1 -20 0 -18
6207 -18 -6 -30 -17 -22 -33 -23 33 -15 20 -69 1 27 -16 -12 -15 40 -34 21 2 -1 38 -25 -27 -23 76 20 -31 -31 -53 18 -19 -36 -27 13
6241 13 -40 -9 -6 -5 -23 -20 14 46 -19 13 -10 -28 1 -28 -17 -9 0 11 17 22 -3 36 -12 -12 -29 23 43 -16 -12 -18 -33 -33 8 51 -2 -26
6277 -26 34 25 6 98 42 7 -18 16 18 63 2 -47 -19 45 45 -11 -10 16 3 22 -22 37 7 -19 9 -9 34 39 43 23 13 -31 -11
6310 -11 -14 -42 5 -14 -34 -12 2 -11 -19 -86 2 -30 -17 10 -11 37 5 31 -14 7 10 -4 -13 67 -12 -7 21 22 20 3 12 38 7 -55
6344 -55 -12 3 25 19 38 27 52 18 11 11 1 14 -22 20 85 -56 10 -65 30 15 4 9 72 17 -41 -6 18 18 0 3 22 -10 -30
6377c0M5k1L2KJ2n5k0nN6J0J7jj04M1M6o4R3q7k1O2L3p5O4m1KM4mp4M6j3M2k8
6409Djn8K6J2l7N2j8O5l7M4q9J9K6OrnRk5J3m3M1k5J7K9kL5m9J5K5n9j1R2r0M0
6443A2l5RLMqK5K0l5k7L7j5n8O6pk2j1L8k6N7j2k3M0%l4L8m5KQK4rL2j9lpm3k4
6479d8L3Pl1N0m4K4mj2O3ml9J0j5m8Q6q0K7k4R2o0OOl4J02p4k9P2l7mmL9k5l8
6512c7M4k6Jk0M0l9R3n3L1mj2J1p3R2n6N8n6j5L5noo2L9k3M5K5q0L0K9nK5k9n
6545hN6m6l1ON0j7jM3l9k7M8k5k1J2j9K8j2Jj0K2qK9j8rn8N2k9J6QK3j38O4M8
6578a0P1j04M2N4n8l1K2J5k2J0Q3q0k1O7n4N4K2n6KM3n8L7Pl0j3k3O2l4M3rm4
6609a3L7Pk1nk7K2K1n3L5L6p1l9O8p8M9J0M8l3kj7M0j8J7l3Q9r6O1Jm0J0l4R0
$$ plain form
6377 -30 15 -6 26 28 40 -15 -35 -40 16 26 43 42 -62 -21 25 -39 54 -33 -54 8 41 -34 30 -11 -9 35 31 -43 3 -10 32 4
6409 4 3 -55 -29 -17 -54 -2 -20 45 8 52 -37 -18 8 14 5 0 9 -16 -3 -46 -5 -30 -13 16 14 49 0 15 40 -19 -30 62 -28 12
6443 12 -23 -14 -11 -7 -15 10 30 -5 -32 5 -10 -68 -2 -9 -31 -42 -4 -30 27 15 -8 32 32 -2 36 -9 -7 1 25 16 48 29 26 19 -24 -48
6479 -48 -15 -8 -39 11 -33 -9 -13 -25 38 34 -5 5 -10 -58 28 -52 -25 -49 43 -17 -11 -5 -39 63 -11 -40 32 -5 -9 -13 26 1 -37
6512 -37 7 -19 -18 -38 2 -37 56 3 34 30 18 29 -44 48 -8 50 -6 -21 14 9 3 -59 -20 -43 2 27 -53 -23 6 1 26 -3 -8
6545 -8 48 2 -29 -23 27 10 9 52 13 -14 34 9 -12 0 -19 9 -3 -2 -12 10 2 31 13 4 -54 -2 -31 -15 -7 16 -122 -58 -10
6578 -10 61 -43 -1 53 -5 -36 -14 1 -21 -11 72 -8 -29 38 -16 38 60 4 6 49 -9 28 35 5 -8 -31 31 -3 40 31 -13
6609 -13 24 31 10 5 -22 0 21 -32 3 39 -32 -71 -3 -81 -32 -22 26 -7 -9 -26 14 -4 13 -20 69 -27 34 35 -5 5 -29 61
6641F1n8lj1K8k6jK0J7qK7m2L3j3j3r1J13m7l9R5p0M7L6n3K0n3j7J4K7K8p3K7
6672b5QN8o1mJ3k5N6K1m4K7j4l2K6j9k4L4Ok2L9j8j5nQrj2L9nkJ7J0K7j10L7K0
6706@mL3n6N3n3P3p1M3l6k2N2l7P2o0j2O2n6k3O3M5J1j07M2p2P1M6p2mL5L2o6
6737a8K8m7K5j8mQ1l5l9O7l0l0J2J3KN4p0o0N0l2J0L0j7L4J1j4L4k4L8q9M5qP
6769Fm2L7L9k6p5Q5m1NM8j4k4okl2N2k1j4j0K9M3q9N5km6k3N8k6L8J1l4m4R5k5
6802El6Q8o0L5l7l2K5Jl1K9m5J22r8J2M7K9r7QL9j7L0MLk2Nl4M9l4n0L9K7J6j6
6835Dk6J8M0j0j0l8N2m6M0k4ol1jmL7j1MN7k2k0k3Ol6k4J11J5j01k3M5Pk2M9J7
6868B4k0j4k4J9k5J1O3o9J4j1N6k4J5n2P8n0pPnL7k1JmJ2j9Q2j03PKK2j8O6l4
$$ plain form
6641 61 3 0 -11 17 -9 -10 10 27 19 46 4 37 24 11 -80 33 -14 -53 42 -28 19 55 2 22 -31 -48 -34 -7 21 -52 -25
6672 -25 -17 41 -20 -24 -11 -36 20 41 -3 24 10 -22 4 -15 -39 -5 1 -21 18 0 -15 -20 -12 -21 -33 6 1 -1 16 26 53 -57 -20 0
6706 0 -4 29 -27 26 -27 46 -25 18 -18 -40 12 -25 47 -13 -25 37 -19 -42 21 66 77 -30 12 -60 11 57 -15 -19 16 48 -18
6737 -18 10 -37 -12 -30 -34 47 12 -27 40 10 -20 -8 5 7 61 -9 -69 -19 -51 -41 -11 -28 6 17 3 37 13 51 -38 7 -1 6
6769 6 -36 1 40 14 -61 24 -17 -12 36 22 -2 -8 -10 -42 10 -11 -25 -35 -6 37 -52 3 1 -45 -68 -10 -36 2 13 -21 -65 30 5
6802 5 -31 57 -3 32 -5 -37 -12 -11 -42 -13 -58 64 -34 -22 25 54 -43 -35 4 -13 17 21 24 2 7 -27 22 -12 -62 -23 4 20 4
6835 4 -22 -4 36 26 16 -22 30 -16 24 0 -6 -37 -38 -42 -5 -16 -12 45 23 3 -20 -14 -50 -74 37 52 -49 -72 -27 -20 -42 7 24
6868 24 4 -10 -34 -15 -40 -29 34 -35 -21 -32 24 0 15 -37 41 -9 -16 -9 -14 23 2 3 -1 11 -8 74 -29 -22 -20 2 -16 50 16
6901A6j3ln1Q1l4l2N2l4K4Kq4N5%K1J4J3o7J2RK0J3k2k4L5j8n9Q1kK0k7l1L6m4
6934d1P4m1J6K2Pk1j4M7l8J9p5O1L0n2KK8m7N4j7j3M4q1M0j4M9l1k9K9Nl6L9p3
6966e7N9r0R1mrQn5P2l9M6Jk4l6L0mM1K3n6O9j00L7jM9p5j2QN1p9O4ml3N2NJ2
7000D0o9J7J2m1lJ07p9JRm2M0MJ3o2M1QK4r%K7q0R0l3K9m5qJj4K8MLk5mQnjJN
7038hK6Nk1k1N4j7L2l1r6M4J7k7K9N9pq2O2k7Llk9P4m5L1k1j4N6m7m1R1m3J4J
7071A8k0k9L2J8l5pMnPL8Mn9R4l8l1j6qL1j3j2J8J5o1nK3J7K4L3jk1Oo5N8jj1
7106Blk4pR0l5l5PM5pl8k7J0J4j5pL4K6RJ8j1l2k9%L4n1K2O1K0j15J2RP0J0m1
7140A6qk7J2nPK4%m5O3k6%l8J3nJ9J9J1l8K4k0nK3oJ5m8K8j2lJ9M1Nq9N4l5J5
$$ plain form
6901 16 3 0 -51 30 -4 -36 16 -18 6 8 -76 -21 -21 0 14 27 -40 -28 -19 1 14 -8 -32 3 -15 -74 7 5 25 -2 -33 3 -41
6934 -41 33 -8 8 30 37 16 2 49 11 30 -45 16 46 -6 -4 24 -23 31 14 1 45 -36 4 -10 39 8 -21 8 13 -23 16 -57
6966 -57 2 -88 3 -1 -10 -2 -57 15 -24 22 23 -1 -37 -7 -11 30 53 -3 66 -34 3 2 51 -24 -36 -28 23 -56 8 4 -29 23 28 40
7000 40 -29 -12 0 -41 -44 63 -16 -15 -6 -48 -8 -4 9 -53 -12 -4 20 11 11 38 -42 48 15 44 -1 -9 -8 -22 6 10 13 -12 -16 -8 -13 -14 -13 -8
7038 -8 18 23 2 -19 35 18 50 19 -77 -33 -16 -43 -14 45 38 -44 18 -9 -6 -9 -38 36 -9 22 1 -13 43 -4 -45 46 3 17 18
7071 18 -2 -31 1 19 -16 -23 -19 -24 -17 21 25 -34 60 22 -9 -25 -33 -2 -15 -27 -9 6 -55 -60 -37 -20 4 37 36 15 21 -44 14 13 2
7106 2 -1 -25 -32 58 23 -12 -5 40 33 -5 -32 -22 -8 -23 -30 4 30 39 57 46 14 -15 -15 19 -32 -10 51 71 -44 -32 -23 47 57 16
7140 16 8 -19 -7 -12 -5 19 19 -26 37 11 11 -27 -14 -19 0 19 30 -8 16 -4 -9 14 8 23 -25 3 -9 -12 7 48 53 -36 18 -17 -2
$$ [...]
8191i
##END NTUPLES=NMR FID
##END=
