##TITLE=1H_DE-80H_X3
 200.13MHz, d2o
 8 sc
 
 19ns.26.2.2025
##JCAMPDX= 6.0         $$ Bruker NMR JCAMP-DX V2.0
##DATA TYPE= NMR FID
##DATA CLASS= NTUPLES
##ORIGIN= UXNMR, Bruker Analytische Messtechnik GmbH
##OWNER= pz
$$ XWIN-NMR		Version 3.5
$$ Wed Jun 18 14:39:04 2025 Russian Standard Time (UT+4h)  Yarkov@DPX200
##.OBSERVE FREQUENCY= 200.1313
##.OBSERVE NUCLEUS= ^1H
##.DELAY= (6, 6)
##.ACQUISITION MODE= SIMULTANEOUS
##.ACQUISITION SCHEME= undefined
##.AVERAGES= 8
##.DIGITISER RES= 18
##SPECTROMETER/DATA SYSTEM= spect
##.PULSE SEQUENCE= zg30
##.SOLVENT NAME= DMSO
##.SHIFT REFERENCE= (INTERNAL, DMSO, 0, 14.3821)
##AUDIT TRAIL= $$ (NUMBER, WHEN, WHO, WHERE, WHAT)
$$ ##TITLE= Audit trail, XWIN-NMR		Version 3.5
$$ ##JCAMPDX= 5.01
$$ ##ORIGIN= Bruker BioSpin GmbH
$$ ##OWNER= Yarkov
$$ C:/Bruker/XWIN-NMR/data/yarkov2/nmr/H-C/1/audita.txt
$$ ##AUDIT TRAIL=  $$ (NUMBER, WHEN, WHO, WHERE, WHAT)
(   1,<2025-06-18 14:38:06.76 +0400>,<Yarkov>,<DPX200>,
      <created by zg, POWCHK disabled, PULCHK disabled
       configuration hash MD5:
       00 E9 B6 7A A2 85 ED C7 34 08 36 98 17 FE 4E 26
       data hash MD5: 16K
       E6 DF E4 F1 97 4E CF 82 85 CC D6 6E 09 B2 20 AA>)
$$ ##END=
$$ 
$$ hash MD5
$$ 25 FE BB 66 8B EC 12 20 8B 8B B3 88 D7 19 55 EF
##$RELAX= 
##$RELAX= 
##$RELAX= 
##$RELAX= 
##$RELAX= 
##$RELAX= 
$$ Bruker specific parameters
$$ --------------------------
##$DU= <C:/Bruker/XWIN-NMR>
##$EXPNO= 1
##$NAME= <H-C>
##$PROCNO= 1
##$TYPE= <nmr>
##$USER= <yarkov2>
##$AMP= (0..31)
100 100 100 100 100 100 100 100 100 100 100 100 100 100 100 100 100 100 
100 100 100 100 100 100 100 100 100 100 100 100 100 100 
##$AQSEQ= 0
##$AQ_mod= 1
##$AUNM= <au_zg>
##$AUTOPOS= <>
##$BF1= 200.13
##$BF2= 200.13
##$BF3= 200.13
##$BF4= 200.13
##$BF5= 200.13
##$BF6= 200.13
##$BF7= 200.13
##$BF8= 200.13
##$BYTORDA= 1
##$CFDGTYP= 0
##$CFRGTYP= 5
##$CHEMSTR= <none>
##$CNST= (0..31)
1 1 145 1 1 1 1 1 1 1 1 1 1 1 1 1 1 1 1 1 1 1 1 1 1 1 1 1 1 1 1 1 
##$CPDPRG= <>
##$CPDPRG1= <>
##$CPDPRG2= <>
##$CPDPRG3= <>
##$CPDPRG4= <mlev>
##$CPDPRG5= <mlev>
##$CPDPRG6= <mlev>
##$CPDPRG7= <mlev>
##$CPDPRG8= <mlev>
##$CPDPRGB= <>
##$CPDPRGT= <>
##$D= (0..31)
0 0.7 0 0 0 0 0 0 0 0 0 0.03 0 0 0 0 0 0 0 0 0 0 0 0 0 0 0 0 0 0 0 0 
##$DATE= 1750243086
##$DBL= (0..7)
120 120 120 120 120 120 120 120 
##$DBP= (0..7)
150 150 150 150 150 150 150 150 
##$DBP07= 0
##$DBPNAM0= <>
##$DBPNAM1= <>
##$DBPNAM2= <>
##$DBPNAM3= <>
##$DBPNAM4= <>
##$DBPNAM5= <>
##$DBPNAM6= <>
##$DBPNAM7= <>
##$DBPOAL= (0..7)
0.5 0.5 0.5 0.5 0.5 0.5 0.5 0.5 
##$DBPOFFS= (0..7)
0 0 0 0 0 0 0 0 
##$DE= 6
##$DECBNUC= <off>
##$DECIM= 32
##$DECNUC= <off>
##$DECSTAT= 4
##$DIGMOD= 1
##$DIGTYP= 9
##$DL= (0..7)
0 120 120 120 120 120 120 120 
##$DP= (0..7)
150 150 150 150 150 150 150 150 
##$DP07= 0
##$DPNAME0= <>
##$DPNAME1= <>
##$DPNAME2= <>
##$DPNAME3= <>
##$DPNAME4= <>
##$DPNAME5= <>
##$DPNAME6= <>
##$DPNAME7= <>
##$DPOAL= (0..7)
0.5 0.5 0.5 0.5 0.5 0.5 0.5 0.5 
##$DPOFFS= (0..7)
0 0 0 0 0 0 0 0 
##$DQDMODE= 0
##$DR= 18
##$DS= 0
$$ [...]
##$SUBNAM2= <"">
##$SUBNAM3= <"">
##$SUBNAM4= <"">
##$SUBNAM5= <"">
##$SUBNAM6= <"">
##$SUBNAM7= <"">
##$SUBNAM8= <"">
##$SUBNAM9= <"">
##$SW= 18.0517328524113
##$SWIBOX= (0..15)
0 0 2 0 0 0 0 0 0 0 0 0 0 0 0 0 
##$SW_h= 3612.71676300578
##$TD= 16384
##$TD0= 1
##$TE= 0
##$TE2= 300
##$TE3= 300
##$TEG= 300
##$TL= (0..7)
0 120 120 120 120 120 120 120 
##$TP= (0..7)
150 150 150 150 150 150 150 150 
##$TP07= 0
##$TPNAME0= <>
##$TPNAME1= <>
##$TPNAME2= <>
##$TPNAME3= <>
##$TPNAME4= <>
##$TPNAME5= <>
##$TPNAME6= <>
##$TPNAME7= <>
##$TPOAL= (0..7)
0.5 0.5 0.5 0.5 0.5 0.5 0.5 0.5 
##$TPOFFS= (0..7)
0 0 0 0 0 0 0 0 
##$TUNHIN= 0
##$TUNHOUT= 0
##$TUNXOUT= 0
##$USERA1= <user>
##$USERA2= <user>
##$USERA3= <user>
##$USERA4= <user>
##$USERA5= <user>
##$V9= 5
##$VALIST= <valist>
##$VCLIST= <CCCCCCCCCCCCCCC>
##$VD= 0
##$VDLIST= <DDDDDDDDDDDDDDD>
##$VPLIST= <PPPPPPPPPPPPPPP>
##$VTLIST= <TTTTTTTTTTTTTTT>
##$WBST= 1024
##$WBSW= 4
##$XGAIN= (0..3)
0 0 0 0 
##$XL= 0
##$YL= 0
##$YMAX_a= 12989
##$YMIN_a= -8175
##$ZGOPTNS= <>
##$ZL1= 120
##$ZL2= 120
##$ZL3= 120
##$ZL4= 120
##$ABSF1= 10
##$ABSF2= 0
##$ABSG= 5
##$ABSL= 3
##$ALPHA= 0
##$AQORDER= 0
##$ASSFAC= 0
##$ASSFACI= 0
##$ASSFACX= 0
##$ASSWID= 0
##$AUNMP= <proc_1d>
##$AZFE= 0.1
##$AZFW= 0.1
##$BCFW= 1
##$BC_mod= 2
##$BYTORDP= 1
##$COROFFS= 0
##$CY= 83.5205535888672
##$DATMOD= 1
##$DC= 2
##$DFILT= <>
##$DTYPP= 0
##$F1P= 10.8118882576601
##$F2P= -7.23987719738617
##$FCOR= 0.5
##$FTSIZE= 0
##$FT_mod= 4
##$GAMMA= 1
##$GB= 0.15
##$INTBC= 1
##$INTSCL= 1
##$ISEN= 128
##$LB= 0.25
##$LEV0= 0
##$LPBIN= 0
##$MAXI= 10000
##$MC2= 0
##$MEAN= 0
##$ME_mod= 0
##$MI= 1.114404
##$NCOEF= 0
##$NC_proc= 0
##$NLEV= 6
##$NOISF1= 3.799351
##$NOISF2= 2.8
##$NSP= 1
##$NTH_PI= 0
##$NZP= 0
##$OFFSET= 14.38212
##$PC= 1
##$PHC0= -1717.525
##$PHC1= 7.966575
##$PH_mod= 1
##$PKNL= yes
##$PPARMOD= 0
##$PSCAL= 0
##$PSIGN= 0
##$REVERSE= no
##$SF= 200.129724274929
##$SI= 16384
##$SIGF1= 3
##$SIGF2= 2
##$SINO= 400
##$SIOLD= 16384
##$SREGLST= <1H.CDCl3>
##$SSB= 0
##$STSI= 0
##$STSR= 0
##$SW_p= 3205.1282051282
##$SYMM= 0
##$S_DEV= 0
##$TDeff= 0
##$TDoff= 0
##$TI= <>
##$TILT= no
##$TM1= 0
##$TM2= 0
##$TOPLEV= 0
##$USERP1= <user>
##$USERP2= <user>
##$USERP3= <user>
##$USERP4= <user>
##$USERP5= <user>
##$WDW= 1
##$XDIM= 8192
##$YMAX_p= 0
##$YMIN_p= 0
$$ End of Bruker specific parameters
$$ ---------------------------------
##NTUPLES= NMR FID
##VAR_NAME=  TIME,          FID/REAL,        FID/IMAG
##SYMBOL=    X,             R,               I
##VAR_TYPE=  INDEPENDENT,   DEPENDENT,       DEPENDENT
##VAR_FORM=  AFFN,          ASDF,            ASDF
##VAR_DIM=   8192,          8192,            8192
##UNITS=     SECONDS,       ARBITRARY UNITS, ARBITRARY UNITS
##FACTOR=    0.0002768,     1,               1
##FIRST=     0,             0,               0
##LAST=      2.2672688,     0,               0
##MIN=       0,             -8175,           0
##MAX=       2.2672688,     12989,           0
$$ Real data points
##PAGE= N=1
##DATA TABLE= (X++(R..R)), XYDATA
$$ [...]
99E951m353m112N46J638o15k03K790K462k344m881j351L803M252n94l793j226
115b030J852P16j608k01K987J757k984l920M84M093K011k344k493O94J789q31
131b8k089N13L105Q13l268k506K102L508Q0k696q05J993R81j733j677J613K549
148B455m44l261j194K548K176j531k535N15K530l4k400n38K284J780j658k684
164a991K54K781P96k276j702J738K047j123k252M60K563O69k357j795J561K360
180A733m87k411m38K241J105j990j686J399K245n26k450n31K164J447j348j869
196a402P37K123l6k234o18K005J411j372j950M43K169J91k034j014J513J494j184
213B42k043M53K090M45j801j116J291J843p08j922J30J949O76j692j299J299J640
$$ plain form
99 5951 1598 -2514 -1968 -330 -945 -1148 1642 4104 1760 -3121 -4472 -669 3583 2989 -804 -2030
115 -2030 -178 538 -1070 -1271 1716 3473 489 -3431 -2947 1146 3157 813 -1680 -986 803 -28
131 -28 -2117 -1604 1501 2314 -954 -3460 -1358 2150 2230 -466 -1271 722 1703 -30 -1707 -94 2455
148 2455 2011 -1250 -2444 104 2280 749 -1786 -1271 1259 1225 -1175 -1713 571 2351 693 -1991
164 -1991 -1737 1044 1840 -436 -2138 -400 1647 524 -1728 -1268 1295 1964 -393 -2188 -627 1733
180 1733 1246 -1165 -1603 638 1743 -247 -1933 -534 1711 1185 -1265 -1796 368 1815 467 -1402
196 -1402 -665 1458 1422 -812 -1430 575 1986 614 -1336 -893 1276 1467 -567 -1581 -68 1426 242
213 242 -1801 -1348 742 1187 -614 -1730 -439 1404 696 -1226 -1096 853 1529 -163 -1462 -163 1477
230A477n14j904k47J697R32j363j539R96J739k90j798m66J718J071j299j387N73
247f04J674N0j738o97J441J193j004j583M39J779J55j644p18J255J267o68j657
264a060J47J624L85j513r20J048J341o13j617O5J456P01j233j067R60J509l47
281H66j426k08J401Q23j180j183O26J305j40j446m74J226Q98j007j149M16J467
298H15m5j277n92J184Q89p17j190K99J313J81j168o49Q42J028n82j167J31J188
316D83K95j030o62P12J099l68j234K9J127M44r29q37O39J002k52j104j54R96N97
335H53p82q82N26J068n3j005l68R26P07p90q52K83R13N5j042m68P82P38o05q82
355h78K37R67J90q90l60O75P71l47q51J9R01L32q35n57N75O78k45q28r2Q07L19
$$ plain form
230 1477 963 -941 -1188 509 1441 78 -1461 -465 1274 984 -814 -1280 438 1509 210 -1177 -604
247 -604 1070 1120 -618 -1315 126 1319 315 -1268 -829 950 1105 -539 -1257 -2 1265 597 -1060
264 -1060 -913 711 1096 -417 -1337 -289 1052 439 -1178 -1113 343 1044 -189 -1256 -296 1213 866
281 866 -560 -768 633 1456 276 -907 -281 1024 884 -562 -1036 190 1088 81 -1068 -652 815
298 815 770 -507 -1099 85 974 257 -933 -634 679 860 -308 -957 -115 913 331 -836 -705 483
316 483 778 -252 -914 -202 897 529 -705 -676 451 895 -34 -871 -232 770 518 -586 -740 256 853
335 853 71 -811 -285 783 730 -275 -643 283 990 200 -652 -369 544 599 -443 -911 -129 609 4 -878
355 -878 -641 326 516 -374 -734 -59 712 365 -486 -467 434 766 -69 -626 -51 627 382 -446 -538 269 588
376E88n51o74M92P64j40q81j07O78M59n95n56K57P03jo34l77O22N41m65o26J89
397c14O46J01n86l37N33M86l58o22Q0N94K42p05l24M42M72j78o31kO84J92n36
418a21k58L73N43j36o06%N34J65l76m40K56M93j42n40j94N07L15l56m99K21N52
439B91n3m66j66M63L25k94l99P8M85L8m52k63L70M52l45l86R3M01J59m15k64L64
461A6K67j17l43j07M49R6l24k29J88L98q2m24k7L92R3j61l29J69L93qm12k0L20
484A98J14k53l33R8L21q0l52qK12K16j78k87O0L80J13k85j39K02K87j20k65J1
506h8K69J01l34j20K13J59j19k10j3K11J08j81j39J46J76n5j90k9K57M6k07j51
528a50J00J86pk52r2K12J07q4k16J14J65O7k71m0J66J22j29j28l2J92R0j85j64
$$ plain form
376 588 37 -637 -145 619 479 -402 -509 169 628 33 -523 -266 437 436 -198 -575 47 588 123 -503 -314
397 -314 332 433 -153 -490 43 529 171 -451 -371 223 465 -240 -564 -122 350 172 -459 -461 223 415 -121
418 -121 -379 -6 537 401 -205 -205 329 494 118 -322 -66 427 285 -255 -449 58 373 17 -482 -261 291
439 291 238 -228 -394 69 394 100 -299 -221 264 302 -150 -413 -43 409 64 -322 -229 172 331 -84 -348 16
461 16 283 166 -177 -284 165 261 -63 -292 -104 294 212 -212 -239 153 246 85 -244 -75 318 310 -102 -122 198
484 198 312 59 -274 -176 145 65 -287 -295 -83 133 -45 -332 -272 108 221 -64 -203 -1 286 166 -99 -88
506 -88 181 282 -52 -172 41 200 81 -129 -142 69 177 -4 -143 3 179 124 -66 -95 162 208 1 -150
528 -150 -50 136 129 -123 -215 -3 104 20 -196 -82 83 150 -121 -161 5 127 -2 -130 -162 30 120 -65 -229
551b29J81J75o8k24N1K19N6j03q9J17J10m7j18oO0J13j76p2K5J06q0j07n3J21
575c8M7l7p4k8J58M1j99M9R2P5o3q9k6J37J4j74k5J42M6l2j30O9K6P8p2k8pJ25
603G7Rj06M0nM6k6r1M1Q6n4m5jR0Ok4l6j0P0k4m3j0M3m6l8n9P1Jroj17Q8K6k6
636h2jK9R5K0k9RL1k3K8j00R3K8K2j24PqJ3Km1O5m5R7n8n7M0K9k3o2j5K9L1j0
668a0o8L3J6K5m5M7l2M3kk0J6m9L5Ro1K6K4m3KL9j2J2L6n0L0NL3J0l3J6qJ1K7
701F2l3JRRl6J8O7j01J2n0p4K5K3mN4n4J0M3M6m0nK1jl2l5N4oM5M7o8pQo7Q0j2
736Ij7O3q4N5m6J14j13P3p9L9m6oJ8K5J7m5RMM3k5l9J8R9r8L9m0Kk1qNkj8M1%
770a4o2OP2p0K1j1L9L2J5kK0pj3N5m2j2N2m1J1p1j2N4n8K8j9OmK8j7J4J2J5nn
$$ plain form
551 -229 -48 127 59 -165 -114 105 161 58 -31 86 196 149 31 25 85 198 22 -50 -25 81 1 -106 -159 -38
575 -38 9 -28 -102 -130 28 69 -130 -81 11 86 23 -66 -92 45 59 -115 -140 2 48 16 -114 -45 -19 59 -13 -41 -48 77
603 77 86 -20 20 15 61 35 -56 -15 71 17 -28 -29 61 67 43 7 -3 67 43 0 -10 33 -13 -51 -110 -39 -38 -47 -53 -170 -82 -56 -82
636 -82 -83 -54 41 61 32 41 72 49 77 -23 70 98 120 -4 3 -5 8 10 -31 34 -11 86 28 -29 11 40 17 -45 -60 -31 0 -10
668 -10 -78 -45 -29 -4 -49 -2 -34 9 7 -13 3 -46 -11 -2 -63 -37 -13 -56 -54 -15 -27 -15 21 -29 1 6 39 49 16 32 24 35 62
701 62 29 30 39 48 12 30 97 -4 8 -42 -116 -91 -68 -72 -18 -72 -62 -19 27 -13 -18 3 2 -30 -65 -11 -17 28 75 7 0 8 -59 21 9
736 9 -8 55 -29 26 -20 94 -19 54 -25 14 -32 -38 -20 5 22 -23 -14 -10 33 8 -31 -13 86 -12 27 -13 -11 -32 -40 -35 -37 -55 -14 -14
770 -14 -76 -70 2 -68 -47 -58 -19 13 28 26 46 39 26 81 39 27 79 38 49 -22 -34 20 -38 -10 -29 -23 -27 1 -16 -2 10 25 20 15
804A5j05N4J9n7M3Pl0K7k1pP3q0J02m6l0L6MlJ4k9QL9m7j0MJ6J4k4jpk1N5O9o0
838B1j1K5LLk1M0l8NJ0p7L4m9L3j9K9n2L8K2l5N5m8J2lP4J6m3j1J1l0l1N0Oo5
871d6P8q9P2l5K3rnL9m2N2j6nJ5o3M5n8N4k5lj1RPQM9n3Mk2L8qj3M6j4n2L2Rj5
907dM8j24P3Lj5m5K0J10j04L3J2m9N3j0K0M0J4k3kn0M7Jol4l2k4j3J14n1l8P7
938D1lJ0j08O9L5l6L4k1n1P5k5k1j9K4Lnl5M1K1l5j9N6l8J3ro6M0N3j0j7k6O2
970C3J2o8L3m1J6L8J8j2J3m8N9nJql4K4m7jp5L8R3j43M9j7M7ll7N3kK5j2O5n8
1003FLj5o4J04rpkm4lN2k2l5M5Jm6N7l6J5K8l1j9Nk6R7m4l3l5L2M7J5k6L7o1l
1037a7P4o1L0j06J4O7J3l1Oj07J00o9K2J9N0J9rj5pM0l1k4P8n5J23r8Ll4R2r0
$$ plain form
804 15 -90 -36 -17 -74 -31 -24 -54 -27 -48 -55 18 -62 40 -6 -36 0 4 1 15 -14 -6 33 -14 -24 -20 -4 10 -14 -15 -22 -43 12 81 21
838 21 10 35 38 41 20 60 22 27 37 -40 -6 -55 -22 -41 -12 -64 -26 -4 -39 16 -32 -20 -23 51 67 24 13 24 -6 -37 13 19 -46
871 -46 32 -57 15 -20 3 -6 -11 28 -14 38 22 17 32 -31 14 -44 10 -15 -18 -29 -20 -13 -5 44 -9 -5 -27 11 3 -10 36 22 -30 2 11 -4
907 -4 44 -80 -7 -4 -19 -64 -44 66 -38 -5 7 -42 11 1 21 61 75 52 50 0 47 48 42 8 -24 -48 -61 53 2 -36 41
938 41 38 48 -60 9 44 8 42 21 -30 45 20 -1 -20 4 7 2 -33 8 29 -6 -25 31 -7 6 -3 -69 -29 24 14 -3 -29 33
970 33 45 -23 10 -31 -15 23 41 29 42 -6 53 48 49 41 7 31 -16 -17 -92 -54 39 -104 -55 -72 -25 -28 -65 -12 -14 11 -1 64 6
1003 6 9 -6 -70 34 25 18 16 -28 -31 21 -1 -36 9 10 -36 21 -15 0 28 -3 -22 -17 -43 54 10 -23 -58 -26 21 36 10 47 -14 -17
1037 -17 57 -4 26 -80 -66 1 14 -17 -11 -118 -18 -87 -65 -46 4 23 14 -1 -8 32 1 -23 55 0 123 25 28 -6 86 -4
1067dK5pl0Q1k5Qj06Q1L0j02K4J1J3qK2k3j0L9N0p6K6j8j4l1RL3K5Qo7O9o0Q2
1099E5J3j05J9K3nqL1l3L6pk6L8l8N2m1QRJ4k6J0o3R7k1p3K9MN2j1k7lo2P1n4
1132d2k1MJ1Oo2R6L8rj9j7m8N5K9oJ3m7L4j5o9P6q3N8L5M3l6k9L0k0nm0Q1n8N6
1165C9l5O0k0j00M2L2N8q6m2P5l8K6NJ5n4KM2j00J7O3Mo8JN4jk4j6K8m1K8JK7
1197fj9lO6o2QJ7P6m6m6M1o0J7M4L9r8PJ2j2Mj5L4k1M2ln7M7Lqmk9qol5J12j13
1232h2P0o5P7l7Oj5K7J9jl9L3J5l1K9j8L8J0k7L3p7P8l4jn0JK8P8o9Q7p4KJ2k2
1265Aj0l0K2k2RL3k0j3L3J0k3o4J04m9J6RJ9l5J5%J9Jl7N1m2L8k3k3L4Ln0N6k0
1298A2m3K8M0k4l8O8k4PJ5q5M7k7Oj1J3J07j16M0j7P5q9O8m6pJ0k7J8k9P8Jm3
$$ plain form
1067 -4 21 14 -16 65 40 48 -58 23 53 -49 -25 -14 -1 -9 13 -10 -20 19 69 -7 19 1 -13 -44 -35 -2 23 31 -36 33 -27 55
1099 55 68 -37 -18 5 0 -8 23 -10 26 19 -7 31 -7 45 4 12 21 35 9 19 -44 53 32 -41 -12 -8 44 33 6 3 -59 12 -42
1132 -42 -63 -59 -48 -42 -104 -8 30 21 2 -15 -63 -8 21 15 28 -19 15 0 -69 7 -76 -18 17 60 24 -5 25 5 0 -40 41 -17 39
1165 39 4 64 44 -56 -14 18 76 -10 -52 23 -15 11 16 31 -23 -21 21 -79 -62 1 5 -63 -62 -8 -9 -33 -49 -21 -62 -34 -33 -6
1197 -6 -25 -28 38 -24 -16 1 77 31 -15 26 -34 -17 27 66 -32 -25 -13 -25 -21 -36 -2 -23 19 16 -41 6 9 1 -3 -32 -40 -46 -81 31 -82
1232 -82 -12 -77 0 -37 -31 -46 -19 0 -1 -40 -7 8 -23 6 -12 26 36 9 42 -35 43 9 8 -42 -41 -13 65 -4 83 9 11 23 1
1265 1 -9 -39 -17 -39 -30 3 -17 -30 3 13 -10 -74 30 -19 -3 6 25 -10 5 5 24 25 -12 39 -3 35 12 -11 23 26 -24 32 12
1298 12 -31 -3 37 13 -25 43 19 26 41 -44 3 -24 -18 -29 -16 91 -25 15 -2 73 -16 52 6 -1 9 -18 0 -29 49 50 7
1329Gj5k7lL1M6k2lN1p2Q3rl6O8j28O2Lm3j5L%J6M8r5J9j2J9l0K3K0k5P4n5N6
1362C9l8Ro6J5N4K2Nl9Km7N5m0pL0Rj8J5L7k7JNm4K4Nk5K2jl5M4L7o2L0Jm2O4
1397C4k5m9RM2k6N6m7K3k5k9K7K6n1kLJN0J1q6N6j0P9p1pL9o6M5K5P1r9k3N6j6
1430B1J1n1O1p5K9nn1L7P3r5M5L5m6L0k9j4P9k4n4OK0k7J23j23O5n1K5rJ0j8p
1461iMM8q5O0K1k8K9o1j5P2k0qn0R1l9J0l4J0K9N9o2n0K5o2J26r0nO1l1j7J9J
1493aL8k6kj1%Nml3P9k7J1jj9j4J9m6MJ1K3M3mo4K4J6j3KJ1o0O0l1M3j8q4O6N4
1528E1n2L2j9m5J8P4m4%l4L6M0l1L9q0k1O4LJj6j2N3j17O0PlNj9k0J2LJ2j7k2
1561d2K5L5j8JnK9j0p5K2L0J4j1j02J52k9pm6j2P4j5m7M2PM2j09N1J5Rj0j5j0
$$ plain form
1329 7 -8 -35 -38 -7 39 17 14 65 -7 76 67 31 99 -29 33 36 -7 -22 -19 -19 -3 45 -50 -31 -43 -24 -54 -31 -11 -36 38 -17 39
1362 39 1 10 -56 -41 13 35 40 1 3 -44 11 -29 -36 -6 3 -15 0 37 10 11 16 -28 -4 1 -24 -2 -3 -38 6 43 -19 11 12 -30 34
1397 34 9 -40 -31 11 -15 41 -6 17 -8 -37 -10 16 -35 -37 -34 -33 17 28 -58 -2 -12 67 -4 -11 28 -38 7 32 103 4 -19 37 21
1430 21 32 -19 42 -33 -4 -9 -60 -23 50 -45 0 35 -11 19 -10 -24 55 31 -23 -17 3 -24 99 -24 41 -10 15 6 16 -2 -9
1461 -9 -5 43 -42 18 39 11 40 -21 -36 36 16 8 -42 49 10 20 -14 -4 25 84 22 -28 -3 -65 61 -29 -34 27 -4 -21 -2 -1
1493 -1 37 11 9 -2 -2 3 -1 -34 45 18 29 28 9 -5 14 -32 -28 -17 6 49 45 -19 5 21 8 10 21 -39 21 -10 33 15 -69 -3 51
1528 51 -1 31 12 -33 -15 59 15 15 -19 17 57 26 65 -15 -36 28 31 32 16 4 57 -60 0 7 4 9 -10 -30 -18 -15 -3 -20 -42
1561 -42 -17 18 0 1 -4 25 15 -60 -38 -8 6 -5 -107 45 16 9 -37 -49 25 10 -37 5 12 54 -55 -4 11 20 10 -5 -15
1592a5K2N2%p5J5J6m4M7p1J4N0L3l7Rk0L7j4K2o4N2l0m1qP2O3n0l8L0JJ4k6p4
1624e8j0J05On4jR7p6Lk8P2qRo6l9P8m3j4j9K3R8J1j16m8O3O5l9k8%P2r3L6l6
1656c8Q3j7o0J6oL0j9K1n5J18m4M9j39J06L4q4Np4J28N0o5j03J7J07Rl7l8j1O2
1685D5p4LL3N3j3q7l3O5nK9j07OR3M3m9l9k6J36p4k3J2j0P4J7j41K7R8n3k4m4
1715f8J42jj19J9RP0Jm4k9K5PN5o1p0O4M1p1j1R8K2r2Jm4P6O0j05m7O1M1rm2J1
1747a0M2K2k8j13Q7K0J5j16P4M2J2k5l0jN6M0r6m1M0P3r1q4Q4R3Lj30KO4L6n1
1777a1p0O5J9J2l6lL0L2K0r5K9R1L6q4j02K7N6J4p0oR9N2q7p9K5Q4ml1j6L2Op2
1809c7K4K4L4M0r4l5R7m4k2k8J6Q2l0q2KK5Q0r0J2k0R6m2j4l5K5M9nr7J8R5M2
$$ plain form
1592 -15 7 59 59 -16 -1 15 -29 18 -53 -39 11 44 7 16 -4 33 19 41 -23 29 -1 -42 -50 22 85 35 -3 27 28 42 16 -58
1624 -58 -68 37 43 -11 -12 85 9 12 -16 56 48 57 -9 -48 30 -13 -27 -46 -23 75 86 -30 -78 -15 50 11 -17 -17 55 -38 -2 -38
1656 -38 45 28 -32 -16 -22 8 -11 10 -45 73 29 78 -61 45 79 -5 0 -74 54 104 39 -64 -47 60 69 32 -6 -17 45
1685 45 -29 -26 7 60 47 -40 -73 -8 -13 16 -91 -85 8 51 2 -37 -63 73 -1 -24 -12 -22 52 69 -72 -45 53 0 -24 -68
1715 -68 74 73 -46 -27 -18 52 53 9 -20 5 12 67 6 -64 0 41 -30 -41 57 79 -13 -12 -56 20 80 -25 -72 -11 30 21 -21 -10
1747 -10 32 54 26 -87 0 20 35 -81 -7 35 47 22 -8 -9 47 87 -9 -50 -10 63 -28 -112 -28 65 68 -62 -60 4 40 -11
1777 -11 -81 -16 3 15 -21 -24 6 38 58 -37 -8 83 119 35 -67 -40 16 30 -40 -46 53 105 18 -61 -36 48 44 13 -3 29 35 -37
1809 -37 -13 11 45 85 -9 -44 53 9 -13 -41 -25 57 27 -55 -53 -28 52 -38 -26 -46 50 8 -6 -41 -16 33 28 -69 -51 44 86
1840H6j11j9O2K9l4j7n3Q7M6p5r9L7J03o1K4l2K8N9p1n4P8K5pn2r8O7J41q7Jk6
1870b3O2K1p5mJ5P2k0j15M6N1O0q3n1O5Q1p5j04M2N5L2q3j5P6N1m2p8j4R5Ko1
1900a7n4JJ43p7j9q4J03J3L0q1j9Q3K5j13RP2P9j20m8P6Q2nm1p2L7J9K1r9N9P9
1930H2K7j19p2J06n1J10j19L2L9%m3kL7l4J7n1p8J34N4p5p7N8M4Lo5NR5M9j06
1959@rn9J19j7q0m8Q9P2Nq0J4OQ9q3q2j0J43k6q4J0R4O1j95k5J27J9K2j08j0O6
1989B0L7n6o7L2N3nmn7P2N8n9j15M7J12n4k5pR3K7p0r2J0Q3L5j17Q0J1O8o4p8
2019c2%P5np9P9oj7n9J0k6Q9Jl8l8QQ1j4n3m3J19Q4j11j08K1J12k3o8%P6J3l1
2050A7n2M2LN2j08J2M1N3m2n6jQ2Nm5m1Q8L5o7j00M9R4L7j26j17J73M6j9o7rN3
$$ plain form
1840 86 -25 -44 18 47 13 -4 -57 30 76 1 -98 -61 42 -19 5 -27 1 60 -11 -65 13 38 31 -21 -119 -52 89 2 3 -23
1870 -23 39 60 -15 -19 -4 68 48 -67 -21 30 90 7 -44 21 102 27 -77 -35 20 52 -31 -46 30 81 39 -39 -53 42 44 -17
1900 -17 -71 -70 73 -4 -23 -107 -4 9 39 -42 -61 22 47 -66 -57 15 94 -26 -74 2 84 79 38 -34 3 22 43 -56 3 82
1930 82 109 -10 -82 24 -27 83 -36 -4 35 35 -8 -10 27 -7 10 -41 -119 15 69 -6 -83 -25 19 22 -43 -38 57 106 0
1959 0 -9 -68 51 34 -46 -94 -5 67 72 -8 6 12 101 18 -64 -74 69 43 -41 -31 63 124 -71 -96 31 50 72 -36 -46 20
1989 20 57 1 -66 -34 19 14 10 -47 25 83 24 -91 -44 68 14 -11 -18 75 102 32 -60 -50 33 68 -49 31 42 110 46 -32
2019 -32 -32 43 38 -41 38 32 15 -44 -34 -60 29 30 -8 -46 -38 43 29 -24 -67 52 136 25 -83 -62 50 27 -41 -41 35 48 17
2050 17 -35 7 10 62 -46 -34 7 60 18 -38 -39 43 48 3 -38 50 85 18 -82 -33 61 98 -28 -145 28 74 55 -12 -21 32
2080C2pp4pM2L7j6r3K6N5J4j4k4KP2M3q7rL5Kk0n8L9N4j9l7j8N1N5o0k1K8PNn3
2114a8l7Q5N5m7r1P2k4Q1m3j04Q3M4lj05K2P1k8L9j33J01L0l8j7k5O5J8m8l2K4
2143cL6K0q7PJ4K0L3k4m3M7J1n2m9R4J00j24l6O0j0l4O1J8m6L4m1l8j8O2J9K0
2173E1j23P6J9O2j01oP2%j03kQ9j0N6j38N4K4j8O5j48J12m8N3q5J1O0j5j2k3j2
2202d0J01k1q6l2P6K1Ro4J6N2l1p7P5j3K6j8k8M7K3k9o6P1qL2L9o9l4O3L1l8k8
2233@l8R7m4j5n3K6M6k5K3o9K7M3Ok4j4N1o4MK7pK7k2K2m0L4J7l9k9K6J3j9K0
2265GM8o0LJ1n9P9K4r6k2P3No4O5l9JL8Qn1L1P1o3j4Kk0L3j5m2J1P2Oq5L7nM3
2299C3L2q7M4J9k5k9M1j2Lm7P1qm1L0m6k8P6K6k1Nl4NjK4p8QQN0jk1J9nl1l4L8
$$ plain form
2080 32 25 -49 -56 -14 23 7 -86 -60 -5 9 -5 -29 -27 45 88 1 -8 27 29 9 -49 -10 44 25 -12 -30 21 76 16 -5 23 30 35 -18
2114 -18 -55 30 85 38 -53 19 -5 76 33 -71 12 56 53 -52 -30 41 13 52 -81 20 50 12 -5 -30 35 53 5 -27 -3
2143 -3 33 53 -34 -27 -13 7 40 16 -27 20 31 -21 -70 24 124 0 -36 24 14 -20 41 59 13 47 6 -32 -50 12 31 51
2173 51 -72 4 23 85 -16 -22 50 50 -53 -55 34 24 80 -58 -4 20 2 67 -81 31 -17 36 -49 -38 22 7 -5 -28 -40
2202 -40 61 40 -46 -78 -2 19 28 -36 -20 32 1 -76 -1 -14 12 -6 -34 13 36 7 -59 12 4 36 75 6 -28 35 66 28 0
2233 0 -38 59 15 0 -53 -27 19 -6 17 -52 -25 18 24 0 -14 37 -27 -23 4 -3 24 2 24 -16 18 35 -4 -33 -7 6 -13 7
2265 7 55 -5 -2 9 -50 29 53 -43 -65 8 13 -51 14 -25 -24 14 22 -29 2 73 10 -4 -2 -22 11 -4 -46 -35 37 43 -42 -5 -10 33
2299 33 65 -22 22 41 16 -13 28 16 19 -28 43 35 -6 24 -22 -50 26 52 31 36 2 7 6 30 -48 -40 -32 18 17 -4 15 10 -21 -55 -17
2334a7K4O0n4m7L9Ok6q3J27p7R2p3K0J0M1jl4M2l2K8q1K8p3J46o2J1m1N0k3k8
2364b8J8L9k5PNk7j2L0op8R5k3m9L1QJ3J8k7L1k8L2l6NL7n1L6J6n3J5J6J8m0O8
2397E5m4Ok9K9j4N4o0k8Q4k1K9m0q9M2L2lM9n3J2m4O3m7m0P7p5M8m2L1L7Rk4O
2429A0rL7k7rM1km7Pk0O1l6L2q8QN0J5m0lO8j4k6K3l5m4O5jm8L8k1N1l5K1n9J4
2463b3N0l7J1NL2o5L3j1k4L8k1m0N4L4j7k4PM7o8m1N1k0L4m2L7l3P6l9K3K1k4
2494B4n7J7J8J7k2o7Q2n1Q0J7j35O7O3k8o2QjO1qo7O4j8RM1r0L1qR8p4J4J0l3
2526@J3Q3n5p0K9Lj5J4nOJ1K2l7j9Pj5O0k1Kk6J0K2kj7Rj3j8rrMNk5L7K9qL%n2
2564d7N7J4J9k5l8L5MK4j4m7N4j1j7j3J7ORp2M3N2r0M0M9p7l5O2l8K9M8l6mml1
$$ plain form
2334 -17 7 67 13 -34 5 11 -15 -98 29 -48 44 -29 -9 1 42 41 7 49 17 45 -36 -8 -81 65 3 14 -27 23 0 -28
2364 -28 -10 29 4 11 16 -11 -23 7 1 -77 18 -5 -54 -23 -15 -2 16 -11 20 -8 24 -12 -7 30 -21 15 31 -22 -7 9 27 -13 55
2397 55 11 17 -12 17 3 57 -3 -31 53 32 61 21 -68 -26 6 3 52 -1 11 -33 30 -17 -57 20 -55 -7 -49 -18 19 28 4 10
2429 10 1 38 11 2 43 41 -6 1 -19 42 6 38 -50 -42 8 23 -17 -20 48 34 8 31 -4 -48 17 16 -32 6 -15 36 1 22 -37 -23
2463 -23 27 -10 1 6 38 -27 6 -5 -29 9 -12 -52 2 36 19 -5 2 49 -19 -60 -9 -29 5 -37 0 -33 43 4 27 48 24
2494 24 -33 -16 2 19 -3 -70 12 -39 41 58 -77 -10 53 25 -37 -29 -30 31 23 -44 20 2 11 52 -38 -7 -15 83 9 23 33 0
2526 0 13 96 41 -29 0 3 -12 2 -3 3 14 36 -1 -20 -13 -28 32 11 13 -13 -3 19 17 0 9 -4 -22 -31 -40 -36 -31 -56 -19 10 2 5 5 -47
2564 -47 10 24 43 18 -20 15 19 43 29 -18 36 25 8 -5 12 18 27 -45 -2 50 -40 0 49 -28 -63 -1 -39 -10 38 2 -2 -6 -37
2597c7K3k1N8Qq4O9kk2O0k2k0Ql6OM2n7J6J0k0N3Jk3K3m3j8K5L5l6jM7n7OJ8L8
2631D7m2m4R8o0J9n3N8n1P3m1n5P4k9N8k0m3j1JO1o1K8l2K8L6lJ6k6l7L3Oo6M9
2663A1n4J1L7K6J7n5L1qk3N2o6J7k9J0l5RO7ml0j7M9k1j7L6K2j20J02n2O8o0M9
2694B3l0P0n3pL8o1O6l1m1R1l5k1J1m8L8lK2K3Or9K9J4M2m3J2j1j8O0p7L7j2p
2726a5M8K0n8J1J1n0N9j2n8O9O7j10L6J2k0J5j7m0k5M0J1Qj0j1k3J6J5k8M0k0
2756a9Ml9J33p6kn6R5n6M3k7o3R1p7L0j3K8M8l5n2j6OQ1pl2N3j5l0j9K3NJ9M1
2788F6p3m8P5m8P5l5k7O5o5L5l3rK7j3L8qn1P1p5PQ7rp1M9p1L1K8m9O8n5R5r8
2820b1KJ6J6LM0k3l0lk9J9n9J14j4l4k8KP0o7J1K0k4l2kN1rKj6K7l5K1N1m6m3
$$ plain form
2597 -37 -14 -35 23 31 -53 16 14 -8 52 30 10 18 -18 -12 30 -27 -11 -1 -21 32 33 10 33 -10 -28 -3 32 -4 -5 42 -15 -9 9 47
2631 47 5 -39 59 -1 18 -35 23 -28 45 4 -51 23 -6 52 32 -11 -22 -21 40 -21 7 -25 3 39 36 52 26 -11 22 28 -38 11
2663 11 -43 -32 5 31 48 -7 24 16 -7 45 -21 -4 -33 -23 -58 -49 18 14 -16 -33 16 -5 -22 14 36 -84 18 -34 34 -26 23
2694 23 -7 63 10 3 41 -20 46 15 -26 65 30 9 20 -28 10 7 29 52 58 -41 -12 2 44 1 13 2 -16 44 -33 4 -8 -15
2726 -15 33 53 -5 6 17 -33 26 14 -44 25 92 -18 18 30 10 25 8 -32 -57 -17 -6 2 -8 -19 -42 -26 -11 -39 1 -19
2756 -19 -15 -54 79 3 1 -55 40 -16 27 0 -63 28 -49 -19 -32 -4 44 9 -43 -59 -53 28 21 -11 42 27 -3 -22 1 6 25 66
2788 66 -7 -55 20 -28 47 12 -15 50 -15 20 -13 -22 5 -8 30 22 -29 42 -33 -26 61 52 -19 30 -41 -10 18 -31 37 -18 77 -21
2820 -21 -19 -3 13 16 56 33 3 0 -29 -10 -69 45 31 -3 -31 -29 41 -26 -15 5 -19 -51 -53 -2 -11 -9 -25 2 -33 -12 39 -7 -50
2853e0P3pLM2q0NL0J0l0P6r1KN7o5O8q4L0K5L6n1k4J8l5K6L0k8L2m9R6m7nq0M4
2886b3P4l4M5j00M8l6PoK2J9l4NO9k2l8N1n3Kk5MJ1K2nmKM6m0l8L6O4o2J3j7R
2920A2L9J5o2Jm0K9k2PJ8j5N6p4L3l3O6or7Q4k7j3J9J7l9M0mMJL1k0j7j4K7J7
2953C3j0J0k7Krl1O9n0K1j0J3l6qN2J7j06O4K7rk9J0m4O1J3m7J7L0nl6J8j0kP9
2986F7q6J4K2ko2L6l4NN6k7J4j5R4j13M1jj2K5K6n7J7j2J0m9L8j0J4mk2J5Qj6
3018b0J2j7l3L2K8L7l2k2L5n9n6J11rO2k8nm4P1q0N1k1Km6K6kN0k2j1K5j7J8J3
3050D9p9L6k3J8k1K2k3L8j6j1j6j5j7N7k8M0k8j6Q3n2L2o8O1M5o8L6m6KJk1PL9
3082A8j7L5J7n3M1p9K3n8J22n6L3k7K0j3l4N3Oj0rjo2L4N8q6LK4l2k4P2m1R9q4
$$ plain form
2853 -50 23 16 19 61 -19 -14 16 26 -4 72 -19 -17 40 -25 43 -41 -11 14 50 -1 -25 -7 -42 -16 14 -14 18 -31 65 18 13 -67 -23
2886 -23 51 17 62 -38 10 -26 -19 -25 -3 16 -18 -13 56 34 -4 47 -6 -4 -29 -25 -14 8 3 -1 1 47 7 -31 5 69 7 20 3 12
2920 12 51 66 4 5 -35 -6 -28 -21 -3 -18 38 -36 -3 -36 30 24 -73 11 -16 -29 -10 7 -32 8 4 8 9 40 20 3 -11 16 33
2953 33 23 33 6 8 -1 -32 37 -13 8 -2 11 -25 -33 19 36 -70 -6 21 12 -17 -7 -51 10 23 -24 -7 23 18 -18 0 -10 -12 67
2986 67 -19 -5 17 15 -47 -11 -45 -40 16 -11 3 -12 82 -31 10 9 -3 22 48 -9 8 -4 6 -43 -5 -15 -1 -5 -27 -12 -4 -20
3018 -20 -8 -25 -58 -26 2 39 7 -15 20 -39 -95 16 7 69 41 36 -8 63 -17 34 13 15 -31 -5 -7 43 21 10 35 18 36 49
3050 49 -30 6 -17 1 -20 2 -21 17 1 -10 -26 -41 -58 -1 -29 11 -17 -33 50 -2 30 -38 23 68 0 36 -10 -8 -7 -28 -21 18
3082 18 1 36 53 0 41 -38 -15 -73 49 -7 26 -1 19 6 -28 25 31 21 12 11 -51 -17 41 -45 -42 -18 -50 -74 -2 -43 56 -28
3114b8%N6l0L1K6n1k2O2m3Kk1R6k3m0K2j1jqmJ1n2O1j2j9J1o0N5kJ1n9o5P2K3
3147a2K0k0K8j5Qj3k6K3J1kRL0pj0p0Q6o6Q0j2l1n3O7k8oO1l4k2J0P3r0J5NK0
3180B9o0N4pn3K4m2oR8o4J9l9l9P0L0m0LlJ7J0J7M6p7L5ml9LL6j8M6m2KP2k6K
3214E4m2M9n9K5lo3M1m1M6lm1L7J0qOJ2nk6K6m1O7p7KQ8l4j9J1Rk2J2k4L7j4R
3248A9k3M4l3K8No7L7J8j5l5N2mKo2K3k0M6k9mL6J3o0mP5o2J7oj0pj7M1k2K9k6
3282b1L6J9M5j61O8K1jm1j0J9N9q4N9M5m0j3N3o1J3k0j9N6kk9K8k8N9q1qM6JL3
3314D1m8J3k9L3k4J6j1k1L5m3Q1p9k2L2K4L2l3OL5o6M1jkM2n8K7k8J5oM1m2j0
3346iKJ7j8KO2ol1qj4K5l6k3J9j4N3m3kl7M9J7L0m3k4J1j8R2j8noQm9pL1K0m6
$$ plain form
3114 -28 -28 28 -2 29 55 4 -18 44 1 3 -18 78 55 15 37 26 25 17 13 24 -28 33 21 2 13 -47 8 6 17 -42 -107 -35 -12
3147 -12 8 -12 16 1 9 -4 -30 -7 4 2 11 41 34 24 -46 40 -26 54 42 11 -42 25 -3 -9 52 18 -4 6 79 -11 4 9 29
3180 29 -31 23 16 -37 -13 -55 -61 37 -27 -8 -47 -86 -16 14 -26 -23 -26 -9 1 18 64 -13 22 18 -21 -18 18 0 46 4 6 78 52 54
3214 54 12 61 2 27 24 -39 2 -39 7 4 -37 0 10 2 8 20 15 -11 15 -26 41 -36 -34 54 20 1 12 21 -1 11 -13 24 10 19
3248 19 -4 40 7 35 40 -27 10 28 13 -22 30 26 28 -34 -11 -31 15 -14 -18 18 31 -29 -33 42 -20 -3 -9 -19 -26 -43 -2 -24 5 -21
3282 -21 15 34 79 -82 -14 7 6 -35 -45 -26 33 -51 8 53 13 0 53 -8 5 -15 -34 22 20 -9 19 -9 50 -31 -39 7 8 41
3314 41 -7 6 -23 10 -14 2 -9 -30 5 -38 43 -36 -58 -26 -2 30 -3 3 38 -28 13 12 10 52 -6 21 -7 8 2 43 1 -9
3346 -9 -7 10 -8 -6 56 50 19 11 -3 22 -14 -37 -18 -32 21 -22 -24 -61 -12 5 35 -8 -32 -21 -39 53 35 30 24 32 -17 -24 7 27 -19
3381a9J4pJ3KK5J0mn3NJ3N6k5n4L0L1m2nl7P0n4L0KrN0n9J0j5nj5N1k0QL7k8p
3416aK9n1O1J1n7L1l9K3J9Pl0K0J2L2n8K4m9j8PM5m0J8l9N1k4K2J8j9k3RqrO6
3449D0j3l2j7LL4pJ1ln9L9K7NLn8P6l5K8mq0Q0k5O1k6j4m6qk7O9m1kL4ro3O7m
3484DJORL8q6N5l2KM1O6o0q1L9n7K2N5k3K4l4L0n0N7J8m9N6m8k1j4O5n5k4M0J
3517ek7mR0l6m7K0k9k1N5Q2j22L9lj5J0L0O1n4q3L0NPLK1J3l2K5jk7m1P1m9Qk2
3551d8M6J7m8M0O1n2j1K7nk4M0J3n3K3l2L6k8lk7lpO9l5n8Q5m0L7m9J8O0j1q9
3583e1P1q0P0kn3O6k5j0jK3O0l2n3L6Kl6l3Q7Rn2k7K2J9Kl0NrK7kM0o3o1O0J9
3617bj6l9Q8l6mN6j6n2L4oJ6k1nJ1P2m3m6J5k6J12r4J6J9j9rL5m4kk3P5n3rl0
$$ plain form
3381 -19 -5 -12 1 3 28 38 34 -19 -14 -1 55 30 -24 6 37 -5 -10 -47 23 -31 -1 1 -8 42 -17 -7 -22 -27 -42 9 -11 -3 34 6 -1
3416 -1 28 -23 38 49 -8 23 -16 7 26 33 3 23 35 67 9 33 -16 -34 -27 18 -22 -4 -43 8 -16 6 24 5 -18 -9 -17 -26 40
3449 40 27 -5 -22 -19 15 8 19 16 -43 -4 23 28 31 -27 49 14 42 38 -42 38 13 74 48 34 -12 -20 -47 22 -19 -21 13 4 -59 8 4
3484 4 5 11 20 58 -28 27 -5 -3 38 104 44 -37 2 -55 -33 22 -1 23 -11 19 -31 26 44 -5 51 3 -18 -32 33 -22 -46 -6 -5
3517 -5 -32 -36 54 18 -29 -9 -38 -59 -4 78 -44 -5 -8 -23 -13 17 78 24 -59 -29 -24 -17 -14 7 20 -12 13 12 -15 -56 15 -34 -26 -48
3551 -48 -2 15 -33 7 68 16 5 32 27 3 43 56 3 26 -6 30 2 -1 -28 -31 -38 31 -4 -62 23 -17 20 -29 -11 49 38 -51
3583 -51 20 -60 10 8 -45 21 -4 -14 -15 8 68 36 -17 19 21 -15 -48 39 48 -4 -31 -9 10 12 -18 -13 -22 5 3 43 -20 -81 -21 -2
3617 -2 -18 -57 31 -5 -9 47 31 -21 13 7 23 2 -3 8 80 37 -9 6 -20 92 -2 14 33 14 5 40 -4 -6 -29 46 -7 -16 -46
3650d6N2npj6J1J7K1k5L3q5K4j1J3J6kJ8M3L0j8qp8RPj9O0po9N7mK8j2k0J0k2
3684eL0J3o2Nj8P6n2JN6l8J1l6J2p0P8Jo%kO0q9M6QK1m8m5L9R3j4n3j3l4RkN1
3719B3j2l1N3k4L2n0Lk0j1R7r7QJ3kL9m7J3K3j6nk4K4J9m4J8l0j5J9M0L8p0j6
3751e2N8n5Q5J9j04M3k1L4K0n6N5j9j0k3L1L5k4j4n1L3MKLLO7k9j1n0K7M4n7o
3783a9k8J5J4K8k3K0Jj4j3K7m0K0J1j9J4RK8k5J9q6J07Rl7k0J3nJ2KK6k7n7Oj2
3816d4qO3rj1L8n4rRJ7L7k3l6M9l5l1Q4o9nk3R3m8Jm7P4Jnj9j9K4JoM0po5P9o7
3852c0mK1Ol0N5om3M1K4pm0pJ9l7L6j3L7ok0K9l0%Mj4P4j52J25j6m4N3Ok1rlL0
3887B8m1J5j6L5L5o8N2k8J8l7L1N4k9o9k0N1k3K5j2Pm3O6Mk0o2NM9J2J9l8K9o3
$$ plain form
3650 -46 6 1 -6 -22 -11 6 27 2 35 -50 -26 -37 -24 -8 -10 8 51 81 63 55 -23 -14 -7 -26 34 27 -42 15 11 39 27 7 17 -5
3684 -5 25 38 -24 -19 -37 39 -13 -12 44 6 17 -19 -7 -77 1 2 -4 -4 -6 54 -35 11 19 40 -8 -53 -14 79 65 12 -1 -35 -26 -28 23
3719 23 11 -20 33 9 41 -9 -6 -26 -37 60 -37 -29 -16 -18 21 -26 -13 10 -6 -11 -35 -11 8 -36 -18 -48 -63 -44 -4 34 -36 -52
3751 -52 6 -49 36 55 -49 -6 -27 7 27 -29 26 7 -3 -26 5 40 16 2 -49 -16 -12 -10 -7 -4 63 34 23 -27 0 44 -13 -19
3783 -19 -47 -32 -18 10 -13 7 8 -6 -19 8 -32 -12 -1 -20 -6 3 31 6 25 -61 46 55 18 -2 11 6 18 20 46 19 -38 -32 -44
3816 -44 -52 11 2 -9 29 -25 -34 -25 -8 29 6 -30 19 -16 -47 37 -32 -37 -60 33 -15 -14 -61 13 14 9 -10 -29 -5 -4 -10 30 23 -42 37 -30
3852 -30 -34 -13 -7 -37 18 12 -31 10 34 27 -13 -20 -1 -38 -2 -15 22 16 -4 25 -5 -5 -1 -15 59 -93 32 16 -28 25 31 10 1 -2 28
3887 28 -13 2 -14 21 56 -12 40 12 30 -7 24 78 49 -20 -40 11 -12 13 1 8 -35 31 35 15 -47 -42 7 19 38 0 29 -34
3919c4l6O1M6J9o8O3l5m2P4q8k2Q5k3n1J01o1Lomk5K9pK8j5j7OL3l3J0MJ0j7N7
3952D5o6J8l1pQN2l4QL2k2o4N7P2n3k7L7k5m5K2L8jj0J4m5J06p7MPo3K8%L2k3
3985a3Mj7J4L6k5qK5l2M0l8K4m2kJ9J5%k9L0o1O5j3l8P0l5MJ0M8qj0o6K3K0L0
4018D0M3p6j6o5J10o8J9k0O2K5r1L6K1K6m7L1n4K2L2m6k4L7J5oo4P9q0L6oM1k8
4049a6K0N0o7O7j3l5L7n3k6M7l1L7rK3J7n7N2r4N1L1m0L7p6L7N9m7n3Q7J1p7j
4080c2N4j5o1J4M0n5L0L8N1q8J3N3k6j3nj4J2K0%L2p0L9J5j0kj4K1j4L1m2l7O3
4112B8m4J9J9Pq0MJ9k5Q6Qn3j3j0KL5l9J1L7j2l8K9RL3Pk6nm1N9j5o6N2oK2J5
4146B8pm3J5K5j0K9J8l7o1JL6j1J3ml3O2l5O4n5j3k5K6J1l8J6J4m8Q7m6J0N4m5
$$ plain form
3919 -34 -70 -9 37 56 -12 51 16 -26 48 -40 -62 23 0 -51 50 -11 -8 -14 -18 -43 -14 -21 7 -8 -25 -19 14 -19 -9 -5 5 -12 45
3952 45 -21 -3 -34 -41 -33 19 -15 -7 25 3 -61 -4 68 15 -12 25 0 -45 -23 15 14 4 18 -27 79 2 6 13 -50 -22 -22 10 -13
3985 -13 -9 -26 -12 24 -1 -9 16 -16 24 -14 10 -32 -34 -15 0 0 -29 1 -60 5 -8 -46 24 -11 -7 3 51 43 33 -33 -10 10 40
4018 40 83 7 -9 -74 36 -32 -13 -33 29 54 -37 -1 20 46 -1 30 -24 -2 30 -16 -40 -3 12 6 -58 21 -59 -23 -29 12 -16
4049 -16 4 54 -13 54 41 6 43 -10 -36 11 -20 17 8 31 48 -9 43 -51 0 31 -9 28 -48 -11 48 1 -52 35 46 -31 -32
4080 -32 22 7 -54 -40 0 -55 -25 13 64 -24 -11 42 16 3 -2 -16 -4 16 16 48 -22 17 32 22 20 6 27 13 44 2 -35 28
4112 28 -16 3 22 29 -51 -47 -28 -53 33 41 -12 -25 -35 -33 2 -37 -26 11 -1 -39 -10 -1 32 39 13 8 -33 26 11 -55 -3 -9 13 28
4146 28 21 -22 -7 18 8 37 55 18 -43 -42 -6 -17 -4 -8 -41 21 -14 50 -5 -18 -43 -17 -6 -44 -28 -14 -62 25 -21 -11 43 -2
4178bL8q8J17p3L6l0j8j0K6J3o4N0k7P6p4O5j3j5k0N9o3J8JK0J7nl5oL9o9L2j
4210fK7J1o5N1m8ON5m7K0j7k7Q8n0Qn6J8N0K3Po9k3O4n5N3m9J1J6mn6M5l0kj2
4243f3O5j7M8n1N8m4j9M1J8k8lj0l5Q7n4M9l3o5L2N1l4jk7J8J8j1m6L3K9m6N9
4274A9m0rN1Kn3k2J3K4RJ9Ql6QJ8L6l4J3o3P8J2pk4l1j2O0n0M5j4k8lM8l7k9P3
4308D4m6jM2K8o2pRl5O9j3o0L4J4K1j7l7L1l0M0n3K0M3k0L0m2m0K6qM5p6L3L6
4340A8n7K0O2p3K6mn7R2j7k0K6K4l6J2o6N4%J1l4M2%Jj9k8J3l9P7m9J2K1jj9l2
4373d0J02r1M2l3K8K9k7j5nO0l7k3L2n3K0n8L4L2J3Jj1%K3N0l7jp4K1rK7RN3o0
4406BL7L2m3n8P3o9M2rO5r4K9mJ1L3p6M2k9N1n7P0q0Q2%o1k6jJ1M6k3j7j6M9l9
$$ plain form
4178 -2 36 -52 65 -8 28 -2 -20 -30 -4 9 -55 -5 -32 44 -30 35 22 7 -13 46 -17 1 2 22 39 34 -1 -7 32 -37 -5 -6
4210 -6 21 32 -33 18 -30 -24 31 -16 4 -13 -40 48 -2 6 -50 -32 18 41 48 -21 -44 20 -35 18 -31 -20 -4 -8 -64 -19 -49 -51 -63
4243 -63 2 -15 33 -18 40 -4 -23 18 36 8 5 -5 -40 47 -7 42 9 -56 -24 27 -7 -8 -35 -17 1 -10 -56 -23 6 -40 19
4274 19 -21 -30 21 23 -30 -52 -39 -15 -6 13 21 -15 -7 11 47 13 26 -37 41 53 46 22 -9 -21 39 -11 34 20 -8 -11 37 0 -29 44
4308 44 -2 -3 39 67 5 -2 7 -28 41 28 -32 2 16 37 20 -17 14 -16 24 -29 -9 34 14 44 2 -38 -12 -20 25 -51 -18 18
4340 18 -39 -19 43 -30 -4 -8 -65 27 10 -10 16 40 4 16 -50 4 4 15 -19 23 23 24 5 -23 -10 -49 28 -21 -9 12 11 -8 -40
4373 -40 62 -29 13 -20 8 37 10 -5 -10 50 13 -10 22 -31 -11 -69 -35 -3 10 11 0 0 23 73 36 35 -39 -18 -27 0 9 62 2
4406 2 39 71 28 -30 43 -26 16 7 72 -22 7 3 14 47 -29 13 -16 35 -22 48 -32 50 50 -11 -37 -38 -27 19 -4 -21 -37 12 -27
4439b7J4K4knn9J05l8p3P7L0q5J00l8m5K4m6L1O0l2NOj3l3oJ5L5mRLo2K1j5O6
4472D2qj6P3o3J1o7N1j1K5j6j1l4L4r4Q0k3L9k5kM0lln1K4rJ8Np1M8L8qk0L0j8
4506EkL1l2nK0oj6qk3L3km3R3k9L1l1k6k3L9k1M0l6pM7n1L9m2K4n4J04o4m0Q5
4539C0r1J06q4P0l1m0J8J5jKlM1qj4J6l9rnmM4l8L4Or5Q8rK5k6k4j0R1o3J6j4
4573fK2l6kO4k5mk1K0m5O5l6j2j8O2m2J0n2N4l4P6N2p3j7m7P7j6o7P4l3L8p5P1
4605B4qJ8p2Pj3M7L8l5K7l6o3P4M6n5k2J6K1l6K8JL4k3m7L0L3kjk9Ml2J7k0qO
4639c1J2j1K7m1O7J5r5J10k5jJ0m0j6K9Nn6Q4Rk5K3k2l7lN1q4L3nJm0J4M2q5J19
4672C4k5l0L5rp7J10k2L5k2pp6jL5K5k0k2J9M4j4k9K3j0k3M8j7o4N3m0M6oJ8N
$$ plain form
4439 -27 -13 11 9 4 -55 50 12 -61 16 46 -39 61 23 -22 2 -44 -13 47 15 20 26 13 -20 -26 -11 24 20 29 32 -30 -9 -24 42
4472 42 34 18 91 28 39 -28 23 12 37 21 10 -24 10 -84 -4 -27 12 -13 -15 25 22 19 -32 -8 -17 1 6 -65 -17 21 13 -7 23 5
4506 5 3 34 2 -3 17 11 -5 -13 -36 -3 -5 -48 45 16 47 16 -10 -33 6 -15 25 -11 -18 29 -22 17 -25 -1 -55 49 -15 -55 30
4539 30 -61 45 -39 31 0 -40 -22 -7 -8 -6 -9 32 24 10 26 -13 -22 -27 -31 13 -25 9 15 -80 8 -1 24 -2 -26 -36 55 -8 8 -6
4573 -6 16 -20 -22 42 17 13 -8 12 -33 32 -4 -16 -34 28 -14 -4 -56 -2 -36 40 92 19 2 -45 32 16 -51 23 -10 28 -47 24
4605 24 16 34 -38 -31 -44 3 41 6 33 -3 -66 8 54 -1 -23 -7 14 -22 6 7 41 18 -29 1 34 32 31 2 6 -26 -9 -29 -37 -31
4639 -31 -19 -30 -3 -44 23 38 -57 53 28 27 37 -3 -19 10 15 -41 43 52 27 50 28 -9 -12 39 -45 -12 -17 -16 -56 -42 0 -85 34
4672 34 9 -21 14 5 -72 38 16 51 29 22 -54 -55 -20 5 -15 -37 -18 26 12 -17 6 -4 -27 21 4 -60 -7 -47 -1 -7 11 16
4704A6m1P1Np1LN1n7L6J2k8k5qM5k5Mj5j3K0PM1p5P0j6K0J9j14L0K0M2l5Pk0L1
4737Gl3K7m1k8J08m9L7o2P4j4j6OpKk6LK7Ok2M1q4M8pl3M0j2J1k8KrN0J4m7L0
4771A5m5L9M5o7q2O6M7m7O4k5J6m2j0M9mk9Qk1N2m0K5Pn3K6jok9O4Lk6rJ8m9L1
4805a0JN5m3k9L1qL6L8p6J6OK2n3L1n7P6k5o8J16m9noL4l7M3k9J2m4K4J2l4qK5
4838crJ9K4k9K7o0J1ML6l9K0QqjOjN5l6Po1KJ7L0n3K1LL1o1J5M2%l6J0L7k6j8
4874a6K8J0m1N5k8K4k0pmRj9J3Jl8K8k3O1j2q7O2l4L4L7o6K4M6o7J4K2L3o8K0
4906iN8l9K3l1m0%N1p1J05n2J7J8l5K8n2O3kL3k8j3m8K0nnl0P2qn0Pj7Ql1R6k2
4940A1l4j6Q7k1l1M3m7K1K8k3n3J2L1J9k7q0P3K3l5L8k6M8j08R0l5N0k5k8K6j8
$$ plain form
4704 16 -25 46 51 -20 -17 34 -23 13 25 -3 -28 -36 9 -16 -12 -27 -40 -20 -13 28 -47 23 7 27 46 -68 -38 -18 24 -11 -4 -24 7
4737 7 -26 1 -40 -68 40 -9 28 -34 40 26 10 16 9 11 -15 -12 15 21 -1 40 -44 4 -3 -36 4 -8 3 -25 -23 -32 18 32 -15 15
4771 15 -30 9 54 -13 -95 -29 18 -29 35 10 26 -16 -26 23 19 -10 -2 -23 29 -11 14 21 -32 -6 -7 -13 -42 22 25 -1 -10 8 -41 -10
4805 -10 -9 46 3 -26 5 -3 33 71 -5 11 17 39 -14 17 -40 36 11 -57 59 10 5 -1 33 -4 39 10 22 -22 2 14 -20 -28 -3
4838 -3 -12 7 31 2 29 -31 -20 -16 20 -19 1 9 1 0 6 5 60 24 31 -30 -28 -11 19 -34 -13 -10 21 -40 -25 17 17 -19 -9 28 2 -16
4874 -16 12 22 -19 36 8 32 12 5 1 10 -9 4 5 -33 -5 -28 33 21 -66 -4 -38 -4 33 -33 -9 37 -30 -16 6 39 -29 -9
4906 -9 49 10 33 2 -38 -38 13 -58 47 -5 12 30 -5 23 -29 34 32 65 37 24 -24 -4 -9 -14 -44 28 20 -30 -23 -40 -32 -63 33 11
4940 11 -23 -39 48 27 -4 39 -8 13 41 18 -35 -23 8 27 0 -80 -7 16 -19 19 -7 41 -67 23 -12 38 13 -15 11 -7
4970gk2Q6o8JJ5m2QJ3k7M8jn8J3J04j10L6LL9k9J6j2m3P0p3M3m7M3o8O3J1ML9
5002D8m9Jj7J0K8j1J4KjK0l7J4m0O2l8n0Q3n1L4l6j3K1n7K3L9k7M8k6l3j2O0L
5034A2l2kL2QJ8L8q8Rkk0M%N6l4J6RNl7rL2l9L1J3l3j9O1j9nj5M3m4L3k4K3Pk8
5070@Mk9J8jJ4K0Ok7J1k9j5N8k9M2j4lo7Q0rk5j6L9j1%n6N4K9j8o9L6j3%Nlk8
5105d6R1q8M2J9j1Jqn1%P8m4k1J08r5N7j3j%m2L7j1K4k1QK0n1J5%K5m2N7n2k5
5138d0L8N1p7O0j2J0qn5J1N4rl0k0J7K2o2L4j4N1l1O9o0J0p7Q0p5Q3m6kO2k4O
5170A6m1Nj3J21p4K4mQ0j31K6o4J9N0l3M1k7%qN4k4K0n8O1j00O3J9k9Lj2O2p8
5201c2K7k5J8N2m8NMM4n8%M6l1J9l5M5n0N1K6q4N0k3k1J1M3o3N0Po8O6k2K5rl0
$$ plain form
4970 -7 -29 57 -11 -10 5 -37 -29 -16 -43 5 4 -54 -41 63 -47 -11 -8 31 2 18 6 -37 33 -40 3 -44 -1 -69 -6 5 9 48
5002 48 -1 0 -17 -7 21 10 24 26 25 45 8 22 -18 44 6 -44 39 -12 22 -14 -27 -6 -63 -40 -1 -28 20 -6 -39 -51 9 12
5034 12 -20 -22 10 18 36 74 -14 -5 -7 -27 -23 -23 33 -1 15 24 29 -8 -17 15 -24 7 20 -13 -32 29 10 5 -10 33 -11 22 -2 21 28 0
5070 0 4 -25 -7 -8 6 26 32 5 16 -13 -28 30 1 43 29 26 -41 39 30 5 -11 28 17 17 -39 15 44 26 -43 -7 -20 -20 -15 -18 -46
5105 -46 45 -43 -1 18 7 8 0 -51 -51 27 -17 -38 70 -25 32 19 18 18 -24 13 2 26 5 13 33 -18 -3 -3 22 -20 37 -15 -40
5138 -40 -2 49 -28 32 20 30 22 -33 -22 32 23 -7 -27 -10 12 -50 -16 -30 21 -10 59 -1 9 -68 12 -63 20 -26 -28 34 10 16
5170 16 -25 -20 -33 88 14 38 34 114 -17 9 -55 -36 14 -19 22 -5 -5 -13 41 17 37 -21 40 -60 3 22 -7 -4 -16 46 -32
5201 -32 -5 -30 -12 40 -8 -3 1 45 -13 -13 33 2 21 -14 31 -19 32 58 -26 24 1 -20 -9 34 -29 21 28 -40 26 4 29 20 -10
5234a0K1n3R4j16M0j5JJ20o6j0nk0Rn8R1J4o2M7J4m9P7n8K8k7L1o1P0m1j6K5L2
5265D7l9k4rM7K4q0kK4K4j4O7o9L3J5Lq6J5J6l3N1KL3j8jj1p5JN1MN3n5%mK9j4
5300EJ7L4k2n8j8L5ql8J00n8K1J0K7nr6M5%O7o0L1r3P8m2p2J30n2j6jL4L3o8L8
5332bL4l8k5O4k2m1N9m2N5k0nKM9n3j4R8n4k9pl1N9o9N3l3J1KJ3k0k7L7J9j8m8
5365d3P3K7k0m8k6L5Ok1%Rj7J3K3l5O6j9j8q3R8lJ4p3J8O1k9l2M0N0q0oL2loL1
5399C4o6M0l6RL6j9Po4P5l4nM6l1QMj0L6np1N5j0K9J9m7k9O0k9O9jo1L%L8m4L1
5434C7j7K8n8pKk3M8jJ0J2n0lj8k2J21p2j0OqJ7pJ3J9k0%J2JJ6n2L5K5l2l3M9
5468A8%J3J6jo6O0p0N7jl6l7N9rlP3p6Pk5K5L2l7K7k8J9Qp4Q2p1J2L3O6j21j0
$$ plain form
5234 -10 11 -42 52 -64 -24 -39 -38 82 16 6 1 -19 -10 -68 23 37 -25 22 36 -13 64 6 34 7 38 -23 47 6 -10 15 47
5265 47 8 -16 -25 22 46 -34 -36 -12 12 -2 65 -4 29 44 47 -39 -24 -8 -41 10 12 45 27 26 15 -60 -59 -8 -4 49 -6 -6 -10 19 5
5300 5 22 56 34 -24 -42 -7 -15 -53 47 -11 10 20 47 42 -54 -9 -9 58 -2 29 -64 14 -28 -100 30 -22 -38 -39 -5 28 -40 -2
5332 -2 32 -6 -31 33 11 -30 29 -13 42 22 17 19 68 15 1 99 45 16 9 -22 37 -32 21 -12 -1 1 14 -6 -33 4 23 5 -43
5365 -43 30 57 37 -11 -37 -2 4 -17 -17 -8 -25 -12 11 -24 42 23 5 -78 20 17 31 -42 -24 37 8 -24 16 66 -14 -20 12 9 3 34
5399 34 -32 8 -28 -19 17 -2 5 -59 16 -18 -23 23 -8 0 4 -6 30 25 -46 9 -1 28 47 0 -29 31 2 71 70 9 12 12 50 6 37
5434 37 20 48 -10 -17 -15 -38 10 9 19 31 -19 -22 -40 -62 59 -13 -23 -17 -25 -8 -15 -2 17 -3 -3 9 10 26 -26 9 34 2 -31 18
5468 18 18 31 47 46 -20 40 -30 27 26 -10 -47 12 3 0 73 -3 4 -21 4 36 -1 26 -2 17 25 -49 33 -38 -26 7 73 -48 -58
5501e8R5mm6J4J3J2n0kM1rN3k9l1j4O5j4n1LJ8mL2j4l9k1O6l1N7q3L2L9r5Q9n0
5534a6k6O4Nk7LJj2J2j4K5K1o4O1n1L7j2k6J4K7l5N5m0N3J7r8J3M3j2On3J7K4
5566A2l6M3J1r0Q6j8k3Pj4M8j8L9r6rM0K9n1%O4p6QlL9M8m9rK1K5j0%K9J1m2k3
5600gj1nN2kK0p7O6p8j5P2k6j7kM1p0O5J6k3l8J3J4j6k1J3N1r0O1Mn0J44m4k7
5632A3Jk3poj8M5l8K9J2ok5P3l3K1o0O3Lr8Q9n1J0L6k3l9nM5m5K6J5kp1M7K0l9
5666d1K9L4K8m3J6o1M2lj7K7mj9%P0l8Kk2M4l9M7m6ro1O1Pn0L7M3n2mP9o7O3o5
5700a2k6N7k4o7N4O6m3J1k4J6n6K8j6NM8n1P4kj5l9k7J07p8LO7kk9m3KM1l8M6
5732C3m9O0k7K9n1oj7M7j3K1mjj03L9J8M1qJ9l0l8jL9K8Qm2lL3k6m3R0o1K3l3
$$ plain form
5501 -58 37 33 -13 1 14 26 -24 -26 15 6 59 30 -1 -15 50 36 -15 -12 6 2 34 20 -19 -40 26 -5 52 -31 1 40 -55 34 -16
5534 -16 -42 22 27 0 3 4 -8 4 -10 15 36 -28 33 -18 19 7 -19 -5 22 -13 42 2 55 72 -26 -13 30 18 24 -29 -12 12
5566 12 -24 19 30 -60 26 8 -15 -8 -22 26 8 47 -49 -58 -18 11 -40 -40 24 -52 -44 -47 -8 40 -9 -18 3 28 18 18 47 58 16 -7
5600 -7 -18 -23 29 27 47 -30 36 -42 -57 15 -11 -28 -30 11 -59 6 22 -1 -39 -26 -12 -28 -49 -36 15 -75 -14 -10 -60 84 40 13
5632 13 14 -9 -16 -22 -40 5 -33 -4 8 2 -23 50 17 38 -22 41 44 -54 35 -16 -6 30 7 -32 -37 8 -37 -11 4 2 -69 -22 -2 -41
5666 -41 -12 22 50 7 23 -38 4 1 -16 11 7 -12 -12 58 20 22 0 44 5 52 6 -3 -64 -3 4 -46 -9 34 -18 -22 57 -10 53 -12
5700 -12 -38 19 -5 -72 -18 48 5 16 -8 8 -48 -20 -36 -31 17 -34 40 38 23 -16 -43 64 -14 -11 56 54 25 -18 -16 25 -13 33
5732 33 -16 44 17 46 -5 -11 -28 19 6 27 23 22 -81 -42 -24 17 9 28 -2 -40 -41 -2 26 34 -8 -11 22 -4 -47 43 -18 5 -28
5765b8j5Q8l3m9M5j5j0L8n0j8R1j5j0j2nj1q4Q5lk5M5o2J5J9l8P6m0k9M3M9n7
5796a5l0O7qrj4K6m1k1L5L7q2N3K8m8J0j0L9Lj5j2lPj3J0k2J3K7l7M9K0o1L7k4
5829dj7J0MJ1j9J3No1JR4r1O1m7P0p0P2l5n3Q9m1O4j00N4n1N4k6N8o6j2L8n9M8
5861fj6k1P2J3K4ol4p6MM1k6R1n7J6j4j1l9P8l1j2J7m1M2j5K8o2K2M3m7KJ5M0
5893C4k6l6kK6qk3M8J5j5L0l2J1%J6l5Rk9J1P%j3pn7P3J4qL4j9n4NL2MJ8mj3k1
5929a5K6m2k%M8J3q7O0J7O1r4M2k3lNJ0k9J5M1o5k5PM2l8L9m5R3m5N8n7J7o6L7
5962eoK1k3j1O4p0K1%j3L7j8mN2l1m4K9N1J0jl4M2q0J1L5n4PK3J7l9P2p8k9K0
5995b8RM6Rl1J4J6L3q8K8K2m5L8r9M6O9o5Pql1O3Rn0P1l3m8Q4p9O3oj4mL6n1m2
$$ plain form
5765 -28 -43 45 12 -37 8 -7 -17 21 -29 -47 44 29 19 7 2 -9 -93 -8 -11 -36 9 -53 -38 -19 -57 19 -21 -50 -7 42 -15
5796 -15 -45 22 14 5 -9 17 -24 -45 -10 27 -55 -2 26 -22 -12 -22 17 20 5 -7 -10 -3 -16 -6 -28 -15 12 -25 24 44 -17 20 -4
5829 -4 -21 -11 -7 4 -15 -2 3 -58 -57 37 -54 7 -40 30 -40 32 -3 -56 33 -8 56 -44 10 -41 13 -13 45 -21 -33 5 -54 -6
5861 -6 -22 -43 29 42 66 60 26 -50 -46 -5 -31 60 3 19 5 -6 -45 33 2 -10 7 -34 8 -7 21 -41 -19 24 -23 -21 -6 34
5893 34 8 -28 -30 -4 -12 -35 13 28 13 43 11 22 22 38 3 12 -17 -6 1 1 -12 -19 -76 -3 11 3 37 18 -36 -31 1 5 23 19 6 -15
5929 -15 11 -31 -33 -33 15 28 -59 1 18 79 -15 27 4 1 6 16 -13 2 43 -22 -47 -40 2 -36 3 -42 51 6 64 7 24 -42 -5
5962 -5 -11 10 -13 -24 40 -30 -9 -9 -22 15 -3 -7 45 14 -30 -1 50 60 59 25 67 -13 -2 33 -21 -14 9 26 -13 59 -19 -48 -28
5995 -28 -19 27 36 5 19 35 68 -20 8 30 -15 23 -76 -30 39 -26 -19 -27 -58 5 14 -36 35 2 -46 38 -41 22 16 2 -2 34 -17 -59
6029e9J9N5ll9P3n5l3J23j29M7J5m2M4n1L5J5k3j9O7k0jJ9oK7p4L1m3J0M3nk0
6060Amj7K8O3j01QM4kk3J8K4q5O5j7pJ0Ml6JK5PK3r5M3L3Ln2P9p0l5O5L9m2l0
6094c3J5L9l0K2j7P1m9l1Lj2M9m3K7K9o2lK6N7oKq2LL2n5K6J5K2j8j4N1J0m6k2
6127b4K9mk7N8m6N8k8po5J9L3m3J8N6m4j6M2mM8q2J5J2l9O6o8J0Q5j07L7K9J3
6158B4q2O7oRo8L1L0On8K2K6j2j1M2j9j1m0L5j3%K6Jm5lM6L9rn6p1R0J0Lk6m0
6192f3L3Kj2%P2J4ro3LN9j6J6p9N3Mk3qLLP6q1j0J3K7p9L6M4p1N8K5n8PL3m2M8
6227A5J2j15J05j00N4O7o1K6lJ1k9j1J0K3j6Ml8J16r3K6p5R4oj5Om9M4k9l9L1
6257c5L3l0K1L0p5J8L1mj3j1M3LK3m0L2j6k9K1Qk0K6lK1Rp8P8p3M3L1o7P7o1M8
$$ plain form
6029 -59 -40 15 12 -27 46 -9 -42 81 -48 -1 14 -28 16 -35 0 15 -8 -27 40 20 19 38 32 59 -15 16 -27 -17 26 21 1
6060 1 -3 -20 8 71 -30 -22 22 20 -3 15 39 -46 19 2 -5 5 9 -27 -26 -1 6 29 -66 -23 10 13 -39 40 -30 -65 0 39 -3 -33
6094 -33 -18 21 -9 13 -4 67 18 -13 -10 -22 27 -16 11 40 -22 -25 1 58 52 54 -28 -25 7 -48 -22 -7 15 -3 -17 34 44 -2 -24
6127 -24 5 1 -26 32 -14 44 16 9 -56 -37 -4 -47 -29 27 -17 -33 9 5 53 -29 -14 -2 -41 25 -43 -33 52 -55 -18 11 24
6158 24 -58 9 3 12 -56 -25 5 11 -47 -25 1 -11 -22 20 1 -10 -50 -15 -28 -28 -2 -1 -46 -49 -3 36 27 -29 -100 -10 0 3 -23 -63
6192 -63 -30 -28 -40 -40 32 46 37 -26 -23 36 20 36 -43 10 14 -9 -17 -14 -11 65 -16 -26 -13 14 -65 -29 15 -56 2 27 -31 -24 9 -33 15
6227 15 27 -88 17 -83 -29 38 -23 3 0 11 -18 -29 -19 4 -12 -8 -46 70 -23 3 -72 22 16 1 7 -42 2 -27 -66 -35
6257 -35 -2 -32 -11 19 -56 -38 -7 -11 -24 -35 8 11 34 -6 26 10 -19 2 10 -10 16 13 34 43 -35 43 -30 13 44 -23 54 -7 41
6290D1m1J8l5j7M8j1Mm7L9l9l6O4pOl9K8j0QK0l1L0l7L2Q1k9m2m3K7L3n0M0J9
6322B4ml8M2o6mO0l2J8J7rJ2j2o0P0Ol9Jpkj5P0j7n2J7j7K7K1j9j9L6l1M1j5n2
6356d8J6M2J2J1o7RJ1KJ5oj7Kj5j1J06m1rj5M2l4Ql5L1l2KM0l5K3k2M3p2N5J0
6389B1J5j0l7m0J0L7pk6L2j5N3m1joJ2Ol2K3L3o0J2k7Q9m9J9MmJ6kOMn4L1J9p4
6424d3M3j2j8kN1j9lRp7M9l1K4N9m8j0M9m6L3p2L4J4NJ1m7M0oj7L0J0l0L8Jk7
6457hK7j4nJpk3M0j2K8j7rj5k7P1n7J0M7RJ4Lm5J4j3p6P4j3l9j5O4J2L3o8L4o5
6491d7J09m1nJ3l5n4M1Rmj9l1Q6j1K3r4OR2m2J9o3J00o9k2O4Pk1Pm4L3M3m8J7
6523A9m0L1%K3K9m6n0P1p0J15n7r6J17l0j9RLqK5l4mnj7K7l9M3Lj5N5J7m3j2k3
$$ plain form
6290 41 0 18 -17 -34 14 3 7 -40 -1 -40 -76 -12 -19 -13 -52 -24 -34 -26 -6 -37 -7 -44 -12 69 40 -2 -45 -18 15 -35 5 24
6322 24 20 -18 24 -42 -46 14 -18 0 17 8 20 8 -52 18 24 -15 -14 -21 -23 -38 32 15 -37 -20 -37 -10 11 -8 -27 9 -22 19 4 -48
6356 -48 -32 10 22 33 -34 -25 -14 -12 3 -3 -20 -18 -33 -44 62 21 12 -3 39 5 13 -22 9 -23 -21 19 -16 7 -15 28 -44 11 21
6389 21 36 26 -11 -51 -41 -4 -11 -37 -5 -20 33 -8 -9 -15 -3 3 -29 -6 27 -33 -21 -48 41 -8 11 15 11 27 25 31 35 -19 12 31 -43
6424 -43 0 -12 -30 -32 19 0 -3 6 -71 -22 -53 -29 30 -18 -28 21 -25 8 -64 -30 -16 -11 0 -47 -7 -13 -30 0 10 -20 18 19 -8
6457 -8 19 5 0 1 -6 -29 11 -1 27 10 1 -14 -41 30 -27 -17 30 39 53 56 11 25 12 -64 10 -3 -42 -57 7 19 52 -16 18 -47
6491 -47 62 21 16 29 -6 -60 -19 -10 -14 -33 -64 22 11 34 -60 -54 38 -4 15 -48 52 -17 -39 25 32 11 18 -26 7 50 2 19
6523 19 -21 10 10 33 62 16 -34 37 -33 82 25 -71 46 16 -3 6 9 1 26 -8 -12 -17 -34 -7 -46 -3 0 -15 40 57 14 2 -21
6556b1M1Op9K6j4O6o1j8QJ11o7m7J2k1Q6Qrk0n1K4j4L7K5m5kPJ1L1o5J2N2J7m6
6589@N6n1J0N2o3l6L3j2K8o9O2p7Q3q3M5%J8NMlm0M9j8J3p5R1j2K3p9J4M2k1k7
6622c8M5K0OQom4om0K2M2k1k5N0KL7l0m3J4j3L3l5j7J5j7N8M2j17O0m2L5nKmN3
6656D1o7KM8l3j5J7JJ0J3l7K3Rj8QPm3N8n0K2Lm0P6l2Oj6%k7L5m4K7kQ8p4l%n1
6692e8jL4K2m6M9j3j6N8m7K0P3p6j2kMj0j7M1JN3p4J3l1K0j2K1n3L0Q7m1n3O0
6724B4p9M5J1j2J3j8j9l9L7m9N2J9J9ONj1j4L4lm5O0j4mol7L8M5o4L6K5r0J4l
6757b4N3k6n1L3L7J2o0J8J9o2K1L5l4KOl1P5r1N4J8r5J23n6P6n7k6M1k8L5l4J3
6788dN7n2k2J8K2J7m0J0l3J4Qrn3J19q5L5mJ1PK0m6m1P5j8mj0J3Lj5l8N0N5k2
$$ plain form
6556 -21 20 26 -53 -27 -41 25 -36 -54 -46 65 -2 -49 -37 -58 28 36 27 7 -44 -20 -34 3 28 -17 -19 -12 -1 30 -35 -23 29 46 0
6589 0 56 5 15 67 4 -32 1 -11 17 -52 10 -67 16 -67 -22 -22 -4 1 5 2 -38 11 -7 6 -69 22 10 33 -46 -32 10 -11 -38
6622 -38 7 27 33 41 35 -9 -15 -55 -33 9 -12 -37 13 15 52 22 -21 -7 -20 13 -22 -39 -24 -41 17 59 -58 2 -40 -5 -10 -8 -12 41
6656 41 -26 -24 24 -9 -24 -7 -6 4 17 -20 3 12 -6 2 9 -34 24 -26 -4 -1 -41 35 3 9 -7 -7 -34 1 -43 -16 -18 70 -4 -7 -7 -58
6692 -58 -59 -25 -3 -49 0 -13 -29 29 -18 2 75 -1 -13 -15 -11 -21 -38 3 4 57 -17 -4 -35 -15 -27 -6 -59 -29 58 17 -36 24
6724 24 -55 -10 1 -11 2 -16 -35 -74 -37 -86 -34 -15 4 10 15 4 -10 24 21 -24 36 22 18 12 -25 13 58 -6 30 55 -35 -21 -24
6757 -24 29 3 -48 -15 22 34 -26 -8 11 -51 -30 5 -29 -27 -21 -52 23 -68 -14 4 -91 32 -24 52 -5 -31 10 -18 17 -17 -4
6788 -4 53 1 -21 -3 19 36 -4 6 -27 -13 -5 -14 -67 52 -33 2 -2 9 16 36 -10 -51 24 6 2 -8 5 8 -7 -45 5 60 38
6821C8q3J7L0J5n4P5l5m0kQ7p9j4O1J5MLrrm6O6k0j9J5nJ2Lok4l1N6j3l8Q4m6
6855H%k8pj5M5pJ0K7k0p2L1O1l8L3k3Ok4M9q1P2J7r5j4J04KL2j8l1jj1L9m3L8
6888D6Ko0m1P3n3N8k9J3j4k3O6m7ol5L4K9m4rL5Pm0PM5k6K5m6L8p2Q3k5L6n9L6
6921Dl1L4l5j8N8K4j8JJ5k5j0K4k2k2m0Q4km5J3o4M2l0O5o2N1J5%l5K8jl5oM7
6954DkJ4k9L9n0P0o8J5K6J1j2L3j20J16k1n0N4m8Kl9J4Q1q2L1K3Mnl1L1J7n5M8
6986B1J6k5L3n8k2P5l2Jmk5L2j4LQm6R6l3p8M7P0m2m2pM2jLl0kPL2j4p0K8lP2
7021C8j11R0K9l1n3L4K9j2l8m1M0k2K8p1P2K2k5j7rN9JKLm0L6K7k5J1L0m8K8J6
7053E2n3L2K0p5N6k8npM1p1M3k3K5jl4M6j6plk7M4l2OL0k1OK8o0L6J2k3K5k1j7
$$ plain form
6821 38 -45 -28 2 17 -37 38 3 -37 -39 48 -31 -45 16 31 35 38 29 20 -26 40 20 1 16 11 23 26 20 -4 -35 21 8 -30 54 8
6855 8 8 -20 -27 -42 3 -4 6 33 13 -59 -28 33 -5 28 5 11 -13 36 -45 27 44 -51 -65 39 41 73 55 24 23 12 51 8 46
6888 46 48 -12 -53 20 -33 25 -4 9 -5 -28 38 -9 -15 -50 -16 13 -31 -40 -5 2 -38 -31 14 -12 13 -33 5 -67 16 -9 27 -32 4
6921 4 -27 7 -28 -46 12 36 18 19 34 9 -1 23 1 -21 -61 23 21 -24 -11 -75 -33 -63 2 -60 -9 6 6 -29 -1 -2 -37 -43 4
6954 4 2 16 -13 26 -24 46 -22 -7 19 30 18 51 -69 47 26 -24 30 -18 -16 -55 -41 40 -42 -11 12 16 11 -20 11 28 -27 21
6986 21 37 12 45 -13 -35 40 8 9 5 -20 12 -2 1 9 -37 59 26 -52 -5 65 23 -19 -26 16 15 18 -12 -14 -7 25 11 -59 -31 -34 38
7021 38 -73 17 46 15 -38 -4 25 13 -25 -66 -26 -48 -20 -91 -19 3 -22 -39 -48 11 12 14 17 -23 13 40 15 26 56 8 36 52
7053 52 -1 31 51 -24 32 4 -1 -8 33 -38 5 -18 7 6 -28 18 2 -5 -8 -35 9 -23 -17 13 -8 -2 26 -34 2 14 -9 16 -5 -22
7087b2nM6j0lJ5Pj6K8j8o6P9o4O7p4M6pJ9p3N7L6j2n9N3q5L9qO0J8r1O5k7K7o9
7120d7M2M1m8l7R7n4J0o7N7j7jL0Rpk1o0P2L3q2N4lM8q2M0k8M9qlro9R0k7k0N4
7154C6n6L7o2L5jk3M4k0KQJL7k6j7O9n0J8pk7N4o1k0M8n2L1m5L7NN1m6k6OK3k9
7188b6ML9m5l0O9Ol8MJ1K2L7q6L3K5j4ol4N6Qj1o7Q0mJ5j39N6L3kPL6m9j3L1n0
7222d2K4j8L9P8j17L8jL7qL3j00J09n1k0N5m0K8m6l1L2Lrj8O1r4N6k8J1J0K8K0
7253C9lkq5K9Q8m7j4NRj4K5K4p1k3R7m2Mr5O7L2Nj6J2m9O0%o3Mj2M2k1J2k1K4
7287@k9rJ1L5j8K0J6J2k8L2k8n3R0j2k5j9J6n3K7K0M5k4o5L5jkl0R2m2j1l2M8
7319A8k3k9J3P5m8oK1RJ1j1Mm6N5j45J10k0K9Pl7P4k4n7M9Mm9K3J7L3m6J7j0J0
$$ plain form
7087 -22 -27 19 9 6 21 28 12 40 22 -44 35 -29 38 -36 10 3 22 -51 6 42 30 -29 24 -61 -22 -30 30 48 -43 22 -5 22 -47
7120 -47 -5 36 -12 -49 48 -6 4 -63 -6 -23 -24 6 15 8 -13 -73 -1 32 -50 4 1 49 -33 7 -21 28 20 17 8 -61 29 2 -18 36
7154 36 -20 17 -45 -10 -11 -34 10 -10 -8 0 1 38 12 -5 64 14 32 25 -2 52 -9 -29 19 -33 -2 -47 -10 -5 46 0 -26 -20 3 -26
7188 -26 -22 17 -28 -58 11 17 -21 -17 -6 16 53 -33 0 25 11 5 -29 27 35 24 -43 37 33 48 -91 -35 -2 -4 3 39 -10 -23 8 -42
7222 -42 -18 -36 3 81 -36 2 1 38 30 63 -37 72 21 1 56 16 44 -2 -33 -1 2 -7 -25 36 -58 -2 -30 -19 -9 19 39
7253 39 36 34 -51 -22 66 19 5 10 19 5 30 54 -17 -40 57 15 19 -76 -9 23 28 12 24 -25 35 35 -28 -24 -36 6 -15 -3 -24 0
7287 0 -29 -38 -27 8 -10 10 26 38 10 42 14 -39 51 39 14 -5 11 -42 -15 5 50 26 -39 -4 -5 -7 -37 55 13 2 -30 18
7319 18 -5 -34 -21 54 6 0 21 30 41 30 34 -12 43 -102 8 -12 17 24 -13 61 37 -20 29 33 -16 7 24 57 11 28 18 28
7351B8l6PL4Kk4L5p4P1k5kl9L8J3o6N0l1l2P3l9L0o6L9K7m5P1n2L1j7o5R9k6J6
7383B5pj7NKj2j5J9Lm5J7R8q1P7o1rlo2Q2j4Nk1L%M8m9qM6m2L4l4nJ3JJ8J8k0
7419Im2L3N1j3j7m2R3n7K0J2m3K4k4K0qJ8k2Mn2O6J6p3M8j9j3MKj1kJ4M3n8P3
7452E4o7k0L5qJ5l8L7n8M6lQ%n2K7O2k8J9Ol5K2j7%L2Nm2O1r1LM1J3j6l2MQ5q5
7487a7L1n3N3nk4N6p0K9qrJ9j4K6J8n6k6K5L3p1PP9n3M8K1rl6k9P5l3l6O7n7N
7520a4j4OMNqJ6m1L7mk7Q3r3N8K6j9j5L7l3k5pK5oMj7K3N5l6l6lM7j04J34o9Q
7554cj8oO9j1j2m2N3j6k3N7l7J2k7jM3J1l4J9k9o0M6j8P1k0k8K5m2N5j6rrn0J6
7587c4k1R3j%j8Mk4o3P1l6K9J8K4p9rK0O3o3M0l1J2j1L2n4Lk7J06Mn1M4o7klk
$$ plain form
7351 28 -8 -1 33 35 11 46 -28 43 18 16 -23 15 28 -38 12 -19 -51 22 -17 13 -53 -14 13 -32 39 -13 18 1 -64 35 9 25
7383 25 18 1 6 8 -4 -19 0 3 -42 -25 73 -8 69 8 -1 -4 -66 16 2 7 -14 -11 -11 37 -12 -20 26 -16 18 -16 -21 -8 -7 11 29 9
7419 9 -33 0 51 38 21 -21 72 15 35 47 4 28 4 24 16 34 12 16 -36 30 46 -27 21 2 -11 -7 -5 -16 -18 -4 39 -19 54
7452 54 -13 -33 2 -6 9 -29 8 -50 -4 -7 1 1 -51 -24 38 10 29 35 0 22 5 5 37 42 0 61 -30 -27 14 27 11 -21 -17 68 -17
7487 -17 14 -39 14 9 -15 41 -29 0 -8 -17 2 -12 14 32 -24 -50 -25 8 -63 -56 23 -30 18 39 30 -6 -35 40 7 -29 38 -19 -14
7520 -14 -28 -22 -18 -13 -21 -5 -46 -9 -13 -40 43 -50 8 34 15 0 37 4 -21 -28 -3 -9 -5 -22 1 56 20 -16 -19 28 -76 58 -11 -3
7554 -3 -21 -27 42 31 19 -23 30 14 -9 48 11 23 -4 -5 38 49 15 34 5 -55 -9 -27 44 24 -4 21 -21 34 18 9 0 -50 -34
7587 -34 -55 38 37 37 19 23 -1 -64 7 -29 0 18 42 -37 -46 -26 37 -26 14 -17 -5 -16 16 -38 -35 -62 44 48 -3 41 -26 -28 -31 -33
7621c3N3p6J5K3k4K6O3k6l9N6o1J3L5l5K9K7m6k1LK6MJ6j6J1n9M2K7m7NN1Mk9
7653A7o4P%l4O5QJ5o6M8Om3L6nL0n2L8m6j5Q3n2O4n3J8J5q3K1L2pO9q8L1Kn2Q7
7687C2mn9L4l3J00l0n4qQ3o3J9l7K3mL3k5o8L9J7L3q0Q3m7K6l5K1J6no4M1P4m2
7719A6j9J6o4M5j7rL7j3L7j4Rk2N1p4L9J7mo5L0K9j5n5R0l2lK2ono9M4k3J8l0
7752c9J4K2N7p1J8m2M3l3J5J6j9L5m3KR9r6J6k0N3J8m9j1N3n6PK7M9q1qN7L7o8
7784BJ5nJ0l6J8l4P2m4NK7o8J34p0n3KL4J8k2j3J3M4p0j5N6p6M1N3m6Nm7K8J4
7816hoL3m9K0j4L8K9Km0Pl1M7m4JK8k4mj3O3p0j2pN8K2o0L7%Ql4J8K7j7k0J7l
7851aP2o7J3M3j28L8J4J3J5K1j4M3q1K2m5N8n8Q0m9K0O3q1K7n1K5j3k8N5ojm0
$$ plain form
7621 -33 20 -56 -41 -18 -42 -16 47 21 -18 38 -23 -10 25 -10 19 46 0 -21 -18 8 12 28 12 23 -36 6 33 -14 -9 42 46 17
7653 17 -47 -40 -40 -74 -9 -1 14 -52 -4 2 -41 -5 -10 20 -32 6 -40 -55 28 -24 40 -13 5 20 -63 -42 -10 -17 52 -36 -5 -3 -55 32
7687 32 28 -31 3 -30 70 40 -14 -22 61 -2 17 -20 3 -1 32 7 -61 -22 -5 28 -52 31 -16 10 -25 -4 12 7 -57 -16 58 16
7719 16 -3 13 -51 -6 -23 -32 5 -8 29 15 24 2 53 -21 18 35 31 -34 -4 25 10 -45 45 13 10 32 26 21 -48 -4 -27 -9 -39
7752 -39 -25 -3 54 -17 1 -41 2 -31 -16 0 -19 16 -27 -25 74 -22 -6 -26 27 45 -4 -15 38 -18 -11 16 65 -16 -24 33 70 2
7784 2 17 12 22 -14 4 -30 42 -2 3 30 -38 96 26 -27 -25 9 27 5 -8 5 49 -21 -36 20 -56 -15 38 -8 -3 -50 -22 -8
7816 -8 -14 19 -30 -10 -24 14 43 45 5 12 -19 28 -16 -15 13 -11 -15 -28 35 -35 -47 -54 4 26 -34 3 3 11 -23 -5 22 5 -15 2 -1
7851 -1 71 4 17 60 -68 -30 -16 -3 12 33 19 62 -19 3 -42 16 -42 38 -11 9 72 -9 18 -33 -8 -21 -49 6 0 -1 -41
7882d1K5M0m3L0k5j3M9k8K9Pl3NJ1jj1N%Qk8M2JpPm0L0L7m6K5kJ3m2N0n3rK0n6
7918d4N5pJ1r0N3kj5k6L7N7n1L8n9MJ0M3m7L1l2O5rj4n3QQ0M4l7m7N1j9l3L5q0
7951d3k2J8PL7j5RQM1m5j4K2m7k9Q1k4M2o3J8k6L9JRl4Lj9P4o4KK7K8n1M2l1l8
7985e7M5j1lM9k9nmN0Pl5K8n3O4k1j0m6j8O2n0K5j5%N7o4L2LPj6k9P7n0Qm2K3
8019b1M7l1OJ6l1j6K7k4O5Kj7k5N2n6l0L2M2m6N2on7K5QJ7p2Q3l3l1L0mpNm5N3
8053A0L5n2j4L6j8m0J9M3k1l3O1J5J7j4o3j5M4jrj3M2l4J8Q%n5Q4l3Jm9O4j1k9
8086gO4p6K0L8k0kOk7k5P0l5o4O3J9l2mRJ3m2j8O3j5R3pj02J0K4K1RL2o8j0j1
8119a1l2L6mL9j1k7L9q0M5L2l0kj8K3mRlK1K2p6K1NJ7m8rL4L2n7J3L8QQl4L7k5
$$ plain form
7882 -41 -16 24 -19 11 -14 -27 22 -6 23 30 -3 2 13 12 1 6 6 14 -14 28 29 22 29 -11 19 56 10 35 33 46 4 54 1 -8 12 -44
7918 -44 11 4 15 -75 -22 -24 -39 -65 -28 29 -22 16 -43 -39 -29 14 -33 -2 -34 31 22 8 -45 -37 43 87 50 3 54 35 2 37 -43
7951 -43 -65 -47 -40 -3 -18 -9 -1 40 -5 -19 3 -44 -73 8 -16 26 -37 -19 -45 -6 -5 4 -30 -27 -46 28 -36 -34 -7 21 -30 12 -19 -57
7985 -57 -12 -23 -26 23 -6 -11 -15 35 42 7 35 -18 46 25 15 -31 -49 13 -37 -12 -27 -27 30 -34 -2 1 8 -8 -37 40 -10 -2 -44 -21
8019 -21 26 -5 1 17 -14 -30 -3 -27 38 40 23 -2 50 -6 -36 -4 38 -8 44 38 -19 6 14 31 -41 42 9 -22 8 4 -3 2 -43 10
8053 10 45 -7 -21 15 -3 -43 -24 19 -2 -35 26 41 58 44 -19 -34 10 9 0 -13 29 -5 13 21 21 -34 50 17 18 -31 33 22 -7
8086 -7 57 -19 1 39 19 17 23 -4 -29 41 6 -58 5 24 -8 -12 -3 10 -32 -50 13 -2 91 84 -18 -8 16 37 46 78 10 0 -11
8119 -11 -43 -7 -11 28 17 -10 29 -51 -6 26 -4 -6 -24 -1 -5 4 1 22 44 -32 -11 -6 11 -37 -46 -12 20 -37 -24 14 22 30 -4 33 8
8154Hk1O3q4N6j2n4NOOK7J5qn0P1k8l7K0P9m9K5l9l6J3P%nM2q3Q6m1M1l0J3n2
8188d6N9l4O
$$ plain form
8154 8 -13 50 -34 22 10 -44 -39 -33 -27 0 15 7 -43 28 0 -37 -17 62 13 38 -1 -37 -24 -17 -17 -22 20 -63 23 -18 23 -7 6 -46
8188 -46 13 -21 -15
8191a5
$$ Imaginary data points
##PAGE= N=2
##DATA TABLE= (X++(I..I)), XYDATA
0@%%%%%%%%%%%%%%%%%%%%%%%%oJ4j6J6j6J6j6J6k3L1l2L2l8M6m8N4o2O5p3Q1q9
45d8J02j11J21j35J50j65J81j99K19k42K66k94L30l69M12m66N31o12P17q58J060
66E90j370J920l203J3228J824j7011l948J481O077K159J908j285k982n740j823
81h175N020R744K837o319p798k43L639K360J55J296M91k850m699p73M626N696
97E007l86n819l432K469L042r7o13J732J034k950l891O66M675K994k288m343o01
114b801K950J079j609k84K269O85l172k820J921M474Q96l260k459J358K197o15
130H09j833N08K343j69l517j635K874L141j029l296o51K400J152j621j100J803
146A79K166j172l011j87L168J778k161k581P96K315k20k307j35K408J158k110
$$ plain form
0 0 0 0 0 0 0 0 0 0 0 0 0 0 0 0 0 0 0 0 0 0 0 0 0 0 -6 8 -8 8 -8 8 -8 8 -15 16 -16 16 -22 24 -24 30 -32 33 -40 41 -48
45 -48 54 -57 64 -71 79 -86 95 -104 115 -127 139 -155 175 -194 218 -248 283 -329 388 -470 590
66 590 -780 1140 -2063 11165 12989 -4022 -7970 -6489 -412 1747 3655 2370 -612 -6352 -8175
81 -8175 -3155 6589 9426 3107 -4691 -4934 -1295 1065 1220 2516 3007 157 -4542 -5315 -689 5007
97 5007 4621 -1198 -4630 -2161 881 784 171 1903 2937 -13 -3904 -3238 1437 4431 2143 -2200 -2801
114 -2801 149 1228 -381 -665 1604 2289 -883 -3703 -1782 2692 3588 328 -2131 -773 1424 809
130 809 -1024 -516 1827 1658 -1859 -3494 -620 2521 1492 -1804 -2455 -55 1097 -524 -1624 179
146 179 2345 1173 -1838 -2025 1143 2921 760 -1821 -1025 1290 1070 -1237 -1372 1036 2194 84
162H4k317J025K863L80k547j344J851J804j518k146R48K501P4k584j282J958K203
179A953r51k395N6K287O14k112j472J820J959r55k377o8K333J041j892j616J060
196g15K003l69k225k66K183J074j643j626R46K232p0k060p10J828J253j324j884
213a373P62J956p9k007r59J572J495r92j971L70J995M11j872j002J601J611r85
230E33j763J98J841O33j658j261J168J661o12j845j13J808Q22j545j269J037J589
247A224k87j738l55J661R09j264j414P17J676r8j783m51J492R46r41j441M32J714
265I99J44j528p76J284J194q63j574L24J488J86j401r39J055J271o38j424J43
282a055J528N68j236r48J008J339m14j392j54J351O41j079j169P10J239k21j297
$$ plain form
162 84 -2233 -1208 1655 2035 -512 -1856 -5 1799 281 -1865 -917 1584 1658 -926 -2208 -250 1953
179 1953 1002 -1393 -1337 950 1564 -548 -2020 -200 1759 804 -1573 -1641 692 1733 -159 -1775 -715
196 -715 1288 919 -1306 -1572 611 1685 42 -1584 -638 1594 1524 -536 -1246 582 1835 511 -1373
213 -1373 -611 1345 1266 -741 -1700 -128 1367 375 -1596 -1226 769 1180 -692 -1694 -93 1518 533
230 533 -1230 -1032 809 1442 -216 -1477 -309 1352 740 -1105 -1218 590 1412 -133 -1402 -365 1224
247 1224 937 -801 -1156 505 1414 150 -1264 -547 1129 1031 -752 -1203 289 1235 294 -1147 -715 999
265 999 1143 -385 -1161 123 1317 454 -1120 -796 692 878 -523 -1462 -407 864 226 -1198 -1055
282 -1055 473 1041 -195 -1143 -135 1204 790 -602 -756 595 1236 157 -1012 -302 937 716 -581
299e81l48J210P52r00j135N27J227K3j267m52J083Q48p44j091K40J242N4j133
317d45m72Q55Q77n72j092J50J213K93j067o46P73R90m51j075NR75M19r38p33O59
337b82R88k50j027j48J103N02p98p36N61R26n5j045k76Q38O01p76p97K74Q67L
357D73r39m39Q05N68m23q23K02R23K11p78n09O88P09l61q33L4Q12K48p21m92N38
378a07P74l35p94l5Q38K56o04n43M17O75j40p29j24O63L74n13o56L83P19j37o35
399b53k93O79L46m03n46K31O14J05o70k87M44M18k58o13J07N59O9n86k74M69M45
420C03k23n01L9O08J90m21l62M38N00k17n08o4N43J20m11l84K68M09j00n49j57
441d79N65K86l96l83K54L91K3m70j54M35L00l54m21K25L98km14k20M02L42k08
$$ plain form
299 -581 -929 281 1033 133 -1002 -475 752 775 -492 -944 139 987 243 -848 -608 634 688 -445
317 -445 -917 -62 815 243 -849 -699 514 807 -260 -906 -133 857 406 -669 -664 311 730 -208 -941 -282
337 -282 706 456 -571 -719 384 886 88 -648 -87 839 784 -261 -537 301 902 126 -671 -397 470 473
357 473 -466 -905 -100 468 45 -778 -576 347 558 -220 -729 -41 668 307 -526 -492 320 568 -153 -645 -107
378 -107 667 332 -462 -497 341 597 -7 -550 -133 542 402 -327 -451 212 586 73 -583 -200 519 382 -253
399 -253 -546 133 479 76 -470 -239 375 480 -190 -477 -33 385 127 -486 -379 180 249 -337 -611 -142 303
420 303 80 -421 -382 226 416 -5 -367 71 571 354 -154 -218 325 445 34 -350 -82 327 227 -322 -479
441 -479 86 372 -24 -407 -153 238 261 -209 -363 72 372 18 -403 -178 220 218 -196 -416 -14 328 120
462A20m04OM64J68m82j56K94K92j98l55O6K84J62l09k42J24M29r6l36l7L90J35
484C19k15l06J75L51m4l51r6K44K00k82l25Q6K84l0k77o3K37K42k26j44L9L15
506A33J2k48q0K44J41n0k81m0L57%k44j30J90J59l5l20M5K66J03j96j35J24J66
529A81o4l04R3O7J59j17k18J31K13ol13O5J23P7k9j84J61M1R0k12j08J28J34j44
553c6j85J00Q2N6j85m2J64J19k4j63K6J87M3p1j03J23P7j7j52k1J24Np5j31k5
578a24K06m5j36n6J66K2r4m9O8J04Or7j4M4J31j42q1M3J18m8j22N3L7J21n4j03
604d6LJ35m5o4kM8O3r1L7j27Q8Kj9l2O5M5M0j53L8L5Q7n4j7LL3Nj9j13Q6j1m3
635b3o1m1J32q1o2QO4L9jm3O0N0rj7oJ5JL0r3LR5j02kLP6K6j10L3N6m1M1m5l1
$$ plain form
462 120 -284 -278 186 354 -128 -284 10 302 104 -251 -185 99 261 -48 -290 -166 263 167 -169 -206 184 319
484 319 104 -202 -27 324 280 -71 -167 77 277 -5 -330 -244 40 10 -267 -330 -93 149 -77 -221 -182 133
506 133 145 -103 -183 61 202 152 -129 -169 188 188 -56 -186 4 163 128 -192 -147 119 222 26 -109 15 181
529 181 117 -187 -94 -27 132 15 -203 -72 141 135 -178 -113 10 87 58 -126 35 76 166 -46 -154 -26 108 -36
553 -36 -221 -121 -39 17 -168 -210 -46 73 49 -114 -88 99 142 71 -32 91 168 151 -1 -22 102 107 32 -99 -124
578 -124 82 37 -99 -155 11 33 -61 -110 -42 62 68 -29 -43 1 132 -10 -91 -48 70 22 -100 -47 -10 111 57 -46
604 -46 -43 92 47 -17 -19 29 92 1 38 -89 -1 1 -18 -50 15 60 100 -53 -15 20 107 53 36 39 72 77 58 -55 31 20 -23
635 -23 -84 -125 7 -74 -136 -128 -64 -25 -26 -69 -9 41 32 15 9 24 25 55 -38 -35 60 -42 -44 -41 35 61 -49 -16 40 -1 40 -5 -36
668c6M0M7Km7k2N2l8J1qL1l8K2q3N9L8K2m8k8Mk3J11j02J1qL7j9n9L4j6kmM0L3
701A3K4%j7K7L2j0n0M2j3M6m9j7m0M6p4OMN0p9QO6m4L7K5k3L2l7k1M1k8rJ5M8
734E1l7NJ3m7N2n1k8mL7M2pjn7J3O2m0Lm0Nk8J24on0n3Q7l9M2j1J3J6j4K9m3J7
768E5M3o1m4N6o4k6l6j6K0jk9M8mN8m8K9K7j3L0qN5o6NK3m3P5Kq3O9p2jk0N6n
802A1L6r0RP4j8j7J9L1J4o7l3L6qlN8p1j0rO5q0KQ6m0m0N9j2J9m2nL3n8M4k7j8
836e2rJ0N7o5O8j7J2jO5q4J00N3q8J9k7j1l6O7r6l7JM8l4L4K0rm4N0m4Q6l5k2
868b1OL9r6L3M9J2j4n8L2L2l7J0L4k1k2P4j5l9l2J10j6m2J0l9K6r2P6J3j9mmo
900b1L1Pk5N2k4k7N5l0Jlnn6L5n1L9M2o6p8Q2N0n2L9k0QO9m2J6J0n3R6jq9N4R7
$$ plain form
668 -36 4 51 53 6 -16 36 -2 9 1 32 -6 16 -67 -8 30 52 4 -24 -20 -43 68 -34 -23 -31 6 -13 -72 -38 -54 -56 -60 -20 13
701 13 37 37 20 47 79 69 19 61 48 94 45 28 -12 34 -40 -34 -30 20 -59 -51 15 -29 8 33 10 42 5 -16 25 -3 -12 3 51
734 51 14 19 32 -15 37 -14 -42 -46 -9 33 26 25 -32 -19 43 3 6 -34 -29 -57 67 61 11 -42 45 6 48 37 50 66 52 81 38 55
768 55 98 37 -7 49 -15 -41 -77 -93 -73 -74 -103 -55 -59 -1 -49 -20 7 -6 24 16 71 5 10 33 -10 65 67 -16 53 -19 -20 -40 16 11
802 11 47 -43 -34 40 22 5 24 55 69 2 -31 5 -3 -6 52 -19 -29 -38 27 -53 -51 35 -5 -45 14 2 21 -21 -26 7 -51 -7 -34 -52
836 -52 -61 -51 6 -59 9 -8 4 3 68 -16 84 137 49 68 41 30 -6 61 -35 -72 -71 -23 -57 -23 -3 -12 -56 -6 -50 36 1 -21
868 -21 -15 24 -72 -39 10 22 8 -50 -18 14 -23 -13 21 0 -22 52 37 -2 -34 76 60 18 28 -11 15 -77 -1 12 -7 -11 -15 -21
900 -21 10 17 -8 44 20 -7 48 18 19 16 11 -45 -10 -61 -22 20 -46 -124 -42 8 -44 -5 -25 -17 52 10 26 36 -17 79 78 -11 43 140
934A40j43K0o0N7O6j05Mk9R1n8j8L5qM2o8nM5j2K1m2PM6m1n1N1jP0o5n7N5N0n2
966a5K0p0J01Or8O0l9P7j6l1m9J07nl2pj2L5P6p8l3Q0l3L6L7j08J9L6q5J5k6J9
997a3PpMqPk8no6P5M7Pn4N3m1PL0p8J23n5n6K6kL9n6j2L6O7k8L2r2J9N1p6L8l0
1032c9j9O8L0j6p4O5M6l0j11Q5M4o5K5o4N5L6n2nOL9p9k0pJ14j0m3L1M1n5M5n2
1063a1m1O8K4l9K5L0Rl1J9p6N4l6O3j04Q7J4q1J8l0M6qk7P6k4j9MMq7J03p2%N
1095c7L2l2J6k3JK4rJ00j08L9L8m5m9L4K9M3q6N8p4N5K0n8L7l2M9Mk5K9k6M0l3
1126A1n7Q6j9K7p5L0q1P8o0L8QRpk7J1NRl6JO1k2N6n3l0O3L5j16K4N5m0P7q5P6
1159E2m7K2n0qj8L7L7j2k7O%P4m2j1K1j8o4M9P8p8Nn5M8K0l1l0O8k7M6m5Kk5k1
$$ plain form
934 140 -3 17 -43 14 80 -25 -21 -50 41 -17 -35 0 -8 34 -34 -39 6 -6 15 -27 -20 26 -15 -66 -15 -16 54 -11 -68 -13 37 -15
966 -15 5 -65 36 42 -56 4 -35 42 26 -5 -54 53 48 16 9 -3 32 108 30 -3 77 44 80 117 9 28 64 -21 -6 -32 -13
997 -13 -6 -13 -9 -17 -10 -38 -43 -109 -34 13 20 -34 19 -22 -15 15 -63 60 5 -51 -25 -27 12 -44 -56 -20 47 19 51 -41 -22 29 -47 -9 -39
1032 -39 -58 10 40 24 -50 15 61 31 -80 5 49 -16 9 -55 0 36 -16 -21 -15 24 -55 -75 -82 32 22 -21 10 51 -4 41 -11
1063 -11 -52 16 40 1 26 56 65 34 53 -23 31 -5 58 -46 41 55 -26 -8 -38 8 0 -27 49 25 6 10 14 -73 30 -42 -42 -37
1095 -37 -5 -37 -21 -44 -43 -19 -28 72 -36 3 41 -4 -53 -19 10 53 -33 25 -49 6 26 -32 5 -27 22 26 1 30 4 44 11
1126 11 -46 40 21 48 -27 3 -78 0 -60 -22 -14 -5 -12 -39 -28 -23 -14 -50 -49 12 -10 46 -7 -37 26 61 -55 -31 24 -16 61 -24 52
1159 52 5 27 -23 -31 -49 -12 25 13 -14 -8 -8 66 24 13 34 16 -48 1 79 1 6 -49 -1 19 -12 -42 26 -1 45 0 2 -23 -44
1192d4K2K3k1rkL9j1m3L1R6n4o8M2qj2k7L8j0K7L8k7L9n4J1k1p0P5j4K6k6k2K4
1224a2M3l2k7L7M5n3M4%o2M7l7j9J3M1k0mn1J7K7PK2o5M8m9O0ln2l9M7l0K4L5
1256BkK2l7M3j0qL3l6%o3P8k8M8n3m7J3K8Q1p6J7ln7Q1j2n4N1Lm1M8j0m2J3j0
1289b8J9rM2o6Q2mj8m9mK2KN3l3joo1L1L7k1J9j4kRPk5K5J3m8nJ7J3J3j7r0N3
1324d4O2l6j4RJ3K6m8L3QJ9p0L7n0J4L2J6m2%N0k9%j4P1mm9kJ7K3p0L5J2O3r6
1357b8M8j3j8RL1L6n1Pn3lN6n9J8K7L3k4mk6j8M1k5J2k7QJ3jO3n1L3q9R6q3L7
1390eJ4j18J12N5j7o5J8Ol2M8OJK3ll3nK3J%k8K4K6o8L2m1%K2pJ9q6P5m8K9J2
1424a0KM4p1J6J6mm2RL6oP0l0m3J5Nl4K9rnP2j05J2N4J6p5O7k0j1KJ6k5M6l3p2
$$ plain form
1192 -44 -22 1 -20 -29 -31 8 -3 -46 -15 81 27 -41 1 -7 -19 -46 -8 -18 9 47 20 59 5 16 -5 -75 0 -14 12 -14 -36 -12
1224 -12 31 -1 -28 9 54 1 45 45 -17 30 -7 -26 -13 28 8 4 -47 -30 -3 4 26 -39 9 -40 20 17 -35 -74 -27 -57 -33 2
1256 2 0 22 -15 28 18 10 43 7 7 -56 22 -6 42 -11 -58 -45 -17 64 -12 5 2 -55 26 14 -40 11 14 -27 21 11 -31 -18 -28
1289 -28 -9 -18 24 -42 40 36 18 -31 -35 -13 -11 42 9 8 2 -59 -28 9 -12 7 -7 -9 0 7 -18 7 20 -28 -33 -16 -3 10 -7 -97 -44
1324 -44 18 -18 -32 -23 -10 16 -32 1 9 28 -42 -5 -55 -41 -9 7 -35 -35 15 -14 -14 -28 43 39 -10 -12 5 28 -42 -7 5 68 -28
1357 -28 20 7 -11 -2 29 65 14 21 -32 -35 21 -38 -20 7 40 16 12 -14 -32 9 -16 -4 -31 -23 -10 -11 52 1 34 -55 41 -42 -5
1390 -5 9 -109 3 58 41 -24 -6 0 -32 16 22 23 46 43 10 5 28 29 29 1 25 51 -17 15 -26 -26 -4 -11 8 -78 -3 -51 -22 -10
1424 -10 -8 36 -35 -19 -3 -7 -49 -40 -4 -10 60 30 -13 2 7 -27 2 -7 -12 60 -45 -33 21 37 -38 29 9 -2 0 16 -9 37 4 -68
1458f8j9O7K7l3j3M5l3K2k0LJ0Lj0L8l9L9r8J0L1lpM2J7l9N7ml3j7M8k2L2l4j1
1491a2Q0q7M2o5L5L5k5Ll5p8P5J2k8M6oM4p2L1L4p5L1k9Q5j4Ko0K8j1K7l3j1J4
1523a7OJ05n6l4m0K9j4J9j9k6J3M2l4M8m3O9k0k1J5J7j6l5J8M5m2J9n6K8l4K9
1553eJ2p1K9j1K4M1k1j6L3l4LjO8r5rP7J02j25p1R0L7o5Rj2K7J0L9p7LL9L1l4
1585B7Nq8N8RRn2J9J4j2Nj3O6k8J1n7o0J70o6p7J1J07l3k0ll3M1j7n5L2QK4jL
1618DL0j7j9K6m4J8P3p3j6J7N1k9o9KO4OJ1j14M6O3j2o5rJ5M9O1j34Q8jJ3k9n4
1650d8O9J0m6rj1L7P5j38K7N4L6n0K4p1O9k7N6j53R2N2o3J6m4M8jL6m4k8M3M1
1680E2q0ON6k6J3n6j4R5n2J0j02P9P0k4j05N7L3K1o7K0J8L6Jq5M8N1k0j0l6J3
$$ plain form
1458 -68 -87 -20 7 -26 -39 6 -27 -5 -25 -22 -12 -9 -19 19 -20 19 -79 -69 -38 -41 -48 -6 11 -28 29 25 -8 -25 23 1 33 -1 -12
1491 -12 68 -19 23 -42 -7 28 3 6 -29 -107 -32 -20 -48 -2 -8 36 -36 -5 29 -46 -15 -44 41 27 29 -31 -3 -14 13 -20 -31 -17
1523 -17 -11 94 38 4 -36 -7 -21 -2 -21 -47 -34 8 -26 22 -21 48 28 7 22 39 23 -12 6 51 9 28 -28 0 -34 -5
1553 -5 7 -64 -35 -46 -22 19 -2 -18 15 -19 -16 -17 51 -44 -53 24 126 1 -70 20 57 -8 1 -11 16 26 65 -12 -9 30 61 27
1585 27 32 -56 2 11 20 -32 -13 1 -11 -6 -19 47 19 30 -27 -87 83 17 -60 -49 58 25 5 2 -31 10 -7 -62 -30 -22 2 1 4
1618 4 34 17 -2 24 -20 -2 71 -2 -18 -1 50 21 -48 -46 18 24 35 -79 -33 30 18 -47 -56 -41 8 69 -65 23 22 35 6 -48
1650 -48 21 31 -15 -24 -35 2 77 -61 -34 20 56 6 30 -41 28 1 57 -96 -4 48 -15 1 -43 5 4 40 -4 -32 11 52
1680 52 -28 -22 34 8 21 -35 -49 46 -6 4 -98 -19 51 27 -78 -21 12 33 -34 -14 4 40 41 -44 4 55 35 25 -11 2
1710BN0m1qJ3LK2o1n8P7L5k4j3n3N7N0k7p3k6J64o6j1j24J13L3l9m2m5J11k8j1
1740b0l4J2R5m3n8%J11k6o3L2j3N7n1n5QN8qk5l2K4R2k7n9l4O7J6po3M3O2j02
1771d3L8k3mJ01p4n4J9Q7J9r3m4L7R7o6n3N5J8Q7j14k6pJ23K7j68J2R4J2m9n4
1800d6j6J49j01K9n7N5J4mj39R2K4L4r4j7J15pm9qlL9J8q3NR7kj23oL8R0l4K2
1831C2o9O4L9j7r7P1kL9m1n7O2Npq0j3J26n4J2j05Q8J7L4r3J1R6k1p2o6M6K1J46
1862A15j57nM0M8m4m5pJ18K2p5p0R1M1m0q7K5N2Q1o9q6N8N3pj76L9J02N0r4m1
1891f8K3J51j02q9M9O5%J8j00N1M1K0r9pO8M3p4j2J2R9q4n4m0J08O2j19m0K4J51
1920I7o9l1j03R8N9L1j92P6Q7J6p2q7Q6Q3m0j21J3Q0Q5j41j2qL1M4q0rR6OK4j07
$$ plain form
1710 2 52 11 3 16 19 41 -20 -78 -1 34 10 -3 -56 1 51 24 -49 -75 89 23 12 -112 1 34 -5 -47 -92 19 -9 -20
1740 -20 -54 -42 53 10 -48 -48 63 37 -26 6 -7 50 -1 -56 -48 10 2 -23 -55 -31 61 34 -25 -59 8 24 17 -46 -3 59 -43
1771 -43 -5 -28 -32 69 -5 -59 -40 47 66 -27 -71 -34 63 -3 -56 -1 17 104 -10 -36 -43 80 107 -61 -49 45 57 8 -46
1800 -46 -62 87 -14 15 -42 13 27 23 -116 -24 0 34 -60 -77 38 31 -18 -26 -29 10 28 -55 -50 47 45 -78 -84 -46 44 10 32
1831 32 -37 27 66 49 -48 23 21 60 19 -38 24 29 22 -58 -71 55 1 13 -92 -4 13 47 -46 -35 61 40 -32 -98 -52 -31 115
1862 115 -42 -47 -7 41 -3 -48 -55 63 85 10 -60 31 72 32 -55 -30 22 103 34 -52 6 59 52 -124 -85 17 67 -27 -68
1891 -68 -45 106 4 -85 -36 29 29 47 -53 -2 39 59 -40 -47 21 64 -10 -22 -10 89 5 -49 -89 19 81 -38 -78 -54 97
1920 97 28 -3 -106 -8 51 82 -110 -34 53 69 -3 -90 -4 79 39 -82 -69 11 96 -45 -57 -65 -34 10 -70 -79 17 23 47 -60
1950f0P8OK0o7J2O3L3l6q6M9pK1j09L4L3Q7pj74Q1J03k6o0j2Q4J9m7p3O1K3k8
1980A5q7k1J03K8J2j30N1Q0L7r6n3N6N3Mo9l9M8Lm2L3L0O3o5n7J1J03K2j21l4
2009f2J9J24q6k6m1L4P4m8j4%O9L4r1q5Q9M6%j06o2K16o1j00L0K0M0J8o1KN9O9
2039A00j36o6J41O8k9j35J7R4lqq0j5J30n6p4o0J82J7n9j00K2R3J6j19OK8R7o6
2067Ej42J18L2M5q3k8O0jJ5q6N0L9J3p9p4O7J21q0n4M1M2L6p4m4N1Q8q5k5MN3
2097B5Rl1o2O4M5k3lo4O6j6n5l4K0L8Oo0j6Q6L8l4n4L6K6K7p4j9M8P8j08M0n0
2128e1Q6j3Or1Q0J0l3n7N0J8N3k8j42J18K5k6p2Q2J2J6o3k7M9M4k5n1j4L0J7k2
2158a9m4K1L4P3p5m0O1MJ2o6k0R7j8K5pkK2r3j6K4P2J3l8m2OJ33j02m4m3J13J0
$$ plain form
1950 -60 18 24 44 -23 -11 52 85 49 -37 12 5 26 -83 -49 -16 71 64 -110 -29 74 48 -12 -24 60 79 32 -41 20 43 15
1980 15 -72 -93 10 38 50 -80 -29 51 88 -8 -61 -5 48 52 -17 -56 -8 -5 -47 -14 16 79 14 -43 -32 71 93 -28 -62
2009 -62 -43 81 -5 -31 -72 -38 36 -12 -26 -26 43 77 -14 -99 -10 36 36 -70 -132 84 23 -77 -47 -27 13 31 -30 -28 31 100
2039 100 -36 -102 39 107 78 -57 -40 54 51 43 -37 -52 78 22 -52 -112 70 87 28 -72 -50 43 59 -60 -54 -26 71 5
2067 5 -137 -19 13 58 -25 -53 7 6 21 -65 -15 24 37 -42 -116 -49 72 -8 -62 -21 21 57 -17 -61 -10 78 -7 -32 -28 25
2097 25 34 3 -59 5 50 27 24 -40 26 10 -45 -79 -59 -21 -15 -75 -91 -5 33 -1 -55 -19 7 34 -40 -59 -11 67 -41 -1 -51
2128 -51 35 22 28 -63 17 27 -6 -63 -13 5 58 30 -112 6 31 5 -67 15 27 43 -20 -47 2 46 21 -30 -44 -14 3 -19
2158 -19 -63 -42 -8 65 -10 -50 11 15 27 -39 -59 38 20 45 38 36 58 -35 -51 -27 45 58 20 -22 -16 117 15 -29 -72 41 51
2189E1l6l8J6O9j4p5k1L9P4q9k0OM5J5q9J0P6J1K7m2m8KO0k4l7M7Kp1OK1J03l4
2221D2pq3K8N2o2L3k5O1k5Ko1KP0k9k1L9J1l8k1qP2l9l4Rm9J54j12L6Nn6Q0K1
2253D7p0l9Q6K5Rj43M7J22j26M7k8Q2Pq6k3k4J14K0o3KM6r1O5r4O4nj2pL6l0M1
2284A9k0l7nNN1j3m8Q8J7n2k4j9J7M1l8pJ8L8l2ooN8Np5J6k9M0P8o9o0O0O8j17
2317c8M2l5J3K2J1l9M2l1m0L4m9P7L5n6J8L0Knl8J2J1qj4mm0K2O7l5k8K5NOl4
2350b0K8mprn8N3M4m5ml0M6o0O6mJ%k0OJ9J8L3n6r9Q3M4p2R5q4O2%q7K7J3LK2
2385Dj8L4L6p2K8n9N3P1m1p5M3J5Kn1QL7k0J3J4Nl6N9o6j0Ql6P3k1qJ3j7lM0r3
2419g0L1Q9m6j1lJ4N2k7J5o0m7J01l2Ro3N6k0oJ2M7o4kJL9l3J7J2mn7R2m0j1L7
$$ plain form
2189 51 15 -23 -7 62 48 -27 -48 -9 65 -24 -44 -38 7 22 -67 -57 19 30 57 15 -33 -31 29 5 -32 15 17 -54 -48 -27 76 42
2221 42 35 -48 -20 32 -30 3 -22 39 14 16 -45 -43 27 -2 -23 16 27 -11 -32 -40 32 -7 -41 -32 -81 73 -39 -3 2 -54 26 47
2253 47 -23 -62 24 49 58 -85 -38 84 -42 5 -23 59 66 -20 -43 -67 47 67 4 6 52 -39 26 -68 -4 -9 -21 -28 8 -22 19
2284 19 -1 -38 -43 -38 13 0 -48 40 57 5 -19 -38 -21 20 -18 -25 -7 31 -1 -7 -13 45 50 -25 -9 -38 2 80 11 -49 11 79 -38
2317 -38 4 -31 -18 4 15 -24 18 -13 -53 -19 -68 9 44 -12 6 36 38 33 -5 7 18 10 -4 -8 -48 -26 41 6 -22 3 8 14 -20
2350 -20 8 4 -3 -12 -70 -17 27 -18 -22 -52 -6 -66 0 -4 -3 -3 -23 -17 2 20 53 -3 -102 -19 25 -47 48 -36 26 26 -61 -34 -21 -18 4
2385 4 -14 20 56 -16 12 -47 6 77 36 -39 4 19 21 -30 -22 15 -5 8 22 27 -9 50 -16 -26 -18 -54 19 -2 -10 3 -14 -17 23 -70
2419 -70 -39 50 4 -7 -10 4 56 29 44 -16 -63 38 6 15 -48 8 -12 -18 -6 41 -23 -25 -24 15 -18 -1 11 7 -50 42 2 -9 28
2452B8o0M2k6n7P1j0m6O1npL1n0K1K3Rrj9kP1m9o7P8n1O8o6pK3j2K7j8K6j6L1
2485C3l6l2J2J2n9K4j3L2j1M7j0K3Jj20J02L5k4k2J1MK7k8J9m8k2O9m8J3l6K4
2515b1N3L5m8k1L6n6L5k0j2N1k1L1n0kJj1j3k0lPJ15q7Lk0J4J5l3oP3n4L3Lm5
2548c8P0p9L8Lj5P4n9K0J1k9j6J9n2M2M2m2j2O1J3p9K0N2j02M3m2O6N5o8rOn0
2579e7J8O7j29J23Rp3N7p4O3m9L8nl6P0Nm5K6l7QL8l5M7j8RJ6K6p0J4K8qn5N3
2611B4m9O6l2Kj1j6qJ5Jj5PNRK2J7m4l2N7K8o2k4M5k0j2J6j0M2ol6qL0J3k8kk6
2646d2O6m3j0M3J0k0K1k2m3j1L9K3j2O9p9Mk8Q8k7j2o3P4l6qJ6J9Nl8m4Q0j6j4
2678a1L1j4pM9l0p1k7J41or1M8k0L6m9N8Pq5K8J4n2R0j3j00N5k0L1L4n4M2l6J6
$$ plain form
2452 28 -32 10 -16 -73 -2 -12 -58 3 -2 -9 22 -28 -7 16 25 16 -3 -5 66 17 -50 28 -23 45 -21 -28 -5 -17 10 -8 18 2 33
2485 33 -3 -35 -23 -11 -70 -46 -59 -27 -38 9 -1 22 23 -97 5 40 16 -6 5 9 36 8 27 -21 -43 26 -22 -9 -45 -21
2515 -21 32 67 19 -2 34 -22 13 -7 -19 32 11 42 -8 -10 -9 -20 -33 -53 -56 -49 66 -21 -18 -38 -24 -9 -42 -48 25 -29 4 7 -38
2548 -38 32 -47 -9 -6 -21 53 -6 14 25 -4 -20 -1 -53 -11 31 -11 -23 38 51 -28 -8 44 -58 -15 -57 9 64 -4 -13 -7 -57
2579 -57 -39 28 -101 22 31 -42 15 -59 4 -45 -7 -12 -48 22 27 -18 8 -29 -21 17 -18 29 11 20 36 62 -8 6 34 26 -29 24
2611 24 -25 41 9 11 0 -16 -24 -9 -8 -23 -16 -11 -2 20 37 -7 -39 18 46 -16 -40 5 -15 -27 -11 -21 21 15 -21 -29 1 14 -14 -16 -42
2646 -42 24 -19 -29 14 24 4 25 3 -40 -51 -12 11 -1 68 -11 -7 -35 53 26 14 -49 25 -11 -19 -3 16 21 -17 -61 19 3 -11
2678 -11 20 6 -1 48 18 -53 -80 61 55 -36 12 -8 28 -21 37 44 -41 -13 1 -51 39 26 -74 -19 -39 -8 26 -28 14 -22 -6
2709fqL2Pn4mO3j7k7KK5J3j4Nk6k4J0O9j4k8M2rkl3qOK6lj2jl1NK9j8N4l9k8j8
2746c6k5M0K5k8L1Jl0Np6P0L6n8L5pK1J0o3M2J5k2%L8j5K5l6j3M1m8j7M7L6k4
2778B0Lk9N4q2L1K0J8o1j6O6k5n4O3%l1K8k3jJ7km7K5JM2m5RqpP5k1j1K0k7K9
2812C1l6N0q2L6L1j5mJ7l1j3ORm7R3m2k4qJ0Q1n3j6m0%P2n3K9m7M8J9n0qj0L9
2845hj6J3Qpl8L7J3j4L9p3O5j4J9J8m2N7p4J4K9j9O1l0n9Q3m1k9PP1j06M0o0J08
2877E2q0k2J9L9k3J8l1J2rJ8l0l1R8q8J03r2K8Q1p9M2%k2k5OJ7rK0j6J1m9O1K5
2909D4l0k4J7j2j2L9o1L4K3M6j13PoN9qnJ6q8M9m2K1N0p6P4ML7j02M4J05r2N6
2940E4l3n8N7l6J9l1O0j8j5Lk0J9m3J9L2k3K1j2L6m7lOM8J4p5ql7Q2m2N0o4J0
$$ plain form
2709 -6 -14 18 25 -29 -33 30 13 -14 -12 13 26 12 17 -9 -33 -23 46 32 4 46 37 35 2 -6 0 26 23 11 10 -21 -16 13 -5 49 10 -18 -36
2746 -36 -61 -21 4 -24 7 8 -22 -17 -93 -23 13 -45 -10 -17 4 14 -49 -7 8 -14 -14 24 9 34 -2 -15 26 -22 -39 8 44 20
2778 20 23 -6 48 -34 -3 17 35 -26 -42 24 -1 -55 8 8 -23 5 -18 -19 -2 -4 -51 -26 -25 17 -28 -19 -27 -34 41 20 9 29 2 31
2812 31 -5 45 -37 -1 30 15 11 28 -3 -16 -10 -1 -48 45 3 -21 -29 -19 62 9 -7 -47 -47 25 -28 1 -46 2 21 -29 -37 -47 -8
2845 -8 -24 -11 -3 -10 -48 -11 2 -12 27 -46 19 5 24 42 0 57 -17 -3 26 7 68 38 -21 62 21 -8 -1 70 -36 4 -56 52
2877 52 -28 -50 -31 8 -15 3 -28 -16 -25 -7 -37 -68 30 -58 45 -47 -19 62 -17 25 25 3 -22 -16 1 -8 12 -4 7 -42 19 44
2909 44 14 -10 7 -5 -17 22 -39 -5 18 64 -49 -42 -48 11 3 -2 14 -74 -25 -67 -46 4 -72 2 6 43 -59 -15 90 -2 54
2940 54 21 -37 20 -16 3 -28 32 14 -1 2 -18 1 -42 -23 9 -14 7 -5 31 -16 -19 -13 35 49 -26 -34 -71 11 -31 19 -45 -35
2972c5O1l4j9l1K6M4j1pj8jJ1K3J6n9O4l3Mj6K9K1K4n0l2J1l1M1Lk1KpNnj2L0
3006gqjK8l8RL5o0J06p3qJ1kOm2J2mM8l2j4K9k4N0j9j3K4K5l1j3n1O4O1q6j4L6
3040DJ7qk9rN5p4Q2l2l9N3n1L7%mo3L0jK0K5n2M0K9Nj1mMK5k5m8R2n6n3M9k3J3
3075bJ2M2n1NK8j7k4k8L7M9l1k0m9N2ok0L0J6k5nN9n0nP4k6l8k0nK2Pl8P6m8M6
3109D7m0L1k5o1O9k4O5r1j5M5K1J8n2l9O6rn2O8jn6J7oJ6J3KJK6k9JJ3q1R8r4
3142e8L8j4L7kjNoj8PO8n1J9J7m5K1J0n6P7n9M5m3K3pl7JM9j7jJ0q2N4J0l7N9
3176A6p7O8K2p7K6L3o5P0m2O1j8%j5n2N2n7J05o4J0l6P1m4mM3n6M7p1N2l8KM8
3207A0m0M3JM9n9LJ3K6m4J2j8J2j3Rl0NJ7K0M6qn7m0K6k5K6oj9R7l0k0j6K8jn1
$$ plain form
2972 -35 26 -8 -27 -58 -32 12 1 -6 -24 -25 -14 9 25 -34 30 -3 1 -15 14 35 59 9 -23 -12 -43 -2 1 -20 -18 -25 -20 -25 -37 -7
3006 -7 -15 -16 12 -26 -17 18 -42 64 -9 -17 -6 -8 -2 -44 -32 -36 12 -20 -34 -5 -29 21 2 -11 13 38 7 -6 -57 7 68 -18 -32 4
3040 4 21 13 -16 -25 30 -44 38 6 -33 20 -31 6 6 2 -61 -31 -32 -12 13 -39 1 30 35 24 20 24 49 24 -24 68 12 -41 8 -15 -2
3075 -2 10 52 1 6 34 17 -7 -35 2 51 20 0 -49 3 -3 -23 7 23 -2 -7 52 2 -3 71 45 7 -13 -18 4 11 -27 49 1 47
3109 47 7 38 13 -48 21 -3 62 -29 -44 1 22 40 -12 -51 15 6 -46 22 21 -35 -18 -24 -8 5 7 8 34 5 6 19 -62 36 -58
3142 -58 -20 -34 3 1 0 5 -1 -19 -12 56 5 24 41 -4 17 27 -29 48 -11 34 -9 14 7 -30 -29 20 3 2 12 -70 -16 -6 -43 16
3176 16 -61 7 29 -48 -22 11 -54 16 -26 35 17 17 2 -50 2 -55 50 -14 -4 -40 31 -13 -17 26 -30 17 -54 -2 -40 -38 10
3207 10 -30 13 14 63 4 7 20 46 2 14 -4 8 -5 4 -26 -21 -4 16 62 54 -3 -43 -17 -42 -16 -22 -41 56 26 6 -10 18 17 -34
3241c4O4n1M9nj8jl0P4lK8n2lo7N2J1m9M4Po4M6k9rjK6J8j1K8m9J3L1p1O5J0k2
3275ck7Q5q9L7n4j4O0oj4P2j0j8l2j8L6l5K9M0m5j4Pk1N5m1%k0P5l6L9j3l2pm
3308a8Jjk2JK9j6K2Qn6N8j0K8l4jL9l3l5k1K8k1Q1j8l6oK1lQ0j11M2M7l5m1L0
3341cL5j18Q5n9P6K2m3j7J7m2O2k3k0J0kL0m3N8n1oQ8m3j2rl7J33q3J9mJj9qN5
3374D9j6l3K2m4M9j6N9m9l1M0l6K1k5K2l2j3K8O0m0om1K6k2LK7m0J3LK0K3KL2
3406E5l1j5MJ9k8k4J1MK7j9%K9m0m4N7J8J0p4QO2J1p6O5n9R8m8nk3qM3l8M9k0
3439A8l0ONo7R4m6L6k1QM6r2O3kK6o1J3K2PJ0m2J9L8m4qL2j3o6P7k9o5OQ1j3m4
3473c6j6L2J1OoK9nk1rM0J9l7o8Q9l1k9L0%K2l3Q7j54Q7L0k2k9J4M9j04P1M9o3
$$ plain form
3241 -34 30 -21 28 23 5 4 -26 48 45 73 21 18 -49 3 14 -35 9 16 -48 -2 -31 -40 -41 -15 3 -8 20 -29 -16 15 -56 9 19 -3
3275 -3 -30 55 -34 3 -51 -65 -5 -11 -25 47 37 19 -13 -31 5 -30 -1 39 -6 -20 -13 -34 21 -20 -20 -40 35 -1 38 25 -7 -14 -18
3308 -18 -17 -18 -40 -39 -10 -26 -4 4 -52 6 -4 24 -10 -11 28 -5 -40 -61 -33 -54 27 9 -27 -33 -12 -15 65 -46 -4 43 8 -33 -3
3341 -3 32 -86 -1 -60 16 38 -5 -22 -5 -47 15 -8 -28 -18 -20 10 -33 25 -26 -32 56 13 1 -8 -45 88 5 24 20 21 2 -6 49
3374 49 33 0 22 -22 27 11 70 21 -10 30 -6 15 -10 12 -20 -33 -5 55 15 9 -32 -6 -28 -25 2 -38 -25 -22 -2 21 23 55
3406 55 24 9 13 32 4 -20 -9 -5 22 3 3 32 -8 -52 5 23 33 -41 -33 29 40 -36 29 -30 68 20 15 -8 -16 27 -11 38 18
3439 18 -12 -6 -1 -68 26 -20 16 -5 3 49 -43 20 18 44 -17 -4 18 25 35 -7 12 50 6 -2 30 17 -49 28 -1 -66 -60 21 8 -36
3473 -36 -52 -20 -9 -3 -9 20 15 -6 -15 25 44 7 -61 28 -3 -32 -2 -2 20 -13 74 -80 7 37 15 -14 0 49 -55 16 65 2
3505Bk3O7ql0oJ5m1Mj0p%L3k9J0M0k2n4N0N5n6k8M0l7rQ1n6N6k7k4r3J38p2Q6
3538D5m5j4K9MM0r3Lk1L1KJ04j01P1q2K3p6Q4k6j1J%jJ5M9n7K0M1n5J4k7OL9J3
3571B5n0K4l8M4k9mM1j9k8O2n5K2j4mM4KnJ1nkk1p6R2l3K6m3kN8J6j06P1J0j8
3604dM1mm1J6M9r8J04q1l1N4q7Q4j4l7J3lK6L5o1K6rqJ3K4L3l7n7L3o0O3M5j1
3636A6Jl9O2k0J3K4n7JKJ9Jk3k8K5rK4l0j2J2O8n1n4M7j6K8j2J5J6mj3%j4l7M3
3670bQm1K2J4m5Q3j8p5N2j9M0l9pR3o6q2P9RM5k3p5m2N1L3k5K4L7o8k3J9L0j8
3702b9P5j03M0jj7K8JKJ1L9m4M0J9n6L5lm2k7M4J1o1N0K7l2l2Q4q9N7m4N4j09
3733g2N8M0l4J2j2M2m1rJ2L1n4J4J4m1M4L5k1m4L8n9Q9o5R6pq8J5K9k6J2j4P8
$$ plain form
3505 2 -21 46 38 8 2 17 -24 -20 -30 -37 -37 -4 -33 -23 17 -5 -59 -9 46 -10 -38 2 -35 -44 37 -19 37 10 -14 -107 31 -41 45
3538 45 0 -14 15 19 59 -34 -31 -52 -21 -19 85 -16 55 -27 -4 -80 4 -22 -33 -32 -32 -33 -18 31 -26 -6 35 -20 -6 -33 -27 12 25
3571 25 -25 -1 -39 5 -24 -28 13 -6 -34 28 -27 -5 -19 -23 21 23 18 29 24 22 1 -75 17 -16 10 -33 -35 23 39 -67 4 14 -4
3604 -4 37 33 -8 8 57 -41 63 -18 -49 5 -82 2 -12 -49 -36 -39 -13 22 -39 -13 -22 -30 -17 7 40 3 -54 -21 -81 -18 27 16
3636 16 17 -22 40 20 33 57 0 1 3 22 23 0 -28 -3 -12 12 -18 -30 -18 50 -1 -55 -8 -24 4 -8 7 23 19 6 6 -8 -45 -2
3670 -2 6 -35 -13 1 -44 39 21 -54 -2 -21 19 -20 -27 66 0 -82 -3 6 51 28 -47 -89 -38 -5 -30 -6 31 -37 -60 -41 -11 -29
3702 -29 46 -57 -17 -18 -35 -7 -6 -4 7 46 2 42 61 5 40 37 -5 -32 12 23 -38 12 39 7 -25 59 -30 27 -17 37 -72
3733 -72 -14 26 -8 4 -8 34 -7 -16 -4 27 -27 -13 1 -40 4 39 18 -26 12 -47 42 -23 73 66 -22 -7 22 -4 8 -6 72
3764G2n2k3n3P6r7M8L3k1K8Jp9J18k6k0Rn0Pp3P3M0j7j0K2j5K3K3o5K6KPM2n9
3796a0ML2J9J3o5K9jj5KQ1m5j9p5N1J0nj8j5N9k5L9m5K3Oj21R4j2J1p3R5j9mq
3829gk9J5K8L6j00M0l4N5M0p1L9N2l6K6n8M1m2J3K7j9m1O1p2M0N5j6j7j1k6O%
3860ek9J6K6j4j1N0m5L7k3k7O4p8M2k3J5L8ll0l0N0oJK1j2Nj3n1L4L6n4O1m0J8
3893B0OJ9n8L1m5K4k7M4M6j7n4J3qm0R3n3%l3L2J0Pnk7l7N1l6O7k1k8K0L4m6L1
3926A3nJ7Nq2P3j9pom0L6oLPl5O8n2M4k7o1N4O3j9o8J4L4rLk3L3l0N9m1n5PN9
3961Gqm1j5R6m4K8K2n6KJ7qN0o7N0k7M4n4j1N0o1PMl2L5k8M3j4j3kL0J3k0L2n9
3995c0P1k1L0o3lO8p4ONM2rk6np0P5j8%%M2m4j2J06p8mj5kK8pj0M0k3J8l4k5R1
$$ plain form
3764 72 20 -3 -56 20 -77 -29 4 -17 11 12 -67 51 25 5 14 -36 -29 -102 -29 11 -6 -16 6 -9 14 37 -28 -2 0 7 49 -10
3796 -10 -6 26 45 58 -7 22 21 6 8 89 44 25 -50 1 11 6 -12 -27 32 7 46 1 24 30 -91 3 -9 2 -71 24 5 1 -7
3829 -7 -36 -21 7 43 -57 -17 -51 4 44 -27 12 64 28 54 -4 37 -5 8 35 16 -25 36 -36 4 59 43 26 15 -11 -5 -5
3860 -5 -34 -18 8 -6 -17 33 -12 25 2 -25 39 -39 3 -20 -5 33 30 0 -30 20 14 15 36 24 29 16 -35 -1 35 -19 42 2 20
3893 20 26 45 -13 18 -27 -3 -30 14 60 43 -11 2 -6 -46 47 -6 -6 -39 -7 3 10 5 -22 -59 -8 -44 23 2 -26 -6 28 -18 13
3926 13 8 25 30 -52 21 2 -5 -11 -51 -15 -21 -18 -11 -46 22 -30 14 -13 -74 -20 43 24 -44 -30 4 -5 -2 -25 8 -22 37 -4 -59 -52 7
3961 7 -1 -42 -57 39 -5 23 45 -11 -9 8 0 50 -17 33 6 50 -4 -15 35 -26 -19 -15 -47 -12 -40 3 -11 -24 -26 4 17 -3 29 -30
3995 -30 41 20 50 -13 -16 52 -22 -16 -11 31 22 -4 -9 -79 -4 -22 -22 -22 20 -24 -36 70 -8 -12 -27 -29 -1 -8 -18 22 -1 17 -17 -42 49
4030D9q2J3J1j1P4j9k1l9Rn4M8J9qJ5j8J6L6l3k8M8k5K1o1P7n4K9Pm9R0q0L3j7
4062dN1o8K3j6L8Ll7k0mR0p5ONlj9Q6o1Pk9k9J8O9K9r9R4j03O6J5qm9k9O0K3j7
4096A3K1rk5Nk2O5n4j3K9j5J7mk5K3j3j0j0j3J0O6n0m1qL6lK3J8k5j9J3M4o7R6
4129E3o3Nj3JO9o5N7o4L4k4LL6l8M0Mj9m7N0Oj7N2j07QR1%o0kJ5L0l5r2M0N3J0
4163A1m4kJ0M1k7K0l7l9%O6j8M7np5M2Q6q9JP5o9O3r4L1K2l7L3l3J4N2n4K3k4
4195a0k1J0mrJ1K1J5l7Jl9R6k6J9l0qj4O1m0qJN5lq1qK4M6l7K9m1L6K4p0O9p6
4229d4L1k7P6l0ONm6k4M0K0Mm1L0J5j7J2k7KRp9P9j5M5j2k9%K7j5j0mM3RL0p5
4263a2N8p7k3R9j2o4O5L2rr3L6mj6kN2j3mn9J4N7m3J0j8J8rJ5mL8o4J0J6l2N1
$$ plain form
4030 49 -33 -20 -9 -20 54 35 14 -25 -16 -70 -22 -3 -11 4 -14 2 38 5 -23 25 0 21 -40 37 -17 12 19 -30 60 -20 13 -4
4062 -4 47 -21 2 -14 24 27 -10 -30 -34 56 -19 -13 -8 -11 -30 56 -5 2 -27 -56 -38 31 60 -39 55 -48 18 33 25 -24 -53 7 30 13
4096 13 34 25 0 5 -17 48 -6 -19 10 -5 12 8 -17 6 -7 -17 -27 -40 -30 36 -14 -55 -63 -27 -30 -7 11 -14 -33 -20 24 -43 53
4129 53 -10 -5 -18 -17 52 -13 44 -20 14 -10 -7 29 -9 31 35 16 -31 19 25 8 60 -47 -39 52 52 -8 -10 5 35 0 -92 -52 1 11
4163 11 -33 -35 -25 16 -11 9 -28 -67 -67 -1 -19 28 23 -52 -10 76 -13 -12 63 -6 57 -37 -6 16 -21 12 -21 -7 45 -9 14 -10
4195 -10 -31 -21 -25 -34 -23 -2 13 -24 -23 -62 34 8 27 -3 -11 -25 36 -4 -12 -11 44 41 -40 -48 -24 22 -15 14 -27 9 33 -37 32 -44
4229 -44 -13 -40 36 6 12 17 -29 -53 -13 7 11 -30 0 15 -2 10 -17 -15 -6 -85 -6 -21 24 12 -17 -17 10 -5 -15 -19 24 33 63 -12
4263 -12 46 -31 -54 45 33 -31 34 66 57 -36 0 -4 -20 -22 30 17 13 -46 -32 25 -18 -8 -26 -8 -17 -2 -6 32 -32 -22 -6 -38 13
4296A3m6K6j7k1j6P0J3p6O2m8M9rK5noJ5p9R2Jl0k7N6k9qL9j4m1L3k2J7%l5l4
4329e2Q3p4K0k9K3O0J9n0L9k3J1j5m5J9M8nm0ML1j5j6%j6M3OK5k9j8lM0r4P1m5
4362b7K8Jj4k7K7P4mn5o2O0k2pj9N5m4j3K6j3M1l%nL2r0L3J4k7M5J7N5q5L6kk2
4396CJ4oj7PM1k5j1M0nm4L1nj4j2Ml8L5j9o6Q5k6J6QJ3K2o3L9L1k6m4OP4j3p7
4430d2N3mL4NJ5n8L9j6lj2J2j5J4J1j8kk9k2m2M8K7M0l0rj1K4k9l0K7j0N3l9R
4463a0k8kK3O5o3K0o6O3J4o0K9K4k5lP8nm9L5l5k1L3k1k5M9l0Qol0P9m1J3k2J4
4496Ek1L4l8RJ0K9ko8Q9l8k4K7j9qJ5j3L1l3k7O8l9L7l7j4L2Q5p1L3q3K5K9l3
4528a0j6k9mN7k1O5k1n7Q4m5j0k1K2NMq4Q8Mj8k1K8J9Pj8o3J8L9K9p5N7k6J6N
$$ plain form
4296 13 -33 -7 -24 -45 -61 9 22 -54 8 -40 9 0 25 20 14 29 -50 42 43 13 -14 42 13 5 44 30 -11 22 0 17 17 -18 -52
4329 -52 31 -43 -23 -52 -29 31 50 0 39 16 27 12 -33 -14 34 29 -11 -7 24 9 -7 -7 -23 20 26 51 22 4 1 41 -53 18 -27
4362 -27 1 2 -12 -39 -12 62 58 3 -59 1 -21 -28 -47 8 -36 -49 -23 -36 5 2 2 -3 29 -61 -28 -14 -41 4 21 76 -9 27 25 3
4396 3 17 11 -6 1 42 17 6 46 41 -3 28 23 9 -3 1 -37 -2 -21 -87 -2 -28 -12 -4 9 31 -32 7 38 12 -32 -26 48 35 -42
4430 -42 11 7 41 46 61 3 42 26 23 11 23 8 22 33 15 13 -16 -38 -80 -32 -5 35 5 -4 -15 9 -20 -50 -23 -33 20 -19 -10
4463 -10 -38 -40 -17 48 -15 5 -61 2 16 -44 -15 9 -16 -19 59 54 5 40 5 -16 17 -4 -29 20 -10 -2 -8 -38 41 0 13 -9 5
4496 5 -16 18 -20 -11 -1 28 26 -42 47 9 -15 12 -7 -15 0 -13 18 -15 -42 26 -13 24 -13 -27 5 90 19 52 -31 -6 23 -10
4528 -10 -26 -55 -59 -2 -23 42 21 -36 48 3 -7 -28 -6 -1 3 -81 7 11 -7 -28 0 19 26 8 -55 -37 2 31 -44 13 -13 3 8
4561Hl6j0P8l8J5PLNl9O0n3M9n0k1J22j19k2M2RL8m9M1k2k3Pj7l3M9l3L7k5L2
4593A2k5N9J0k3o3J4o5M2P1j1L4o0L0k7N7n9M0j9k0N0k8J1j5l4Rj6N5p5M1j8K6
4624CNk4JNNNl2N6o2K2L4j6Rq%k9J5k6L3j0k3K8k2L5kj0OrKN6j5j9nr5Q8L3l7
4661cM3m3N8n1k4J6k9l7O3J5k4L1K9j03M8Q6o7K7n6j2M6Rk9j5J4j1K8Mj7M4m5
4692eK1L1p8K1RnQk3qN1m5L6j7j5j2k2P4%L4l6ro3J7O5n3%J8k4K9lJ8j9m8O4j7
4727fl7kL1M7j4m3nL9J4K5n3L4J0n2J4k8M4k9k9j1Q5n8pM3No2M3L9l3K0k6Lj1
4760a0k4L3%K4Ln5K7j3J3j6P8o5l6O6k5M0m4M3rj07R5j4O0K9n9k8k0jkJ7j0jM1
4793C0p5L1O1m1o0Q4p5N2J4k0k2NJ0LoM8jj8j3Ol2K1O8m8k0K8K6k8okJ3l2M9n2
$$ plain form
4561 8 -28 -38 40 2 17 24 27 32 -7 53 0 49 -1 -22 100 -19 -41 1 10 48 -1 40 18 -5 2 -15 -48 1 -32 5 -20 12
4593 12 -13 46 56 33 -30 -16 -81 -39 32 21 55 -5 25 -2 55 -4 36 17 -3 47 19 30 15 -19 -10 -26 29 -46 -5 -23 3
4624 3 8 -16 -15 -10 -5 0 -32 24 -38 -16 18 2 11 3 3 -26 -11 -37 -4 -14 -37 -9 -31 4 2 -8 -2 -11 -9 47 32 13 8 -87 1 34 -3
4661 -3 40 -3 55 4 -20 -4 -33 -70 -7 8 -16 15 44 -59 -11 75 8 35 -21 -33 13 22 -7 -22 -8 -19 9 13 -4 40 -5
4692 -5 16 47 -31 -10 -1 -6 2 -21 -29 22 -23 13 -4 -19 -31 -53 21 21 55 19 10 -53 -36 29 -24 -24 -6 -30 -1 -4 14 -5 -53 11 -6
4727 -6 -43 -45 -14 33 19 -24 -29 10 24 49 -4 30 40 -12 2 -26 18 -11 -40 -51 34 -24 -31 12 17 -45 -2 37 4 24 -2 1 -10
4760 -10 -34 -1 -1 23 26 -29 -2 -15 -2 -18 60 -5 -41 25 0 40 -4 39 30 -77 18 4 64 93 34 6 -14 -15 -17 0 -10 -11 30
4793 30 -45 -14 47 6 -54 30 -45 7 21 1 -21 -16 -6 -3 -9 39 38 20 7 13 -19 2 70 22 2 30 56 28 22 20 33 1 50 -2
4827bL1m0J1Mj6j9J9N2k6Mj6P1m0l9k9QJ3lK2J0m4J8J0n1K4L6l6L6k7K9l7J7J5
4860EK8m8L2J4Ln4N1K9k7n4L8l8M1nL2q0J8L6J1m1K2o0O1m2%QoM4l0K5j5n2M3
4893a1J8l2J0o%QK7jJ2jj4j8L7MLk1j4K3Ln9K2j2k0N0qK3j5r4N8L0j2j8l8M1r
4928c4K2M3o2O1j3k0k3K5k8M5n2K2L6Lj4oN4L3n8o2N3n4J0KJPm7R9K2k3k0J3O
4961D1l4k8N1M5q7mL4l0L9j4l9L0L6o1K5k3KM8l3j2K1k1L5m3K0J1mM0k3n5L9j3
4993gk9J1%N2m2j3qL2J06p8n7M8l2L6Jn%l9MRN6n9M2k0qJ4n1O3l3J1K6k8R%oK8
5029C3jn6L2n6M7O3k9J0lj9n3K5L9j3j8K7kj8J5n0K2j6J3RL5o6N2l7O4j9k3oM
5062Ek1M6m7k4M5j3k1K3L8n4Rk7O5pm4M1j9L4k8M5k1q0O7m2L3j9M0j0l5RMj1l
$$ plain form
4827 -2 29 -11 0 4 -12 -31 -12 40 14 18 2 73 33 -6 -35 -27 -14 -17 5 15 -29 -11 -1 -52 -28 8 -28 8 -19 10 -27 -10 5
4860 5 33 -15 17 31 34 -20 31 60 33 -21 17 -21 20 15 47 -33 -15 21 32 -9 13 -47 14 -28 -28 -20 -26 18 -12 13 -2 -54 -11
4893 -11 7 -25 -15 -21 -21 -13 14 13 25 24 10 -8 29 33 36 15 1 24 27 -32 -10 -22 -42 8 0 23 8 -86 -28 2 -10 -28 -66 -25 -34
4928 -34 -12 31 -31 30 17 -3 -26 -1 -29 16 -36 -14 22 25 11 5 59 92 34 -28 25 -29 -19 -17 -16 -9 -56 43 65 42 22 35 41
4961 41 7 -21 30 75 -12 -16 18 -12 27 13 -26 4 40 -21 4 -19 -17 31 -2 -14 7 -14 21 -22 -2 9 5 45 22 -33 6 -7
4993 -7 -36 -25 -25 27 -15 -28 -36 -4 102 24 -33 15 -17 19 20 15 15 -24 -20 -11 45 -14 28 8 0 14 -37 26 -7 4 30 2 11 11 5 33
5029 33 32 -24 8 -48 -1 62 33 43 40 21 -32 -7 32 19 1 28 26 8 23 -27 -5 -21 -8 1 36 -30 22 -15 49 30 7 1 5
5062 5 -16 30 -17 -41 4 -9 -30 -7 31 -23 -14 -41 24 17 -27 14 -5 29 1 46 25 -55 12 -30 3 -16 24 14 -21 -12 -8 -19 -22
5095b2j0J9%K1K4n3K6j0j7L2J5l5m9R6j5pJ2j4n6N3K1M5r8mM6K0j4%j2J4J3k1
5127B0k0j9L1k2J2l8N5n6K7kpK6k2N2k7m5L2l1K9k3M2j0m2L3llMK1NpoNJ3J5m2
5162cj9L7N7n1oLjM3J8n5m9QL7m6Ln6J31j4o6m7Q9m9L2J4j2K8q1O4l1L2J5p7L5
5195a7J2j9O5q4J15o1j4J7K1p1N7k0L5l2N1n3P2r7pR2o4k6N4q0L6J9J8k0l1Ml8
5226f6L3P6k5q1Q3mj6j2j2K8n2O1O2pp5j8L9L9l1k5rk4O8J8k2l1j1L0Rr7N4M4
5258B6m5N6j8K7m1k1O1k6j4l3M3n8l1N2loN3o8K3j7NN8p5N5K4k4M1r8O5M2k5k2
5290FM2n3j2lM8L0p3L7pl5L2j8L4k5k3m4J2J2PoM8L7m5J0k3k6N4o0L5L0l3rLM6
5324B8Om8O5o3R%M3n1j1M0ql7K7K5k4J8L8j16R1o0J8l0Q5q2K8QK1o9N2m0jOj9
$$ plain form
5095 -22 -32 -13 -13 8 32 -21 5 -5 -22 10 25 -10 -59 37 22 15 27 13 -43 10 31 76 -22 -26 20 40 26 26 14 28 41 20
5127 20 0 -19 12 -10 2 -36 19 -37 -10 -12 -19 7 -15 37 10 -35 -3 -34 -5 -28 14 4 -38 -5 -8 -11 -7 14 19 12 6 11 24 39 -3
5162 -3 -22 15 72 21 15 18 17 60 78 23 -26 -18 19 -27 -24 -80 51 37 -29 -76 13 -36 -4 10 -2 26 -55 9 -22 10 25 -52 -17
5195 -17 -5 -24 41 -43 72 11 -3 14 35 -36 21 1 36 4 55 2 74 -23 -30 62 -2 -28 26 -54 -18 1 19 -1 -32 -28 -66
5226 -66 -33 43 18 -63 20 16 0 -12 -24 4 -48 13 75 68 -7 -25 14 53 22 -3 -12 -36 32 50 28 -3 -14 16 25 -72 -18 26
5258 26 -19 37 19 46 5 -16 45 19 5 -28 15 -43 -74 -22 -25 -31 22 -46 -23 -40 -35 23 -52 3 27 3 44 -54 11 53 28 6
5290 6 48 -5 -17 -20 28 58 -15 22 15 -20 12 -6 28 3 -20 -64 -52 -40 -33 -39 9 46 1 11 -12 -38 16 -44 -9 21 -12 -21 -18 28
5324 28 34 -14 51 -12 -3 -3 40 -11 -22 18 10 -27 0 25 1 19 57 -59 32 -28 -10 -40 45 -37 -9 -1 20 -49 3 -37 -38 -32 -51
5357e1K6j4N1l6J2k3J3L5q6K3K4Kl9O2plK3N0n9M2l2N2Mo5l1M1k1k9Q8l4l3K8
5389A3j8j0n4M0P7n2j7j3j8N4k6L4K2nm5k1O1r1M3j2L0j0rM9m8j7M7J0NoJ3k1
5421Ek6L2J9n0R2r3M9p3nP4n9k4O3M0m1l2kM5o9pO8qL2J2k1m9jj7M1J0l0M5q7
5454f7L9N0p3N4j7kN9Lk8J1k4rM1kj8K0J0o0K1k3LM3j7o1J8N6n2n0K3M6m7L5o
5487b4M4k3L5l3l8k5P9pk4pqN5l6J5l0m5R2Np9L5K0K5oJ4j06O7J9o0Q3j08R4n
5519A8Kj6o3O7n4M5JL9k5m1J5J9m0k4L5k5P8l7M2k6m4Q3k8Ok5K5p5L8rM6o3N7
5551B1LJ8o4O5M5p1m5L5M7p7NL7l1L9q7K4oj8P2j6m1J6k0L2k6P7k2JKqRj9M4o8
5585b7O4n1l3P3K8m0K9J4n3N1lo4qJ2n2P6K3m5Kl1N5nj3M7l7l3n1J5J00n8j6M4
$$ plain form
5357 -51 -25 -39 12 -24 -12 -35 -22 13 -73 -50 -26 -24 -63 -1 -8 -11 12 62 3 45 13 65 69 4 -27 14 -7 -36 52 18 -15 13
5389 13 -5 -15 -69 -29 48 -4 -21 -34 -52 2 -24 10 32 27 -18 -39 22 -69 -26 -38 -8 -18 -27 22 -26 -43 4 14 19 13 26 5
5421 5 -21 11 30 -20 72 -21 28 -45 -50 24 -35 -59 4 44 3 -29 -31 14 -55 -62 6 -2 30 42 21 -28 -29 -46 -5 5 -25 20 -67
5454 -67 -28 22 -51 3 -14 -16 43 46 18 29 5 -4 37 35 17 37 47 -13 8 -15 -12 31 14 -47 -29 27 -25 -75 -52 -6 -53 -18 -24
5487 -24 20 -3 32 -1 -39 -64 15 8 -16 -23 -31 24 -12 3 -27 -72 20 25 -54 -19 1 26 20 34 -72 -5 14 -46 37 -71 23 18
5519 18 20 4 -59 8 -46 -1 0 39 14 -27 -12 7 -33 -57 -22 -47 31 -6 36 10 -34 49 21 27 2 27 -48 -10 -19 27 -36 21
5551 21 24 42 -22 43 88 17 -28 7 54 -23 -18 19 -12 27 -60 -36 -42 -60 12 -4 -45 -29 -49 -17 -43 34 12 13 15 7 16 -3 41 -27
5585 -27 37 -14 -47 26 54 14 43 57 4 55 52 -12 -20 -8 -60 16 39 -6 -4 -35 20 15 2 49 12 -21 -72 -57 43 -15 -31 13
5617A3Ql6K1j5LM5j02P1P0m0pQk8pJj9L0M1k3k0j7j8J0L5n7K4O1m0ok8O1k7jj9
5651hk2O7r1O6Qk6j7L1l3L1k8jM1lm1R5j3r9mQ7k0k8N8m9K0Rl2L5npl9N2L4p0
5685bLl9J9kPLJ7K8l5m6k5O3J6j3m8l5L5N7l3J9nN0j3Lj3k2M5k4L4j8PLJ3j0l5
5720DL0m4K0pk7POO3n1K9J3n4NK8njl8Rj5K6l8LM3n8M8j3J4mJl6M8on1P8l2k0
5756b5jP5l0k7L1m4J8Pl2J0Q8j14P2l6Rj6J0k0OM3l3oP1j3o1M0J7q4K3l0M1Kq3
5789i2J04M0o0l4J4JL0L2m9OJ7K2%k6%J7kmn4O3l2k3K8PM8n9M3k1l1N7l6qrKn
5824a4L3r6M7mK3kK6q9P1k3Q3k3nLn8QmJ2RmK6mlK7j3lJ1j3J3ormJo1K2m3Q4j7
5862Aj4m3O9k4lJK8K7n7N7n0O8o6k7k6O4j8Nk4K0j8L2M8n2K2P8j24P7Nm8K7o8
$$ plain form
5617 13 21 -15 6 -9 -6 39 -63 8 78 38 31 39 11 4 5 -14 16 57 34 14 -3 -21 -11 24 -33 -9 52 12 6 -22 39 12 11 -8
5651 -8 -30 37 -54 12 20 -6 -23 8 -25 6 -22 -23 18 15 -26 69 56 -43 -47 40 20 -8 50 1 21 30 -2 33 28 21 -18 34 68 -2
5685 -2 1 -38 -19 -21 -14 -11 6 34 -1 -47 -72 -9 7 -6 -54 -89 -54 3 -30 -11 -16 34 21 24 11 -11 34 10 44 26 33 36 49 39 4
5720 4 34 -10 10 3 -24 -17 -11 52 1 30 43 -11 -6 22 17 16 -22 -13 -28 -2 -40 -37 6 -52 -4 -17 -3 -7 -6 -42 6 0 -51 27 -5 -25
5756 -25 -26 49 19 -8 23 -21 -3 4 -28 -18 70 -44 28 -8 1 -15 -5 -25 -19 24 -9 -15 56 43 -18 22 39 -45 -22 -52 -11 -9 -92
5789 -92 12 52 -8 -42 -28 -27 3 35 -14 -8 9 31 31 5 5 22 20 16 -38 25 -7 -30 -2 5 53 -6 37 16 -15 42 6 -2 -11 -9 -14
5824 -14 19 -77 -30 -34 -11 -13 13 -76 -5 -28 55 32 27 30 -28 -20 -24 -12 -3 -7 19 15 12 39 26 23 34 21 34 28 19 15 16 -45 -23 -66 18 1
5862 1 -13 -56 13 -11 -14 -13 15 42 -15 42 -8 60 -6 -33 -59 5 -13 -8 -32 -12 -30 2 50 -2 20 98 -26 51 56 8 35 -33
5894c3M1o5J02n9L9Jj19N8K5j1%L4k0Rn0K1nKJ3Ln6K9J5j8j3P4m2J9J3j6QQ7q2
5927Dk3L8J6rn7L3m3O7k7m7J09p8J9r%M7n3QK5j4K9m3J0l8M2K2qnMl4K0K4m1j4
5961b6lJ6l9O4K6o7K3Rj3O1k3j2j8K8j9j8J4Nm4N8m5K8mK8m4RL2rL7p9K2j8J2
5994iM5m3Jj9mO5q1K3J4%QN0m4j1L9m3K6k7JJ6J5l9J6M3j02R1K7J6n8Ok2QJ7k3
6028BO5p3K4NK5p5m8O2L9r2N1OM7n7J01r1J4P6q9j9m8L7Q2K2j1K3j2r0J3J9M1
6059D9k9k9L8k1Nl1M9PK0J8q7jLOL9Km5m4K3K4Ll9R2j16J5Q7l4N5l6p0m0O6Nj4
6093c0Rl0P4mk1j8J2L6k5j4k0J9L7J4pLQJ6j03NJ3N5o7j2M0J6l4oqP7n4Ro2K5
6127d7OL5j5k1jK2M9n2N2o0M8k6Mj7QN4n2P0k5n1J6P2n4RL9q2Q6l5k3j7l9M0L
$$ plain form
5894 -33 8 -57 45 -14 25 26 -93 -35 -10 -21 -21 13 -7 2 -48 -27 -32 -30 -17 -14 -70 -41 -26 -44 -57 17 -25 -6 7 -9 -1 86 4
5927 4 -19 19 35 26 -31 2 -41 26 -1 -48 61 -17 2 -7 -7 40 -13 -5 20 6 35 -8 2 -36 6 28 20 15 19 -15 5 29 -12 -26
5961 -26 -29 -13 -52 12 38 -29 -6 3 -10 51 28 16 -2 26 7 -11 3 8 -36 22 -23 5 1 29 -15 -6 26 17 54 -25 -3 -21 -9
5994 -9 36 -7 -6 -25 -29 36 -45 -22 -8 -8 0 50 6 -5 34 -9 17 -10 -9 7 22 -17 -1 42 -60 31 58 74 16 22 0 8 25 2
6028 2 67 -6 18 23 48 -27 -75 -13 26 -66 -15 -9 38 -19 82 -9 5 81 -8 -27 -75 -38 44 66 55 78 66 -24 -11 8 49
6059 49 20 -9 29 8 13 -18 31 38 58 76 -11 -12 -9 -3 36 38 -7 -51 -28 -4 -1 -40 52 -64 -49 38 4 59 23 -47 -87 -21 -16 -30
6093 -30 -21 -51 23 19 -2 -20 -8 28 3 -11 -31 -12 25 39 32 35 43 59 -44 -39 -26 29 -38 -50 -10 6 -28 -34 -42 35 -19 -10 -72 -47
6127 -47 -41 -6 -21 -42 -43 -21 28 -24 28 -32 16 -10 -6 -23 -15 39 -13 57 32 -19 -3 69 15 24 63 -19 67 32 9 -8 -47 -7 -4
6160dj2q7J27k6K1l4rR9j00l8R8mk7kk0Nk4O9l3%j7J6M1j4K1j9lj8Q0q5L7J0m
6193D4qj8m0L7k3j0K6j4J3J2K0om0k1k8J5K1o6J6N0O0lp4Q6j1k8k5NpJ5L8j14
6225g8P3K9K3j4M3j29J12o3J9nj9m1Q2Ko7J7M4M7p1N5o5k0Q3j7n2J4o6P1j4rL
6256a3jk3K1O0m1Mq5P3%m3P2l9j7M9jk4K4J6j3n4M4j6K0l3KL5Ok7oMl6O5p9L0
6290b6K9l1j5J1l2Q7rpl0N0j8J3n4LK4K8l2KJ0mJ1qRNk3O0l2J8M9o6lK6k2m5J
6325b1l4M3j0M3o8M6Pn6J27o8j5J4jJ0p5J01p0K9j8P4r8M9k0o5N8k9lP5k7KL4
6356C4M2j17N1J9m1J1l0M0K4m3j1L3k0L1kk7k1O5j4Nj03M4N6k0k8J3l0M8N2o2
6386aJ0L1l6Rm9kl1O1j6M9ML0K4p9J1j1k4M4n7M8LJ0oJ9J8j04K1L1Kk1M0lJ3j02
$$ plain form
6160 -4 -16 -103 24 -2 19 -15 -24 75 -25 -63 35 31 4 2 -18 -13 -37 32 -1 -1 -18 -2 39 25 46 27 24 6 86 1 38 48 44
6193 44 36 18 -22 15 -8 -18 8 -6 7 19 39 33 -7 -28 -56 -41 -20 -86 -70 -20 40 37 -37 49 38 10 -15 -10 -17 -2 36 -78
6225 -78 -5 24 47 33 76 -53 59 -4 15 10 -9 -50 32 34 -33 -16 28 75 4 59 -6 -26 57 40 -12 2 -64 7 -7 -16 -13
6256 -13 -14 -37 -16 44 3 7 -78 -5 -5 -48 24 -15 -32 17 16 -8 16 32 19 -35 9 -7 13 -20 -18 17 23 -4 -10 -6 -42 23 -56 -26
6290 -26 3 -28 -43 -32 -64 23 14 7 -23 27 9 22 -32 -29 -5 23 -9 -7 3 -1 10 2 11 16 -7 53 21 39 88 22 19 45 23 -22 -21
6325 -21 -55 -12 -22 21 -47 -1 6 -50 77 9 -6 8 7 17 -58 43 -27 2 -16 58 -40 9 -11 -76 -18 -47 -50 25 -2 0 34
6356 34 76 -41 10 29 -12 -1 -31 9 33 -10 -21 12 -8 23 21 -6 -27 38 24 29 -74 -30 26 6 -22 -9 -39 9 61 -1
6386 -1 9 40 4 13 -36 -38 -69 -8 -24 25 29 59 83 4 15 4 -20 24 -33 15 18 28 22 41 59 -45 -24 7 9 -12 28 25 38 -64
6420f4R0Jj7m0%J5LJ3j6P8p3K4k8k1kL1J4K1n5K1k5P0j0J0m5jpN7k9pm2L6j3j
6454a2L5m3j4J1O2n6k8N2k8k1Q1n2J2l9J3N3J9j05K6M1J5Mj2qk8Q9q6N0l1K9l9
6485a0J3J10r3jK2n2K6K4j9Kj7J3M7k8qk6J5kk8l2M9K6j3n3O2o9L2K9n0M6om0
6517c1O3q6O0L8j6j4J9J3n8J4J8mKORo0N3JJ7n0L2qm7Qk6J4PN5j2rJ4k0l3N3m0
6552a8QL5m0L1l7N5m0J3k4k3QL4L3o5M3lM0n6j0K1J1k3N3j3k8No3M3j1NP0o3P
6585bl8j2J27l9m7pkk0MK6m0L2J0jL5j0m8R1l6Ok4l3O0K4l5J4j3nkK6k6K6p3N5
6619B3oj8O3q8PO6q5O1M7j20P5l9L9n0J1n2K1P2m3N0k9J9k5O4n6k5j2J8K9J0l7
6650a0K8K4j5K5J1m5K0m3J8K8j7k0L8o2L7l2j4J3L5qm5Q4l1o5L4m4P7m1j2J5K2
$$ plain form
6420 -64 26 27 10 -30 -30 -15 -12 1 -15 63 -10 14 -14 -35 -37 -6 8 29 -26 -5 -30 40 30 40 -5 -6 -13 44 15 8 -34 2 -11 -12
6454 -12 23 -20 -34 -23 39 -17 -45 7 -21 -42 39 -13 -1 -40 -27 26 45 -60 -34 7 22 26 14 6 -22 67 -19 31 0 29 -10
6485 -10 3 113 20 19 41 -11 15 39 20 22 5 18 65 37 29 3 18 16 -12 -44 5 31 18 -35 27 -42 -10 19 -31 15 9 -31
6517 -31 32 -54 6 44 28 14 33 46 -12 2 20 16 18 24 33 -27 26 27 44 -6 26 18 -29 -21 -47 -33 -26 29 17 8 22 2 -31 22 -18
6552 -18 -10 25 -15 16 -21 34 -6 7 -17 -40 -32 2 35 -30 13 10 50 -6 -16 5 16 -7 46 33 5 10 -53 -10 -21 -16 54 -9 -2
6585 -2 -40 -52 75 36 -11 -18 -20 -40 -36 -10 -50 -18 -8 -9 26 16 -32 59 23 29 5 -28 32 56 21 35 22 17 15 41 15 41 -32 23
6619 23 17 -1 62 -26 -19 47 -38 23 70 -50 25 -14 25 -25 -14 -66 -45 27 -16 34 5 24 -1 63 7 -18 -30 -12 17 27 -10
6650 -10 18 42 27 52 63 18 38 -5 13 41 24 4 42 -20 17 -15 -29 -16 19 11 -34 50 19 -46 -12 -56 21 -20 -32 -17 5
6681EJOn8RP2qm3J7pm8N3k1P8n0N3n1K4k3k7K6MM3o1K2j7j1J9l4l4N4N1mJ3n1
6715Bj1L2Ol5M0m9pk5K5J3mK7o5O5Kol4M7l5K4K6n2J8%K2k9LK4j4J3o7P8o6OO8
6750D2L0n9OK9m4pL6n6JRL0m2k6O4k8Om5Q1rj4j3mj2l2L3K8lJ0RLK9pnq2J02m1
6786A9J9l9MK8%l8M7o7M5J2o1O0k7km1P4n8k8Q6p1J4O7n9L9k3M2r8J7j6K7J8k3
6818c3K4RRl2J01q1rL5J7l0k2K4rk5O7k6j3l0P6p8L8K0k8K3k0j9J3l3K4j%j7j0
6851c6LN4m6N1l4j3QJ8j8o5M1OL4K6J0q7P4J0mj6l7J8M1l2mn0L0J5K9k1k6j2l0
6884f3M7K2lm5M7j7K7m5j2M5K7j8l2K1k2M9m4%J05q6n7NJ9K0nk0R4m8o0M9L3k7
6916FJ6n5J6j1M1k6J3K9l9Mj7j3LjP4n3KMpnnj5OK9NNOm3jM2kJ8j3m6R0q0L6K0
$$ plain form
6681 5 6 12 -46 -37 35 27 -16 1 -6 -54 -1 -22 56 6 59 8 32 9 -18 8 12 55 -6 16 -1 -12 7 -27 -61 -7 44 40 53 2
6715 2 -9 23 29 -6 34 -15 -22 -47 -22 -9 -13 14 -51 14 16 10 -24 23 -12 12 38 -14 4 4 26 -3 0 24 10 23 -44 34 -32 -26 42
6750 42 72 13 19 48 4 -3 33 -23 -22 -13 17 -25 -51 13 -15 -9 -54 27 18 4 -9 -13 -25 -57 -24 4 1 11 20 23 52 45 40 -42 60 19
6786 19 38 -1 3 31 31 -7 40 -27 18 30 -31 29 2 0 -41 33 -25 -53 33 -38 -24 43 -16 23 0 42 -56 -39 -55 -28 -10 -33
6818 -33 -9 0 9 -23 78 -3 -12 23 40 10 -12 12 3 -22 45 19 6 -24 52 -26 12 32 4 27 7 -12 1 -32 -8 -9 -9 -26 -36
6851 -36 -33 21 -25 26 -8 -21 -13 5 -13 -78 -37 -31 3 29 39 -48 26 36 32 16 -21 -3 38 6 2 -48 -18 -3 26 5 -21 -33 -63
6884 -63 -16 6 3 -42 5 -12 15 -30 -42 3 30 12 -20 1 -21 28 -16 -16 89 3 -54 -49 -30 -10 -15 -35 59 11 -49 0 33 6
6916 6 22 -33 -17 -28 13 -13 0 29 -10 -6 -23 -36 -33 -34 40 -13 -11 -7 -14 -19 -24 -39 -33 -4 1 6 12 -31 -32 10 8 26 13 -33 57 -23 13 33
6954C3Pj2l9K9k0M9j7j1O4o5pn1M0N2j00O2J0q3L4L8Nk9QNK8j8j9j1m8K2K6J7
6986arj0J1l5pO7J4lL7m8l2J3RrM7Qj17N9K3Ll3M5o2K1K4m5O3q9L7L4m2j0K3J0
7020dL1q6rP7PK6n2M5k2J4kJ6o6J4L9%om4Q1m7P7n1Mm0Pk1K2j8j6j1N0p3R7o0
7054b1L3M0q9L0m9K5L1N5p3J6pPK3l7l0M0J2j4j6J2nL0L2l6K5J6%j3m2N2k3Qj3
7087A9L6K3j00J1MnL0m4O9m5j8N2l1mj9MqKN9m5l2N3n8O2m0j8O9k0J9J1m2j2m9
7120f7L2Q4l0l1M4k6qk4R8j13OP1m3qL8k5O0l4k8K9m1K9J9m8Jnrj6PL0l1N3oj6
7154hO7n2rk1K6N0l3k4j1K0KM6n8j6P4o5O6m6qJ3k0M1n2oP5o7Mj0mj2K1QN1r4
7188e2K7Q7n7lJ7q1P9m4m1O1mL3k1M7r9J05o3K8j8kk4O1n4k2J02l7l7L8l7JQP3
$$ plain form
6954 33 40 28 -11 18 -2 47 30 19 83 18 11 -40 0 52 -48 14 24 -59 -25 13 18 -11 -3 2 30 12 -7 -18 -66 -44 -18 -1
6986 -1 -10 -20 -9 -44 -51 16 30 27 64 16 -16 -3 6 -3 44 52 -65 -6 17 20 -13 32 -30 -9 15 -30 33 -56 -19 15 -27 -37 -14 -4
7020 -4 27 -59 -68 9 16 42 -10 35 13 27 25 41 -25 -11 28 28 22 -22 59 12 89 38 42 2 9 -12 10 -8 -24 -35 15 -58 39 -21
7054 -21 12 52 -37 -7 -56 -31 0 55 -18 -2 -9 -2 21 -16 -46 -6 6 -8 -24 -12 -17 13 45 9 34 50 50 37 -5 47 24 32 19
7087 19 55 78 -22 -11 -7 -12 18 -26 43 -2 -20 32 1 -3 -22 -18 -26 -24 35 -10 -42 11 -47 15 -25 -43 26 6 25 36 -6 -18 -67
7120 -67 -35 49 19 -12 32 6 -2 -26 72 -41 -35 36 -7 -15 23 -2 58 24 -4 25 -16 13 32 -16 -15 -20 -29 -45 -38 -8 -39 14 8 -8
7154 -8 59 7 -2 -23 3 53 20 -4 -15 5 7 53 -5 -21 53 -12 54 8 0 13 -7 34 -18 -24 51 -16 -12 -22 -26 -38 -17 -9 42 -52
7188 -52 -25 62 5 2 19 -62 17 -27 -68 -7 -11 22 1 48 -51 54 -9 19 1 -1 -25 36 -18 -40 62 25 -12 26 -11 -10 -2 71
7220G1m2k6M6Ll6n8K5J1K2Lq3Q4p8J5J6j0K4rN4m7j8RL4Mk4P0o2k0k2J6M8K4n6
7253a2L2K5mm8NNJ3M9l5m3N2o0P5q0J6JrN7m0Lm3J3Kk5J3k8Q3o1kM2j1J7lk9M1
7288A1P0k9m7j6MJ8o3J04n8J2kk2M6l3Rnj5O7r4M4M4p3M7k0L1k8m8K7M5J1p3N5
7320A9j6j4k4ON6J5o6m3R0p3O0rl9M7o3L4j2P7m5PK7n2M3j9Mj6K9j9L1m2M9p0
7352b8P0nq6M6J7l3J4K0k0J2k0k7O7l5k0k7O2j0J8K5j4j4n7P4oqm5J4j1M4l2M
7384a1M3L0n6k0oj2K8K4mn3K0Qk7P9Ok4lrj1j1l4K6RJk0PL6k4K0k4n9N0j0J3K9
7419A1p3O8ORnl8M8J0n4K1pOJ2K4n4M0k6Jj7k4M1L5om0N0lm5KNPm1l2L5Q0o5N
7455a4Jm4R8l1Qnk1l9J15kk7k8KM5o4O2j05N0RNl6pP0j7J4l6K1J2p4Q5n2Kk5l7
$$ plain form
7220 71 29 3 49 52 16 -42 -17 -6 16 19 -64 20 -58 -43 -27 -37 -13 -22 32 -15 -33 -24 10 14 -10 60 -2 -22 -44 -28 20 44 -12
7253 -12 20 45 41 -7 -2 3 16 65 30 -13 39 -21 54 -26 -10 -9 -18 39 -1 2 -41 -28 -26 -51 -38 -66 17 -44 -46 -4 -15 2 -1 -30 11
7288 11 81 52 5 -11 -7 11 -52 52 -6 6 4 -18 28 -5 4 -1 -16 51 -43 1 45 -28 19 -1 30 2 -46 -19 26 37 -36 19
7320 19 3 -11 -35 -29 27 42 -24 -67 23 -50 10 1 -38 9 -54 -20 -32 45 0 7 34 -18 25 6 10 -6 23 4 35 -7 42 -28
7352 -28 42 37 -49 -3 14 -19 -5 15 -5 7 -13 -40 27 -8 -28 -55 7 -3 15 40 26 12 -45 29 23 15 -30 -16 -27 17 -15 -11
7384 -11 32 62 6 -14 -20 -32 -4 20 16 -37 -17 -9 -36 43 49 25 22 13 2 -9 -43 -17 -8 -7 -27 -20 16 -8 12 -12 -71 -21 -31 -18 11
7419 11 -62 6 12 21 16 -22 26 36 -18 3 -4 2 14 38 -16 24 -2 -1 -18 -42 -1 34 28 -12 38 35 -10 -8 -3 4 -37 -69 -34 46 -19 -14
7455 -14 -13 -57 41 10 18 13 -8 -47 68 66 39 11 13 58 -6 56 -49 1 10 15 -21 -28 42 25 39 3 24 36 -38 47 -5 -3 -28 -65
7489f5J5P5k3o2RQ7ro6PJ7j7J01j15M3K2l9mL2m8O8k2k2N1m4J6L1p0O0nJ5Pk6
7521A9j1Ln0M6%J0K5q3L5J7j3QJ1p9Q7J2k6L5p7M2K0n2kN8Km2J7Mj3J2N3m6l0
7554hK9qm9J0%K0L5k3Pj5Pk8J7L1l3PK2J2m5r%K8o4j4R1o6L1l3O9j6K2MqRo8Q3
7590D7j1k6mK3l0L3Jl3jNk1O2n3J1k2P1j1q7P0rn5L2oK0k9MON%pMN9r5L6Kj3L2
7627A0m4N6j6K0k9j3N9k8rJ4l3L3k9M6l4j6L2oj2N8j6m2j7qN8omj5j7J0q6Q4o
7660fl5M9L0m7K0m9N2p0J7Nk2O4nK0l8l0M4j0K7rJ0n2L9%NoM4N3r4oP3n0k2J5
7694A6n6K8M1p0Q6j21M7L0k4M4Lj34L4R4l4K8j6l2O9q0N5O0J1j31K8M9j2Ql2k7
7724c8M6Mo3O8k1RL9n8L4L0m8J9n3L8Nq1L8M2pMm2NJ02j37M4L4on9j0J9M0j0J6
$$ plain form
7489 -65 -50 25 2 -60 -51 36 27 -39 -32 -15 -32 69 -46 -3 19 -20 -24 8 -40 28 6 -16 35 -9 7 38 -32 28 23 38 45 19
7521 19 8 11 -39 7 7 17 42 -41 -6 11 -2 6 17 -62 25 37 11 46 -31 11 31 -21 -23 35 37 -5 12 16 3 15 68 22 -8
7554 -8 21 13 -36 -26 -26 -6 29 6 13 -2 5 -23 -6 25 -8 -1 21 33 -12 -21 -21 7 -57 -71 20 -46 -15 -48 21 5 27 31 23 32 -36 47
7590 47 36 10 6 29 -1 32 33 0 -1 4 -17 45 -8 3 -19 52 41 -46 24 15 -40 -8 -14 6 -23 -19 -13 -8 -8 -15 -11 48 -47 -11 -9 -22 10
7627 10 -34 22 6 26 -3 -16 43 15 6 20 -13 20 -9 37 3 -13 19 13 1 59 43 1 -16 -24 34 28 24 9 -8 2 -84 0 -6
7660 -6 -41 8 38 -9 11 -38 14 -56 -39 -34 -56 8 3 23 -15 -45 -1 -11 16 7 17 -35 4 4 9 3 47 100 6 0 73 23 1 16
7694 16 -40 -12 29 -41 45 -76 -29 1 -23 21 24 -110 -76 18 -16 12 -4 -36 33 -47 8 68 79 -52 -24 25 13 21 -11 -38
7724 -38 8 12 -51 17 -4 5 44 -14 20 50 2 21 -32 6 11 -70 -32 10 3 7 -35 -30 72 -65 -21 13 7 -52 -62 -43 -3 -13 3
7757Cl9N1jl5K2K1ML8n3L0j1J2l2m2R1q9N5k0m6L7L9p7kJ2K6JoK6j4j5Ll4O3m3
7791b5K1J5l9J5j4N2m3J5rn0oM3k7M0J1O3l4rk0L3n4N8QKj2M4p1m7L1PM4k4k9
7824a1O3p4l9Nm4P6R2q1j1L4Jk8k7N3J7j03Q5n0L2M0l8l1J7L7poJ9K1l0rNn5O9
7857B2q1M3P6j6q6R4n6mJ2L0j8J6o3Qj9N2m4L5j1J6J7k9N3j9p8l5N9K3n7O0p5
7888g5R1K9o1J3M5J5q3L0N7o8oj9pM7qqL5Ok6n0N6Jj7jLm6qN6ol4N2n3J7l1M9
7923ej6j6J6N6p2M2ln8P3J0J8j5l0JkN1l6k7K1j8j2PO8lm9oP3l6j4j1j7m6L2K2
7957bj2L6Mj18P0P3p2j5L7m5N8n8K7M0Nl4k1R4j00L2J1K2j3L5n4J1L6k8n1O1m
7988B5k7M1n8K2Q6j30P3j2n3j6K4O3o5%J7K4m1L2pK6l8J0j3M7n1J0J8j7qM5mJ7
$$ plain form
7757 3 -36 15 14 -21 1 22 26 64 11 41 30 42 10 -32 59 -30 25 5 -41 -4 35 -42 -44 -32 -6 -5 -11 15 1 -14 -11 -45 18 -25
7791 -25 -4 11 -28 -13 -27 25 -18 -3 -12 -62 -68 -25 -52 -12 -1 62 28 19 -1 32 -22 36 44 46 34 78 7 -40 -9 -2 42 18 -11
7824 -11 52 -22 -61 -56 -100 -24 68 -13 -24 10 11 -17 -44 9 26 -77 8 -42 -10 30 -8 -39 -22 15 8 2 21 42 12 3 8 -47 22
7857 22 -59 -16 60 44 -42 52 -4 -8 4 34 16 32 -31 -23 -42 10 -34 1 -10 6 23 -6 47 28 -50 -85 -26 -3 -60 0 -75
7888 -75 16 45 -16 -3 42 57 -26 4 61 -7 -13 -32 -39 8 0 -8 27 33 7 -43 13 14 -3 -4 -1 -47 -55 1 -5 -39 13 -40 -23 -54 -5
7923 -5 -21 -37 -21 35 -37 5 2 -56 17 27 45 30 0 1 -1 50 14 -13 8 -10 -22 -15 53 50 1 -5 68 32 18 7 -10 -56 -24 -2
7957 -2 -14 22 26 -92 -22 51 -21 -36 1 -44 14 -44 -17 23 28 -6 -27 67 -33 -1 10 32 19 54 0 11 47 19 -32 29 25
7988 25 -2 39 -19 3 89 -41 32 20 -33 -49 -25 38 -27 -27 -10 14 -27 5 -2 24 -14 -4 -17 30 -21 -11 7 -10 -18 27 23 40
8020D0m1qM2m7O4nK4p4N3p6P1o7J1rM8l6o8Q0MK0p8O2K3q4j6O9o0J8N6j3J8l9
8052a8L4l1L1p2L4Q5nm2m9O0l9K5L7m5Rqk8K3n4P2l1j0k8M3L5j9J2q0P0l9L0k5
8084b3l5M7j2J0M5k2l6j9L7j8L4j0k1j3J2P6q9R2o8l6L4K2k6O2Kq9P7k4QpK1k2
8116Ik6rk2P0j09Q9%J6l2o5O8k2K1K2oj6M8J6pm0m7L5M1n4N9k4k0k8J3nQ8Ln6
8149A0J3k9J7K3k9J0qK9M5n8m5M7l3k8M9K3k9qKj2J4L1no5k4K7kN2k8l0N7m1l
8182b8O3p2N1jk6qnM9n4
$$ plain form
8020 40 -1 -9 33 -14 50 45 69 -5 48 -28 43 -24 -13 -22 26 -10 -78 2 6 26 -52 10 33 -51 -67 2 -58 -40 16 3 21 -18
8052 -18 16 -15 16 -56 -22 63 58 16 -33 27 -12 13 50 5 14 6 -22 1 -53 19 -12 -22 -50 -7 28 9 21 -59 11 -28 2 -23
8084 -23 -58 -11 -23 -13 32 10 -26 -45 -8 -26 8 -2 -23 -36 -24 52 -37 55 -13 -49 -15 7 -19 43 45 -44 33 9 17 10 31 9
8116 9 -17 -26 -48 22 -87 2 2 18 -14 -79 -11 -33 -12 10 4 -12 36 52 45 5 -42 -7 34 -20 39 15 -5 -33 -20 -25 63 66 10
8149 10 23 -6 11 34 5 15 7 36 81 23 -22 25 -8 -36 13 36 7 -1 1 -11 3 34 29 -36 -60 -33 -35 17 -11 -41 16 -25 -28
8182 -28 35 -37 14 13 -13 -21 -26 23 -31
8191c1
##END NTUPLES=NMR FID
##END=
