##TITLE=1H_DE-80H_X3
 200.13MHz, d2o
 8 sc
 
 19ns.26.2.2025
##JCAMPDX= 6.0         $$ Bruker NMR JCAMP-DX V2.0
##DATA TYPE= NMR FID
##DATA CLASS= NTUPLES
##ORIGIN= UXNMR, Bruker Analytische Messtechnik GmbH
##OWNER= pz
$$ XWIN-NMR		Version 3.5
$$ Thu Jun  5 11:05:07 2025 Russian Standard Time (UT+4h)  Yarkov@DPX200
##.OBSERVE FREQUENCY= 200.1313
##.OBSERVE NUCLEUS= ^1H
##.DELAY= (6, 6)
##.ACQUISITION MODE= SIMULTANEOUS
##.ACQUISITION SCHEME= undefined
##.AVERAGES= 8
##.DIGITISER RES= 18
##SPECTROMETER/DATA SYSTEM= spect
##.PULSE SEQUENCE= zg30
##.SOLVENT NAME= CDCl3
##.SHIFT REFERENCE= (INTERNAL, CDCl3, 0, 14.3821)
##AUDIT TRAIL= $$ (NUMBER, WHEN, WHO, WHERE, WHAT)
$$ ##TITLE= Audit trail, XWIN-NMR		Version 3.5
$$ ##JCAMPDX= 5.01
$$ ##ORIGIN= Bruker BioSpin GmbH
$$ ##OWNER= Yarkov
$$ C:/Bruker/XWIN-NMR/data/yarkov2/nmr/H-C/1/audita.txt
$$ ##AUDIT TRAIL=  $$ (NUMBER, WHEN, WHO, WHERE, WHAT)
(   1,<2025-06-05 11:03:55.87 +0400>,<Yarkov>,<DPX200>,
      <created by zg, POWCHK disabled, PULCHK disabled
       configuration hash MD5:
       00 E9 B6 7A A2 85 ED C7 34 08 36 98 17 FE 4E 26
       data hash MD5: 16K
       BE 85 59 73 DB BA B1 A4 28 36 36 B4 E7 4D 72 98>)
$$ ##END=
$$ 
$$ hash MD5
$$ 79 F8 94 A8 7A 76 1C 82 DF F4 55 48 57 C3 31 0E
##$RELAX= 
##$RELAX= 
##$RELAX= 
##$RELAX= 
##$RELAX= 
##$RELAX= 
$$ Bruker specific parameters
$$ --------------------------
##$DU= <C:/Bruker/XWIN-NMR>
##$EXPNO= 1
##$NAME= <H-C>
##$PROCNO= 1
##$TYPE= <nmr>
##$USER= <yarkov2>
##$AMP= (0..31)
100 100 100 100 100 100 100 100 100 100 100 100 100 100 100 100 100 100 
100 100 100 100 100 100 100 100 100 100 100 100 100 100 
##$AQSEQ= 0
##$AQ_mod= 1
##$AUNM= <au_zg>
##$AUTOPOS= <>
##$BF1= 200.13
##$BF2= 200.13
##$BF3= 200.13
##$BF4= 200.13
##$BF5= 200.13
##$BF6= 200.13
##$BF7= 200.13
##$BF8= 200.13
##$BYTORDA= 1
##$CFDGTYP= 0
##$CFRGTYP= 5
##$CHEMSTR= <none>
##$CNST= (0..31)
1 1 145 1 1 1 1 1 1 1 1 1 1 1 1 1 1 1 1 1 1 1 1 1 1 1 1 1 1 1 1 1 
##$CPDPRG= <>
##$CPDPRG1= <>
##$CPDPRG2= <>
##$CPDPRG3= <>
##$CPDPRG4= <mlev>
##$CPDPRG5= <mlev>
##$CPDPRG6= <mlev>
##$CPDPRG7= <mlev>
##$CPDPRG8= <mlev>
##$CPDPRGB= <>
##$CPDPRGT= <>
##$D= (0..31)
0 0.7 0 0 0 0 0 0 0 0 0 0.03 0 0 0 0 0 0 0 0 0 0 0 0 0 0 0 0 0 0 0 0 
##$DATE= 1749107035
##$DBL= (0..7)
120 120 120 120 120 120 120 120 
##$DBP= (0..7)
150 150 150 150 150 150 150 150 
##$DBP07= 0
##$DBPNAM0= <>
##$DBPNAM1= <>
##$DBPNAM2= <>
##$DBPNAM3= <>
##$DBPNAM4= <>
##$DBPNAM5= <>
##$DBPNAM6= <>
##$DBPNAM7= <>
##$DBPOAL= (0..7)
0.5 0.5 0.5 0.5 0.5 0.5 0.5 0.5 
##$DBPOFFS= (0..7)
0 0 0 0 0 0 0 0 
##$DE= 6
##$DECBNUC= <off>
##$DECIM= 32
##$DECNUC= <off>
##$DECSTAT= 4
##$DIGMOD= 1
##$DIGTYP= 9
##$DL= (0..7)
0 120 120 120 120 120 120 120 
##$DP= (0..7)
150 150 150 150 150 150 150 150 
##$DP07= 0
##$DPNAME0= <>
##$DPNAME1= <>
##$DPNAME2= <>
##$DPNAME3= <>
##$DPNAME4= <>
##$DPNAME5= <>
##$DPNAME6= <>
##$DPNAME7= <>
##$DPOAL= (0..7)
0.5 0.5 0.5 0.5 0.5 0.5 0.5 0.5 
##$DPOFFS= (0..7)
0 0 0 0 0 0 0 0 
##$DQDMODE= 0
##$DR= 18
##$DS= 0
$$ [...]
##$SUBNAM2= <"">
##$SUBNAM3= <"">
##$SUBNAM4= <"">
##$SUBNAM5= <"">
##$SUBNAM6= <"">
##$SUBNAM7= <"">
##$SUBNAM8= <"">
##$SUBNAM9= <"">
##$SW= 18.0517328524113
##$SWIBOX= (0..15)
0 0 2 0 0 0 0 0 0 0 0 0 0 0 0 0 
##$SW_h= 3612.71676300578
##$TD= 16384
##$TD0= 1
##$TE= 0
##$TE2= 300
##$TE3= 300
##$TEG= 300
##$TL= (0..7)
0 120 120 120 120 120 120 120 
##$TP= (0..7)
150 150 150 150 150 150 150 150 
##$TP07= 0
##$TPNAME0= <>
##$TPNAME1= <>
##$TPNAME2= <>
##$TPNAME3= <>
##$TPNAME4= <>
##$TPNAME5= <>
##$TPNAME6= <>
##$TPNAME7= <>
##$TPOAL= (0..7)
0.5 0.5 0.5 0.5 0.5 0.5 0.5 0.5 
##$TPOFFS= (0..7)
0 0 0 0 0 0 0 0 
##$TUNHIN= 0
##$TUNHOUT= 0
##$TUNXOUT= 0
##$USERA1= <user>
##$USERA2= <user>
##$USERA3= <user>
##$USERA4= <user>
##$USERA5= <user>
##$V9= 5
##$VALIST= <valist>
##$VCLIST= <CCCCCCCCCCCCCCC>
##$VD= 0
##$VDLIST= <DDDDDDDDDDDDDDD>
##$VPLIST= <PPPPPPPPPPPPPPP>
##$VTLIST= <TTTTTTTTTTTTTTT>
##$WBST= 1024
##$WBSW= 4
##$XGAIN= (0..3)
0 0 0 0 
##$XL= 0
##$YL= 0
##$YMAX_a= 104681
##$YMIN_a= -76361
##$ZGOPTNS= <>
##$ZL1= 120
##$ZL2= 120
##$ZL3= 120
##$ZL4= 120
##$ABSF1= 10
##$ABSF2= 0
##$ABSG= 5
##$ABSL= 3
##$ALPHA= 0
##$AQORDER= 0
##$ASSFAC= 0
##$ASSFACI= 0
##$ASSFACX= 0
##$ASSWID= 0
##$AUNMP= <proc_1d>
##$AZFE= 0.1
##$AZFW= 0.1
##$BCFW= 1
##$BC_mod= 2
##$BYTORDP= 1
##$COROFFS= 0
##$CY= 83.5205535888672
##$DATMOD= 1
##$DC= 2
##$DFILT= <>
##$DTYPP= 0
##$F1P= 10.8118882576601
##$F2P= -7.23987719738617
##$FCOR= 0.5
##$FTSIZE= 0
##$FT_mod= 4
##$GAMMA= 1
##$GB= 0.15
##$INTBC= 1
##$INTSCL= 1
##$ISEN= 128
##$LB= 0.25
##$LEV0= 0
##$LPBIN= 0
##$MAXI= 10000
##$MC2= 0
##$MEAN= 0
##$ME_mod= 0
##$MI= 1.114404
##$NCOEF= 0
##$NC_proc= 0
##$NLEV= 6
##$NOISF1= 3.799351
##$NOISF2= 2.8
##$NSP= 1
##$NTH_PI= 0
##$NZP= 0
##$OFFSET= 14.38212
##$PC= 1
##$PHC0= -1710.501
##$PHC1= 9.76656
##$PH_mod= 1
##$PKNL= yes
##$PPARMOD= 0
##$PSCAL= 0
##$PSIGN= 0
##$REVERSE= no
##$SF= 200.129724274929
##$SI= 16384
##$SIGF1= 3
##$SIGF2= 2
##$SINO= 400
##$SIOLD= 16384
##$SREGLST= <1H.CDCl3>
##$SSB= 0
##$STSI= 0
##$STSR= 0
##$SW_p= 3205.1282051282
##$SYMM= 0
##$S_DEV= 0
##$TDeff= 0
##$TDoff= 0
##$TI= <>
##$TILT= no
##$TM1= 0
##$TM2= 0
##$TOPLEV= 0
##$USERP1= <user>
##$USERP2= <user>
##$USERP3= <user>
##$USERP4= <user>
##$USERP5= <user>
##$WDW= 1
##$XDIM= 8192
##$YMAX_p= 0
##$YMIN_p= 0
$$ End of Bruker specific parameters
$$ ---------------------------------
##NTUPLES= NMR FID
##VAR_NAME=  TIME,          FID/REAL,        FID/IMAG
##SYMBOL=    X,             R,               I
##VAR_TYPE=  INDEPENDENT,   DEPENDENT,       DEPENDENT
##VAR_FORM=  AFFN,          ASDF,            ASDF
##VAR_DIM=   8192,          8192,            8192
##UNITS=     SECONDS,       ARBITRARY UNITS, ARBITRARY UNITS
##FACTOR=    0.0002768,     1,               1
##FIRST=     0,             0,               0
##LAST=      2.2672688,     0,               0
##MIN=       0,             -76361,          0
##MAX=       2.2672688,     104681,          0
$$ Real data points
##PAGE= N=1
##DATA TABLE= (X++(R..R)), XYDATA
0 0 0 0 0 0 0 0 0 0 0 0 0 0 0 0 0 0 0 0 0 0 0 0 0 0 0 -2 8 -8 8 -8 8 -8 9 -13 15 -16 17 -19 23 -25 26 -32 33 -39 41
45 41 -47 52 -56 62 -68 76 -83 92 -101 111 -122 136 -149 166 -187 210 -236 269 -310 363 -432 529
67 529 -672 933 -3471 10277 -29925 -62255 -50933 -46033 -33235 -42655 -31295 22095 41137 34820
81 34820 31141 19452 35451 25092 -21883 -11959 10018 -9811 -24083 -38573 -31749 -6436 -19972
94 -19972 -18457 14158 17639 16580 2774 -21264 -774 10024 -7232 6865 24605 34432 34607
107 34607 4735 2813 17306 -4386 -12021 -13650 -25987 -10627 -17503 -39641 -10687 20070 29629
120 29629 35959 29921 42117 39711 -6813 -22673 -16354 -22524 -17538 -28554 -31476 2517 2127 -14600
134 -14600 1773 18869 34038 25302 -6372 3158 8772 -23454 -31601 -22798 -7863 9809 -8176
147 -8176 -14177 10443 6108 -6345 -8238 -3227 23469 17366 -13136 704 12270 -454 -1951
160 -1951 -4113 9248 23575 -1033 -14080 -6732 -9073 -5524 -13011 -13386 19270 20129 -1716 4724
174 4724 8613 11836 13421 -2000 7243 19381 -227 -10751 -16099 -15866 1486 -8012 -17048 5478
188 5478 7584 -2779 -7301 -12560 5441 14122 -2527 5053 13450 6719 4083 -13415 -14035 9544
202 9544 459 -13105 -5107 -2694 653 -9224 -20067 3799 14942 2571 3978 2165 5656 9635
216 9635 -12215 -11344 12707 10695 2742 -1860 -1610 11410 -1550 -17685 693 8576 2418 -1241
230 -1241 -10832 -159 9124 -8429 -6581 8523 10890 9929 -5860 -9453 8693 -96 -11416 560
244 560 5362 9761 4783 -12243 -3034 4814 -6802 -6816 -5399 1164 9854 -7357 -11055 7217 5378
259 5378 2251 3015 -341 9520 3924 -14038 -7877 -1304 836 4455 -3869 3854 16620 -74 -8103
274 -8103 -1302 -636 3031 -5315 -12172 3235 2952 -7077 -3189 91 11212 14514 -3248 -94 10226
289 10226 -1147 -7982 -9737 -4198 8568 -1711 -9580 3488 3913 465 -2259 -7134 7230 11303
303 11303 -6587 -5326 1862 889 383 -8464 -2051 13459 3179 -3981 1492 1077 5562 393 -9173
318 -9173 4095 7534 -4340 -6273 -6964 -464 3988 -8013 -3224 10335 4599 1533 -1090 -2567
332 -2567 7900 2455 -7678 1001 3664 1581 -1323 -8876 1219 8085 -4692 -4541 939 -340
346 -340 956 -7777 -8999 5496 4108 -1331 2034 2848 9376 5287 -8238 369 6993 -1664 -3318
361 -3318 -4749 -955 5572 -5576 -8045 2888 2384 648 -3690 -6610 5943 4632 -6914 886
375 886 7430 7359 5658 -3130 1467 7828 -4456 -8688 -4997 -3960 1251 -5257 -8785 5866 7112
390 7112 -210 1597 2092 6934 4691 -8031 -3490 3172 -2349 -2393 -3617 -108 9674 1698 -4311 3939
406 3939 3700 746 -3867 -8408 1047 2075 -7671 -3268 1708 3111 5601 -2136 -305 9251 2235
421 2235 -3594 -2320 -2062 2731 -2899 -9272 1957 4900 -597 573 -1133 3260 5912 -5623 -5842
436 -5842 1321 -1238 -2392 -6210 -4541 6783 2378 -3880 4628 7090 6586 3853 -3715 1918 4661
451 4661 -5664 -6548 -3632 -1440 1850 -6187 -5722 6203 3096 -1490 1557 2668 7890 4498 -4453
466 -4453 1952 5112 71 -810 -3787 140 4964 -5782 -7959 -130 -1168 -1651 -3572 -3783 5645 3310
482 3310 -4338 185 1777 2939 3174 -4138 417 6571 -1652 -4296 -2263 -1060 2761 -3782 -6743
497 -6743 2214 354 -3829 -2544 -2817 4259 6403 -2000 1928 6946 2972 975 -3109 -440 6300
512 6300 -1246 -5012 932 388 721 -1341 -4711 4275 6261 -1813 -666 668 2011 2354 -4905 -1427
528 -1427 6766 1265 -2005 -1315 -1527 2797 -1289 -6373 1649 3491 -617 -1834 -4762 264 2595 -6119
544 -6119 -3667 2570 287 -276 -3438 -3073 4869 1583 -2339 2312 2439 2646 -589 -7355 -1206 2733
560 2733 -3787 -1906 1236 2768 5039 -1208 -1525 5903 3240 621 127 -1656 2841 -260 -7774 -1205
576 -1205 3257 1671 2621 432 3449 6780 -1407 -2808 1626 565 912 -2809 -6002 1182 -298 -5972
592 -5972 -1871 798 3550 3174 -3247 -48 3410 -2941 -3326 -2044 -682 3800 -1135 -4408 2343 1914
608 1914 -859 -695 -1569 3296 2196 -6095 -3444 -433 -2073 -288 -1711 1597 8375 3168 -261 2868
624 2868 2082 2747 -565 -4160 1779 1273 -5112 -3447 -1911 742 3661 -937 1592 6658 2215 -564
640 -564 -1698 -1871 2677 -798 -4796 1113 1331 -1564 -1451 -2997 1889 4639 -1199 -390 1867 -219
656 -219 -686 -4751 -4443 2553 -130 -3214 151 365 1744 744 -2937 2601 5217 407 -51 -1231
672 -1231 -1079 810 -4508 -4130 2897 1664 498 163 -645 3490 1509 -3291 997 2132 272 -135
688 -135 -3924 -986 3147 -1402 -1000 3122 2920 2905 -1302 -3556 1418 -549 -3708 -1067 -530 1577 1579
705 1579 -3613 -224 3542 145 37 -90 397 2579 -2507 -4390 1029 704 618 1117 -388 3375 2557
722 2557 -3326 -1600 265 -316 130 -2961 -1338 2971 -1413 -2284 1092 1398 3481 1611 -1604 2362
738 2362 1703 -2261 -1416 -1536 732 1942 -3323 -1963 1734 -1544 -1878 -1481 -624 3498 832 -2304 1422
755 1422 1274 542 205 -1843 1952 3326 -2343 -1667 95 -718 347 -1951 -1046 3725 931 -1455 211
772 211 -416 1649 749 -2521 1636 3020 -625 -422 -618 532 2766 -1159 -778 2571 165 -718 -1699
789 -1699 -2781 1467 386 -2937 451 1079 221 -73 -2858 68 2618 -1327 -908 744 -255 1133
805 1133 -1695 -2703 2109 1046 -1459 -427 -996 449 107 -3778 -260 2147 -202 485 -432 95
821 95 2792 -868 -1864 2027 1193 847 8 -1634 2027 1623 -2082 564 1542 905 1079 -1990 -1121 1894
839 1894 -1125 -1470 139 250 2225 -7 -2137 2031 1711 -790 326 -303 1112 1343 -2830 -1604
855 -1604 616 -1110 -793 -1604 -1191 2035 -800 -2817 599 450 529 567 -1373 1527 1985 -1883 -707
872 -707 152 -39 1349 -1582 -1230 2303 -197 -1478 -102 -276 1727 590 -2001 1121 1566 -596 280
889 280 -512 1096 3046 -699 -555 1887 243 45 -882 -1206 1906 342 -1959 280 196 284 422 -1972
907 -1972 362 2048 -1404 -1191 -523 -592 831 -1288 -1333 2399 939 -489 468 -693 1040 455 -2836
924 -2836 -598 448 -1453 -995 -1936 -711 1995 -745 -739 2150 1213 1346 425 -1083 1748 1245 -1561
941 -1561 -143 70 75 621 -2160 -470 2130 -557 -588 182 -351 1247 -568 -1842 1211 936 -123 763
959 763 -362 1459 1815 -1584 -367 1302 -568 -539 -1688 -1674 934 -1292 -2084 504 299 1042 718 -1203
977 -1203 1539 1906 -1106 2 134 -15 854 -1791 -1218 1406 -608 -742 27 -688 1620 374 -2047
994 -2047 711 898 -529 95 -845 518 1863 -1203 -458 1262 47 682 -392 -1050 1649 309 -1630
1011 -1630 74 -203 333 376 -1834 445 1563 -1113 -408 -110 -206 1217 -767 -1267 1491 333 -370
1028 -370 227 -495 1541 1030 -1480 468 926 -448 -67 -1324 -748 1171 -1260 -1376 420 -224 728
1045 728 109 -950 1991 1517 -640 745 372 421 863 -1730 -704 1011 -1267 -955 -653 -1007 1003
1062 1003 -542 -1557 1216 707 -36 570 -394 1022 1576 -974 180 900 -154 506 -947 -1072 1162
1079 1162 -717 -1732 -53 -425 326 192 -1366 1045 1486 -492 535 384 352 1347 -940 -841 1197
1096 1197 -430 -548 -417 -899 916 76 -1634 609 510 -349 471 -937 181 1388 -992 -349 707
1113 707 -25 686 -504 -1015 1377 133 -1109 324 -223 191 550 -1436 191 1138 -567 -105 -260
1130 -260 -143 1106 -711 -1102 1164 1 -259 221 -602 985 863 -1025 453 680 7 448 -986
1147 -986 -360 1240 -922 -1079 378 -592 318 -283 -1240 1244 627 -637 490 -83 608 1158 -953 -56
1165 -56 1358 -432 -179 -263 -708 717 -539 -1371 466 -285 -260 186 -964 732 1288 -784 513 1029
1183 1029 229 848 -465 -409 1210 -415 -986 39 -671 61 -104 -1538 362 543 -729 115 -227 151
1201 151 1132 -579 -221 1300 -76 99 -29 -809 656 -229 -1436 53 -182 -478 107 -1033 187
1218 187 1035 -790 -168 589 38 966 -62 -552 1207 329 -395 465 -157 568 547 -1133 345 819 -644
1237 -644 11 -340 -299 834 -710 -708 862 58 128 397 -449 991 606 -933 243 164 -451 193 -1084
1256 -1084 -547 656 -899 -695 23 -612 276 -400 -1155 627 232 -631 296 -175 431 686 -809 57
1274 57 791 -269 93 -110 -526 922 -368 -958 416 -117 64 409 -506 742 1117 -400 458 510 126
1293 126 875 -296 -306 1030 -148 -332 268 -385 384 69 -989 375 373 -509 173 -430 -62 539 -745
1312 -745 -473 491 -447 -69 -304 -681 620 -76 -792 324 23 -87 306 -880 -63 555 -863 -334 -26
1331 -26 -432 313 -439 -555 936 303 -188 553 16 762 953 -461 597 865 -124 437 -274 -241 646 -689
1351 -689 -872 373 -459 -86 59 -485 870 727 -127 916 643 519 777 -461 -37 531 -933 -861 -601
1370 -601 -1085 -282 -570 -1166 384 74 -285 483 -156 491 786 -462 95 572 -333 -123 -582 -769 385
1389 385 -560 -972 265 -405 101 294 -459 709 867 -92 482 614 382 769 -398 -423 715 -389 -300
1408 -300 32 -471 488 227 -661 756 566 -68 549 -219 43 560 -830 -433 140 -532 -73 -256 -492
1427 -492 620 189 -457 426 -233 3 200 -750 -77 367 -721 -183 -59 -288 464 -306 -625 518 -182
1446 -182 -304 142 -491 435 493 -609 613 582 107 645 34 141 682 -441 -509 180 -600 -114 -232 -629
1466 -629 578 401 -304 598 258 290 695 -328 13 504 -487 -240 78 -378 321 -213 -699 277 -162 -538
1486 -538 -35 -770 -152 210 -705 40 517 -48 576 231 149 929 -1 -349 210 -576 -312 -324 -1108 -190 150
1507 150 -605 280 133 191 994 115 200 860 -43 26 63 -565 196 -319 -889 274 126 -55 459 -201 292
1528 292 734 -337 104 424 -189 86 -298 -656 425 -192 -350 364 -90 80 431 -544 151 438 -259
1547 -259 53 -2 -243 454 -317 -315 538 -91 -232 127 -479 129 74 -711 185 117 -83 488 -49 183 973 -43
1569 -43 -6 478 -283 -118 -333 -922 -185 -333 -806 7 -150 22 740 -3 461 862 125 345 245 -216 310
1590 310 -274 -804 149 -335 -542 -26 -593 57 398 -498 198 285 -10 407 72 -108 797 -75 -144 167 -302
1611 -302 90 10 -669 34 105 -676 195 -156 -26 530 -277 3 828 -105 217 173 -312 324 27 -564 133
1632 133 -123 -248 187 -278 -17 411 -283 48 376 -289 245 -66 -495 470 -107 -319 226 -228 32 262
1652 262 -331 153 416 -285 246 -55 -197 459 -282 -198 393 -152 -103 38 -534 96 -45 -581 159 219 -58
1673 -58 457 -28 160 664 -12 110 243 -233 16 -270 -737 127 -215 -403 110 -246 162 481 -203 175
1693 175 623 -81 177 140 -269 258 -268 -510 200 -188 -61 226 -189 298 300 -425 114 -33 -402 94 -307
1714 -307 -321 373 -225 -92 508 -116 403 237 -272 286 41 -422 116 -198 -240 222 -383 -4 350 -272 127
1735 127 190 -321 225 -121 -340 288 -69 10 313 -89 321 546 -212 173 238 -258 224 -253 -463 172 -525
1756 -525 -477 194 -316 196 427 16 592 515 136 481 83 -125 226 -471 -535 -106 -711 -253 -211 -345 331
1777 331 275 -63 499 188 6 253 -418 -276 142 -487 79 143 -62 455 104 -177 351 -149 -390 141 -429
1798 -429 -180 203 -418 172 303 9 505 374 123 559 -121 -236 124 -453 -115 21 -404 116 252 -217
1818 -217 391 206 -62 376 -193 -300 267 -532 -282 -117 -556 110 201 -86 548 360 106 390 25 44 236
1839 236 -498 -351 -99 -671 -145 -210 -469 220 179 105 574 227 73 263 -275 152 227 -368 112 92 -177 317
1861 317 -151 -195 473 -225 -151 169 -319 29 52 -293 185 313 12 517 198 15 561 -164 -38 207 -462
1882 -462 -143 -132 -693 96 -144 -312 406 51 61 317 -160 -7 324 -303 -9 12 -291 240 -114 -283 323
1903 323 -105 31 433 -77 43 210 -480 -66 -80 -298 133 -25 -199 453 -133 -23 360 12 133 234
1923 234 -213 233 218 -430 110 7 -225 243 -243 -269 108 -426 -108 117 -269 276 115 -244 349 -33 -280
1944 -280 214 -173 82 340 -309 31 47 -300 -32 -104 -251 268 -116 -250 89 -180 -108 273 -48 368 288
1965 288 -112 178 108 -186 167 -214 -246 200 -354 -225 105 -465 85 187 -262 464 26 -239 237 -108 -13
1986 -13 422 -122 12 293 -245 -56 -23 -516 168 -101 -121 408 13 -119 256 -319 -94 282 -166 226 -2
2007 -2 -258 190 -113 -101 587 130 261 560 -192 -139 99 -500 5 -53 -245 206 -120 -126 321 -217 50 205
2029 205 -242 117 72 -343 7 171 -134 480 280 130 354 -253 -296 -31 -523 -200 -75 -378 115 45 -198
2050 -198 352 72 275 577 24 279 360 -321 -8 -23 -290 186 -28 -342 63 -234 -397 175 -230 280 350
2071 350 53 471 356 -179 196 -93 -227 298 -307 -366 36 -497 -139 58 -256 416 351 67 411 50 -249
2092 -249 31 -321 -149 266 -332 27 55 -394 141 145 -167 383 175 -115 240 -293 -212 223 -129 218 176 -290
2114 -290 111 -105 -319 135 -50 -68 390 -26 131 334 -93 217 318 -45 304 52 -255 -103 -375 -457 -72
2135 -72 -262 58 234 -132 134 153 -38 296 196 15 354 -5 -102 -10 -346 -302 201 -321 60 19 -302 134
2157 134 -106 -261 310 85 197 340 -154 33 64 -289 16 -7 -294 235 78 -4 303 -93 -45 322 -137
2178 -137 41 -100 -542 -129 -298 -314 250 101 138 531 52 42 259 -210 77 229 -244 146 -13 -363 176
2199 176 -40 -251 271 -106 65 16 -392 -249 50 -203 305 294 201 434 87 -102 171 -314 -125 84 -331
2220 -331 -123 -98 -285 126 4 -18 299 44 22 294 -78 -72 180 -103 211 250 -158 222 -17 -307 34 -301
2242 -301 -217 60 -69 22 246 -91 241 131 -16 398 32 -27 95 -262 -148 39 -168 105 226 -185 192
2263 192 47 -284 181 49 -89 219 -137 -54 116 -244 50 185 -216 172 71 -13 75 -160 -111 189 -25
2284 -25 11 186 -224 98 41 -232 79 84 3 283 -142 -19 148 -346 -157 153 -103 142 151 -101 290 170 94
2307 94 220 -4 -112 83 -338 -134 -164 -340 -107 93 -167 303 153 28 253 29 -37 283 1 -30 163
2328 163 -291 -17 -87 -329 171 20 -42 233 -135 12 198 -212 -46 144 -102 141 6 -166 189 31 31
2349 31 360 -70 -26 137 -235 -96 -88 -408 45 -129 -145 236 -12 60 254 -2 62 180 -173 135 55 -274 29
2372 29 -55 -253 418 -49 39 316 -113 47 126 -273 -23 -115 -182 75 -74 -12 392 94 216 346 41 95 179
2395 179 -177 -38 -70 -233 57 -57 -24 223 -44 -97 180 -162 43 189 -196 121 27 -118 132 -58 -6 233
2417 233 -97 101 172 -97 38 47 -132 67 -40 -252 95 -26 -98 195 23 26 245 43 80 109 -178 -24 -43
2440 -43 -225 32 -163 -149 130 -106 55 153 -222 30 27 -214 97 116 -77 152 26 -67 210 -195 -57 130
2462 130 -54 34 -19 -117 20 -5 -121 113 -119 46 157 -207 -27 90 -211 57 40 -58 71 -68 -62 117 -80
2485 -80 -176 71 -104 9 114 -151 121 44 -114 74 -98 -124 163 -142 -45 148 -22 179 207 -95 158 133
2507 133 -92 118 -87 -62 125 -180 -144 -33 -174 7 98 -158 322 71 -168 100 -134 -39 139 -43 -47 271
2529 271 -189 101 11 -201 113 55 -22 174 -45 46 138 -120 -130 166 -83 -47 166 -159 107 86 -33 143 -7
2552 -7 -88 139 -75 49 134 -268 -101 34 -143 44 -106 -150 66 -101 -77 9 -52 282 0 -108 69 99 -60
2575 -60 252 59 -46 80 -100 -131 -61 -295 -113 121 -120 157 15 -66 162 77 29 143 -81 -9 52 -101 -65
2598 -65 -42 -155 -20 -49 -169 30 -176 -22 139 54 -78 104 -39 193 157 -90 -43 9 -64 71 35 -85 116
2621 116 -44 -23 44 -80 75 61 -198 173 15 8 248 -2 62 99 17 -27 85 -164 -12 -13 -63 81 9 -78 114
2646 114 17 -62 117 -156 12 68 -168 -65 6 -196 94 -15 -58 185 53 85 188 -164 -75 77 -67 58
2668 58 11 -66 148 -25 -68 139 -46 110 111 -101 -38 11 -61 65 141 34 164 62 30 211 -127 -43 1 -157
2692 -157 -37 -76 -187 16 -66 -48 89 38 14 111 -117 47 103 11 -74 86 -133 13 -43 -25 -17 26 -4 16 -50 56
2718 56 114 -25 54 48 40 138 -90 -35 81 -212 -47 -8 -1 13 -49 -62 102 40 -40 108 55 -122 -79 -80 -35 59 -42 62
2746 62 76 -112 96 77 -20 21 -22 -62 66 -142 -156 190 18 30 157 -154 153 48 -91 69 -55 6 98 -58
2770 -58 -13 166 88 84 -14 -2 56 -1 -152 -69 -125 6 163 -113 31 66 -98 38 11 -9 41 77 -48 89 57 110
2796 110 121 -69 72 39 19 45 10 -26 -43 -32 -96 4 -46 22 36 -131 -87 26 -18 28 68 -105 102 -123 -120 14
2822 14 31 -45 37 -64 3 -66 -150 -36 62 60 179 119 61 143 -16 -182 129 -94 -53 69 -91 65 45 -109 3
2847 3 -132 -117 111 -158 -26 80 -52 30 -14 -15 116 56 -59 114 -8 -28 -2 -97 -128 118 38 23 124 -89 47
2872 47 -41 50 109 14 -34 25 -64 17 10 32 111 5 -59 40 -130 -139 88 -123 -25 -8 30 84 94 -174 -7 -20 -155 76
2900 76 -84 -94 -14 -144 -26 90 11 -11 21 -118 -18 8 -100 -36 30 -88 -11 -100 -16 11 -82 90 87 50 180 138
2926 138 -73 -113 -37 -88 93 -93 8 -46 -21 -15 6 -66 -41 -130 -43 10 -25 47 -3 -163 44 24 5 49 18 -29 99
2953 99 94 -73 171 -13 -11 120 -76 -48 -43 -48 60 91 -30 -20 129 -45 37 -29 17 -19 -13 28 111 -166 113 82 -19
2980 -19 31 -84 -79 96 66 -105 16 40 39 87 10 -10 -19 -43 76 2 -45 106 15 1 17 -102 19 -64 2 75 104 -77
3008 -77 -8 1 -30 42 -32 -16 -35 -40 51 -9 -121 74 -68 -67 15 -112 -53 1 -18 -46 -52 -69 -54 25 -75 68 49 -20 -16 -64
3038 -64 -6 -11 -8 -116 6 5 4 21 -86 163 -65 -14 37 -23 -91 -19 -46 14 -88 -28 -167 49 -28 -88 14 -61 95
3065 95 -203 -15 -65 -55 117 -80 55 -26 -79 7 7 15 83 66 -57 -51 -36 1 49 -37 -11 51 -43 -130 70 -83 -61 65
3093 65 39 -59 -13 -33 29 -93 -67 97 108 -78 -68 58 16 104 5 41 -33 -103 125 11 20 12 5 57 -2 -28 -62 -10 65
3122 65 -41 145 51 7 111 123 107 31 -20 5 24 105 26 -79 -64 -12 -59 73 38 14 1 -16 57 -64 -8 16 98
3149 98 17 6 6 -26 -65 -23 150 63 46 36 -59 68 -17 -99 -26 -88 123 -45 15 -70 38 -40 30 -13 39 43 -8 57 -93
3178 -93 5 114 -49 31 7 -49 108 98 -27 29 24 -2 86 98 -4 95 -44 -10 -52 -12 49 -23 40 70 -119 20 33
3205 33 4 -36 1 -19 82 -29 -14 -9 39 11 1 -13 2 -108 75 -54 -76 37 13 -20 -55 7 -64 3 20 30 -113
3232 -113 35 -15 32 28 7 42 102 -10 -4 22 -15 35 -157 -25 40 -100 29 -17 -7 -43 -54 -15 90 10 -25 58 -49
3259 -49 -71 -87 -52 -33 8 15 28 -2 -2 -11 -103 14 -17 -40 -93 49 -34 -37 -6 8 -22 -22 68 -72 -82 -42 124 -73 49 85
3289 85 -32 66 -25 -48 -87 -5 14 -95 86 -2 -22 48 -1 -44 -67 84 99 -43 41 26 -89 17 -26 -75 87 -141
3315 -141 -7 -29 72 -34 40 -3 0 36 -61 72 11 59 27 -97 106 149 100 75 -68 -25 0 -54 -37 16 -71 60
3341 60 9 71 -3 122 -20 26 21 -91 61 -85 -20 58 20 -17 16 -13 30 16 -19 -37 73 -10 -75 43 5 59 -33
3368 -33 -5 -127 -37 -38 -13 -27 -10 127 -5 50 16 131 -25 -1 -32 59 -103 -14 -25 -19 36 -78 198 -7 68 -29 -75
3395 -75 62 37 -9 66 -81 25 20 45 90 -22 19 -139 44 30 69 91 -33 75 65 50 29 16 -20 -36 -30 28 -37
3422 -37 -84 -64 20 -31 12 5 17 3 16 -19 -23 -15 -32 75 118 79 -39 73 65 68 50 -138 -37 -97 -116 74 7 -96 -27
3451 -27 -20 40 50 -73 49 27 -155 53 87 69 37 -89 -5 13 -109 4 106 -112 81 2 -4 83 -91 5 -40 -46
3477 -46 9 63 -136 -92 58 51 -52 -5 -62 48 -90 -38 50 14 96 112 91 -103 -79 -83 45 58 60 41 -76 37 43 47
3505 47 21 -46 -8 -27 -32 24 -120 -10 17 0 -65 25 15 104 35 34 30 -24 40 -68 2 -99 -89 -63 30 -9 60 -19 0 80
3535 80 106 -26 119 16 32 -79 17 34 10 -26 -48 116 -57 20 -42 42 30 -101 89 -28 8 22 -33 -86 95
3560 95 44 21 -12 44 -90 -13 -23 -14 104 -83 -31 102 33 -52 85 60 67 -50 78 -97 -41 18 59 -75 11 -12 -8
3587 -8 81 7 63 110 -20 30 75 -41 0 -47 21 -17 15 -5 -68 -79 -79 12 -140 23 -69 -65 -100 -102 -3 -74 -18 -32 -83 -72
3617 -72 76 -66 30 -42 -52 -65 64 -50 84 -13 -72 -25 -125 -95 28 -14 90 57 35 -63 -2 -37 38 -75 -5 54
3643 54 -1 -46 79 15 -29 26 -51 -57 48 9 -88 46 -22 81 22 104 17 64 -68 -26 -51 61 -40 23 -28 -89 -9
3670 -9 50 -63 -41 -62 22 -67 29 -28 -31 -13 32 9 12 104 -22 -3 -28 18 -19 -43 9 -122 66 65 -55 -34 -21 23 -9 41
3700 41 -24 -65 -122 88 -106 39 56 -79 -35 47 83 56 62 -25 14 33 70 -37 150 53 57 55 -83 -21 -6 109 -20
3727 -20 73 -97 99 91 150 -16 -82 -109 20 138 28 -42 -19 63 -51 -101 85 6 31 -62 -75 60 -29 -55 22 50
3753 50 -69 -45 -11 29 -106 20 15 9 -25 -32 22 52 53 76 -29 -12 67 19 65 -70 -41 -90 6 89 -89 78 90 47 -54
3782 -54 -67 -51 -141 -101 12 102 -16 -14 -46 31 15 -85 -13 136 27 -61 -44 26 29 -42 -50 -6 -21 32 -38 36 2 -11 25
3811 25 -52 6 31 12 -85 81 -14 8 -48 -32 -40 35 -70 -34 -83 65 13 -26 -88 -59 25 -34 7 59 28 38 -33 126 -30
3840 -30 5 -12 -54 -46 14 41 82 -52 23 36 -8 0 68 -76 60 32 30 3 15 -28 12 65 50 -21 -77 26 -6 -3 24 13
3870 13 -26 84 -10 2 39 -78 39 16 -126 153 31 -9 -20 92 -37 21 101 -75 107 42 -50 6 -25 -10 4
3895 4 41 117 2 -33 -58 -116 -48 15 38 67 9 -51 57 -28 -23 -66 95 -81 141 -14 -215 8 -119 48 86 -31
3921 -31 109 147 35 25 -102 34 132 33 -110 98 -4 13 44 -139 -30 -20 44 11 -43 5 10 -38 12 61 -4 20
3947 20 -11 -42 92 8 -19 54 48 -6 86 -17 -26 -45 58 42 40 51 29 -55 133 44 1 80 -129 -59 -48 7 -41 -39 166
3976 166 78 -29 56 -34 -34 -33 -72 119 55 39 23 -88 -20 -10 -51 47 -117 -110 -12 7 0 6 -48 31 38 -23 67 -19 98 50
4006 50 -30 -4 -5 24 35 33 -49 57 21 51 162 -13 43 129 -71 -35 43 -56 -15 34 30 36 95 47 20 34 23 84 -2 -99
4036 -99 -10 -60 -59 3 5 26 51 -23 94 23 -64 -15 -77 -27 16 100 -1 28 -95 12 54 39 17 6 6 87 -135 -49 -21
4065 -21 -4 -108 -17 -73 -35 -29 -20 102 24 -29 122 -27 -6 -46 -26 -100 -80 -84 24 -42 39 -21 20 15 119 -68 135 11
4093 11 109 -42 -35 -16 -50 -190 -40 -25 -18 -93 91 37 -12 133 -65 -4 93 67 -64 -7 -11 -29 -26 -128 16 37 81 115
4121 115 -65 11 -106 57 -21 25 91 -45 -42 60 28 -31 -57 -46 -44 -24 -9 -73 8 15 66 -2 62 -86 47 -95 13
4148 13 90 29 -213 -9 8 57 -38 5 72 -46 -30 -114 -45 -46 -61 -44 -72 120 -36 47 -13 -59 49 102 -25 30 -91
4175 -91 -18 111 -117 -40 64 -13 -2 12 2 62 19 121 87 -27 24 -14 -75 13 -82 19 34 83 -16 40 6 36 -21
4202 -21 -37 36 57 -51 51 32 96 -14 -110 6 -91 106 -15 -23 -80 91 60 49 28 0 -17 -53 41 -40 -40 -6 47 0
4230 0 1 -60 52 -66 74 -1 -1 -26 -2 -114 -11 24 -86 -47 -102 -37 53 101 86 33 19 19 -101 61 -31 -66 103 -44
4258 -44 -93 -102 48 74 28 -25 58 35 46 -16 42 95 -15 -10 -127 14 30 -22 -49 -34 74 34 -145 44 23 -41 -34 -41 -52
4287 -52 16 30 27 9 82 -9 -52 -71 64 -45 -18 -39 21 -58 84 -94 35 -60 37 7 46 -40 -27 -29 -27 23 22 0 -13 34
4317 34 56 3 7 17 -6 168 21 17 -125 -5 -94 99 54 -75 23 -1 -20 -152 94 3 57 -43 51 4 29 4 -11
4344 -11 47 -9 20 -32 74 13 65 -59 -33 -12 85 -50 -33 27 -70 -25 76 51 -37 82 21 33 24 9 62 61 -73 -29
4372 -29 -85 -25 4 36 34 14 -11 23 29 128 16 -35 -30 31 65 -5 -31 35 166 -72 -131 12 29 -55 -25 8 79 152 33
4401 33 95 82 30 -33 -34 40 36 -66 6 79 56 27 157 -28 -65 65 -2 78 -31 -51 16 20 -97 -37 -72 -46 0 -1 100
4430 100 49 -92 24 -147 -55 -5 -80 -72 113 33 -20 -29 -81 7 56 -52 -29 72 36 128 -109 60 110 -13 -17 -3 77
4457 77 -90 -4 -11 -6 -7 29 40 40 125 -42 -44 33 33 -33 114 100 92 -69 79 -31 -77 45 -4 33 2 1 11 30 58 14 -22
4488 -22 -26 -28 -130 -55 125 -67 88 19 -55 3 76 -37 68 -154 -112 15 107 44 69 -87 -5 31 84 16 -12 -4 93
4515 93 11 62 -37 -42 -45 -2 6 17 81 20 39 92 -29 -64 13 57 32 -66 129 -31 6 -5 4 -15 26 40 12 -35 70 -23
4545 -23 -82 -64 57 -139 80 18 -71 25 -13 -17 -20 -6 -37 27 -19 61 -95 31 91 73 -93 -54 23 23 88 -19 -93 -114
4573 -114 -118 -11 3 -33 14 38 -108 37 3 103 -27 -87 -5 -65 -22 72 11 -105 70 13 -31 119 -27 -149 40
4598 40 -22 28 48 29 -154 86 85 69 163 -69 -8 66 -28 -27 71 -57 144 -34 41 6 -22 3 9 9 71 0 -9 52 51 -59
4628 -59 -47 -44 -31 17 27 -86 -16 64 48 -20 -117 25 -42 73 13 66 -6 121 31 6 -61 9 11 -23 -45 70 48 -19 62
4657 62 -4 73 97 58 98 -34 -94 -26 -61 -81 -53 -34 -128 6 103 -30 26 -17 6 75 -109 44 67 -14 24 -26 -71 -7
4685 -7 7 65 -65 -167 26 24 114 -16 -64 -37 105 55 -33 13 1 -69 -5 62 6 59 21 -52 2 41 -17 7 -67 82
4713 82 -25 119 8 -88 79 -79 -70 71 -97 137 12 -21 31 -135 -95 -4 10 -8 -99 154 44 143 -11 14
4737 14 -89 -79 -69 -65 -89 -13 -16 -10 35 -13 52 16 39 -66 106 -103 -98 24 -32 -73 67 -30 -68 -14 -84 -63 -23 96 -76
4766 -76 -117 3 -82 3 0 -37 -45 14 -18 117 -53 -113 -1 57 14 -8 97 47 157 8 8 12 39 99 65 -4 -63 -6 71
4795 71 -26 11 -58 8 -6 47 129 -15 59 102 28 -60 14 -69 -84 -124 -74 125 16 -6 90 -11 -34 99 -64 57 -49
4822 -49 -92 -16 50 47 -82 -89 8 19 14 46 -23 47 29 7 19 -16 -24 21 64 3 -46 -76 6 -78 38 -79 -15 -2 1 -30 -77
4853 -77 -78 -75 -93 -89 79 -37 -37 43 -152 4 27 -131 27 -5 13 -4 -15 31 -58 -43 15 35 44 56 34 -6 25 -103 -11
4882 -11 -60 33 69 7 69 14 -15 3 -33 74 -25 147 -126 -42 -130 -42 -11 38 -84 -42 93 49 -179 92 -116 28
4908 28 57 -49 67 165 49 56 24 -2 97 48 88 -33 -44 15 -14 -72 3 -39 -74 40 -12 -15 -15 80 58 46 15 -69 -14
4937 -14 -15 68 83 96 -78 -59 78 -94 98 -146 31 52 52 18 -87 -82 -158 36 21 24 23 -28 23 62 -125 -121 58 22
4965 22 28 23 -42 -35 62 46 -2 59 -40 -16 -16 -37 -91 11 -57 -37 67 91 -46 59 117 27 20 12 -68 10 12 -3 57 -43 -14
4996 -14 -42 -65 91 -32 -112 59 -59 -120 103 4 -60 -74 14 -71 17 85 114 40 9 55 78 5 -85 97 -3 25 86
5023 86 -122 32 35 -87 96 -36 -92 14 72 -40 22 -55 -55 -75 72 -24 -81 -30 -15 -15 59 -16 -4 -96 -63 -36 -81 -44
5051 -44 -45 5 121 35 95 -14 27 89 -146 5 -1 -53 79 -26 -83 59 -13 -7 17 128 31 -26 -73 64 49 -55 -58
5078 -58 138 8 -70 -89 -3 48 -27 22 41 4 -28 -46 -43 -17 5 32 -25 -46 97 -59 -32 -51 127 -76 -61 -29 83
5105 83 108 -54 74 -33 -74 -186 43 -52 106 43 17 6 -78 16 149 57 -116 -58 84 -30 61 -46 -16 70 -67
5130 -67 34 4 113 -44 -13 67 14 17 44 20 72 -106 82 51 170 -46 78 -36 18 61 18 22 27 11 25 8 -35
5157 -35 115 41 -36 -150 40 -81 -29 -9 -80 -8 20 -35 111 -74 -11 -27 29 -44 89 55 -107 -54 28 -30 -89 -93 -69
5184 -69 53 103 -16 -31 25 81 -23 -147 130 29 -29 -93 -35 -40 61 -79 -53 -130 -110 110 21 -29 -21 -29 42 6 -94
5211 -94 23 -102 41 67 -9 -93 67 78 -55 36 -139 -119 32 -136 27 57 -173 54 15 -95 -28 -23 21 52 6
5236 6 58 27 4 -55 5 -78 -5 -46 -33 -64 -15 7 91 26 11 -13 109 -4 -102 -78 32 -31 -94 61 -85 -18 9 71
5264 71 -114 80 49 3 -94 -68 32 -39 -20 17 -34 56 -7 140 -95 -22 20 76 -15 -25 -28 -47 17 52 -76 -96 -65 -66
5292 -66 11 -35 -16 60 -7 -65 -36 -80 -96 -38 -3 39 85 -26 -65 -13 45 13 -8 13 -22 -58 -39 -23 44 76 6 26 3 80
5322 80 23 -50 -41 -40 -145 -47 -42 65 -22 -39 -68 -149 1 -29 -64 62 -21 94 -60 -20 65 107 -47 89 -38 -18 66
5349 66 2 -53 21 -18 -15 -36 59 11 151 -47 4 13 -19 -46 -87 20 54 45 -13 -45 29 19 -39 52 -46 64 82 45 107 77
5379 77 -44 55 -19 24 -10 11 12 -131 -57 183 -22 -13 5 -8 -14 50 26 43 58 21 -109 -63 81 -62 -87 30 -18 -102
5407 -102 -98 -2 -51 97 -34 14 141 -52 -35 -52 -28 -87 -19 -31 -71 -15 -39 17 28 -10 -68 -57 -30 -48 -3 -55 -15 -25
5435 -25 43 -104 30 -101 -50 19 46 -77 45 -59 61 -92 -30 8 -16 28 -27 -32 11 18 -42 -51 24 49 41 49 -54 -77
5463 -77 8 48 -56 2 -49 -46 -33 -110 -60 2 6 23 19 -65 66 -19 -28 33 -3 7 51 -32 8 67 16 69 84 103 -24 -89 80
5494 80 10 -76 41 6 -93 -70 -35 -85 14 16 58 105 -101 -39 -152 -75 -46 -7 -11 -46 55 -62 -162 -11 29 52 14 58
5522 58 -84 -51 -23 21 -30 -27 37 48 -19 21 -13 26 -207 -3 -72 -18 -37 -14 -24 4 29 -61 -65 75 -35 56 32 -86
5550 -86 27 -47 -74 46 -88 48 -34 58 102 -120 0 30 65 -77 -37 -23 61 104 -93 25 19 60 -44 -14 -57 11
5576 11 18 -65 57 -44 -133 -81 6 51 24 -26 101 -35 -35 -1 17 -26 26 -83 37 36 58 -12 47 10 -70 115 113 -49
5604 -49 4 -12 10 82 -16 3 -25 76 -62 94 89 -83 -26 29 42 43 138 -105 -2 42 67 15 -7 -32 -24 -75 -6 49 133
5633 133 -7 10 -86 -22 -17 -19 -11 -116 -35 -48 -130 7 -7 72 47 8 -53 14 12 17 34 21 28 -60 -13 49 -77 -15 -12 -7 -54 -3
5665 -3 -111 -75 46 20 72 -16 -13 -20 -13 13 11 46 3 223 -38 -51 -100 97 -16 -23 -105 21 -54 8 81 26 -37 26 115 89
5695 89 -107 -15 96 30 -92 -22 -5 -19 -88 -74 60 1 -164 -193 -65 -81 116 15 122 -40 34 44 -4 -51 -181
5720 -181 -11 40 -15 -87 95 65 65 -23 -34 79 -104 -42 101 6 14 -97 22 102 9 90 -46 -52 -11 6 1 72 -52
5747 -52 -3 -69 -1 4 17 26 -109 60 -22 20 42 38 -6 -66 20 -9 -39 -57 -14 -7 -40 29 -55 58 24 34 9 1 -39 31 -63
5778 -63 17 74 -82 -25 123 1 -8 3 -127 -25 -95 -57 -112 -47 -78 3 -26 93 -47 78 96 9 24 -60 79 -27
5804 -27 -79 38 -13 27 -82 4 151 -66 -63 51 12 -101 1 23 145 12 44 85 -16 82 58 15 21 46 18 58
5830 58 -78 77 86 -4 -34 -48 -18 -114 -24 -25 -39 -116 16 32 61 -75 -38 -17 -10 -57 36 17 -11 -31 18 26 -71 12 -57 -83
5860 -83 95 -62 13 -110 19 4 -31 -42 -27 15 -105 57 29 -46 15 47 -105 -34 -110 14 94 52 105 6 -30 36
5886 36 -7 31 18 11 53 -34 13 38 -40 17 7 -99 42 -28 21 28 -59 -17 40 -29 44 -18 -4 -10 26 43 -33 26 15 175
5916 175 58 -77 119 -41 -41 56 11 43 -17 -12 75 20 -31 -33 -69 28 -15 5 -18 -30 94 13 -5 -30 120 23 25 -28 14
5945 14 62 22 6 -86 -9 38 -60 48 103 -34 70 -52 -50 -17 -27 64 87 -24 -27 9 44 91 -27 109 86 -80 -115
5972 -115 -28 -44 -74 27 36 -50 -113 38 77 -44 9 73 11 2 -16 -2 -16 14 30 0 58 21 18 14 -18 -42 -50 -12 -8 -88 50
6003 50 63 3 -19 62 72 14 43 8 104 22 75 -34 51 37 -41 78 0 35 22 101 -62 28 -4 71 38 -55 -6 -36 -148
6032 -148 -28 1 -144 -16 -60 -146 -9 146 -14 -22 55 -40 35 -8 22 -12 32 -102 91 -106 -6 38 151 63 -19
6057 -19 167 61 20 28 -48 110 62 -71 44 18 -123 -33 150 49 129 -51 53 -38 131 -22 70 22 19 27 6 -55
6083 -55 -14 7 -46 48 23 -2 -106 8 9 43 -73 107 -63 31 -6 -33 23 -10 4 5 -80 45 17 21 -72 39 -62 -26
6111 -26 48 37 8 26 -22 -72 27 32 42 -68 133 28 -10 60 101 94 -95 74 17 -9 66 -35 50 -18 -27 -47 -44 -1 33
6140 33 -115 -7 -11 -34 -12 -49 48 -132 -47 29 -67 -24 -21 -53 -72 55 34 -107 -87 -48 26 60 -27 -52 78 32 -106 -76
6168 -76 -64 33 32 -105 3 -45 5 85 41 1 -4 108 44 -40 64 20 -16 -2 5 17 47 73 -89 11 -28 -74 56 47 61
6197 61 -10 63 25 -22 -6 -1 -98 47 -100 -41 -29 90 -131 15 -16 -22 -17 -9 81 0 -8 36 -19 -139 -87 36 -33 -6 -54
6226 -54 64 52 54 43 39 -2 -45 43 31 -84 -63 -62 -1 -22 14 27 -73 -69 10 22 12 -28 -63 -14 7 -54 12 19 18 -66 32 -27
6258 -27 25 95 -117 11 38 -34 53 97 -75 -19 -26 -35 -75 3 -11 -144 34 22 20 17 63 41 79 42 39 -47 -42 -79 -49 74
6288 74 -54 -83 85 93 18 -15 -165 85 121 -2 38 15 -39 -4 2 84 -21 -44 -52 -117 7 -22 61 -142 -57 -87 10 7
6316 7 48 -65 -14 -30 -13 24 -1 -10 -28 24 -35 1 -14 19 35 49 16 24 70 -37 -24 -11 38 198 -49 -13 37 -41 0 -65
6346 -65 -13 25 68 4 -92 -16 -71 0 -28 115 26 18 -147 -125 -90 102 -115 -60 57 -29 -25 -55 31 -61 -43 40 -17 -1 -7
6375 -7 -4 22 101 11 -102 2 14 -59 -23 -19 -46 -58 69 -14 168 -38 55 18 41 14 -59 -37 -130 -11 28 -94 50 65
6403 65 47 128 4 32 108 73 74 -15 38 48 -121 110 -32 -39 66 46 84 -28 -3 -49 10 55 -71 -72 -38 24 2 72
6431 72 13 -105 -19 54 -19 -65 11 77 -3 -40 -42 31 -26 -95 -160 60 -15 -29 -5 102 19 -61 4 32 26 3 32 -89 -59
6460 -59 58 11 -3 -35 96 -55 21 0 -50 -1 70 43 73 -28 109 65 63 -142 -46 43 39 -29 4 -21 -17 79 2 -151
6488 -151 -3 15 -89 117 50 -53 49 -43 0 -81 8 74 42 -47 -45 -38 -31 -15 -45 -74 -64 22 5 -5 -32 -76 -3 12 -47
6517 -47 -76 5 38 37 96 1 -141 -153 55 -21 40 24 -85 -78 -31 -46 109 -1 -58 -46 2 41 60 -1 38 60 24 -26 22
6546 22 -80 43 -90 -52 61 -36 -59 -26 15 60 -10 106 -23 6 -121 -61 -125 41 -41 -40 23 -63 -37 65 38 18
6572 18 78 -63 -8 -43 31 -76 -42 -16 -31 -43 -60 1 62 59 -13 -33 -76 52 127 51 28 -15 6 68 -77 44 -44 -20
6600 -20 10 -113 33 -40 36 39 -107 -116 -13 -23 4 -44 5 -90 -49 70 103 12 -64 -34 -77 -81 42 25 -90 -6 -56 35
6628 35 -96 -2 -11 -25 -168 -17 -56 17 70 19 -76 -25 -8 66 81 72 -49 33 40 -9 65 23 6 -109 42 -63 -73 -2
6656 -2 9 -15 -43 35 17 33 -102 52 45 9 -13 3 26 16 -114 -36 9 20 -58 33 28 -115 54 -10 70 -37 -35 -67 8
6685 8 -10 48 52 34 -50 26 -11 -135 -109 -4 -18 80 4 5 -36 33 -21 -86 -46 3 45 22 -50 50 29 34 -3 47 -26 -89 -40
6716 -40 4 -3 -18 109 -75 -71 97 29 -115 25 -54 -20 -22 -8 60 -19 -51 66 27 -59 -21 54 -47 1 -76 47 18 15
6744 15 59 -3 22 9 42 -19 -99 65 -49 -8 85 -64 53 -24 44 26 -62 -39 -47 1 106 -20 -38 4 -105 23 81
6771 81 -37 -16 65 16 5 124 9 42 97 27 19 81 -91 -18 88 16 16 2 -61 -26 8 -39 24 65 -8 -43 -71 49
6799 49 9 -28 96 -63 -20 -68 -1 -37 -12 30 -30 -58 137 -63 52 8 47 -48 98 -45 -27 -48 -9 -30 117 89
6825 89 25 -106 63 16 36 38 45 24 -102 31 -28 -25 -107 -39 51 -15 20 -65 -134 4 32 84 -28 -47 -25 107 -19 10
6853 10 108 112 -92 138 3 -19 79 17 16 94 -52 -10 -26 -66 113 111 -74 -78 85 -31 -40 13 -75 37 -21 -51 33 88
6881 88 56 -67 -106 47 87 73 2 -53 -68 -12 -55 50 51 -30 -12 72 34 105 7 9 7 76 -10 91 -34 -5 110 12 -5
6910 -5 -49 69 87 73 -31 35 -27 17 -68 -21 27 -5 -38 12 24 6 28 53 39 -4 -136 8 7 4 36 -25 -58 28 -16 44
6940 44 65 66 16 8 -56 -100 7 109 65 -4 -67 -30 -3 -14 110 32 -3 8 -37 45 -47 -12 102 106 57 -78 -14 25 -28
6969 -28 -1 15 66 -69 -51 -20 84 -49 -32 -49 -11 101 -16 -132 -11 72 -12 42 -99 -89 124 -40 -17 101 -4
6994 -4 0 -20 -57 44 -34 -23 37 24 60 27 27 -3 27 22 3 -3 39 0 -4 -31 34 19 -1 8 63 7 33 -74 -48 -89 114 -31
7026 -31 21 53 -31 -70 -3 -29 -41 -70 -11 60 35 -134 10 -60 84 136 -34 -86 32 64 -12 -6 -39 -52 -12 31 -4 46
7054 46 18 -35 -20 0 -52 -23 12 12 8 -91 17 91 39 -10 42 27 84 73 -59 -81 104 9 14 28 -32 60 91 141 -74 -56
7084 -56 -52 0 42 30 7 1 -74 44 74 -67 -25 88 -6 5 48 -40 22 -80 60 81 21 0 66 -4 -89 -77 -7 -16 27
7113 27 21 77 -11 -5 50 109 -18 -2 -130 -28 -13 -70 -14 -43 -58 51 -36 -61 -7 27 -69 65 -27 40 9 26 12 -8 35
7142 35 -6 45 -35 89 36 65 128 -85 11 73 -63 -18 50 72 60 -16 97 15 22 -33 -115 -18 -61 -60 -8 2 56 165 -68
7171 -68 -23 -36 26 -24 6 22 -18 -84 -126 -63 -15 -123 -27 -40 16 -19 121 -29 -23 -141 4 30 48 -37 6 -84 8 26
7199 26 70 -20 -4 63 -32 -23 56 72 -26 -62 -12 -18 -42 -130 -133 34 -22 -8 28 3 47 -24 -19 59 91 4 66 20 46 -43 -100 -16
7231 -16 -100 -1 -30 -12 3 -17 -90 -23 -125 -1 -22 14 27 -56 84 -29 -12 -86 18 8 -96 -85 28 -8 66 -97
7257 -97 81 100 -13 -20 19 -27 41 70 -42 116 0 -39 -19 -38 8 7 13 15 -75 2 -2 152 -35 -107 -89 12 -71 -89 -33
7286 -33 47 -58 20 13 -7 43 42 -13 110 14 53 -62 87 -73 -94 21 34 -79 9 -18 55 -31 -125 72 -7 21 50
7313 50 52 -61 28 -23 15 88 -5 -95 -21 -45 82 35 33 7 -57 84 12 -38 -23 -20 -88 52 -60 36 -25 127 36 50 40
7342 40 9 -72 -53 -1 45 -24 60 -9 -95 -3 26 -33 30 21 -86 -8 29 25 31 91 0 -41 91 170 -147 -1 29 -106 4
7371 4 -8 -7 18 -95 -60 86 17 -36 114 37 26 -42 46 -3 -12 0 54 32 -11 26 71 31 26 -36 -68 51 -51 -20 21 -173
7401 -173 -85 3 16 6 -15 16 -35 -6 -54 90 50 97 50 -94 -20 61 -68 82 57 31 -2 -40 15 25 86 41 -37 82
7429 82 -104 27 -81 37 -23 6 -5 -31 20 18 47 41 45 -24 17 39 63 87 99 81 -29 -25 49 -106 -2 126 -68 22
7457 22 137 -37 -72 31 62 5 -92 95 -74 -4 120 -48 -11 -57 -1 54 65 -37 -134 -66 -66 64 -50 23 12 3
7483 3 -69 -79 -27 -14 33 6 19 -99 -104 126 -55 -92 36 72 15 -10 70 -75 -79 -79 20 48 42 -76 10 54 -9 90 18 146
7513 146 58 24 -16 -152 8 34 -51 30 99 11 47 1 86 25 -69 -77 -42 -27 -100 23 160 -76 -57 114 4 -9 -91
7540 -91 32 -26 68 51 -5 23 25 3 -97 -61 170 27 7 -25 -40 -16 -20 18 -42 -79 -112 -106 -50 -46 71 84 -118 -62 -45
7569 -45 3 68 -48 58 -33 130 58 -17 109 65 23 -18 -89 59 110 37 -20 40 -90 -117 46 -53 19 -100 168 21
7595 21 27 -53 -36 26 -35 -53 89 -174 12 -73 44 7 -123 72 -51 -33 31 -31 20 -16 -8 -5 -79 30 -32 -22 74 -18
7623 -18 -12 -24 26 18 26 -33 -49 -9 46 93 55 30 10 34 86 21 39 17 -163 92 -40 -75 58 -42 -98 -21 24 88 -31
7652 -31 -149 21 -83 -57 -19 18 73 6 -25 82 -59 100 -73 76 132 -21 -4 36 12 -95 60 2 -44 46 -4
7677 -4 64 78 148 47 22 -61 -44 -97 -63 -7 -111 25 -1 65 -56 33 50 112 -68 -68 -20 -92 -30 7 -76 -16 -26 7 14
7706 14 -17 30 -100 -59 -58 -103 8 -28 -18 51 48 -78 -60 31 31 87 -7 -43 26 6 -47 -71 146 45 -75 33 -55 -22
7734 -22 -5 102 11 -56 8 76 -1 1 38 42 153 31 25 -11 -38 -85 -28 -48 101 -52 -83 59 10 -95 -30 18 33 -78
7762 -78 -91 -138 -1 -58 -96 7 24 100 36 -95 42 93 -110 45 -20 27 21 74 9 21 -68 -132 -42 -124 -59 -73 -26 36
7790 36 -91 -14 18 -141 -44 39 83 -35 11 127 -19 -22 -20 71 -56 -24 -73 -111 46 96 9 -79 -40 56 -162 -80 -9
7817 -9 20 8 71 32 49 -142 26 92 -7 -12 23 -30 95 71 106 -28 -19 -5 -23 -39 4 -124 30 48 -100 11 -35 -40
7845 -40 -25 -39 63 25 32 -4 22 63 48 -90 87 53 -20 11 109 -48 75 12 26 29 -42 -43 37 -42 -16 28 -96 79
7873 79 -42 -52 -96 20 -97 -3 51 27 -47 -35 41 -10 19 13 -18 42 29 49 -143 19 77 -62 67 101 55 -27 53
7900 53 47 -6 79 4 -74 -57 -96 98 -15 46 31 -21 -57 48 14 -84 -29 -81 106 58 -35 4 -33 -54 -9 44 28 32 -20
7929 -20 -20 -3 -92 59 -62 114 43 -73 -91 -7 -2 13 2 -48 -21 -14 -69 38 75 -21 3 42 -58 -99 -73 -120 -29 9 -94
7958 -94 -85 -58 -10 2 55 -54 31 9 -56 33 -43 35 -57 75 25 9 -11 107 -27 26 -77 3 -21 4 31 -52 10 25
7986 25 -58 30 18 84 69 80 -20 4 -72 72 73 3 -10 60 62 73 75 -46 -32 -99 -29 -56 56 -79 -63 -43 -69 -21 24
8015 24 3 42 -32 72 48 -16 -52 -34 -116 86 -30 -51 65 -33 -54 7 -56 -25 -24 -27 39 -34 -38 25 -17 57 11 -7 9 -69
8045 -69 56 -14 15 -31 114 -18 9 84 29 -21 -54 51 4 -67 -54 90 -8 -71 -35 -99 -194 -1 69 2 -87 -55 89
8072 89 -58 0 -5 55 56 -34 -69 -73 1 -80 30 6 -35 -39 -102 -16 153 91 58 -74 -88 24 50 9 -10 17 2 66 21 -7
8102 -7 -8 61 2 49 10 95 -44 62 53 30 34 19 -25 -15 -45 -27 -27 176 58 20 -40 -6 39 32 -39 15 -35 0 15 -14 -87
8133 -87 24 34 -92 -24 -3 12 -19 -86 139 150 -5 73 -26 -9 -38 94 67 18 -15 -95 6 -84 26 78 4 -72 130
8160 130 -58 -54 -36 18 -26 -7 -21 73 110 61 -21 8 -60 -61 -23 40 -101 -58 118 -149 39 -19 -24 30 18 -81 57 -147
8188 -147 -95 102 87
8191H7
$$ Imaginary data points
##PAGE= N=2
##DATA TABLE= (X++(I..I)), XYDATA
0 0 0 0 0 0 0 0 0 0 0 0 0 0 0 0 -6 8 -8 8 -8 9 -16 16 -21 24 -26 32 -40 41 -48 56 -65 73 -85 96 -107 121
36 121 -137 153 -171 190 -214 236 -262 292 -321 354 -392 432 -474 523 -578 636 -700 775 -856
55 -856 946 -1053 1171 -1312 1477 -1673 1918 -2225 2627 -3177 3984 -5279 7709 -13888 67402
70 67402 104681 23403 30325 -3123 -28276 -64850 -76361 -46796 -28933 -45799 -27614 -9779
82 -9779 23916 43024 19677 29249 60254 26890 -4103 -15767 -17065 540 -8452 -20414 9355
95 9355 8852 -10964 -21603 -40327 -26602 -7359 -28075 -20230 5075 9231 13099 3480 10508 43155
109 43155 33092 17034 19353 -1279 -9316 -19944 -52087 -35526 -4384 -7375 -4565 1055 15817
122 15817 31775 8805 6144 34917 31610 21621 7159 -14286 -2264 -8730 -39063 -24745 -829
135 -829 6683 6013 -11309 3545 28399 5943 -1240 17348 20057 18408 -6524 -28083 -9260 -10735
149 -10735 -28492 -19965 -7712 11576 11606 -18247 -6550 16273 1129 -2951 3015 8560 18357 -3296
163 -3296 -19633 -1865 1410 -118 -1024 -6764 12045 10426 -22083 -18286 -4033 -3789 2685 -2351
177 -2351 5505 24743 9987 -685 7493 8968 19188 11238 -8929 3573 4094 -17553 -19507 -16681
191 -16681 -2645 10925 -4455 -1652 13793 5224 1025 -3810 -4677 17803 12099 -9749 -981 3577
205 3577 -863 -5844 -14983 2803 14965 -6190 -11086 -6480 -7492 -1726 -12586 -12267 16208 15422
219 15422 -302 -220 1011 9349 2702 -14701 1732 13145 -1789 -6685 -9288 -2438 10331 -3803
233 -3803 -6557 11957 9490 668 -9236 -13581 4941 3610 -10960 3211 12127 8138 5083 -7485
247 -7485 -1018 12150 -972 -5320 194 11 3771 -9101 -16379 4790 6926 -2512 1859 975 5211
262 5211 4411 -12580 -6398 6454 2514 2436 -3135 -2208 10368 -2217 -11961 2888 6687 5776 1606
277 1606 -7157 3439 5053 -10765 -7728 -1097 2497 5876 -7990 -6812 10484 3221 -4094 1805
291 1805 5721 12321 2277 -12225 -945 1847 -7081 -5472 -5088 5316 12735 -4381 -5514 6897
305 6897 2795 -1519 -6559 -5448 7508 -1227 -12693 -1708 2817 4574 5162 -2343 7509 13522 -3003
320 -3003 -6594 -2749 -973 2649 -7212 -7013 8085 2345 -5531 -2237 -2417 5311 4297 -7545 649
335 649 7036 659 -493 -3618 3025 12074 -936 -4959 4059 423 -2091 -6254 -9283 3653 4060
350 4060 -6209 -1892 1231 3056 2353 -8314 -1268 10129 356 -3123 866 2484 7684 -590 -6122
365 -6122 5646 4782 -3088 -4959 -8012 173 1404 -11423 -4752 6357 3075 1927 -1461 2203 11534
380 11534 1996 -4190 3487 2956 2143 -2903 -9635 1290 3861 -7446 -4537 646 2957 3834 -5252
395 -5252 -1798 8436 1337 -2628 -995 -1205 5093 -300 -8368 1902 5559 396 193 -1685 4812
410 4812 7291 -5365 -4438 2049 -1381 -1725 -5575 -5399 6043 2815 -3880 2031 4195 5367 2021
425 2021 -6361 1413 5320 -4614 -4377 -1780 515 5138 -2352 -3337 7460 4520 -970 -2888 -4725
440 -4725 1823 -1906 -11878 -3448 2289 -786 127 -1958 3696 10761 1920 -403 5190 3513 2104
455 2104 -5206 -9185 940 -1122 -9132 -3653 154 2804 2815 -4191 1730 8723 2050 736 1369 2484
471 2484 6740 -1547 -5949 3932 3555 -931 -1213 -2853 2718 1339 -8497 -4208 896 -434 1019 -2570
487 -2570 110 8456 1398 -2848 2909 3051 3613 -1023 -6340 1219 839 -6549 -3952 -2231 875 3452
503 3452 -5056 -3785 3824 -771 -3202 -2223 -124 6762 1789 -4250 3255 3709 165 -420 -3553 1676
519 1676 4528 -4966 -4708 719 865 2150 -1687 -131 8810 3289 -3350 -108 -104 1643 337 -4824
535 -4824 2296 6397 -118 -649 -145 2217 5376 -2737 -3831 3511 -735 -4526 -4694 -4752 2391 1741 -3849
552 -3849 1862 4106 1391 268 -4598 -440 4702 -3221 -4511 -64 -1375 -744 -4101 -4926 4034 3705
568 3705 -923 1438 837 2641 1806 -5793 -1362 4448 -689 -1880 -2110 -982 3820 -1200 -2583 5521
584 5521 5478 3513 1855 -1750 2963 2694 -5216 -2062 1968 990 538 -4073 -1896 4449 -730 -2282
600 -2282 1875 1552 3015 -790 -6129 432 1910 -2639 -817 477 3237 3656 -4244 -2840 2524 -1423
616 -1423 -2258 -2711 -3104 1680 -2463 -7039 -381 2061 2260 2994 740 5233 6101 -2283 -2334 80 -1081
633 -1081 -215 -4206 -4279 2185 -487 -3068 746 2558 6279 4706 -1323 2782 3298 -3096 -3315 -3207 -606
650 -606 3126 -1815 -1741 3361 1688 928 -201 -1055 4407 1627 -5047 -1865 -813 -1813 -858 -2933 1457
667 1457 5691 41 -1342 -37 -1082 604 -2861 -4058 2998 1910 -1921 -435 -186 2643 2840 -2270
683 -2270 1039 3461 -1228 -2467 -4150 -3145 1704 -1708 -2738 3239 3022 1808 593 -1147 3779
698 3779 3636 -1557 647 1067 -380 -659 -5164 -3496 2025 -1070 -2074 479 630 2680 -95 -2594
714 -2594 3300 3775 352 746 -800 311 935 -4668 -2874 1747 131 364 -961 -1123 3227 -146
730 -146 -3003 1622 1892 1222 495 -2762 480 2052 -2418 -1025 1102 1574 2643 -1979 -2052 2693 -250
747 -250 -1886 364 262 2494 750 -3656 -110 1058 -1506 -773 -1676 340 2496 -2582 -2631 1733 714
764 714 905 451 -256 3758 1240 -3110 -774 -452 -388 -120 -3235 -288 2386 -1836 -1694 384 990 3101
782 3101 350 -788 3404 1432 -1086 -171 -765 1848 2183 -2466 -108 1875 -925 -820 -1823 -279
798 -279 3087 -638 -1636 1595 338 511 -304 -1918 2283 2156 -1911 -614 -198 -277 438 -2752 -752
815 -752 2872 -552 -1567 -716 -1305 764 -1167 -3099 1132 1143 -799 -354 -1395 1246 2349 -1750 204
832 204 2649 326 260 -1284 -1441 2287 -93 -1898 933 683 823 -149 -2728 1043 2351 -1145 279
849 279 1282 1097 2108 -1013 -691 2756 637 -638 -56 -1006 1132 -609 -3618 233 1147 -467 148
866 148 -980 409 1911 -2026 -1538 946 -197 358 -989 -1819 1826 254 -2117 443 608 929 761
883 761 -2483 -269 1177 -1936 -1226 -531 -57 1894 -761 -1407 2154 1131 -68 421 -50 2125 1360
900 1360 -2237 97 1155 -365 484 -862 67 2737 -544 -1343 721 185 561 -659 -2014 1359
916 1359 744 -1959 -93 208 927 1770 -991 422 2526 -386 -751 -840 -1234 767 -1549 -3098 298
933 298 -139 -1145 -391 -1173 1302 2130 -1001 242 1560 141 582 -1133 -881 2246 -350 -1474 646
950 646 -32 288 -90 -2117 583 1131 -1331 -243 -173 340 1841 -821 -86 2946 981 311 406 -372
968 -372 1492 -227 -2503 129 -68 -1105 -334 -1844 67 1950 -1096 -312 1513 664 1083 -570 -1221
985 -1221 1681 15 -1612 79 -475 501 512 -1964 169 1717 -816 -389 -259 -223 1287 -1255 -1573
1002 -1573 1256 63 -302 194 -662 1428 1104 -1527 284 956 -192 457 -1316 -216 1723 -1001
1018 -1001 -1066 692 -141 669 -207 -1666 1165 642 -1423 -70 -446 507 1115 -1479 85 1897 -152
1035 -152 219 219 -259 1527 -316 -1665 589 -134 -679 -407 -1776 460 1105 -1477 8 1059 341 1180
1053 1180 -207 -70 2225 139 -698 377 -448 540 -219 -2230 159 492 -1303 -322 -678 -66 1165
1070 1165 -1019 -376 1713 250 417 226 -320 1735 565 -1569 401 185 -530 -346 -1698 -221 934
1087 934 -1408 -506 614 -100 1141 -8 -584 1979 698 -614 449 -176 633 487 -1601 -25 958
1104 958 -878 31 -318 -179 1332 -686 -1052 1134 107 71 -86 -930 1014 719 -1249 344 375 -170
1122 -170 566 -1025 -226 1390 -621 -587 361 -245 890 -270 -1299 1035 393 -910 4 -621 -2 714
1140 714 -1268 -151 1178 -97 359 91 -93 1662 45 -991 891 -35 -271 -155 -1362 165 493
1157 493 -1468 -306 269 -46 610 -464 -371 1572 175 -351 689 -2 818 156 -1315 576 322 -940
1175 -940 -60 -852 -365 747 -1162 -697 996 -124 337 229 -213 1449 553 -695 916 326 95 428
1193 428 -1137 -64 828 -1000 -564 110 -417 565 -678 -898 1102 132 -456 553 -188 787 833 -871
1211 -871 387 854 -513 -82 -632 -590 738 -938 -1011 482 -447 -97 -38 -956 675 496 -929 250
1229 250 192 89 724 -653 185 1219 -355 -176 359 -220 652 -181 -1167 666 112 -669 200 -430 498
1248 498 894 -763 237 1148 45 441 33 -142 1273 -84 -736 487 -67 83 92 -1102 314 492
1266 492 -1050 -272 -103 -240 400 -720 -536 1000 -295 -141 290 -354 636 111 -1080 424 111 -743
1284 -743 -126 -778 -216 510 -787 -314 661 -206 502 84 -496 965 339 -778 573 158 257 464 -654
1303 -654 420 926 -375 229 451 -98 908 -259 -602 794 -119 -445 28 -604 280 308 -879 239
1321 239 550 -141 549 -151 56 1058 -417 -656 289 -549 -340 -633 -1382 88 -135 -1102 36 -167 24
1340 24 733 -331 130 1039 -214 202 291 -219 556 -94 -908 598 -16 -632 73 -666 160 622 -763
1359 -763 200 715 182 912 239 134 1221 255 -176 584 -42 132 138 -859 160 130 -800 -40 -197 -202 457
1380 457 -645 -453 863 -285 -259 212 -374 475 110 -700 445 48 -380 -2 -707 -337 396 -915 -504
1399 -504 214 -446 119 -100 -434 921 204 -242 526 2 175 491 -613 293 649 -360 167 144 -135
1418 -135 730 -110 -331 850 2 -33 263 -471 478 411 -641 370 354 14 492 -238 -41 624 -573 -310
1438 -310 321 -343 210 27 -547 537 205 -480 136 -334 -222 108 -1094 -344 364 -562 -23 200 96
1457 96 934 258 -70 723 133 -134 86 -783 -172 155 -1035 -136 187 -274 587 -7 32 1019 87 7 508
1478 508 -151 372 150 -701 389 326 -591 270 -32 -53 531 -533 -345 269 -535 -246 -69 -502 545 230
1498 230 -432 636 335 -32 309 -281 126 415 -836 -433 37 -510 -55 -211 -517 634 46 -222 478
1517 478 -77 221 301 -662 78 401 -537 -33 -83 -114 617 -288 -224 602 -78 21 78 -669 99 68 -766 168
1539 168 65 -248 448 -202 -14 794 -238 -53 321 -315 289 -65 -499 450 128 -373 259 -125 59 393
1559 393 -548 -90 306 -487 -114 -239 -478 452 12 -272 734 266 306 593 -159 354 329 -548 -168 -174 -754
1580 -754 -222 -653 -579 347 -248 -80 594 129 613 598 -123 475 382 -365 150 -287 -369 181 -751 -341 300
1601 300 -437 3 122 -200 442 94 -467 573 170 95 500 -301 76 401 -477 -133 5 -530 8 -340
1621 -340 -479 433 -112 -207 356 -34 338 510 -300 297 304 -419 149 -202 -173 420 -343 -232 421 -202 12
1642 12 55 -349 346 145 -470 187 -223 -243 197 -402 -12 424 -418 -18 273 -163 314 206 -287 474 136
1663 136 -210 310 -326 65 375 -540 -86 18 -573 -97 -317 -336 413 -72 -70 609 85 295 374 -205 352
1684 352 250 -559 -9 -147 -440 72 -558 -261 412 -186 48 407 -157 268 165 -408 320 55 -174 226
1704 226 -200 -47 341 -269 -64 370 -280 216 -18 -330 258 -59 -367 127 -93 -39 215 -337 112 360
1724 360 -260 314 164 -92 184 -245 -360 201 -346 -188 134 -304 240 238 -407 226 125 -330 147 -337 -446
1745 -446 213 -288 -9 527 48 514 460 -76 492 133 -413 4 -515 -432 -200 -593 -82 348 -249 356 591
1766 591 147 803 408 -33 411 19 -314 -18 -585 -101 103 -482 28 58 -245 213 21 -127 463 -168
1786 -168 -367 232 -258 -37 98 -370 266 330 -213 274 23 -144 292 -281 -257 45 -394 -294 93 -314 316
1807 316 359 -152 501 293 -62 363 -255 -192 86 -607 -131 66 -303 393 299 136 739 90 -96 329 -330
1828 -330 -269 6 -703 -341 28 -428 289 361 92 774 240 136 462 -113 -167 -90 -534 -133 -139 -614 28 -100
1850 -100 -308 268 -125 -20 377 -169 -111 95 -350 70 92 -263 282 151 -79 359 -140 -118 265 -345 -142
1871 -142 46 -491 -121 10 -188 378 130 5 637 137 114 316 -248 24 80 -297 -10 53 -361 166 -60
1892 -60 -219 379 -70 -48 285 -128 113 91 -356 22 91 -185 309 -6 -230 281 -202 -174 387 -226 78 100
1914 100 -418 -39 -177 -441 180 -97 -198 341 -242 81 325 -243 179 229 59 280 -16 -300 263 -62
1934 -62 -233 347 -211 70 159 -481 -9 -65 -377 172 75 1 450 98 -44 424 44 111 185 -363 148 -53
1956 -53 -563 -61 -335 -267 242 -112 64 215 -318 57 15 -235 230 317 -106 334 -36 -141 183 -255 -122
1977 -122 56 -313 -233 58 -484 43 65 -66 630 212 119 480 -81 -142 13 -329 11 124 -404 194 86
1998 86 -143 230 -82 -7 435 -191 -96 -2 -332 -48 -63 -260 164 -21 -191 303 -262 -242 181 -49 164 511
2020 511 9 318 147 -282 280 -130 -242 67 -274 -350 10 -532 -102 235 -106 291 349 15 411 -16 -100
2041 -100 360 -22 -105 321 -230 -85 -82 -646 -172 -231 -310 176 -78 -139 357 59 310 627 151 386 318 -280
2063 -280 -76 -397 -711 -234 -318 -208 274 -123 -18 367 -108 269 205 69 282 53 -265 131 -156 -208 173
2084 173 -147 54 214 -243 -19 -12 -370 109 175 -112 483 -92 -135 219 -459 -36 132 -257 112 -14 -340
2105 -340 71 -52 -174 440 129 160 447 -175 -146 24 -345 74 26 -169 158 -22 -277 129 -196 -53 335
2126 335 -105 100 231 -211 127 203 -86 450 200 33 127 -310 -244 -118 -491 -138 64 -207 377 94 51
2147 51 496 248 124 499 54 60 136 -462 -348 -81 -368 185 75 -167 262 -121 -124 100 -231 -19 153 -188
2169 -188 -79 169 -202 137 108 -87 267 50 -146 73 -349 -303 17 -201 185 261 -69 255 -138 -200 147
2190 147 40 -79 194 -145 11 181 -146 62 219 -206 381 -38 -326 30 -231 -201 45 -199 21 101 -261
2211 -261 58 -12 -355 78 2 15 426 -15 34 244 -229 13 76 -334 20 -110 -380 -15 -315 -205 280 -85
2233 -85 249 409 -46 193 163 -222 203 56 -250 212 -165 -199 154 -226 -110 212 -305 85 48 -299 122
2254 122 5 -161 230 24 95 291 -238 -198 110 -332 -79 76 -89 71 80 -224 215 -102 -64 150 -141 71
2276 71 163 -173 16 28 -156 298 56 -66 118 -200 -56 199 -274 80 207 -164 250 139 -200 65 -103
2297 -103 -194 40 -118 -145 128 -297 -136 -77 -209 276 112 191 422 -21 -62 185 -173 -88 85 -335 -191 -77
2319 -77 -365 -22 -13 -105 480 147 88 284 -98 25 12 -179 9 2 -311 53 -1 -181 149 49 -38 167 -227
2342 -227 -50 110 -257 -91 16 -148 247 184 81 339 -78 23 178 -131 -26 33 -173 -177 -73 -368 45
2363 45 36 -128 305 -116 -15 305 -226 -86 67 -187 58 54 -181 119 46 -110 200 -75 111 218 -161 18
2385 18 65 -314 -60 -110 -182 97 -113 -24 256 -49 40 190 -20 92 212 -156 53 -54 -211 96 -215 -155
2407 -155 243 -89 -38 134 -192 73 -43 -146 156 41 -95 153 -79 -19 179 -95 -46 40 -188 65 -15 -268
2429 -268 23 -92 -239 160 -80 -14 268 14 42 225 -194 154 33 -148 125 30 -166 93 -159 -92 80
2450 80 -72 69 27 -178 75 -120 -180 163 -248 -166 53 -35 80 240 -53 110 160 -111 161 120 -215 82
2472 82 -78 -36 63 -35 37 189 -48 -2 38 -234 54 57 -165 219 -13 -2 157 -19 60 199 -185 42 152 -123
2496 -123 52 -102 -57 123 -116 -50 190 -192 37 180 -37 40 46 -131 47 44 -72 186 -34 -87 124 -83 -26
2519 -26 18 -247 -82 -59 -248 211 185 -6 218 -45 90 90 -100 2 27 -217 0 138 -107 56 -175 -66
2541 -66 58 27 -143 57 -94 11 92 -172 53 192 -88 121 -38 -67 142 -32 6 102 -130 -27 29 -131
2563 -131 54 73 -142 38 -60 -124 29 -127 -128 50 -54 195 198 -27 83 -6 -73 65 -52 -92 -16 -40 -45 40 -150
2588 -150 -89 59 -128 244 137 8 202 251 -43 154 7 76 -53 -136 -10 -77 -34 109 1 -85 126 -114
2610 -114 17 12 -214 -131 230 -67 110 121 -14 228 -32 -145 64 -76 -12 -48 -222 -51 172 -99 152 89
2632 89 -2 311 -58 54 35 -152 -87 65 -144 -61 155 -247 64 17 45 95 38 -127 183 60 -54 89 -164
2655 -164 -99 -18 -68 87 29 -80 59 -67 -79 152 145 198 254 -93 134 -87 -160 45 -81 -43 91 -43 -70 155
2679 155 -37 -14 47 -14 10 1 -75 90 28 6 155 22 22 111 -92 16 -121 -133 -89 -83 -100 114 43 12 59 64 21 152
2707 152 32 55 -56 -173 -90 -171 -54 98 -33 -120 142 -71 -37 46 -62 -43 18 -75 222 -81 -179 82 46 -92
2731 -92 186 16 -43 53 -57 -71 -39 -147 -33 10 -39 118 -101 -49 57 54 125 95 -30 73 -31 -124 -78 -32 62
2756 62 126 -27 78 127 -83 -20 -65 -101 10 39 36 104 -70 -164 6 -42 -20 136 -86 -53 93 -67 235 62 88
2781 88 151 22 -72 82 -39 -197 106 -59 5 137 -33 17 16 -118 147 93 14 50 -72 -70 -12 -51 54 96 -105
2806 -105 95 81 -91 73 -15 -70 76 -24 19 105 34 -13 125 -61 144 -35 -29 -93 29 47 -26 -120 36 -16 -54
2831 -54 24 17 -48 16 1 -49 29 -14 -75 -3 11 2 -13 -64 125 -54 -2 79 -91 -99 -7 -143 -112 75 6 16 -9 30 47
2860 47 -62 -113 57 -49 -14 84 16 62 68 -98 -20 -6 -114 -149 -54 -112 97 -33 -31 -27 33 -9 188 -83 -16 -2 -30
2887 -30 106 5 -26 92 151 -145 165 -39 17 9 -9 109 137 -74 -35 -12 -34 38 -82 -35 56 36 -57 10 -53 24
2913 24 113 -76 -56 13 -107 132 -5 15 25 -128 -141 64 -78 97 16 -25 239 60 -69 -25 -2 -93 70 -61
2937 -61 -34 41 -39 -6 -8 -38 -4 -31 -55 63 -53 61 -27 -4 62 41 -57 43 19 -34 -10 81 -131 6 -15 18 59 -185
2965 -185 -50 -19 -72 60 63 -50 95 87 20 98 13 43 0 -109 28 143 -28 7 76 -77 18 20 -136 62 20 85
2991 85 -22 -59 -8 79 -82 -4 139 -19 17 -48 -26 57 -78 29 31 -141 16 -91 -54 -1 -21 -4 135 98 -68
3016 -68 21 -82 69 98 -10 51 60 -19 31 95 -72 134 -41 101 93 16 24 30 -12 -41 13 -111 21 18 -69 11 56 75
3044 75 -52 -59 3 1 -49 61 -91 -20 28 -9 -31 30 19 19 49 41 10 107 -134 1 4 89 43 -69 -12 97 90 -60 63
3073 63 14 175 70 68 -22 -59 -122 162 -70 -33 -55 89 -67 89 12 -15 -53 -74 103 -27 75 -28 73 -32
3097 -32 -47 -31 -68 11 13 40 48 69 24 5 -58 70 2 -59 -48 -42 62 39 13 2 -85 -55 -23 5 -97 -23 -17 93 91 -95
3127 -95 38 103 -78 109 38 -56 -40 28 26 60 -70 -61 52 31 -108 -19 -12 17 -92 -110 -43 30 -55 40 121 9 105 -76
3155 -76 -43 -44 5 -125 4 -63 18 39 -65 -106 -40 -113 21 17 -56 38 -47 67 60 -89 -9 -119 12 123 -56 19 19
3182 19 -176 -48 -71 -38 14 -48 12 -11 -60 4 59 -53 -103 19 -19 180 1 -24 -83 53 18 -89 4 -45 23 -98
3208 -98 -55 -6 -48 -46 -67 -12 -5 -31 -90 -8 -54 -79 107 -43 46 61 34 -50 -48 21 38 118 -15 -46 -16 -97 94 52 38 4
3238 4 -20 149 -15 -18 -107 -60 -97 96 -20 61 6 57 -24 167 25 14 -11 -3 -93 59 -12 -76 19 22 9 -84 -148 -2
3266 -2 -16 -87 14 -16 -15 -59 67 -23 -2 6 -1 30 20 12 29 0 -7 -125 3 -77 81 91 -29 -44 28 -15 119 11 -1
3295 -1 -13 45 -18 -163 -23 23 4 42 -11 125 -38 -15 -82 12 13 -64 97 31 3 26 -39 23 167 102 7 35 139 -29
3323 -29 22 -38 8 83 -16 -91 -25 -69 57 -11 68 -97 50 -46 41 -7 -84 95 2 77 42 -74 82 34 17 -87 -23
3350 -23 -27 -20 -44 76 -66 -153 72 -69 -39 -37 36 26 -44 -81 -29 -128 -60 103 142 -96 97 73 37 5 44 -9 -38 69
3378 69 0 -3 32 20 94 -28 54 79 -29 150 123 -50 -35 15 77 14 37 119 26 -7 -114 48 -93 94 81 33 107
3405 107 -24 -17 112 -37 -22 35 54 -4 -104 -16 41 43 -101 19 1 -51 -7 -71 87 -72 34 7 1 -25 18 -29 -78
3432 -78 28 -64 -8 -62 -58 -47 71 -68 12 66 5 66 55 91 -6 60 54 30 81 -105 62 -25 -166 -38 -78 15 71 -36
3460 -36 38 9 8 -25 -22 57 82 -44 77 89 8 67 47 25 89 110 41 87 -76 113 48 -23 -53 78 -23 54 67 78
3488 78 -5 8 83 24 0 34 -13 -15 29 14 82 30 87 -14 -53 -42 -26 33 -36 -36 -65 -29 -33 -99 -26 -20 -76 -22 19 40 -25 128
3520 128 89 -72 -5 -41 -24 -105 1 111 60 63 65 -59 -1 32 -142 -42 -53 -6 51 -52 -70 58 -94 -33 34 54
3546 54 -27 -18 -76 -25 115 -2 107 -59 29 93 -32 -55 57 39 18 -20 -70 92 51 -5 -43 -20 89 -45 52 -5
3572 -5 -61 -15 -186 46 53 87 -22 6 -72 -6 -26 65 -11 -41 -101 13 33 -13 -85 -28 -5 -21 31 6 21 101 -101 3
3600 3 -39 2 -52 19 -77 -62 67 30 109 -19 -55 146 46 90 38 -21 -56 15 61 -57 -115 -32 -8 47 64 -73 77
3627 77 -143 -34 -16 22 67 -98 86 -48 -86 -34 -89 87 -79 -8 -41 -96 28 80 -24 17 -101 55 44 1 46
3652 46 124 119 59 83 -12 -4 7 -78 -31 5 17 78 36 -27 2 -4 9 -7 92 17 -46 -58 -19 -160 54 -40 -2 -16 -79 -80 -137
3683 -137 50 26 -42 -55 22 68 -62 -19 -21 138 38 -22 74 18 17 82 8 -10 -12 62 81 75 88 29 -21 9 52 -15 23 -103
3713 -103 31 1 18 -25 55 -106 -60 -8 56 59 59 -47 37 -40 -21 -18 -75 6 -138 -76 -49 -72 37 -19 -66 4 30 52 -29
3742 -29 38 -9 -23 -23 -139 -68 61 -84 136 12 21 -61 83 -26 88 -47 39 -54 32 60 21 -73 80 -34 56 -64
3768 -64 161 -3 -88 16 -13 -87 10 2 35 -37 -122 -31 80 -81 24 123 23 59 -9 23 -45 15 156 0 40 -20
3794 -20 143 42 35 8 73 7 -51 23 3 16 37 -82 28 -21 -82 -126 33 -22 -27 13 69 72 -98 9 -7 2 -7 84 -20
3823 -20 -27 -58 -46 1 -12 -58 28 30 42 -14 20 28 -39 -89 -36 0 11 -89 54 176 6 -47 -53 3 -7 19 55 157 4
3852 4 69 56 -50 29 -59 95 10 -10 -33 -78 -22 63 96 49 -79 131 50 38 -47 -75 -64 37 -3 95 41 39 -43 75
3880 75 -34 -34 -37 -50 -26 86 20 -60 -146 -59 -113 31 -6 25 -18 -4 78 -67 -17 80 -18 2 -16 -110 25 118 36 -46 72
3909 72 -38 -61 -123 3 50 -79 -1 15 47 -52 44 124 -12 -52 16 46 -80 54 -97 114 27 103 -53 41 78 45
3935 45 83 -24 5 -82 -47 21 -44 -20 -56 -106 77 58 38 -27 38 33 18 -5 54 -46 46 111 -20 -20 39 4 -128 -17
3963 -17 -62 -11 -41 39 -144 -26 41 17 54 -16 -65 27 -67 23 -26 -135 19 110 -3 59 14 -51 52 8 -26 -85 -114
3990 -114 -68 -25 -36 5 -109 -59 -24 -19 -5 -144 31 -100 42 4 44 -21 -44 24 -77 37 57 -109 -33 53 10 -4
4016 -4 58 -35 11 -71 -15 76 26 111 7 106 31 -15 60 -82 -104 -40 4 69 14 33 138 -161 -29 39 -29 87 -2 -58
4044 -58 -49 46 44 23 -82 -8 -14 -46 -16 76 -47 -76 -51 -19 -52 -28 -46 -10 114 -96 7 -57 7 -2 -125 37 46 51 -71
4073 -71 -7 -31 -16 12 -36 8 -34 37 1 -60 14 -126 -66 50 -82 -18 23 28 113 33 1 87 -29 45 107 -32 -2 -29
4101 -29 -77 -43 9 101 13 -77 -28 -144 -1 -20 0 -45 -89 20 18 -29 32 7 46 -28 44 28 85 -5 39 -5 19 76 -31
4130 -31 71 -17 -16 30 121 82 -68 19 25 42 -114 -91 26 -5 21 -67 -48 -51 57 56 -18 -40 128 43 20 23 43 121 -41
4159 -41 -37 32 59 31 -23 83 38 95 62 -103 110 33 -84 -54 -144 -36 -14 91 -73 44 -90 -12 -81 51 111 61
4185 61 58 83 1 21 108 -107 -52 -71 28 -60 9 4 -105 -128 138 38 48 20 -77 78 10 14 -67 -52 -25 -20 62 3 -10 -40
4215 -40 143 -22 107 79 18 89 68 20 -20 -59 -7 -45 -45 -82 -36 24 -6 -46 35 39 -2 15 57 -48 2 -132 -53 -5 -112
4244 -112 -25 105 -102 37 15 -11 17 62 -26 -52 -75 -26 -125 -93 -4 -26 -13 33 -130 -69 110 43 -63 3 -52 137
4270 137 143 -83 -14 -15 24 103 -23 -28 -36 47 -30 81 -11 -65 45 -35 -57 -12 111 -13 -33 -7 229 29 14 17 -4 -21
4298 -21 -34 -11 10 238 -29 -51 76 -73 85 -35 -11 18 -59 -2 -47 -8 33 15 -45 -45 -62 -212 64 17 -20 25 -75
4325 -75 53 22 -84 -79 22 -55 0 -20 -9 -8 107 -49 7 -22 -108 -10 -117 -4 -60 -156 7 -59 4 26 100 -98 51
4352 51 1 13 -73 115 -57 -14 39 65 25 48 -17 20 -62 -69 10 -18 60 115 122 26 49 80 84 94 92 70 -41 6 -19 -55 -121
4383 -121 -122 123 -76 59 -48 61 -31 -41 -118 45 -44 -44 -5 -37 -49 3 -158 -27 83 -62 -30 -98 -24 91 123
4408 123 -77 -87 -76 38 70 -84 101 76 -81 -48 -75 -53 140 -30 -25 77 -179 -86 114 -34 42 4 60 1 -37
4433 -37 -82 -57 50 -69 13 -57 -96 -8 19 -72 -30 -49 74 -28 12 -3 14 -65 112 81 30 -14 1 34 24 -17 -132
4460 -132 7 -26 49 53 -25 11 -88 -81 33 75 4 -6 55 76 -101 -30 -6 -13 20 11 53 -69 -18 -7 -32 46 -83 -113 12
4489 12 23 -91 -25 -44 124 29 24 -29 -43 23 26 -4 35 -29 -60 -98 -21 2 104 3 21 -29 21 -7 98 -47 50 28
4517 28 -63 -28 47 -36 22 -3 -79 -3 -50 24 -8 38 112 0 -29 16 -30 -33 -78 -109 42 25 36 -81 17 114 9 56 -44
4546 -44 -4 8 -4 -19 -51 124 -117 -35 -72 -27 -59 73 -36 0 38 73 50 115 -59 -7 3 -105 -95 -22 4 -29 17
4573 17 -1 -44 -59 18 -34 -48 -48 -2 16 -42 26 -11 15 15 -31 -41 126 -34 -48 -42 -111 -26 3 -59 76 -44 15 -36 41 29
4603 29 -49 27 -32 102 -92 35 -46 30 69 -20 -31 10 -71 57 75 -8 64 34 110 112 23 141 -82 -58 0 -48 -6 107
4631 107 3 -50 -5 -16 -71 26 79 68 65 14 29 -23 -104 -22 -30 -73 -55 15 15 -59 -30 -57 109 24 36 136 -65 7 54
4660 54 21 -72 -49 -2 -32 20 -79 24 -80 57 44 -132 -68 27 -15 -74 19 20 -17 -1 -57 -91 75 41 11 45 -11 4
4688 4 110 69 58 142 -63 -37 -1 -31 -113 96 53 -4 -37 -77 111 -82 28 -99 -44 -43 -26 -58 -57 116 15 -12 -58
4715 -58 -48 21 -32 -69 -98 33 -18 -36 46 -2 76 -133 -6 -28 -26 -12 -59 -160 -47 -73 -128 -71 -69 -80 21 -18 -21 4 79
4744 79 29 -11 63 20 -54 106 78 121 -2 -25 32 35 -29 -30 92 65 -6 33 64 93 17 -105 18 10 57 18 30 -173 -30
4773 -30 -87 137 -87 -39 -9 18 -20 -13 -8 -45 -38 -48 -4 40 72 7 68 -94 -10 -24 -5 -6 66 -22 -79 21 42 92 -72 -94
4803 -94 49 -111 81 -11 1 -18 45 3 -46 -10 103 6 36 -6 39 -10 -39 -34 9 22 -104 9 23 71 -48 76 19
4830 19 50 80 55 2 74 -41 -52 33 -22 73 -104 -18 22 52 33 23 121 -28 -11 -84 15 2 -12 -21 -37 37 -45 53 -20
4859 -20 -50 122 -52 63 -25 -105 -64 -138 65 87 16 -19 32 80 25 -106 13 81 69 42 40 -72 -28 -55 -26 -9 -53
4886 -53 -84 81 -2 -45 -70 6 -18 -21 46 -40 7 -32 76 -91 -40 -25 21 58 44 13 54 -87 57 30 116 -101 39
4913 39 -31 -83 61 -1 -19 -33 -4 24 -109 10 -6 -97 33 28 -96 -105 -32 63 23 -66 -6 -60 -44 -120 -40 -38 -51 -78 38
4942 38 58 184 -67 169 -86 82 -28 -36 98 -42 -34 9 -29 -46 48 25 80 30 5 79 -102 13 -12 9 57 -19
4968 -19 -1 -6 -8 30 31 45 26 -110 -12 13 -46 -19 19 1 -40 -56 -77 -56 -39 12 38 -127 54 -73 -27 103 -60 -16 66
4997 66 129 19 20 -41 8 16 19 -25 57 53 47 10 -6 -68 12 61 -98 57 71 41 -24 108 -145 114 26 6 -68 26 63 -36
5027 -36 -17 -53 88 6 31 59 57 -13 86 -115 12 79 -11 -8 69 35 -53 6 -31 73 -81 -69 37 -86 -59 -101 -94 -135
5055 -135 -86 46 28 -100 94 2 52 -44 21 23 -138 50 75 102 15 -6 20 21 26 -55 18 22 58 -126 32 -15 -69 64
5083 64 47 -19 11 54 -61 108 -35 10 45 64 7 -8 -96 128 21 -61 25 15 47 -39 -15 -39 16 82 -11 7 -44 36
5111 36 75 10 -31 -53 -6 15 -31 -55 -53 -9 57 73 91 34 -13 -41 77 -18 6 -38 63 -11 -37 -61 -96 1 -49 -30 -6 15
5141 15 120 -63 -41 88 -25 -39 116 -70 82 -49 0 -75 -62 -34 42 62 -39 67 -99 73 53 13 26 31 -41
5166 -41 -25 77 33 -64 -80 -108 -31 -26 -75 -22 116 -59 16 -46 -109 12 69 27 -44 -28 33 -125 6 -23 15 19 -55 -45
5194 -45 -6 8 -18 9 82 -89 -41 142 -57 217 -62 -75 95 -116 -25 61 175 112 -21 87 112 0 99 42 -7
5219 -7 137 -48 5 31 105 -131 -68 -2 23 60 -10 74 -125 5 72 4 -79 -74 129 57 34 -30 -41 -23 27 26 39 -34 -13
5248 -13 -46 38 65 -19 162 -51 -47 -27 114 -104 2 -34 -39 -47 -71 69 8 55 -67 -8 -45 -32 47 60 14 -4 -152 -49
5276 -49 122 16 18 -116 -43 71 -86 -39 6 3 22 51 54 -26 11 50 65 18 0 45 38 -21 120 -19 25 -18 -59 117
5304 117 20 6 32 -85 66 52 62 -40 -5 -52 112 -5 -156 -8 45 -23 29 0 -87 48 -57 94 -2 -26 97
5329 97 55 69 29 59 -124 -63 -52 0 75 -44 -64 26 -86 -91 15 -32 0 -49 -80 20 39 -89 73 -74 -55 45
5355 45 19 -10 -152 -172 31 -55 31 -110 -53 -80 -75 23 36 -38 -12 140 -25 -5 2 -66 -64 -1 -23 11 12 63 13 -43 6 116
5385 116 -147 -54 57 34 119 72 69 -22 -142 -18 -12 49 -7 0 -105 -76 54 -59 -51 -50 103 -104 90 -10 -40 29 -24
5412 -24 67 5 -40 -62 -51 123 21 -13 70 49 -24 55 -11 -72 16 51 -38 124 11 82 55 -112 -70 82 153 -122 -36
5439 -36 -64 28 14 14 109 -65 -73 -64 40 -1 120 74 -26 116 -107 -21 -66 4 131 -111 52 84 41 -22 -30 71 -119
5466 -119 84 -27 30 51 -71 139 -34 42 85 -37 62 77 5 109 5 -5 -187 -95 92 -26 21 46 58 99
5490 99 -55 -63 24 2 -27 -112 2 -20 -149 73 14 -6 -173 43 74 -38 -34 118 128 24 52 39 -63 44 -125
5515 -125 -9 40 -124 79 -68 -23 -19 31 -83 105 17 61 -18 124 103 -100 149 22 -17 132 14 -67 54 -28
5539 -28 -109 4 34 -77 -29 22 -62 61 -2 -12 125 4 132 102 40 -7 82 50 5 -55 -28 68 1 50 -121 -8
5565 -8 20 -97 6 70 60 90 8 -21 3 3 23 -110 -5 30 -21 -83 -19 -54 80 48 38 42 -63 40 -35 -88 -24 56
5593 56 -33 69 40 39 -9 -55 -33 37 -71 -5 87 -48 104 88 -108 -80 -2 -39 -100 9 26 54 -65 72 -26 -9 -39
5620 -39 42 -24 33 57 -41 6 -44 -52 -43 119 68 -18 8 36 -81 -57 57 -100 1 68 -25 38 -3 95 55 -22 -90 -32 -34
5649 -34 -33 -54 -101 -32 -70 43 -4 53 -18 -39 -137 -15 58 97 65 -60 -32 -12 14 25 -3 -31 43 40 -59 -44 -150 -14 72
5678 72 -6 11 0 82 39 -2 -28 73 -29 8 -16 -70 -17 60 14 -29 -116 -54 58 73 10 55 5 65 29 59 19 -48 -67
5707 -67 0 -12 61 -32 52 -47 154 12 -55 0 123 -25 -2 27 3 91 0 94 109 -43 -51 -6 -58 -125 -12 -7 46 60
5735 60 -33 90 -85 -68 6 -2 -62 56 37 85 22 -57 1 39 -28 -65 -71 -131 66 -30 -1 -91 -44 -118 -18 16 -19 -4 68
5764 68 10 72 15 91 -35 -109 -18 -47 -31 -10 98 34 83 -11 -39 95 -2 -11 -30 -87 59 76 -49 -179 -1 11 -90
5791 -90 153 62 12 -40 9 -33 10 79 -4 110 36 -130 63 47 20 -78 41 17 105 -17 -77 17 -77 118 50 -67
5817 -67 -25 -100 -48 12 -61 -6 24 5 3 20 -9 45 -35 -55 -2 42 -21 -70 -71 76 -49 76 54 -58 1 3 106 62 -5
5846 -5 2 -114 -93 -79 0 -48 23 -131 3 58 35 9 -69 77 82 -31 59 31 -73 26 40 -68 31 -55 -66 -31 14 7 17
5875 17 40 -14 -50 -80 104 15 96 8 12 93 -88 28 -60 -70 -14 65 15 -21 69 1 -77 6 -1 -15 -29 -88 -46 -18 53 53
5905 53 -30 81 17 -53 -13 78 -2 -11 -72 46 -38 -90 55 -56 -29 -25 47 70 104 -59 30 -1 1 -25 -72 14 57 -84 84
5934 84 -12 -63 -3 52 84 140 24 6 -25 27 -46 -41 -41 -98 -103 128 -2 -7 18 -22 95 -27 -28 23 89 45 -73 -126 35
5963 35 -18 49 30 -74 48 -30 49 4 95 -101 117 -76 -7 43 -90 -77 79 -32 -80 -9 -104 19 28 -64 -11 1
5989 1 -54 34 25 1 44 3 26 76 -22 6 44 78 131 -38 58 74 -37 -18 34 -52 -17 31 -74 -6 3 40 -24 -16 -64 41
6019 41 89 -78 -19 -26 58 145 -32 89 -63 51 30 155 -39 -11 29 -33 -86 -46 -52 -47 54 63 -34 -51 3 32 -15 45
6047 45 1 -41 -5 -6 114 5 -66 45 76 -77 34 -40 154 -23 40 5 4 58 -43 7 -67 100 107 28 -8 33 67
6074 67 -60 -31 -27 -27 -7 -16 89 75 41 -9 -54 4 43 94 71 64 -19 -127 -66 -115 -111 -89 -43 36 -96 32 -82 16 4 -38
6104 -38 -96 34 -125 67 123 61 76 49 -2 -39 -49 -82 5 22 137 -68 50 -41 1 32 -48 8 -58 -53 106 -3 65
6131 65 61 9 -1 -22 -123 25 -81 -120 43 -34 -8 48 -54 46 74 43 -71 -41 -27 3 -55 47 -80 -146 -18 -11
6157 -11 126 29 -67 60 34 -68 -14 27 -12 -26 -4 57 -16 5 123 -60 -28 -71 2 94 -71 64 10 -43 -3 49 73
6184 73 67 50 62 136 1 71 66 -82 -7 -66 -23 27 20 35 -4 0 -23 60 -48 -60 -1 -8 23 -29 135 46 60 69 -36 -14 84
6215 84 5 -8 4 -41 20 96 33 37 29 45 -9 -6 40 24 -95 -19 47 -4 82 -62 72 -37 16 -6 -102 41 41 -72 -14
6244 -14 -133 -34 40 -1 22 -6 83 51 64 -10 -22 3 -30 10 -15 81 -85 2 125 -14 68 -20 55 41 8 28 55 -4
6272 -4 -20 -3 116 33 -35 58 -86 -10 35 -80 -19 64 5 67 -120 42 -54 135 -66 8 88 50 163 -93 0 81
6298 81 29 59 -83 13 -103 74 -48 -145 30 -44 -41 -48 -66 50 -4 -33 54 -33 -65 4 -72 13 -3 112 -20 -110 60
6325 60 -36 47 -20 -34 1 -38 82 29 -31 -36 -14 68 -73 -64 -78 53 57 -159 -92 46 -36 14 33 108 -7 32 -101 -44
6353 -44 25 95 26 -30 -21 -6 -77 71 31 -32 61 47 12 -36 90 -44 -1 67 89 -66 88 -21 -60 67 0 17 -26
6380 -26 -61 57 -115 -2 57 -8 -23 76 58 94 -23 -88 -87 -42 50 -81 -56 59 88 70 8 -22 -7 82 -40 -3 126
6407 126 -51 -60 7 -82 -3 71 5 29 138 8 -9 -55 72 10 54 16 31 70 74 -17 83 -45 145 14 21 19 -17 128
6435 128 -40 -115 -114 -22 -22 -41 -51 -38 -6 -140 88 -64 134 33 19 -31 16 -46 -38 63 1 2 74 -12 -47 -55 33 -41 -48
6464 -48 -36 -98 -86 -14 -23 15 33 6 -53 -64 4 28 30 26 77 16 -81 -65 9 -8 60 -9 -149 -51 40 28 -69 60 64 -112 -9
6495 -9 21 52 -8 32 -14 6 12 -114 -15 7 -84 1 -80 -5 -24 55 -107 7 83 45 -56 20 7 -79 33 -115 -117 151
6523 151 -39 -26 -53 -128 -20 -21 41 -147 13 -35 -9 -58 30 5 27 41 100 -5 -9 58 -30 -35 -59 -45 32 -85 -9 32
6551 32 41 -29 -94 62 82 39 28 8 -54 140 -97 116 -28 8 10 104 6 32 0 -9 -64 -17 -46 -4 71 -4 1 80 99 1
6581 1 -96 78 17 83 -36 1 43 -54 17 18 62 63 1 -92 72 9 -46 -125 50 -64 67 -55 72 45 -24 -11 -64 -29
6609 -29 -29 -115 -23 44 -42 -31 -56 1 64 -53 -4 39 98 1 6 33 102 95 -11 -17 26 84 -107 -48 -8 -81 -79 77 -6 15 3
6640 3 -11 33 19 -4 38 6 -23 45 73 144 -1 -6 -80 -33 116 -74 -69 -16 -29 -85 -55 -31 40 25 -56 19 15 -95 -32 4
6670 4 29 63 56 -44 -92 67 47 137 -33 -84 -110 -73 -77 119 35 2 4 7 -29 -128 49 -10 -99 -61 49 -79 -63 5 -3 -7
6700 -7 37 -11 -74 -34 -30 -34 -50 -6 10 20 -85 -34 -86 46 25 87 -162 -12 67 23 44 -27 -64 -18 32 -31 -7 -21 74 -49
6730 -49 -26 -30 -52 -73 -1 -52 -122 58 25 -49 -70 -15 -104 7 31 69 22 32 -34 -10 73 36 -9 79 1 51 102 -28 119
6759 119 111 -8 18 -103 -51 -8 -58 70 -34 28 23 12 -35 58 20 31 23 107 88 -10 -70 -33 67 -66 -79 95 -38
6786 -38 -51 -66 -56 -20 -42 12 -43 37 59 25 -78 -92 39 61 59 -10 6 92 -21 -31 -70 -21 103 91 -18 -26 34 18 73
6815 73 3 -28 -35 -6 110 -21 58 23 -25 -87 9 28 65 -14 -3 52 -98 -65 -49 70 -12 2 46 -23 35 -26 -11 66 -21
6844 -21 62 -116 -132 32 93 -36 -36 97 21 28 20 -2 43 32 -22 125 -40 106 -4 -11 36 48 -65 -37 -61 95 37
6871 37 -100 -47 10 62 -72 -97 139 -66 -21 -58 21 45 -8 92 -13 86 52 -57 -19 23 108 -52 90 -69 64
6896 64 -42 71 -18 -48 99 -2 36 -104 -62 -77 -4 21 -19 -92 19 14 -51 38 108 -18 25 25 -19 20 -75 45 5
6923 5 42 51 -4 -48 -67 -37 90 105 1 -91 -87 -21 -85 28 96 23 52 -55 56 -82 79 -94 30 -18 -46 -60 -65 19
6951 19 -94 27 -55 39 -14 -73 20 17 67 44 40 100 5 -64 -106 44 -71 0 -82 -131 -65 -63 -20 68 -39 -7 -25 52 -50
6980 -50 -3 52 68 -89 -39 -82 -5 74 9 68 -94 62 -15 -27 -25 -9 18 -10 122 6 110 -27 84 -18 -110 0
7006 0 -35 145 49 -34 -24 30 -13 10 92 0 -47 -78 1 89 142 -80 -9 16 30 5 -11 -47 -15 -47 9 -12 -73 -46 -37 -81
7036 -81 19 -27 6 -9 5 -44 35 103 30 -3 -25 35 -83 12 5 -96 32 186 10 68 28 34 50 -109 -3 1 77 24
7064 24 68 0 -14 49 47 -59 -81 -28 -53 -84 105 94 1 -30 -5 -20 -51 17 -63 -50 -47 1 -72 -63 157 9 31 -57 64
7093 64 23 -40 -3 -20 75 -19 11 -38 0 -9 82 34 108 31 29 -5 -122 78 23 9 -50 -40 -53 21 26 20 -56 -42 34 23 -8
7124 -8 1 -30 -63 -55 -66 -79 26 21 114 46 26 145 -59 7 -31 -48 -15 19 -76 27 40 8 5 72 6 -61 43 -34 12 22
7154 22 -53 47 -56 -97 -47 -58 -79 -2 -141 66 69 -115 29 35 66 26 5 42 -59 6 85 -116 -111 6 28 -8 77
7181 77 -27 -98 -62 -12 28 13 -3 120 -44 -69 47 87 11 28 21 -12 -54 11 102 -44 -69 35 41 -5 66 54 -60 -11
7209 -11 9 33 2 30 24 89 2 -71 26 54 59 6 -39 2 -90 -70 27 -39 146 -130 -3 55 -14 27 85 -53 -49 40 3 -60
7239 -60 -25 -26 -46 33 -192 -94 -31 -78 -33 57 56 -10 -48 42 -90 -63 -88 62 -75 -112 41 17 -6 -104 -108 35 25 15 -75
7268 -75 -13 -21 -112 81 -55 -113 -37 -13 -11 -34 -66 -22 62 55 -86 33 -96 -15 -59 -22 17 -21 5 38 -1 -3 -12 -55 92 -35
7298 -35 -57 -14 111 -50 19 5 108 19 -58 11 14 52 53 -82 -148 40 -67 -19 28 18 -32 31 15 -92 -2 -37 26 -34
7326 -34 -42 17 -68 -2 50 -50 107 -44 66 -73 40 -80 -91 -22 95 -42 114 -17 51 19 34 58 -90 94
7350 94 111 -39 17 26 24 70 -1 -48 -171 30 55 10 37 21 28 -16 -20 22 -58 46 111 57 38 25 -85 -32 107 -3 7
7379 7 59 -19 -26 45 65 23 54 18 47 -20 -5 -3 -55 12 -11 25 43 32 -8 30 25 43 55 -56 20 36 2 -27 -61 33 -37 -36
7411 -36 9 -4 -39 8 0 50 -27 28 13 -1 89 -14 20 -30 -12 32 -35 -12 -9 2 96 -75 -44 129 7 -24 14 -68 42
7440 42 67 3 -96 65 36 71 -130 113 32 -12 -45 -58 69 -35 -26 46 -43 -92 -20 23 96 73 -66 43 73 30 40
7467 40 77 27 -55 112 -12 115 -23 25 19 7 -44 86 -61 -68 -19 9 30 73 95 -65 100 9 47 -28 -60 1 25
7494 25 146 -29 6 -76 -4 -5 76 -147 -21 -84 77 -82 -26 42 -132 -52 22 2 75 2 36 8 33 -1 -25 13 73
7521 73 -31 23 91 58 -53 30 -67 -69 -11 -19 -74 -36 12 46 80 -24 90 -66 -27 -98 -27 -54 0 59 -38 -56 2 -2 -18
7550 -18 101 -15 32 1 -17 34 -21 -6 -54 -36 57 -61 -29 -104 -13 202 14 -78 -57 18 49 36 -39 2 10 41 78 -80
7578 -80 -59 15 104 -51 97 -69 -17 -50 -6 -72 -3 -2 -62 30 38 -35 18 -88 26 26 -1 57 -24 -27 -42 -43 17 59 -153 -64
7608 -64 -22 -129 62 18 105 -97 26 65 0 64 103 -79 -27 -59 -15 78 7 22 22 28 -53 -16 -1 43 56 11 0 68 31
7637 31 0 93 48 109 131 16 51 26 -28 -75 -54 -47 77 -56 117 18 -68 -8 -12 10 3 -52 -65 101 -6 75 -34 -26 -10
7666 -10 -17 17 -30 -41 -35 33 -13 -51 -47 -72 29 -106 31 -8 118 -26 -126 -10 44 127 -93 6 -11 30 118 25 25 -89
7694 -89 51 3 -93 -53 149 -18 14 60 -28 7 1 -45 49 20 -93 24 -31 40 -46 -39 87 -37 -91 21 126 -16
7720 -16 61 -20 -23 25 -180 -58 15 -103 21 19 57 -10 63 -27 -73 -39 95 -72 13 -41 29 99 5 23 72 -55 -30 -8
7748 -8 47 -8 119 -66 -52 -79 18 -15 -16 -25 -42 -86 -2 51 -41 -57 19 -29 63 11 -53 102 16 12 58 -36 -60 -2 -25 83
7778 83 88 -55 -21 -18 -57 62 23 -19 97 -3 118 -7 42 40 -51 -3 -134 -87 -47 9 23 21 81 2 22 0 -84 -63 -44
7807 -44 13 -96 22 14 -58 62 -143 17 57 -1 21 37 -38 81 47 -25 -14 -179 -55 -56 -42 -30 -25 -60 -59 -88 125 -34
7835 -34 -115 4 -39 53 141 -1 -66 85 -152 -23 -79 65 19 -19 -12 25 21 -18 5 20 -15 16 -160 -32 -43 -64 -91
7862 -91 18 120 36 10 -53 123 -60 -63 -2 -49 17 -10 -12 36 -113 19 17 -5 26 -37 -59 20 -13 -62 -28 -26 -50 -73 26
7891 26 -42 -43 -102 14 17 21 100 60 27 25 14 -85 35 -52 -35 55 45 -116 17 89 87 -108 -5 26 81 27 -41 -113 -145 -39
7921 -39 48 -76 130 -11 -52 4 -44 49 6 -62 49 -28 -19 8 74 -90 -51 -19 -106 58 -20 35 -82 29 16 -43 69
7948 69 29 129 -98 -81 13 -6 20 -68 -4 -26 -75 -15 54 -6 32 -71 -74 147 -39 -65 -96 -23 -83 90 -66 64 56
7975 56 -96 43 -74 78 47 -65 -25 -70 -64 -130 67 160 -89 52 84 -105 70 53 10 2 26 -27 9 -92 5 1
8001 1 -6 100 49 55 31 -64 -24 49 39 -39 -50 -47 -65 73 -64 -14 80 -26 -2 -44 34 46 -62 7 78 -41 -6 48 57 6
8031 6 82 50 3 134 63 66 42 -36 -71 72 18 48 72 42 11 48 -15 9 24 21 5 -60 -1 9 20 69 30 50 -29 -46 -26
8062 -26 106 28 -129 -16 -11 65 -18 -18 -16 -76 -7 2 44 -15 65 -8 -68 27 56 -26 -102 71 58 -46 114 -45 -37 -77 -32
8091 -32 37 -84 45 -18 1 -53 -79 -17 66 -141 13 34 -22 103 -87 84 44 -74 -11 -2 -48 57 108 119 108 35
8117 35 -2 105 2 49 -1 -83 -39 -61 -104 -36 71 -79 111 -7 16 -3 -64 76 80 41 -20 -92 41 -43 55 62 -73
8144 -73 67 48 61 -27 3 -24 11 -124 -43 -5 90 99 80 24 -136 19 40 102 -138 -54 -30 -39 -25 -24 -91 -44 -17 -20 -2 -55
8174 -55 16 21 -46 -33 14 -99 -17 19 58 -8 86 6 -60 -10 2 -79 86
8191H6
##END NTUPLES=NMR FID
##END=
