##TITLE=1H_DE-80H_X3
 200.13MHz, d2o
 8 sc
 
 19ns.26.2.2025
##JCAMPDX= 6.0         $$ Bruker NMR JCAMP-DX V2.0
##DATA TYPE= NMR FID
##DATA CLASS= NTUPLES
##ORIGIN= UXNMR, Bruker Analytische Messtechnik GmbH
##OWNER= pz
$$ XWIN-NMR		Version 3.5
$$ Thu May 29 12:38:15 2025 Russian Standard Time (UT+4h)  Yarkov@DPX200
##.OBSERVE FREQUENCY= 200.1313
##.OBSERVE NUCLEUS= ^1H
##.DELAY= (6, 6)
##.ACQUISITION MODE= SIMULTANEOUS
##.ACQUISITION SCHEME= undefined
##.AVERAGES= 8
##.DIGITISER RES= 18
##SPECTROMETER/DATA SYSTEM= spect
##.PULSE SEQUENCE= zg30
##.SOLVENT NAME= CDCl3
##.SHIFT REFERENCE= (INTERNAL, CDCl3, 0, 14.3821)
##AUDIT TRAIL= $$ (NUMBER, WHEN, WHO, WHERE, WHAT)
$$ ##TITLE= Audit trail, XWIN-NMR		Version 3.5
$$ ##JCAMPDX= 5.01
$$ ##ORIGIN= Bruker BioSpin GmbH
$$ ##OWNER= Yarkov
$$ C:/Bruker/XWIN-NMR/data/yarkov2/nmr/H-C/1/audita.txt
$$ ##AUDIT TRAIL=  $$ (NUMBER, WHEN, WHO, WHERE, WHAT)
(   1,<2025-05-29 12:36:10.81 +0400>,<Yarkov>,<DPX200>,
      <created by zg, POWCHK disabled, PULCHK disabled
       configuration hash MD5:
       00 E9 B6 7A A2 85 ED C7 34 08 36 98 17 FE 4E 26
       data hash MD5: 16K
       0A 5B 83 B0 DA 6F BF CD 96 EF DE F7 C2 B3 17 8D>)
$$ ##END=
$$ 
$$ hash MD5
$$ FC 4C 20 56 61 88 24 78 67 B5 80 5B 09 E1 48 94
##$RELAX= 
##$RELAX= 
##$RELAX= 
##$RELAX= 
##$RELAX= 
##$RELAX= 
$$ Bruker specific parameters
$$ --------------------------
##$DU= <C:/Bruker/XWIN-NMR>
##$EXPNO= 1
##$NAME= <H-C>
##$PROCNO= 1
##$TYPE= <nmr>
##$USER= <yarkov2>
##$AMP= (0..31)
100 100 100 100 100 100 100 100 100 100 100 100 100 100 100 100 100 100 
100 100 100 100 100 100 100 100 100 100 100 100 100 100 
##$AQSEQ= 0
##$AQ_mod= 1
##$AUNM= <au_zg>
##$AUTOPOS= <>
##$BF1= 200.13
##$BF2= 200.13
##$BF3= 200.13
##$BF4= 200.13
##$BF5= 200.13
##$BF6= 200.13
##$BF7= 200.13
##$BF8= 200.13
##$BYTORDA= 1
##$CFDGTYP= 0
##$CFRGTYP= 5
##$CHEMSTR= <none>
##$CNST= (0..31)
1 1 145 1 1 1 1 1 1 1 1 1 1 1 1 1 1 1 1 1 1 1 1 1 1 1 1 1 1 1 1 1 
##$CPDPRG= <>
##$CPDPRG1= <>
##$CPDPRG2= <>
##$CPDPRG3= <>
##$CPDPRG4= <mlev>
##$CPDPRG5= <mlev>
##$CPDPRG6= <mlev>
##$CPDPRG7= <mlev>
##$CPDPRG8= <mlev>
##$CPDPRGB= <>
##$CPDPRGT= <>
##$D= (0..31)
0 0.7 0 0 0 0 0 0 0 0 0 0.03 0 0 0 0 0 0 0 0 0 0 0 0 0 0 0 0 0 0 0 0 
##$DATE= 1748507770
##$DBL= (0..7)
120 120 120 120 120 120 120 120 
##$DBP= (0..7)
150 150 150 150 150 150 150 150 
##$DBP07= 0
##$DBPNAM0= <>
##$DBPNAM1= <>
##$DBPNAM2= <>
##$DBPNAM3= <>
##$DBPNAM4= <>
##$DBPNAM5= <>
##$DBPNAM6= <>
##$DBPNAM7= <>
##$DBPOAL= (0..7)
0.5 0.5 0.5 0.5 0.5 0.5 0.5 0.5 
##$DBPOFFS= (0..7)
0 0 0 0 0 0 0 0 
##$DE= 6
##$DECBNUC= <off>
##$DECIM= 32
##$DECNUC= <off>
##$DECSTAT= 4
##$DIGMOD= 1
##$DIGTYP= 9
##$DL= (0..7)
0 120 120 120 120 120 120 120 
##$DP= (0..7)
150 150 150 150 150 150 150 150 
##$DP07= 0
##$DPNAME0= <>
##$DPNAME1= <>
##$DPNAME2= <>
##$DPNAME3= <>
##$DPNAME4= <>
##$DPNAME5= <>
##$DPNAME6= <>
##$DPNAME7= <>
##$DPOAL= (0..7)
0.5 0.5 0.5 0.5 0.5 0.5 0.5 0.5 
##$DPOFFS= (0..7)
0 0 0 0 0 0 0 0 
##$DQDMODE= 0
##$DR= 18
##$DS= 0
$$ [...]
##$SUBNAM2= <"">
##$SUBNAM3= <"">
##$SUBNAM4= <"">
##$SUBNAM5= <"">
##$SUBNAM6= <"">
##$SUBNAM7= <"">
##$SUBNAM8= <"">
##$SUBNAM9= <"">
##$SW= 18.0517328524113
##$SWIBOX= (0..15)
0 0 2 0 0 0 0 0 0 0 0 0 0 0 0 0 
##$SW_h= 3612.71676300578
##$TD= 16384
##$TD0= 1
##$TE= 0
##$TE2= 300
##$TE3= 300
##$TEG= 300
##$TL= (0..7)
0 120 120 120 120 120 120 120 
##$TP= (0..7)
150 150 150 150 150 150 150 150 
##$TP07= 0
##$TPNAME0= <>
##$TPNAME1= <>
##$TPNAME2= <>
##$TPNAME3= <>
##$TPNAME4= <>
##$TPNAME5= <>
##$TPNAME6= <>
##$TPNAME7= <>
##$TPOAL= (0..7)
0.5 0.5 0.5 0.5 0.5 0.5 0.5 0.5 
##$TPOFFS= (0..7)
0 0 0 0 0 0 0 0 
##$TUNHIN= 0
##$TUNHOUT= 0
##$TUNXOUT= 0
##$USERA1= <user>
##$USERA2= <user>
##$USERA3= <user>
##$USERA4= <user>
##$USERA5= <user>
##$V9= 5
##$VALIST= <valist>
##$VCLIST= <CCCCCCCCCCCCCCC>
##$VD= 0
##$VDLIST= <DDDDDDDDDDDDDDD>
##$VPLIST= <PPPPPPPPPPPPPPP>
##$VTLIST= <TTTTTTTTTTTTTTT>
##$WBST= 1024
##$WBSW= 4
##$XGAIN= (0..3)
0 0 0 0 
##$XL= 0
##$YL= 0
##$YMAX_a= 288286
##$YMIN_a= -187727
##$ZGOPTNS= <>
##$ZL1= 120
##$ZL2= 120
##$ZL3= 120
##$ZL4= 120
##$ABSF1= 10
##$ABSF2= 0
##$ABSG= 5
##$ABSL= 3
##$ALPHA= 0
##$AQORDER= 0
##$ASSFAC= 0
##$ASSFACI= 0
##$ASSFACX= 0
##$ASSWID= 0
##$AUNMP= <proc_1d>
##$AZFE= 0.1
##$AZFW= 0.1
##$BCFW= 1
##$BC_mod= 2
##$BYTORDP= 1
##$COROFFS= 0
##$CY= 83.5205535888672
##$DATMOD= 1
##$DC= 2
##$DFILT= <>
##$DTYPP= 0
##$F1P= 10.8118882576601
##$F2P= -7.23987719738617
##$FCOR= 0.5
##$FTSIZE= 0
##$FT_mod= 4
##$GAMMA= 1
##$GB= 0.15
##$INTBC= 1
##$INTSCL= 1
##$ISEN= 128
##$LB= 0.25
##$LEV0= 0
##$LPBIN= 0
##$MAXI= 10000
##$MC2= 0
##$MEAN= 0
##$ME_mod= 0
##$MI= 1.114404
##$NCOEF= 0
##$NC_proc= 0
##$NLEV= 6
##$NOISF1= 3.799351
##$NOISF2= 2.8
##$NSP= 1
##$NTH_PI= 0
##$NZP= 0
##$OFFSET= 14.38212
##$PC= 1
##$PHC0= -1708.697
##$PHC1= 8.766559
##$PH_mod= 1
##$PKNL= yes
##$PPARMOD= 0
##$PSCAL= 0
##$PSIGN= 0
##$REVERSE= no
##$SF= 200.129724274929
##$SI= 16384
##$SIGF1= 3
##$SIGF2= 2
##$SINO= 400
##$SIOLD= 16384
##$SREGLST= <1H.CDCl3>
##$SSB= 0
##$STSI= 0
##$STSR= 0
##$SW_p= 3205.1282051282
##$SYMM= 0
##$S_DEV= 0
##$TDeff= 0
##$TDoff= 0
##$TI= <>
##$TILT= no
##$TM1= 0
##$TM2= 0
##$TOPLEV= 0
##$USERP1= <user>
##$USERP2= <user>
##$USERP3= <user>
##$USERP4= <user>
##$USERP5= <user>
##$WDW= 1
##$XDIM= 8192
##$YMAX_p= 0
##$YMIN_p= 0
$$ End of Bruker specific parameters
$$ ---------------------------------
##NTUPLES= NMR FID
##VAR_NAME=  TIME,          FID/REAL,        FID/IMAG
##SYMBOL=    X,             R,               I
##VAR_TYPE=  INDEPENDENT,   DEPENDENT,       DEPENDENT
##VAR_FORM=  AFFN,          ASDF,            ASDF
##VAR_DIM=   8192,          8192,            8192
##UNITS=     SECONDS,       ARBITRARY UNITS, ARBITRARY UNITS
##FACTOR=    0.0002768,     1,               1
##FIRST=     0,             0,               0
##LAST=      2.2672688,     0,               0
##MIN=       0,             -187727,         0
##MAX=       2.2672688,     288286,          0
$$ Real data points
##PAGE= N=1
##DATA TABLE= (X++(R..R)), XYDATA
$$ [...]
1274D46m54J390j794J04R35j669P57L37j324J602m32r90J973j075m48J545j471
1291e68N43P07j527J367p6j316J470n23q86J453j218j18J059j717Q70O60j486
1308a306J387K31r28J787n78k67J583j324K00R46j802L38M20j825R42m06q70J366
1326a06n97k54J663r87M19J133j305P70K40j386J216p28j183J265j124m16J328
1343e2j279N41R63j296J453M42j157J588k66q68J409j133l61R80j855N22O32j582
1361a319J156O4r28J915o00l14J743j227P3Q81j529M72Q9j625R63k52j109J424
1379a23o66n12J437r57O17R18j185J147L48j405J259l14j084J243j196l52R95
1396A70j556O28Q90j319J306N14q38J407k18n47J376j128k94R51j543L9L34j394
$$ y = [446, -8, 1382, -412, -308, 627, -1042, -285, 52, -1272, 330, -102, -1092, 881, -194, -642, 903, -568, -25, 682, -845, 522, 446, -870, 600, 77, -809, 644, -574, -692, 367, -1350, -480, 180, -1306, 81, 312, -616, 1171, 593, 326, 1909, 585, 785, 1731, -71, 267, 687, -1138, -196, -602, -1472, -106, -703, -957, 706, -281, 138, 1271, -34, 736, 976, -410, 806, 78, -1105, 160, -964, -1380, -52, -1331, -790, 173, -1123, 330, 772, -385, 1203, 937, 69, 1478, 345, -16, 964, -891, -369, 263, -1319, -163, -99, -1027, 888, 288, -26, 1717, 490, 563, 1444, -85, 387, 476, -1149, -186, -438, -1547, -123, -789, -1301, 136, -821, -204, 714, -471, 676, 1024, -381, 878, 564, -520, 723, -473, -825, 170, -1386, -758, 132, -1187, 119, 633, -205, 1202, 984, 437, 1813, 685, 391, 1342, -201, -162, 172, -1222]
1414a222J002k52r54J349o69k43J451r23J98J051j047Q97L25j131J036j58j188
1431d78J238j030p00J136j233K84P85j076Q54M93q50J325k13o56J044r70l11J051
1449F93j173K82J029j351R93L21j122J124p89o43J050j036j73R58j034P50P32
1466F11r27J322l6r96J118q18r88P78j095k01R04j133R22P08q73J255L63p77J071
1485A208q17l06Q26j438O8Q29j259O83O57r39J237l31n86J045r00k64R08j105
1503d84J60O18j085P33J56o54J024l34o87J059r47j04Q31j116P10P86j254J166
1521E78J07q27J002m19m70Q53j197o7N88j249K90L90q89J093K75m24J341n32m0
1540D03J103r90%M45j219L54Qj245Q42k16o67J425p16J54J020q66L37N91j098
$$ y = [-1222, -220, -472, -1426, -77, -746, -989, 462, -461, -263, 788, -259, 638, 963, -168, 868, 710, -478, 760, -270, -970, 166, -1067, -783, 2, -1074, -220, 273, -577, 748, 535, -121, 923, -47, -358, 693, -480, -198, 831, -520, 473, 794, -328, 796, 7, -636, 414, -622, -795, 163, -871, -121, 611, -316, 1006, 970, -26, 1092, 274, -714, 64, -1031, -1232, -328, -1461, -539, 169, -704, 551, 914, 137, 1208, 391, 85, 911, -527, -459, 370, -889, -206, 451, -488, 749, 418, -168, 877, -23, -287, 621, -484, -324, 294, -791, -58, 98, -556, 468, 134, -553, 506, -441, -545, 286, -830, -120, 666, -588, 578, 685, -142, 860, 441, -29, 824, -373, -440, 148, -1101, -811, -421, -1310, -217, 58, -366, 975, 443, 403, 1506, 516, 516, 961, -258, 96, 104, -1141, -299, -515, -1182, 243, -473, -319, 701, -165, 172, 763, -335]
1559c35P69N8r88J080n47m73Q92p64J3P79j044M27M12j160P60J73n71J024k29
1578B76k20J034q58q0Q13j047K45K20j056O90l49p55R39n07l20J153n37K36Q52
1597G29q81P32K87j032J005l58p59Q20q45m28Q10q21M23P37r18R27L53r22Q47
1616G06j59n63O18p95l82P25j097L79O39q59Q22K33n50R71m53m20Q89p91r5Q47
1636F65r36N40K13j072P35q0r12J017m89m26R34p64K00O90n82O77M36o94P70j76
1656G46r05M62n99l52Q06r99K81O31q78N42M46p45J039k41l67R47p53j42Q13q66
1676a34J72L34o96M60q0r06Q30l56m31R86o28K97P58o99M04N40q67P20k18p74
1696b88O28m48o15O87o06J22O65n30N25L32p56P86j41n38P65p99k93Q03r47K41
$$ y = [-335, 434, 492, -496, 584, 37, -436, 456, -308, -295, 484, -560, -133, 279, -881, -121, 52, -519, 505, 276, 56, 1090, 232, 152, 965, -82, 163, 383, -673, 17, -332, -1087, -148, -655, -975, 178, -359, -123, 729, -152, 580, 867, -165, 840, 482, -277, 543, -302, -730, 80, -741, -318, 419, -499, 428, 781, -141, 706, 547, -16, 602, -193, -575, 150, -947, -568, 71, -788, 34, 267, -283, 688, 235, -185, 704, -87, -182, 665, -271, 269, 482, -590, 145, 65, -847, 170, -319, -745, 189, -575, -375, 315, -267, 410, 846, 152, 922, 746, -159, 303, -296, -648, 158, -841, -560, 71, -807, -265, 181, -564, 475, 234, -133, 814, 61, -81, 732, -134, 38, 372, -324, 136, 56, -850, -20, -376, -807, 179, -449, -152, 606, -93, 311, 851, -16, 704, 486, -288, 340, -108, -723, -36, -642, -520, 145, -385, 140, 472, -284, 502, 361, -177, 588, -211, -504, 299, -648, -407]
1716d07N26q02P33L32m94Q54j63n21P07p52k77O87j028K06L95j019P61J26m81
1735f17J097j81k06Q48o58j57N79j044N8M41q51N87J25o09R34l19j61Q12r05P5
1755a52M72j021L53L23q07R23P5k65J029l83k80P29q68j35J54j055J91J20p81
1774a378R47J70j66J215n9n3Q17j041R4l5j113K90k47o76Q55j68pR82j19K4P76
1795A108q35K78j5q38K80k09p36Q80l94k74R99n44L57P01o56M50J95r34N50j66
1815A97p17P02n05k97Q22o58L00M83o69O86N3o04O23m83n35O54k99o7P34n66M13
1836B67N70p56L93L3q16M50n08m65N39n47O3Q53m35N78O72m56O36j63p87M53p07
1857a33n39N97p54J09O27o28N63M11m54P56k2m68O25n11m45M82o82L05O41q28
$$ y = [-407, 119, -683, 50, 382, -112, 742, 579, 58, 765, 13, -264, 423, -605, -399, -4, -1023, -262, -136, -617, 480, 299, 93, 941, 283, 126, 705, -339, -281, 160, -691, -104, 21, -588, 346, 27, -134, 678, -227, -152, 320, -701, -348, -25, -832, 91, 166, -99, 930, 547, 267, 996, 128, -7, 147, -908, -717, -597, -1378, -431, -261, -427, 788, 729, 676, 1493, 452, 546, 511, -602, -312, -559, -1235, -380, -548, -555, 427, 308, 332, 1108, 273, 551, 536, -302, -22, -231, -967, -87, -481, -755, 244, -300, 57, 758, 102, 552, 747, -187, 363, 197, -520, 182, -323, -620, 202, -456, -156, 327, -342, 344, 397, -207, 416, -67, -602, 52, -247, -314, 420, -146, 267, 837, 81, 474, 507, -309, 141, -367, -832, -293, -840, -777, 76, -359, 219, 891, 435, 1071, 908, 121, 574, -133, -672, -75, -829, -720, -93, -721, -158, 253, -201, 555, 533, 65, 690, 179, -266, 216, -466, -161, 480, -348]
1877c48L82L49p32N48j9l96O43n40o0M73p52J12N30p28P08R8n07P85k76m94O21
1898C97m11k96P74q22K35K25o38M86M9l05P62k41k40N08p21p8N06p62L32M16o27
1919d51P22N5n64P89l60l6O69q82K9K81q45K61J63m86Q78n8l81P59m40k09N50
1940D44p15J79L95n58M39J17o44N46k64l82Q22o08p3N20p67K98L19m27N86nk55
1961c3O40m26l22N75p36R5N61o27K72L01p65N03j19m14P76k18j17M05o06K3K97
1982F5m76N42K61m83O00j17m89N71n68j98O30o23J84L62q13M44N9m43P74J0k95
2003cO56n52k16K93o49K73L41o36O47Rn02O48k02j75P81m57j47K31o14k6n5m77
2025h32O17K30j34Q22m14k52N95o32k9M70o57L03j8o75M71k47k28P73k40pN43
$$ y = [-348, 34, 383, -349, 199, 180, -216, 427, -113, -173, 300, -452, -340, 190, -538, 170, 268, -239, 546, 270, -224, 397, -14, -310, 464, -358, -123, 102, -536, -50, -1, -306, 456, 215, -25, 483, -238, -316, 190, -572, -240, 176, -451, 271, 326, -238, 551, 191, 155, 824, -58, -29, 252, -593, -332, -169, -655, 223, 165, -216, 543, 103, -106, 444, -271, -92, 303, -255, 184, 301, -343, 203, -61, -443, 379, -229, -302, 218, -549, -251, 68, -359, 227, 222, -33, 607, 181, -141, 434, -302, -207, 354, -273, -1, 300, -465, 38, -81, -495, 281, 63, -54, 351, -255, -232, 65, -411, 131, 392, -91, 509, 392, -97, 474, -94, -292, 338, -285, -101, 261, -552, -108, -49, -492, 282, 292, -3, 653, 101, -115, 178, -471, -198, 143, -493, 154, 163, -339, 309, 107, -68, 713, 256, 109, 340, -274, -300, -355, -832, -215, 15, -119, 703, 289, 37, 632, 0, -29, 441, -216, 87, 69, -606, -135, -382, -610, 163, -77, -84, 459]
2046D59o80J13J68m85M56K31k48M80o5m93M13l79k16M58n30J90K13q45N83Ol61
2067e32P48L5r1O38o88Q1J52o46J67L00m93M26q4o14O25l31k30P54k19J86N29
2088G13o32K22L1l73L42k15l29N02m30m25L77o48L69N59l29N91L63n17N17k72
2108D16m58O04p00N2K68q66JQ6l66N40M13o1Q88j39m50N02n82n9L92p03K71N1
2130A00o88K69m1l18P30j76P1N40o30P7L06p08N11L63l35N81m2n65M42o24k48
2151c85L16l98R3L74n45L62n5k41P29oO5N76m66j92J92p24J31K52m30M25K9o43
2173e41L76k92j59O90k28K49O32m92J52N2n23L08j62k49J72k41k19L11l66J91
2193c39O51l29N92n9l97R7k18n46M45l46J48N51m35J81K24l98L32J90m56N42l09
$$ y = [459, -221, -108, 60, -425, 31, 262, 14, 494, 429, -64, 349, -30, -246, 212, -318, -128, 85, -760, -177, -171, -532, 216, 251, 160, 798, 110, 191, 343, -303, -136, 164, -329, 97, 13, -601, 24, -307, -537, 217, -2, 184, 713, 81, 303, 334, -39, 303, 88, -241, 261, -169, -594, -217, -865, -496, 63, -266, 325, 688, 171, 688, 416, -42, 562, -138, -86, 182, -684, -683, -597, -963, -423, -10, -71, 817, 678, 228, 730, 148, 89, 481, -222, 49, 100, -588, -319, -360, -678, 52, -124, -53, 487, -143, -66, 240, -468, 43, 406, 71, 652, 610, 45, 487, -137, -385, -69, -467, -374, 0, -545, -183, -238, -479, 250, 244, 309, 885, 419, 227, 419, -305, -174, 78, -352, 73, 102, -541, -165, -457, -616, 74, -154, 95, 727, 235, 387, 439, -84, 224, 62, -187, -15, -256, -475, -164, -530, -339, 312, -17, 575, 516, 119, 216, -2, -548, -103, -449, -301, 250, -185, -4, 220, -178, 154, 344, -112, 430, 121]
2214A21m27K58l64k9N12k34L51L22o17K38l02n07N96j17l5O62l48l3L75n57J80
2235D5K56l46L56r5n13M65l27k13M14k43J81M94o31J83p1m97N71M5j67N37j43
2256C01k36L16n44L6P2m08M48O4m83L94j54j63N83j15J11M42m60K0J32q55L33
2277a66N9l16N98j98m4M38o06P3M02l21J67K99m55K12j10o07N75k33j88P02m72
2298a91J67K78o05L50K67l56N29j87k70L09m52j85N29m13K53M18o42K26M4n35
2318d66M28j20k83O23j23p1M49m23K70K15m85K56M8o46L55m17k25L10j60J63O45
2339C43l63L58Nl15M32k19k48L82l30l51L49m57J0L70l67L56K34m84M76j11l12
2360b42N10k86p7M73m83J92J13m98K60J04k83M67j34j48L89m82q0K88m36L9L69
$$ y = [121, -306, -48, -412, -441, 71, -163, 188, 510, -107, 131, -171, -678, -82, -199, -234, 428, 80, 47, 422, -135, 45, 301, -45, 311, 216, -297, 168, -159, -372, 42, -201, -20, 474, -157, 26, -45, -542, 29, 74, -93, 444, 301, 65, 381, -163, -127, -55, -463, -15, 49, -434, -40, -194, -357, 226, 111, 222, 664, 204, 224, 356, -499, -166, -107, -423, 175, -23, -67, 371, -235, -162, 240, -81, 86, 385, -70, 142, 32, -575, 0, -233, -421, 281, -191, -24, 254, -351, -1, 266, -90, 439, 252, -18, 291, -161, -346, 183, -230, 23, 441, -201, 25, 69, -466, -38, -158, -441, 182, 59, -12, 437, 14, 284, 499, 14, 270, 318, -328, 27, -390, -615, -305, -465, -302, 343, -20, 338, 343, 28, 460, 241, -7, 375, 45, -306, 43, -414, -404, -34, -401, -45, 189, -295, 181, 70, -242, 268, -18, -95, 378, -105, 87, 200, -298, -38, 66, -217, 250, 116, -32, 357, -125, -205, 83, -353, -314, 55]
2381E5l88M54J43l22M31j95j45M16m32j04J69m60O2L00l26L61J10o9L61k44j95
2402a8K27m09P2J12m38L71J11k87M03m7k5M48k35j73K88n51m6J97m84L50M5k25
2424c14M27j19r4M17k68q7L45l67O9M0k90K35k1k68N49j77l8K96k60j7K99m80
2446a23J04R3m32K76M3j58M59k17k20N55j97J9J26m63K15Q2n41K87j72j40N01
2467I7k12R6L89k99j1J54l40K02R0m19L25l8l01M98j99j03L49m17L9K06m05J88
2489a11O4l21M36j83O8L23l79J19J88l78K36R0l46K50j39j46L32o4j27M31l70
2510b7RK15l92K59p9l10K36J3j12L70j61j25K09j17j0K98l96J55J33l75L40j32
2532Aj47L26k09j11L30l92K47j3l70M26M5k52L23n7j88K28k04qR8j60J59J41l60
$$ y = [55, -333, 121, 264, -58, 373, 178, 33, 449, 17, -87, 82, -378, -316, -16, -342, 19, 129, 60, 421, 177, -18, 209, -200, -128, -16, -454, -83, 28, -259, 144, 97, 72, 520, 285, 112, 400, -151, -197, 0, -484, -134, -89, -314, 113, -6, -100, 317, 49, -38, 307, -60, 9, 49, -241, -6, -27, -295, 254, 77, 39, 335, 75, 58, 357, -123, -19, 74, -358, -82, -39, -197, 262, 45, -175, 380, 183, 202, 328, -135, 80, 162, -379, -92, -264, -404, 97, -115, -19, 370, 71, 60, 214, -126, 76, 166, -253, 72, 34, -267, 231, 32, -71, 278, -139, -100, 106, -299, -111, -47, -368, 68, -115, -47, 276, -103, 16, 204, -174, 62, 152, -194, 56, -83, -229, 103, 39, -88, 343, -27, -18, 197, -195, 64, -15, -325, -89, -76, -188, 182, 21, -104, 105, -12, -22, 276, -120, 35, 168, -207, 133, 1, -146, 180, -29, -140, 190, -202, 45, 32, -338, 88, 133, -119, 204, 147, -41, 187, -17, -25, 73, -87, 72, 213, -147]
2555a47R9J70k54L35k32j08M94n19J39K82l84J20O2k11K32M2j67K16k19J5J81
2576A46l11J20J68m05J74Q1k86L21K7k08M01j24j06J92k23oJ68l30K35J58l49
2597a57L39k13j42K68k31K5J05k70J91P5k25K38L6q9M32k16j0K03l99n8R0k52
2619b60J83k1j60O1J24k47L94j41j6K12j40L8J68k72K02P0l90J67Lj64J54m7q5
2642a67K41k01K68J73l04J58o2k40K11j55j68L75j73M7O0j39J04J35l14J15J86
2663A50k14J72k27j25K56k08J40K94k69L47j77m99L01p7j29L22j59L3J46j12P4
2684C9K38k50K16N6l67J33r2m01K86j07j1M02j77J40J91l81K19l3j91K93j53r9
2706d9K18j83j86K37j87K47pj52J56k58J4K3L5k7K82n7j24K56l24J45J64l91J94
$$ y = [-147, -48, 122, -132, 203, -29, -137, 357, -162, -23, 259, -125, -5, 57, -154, 78, 120, -47, 169, -50, -35, 146, -165, -45, 123, -282, -108, -27, -313, 8, 35, -173, 228, 104, -2, 190, -33, -39, 129, -201, 34, 192, -157, 182, -31, -173, 95, -136, -111, -6, -276, -85, -10, -235, 3, 39, -50, 382, 166, 156, 359, -40, -98, -8, -260, -77, -98, -258, -197, -73, -320, 74, -67, -83, 129, -11, 27, 195, -77, 125, 195, -195, -28, -25, -189, -35, -82, -167, 74, -127, 141, 314, 10, 168, 106, -134, 77, -78, -246, 129, -44, 3, 63, -76, 28, 163, -151, -36, 150, -64, 108, -119, -244, 12, -196, -56, 238, -31, 316, 139, -360, -59, -136, -265, 57, -102, -69, 77, -35, 39, 277, 27, 243, 299, -68, 65, -27, -428, -142, -249, -260, 142, -35, 105, 296, -85, 134, 101, -90, 203, 50, -49, 169, -14, -200, 37, -150, 97, 90, -62, 94, -164, -150, -127, -92, -119, 163, 106, -18, 238, -86, 59, 223, -168, 26]
2729B6%j23J92r7j63L10l53R9J93j83R9M3k75L83j27o0K83p8j64K77l16l4P3k22
2753b17K16l8j75L48n1j81K13j23pK77l83J24j5j06J81j03q8L56k06j7K11k31
2775a5j10K02j37j20R3M1K13j01j06J61k27j8L20j60j45K06k02J31J1j70K86r3
2797F0j06K73j64k8K1o7j13Q3j66J30K0p8J38j73M2L09r8j5J01j01j18R7j34O0
2821b7K6r4K67k17k4J14j81M8J69j77K20pl36L07J6n7J79k07L1J13j98r1J60k46
2845b12P5M8j15K93n4j42J93p6p8J88m2o2M7k05J72J16j97K01j50o9K19k90j2
2868a52K4j16J82J55j74J19Q5j16R3j21n9K06k01O4J17k69K17l3j77K83j4k31
2890a18J95m6j46J21j25n3K47j75J15R1j27L5j13k9J80KM9J22k64L4o0q5J25J12
$$ y = [26, 26, -97, 95, -2, -165, 145, -208, -109, 84, -99, 0, 43, -232, 151, 24, -36, 247, 169, 5, 282, -34, -68, 5, -217, -1, -39, -214, 134, 83, -98, 115, -8, -15, 262, -121, 3, -12, -118, 63, -40, -128, 228, 22, 5, 216, -15, -125, 77, -60, -180, -87, -46, 167, 66, -40, 121, -106, -124, 196, 36, -109, 97, -105, 26, 37, -133, 153, 60, -46, 227, 63, 35, 56, -11, -124, -41, -207, -77, -57, -135, 3, -170, -128, 181, 83, 68, 169, 68, -50, 47, -87, -27, -1, -95, 172, -45, -69, 45, -136, -88, 81, -96, 124, 117, -219, 88, 104, 47, 226, 19, 50, 163, -35, -126, 34, -212, -137, -89, -204, 89, 35, -107, 86, 10, -68, 120, 78, 16, 63, -142, 30, 146, -51, 150, 0, -69, 150, -140, -152, -128, -244, -62, 93, -81, 38, 123, 7, 100, -21, -80, 126, -75, -11, 106, -163, 54, 21, -156, 127, 113, -118, 77, 31, -115, 6, -119, -172, 75, -100, 15, 106, -21, 14, -99, -128, 52, 54, 103, 225, -39, -5, -65, -150, -25, 87]
2914H7j91M2L3k32K68j67J59P9j16K5J87k07j2J32k87L00j7j85J62j46l8K06k67
2937a85K00j5q6K22j66j19K49k08K2J18l6J8J63k27J37o3k75L45r9o3K42j88j55
2960a69K29o7K7J14j85J37k7j8J48k00N5O0p7j62J62j16M3L4j28j8K22j68J60
2983E6n2j51K28j15j05J88j23J80J9j43J74j16j59K42k57P6J92j72QJ11j43M4
3005a8J24j48R8j6j53J68k5L2mo8kJ43k16J63m3j98K37k27l1J77r2L4J58j29j0
3030d6J27k72L08q1j58J33J51l52J88j5R4J06k24J05P1k51qR7j69J76j1j7J97
3053A49j99P4R1o0k5O9k52J98k1r4K01j57m3J15j08N1J05j09m4P4j53J9L4k7J89
3078G7J5m1N3j27M2J16j05K1kj95R3J07p3K4r1j2J62k20J21Kj45K75m5j12J72
$$ y = [87, -104, -62, -29, -261, 7, -160, -1, 78, -38, -13, 174, -33, -45, 87, -200, 100, 83, -102, 60, -86, -124, 82, -185, 15, 0, -86, 136, -30, -149, 100, -108, -86, 32, -4, 14, 177, -50, 87, 24, -251, 94, -5, -68, 174, -14, -169, 60, -7, 20, 134, -51, 86, 59, 41, 189, -11, 44, 104, 27, -135, 27, -89, -46, -12, -140, -158, 64, -104, 56, 4, -147, 81, -34, -139, 49, -74, 106, 125, -18, 156, 40, -119, 123, -134, -58, 134, -38, -30, 81, -62, -18, 106, -42, 56, 40, -113, 55, 30, 62, 58, -10, -12, 131, -85, 78, 35, -163, 74, -153, -184, -7, -99, -65, 93, -36, -46, 81, -191, 117, 36, -122, 11, 162, -190, -2, -17, 77, 183, -41, 64, 135, -116, -124, -27, -196, -20, -31, -48, 149, -50, 24, 115, 55, 30, 99, -153, 45, 24, -70, 131, -26, -69, 46, -62, -11, 94, -15, -59, 15, -138, -119, -85, -112, 77, 92, 51, 104, -23, 19, 135, 30, 51, 49, -146, -53, 54, -19, 5, -86, -98, 64, -156, -35, -33, -178, 97, 52, -60, 112]
3103A12r9OO2j72k2J73p8jm0l6Q1j8PJrp2R5J9r8J49j00K7N7L1M4j20j27K82j32
3132B2o3J75k37Q4M1k15J92Q1j93O4k8MJ44j86J44M8r8N6J4j65J03J45k23J92
3156A01j39j64K51j59J11rl7J25Nj08L8Q0j84J91j68M2N9j25O5Q9j06J8O4p0J27
3181I7ok67J82l8n0J83j27n1J81j89J31R6k72J37p4P5m0J82j04J1j05l0Q3o5n3
3206a13K35k06K43j96O0l6j7R9k2m7K1P1j29J64j9k24K03k15J8K04j43p6K52j94
3230f7P9N5r0K12k37Q2k4K0M0n2j31O5J48r4N8rj90J09O8j19J91j73R5l9r4P8
3256a9K6j54K91j90k7MK15j93J8P0j03J21q5k6J4o1J05J2j84K51j12l4O0j02K1
3281h2K30j34n9J78j37J10n9j16J23p0q2O0J5N5J9j25J05j6r0J97j56N0M3K8j30
$$ y = [112, 13, 19, 81, -91, -113, 60, -18, -19, -59, -95, -14, -32, -25, -24, -33, -105, -10, 9, -89, 60, -40, -13, 44, 75, 119, -1, -128, 154, 22, -41, 134, -103, -19, 22, -193, -1, 80, -113, -49, -77, -73, 71, -115, 29, 77, -21, 35, 49, -116, -13, 132, -91, 101, -38, -202, 49, -110, 1, -8, -45, 80, 85, -23, 15, 95, -89, 102, -66, -24, 35, -90, -25, 64, -42, -24, 40, -30, 97, 91, -176, 6, -32, -82, 101, -26, -77, 104, -85, 46, 142, -130, 7, -67, 8, -32, 150, 46, 57, -48, -78, 5, -60, -113, 122, -84, 159, -37, 23, -13, -30, 69, 47, 0, 21, 92, -37, 127, 108, -116, 87, -128, -110, 94, -49, -125, 127, -67, 12, 67, -23, 189, -48, 34, 10, 30, 70, 18, -113, -48, 100, 6, 64, 55, -135, -26, 42, -77, 114, -59, 36, -3, -97, -19, 7, -147, 144, -46, -73, -69, 146, -47, -29, 41, -62, 59, -26, -52, -38, -99, 6, 18, -166, 85, -27, -61, -1, -103, -82, 148, 14, -45, 133, -4, 106, 47, -69, 54, -16, -98, -38, -23, 32, 51, -74, 31, 15, -75, 122, -34, 16, 59, 87, -43]
3306d3P8q9N1L5p9NL9j92P7pk3J53j63L6J27L4q1R7o4L2P7j79J70k4j21J37j81
3333i8mJ17j1k8J16j45L2R1j38K22j75N7Q5j13m6J14k57J40J11o1J02j44N1n5
3357c7k8m1J96p1p5J08j85J69J8j83K00P1k11J78j30m5J37m7p4mP9n1N0j41J93
3382G6n7j12N8J37r1n8J3q9K98k78J49p8K0J03j77J02k1O6r0J25j53n1J91j26
3406d3J45jj22k3K7L0m5k5o0J30r4O7P8k2k6L0p0J22j36M6n1L7k7K1n1Q1N0q6
3434a8R9p4O6Mq2k5j10K6J01M3r8M4Q1j74J81r3K0J00j44j0J01pj7O5r9LJ08j25
3462c4M5M6q4l7l2O8J48k14J00l4k2J83n3j74J96j38N6r3l4P5O5p6J6O0p9m6J78
3489H6j42O7K5o6J0p3J09L5j64J38j56m1K16J1N9n6l5j3Q9j57N8L0k3J96k27n
$$ y = [-43, 35, -54, -3, 32, -47, -42, -3, -195, -118, -125, -148, 5, -158, -122, 5, 39, -42, 55, -9, 23, 100, -79, 91, 67, -54, 83, -98, -102, 15, 4, -24, 92, -53, -21, 70, -68, 154, -21, 36, 121, 8, -38, 76, -181, -41, 70, 9, 111, -33, 18, -37, -65, -106, 90, 19, -56, 52, -133, 36, 54, -129, 71, 142, -69, 109, -21, -66, 71, 24, -50, -54, 25, -26, 24, -117, 76, 19, -93, -35, 102, 11, -47, -34, -123, 175, -103, 46, -32, -12, 91, -86, 16, -5, 61, -29, 96, -57, -108, 83, -43, 102, 101, -21, -44, -17, 13, -32, -57, -117, 13, -81, -14, 64, 42, 16, 46, -24, 98, -38, 8, -43, -6, -33, -12, -63, 18, 68, -18, 81, 7, 73, 77, -5, -30, -140, -114, -13, 30, -68, -24, 57, -117, 64, -29, -9, 91, -53, -63, 38, 31, 14, 79, -20, -17, 91, -34, 11, 57, -27, -64, -96, -28, 120, -94, 6, -28, -50, 133, 80, -94, 102, -36, 20, -73, -107, -32, 33, -43, -27, 33, -46, -92, 86, -56, 11, 36, -30, -20, -93, 16, 51, -113, 25, -131, -172, 44, 55, 114, 58, 23, 10, 99, -58, 0, 30, 7, 203, -24, -29]
3515b9L2Ol3Q1j68O7J11l8Ql2j03J23J28l60K50no1O9j53J70nj03L4%m9Q1J2J2
3543D5oj6M4o7L4J25r4J9o8J4J0N5r3j11J74p2N7o0L7m0O6k07J57l8o5R4j45M7
3571a04M6j85K90P1j24K2ol7J0K2L0N2j43mO4L6j16J27j3r2M1pl1J15J3J4q9j2
3599a0K8q0n4J62o2K4L8k6Ln1J01j3j35L2J15j95NJ57k1J3Jm6Q2l2K5O3j21p1
3627f8Q7j06K1J62r2O6p5o7J79o4K9L1k94J34R5n6oJ0j28J37Op0N8Pj19J61p0
3654c2o5J34P2k9j2q7M3m6N8k4l8O7k2o5O4J47k75K53k05O6J27j05oJ8j34o5J82
3681B1M4n7j1pq8L4O2k7j03L3J42n6n3Q8j2Oj08L3J06m9J8o8K9l9J10m8q2J81
3709I9j27N7K2k1J17m3n5oj7L9l6j24l2J62j10J61j58j2P6n2J05J9o5rk1J02N0
$$ y = [-29, 3, 9, -24, 57, -111, -44, 67, 29, 37, 5, -98, 25, 153, -207, 43, 38, -23, 46, -107, 63, 58, -45, -11, -11, -60, 21, 33, 45, 39, 23, 67, 0, 34, 159, 65, 84, 16, 30, 40, 95, 2, -109, 65, -7, 50, -10, 27, -13, 53, -154, 3, -35, -100, -6, -151, -104, -58, -243, 47, 118, -6, 16, 10, -27, -17, 5, 35, 87, -56, -60, 4, 40, -76, 51, 38, -54, -13, -20, -51, 64, 77, 91, 2, -10, 18, -62, -116, 46, -16, 8, 46, 20, 23, -28, 73, 60, -75, -43, 72, -123, -118, 39, 18, 31, 32, -14, 68, 36, 61, 124, 3, -68, 19, -87, -66, 96, 4, 70, -5, -72, 107, 43, 72, 103, -191, -57, 38, -18, -24, -14, -142, -5, 1, -69, -11, -4, -123, 38, -32, -97, 37, 109, 80, 68, -19, 24, -22, 36, 12, -26, 41, 19, -46, 18, 165, -110, 143, -62, 4, 131, 26, 20, 38, -96, -161, 21, 65, 8, -3, -10, -98, -64, -2, -29, -132, -99, 43, -13, -66, 22, 10, 16, -92, -59, 47, -2, 16, -52, -23, -62, 48, 0, -82, 99, -28, 29, 51, 30, 147, 104, 49, 43, 26, 65, 29, -95, -127, 35, -75, 86, -72, -84, -8, -60, 45, 64, -1, -10, -31, 71, 121]
3736A21j39l8qJ26p0k0r8J14K0Nj4J55k63N8R6Nk9r9M9O5oj18K47j27L5N5j72
3763e0M2k6J8n9J2oJ05j23R9J4k7m2Q3K1j52J91r3K5j49J3J71j36R3k7j17O9N9
3790Hl4J13j28j10M9J36m9J13q6kj7J4N3J11j57q0J18j35K65k05j17K35j03J33
3814A25p2j46N9L9r1L4K1lP6l6M3O8k73J95K3j06J63r0pO4r4R0k2o0l8J12o5m8
3842c9p3J35O6J21k54O6l1l9L2l8N8j1j0K6n0O4ro4J7P5n6M5o1O1m6N4m7J3J08
3871A13k4k2N8j77Q6q2r1j02L84k20J14j16P4n6NJ32j9j76J04q1Q7K45l04K0J13
3896F5j43l1P5l4J17p1N6N1j09o3J05m4M3L3j27M8j2j3J12p3K2j4L5N1j49N3n
3923b2J37k20J13m6L7M5N2q0J12p0o4j3L9l0q1J16KJ1q0O8r3o6J79j02n6J97j29
$$ y = [121, -18, -56, -64, 62, -8, -28, -126, -12, 8, 13, -1, 154, -109, -51, 45, 50, 21, -78, -29, 36, 30, -88, 159, 32, 67, 122, -50, -8, -34, -16, -75, -63, -69, 36, -87, 12, 26, -1, -43, 40, 61, -91, 100, 7, 32, -117, -104, 67, -69, 24, -3, -120, -51, 8, -26, 87, -41, -151, -102, 34, -15, 98, 12, 10, -7, 7, 60, 171, 14, -66, 52, -83, 182, -23, -140, 95, -8, 125, 53, -93, -34, 5, -86, -52, -31, -34, 42, 6, 49, 117, -156, 39, 62, -44, 119, 29, 22, 86, -8, 82, 60, 0, -38, 74, 9, -39, -112, 23, 89, 210, -44, 22, -9, -48, -16, -54, 4, -7, -17, 9, -41, 23, 14, -50, -33, 42, -14, 31, -30, 31, -15, 39, -8, 5, 113, 89, 67, 125, -52, 34, -48, -139, -241, 143, -77, 37, -79, -5, -61, -56, 76, 57, -119, -15, -96, -9, 236, -68, -48, 65, -78, -109, -34, -68, 49, -22, 34, 85, -24, -87, 18, -26, 17, 50, -77, -29, -41, -54, 58, -15, 7, -7, 28, 79, -70, -17, -22, 115, -105, 8, -38, -1, 44, 96, 16, 128, 58, -6, -19, 20, -10, -91, 25, 27, 38, -42, 26, -67, -133, 46, -56, -112, 85, -44]
3950d4J02n0K1n2o2M4J28j24K1j9Oj38J18o2J24J0j39P5m2N8J12lj09J36Pm9J8
3977H7j04J27j15j06Q1J0Qq7J21Rj4o8jJ17j05P1o8q6R8N1l4J31q7k1%p3Q6J7
4005D5j13K08o4o6k9o1P2j7J9J08oj72J24m1J9m8K2q3J60p0j06J72p3l5L4mJ69
4032A64k90K11j55J22j13J31j41J27Q6p7L7k2n7Nl9n9M3n5n9P9Q9j94L02j78P0
4057B7N1n6qL8q6j8m8Q8L0J35q3j20J04k8j88M7J56p6N1n5j26Q4oL4P3m%r9O5
4086a8m8O6O4lJj59K52k73J10J24r7R0r9j3L3J5r2K0M0p1M0Q6l4r2J01r9Pj5R
4115e5k8R4n0J21J4j24q3J72K9ol9l0q6QQ5j01J29p4o3K3N1O6o9n8J57k37J62
4142HO0n3P7j31L8r2J33Q9j77k3O6n5K28j27j25J18o5l5L2K9l3N1L8q0N6l6l9
$$ y = [-44, 58, 8, 29, -23, -85, -41, 87, -37, -16, -35, -29, -167, -49, -111, 13, 23, -116, -41, -83, -25, 87, 84, -25, 111, 118, 69, 87, -17, 110, -5, -111, -30, -20, -12, -99, 22, 31, 17, -51, -52, 65, -40, 31, -37, -123, -25, 26, -8, 123, 36, 15, 15, -58, 28, 45, -68, 140, 76, 10, -19, -80, -8, -25, -6, 102, 96, -76, 48, 7, 26, -22, 0, -83, 77, 7, -99, 73, 0, -35, -1, -5, 164, -126, 85, -70, 52, -61, 70, -71, 56, 142, 65, 102, 80, 23, 28, -11, -70, -27, -82, -141, -62, 27, -167, 135, -43, 27, 78, 22, 14, 52, -34, -52, -100, -12, 18, 153, 70, -50, 54, 26, -162, -115, 41, -35, 16, -39, -165, -81, -87, -53, 20, 16, 16, -83, -18, -66, 0, 64, 61, 62, -97, 155, -118, -8, 116, 19, 109, 10, -3, 30, 45, -47, -27, 13, -58, -18, 68, 34, -58, 43, -56, -49, -64, -55, -83, 11, -39, 82, 96, -28, -111, 61, 90, 84, 45, 15, -71, -63, 22, -79, 50, -24, -87, -64, -13, 53, -16, -74, 83, -154, 8, 68, 15, 92, -39, -1, -93, 40, 129, -48, -71, -5, -60, 168, 41, -84, 34, -31, -66, -34, -5, -38, 13, 51, -29, 27, -9, -48]
4169d8J7l0nJ1P4R6q1K7k9r7QM3MM3q2M0k7R4j40QQ8n5L4jk0N8O7r4n3J3K8k6
4201c5M6K3J1o9Pp1Q8J05j12k8o0K5M1m3J50j31J85j80O3m5M8N2p1J26j6l2p8
4228aN5q8P0j28L6J7QN4j36O6L2P5p4N4j05J31o5k0M7j44J29J3j11l8P8L5N0j1
4256B9l8n9k2M5P8k22K02qpl1Oq4J69J3k5J51k17j4J6J52j65kJ32j0n8n8r5J54
4284C2j18J55L6j32l7J03j4j7KmOm4p7JR4Q8m4p3j14J59l6O5O0j29J41l1p9QO5
4313F6k6j08J4J3j04J71J00j41J1P0j18L1LO9op9n6R3j9j01J18J7j49K16j04k8
4339d7j02M2R9K0M0k8Rj3l7k3M8n9J2N6p3P5Oj5k6K7j1J54j06k0n5PJ5M5j9p5
4369e4K2J23j19nQ0p4K2l2J9j5m9L8N3K4j1l9KL2J1J0m8p3N6J03j51KJ3P4J69
$$ y = [-48, -31, -61, -66, -55, 19, 115, 34, 61, 32, -65, -57, -14, -10, 33, -49, -9, -36, 58, -82, -74, 14, -41, -7, -8, -28, 30, 97, 3, -50, -37, -9, -35, 11, 34, 45, -24, -17, -88, 0, 105, -7, -35, -95, -70, -29, -72, 78, -53, 132, -48, 15, -30, 18, 70, -1, 125, 109, 77, -1, 54, -34, 36, -92, -56, -39, -31, 23, -113, -47, -15, 60, -14, 40, -65, 66, 1, -19, 28, -116, 13, 26, -85, -123, -45, -10, 40, 29, -9, -68, -90, -45, 33, -189, 13, 5, -2, -33, -27, -111, 58, 71, 46, 197, -20, -34, -18, 134, -31, -33, 99, 89, 31, -27, -122, 32, -86, 69, 105, -27, -64, 39, 25, 8, 10, 6, 12, -32, -109, -108, -14, 74, 30, -43, -157, 2, -34, 31, 91, -38, 103, 72, -7, 1, 66, 40, -68, -54, -41, -145, 26, 126, -15, -4, 66, -52, -21, -18, 51, 45, -34, -90, 3, -16, -117, 1, 18, -131, 85, -19, -47, -149, -107, -8, 12, 52, 24, 33, 20, -17, -40, 8, -51, -39, 17, -56, 19, 25, 10, -16, 11, 0, 154, 48, 28, -27, -20, -5, 40, 21, -54, -32, 91, -28, -33, 47, -27, -5, -37, -18, -33, -82, -44, 9, 33, 22, -17, -15, 17, 28, 38, -10, -83, -27, 76, -75, -73, -60, 14, 183]
4398A83k06o2N5L4Q6j59N0N8j02K1L0r4R9p7R2RJ8j05O8J4oO8q3j52J84k0N9p1
4426io8J14N9j69qJ11q4N4lM3k0Jj14J58j47J55j4p5N0jr3J68o5j5JrO0l4j31
4455h5Q0J2o5k3J00r1J5m3J18Kr2R3j0LpP7k07K15n0j57L7O8J1Q6j42J20j15m7
4483i7K0K8r8J46J1J8M7r9j3j2j0R5q3r8J63J33j12j28j5NM8J82k13Q3KN0L3j97
4511a11J03l0J7J9NK8l2R8j35j3Q2O3r6l8J15l7lj08Qm7O6jR4l4l2R0p9J0J0k1
4541iQ2K7k03P8L5o4o2J21l1J9K2N3l6qO6k8r8P3n3Q1j5q6k8P2K4j34J21n1M0
4570HM3ro4J79k97J04J3R1K3q4J9Jn5MMlK0O5j04o8J29m7p9J14K7k1K3j2on7m0
4601g9N0K0mn7pJ75n7l1lO8j47J1rJ03o0%Q3j11k5J22l6r6Q0k1J1J01j36O9m5
$$ y = [183, -23, -85, -30, 4, 90, -69, -19, 39, -63, -42, -12, -106, -7, -84, 8, 17, 35, -70, -2, 12, 6, 74, -9, -161, 23, 3, 62, -9, -77, 37, 96, -73, -81, 30, -54, 0, -3, 40, 20, 21, -93, 65, -82, 73, 59, -16, 34, 33, -60, 108, 43, 28, 29, 20, 80, 46, -85, -5, 7, -58, -81, 19, -72, -57, -100, 18, 20, -72, 21, 11, 14, 7, 84, -123, 92, 42, -115, -78, -10, 1, 87, -55, 65, -50, -97, -77, -49, -147, -1, 10, 28, 75, -24, -37, -49, -59, 36, -47, -145, 18, 151, 39, -89, -104, -99, -51, 131, -82, 1, 3, 53, 86, -111, -8, -38, -21, -2, 3, 31, -1, 97, -38, -51, 31, 94, -2, -40, 75, 38, 35, -73, -65, -112, -46, -47, 47, 13, -19, 71, -8, 2, 12, -9, 73, 100, -103, -25, 10, -54, -116, 5, -26, -7, 15, 68, 32, 24, 90, 62, -36, 37, -16, 65, 50, -36, -64, 8, 32, -102, 19, -32, 8, 51, 42, -22, 157, -140, -36, -23, 68, 91, 7, 26, 27, -28, -24, -20, -23, -3, 62, -42, -110, 19, -28, -107, 7, 34, 13, 36, 24, 18, -39, -79, -29, -9, -13, -70, -77, 98, 41, 10, 7, 75, -72, -61, -70, 33, -27, -27, 56, -55, -80, 42, 6, -90, -10, -31, -20, 81, -55, 14, -31]
4630c1q1K62j30r6J27j36J28j9j38O3n7M8P3N8p8J44j00m8L5Nj23J48l6j10Q1
4655a1O8l4j40Q8M7k3M2o6J5Lq2j8J43L6n6L8m9l9J37k18J26l2J7J26m6m7N5l9
4683D1j30J85j36J30n8l6k8k2n9R6j0j9Q2j7p7J46j39K03o9k1o7M6q6K3L8l2o2
4710g8J22J3q3q2J36j73J33Q0m7o3J32j01M3k8J12q7k0Ll0K1J04j01N1k05J53
4735EP5l2J54k37l4J08j6j4pn4Q0P3k31K19j19j25J64j07N5J53r2n1nL0Q3k1o7
4762a3j40J75N6o0r4n9J21k5p5J66j18J89q2j15P2m8M1K4K2j9J4k2N0o9j6P0l5
4789A0k6J0L2p5O4qP0m2j15J3O7l0OJ21j40P3J5j56J57j59K6J51J8pj58J05l8
4816a6K5m9M9On1m7L3Q4%L5p2J2QM7j37K0p8l5J22L0J5J05k28L5J9N0j40K89j28
$$ y = [-31, -112, 150, 20, -76, 51, -85, 43, 24, -114, -51, -108, -60, 13, 71, -7, 137, 37, -11, 24, 29, -94, 54, 18, -92, -11, 57, 23, -117, -29, 18, -5, 37, -29, -14, -11, -93, -111, 32, 68, 12, 50, 1, -38, 99, -119, 7, -25, -8, 118, 72, 25, 80, 41, -89, 96, -40, 90, 32, -4, -32, -54, -113, -17, -27, -46, 36, 19, -58, 88, -51, 152, 83, 62, -5, 41, -45, -22, 16, -16, -78, 44, 57, -26, -108, 28, -145, -12, 68, 21, -42, 90, -11, 32, 4, 116, 29, 9, 12, -18, 3, 107, 6, 57, -148, 5, 80, 48, 202, -35, -69, 39, 23, 9, 2, -52, 28, 101, -130, 89, -30, -155, 9, -98, -43, 110, 18, -33, -38, -8, 75, 54, -13, -153, 22, 78, 18, -76, -135, -14, -39, -114, 52, -66, 123, 41, -74, -2, -50, -9, 15, 37, 18, 32, 10, 60, -9, -25, 45, 10, -16, -6, 26, -49, 15, 7, 77, 35, -80, -67, 0, -30, -24, 97, -43, 30, 45, -111, 46, -113, -87, 64, 82, 75, -83, 22, -16, 9, -40, 9, 15, -36, -83, -50, 34, 34, 69, -3, 9, 17, 64, -73, -53, -131, -166, -44, -14, 1, 106, -122, -87, -68, -18, -158, 131, 3]
4845CMP9m1q7J3O5Qn1O1j03P4K0l8Q9q1L9n5J2L2q8J03j05m1J24j02J7L9J62j46
4874Fj7q8j2J50K4j35m7J52l3j4Q8J38k51J00M1n6q0M5N9L1j07n3l2Q8L9j4M1
4901F3p0LM2j41J64q7R6p2K7k8r1M5J6J16j24L3nKO5j23J8j0Q9q0M5k9n6R3Q3
4930H4m8M9n4p8J46j74M6K6M7q7L4O1J4lj26O0j08J19ON5j01pO5q2J3J57j36R2
4958G0p5O1M1n6kP0k44J85m8q3J06kj38J28L9j25O8O3j17J8M4ll0O9l5J11j45
4985c0P3N8l2n8p2N9l9o6J46o8l4N7j07P2Q4K2N2j55P1r6N2M3nk6N2q6mlJ8O6
5015D4ll5l0rN7q6N7r0J47j96J70p0P8j8n4KLo4J69p6j8Q6j44Q2r5J39m0mrL2
5045B5n1Q3L0j13m6N9J0o6J16j0K3n5k1M3o3J25r3n2J28j00j21K44m7q7J81j28
$$ y = [3, 7, 86, 45, -42, -29, 36, 44, -7, 54, -49, 25, 45, 7, 96, 15, 54, -1, 11, 43, -45, 58, -47, -88, 36, -66, -49, -10, 152, 6, -11, -99, -111, 39, 63, -72, -119, 33, 0, -14, 74, 212, -39, 61, 102, 46, -34, 11, 70, 101, -6, -59, -91, -3, 36, 22, 63, -7, -4, 38, -103, 61, -26, 70, -2, 25, -3, -94, -49, -33, 83, -41, -8, -13, -11, 54, -69, -51, -61, 28, -52, -7, -36, -92, 1, 84, 36, 85, 31, -47, 99, -75, -29, -3, 44, -43, -9, 52, 66, 63, -63, -3, -111, 8, 14, 69, -32, -39, 26, -56, -43, 114, -22, 70, -5, 56, 97, 41, 39, 109, -135, 50, 2, -81, 25, 23, -115, 13, 52, -73, -5, 58, -59, -41, 3, 0, -30, 39, 4, 115, -30, 43, 101, 69, 11, -61, -2, -41, -107, 39, -29, -63, -6, -113, -41, 43, 65, 117, -38, 33, -63, -11, 32, 27, 1, 53, -33, -37, -40, -22, 44, 41, 6, -24, -33, 24, -62, -5, -95, 52, -144, 26, -44, 34, 16, -38, -36, -33, -97, 72, -4, -22, 64, -80, 2, -93, 46, 6, 2, -7, 25, -26, 57, 87, -26, -72, -13, -3, -69, 47, 37, 60, 5, -16, 27, -36, 89, -4, -56, 72, -28, -149, 95, 48, -39, 142, 14]
5071A4j6L3j5m3N5J7J9l4j7J01j59M7k1j1K6p9j5J00l9N0O1j23N6Q3k7j93J75
5098D5j6J3j6j3N8j65J74q8M4p7oQ5j04K5J03n4J6j4J2m4J2k0nP6j2Jo0M9nm1
5128b7R5p5o6J24J3K9j15o8J34r1J1O3kK6Q3k20J18n6j27K18n3j5K6l6K9q1J16
5155E3N7j04L9o1k5M6K3j0O6mq7J7k8L5j23J99l2J8l5j46J2J15q4M6MJ4q5p0R7
5184e3M7M8n3p1N1P1j1Q8k03J40o4K9q9J42o4kJ12j59PK8Q7j35M4l2N0p4N7k8
5212c7O8qk3k4qJ91j87O2j35J43o2p5J33K4j68R1P2k2j6l2M4pK4q5l4J59j43J7
5240c8P1j08Q1k5p7J03m8M5J15j55m9J17n5Ml5j5k0J96k09J18lj00J82oj67L0
5266d8n8P0n1J64j50L4J18r1O9m2Q0r1K0k5LP8n2k6L9n2l1R0j18J05Mj14J45q5
$$ y = [14, -2, 31, 16, -27, 28, 45, 64, 30, 13, 114, -45, 2, -19, -30, -4, -83, -98, 2, -37, 13, 74, -49, 7, 90, 63, -130, 45, 29, 42, 26, 13, 71, -94, 80, -8, 36, -41, -47, 38, -66, -41, 62, 8, 24, 10, 22, -22, -10, -30, -35, 41, 29, 30, -30, 19, 14, -27, 68, -7, -73, 51, 64, 93, -22, -90, 44, -47, -36, 27, 25, 51, 134, -86, 32, -24, -151, 67, 14, -1, 25, -11, 18, -63, 53, 110, 6, 45, -16, -41, 5, 28, 18, 84, 80, -7, 10, -18, 17, -106, 93, 61, 79, 44, -102, -90, 25, -59, -13, -9, 5, -80, -150, -53, -6, 42, -11, -82, -31, 40, 29, 117, -86, 54, -10, 19, -70, 72, 8, 6, 118, -41, -34, -6, 81, -54, -10, -42, 8, -66, -9, -37, 31, 23, 0, -24, -32, 159, -28, 34, -101, 42, -20, -95, 38, 62, -106, -15, 57, 35, 19, -13, 31, 24, 48, -37, -71, 88, -55, -38, 33, -75, 6, -19, -96, 7, -41, 4, 119, -36, -85, 32, -23, -19, -54, -69, -89, 107, -102, 16, 13, -87, 95, 89, -78, -48, -106, -36, -87, 77, -73, -39, 79, -12, 57, 15, 95, 4, 24, -1, 2, 80, 28, 2, 41, -11, -42, 48, -70, 35, 39, -75, 70, -15]
5294a5m0M2k7J8J1Q2L5j64ql3O6r3J16o4J33k9j02M4N2j20J98j47P3M1N3j95J57
5321H4j55R8JN4k64K04m2J04l1k02J71n4Q9M1j16J9lj3ro1N0P8r4k1R0K6l8j26
5349a20J13q2J85j74P6Jr1R8J4j52J79r6K6K5l8N9k0n1P9K5m8J06p0l7j3J0o1
5376e7OM6Lm5Qo6J80j00R3p6l5P6J1q4NO3m9k5K6J4nO3r6O7On4Oj13J62l1l2L7
5408DO6n8P7j13P7L1m2n6k6O4O2j96MJ68j95O9J26o4k1K0O7j5j7n5O5l5o2Q1L
5437B9k3p5J38L3J5j55R3j8j05J55j70R6P1j44Q9j08Q4lO8j28J03p2j04J47r4
5462g8L7p3J07J9j52O7JL4J40q8K6j23K04j33Kn7o1K57o8j87J44k6q1J44q3jr
5489c8K7L7MPn1M4j17R9Kno7L9N5%mp5M5p3N7k3k3pQ4l3L0jm6k8m6P6Qok9J46
$$ y = [-15, -55, -13, -40, -22, -11, 71, 106, -58, -66, -99, -33, -126, -10, -74, 59, 30, -72, -28, 24, -96, 102, -45, 28, 69, 122, -73, 84, -71, 27, 28, 82, -182, 22, -20, 84, 53, -149, 22, -32, 57, 98, -18, 1, -2, -15, -24, -85, -35, 43, -51, -72, 18, 44, 6, -120, -7, -89, 96, -78, -2, -1, -92, 6, 20, -132, 47, -49, -23, 2, -36, 23, 3, -48, 31, 56, 8, 114, 44, 7, -6, 4, -57, -51, -5, -2, -47, -39, -105, 75, -25, 68, -8, -43, 33, 44, -40, -35, 28, -21, -46, -20, -6, -11, 52, -44, 23, 29, -25, -19, -132, 30, -1, -33, 4, 70, 12, 89, -24, 53, 84, 42, -14, -40, 24, 86, -110, -106, 62, -133, -64, 62, -2, -23, -3, 64, 49, 32, -23, 42, 7, -55, 26, 29, 6, -69, 69, 102, 117, -38, 55, 37, -68, 87, -83, 13, 84, -60, 29, -79, 5, 2, 70, -58, 45, -27, -131, 16, -78, -41, -114, -7, 12, -140, -73, -72, -38, 102, 14, 40, -83, 121, -12, -10, -67, -128, 129, 61, -126, 18, -8, -89, 55, -28, -29, -38, -11, 26, 30, 37, -14, 30, -87, 12, 14, 9, -58, -19, 36, 36, 32, -43, 2, -71, -14, -37, -60, -67, 17, -16, 14, 13, -33, -61, -107, -31, -23, -29, -58, 88]
5523H8n3j22R7%n8P3m2Pm4KQ3m7N1p2k0O7J2P4j10N3m2J44j23m7J2n2o9J32q1
5552h7M0O3Lj36m0Q2J77j74K18j98n0R7M9l6k0J5J7o1J09l8n0j5O3j03K01k43
5578a17m6K64r1p1N8Lj0Q4m2j33Q0P5j22j4J8qr4K09l0J18j56K3lN8l1NqK0q1
5607d2l5J24r1P7K0o1J7M8j44P0j9R2J6j34R2O8j04n1K1L8K1n0J52j04K0j62J24
5634Cn2n2R8j40J97j5j67J22M4q8L9j00J06O9j11J2j1p9J08Rj12J64j11k9J91
5659I5m4o6o0Q1j5M0M6q8j7L3j0rm2J47q9J06j56L7K6p8K1K6j1M3l8n0N1j2L0
5688cp4O0j4N1j2Q9j74N7o9J70m0K8RPj17L7o2J6p3J54N7j43J7R7m3m8J59j28
5716HR4j68l1J87q1jo7k1Q5p3M1l1J7K7J15o3l0rp7kJ94q7K4N4m9o3K3MN2K6j09
$$ y = [88, 35, -87, 10, 10, -48, 25, -17, -10, -54, -52, 31, -16, 35, -37, -57, 10, 22, 96, -14, 39, -3, 141, 18, -29, -17, -69, -138, -6, -87, -47, 16, 19, -117, -157, -75, 102, -72, 146, -52, -102, -5, 44, 8, -12, 3, 20, -41, 68, 30, -20, -35, 28, -75, 126, -117, -163, 101, 10, -61, -3, 0, -10, 74, 32, -101, -21, 54, -68, -82, -64, -72, -166, 43, 13, 131, -25, -2, -5, 53, 22, 27, 19, 39, -42, -77, 47, -44, 33, 53, -8, 9, 57, -87, -17, -36, 56, 72, -62, 30, 98, -6, -57, -36, 2, 23, -27, 125, 21, 41, -121, 3, -49, -101, -3, -143, 54, 39, -128, -6, 38, -50, -11, -111, -5, 64, -47, -35, -46, -125, -17, -8, -120, 44, -67, -96, 95, 51, -15, -75, 6, -9, 31, 77, -11, -28, 5, -5, -14, -56, 91, 2, 108, -48, -11, 15, -63, -42, -16, -27, 16, -22, -72, -21, -33, -3, -77, -17, -31, 20, 8, 97, -77, -20, -89, 81, 41, 69, 78, 85, -32, 5, -57, -41, -114, 40, 97, -46, -29, 68, 25, -23, 136, 8, 102, -66, -97, 90, 9, 8, -59, -80, 5, -68, -27, -58, -41, -14, 101, 38, 8, -1, -78, -80, 114, 27, 51, 105, 56, -7, 16, 20, 72, 98, -11]
5747a1r5K49j30l3N7J6j15p6J07m8J86j74O1q4J20j6j03O6P5j25QO6j10J09Q6
5772H6n3r2O2r7L8n9R5N8j06P5k1k03K57lk03J51M9n0L8K0k5J1rl4O8m3plQ9j24
5802c5M0j05l8J24J30j28R4n7NJLr5J37n8j0m3K3n3J54p9n6P8p2J2N5j55J37L6
5830D5m5rkM4M7j20O3o0m0J33j18L2P3k59J79LK3o5J6o3OJ14JkK5rq3J02M0j04
5860c3Q3o4j3M2k7k5j02K10j0l2M2j44L8M0j38L10j13j6jK1j29L6Q7j21j1QJ72
5887A10k38J22P9j37m5J39q8J0MQ1m8P2o8L0Kj21P9l9K7J7P6j7n0N0R4j24j4o
5915cm4Q3Q7p0k63J85J19o1nj20N1MQ2K1j01M9K9n2R5j38Q4k7kJ6K9r1J9P4rJ8
5945E9q0J34j74J17k1j8j42J10Q9j33R2k5p5O0Q3p2O6o0j1n7rL8L6L4n9M5q2Q0
$$ y = [-11, -106, 143, 13, -20, 37, 53, -62, -138, -31, -79, 107, -67, -6, -90, 30, 14, -89, -23, 52, -73, -65, 1, -109, 0, 86, 33, -59, 3, -94, -56, -115, -20, 38, -68, 7, -14, -217, 40, 37, -166, -15, 34, -16, 22, 42, 17, 28, 19, -15, 53, 10, 3, 0, 89, -35, 5, -100, -138, -14, 116, -12, 82, 25, 30, 31, 34, -61, 76, 18, 8, -35, -12, -65, 89, 10, -46, 32, -40, -28, 27, -128, 9, 45, 0, -9, -11, 33, 80, -40, 23, -37, -77, 56, -62, -30, 43, -216, -37, -34, -11, -76, -60, -123, -117, -3, -2, -4, 21, 12, -71, 31, 71, -33, 50, -14, -27, 15, -12, -37, -139, 71, 61, 29, 71, -73, -35, 5, -133, 177, 64, 48, 47, 68, -61, -25, 62, -59, -70, -62, 110, -128, -6, 73, -64, -109, 30, -58, -48, -44, 37, -11, 61, -7, 23, 25, -96, -17, -56, -29, -12, 64, 47, -3, 47, 141, 17, 3, -3, -47, 36, 123, 53, -210, -25, 94, 33, 28, -92, -41, -37, 45, 66, -35, 14, 43, -9, 86, -52, 32, 5, 3, 19, 48, -43, -24, 50, 41, 59, -21, 113, -61, 56, 35, 17, -125, -15, 74, -59, 33, 8, -67, -7, 76, 4, 70, 10, -1, -58, -67, -29, 7, 41, -18, 27, -55, 25]
5973B5K8j17Q8M9j23k7J48lj07L7j30R7P4M9j49J8j04J84O4j34N9K8L5j21L2l8
5999c8K2o6R0J16j48qQ0q4%M8J02j26l2L4n2Nn0J94j1l2n1K0p7J72j49KPoQ7j18
6029f9L5j06L1J89p1p6J01L6j74K04j22k6J13m4Oj00O5J2l4N2L2q1%P1J8o5j7
6056b0J0K8o5R2n2j04J5J23m8LO9K4j59L3J51m8q4m9J16j32J36n0O2k6KQJ4K6
6084G5j00P9j54O1M5L7j17N4Q7j17N6km4n4N2J2J2Q0L0L3j36Rl6nP3m7R7m5J05
6113A40j12l8L7r5pR0j6lJ1%j03J45j4K9L5j80J62j95J12J0m7k3J06K5L0q7J2
6140B4P1j10J07k31J44m6J41j19N7o5O8O4j67R6k7q6N9r3k8J07m9O7j9N7n7K0
6166a5P3nm9J2l2Q1Kq6J8J01j71j4P6J33p8j19R2R0j80J25l5j05J54oj72J10M2
$$ y = [25, 53, -64, 24, 73, -50, -77, 71, 68, -39, -2, -132, -35, 39, 88, -61, -43, -147, 37, 101, -33, 26, 54, 89, -32, 0, -38, -16, -82, 8, 124, -24, -32, 48, -36, -36, 12, 114, -12, -44, -10, -62, -57, -107, 87, 76, 44, -7, 13, -64, 108, -41, -39, -32, -38, 49, -69, -34, -140, -109, 80, 9, -67, 34, 70, -104, 100, -22, -48, 65, 21, 27, -73, -8, 4, -30, 22, 54, -27, -27, 44, 62, -3, -20, -10, 18, -47, 45, -7, -111, -96, 27, -21, -18, 51, 75, -84, -51, 100, 52, -32, -81, 35, -97, 39, -11, 51, 25, 27, 35, 49, 75, -25, 54, -100, -39, 6, 43, -74, -20, 67, -50, 6, 4, -40, -94, -42, -30, -18, 62, 92, 125, -11, -2, -38, -43, 30, -17, 80, 35, 140, 28, -10, 27, -68, -75, 15, -1, -4, 7, 7, -96, 49, 35, 64, 99, -81, 81, -114, -2, 8, -39, -62, 44, 69, 99, 12, 24, 95, -15, 92, -139, 5, -41, 100, -19, 38, -27, 41, 105, -62, 34, 7, -79, -20, -113, -141, -34, -83, -16, -35, 22, -35, -15, 58, 53, 4, 16, -16, 65, 67, -19, -1, 100, -71, -85, -9, 124, 46, -73, 19, 109, -71, 54, 19, -86, 68, 62, -110, 0, 42]
6193D2l4m6JQ4o6kJ8p5M6jK5N4p3O0o2K0ml0P4k8L9o0K1N1p9m2J21L8j5j0j8P4
6225A23j50N2q4jK3j8M0m0J08n8k6j02J00P5j09Q8p1L5Q9k8M7j21J24j45L5QJ23
6252A17j46M9M2l8r0J24Kr1P8j40Q3qj2Q5l4J9Kl6K8o1l7Q9q7K4pJ6R4j51R1K1
6282B6k1O0L7p3J4k0r9qK8J72j3n7l5LN6j46N5l7J34l6l5k4K3k4q8J69K5p4m8
6311c6J6L2j15P7P4r9R1K6Lj94J85m2j05Q2K6m4Q6q6O1N5o1N7j40j1N3J34j35
6338a0J56j50o3oP7p5N3p6N7R0Lk2J36j96k5J5N6j3L3j11P2o8N2O3j13N4J49k1
6366A17j25l6J30o9L8nj52J23j9J85k25M6m7R9j99L8L7J16MmK2o4q8J58j04K2
6392bk0p7P8L6q0M3K5lp1J2R5J2J0j48M4J53j92Q6J2r5J22l9m5J32k52J79l1k
$$ y = [42, 8, -38, -37, 47, -19, -21, -3, -78, -32, -33, -8, 46, -27, 33, -29, -9, -13, -43, 31, 3, 42, -18, 3, 54, -25, -67, 54, 92, 77, 67, 49, 123, -27, 25, -59, -60, -37, -55, -15, -55, 53, -5, -31, -133, -33, 42, -67, 21, -50, -15, 74, 46, 93, -28, 96, -49, -14, -6, 117, -29, 20, 62, 24, -66, 58, 60, -31, 47, -93, -10, -18, -30, 55, 21, 40, 42, 6, 34, -27, -64, 25, -62, -38, -45, -29, 65, -86, 5, 26, 5, 65, 102, 29, 43, 23, -76, -84, -56, 116, 103, 46, 11, 14, 70, -76, -21, -58, 76, 40, 5, -19, 4, -20, -108, 61, 86, 12, -36, -20, 12, -103, -26, 48, -51, 40, 66, 69, -125, 60, 18, -87, -5, 21, -23, 63, -23, 38, 93, 32, 89, -51, -62, -9, 125, -10, 146, -4, -67, -73, 4, -71, -18, -94, -37, 53, 56, 34, 170, -26, -51, -36, 20, 7, 40, -71, 1, -67, -15, 48, -65, -11, 138, 117, -8, -44, 86, 17, 55, 50, -102, 21, 2, 187, -38, 8, -39, 60, -139, -101, -64, 52, 56, 52, 74, 10, -78, 80, -24, -2, -22, -99, -21, 15, -65, -22, 3, 0, -71, -59, 36, 48, 58, -90, -46, 107, -85, 1, 13, -82, 40, 1, -44, 88, -164, 15, -16, -18]
6420a8J07r9o8J46j1K8j40J32j16J38r2P2q2j22J99jL1o2q3N8m7l4QQ3p2O6r3
6447g2L4N4j7j57J66M1j15K25j39K6n7K7k6q3J11j5n4J26m2q6M3k1l8J09r9K1
6473c8P2o0J7P1p6N7j50O5O5q6R2r0M6j7J5j5N4N1k6J8j30m7P5mk7J27L5j6k8
6502E0j7j0J3r7J06j61K09j17O5p0QP7m9Q1o8O0q2n7q5P3Qo3L4J38n1R2k03J59
6530D3oL7j5oj28N4N9K7o0j65J27O7o7k9J61j30L3K2o1LN0JK6j11j0M7L9l2L9
6559A5Q4j10m1R9j44J75j08J36J8k6l2m1N0n6q4N6m7J4o3Q0R8K1j18j0jrM2m4
6587d6L0j2K7k0J2N1N0j16P2j09O0o2O0N4r1M7n0J27j46L2J47p0J1q5p2R5k8R
6615b3l5J68j69N3K5j04K39j12l1j8j7Q3n6RK6k9N8r1J04j9j7j8m6l6L4L1J03
$$ y = [-18, 89, -10, -78, 68, 57, 85, -55, 77, -39, 99, 7, 79, -3, -125, 74, 73, 104, 42, -41, 17, -30, -64, -56, 27, -45, 21, -72, -38, 16, -1, -158, 8, 49, -66, 159, 20, 46, -11, 16, -10, -93, 18, 3, -51, 75, 33, -53, -10, -31, -69, 40, -59, -38, 34, -26, -9, 62, -14, 43, -107, -42, 23, -63, 29, -61, -15, -32, -17, -32, 22, 73, 47, 65, -65, -112, -37, -41, -68, 59, 94, 78, 50, 33, 23, 36, -61, 45, -116, 93, -24, 41, -29, -21, 56, 7, 88, 20, 80, -2, -59, -144, -71, -63, -126, -92, 46, -5, 87, -116, 43, 37, 74, 59, 53, -75, -21, 38, 65, 5, -160, -33, 34, -33, -62, 99, -31, 2, 24, -37, -34, 16, 17, 43, -68, -78, -31, 8, -24, 15, 99, -11, -52, 47, -97, 78, -30, 106, 124, 98, 66, 25, 75, 19, -65, -9, -56, -42, -105, -25, 73, 94, -24, -34, -35, -44, -2, -46, -16, -28, -1, -21, -9, 42, 92, -24, 48, -61, -1, -63, -3, 51, -40, 7, -43, 84, -62, -30, 117, 47, 58, -27, -99, -4, -32, -23, -58, 110, -59, -6, 19, -85, 154, 42, 11, -7, -24, 59, 3, 12, 38, 9, 67, -24, 80, 61, 44, 26, -20, -56, -22, 9, 112]
6642A12j67J24k6j9r6J07M8k8p2j7j9jL1Q2k5j15J41p6o3K2N8P7L2j10R0j84J77
6669H3p6L7o9NJ00j45k1O7m2K4PJ24k98J68M5m4Q7r6M5N4r2p6O2L1Q8m3K7j20
6697f8Q5j30L8N1m1l8Q9LJ30j22J4Jp5J24j23O5j6J6O1q8l9J61K9j44J87k10M0
6724@r9J02o8NJ40j43j7J09Q7q2l3Q0n2m8Lp2J34r9NQ2m3k4%R8k50J18l4Q8J6
6753Cr6M2Q1j6o2J54j07J08j67j4L6k2L8N2j39M1Q5r0O7kj4L1K4j59N7L0L7K7
6781B5K0o4J16j06K7L2n1K0j30M3J34N5P2j10j56J47k8q6q9N9J66q7R3n9j55J17
6807ErO6m6K2n5O0m7ln3J7J95j60n6O2Qrp9Q9m1l6O6j9mrm8N9L5j99K55M2j10
6838bk1R5j24J5R7p5L4j7l4LJ17m1l4r6J19q9L8q5J40o2J8R3j41J90j57k3M5p0
$$ y = [112, -55, 69, 43, 24, -72, 35, 83, 55, -17, -34, -53, -54, -23, 59, 34, -81, 60, -16, -79, -57, 1, 78, 110, 0, 90, -94, 83, 7, 44, -25, -20, 80, -65, -86, -19, -61, -37, -30, 94, -204, -36, 9, -35, 52, -44, 1, 55, -37, -113, -51, -20, 68, 25, 52, -68, 17, -113, -75, -24, -65, -103, -14, -11, 119, -3, 11, 12, -63, 61, -62, 3, -13, 3, 64, -24, -63, 98, 127, -17, 170, -40, 0, -99, 3, -65, -60, 80, -63, -80, 29, 116, 34, 1, 81, 29, -19, -16, -88, 46, -53, -48, 34, -9, -33, -33, 65, -185, -67, -101, -13, 3, -93, -51, 30, 14, -48, 106, -1, 107, -60, -74, -38, -60, -22, 30, -109, -68, 17, -73, -6, -8, -22, 9, 33, -126, -69, -39, -2, 25, 45, -19, 97, -9, 18, 50, -1, 19, -111, -68, 66, 121, 193, 83, -73, 74, 46, -40, -129, -70, 96, 9, 102, 43, -112, 5, -4, 62, 16, 38, -17, 43, -4, -7, -60, -43, 152, -8, -64, -2, 6, -3, -82, 7, -34, -70, -4, -23, -27, -36, -84, -25, 10, -189, 66, 108, -2, -23, 72, -52, -37, 60, -15, 19, 2, -32, -29, 88, 47, 13, -83, 36, -53, -15, -100, 40, -22, -4, 89, -52, 138, -19, -42, 3, -67]
6866f7M9P6o2r7o4J74o3R3q5kJ4K8j02J7J63j30J48j13L3j41J57L9l0Pj9J7N6
6893I6j29l6L1J48j01J9nj1p7K0k2R1p8R3k0p4QR6N2j21pm7J79j45J19r9m2P8
6921A6Kj2K7j16J38l1N2k5qr6R5n7J02rq1J15m6L7j39l8J08P5j51l6J11R6k1j79
6949g1N9R4o6P5j40QJ3N3Q8j12LL9Q4p3j61J74j86O9J76j25m5N9j36J87o3j07
6975a04Q3M9p8L6R2j56J02n2J78j19p9J26j68l2J87l1j08R3j64J00J7J9J37p2
6999E6m4j8L4j01R7j6j8P0j96J36O2r7K5K9p6J32p3jJ03j58j6J08j51Q1O3N1r7
7026a5l3OO3p1oJ49K6k5j00R5m2K7j06R5Mj50J67K6j29q2O0J02Rl9m3J2J48j80
7054c2j5J84q8o1o5R4P1o5NO3j50J68j38J1r9J16J31p1j26J7N7m2n3L5k8J06K2
$$ y = [-67, -18, 58, -4, -101, -165, 9, -54, 39, -46, -48, -34, -6, -108, -91, 72, -58, 90, -23, 10, -131, 26, 65, 35, 42, 23, 40, 96, -33, -69, -38, 110, 9, 28, 23, 12, -65, -45, -67, 24, -54, 39, 19, -55, -47, 49, 101, -20, -27, -74, 105, -40, 79, -20, -62, 16, 18, 6, 33, -83, 55, 24, 76, 51, 43, -53, 42, -15, 87, 78, -3, 112, 66, 103, -36, -74, 34, 109, -42, -78, 33, 129, 108, -71, -12, 82, 16, 91, -49, -41, -28, 25, 113, 1, 4, 43, 127, 54, -107, 67, -119, -50, 126, 1, -44, 15, -121, 66, 3, -104, -21, 28, -50, -14, 78, -78, 24, -28, 150, 31, -48, 78, -90, -122, 65, 34, -74, 19, -145, -45, -28, -9, 128, 56, 12, -6, 28, -73, 24, 8, -10, 60, -136, 0, 62, -35, -10, 19, -57, 75, 2, 1, 104, -54, -70, 38, -113, -32, 31, 82, -15, -48, -42, 21, -50, -56, 93, 119, 94, -6, 89, 47, 74, -32, 63, 67, -83, 84, 110, -19, -101, -41, 61, 70, 31, -12, 0, 148, -32, -47, 137, 49, -12, -77, 17, 88, 23, 28, 91, -59, 109, -29, -18, -117, -1, 130, 59, -67, -50, 7, -35, -88, -53, -81, 25, 47]
7081D7lK7j02L8N0j34R7p2M3J54j55P9K6j32M3n6l3N9J26j26Q2m0l5Q5K4j48N4
7108bjK1O0j25o8K60k27Q4N7j09j5J3J1N9qm7M7K5Rq0Q6n3JL0k0j67P2J22m4J34
7138A25q5R8m0j24O1L8j32K1K5p7N1o9J33l1K8j25J74p1mQ4j30J9Jk1L7mK5k8
7166b1j8L0P0j54K6J01N1Jj09N8LK0j23J28r0R1O7j54L8n2J16p5N1p6M2N5nq7
7194a6Qm6NO8Ok8l4P0K1j48J26n1o3J32r0pQ7m0L6p8P2l4l9q5Q3J4L9J23j49J69
7224A51j64O9n5l6O0J6p5M7J10r9m6J21p9km7qN5p8k1n1K57j60k8N7J04m2l0k5
7252AO4J6k9p9k9Q8oo5M1M0j23K40j08j3m5J3O6j44j6J44r8L2M0l7L1N3j12O9
7280C4j99J23J7o8P5L6PR1j61J26k04Q0J46j23M9lj03L8M3k5J2%K6l4L4p9J8J02
$$ y = [47, 44, 71, -31, 7, 57, -77, 20, -52, -9, 145, -10, 69, 95, -37, 6, -50, -83, -24, 102, -24, 58, 18, -17, 68, 92, -56, -2, -3, 18, 78, -47, -115, 145, -82, 2, 59, -50, -65, -52, -41, 18, 10, -37, 10, 35, 44, -36, 50, -3, -2, 28, 8, -159, -87, 35, -9, 125, 40, 138, 98, -26, 35, 73, -59, -38, -13, -90, -39, -108, 25, -6, 22, -103, 71, 0, -4, 80, -50, -31, -30, -51, -14, -18, 7, -21, -39, -9, 61, -93, -67, 34, 85, 86, -23, 35, 38, 58, -65, 63, -27, 64, 131, -23, 15, -37, 79, 4, 55, -21, 21, 76, 71, -16, -8, -54, -49, 19, 25, -3, -37, 33, 54, -94, 32, -19, -82, 50, -40, -47, 40, 0, 36, -42, 30, -4, -43, -128, -45, -31, 8, 131, -18, 151, -13, 56, 1, -35, 25, 41, -34, 13, 123, 24, -22, 99, 20, 18, -29, -37, 18, -60, -81, -132, 125, -35, -63, -6, 98, 56, 26, 1, 65, 81, 52, -27, -56, 32, 26, -39, 2, 42, -81, 159, 51, 38, -7, 6, 72, -72, -88, 56, -42, -10, 30, -7, 24, 77, -35, 34, -165, -42, -25, -93, -18, 18, 25, 116, -45, 81, -123, -43, 103, -20, 29, 26, -77, -39, 4, -21, -9, -9, 17, -17, 17, -62, -44, 58]
7308E8j24R6lJ12L4n6j28k8J07p1Pj6lK5o9o7J75K8p1M8j11N9j3l7J19pj54J20
7336C0Qk7l0OQ1n8rJ8J9j78J14OK4R7l9K6o3k0o1J8Pl6O3ln2o4J91o2r3N1j2o
7368e4J16r9J1K6q3O7%J23j61J10j20J5J06j50J85r8M5k9m5Q3n1O0j43J81k06
7393a11J10J12j31l0P7k2N0j22J61Mj30MQ4Qo2Pj6j0j09J04P8l1lk0j01J20p2
7420e1K4J22k9j48J19n6O8k6O1j31M5PL8J4n9l0J9rJ9n6j28K74q1n3R9j24O6r
7448a5J3J4J1J3j0q8m4O0j1J38r5j09K01l7J7q1J1o1mK3N8p7O5L3j9j31K48j76
7476e3k0J53M3r3P2p6rO5j43J0Q1p9M4K0K9M2j2o6j5L6q3L5J1K1q7l4J07OM0q2
7506c7jr1K16l3J6j8kL3q5j03L3J76l5p9lj2M7N5k13J49pm1N0Qk0L2P5l1j07M3
$$ y = [58, -66, 30, 27, 139, 173, 117, -11, -39, 68, -3, 4, -12, -15, 10, -59, -126, 49, 77, 6, 54, -57, 2, -11, -48, 71, 64, -90, 30, 38, 11, -19, -13, 68, 10, 1, 19, 38, -140, -26, -20, 4, 101, 62, 88, 25, 5, -56, -38, -31, -67, -4, -7, -59, -123, 68, 6, -87, -36, -48, -54, 62, -37, -26, 0, -83, -16, -16, 107, -54, 56, -64, -49, 57, -93, 92, -6, 39, 10, -35, 48, -3, 57, -86, 95, -111, -1, 111, -20, -50, 27, 5, 55, -67, 94, 98, -32, -28, 56, 64, 2, 9, -7, -17, -126, -22, 56, 25, 22, 2, -99, 21, -51, -27, 95, 66, -82, 37, -19, 49, 23, 84, -47, -2, 5, 43, 57, -2, -32, -13, -22, -3, -59, -187, 87, 6, -47, 52, -72, -6, -15, -2, 12, 23, 36, 26, -62, -106, -46, -57, 81, -14, -123, 78, 41, 58, -23, -12, -73, -77, -54, 4, -73, -8, 25, 6, -125, 123, -53, -73, 80, 123, 30, 102, 26, 17, 82, -61, -51, 30, -49, -5, 15, 44, 86, 74, 8, -7, 29, -54, -19, -8, 13, -74, -108, -1, 5, 45, -37, -38, -129, 87, 54, 70, 52, 50, 83, -2, -105, -72, 104, 69, -10, -13, -25, 22, 77, -136, 13, 6, -35, 15, 23, 3, 35, 110, 79, -28, 15]
7536A5L6r3k4J75K1j70m0L4r8MK59j31k8J3R0J1m6n1llJK6k5n9P5L9l3o0O3k1
7566b3pl6Q4O7p4l0o2J68J5j27Q1j29M1OM7m8N4l1k7J8k9Q1N9o4o3JJ06k6n4J10
7596A08j31J08r1R4j8j01L6J05o3o7N4m0QpM6j5Nm6rJ27j71J42m8K8M2j4j54l2
7624a04J50Jl5j31J19p5M0M7o4jJ21j23Q6J14q8m6J2lL7n7l4O3m5K1R5o9p2N4
7652A3o1P4k0O6j6q6J46j28n1P3N8j05J4L3q4J64j31j7J22j44Q0p3k4P0j0k5J00
7679C8J2j17J47p8J7o6o8J36k1Q5r4P9pM0m9j71K51p4J6rr2p1R2L5l6p4K22k17
7707g4lO7Kj4J50j49k0M8pn0N7J4l5p0P6J10j53m8J15Q3j68J10Pl0m5K8k1J60
7735A40j40n9O5K4p9q2R6P7lr8J27j29N6m1MoK0j2k2M6O7m9Nk9M4j18J44q1JK7
$$ y = [15, 51, -42, -66, 109, 130, -40, -80, -46, -144, -140, 119, -12, -40, -27, 63, 74, 28, -23, -26, -29, -28, -2, -27, -86, -11, 28, -5, -65, -2, -23, -30, -66, 18, 85, 11, -19, -81, 87, 102, -25, 56, -73, -32, -26, 21, -27, 27, -4, -31, -13, -42, 39, 98, 34, -29, -28, 78, 52, -2, 108, -23, 85, -6, 88, 70, -31, 5, 110, 47, -20, 34, -6, 2, -5, 41, 26, 31, -15, -24, 103, -68, 74, 26, 54, 96, 82, -72, -104, 46, 47, 12, -119, 0, -75, -35, 12, -52, -53, 68, -55, 31, 145, 57, 11, 23, 20, 57, 0, -34, 29, -16, 5, 100, 31, -41, 13, -48, 26, 6, 72, 56, -30, 116, -12, -63, 10, 68, -37, -23, 10, -74, 90, -41, -58, 64, -80, 0, -73, -97, -27, -37, -62, 38, 50, -67, 80, 2, 19, -47, -115, 21, 0, 85, -9, 70, 63, 103, 54, -117, 134, 60, 76, 67, -25, -96, -4, 31, -5, -79, 143, -74, -77, -10, -8, -22, 128, -21, -41, 7, 0, -50, 7, 21, -14, -84, -8, 102, -51, -99, 16, 99, -69, 41, 48, 18, -27, 1, -20, 140, 0, -59, 6, 30, -49, -131, -35, 42, 39, -59, 68, -61, -5, -46, -42, -48, -28, -40, -62, -16, 51, 2, 7, -22, 22, -96, 48, -33, -32, -5]
7765eJ5%l3J18l2k7L8j71Q0%J31r1j8L2j8Nn7O7k8O9o9N7M1j04m8k3k9J17p0K2
7795c1J9m0j62K75L7k07J53J62k29P7M8q8NJ65k09l4R0L7r3n7J24J3pk9r6J8K12
7822A53j91N5L0kq1J4O6J14k22M0L5O6n5q3k8J06k6J2N5p7jk5L3r3J25k0m2K00
7850A58j78N4J8j0L4j51J11l9mR2j01j7J26p7k1L5n0n0on3P6oJ09K2j27N6M0m2
7878aK6k26J68M8L7o7n3J22j13N7q1L0J22q9J08j33M2J7o6R6j7Nj21L0Q0j1N1
7905F1k2j23J59j17Q9j6K8o7j2J52j72N7n4k7P2o2P9l9j0K5J25p9k5N7j27J48
7931A00j34N9L0L2j1j17l0L4N1Q9r8O4k0j03J82k45J43p4J14j00Q0N2j23k6j7
7956f8K8N4Q0j38J3N8n5l4J30Jj35J7O9m8J21N4p3o2O0j21K5Oln7R4m8J32k20
$$ y = [-5, 10, 10, -23, 95, 63, 36, 74, -97, -17, -17, 114, 23, 5, 37, 19, 24, -33, 34, 6, 75, 6, 63, 104, 0, -48, -71, -100, 17, -53, -31, -12, -52, -214, 61, 98, -109, 44, 206, -23, 54, 102, 14, 19, 184, -25, -59, 31, 68, -25, -82, 42, 55, 48, 19, -77, -59, 153, -38, 17, 47, 45, -36, -22, 44, 158, -64, -24, 11, 77, 22, -61, -89, 17, -9, 3, 58, -19, -20, -45, -12, -105, 20, 0, -42, 158, -20, 34, 52, 42, 76, -75, 36, -3, -7, 85, -16, -33, 93, 16, -5, 30, -20, -70, -76, -129, -53, -59, 50, 72, -55, 1, 41, -1, 25, -201, -33, 15, 52, -15, -68, 54, -59, -2, -83, -53, 69, -20, 88, -45, -3, 14, -52, 44, 27, 32, -89, -59, 21, 10, 61, 39, -84, 75, -42, 47, 31, 59, -8, -20, 132, -40, 17, -37, -64, 8, -54, 25, -14, -24, 1, 126, 47, 22, 79, -48, 100, -34, 25, 55, 87, 76, -41, -71, -37, 14, 103, 5, 69, 49, -54, 128, -117, 26, -48, 66, -34, 46, 98, -25, -51, -68, -40, 14, 94, -44, -31, 27, -28, -62, 68, 69, -66, -49, 20, -28, 93, 147, 74, 12, 72, -49, -24, -18, -21, -78, 16, -32, 100, -120]
7984a20kJ51m5J03j73K58j63j1r6K23p7k6k6q1J53r0Q7j92J26N1j06M8lM4n7l4
8010e8n2KJ25jj4Op9J43k6m4J2M7n7MJ15n4j11R4M7j61R0l4m0L0R7j09M5o0N8
8039A5j16J20Nn2N5p1Q3k7m1O6M7j08Rk8J27j18j00J13JO8r0R6Jk07J92l4M0j12
8067f6P2J1O5j37J79j37j0P4l3M9o6o6O1K13k30r8Q4J01j31Q2r1J39j22M3j6k6
8093e6J05j49J48o0l9J26p1M8n1M2N5j10r3J18q2P2J09n7J6l2N8L1j20j4Q2j11
8119c5j2J75j00p3J3l7L6R1jj7j12J4KJ23q3J6r8P9p7J76j26k1Q0L1P1j25NP3
8147F8k6L7n3j73K93k66J99l6P3j01o6J6J38j19N4K0m7M7j55J19l9Q4j22M1Q4
8172G0L2o1Kj15J4P9O0j26J45L3j08n7n5M5O2PL3j52O7
$$ y = [-120, -122, 29, -16, 87, -86, 172, 9, -2, -98, 125, 48, 22, -4, -85, 68, -22, 65, -127, -1, 50, -56, -8, -11, 33, -24, -58, -110, -108, 17, 16, 2, 8, -71, 72, 46, 2, 14, 61, 4, 8, 123, 69, -42, 52, 99, -62, 28, -6, -46, -16, 81, -28, 17, -43, 15, -101, 19, 24, -28, 27, -44, 39, 12, -29, 37, 84, -24, -15, -43, 84, -34, -134, -21, -20, 48, -42, 54, 55, -152, 40, 6, 46, -66, 6, 17, 82, -55, 124, -13, -23, 51, 18, 67, 1, -65, -4, 209, -21, -119, -35, 66, -65, 17, -74, 65, -57, -14, -30, -56, 49, -100, 48, -12, -51, 75, 4, 52, 1, 43, 98, -12, -105, 13, -69, 3, 112, 55, 71, 39, 97, 128, 8, -6, 76, -35, -47, 128, 28, -45, -32, -69, -33, 58, 57, 40, -72, -58, -56, 67, -16, 0, -98, -19, -96, 80, -46, -67, 13, 44, 115, -10, -5, 68, 42, 79, 26, -147, 146, -120, 79, 43, 116, 15, -51, -35, 103, -16, 38, 58, 11, 58, -97, 22, -17, 67, -55, -14, 70, 102, 41, 43, -72, -58, 21, 81, -45, 100, 133, 25, -32, -87, -42, 20, 27, 60, -92, -25]
8191b5
$$ Imaginary data points
##PAGE= N=2
##DATA TABLE= (X++(I..I)), XYDATA
0@%%%%%%%%%%%Qj6J6j6J6k4L2m0M8n6O5p4Q9j05J25j48J71j96K26k60L00l40L82
34B03m32M89n52O17o89P69q58R55j060J175j301J439j588J752j930K125k342K579
52A351k842L138l466L833m252M730n281N929o702P643q818J0333j2369J5274j9789
67a1288K7844m6673J77141J41262j40798m2470j27847o4494o3531k7355J1231
78a66978K0660J4230P3179K6823M4655O3522J7451O510O785m7011k8415n1597
90b0186n1754J5742J3263l855K7221o735m295J893k8572J0367L0117J793L8505
103B3504K6192k564J9177o408j2689J1739j6714j198k240n6423l0283j3794l1597
116i3298J2896K0480J9720M9938J5415N380K2156j1578K861J3963j4865J0452
$$ y = [0, 0, 0, 0, 0, 0, 0, 0, 0, 0, 0, 0, 8, -8, 8, -8, 8, -16, 16, -24, 24, -32, 33, -41, 48, -57, 68, -80, 91, -105, 121, -139, 161, -179, 203, -229, 260, -292, 325, -364, 405, -453, 502, -558, 617, -684, 755, -833, 919, -1011, 1114, -1228, 1351, -1491, 1647, -1819, 2014, -2238, 2492, -2789, 3140, -3562, 4081, -4737, 5596, -6773, 8501, -11288, 16556, -30117, 147024, 288286, 147488, 105018, -22829, -87323, -150854, -178209, -166978, -146318, -132088, -58909, -32086, 12569, 76091, 93542, 100052, 106837, 59826, 31411, -20186, -71940, -56198, -42935, -46790, -19569, -26304, -30599, -28706, -57278, -46911, -16794, -15001, 23504, 49696, 47132, 66309, 59901, 47212, 58951, 42237, 41039, 38799, -17624, -47907, -61701, -93298, -80402, -59922, -40202, 9736, 25151, 30531, 52687, 41109, 43970, 57933, 43068, 53520]
128E3520l445m2158j8988l3979l3398J3315N68R455L2626M258J7846J8347j0987
141F980K1485J7710j0113R833j4453k9983j4250l9538j6082K0135M204K8584L1842
154A6354r66J6060L166j4193J2322o420p769J4709j8784j6301J48k0299J617R732
168a0624Q8K7863L085k2197K117j8535j7589J3166q67J3025K0675o121J0789J741
182A6616k0327J1585K742r376J3893o996j1066k029k4941J171J8357k974J9640
195F295J4501r871N458j1809j4973J1115p771K255K0033q972k56L366j6796M292
209c133K261k995K0541m962j4586O545j4739p426J1980j959J4909J1991j1226
222G201O087p348k0401O004m051j350J7504m615J253N425j7030N181R319p502
$$ y = [53520, 50075, 7917, -11071, -45050, -78448, -65133, -64565, -55110, -22484, -18226, -380, 17967, 6980, 28465, 46175, 36062, 45895, 31442, 1459, -12791, -52329, -68411, -48276, -44072, -15488, 16354, 15388, 31448, 34614, 20421, 32743, 26323, 18554, 33263, 14479, -1822, -1674, -21973, -20356, -10624, -10536, 17327, 20412, -1785, 332, -18203, -35792, -22626, -23493, -10468, 10207, 4086, 14875, 16616, -3711, 7874, 10616, 1240, 15133, 8137, -2929, -4958, -29899, -28728, -10371, -13345, 6295, 20796, 10925, 16383, 4574, -10399, 716, -7055, -4800, 15233, 6261, 6005, 9371, -7425, -3133, -872, -3867, 16674, 11712, -2874, 3671, -11068, -18494, -6514, -8473, 6436, 18427, 7201, 13288, 5940, -14461, -8457, -12508, -13858, 3646, -969, 284, 5709, -11321, -6140, 3179, -4323]
236d323J2072J705r471M507j4283o305J4649m996Q877J8939o085K629m164j7876
250d125L114o265n822J6517n452m646R558j0712N37P611o195J2824L699j2380
264a737O899p329j2511Q454k348O732J5418o720M134J945j8308K245Q94q041J0653
279C80o49k566Q217j1253o99J0300q344O981R046p973M009n499j1082Q078m668
294e722r54J4472n504n87M162j2604K057J480p610J2991K718n912R827n734n732
309b652O024p601M752P106j0898N053Q04j2299O373O88j663J2068l211P17O771
324A2032j3259j185L761j0208N479K879n693P884n024m490J0873m919Q17J0884
338I831n549J618J37j0856M382k841p598J1528l11l582Q955n163m94L961q115
$$ y = [-4323, 7749, 9454, -17, 4490, -9793, -16098, -1449, -6445, 2432, 21371, 15286, 17915, 13751, -4125, -1011, -7276, -13098, 3419, -2033, -6679, 2879, -7833, -7296, 315, -5880, 6944, 10643, -1737, 5162, -2167, -14678, -6224, -8572, -1840, 13578, 6858, 10992, 12937, -5371, -3126, -2232, -10273, 380, -269, -2835, 5382, -5871, -6570, 3730, -4614, 2367, 11413, 3440, 7449, 1950, -9132, -1054, -5722, -6676, 7796, 2292, 1705, 5867, -6737, -4680, -3200, -10810, 2181, 4899, -1013, 8814, 3080, -2652, 3372, -4229, 523, 7629, -3269, 1784, 2588, -9711, -3338, -2650, -4313, 7755, 4544, 5261, 12032, -1227, -2412, 1349, -8859, -3380, -501, -6194, 1690, -3334, -7824, 3049, -1870, -1053, 9831, 4282, 5900, 6037, -4819, -437, -3278, -10876, 652, 341, -3241, 5714, 551, 57, 4018, -4097]
353d097N566K228r994O614n34p681P583r13J480J0108n224L042M648j2743J39
368B22l57j0052M639j879l052R437m420O57J0473n160L010O748o328L566j698
383E806q364N921n248n833Q303n015j958N748o121L267L978n559Q871K868m625
398B039Q395k660n106L484q683k343K849r353L078M823m902P906L145j600P927
413H999m305k961N430r039j999M351o523M241M201k496Q827j003m222O140p576
428B065o923K181q446j17M451k884R978N677k635R238j078o639K338q665n386
443f845Q1r501K639N185m048R914P720L13R214o41l028K509j0266l766K251r283
459g552P48L494m968M521Q2k554P346k649p93Q310m009J14M261n125L164J346
$$ y = [-4097, 1469, 3697, -6297, 317, -217, -7898, -315, -1228, 252, 10360, 5136, 8178, 12826, 83, 222, -135, -10187, -5548, -7427, -10479, -1042, -5462, -4805, 5668, 508, 3518, 10266, 3938, 7504, 5806, -2558, 3363, -1885, -7718, 585, -4430, -6388, -640, -6761, -3494, 484, -5075, 3796, 6664, 2039, 10434, 7774, 2668, 6152, -2531, -4874, -2025, -11378, -8300, -3477, -8379, -473, 2672, 1072, 8999, 4694, 1733, 7163, -1876, -3875, 476, -6047, -1806, 2395, -101, 8726, 7723, 3501, 9641, 2065, -4858, -2677, -11123, -11240, -6789, -9673, 305, 5982, 3347, 12585, 11507, 4868, 7206, -1459, -6845, -6764, -16265, -13626, -8441, -12489, -2575, 5145, 5458, 14672, 14031, 11003, 13512, 3246, -520, 1731, -7552, -6804, -3310, -8278, -3757, -3675, -6229, 1117, -1532, -2325, 5985, 1976, 2090, 6351, 1226, 4390, 5736]
475E736n269N459k555p008L938n005l269N060l061M237N640m845M775Q12p249
490b604L628j423l373N269m198o95M308o637J958M376m831M551J615m004M886
505B826l059k575O957k446J600O643m340O03p07p724K716j582m603O980j282k383
521b376N006m016k54K737n256L840J655o457L446j253m775M956m19J949O846l793
537A836J375K526p761J260J502l634N305q0j710M634n599k643L941n824Q97L644
553c31l855K993j31l010P338O08R3Q398k559k630K20q667k526j490o035N809K135
570c640j690P547L81p81N078k428R51K242p888j228k497q959J588L85k84Q658
586b565J995K774O653l980j22K461n251J716M79m859K729l161l823N337j693P05
$$ y = [5736, 467, 5926, 3371, -3637, 301, -4704, -7973, -2913, -5974, -1737, 3903, -942, 3833, 4645, -2604, 1024, -399, -3772, 1497, -2701, -3396, 912, -5725, -3767, 609, -4222, 329, 1944, -2060, 2826, -233, -2808, 4149, 1703, 3303, 9946, 5606, 6209, 5502, -2222, 494, -1088, -5691, 1289, 7, -2376, 2630, -1386, -1640, 1097, -4159, -319, 1336, -5121, -1675, -2928, -7703, -2747, -3166, -1217, 5629, 1836, 3211, 5737, -2024, -764, 738, -2896, 2409, 2329, 619, 5253, -346, -2989, 952, -4872, -3975, -331, -4186, -1193, -1324, -4334, 3004, 3612, 3705, 12103, 9544, 6914, 7134, -1533, -4059, -5549, -11584, -5775, -3640, -5330, 2217, 2598, 1817, 6895, 4467, 5418, 7660, -228, -1456, -3953, -12912, -11324, -10939, -11223, -2565, -570, 2204, 8857, 4877, 4755, 7216, 1965, 3681, 4160, -699, 2030, -1131, -4954, 383, -1310, -605]
602f05O521k405N53L90o716J041j032l926O063P08j656M309l758j398K352m770
618d329K263K573m792K577k46m207L766k66J560O980j441J663L013o568j019j1
634A516m735K641o63k508L699l786j956M817k441K257N504j614K916j07n247J964
650B257k218l279M786j554r17K537m259P63J880l414M434K324l303L126k302m249
666c388J531l295Q60M899k222L076K623m542J824m6k763M083j649j913L113m871
682b680j319K714k864L459L669j483M321j026m433K280l146k340L942k264N12
697f58J692m446J807O37l167M718J235j765L423k749j826J778m025J729L669k945
713h93K782N83l910J825j894r33M410j904K27L518m346l27J246l188L009Q00j641
$$ y = [-605, 5916, 3511, 4064, 4454, -2262, -1221, -2253, -6179, -116, 592, -1064, 3245, -513, -1911, 441, -4329, -2066, 507, -4285, -1708, -1954, -6161, -2395, -2661, -1101, 5879, 4438, 6101, 9114, 2546, 1527, 1516, -3219, -578, -1241, -3749, -50, -3836, -5792, -975, -3416, -1159, 4345, 2731, 5647, 5540, 293, 2257, 39, -3240, 1546, -8, -925, 1612, -2647, -1884, -4, -3418, 1016, 3340, 37, 3163, 861, -3388, -1857, -5152, -4292, 607, -1615, 1461, 4084, -458, 1366, 1320, -1443, 2640, 991, -922, 2191, -2680, -3999, -1285, -4149, -690, 2979, 1496, 5817, 4791, 358, 2638, -508, -2848, 1094, -1170, -658, 1034, -3412, -1605, -968, -4135, 583, 1818, 53, 3476, 727, -1099, 679, -3346, -1617, 2052, -893, 1889, 2472, -1438, 387, -1507, -2440, 1970, 66, 293, 3811, -535, -862, 384, -2804, 205, 1005, -636]
730f36L921k603l155K811l338l42L499j939K455J192l518L014n08k704M789m62
746B476j119K506m112j037O75m666K681K385k189L998L06k033K653k261q9L606
762C780l036R10J929m604L42k82k984L480m38j083M079k846j461K261l150J373
778a730K469j875L303J68l423K623j849k264L556j683M75K537l472J130J039l422
794b418L263J086j860L212k075j572J991l608N63L359k779K240J464l100J758
809A524j679k275L395j938o72L319l148l35J447k908K194Q91j965L596r15k553
825b022K940j903o45K984j773K055J445l479J685j32l533K788k95j053L040k093
841IL15K145l527J506J953k863K037q1k778J866k225j021L417j945R64K875k813
$$ y = [-636, 3285, 682, -2473, 338, -3000, -3342, 157, -1782, 673, 1865, -1653, 1361, 853, -1851, 2938, 2476, 1357, 3863, -249, -1286, -611, -5277, -2596, -211, -2400, 1598, 1904, -129, 2524, 263, 174, 3780, 744, 1654, 3583, -1021, -679, -961, -3945, -465, -903, -1986, 2093, -753, -2214, 47, -3103, -1730, 739, -1136, 2167, 2335, -1088, 1535, -314, -2578, 978, -705, -230, 2307, -1165, -35, 1004, -2418, 845, 1931, 71, 3283, 1208, -364, 1627, -1981, -1418, 1941, -838, 1402, 2866, -234, 1524, -155, -2430, 965, -973, -1645, 1674, -1474, -1809, -362, -3270, -1076, -185, -2150, 1446, 531, -2022, 918, -985, -1630, 1354, -419, 1636, 3081, -398, 1287, 1155, -2378, 410, 115, -938, 2102, 9, 324, 2469, -1058, 448, 2401, -462, 1575, 1494, -1284, 582, -1643, -2664, 753, -1192, -228, 2647, -166]
858a66Q68L17l241K207r01j945L254j863j276K707k336J081K456j923K828Q44
874B911k798K219j137k690K422j796j87K363k771Q25J628l121K297J078j529K715
890B429p17j420K344k996l64K526k734J137J318k597J573n00k282K859j330j209
906a963K916k121n00J693k635J658J099k128L375Qk305K614j610j269K069k327
922a426P49J747k786J882R62k356K770J13j042K690j811o44J694l684P7J500k748
939b313J659Q45j730K761q51q41K965j885m64J993k895k6K50k953J826j32j726
956c517L368n08o21K946j684K97J742k535J435P95k834J997k46j906K450j038
972A41l64K504k439L38J581l250J080O44k029K196k67j111K886j585k53K503k337
$$ y = [-166, 702, 1019, -2222, -15, -916, -2861, 393, -1470, -2746, -39, -2375, -1294, 1162, -761, 2067, 2911, 113, 2332, 1195, -1495, 927, -869, -1056, 1307, -1464, -639, 989, -2132, 165, 1243, -286, 2429, 1712, 292, 2636, -360, -724, 1802, -932, 205, 1523, -1074, 499, -1, -2283, 576, -754, -1963, 953, -1168, -1668, 25, -2610, -952, 147, -1981, 1394, 1402, -903, 1711, 101, -1168, 901, -1426, -677, 1070, -1716, 166, 1128, -1228, 1542, 1655, 613, 3303, 1492, 848, 2542, -1142, -1065, 435, -2313, -654, 191, -1539, 1222, 371, -470, 2495, 610, 146, 2139, -756, -782, -532, -3485, -1659, -1791, -3517, -149, -657, -1278, 1668, -16, 281, 2023, -512, 923, 1718, -1116, 881, 635, -1271, 1179, 141, -223, 2281, -158, 180, 1761, -1489, -409, 235, -1794, 402, 135, -976, 1910, 325, 72, 2575, 238]
989B38L50J000k807J215n12k544K426r88j122L098j211K11K190j873J279R84k465
1006e31K075o9k489K048j233j087J882j870L71J850k559J397J197k451J926j14
1022C43j231K322j280m07K238k236K04J675k495J076N20k131J897p50j464K640
1038I21j604l61K324j813P62J095k133J655J26k181K272p54j488J973j471k10
1054h87J711k066J148J240k294J801J43j720K079j064j032K030k053o2J740k282
1070a568Q75J009j841K028k12j127K468j138p73K256j859p1J513k225J114K06
1086F55k096K036n85j636K127j134m49K048j976J018J294k244J905M51k094J903
1102A223n52j319J727j809n6J528k400O75J276j858J439K87j269K175q18o26K406
$$ y = [238, 588, 1588, -1219, -4, -516, -3060, -634, -1622, -2744, 354, -857, -646, 1544, -329, 950, 1934, -531, 1544, 1475, -1014, 1034, -199, -1286, 596, -1274, -903, 947, -1612, -215, 982, -1469, 457, 343, -888, 1434, 154, -253, 1985, -251, -47, 1628, -867, 209, 729, -1402, 495, -255, -1719, 921, -683, -1044, 1280, -533, 229, 1324, -809, 846, 972, -1209, 1063, 309, -1179, 794, -677, -887, 824, -1242, -94, 1146, -1148, 653, 796, -924, 1155, 91, -941, 1089, -964, -1026, 714, -1568, -693, 316, -1525, 503, 291, -836, 1632, 494, -279, 1977, 118, 47, 1560, -665, 449, 655, -1441, 595, 10, -1626, 501, -633, -1082, 966, -1010, 8, 1302, -942, 963, 1414, -680, 1223, 671, -648, 1079, -730, -786, 742, -1658, -983, 293, -1565, -126, 161, -1108, 1067, 249, -377, 2029]
1119B029j849k27J722k026N88O41k260J656m41j706K130q06r64K051j312N14J393
1136A133j716J589N44j975J921l13j619J812j490n93J645k097M96J174k016J149
1152c56N16j543J927o76q34K207j433j72J921j932P15P87k117J371k28j480J808
1169D81p48r31K025j319PJ712j766J136M34j908J527k48j631J657q07n85J713
1186G49j488M41J563j991J198O36j886J472m29j086J692j401k23J902j900M44
1202c07J363j824J026L04j505J619p78j039J960j135k58J712j553N77Q99j787
1218g26J259j51j672J679p47j053J689j304L23J377j481J114J009j771J566pj398
1235b94J509j121p29J498j722L72J197j848J024P26j593J588l22j036J751j249
$$ y = [2029, 180, -47, 1675, -351, 237, 878, -1382, 274, -167, -1873, 257, -549, -1513, 538, -774, -260, 1133, -583, 1006, 1550, -425, 1496, 1183, -436, 1376, -114, -707, 938, -1159, -663, 511, -1505, -356, 160, -1383, 544, -132, -966, 1241, -192, -364, 1557, -375, 340, 1127, -990, 381, 153, -1327, 481, -267, -1198, 827, -492, -485, 1227, -539, 597, 1031, -877, 650, 402, -1229, 428, -379, -964, 749, -739, -298, 1265, -726, 472, 1108, -778, 694, 265, -821, 871, -530, -753, 1149, -751, -307, 1056, -768, 258, 562, -943, 676, -102, -1141, 819, -316, -574, 1138, -415, 162, 1061, -726, 533, 382, -1290, 389, -358, -1411, 278, -1026, -703, 674, -807, 307, 1316, -455, 1111, 1104, -294, 1215, 94, -635, 863, -859, -487, 710, -1138, -114, 612, -981, 607, 285, -751, 1000, -249]
1251b49l79J656j668L90J193j635J123K41j559J682o91j116J639j218m94J263
1267A78j430M71R52j480J438M56j068J616n53n14J571j520r2J248j767M76O17
1284E99j701J239k51j086J839r92l48J869j497O2J320j563Q22M05j458J525l38
1301D46j342J609r95o25J242j383K82P60j610J300L00j268J617j24o93J672r95
1318A93j2J308j611M76P82j969J118nj362J445n04m88J697j180J44J289j555N16
1336B82N80j510J025j87j172J621r36n74J626j354Q9J122j481Q63L13j428J364
1353B43j60j123J571q64k42J183j280M81P79j490J214K55j127J253k24o23J265
1370A111j042j02J239j625L38P14j453J009J39r54J421n43o74J518j136l16R92
$$ y = [-249, -628, 1028, -640, -250, 943, -692, 431, 672, -887, 795, 104, -1012, 627, -591, -1085, 178, -1252, -781, 171, -1309, 129, 585, -483, 1133, 580, 66, 1637, 117, 25, 1273, -494, -18, 599, -1102, 137, -114, -1200, 639, -353, -701, 1168, -329, -267, 1053, -510, 312, 717, -741, 784, 446, -896, 713, -282, -907, 335, -1048, -766, -6, -1616, -316, -16, -1284, 333, 209, -484, 1188, 193, 181, 1489, -122, 354, 1136, -833, 285, 280, -1082, 363, -141, -629, 1068, -112, 32, 1321, -234, 282, 862, -648, 377, 190, -982, 639, -297, -871, 755, -599, -510, 612, -869, -6, 307, -1121, 243, 83, -1040, 531, -333, -575, 608, -672, -191, 588, -902, 312, 567, -560, 693, 469, -154, 1111, 69, -33, 1206, -419, -81, 633, -820, 189, 328, -626, 795, 252, -422, 1096, -40, -356, 636]
1387F36j409M02N60j506J355K1j013J421k75p27J256j079mR61j588Q06M07j396
1405a172J287P3q76J417n72k11J238j198L24R29j303O90L90j458J070o17q82J238
1423C67j341k73J193j075N35R44r35J327K47r24J394o26r78J057j250l94Q37j307
1441a202N25N90j086J180O5p55J236m82m18R13j019K54Q27j138Q51N96j119R14
1459G32j78j036R86q51o75J251j120L09J164j157J155M45q27J106n84r15R75j157
1477c77o02P88j273N65R36r63J176L25r77J418n71p98R65j004j96Q43j300P07
1495c38N51q88J289O6n76R79n65n46R95j236k00Q37j310P23M49j041J049j57o34
1514e53J166o33l91R61j104K53N91j005Q41K81q54J217j64p15J006o60m05R02
$$ y = [636, -773, -371, 189, -1317, 38, 59, -954, 467, 192, -535, 721, -358, -362, 599, -989, -183, 224, -1172, 115, 188, -688, 729, 157, -54, 1184, -14, 310, 1239, -64, 626, 1016, -442, 628, 11, -871, 367, -974, -1247, -54, -1129, -594, 350, -585, 742, 989, 65, 1459, 833, -145, 912, -338, -732, 105, -1202, -677, -87, -1173, 7, 72, -683, 553, 71, -347, 566, -453, -199, 628, -510, 341, 937, -182, 732, 554, -482, 504, -347, -1022, 229, -891, -582, 582, -575, 580, 1025, 198, 1304, 720, -195, 780, -377, -979, -191, -1464, -899, 37, -926, 250, 575, -402, 1016, 445, -353, 612, -392, -588, 255, -1045, -338, 213, -675, 614, 680, 104, 1083, 518, -28, 967, -269, -469, 368, -942, -219, 230, -811, 238, 81, -553, 613, -20, -411, 550, -554, -301, 290, -715, 126, 407, -447, 770, 606, -109, 897, 237, -168, 734]
1532G34j138J50M78j429Q43L9q34J149k17q9J234n94L8Q27j120M40L23j216N96
1551B14j40r42R77o57k61J164p40J31R43j002N73J07r22J057j74p31J046m36n07
1570c00Q72r00P2N09r89M68K50j052R81j21l33J188l28M4R63r02K58K61j278M79
1590A42j12r41P88m50n30J098n75J7J156p00L67M83r72P50j91q80R70n99m77R72
1610C16q49p5P71o84N69M72p07R91K0r22J035p36m49P51r97Q8M66j027M13M61
1630i3q10J035L6l08J051o18m00Q94r14R5O31j006N60J20q87R05n46l14P55o95
1650e09n9P47p74L81O86q81R81J16o42R36m28o67O40j040j22O94r36M89N39p94
1670f43Q45q0m12J023n45l16Q97q13J27N56r59M86J93q89Q63l04o77P48p74o1
$$ y = [734, -404, -254, 224, -1205, -362, -323, -1157, -8, -225, -314, 920, 326, 364, 1191, 71, 511, 834, -382, 214, 74, -868, 109, -548, -809, 355, -385, -254, 689, -313, 260, 367, -555, 502, 328, -403, 643, 207, -300, 572, -328, -256, 253, -736, -268, -18, -1070, -89, -210, -543, 645, 317, 361, 1324, 422, 680, 941, -337, 142, 30, -911, -123, -573, -1103, -5, -580, -563, 593, -107, 260, 743, -229, 521, 330, -550, 420, -179, -656, 316, -533, -608, 163, -521, 48, 520, -187, 804, 824, -98, 937, 201, -248, 503, -494, -406, 60, -967, -554, -93, -903, 132, 168, -140, 911, 293, -107, 787, -127, -32, 599, -407, 153, 273, -614, 291, -255, -569, 186, -509, -568, 179, -595, -214, 472, -409, 572, 688, 46, 982, 554, -113, 527, -513, -635, 59, -877, -388, 151, -643, 202, 122, -290, 733, 188, -128, 769, -44, 83, 639, -320, 166, 359, -530, 333, 29, -648, 100, -674, -735]
1690g35Q48o01K22P41o72P38K87r19P57l32p43P57p31k13O50q52L92N50n20P16
1710C40J96o02P02l53n06P14q91j48N96p33L21N77o83P95L16o38R81n19l69N80
1730F76j040j00N45r95M71L82p47J074j08l88R52n82k43P05p93J87K59q76N20
1749a01L08n40Q24l17k53P58p78j39M97q54L9M67q15Q02K06m74J009j30k89Q66
1769A086o73j25L88j077J31L4r96O77K9m85J049r9J05Q42m39J92M63q55Q3Jj101
1790g70L77k11n66Q13j29J20R48l43L52N16q48K75k09p83L39n16m83P61l93K42
1810e08J056o21N83N34q64N51k21r33M37l77m60Q76l81J58Q36o01K46L01p69L19
1830A62l10o34O92m02j85Q38k88K63P22n53M60J22q60K13k56p21M36n15j05P80
$$ y = [-735, 113, -488, -266, 475, -197, 541, 828, -91, 666, 334, -409, 348, -383, -596, 54, -798, -406, 144, -376, 340, 536, -66, 636, 283, -223, 491, -400, -548, 48, -685, -364, 213, -470, 325, 641, 3, 984, 465, 96, 676, -364, -464, 81, -914, -443, -61, -808, 266, 158, -230, 722, 140, -103, 602, -191, -4, 255, -621, -101, 207, -333, 491, 174, -79, 679, -99, -238, 259, -595, -556, -89, -904, -102, 104, -370, 639, 509, 220, 1086, 413, 288, 676, -401, -270, -236, -1232, -555, -526, -1011, 38, -61, 44, 886, 447, 639, 1102, 247, 330, 331, -770, -393, -604, -1170, -357, -486, -366, 582, 239, 591, 1107, 259, 534, 325, -458, -119, -635, -1118, -357, -750, -508, 548, -73, 510, 1044, 180, 731, 510, -423, 14, -363, -823, 53, -328, -170, 666, 65, 311, 612, -157, 162, -148, -782, -90, -492, -677, 161, -127, 136, 858, 305, 765, 887, 27, 240, -16, -737, -301, -816, -921, -141]
1850a41m30M02O47o09P98J78p36Q25n95n55N77o59k19N00n58K26M24n90N51J08
1870A44n21P66j77k21O78p70J5M77r07K98L42o14P14J05l77L64l20k32P24o72
1890a84m9N83r12L19K04n37O60M6l06Q10l49k60N19q72J71M08p87O01J63o41O14
1911B01j31m00P73k83j67N21q18k2J40p15N11K63m22Q58n5l22P27n82P2L30n79
1932a00JJ83q03N62Pn68R46k43j00P87n86K7K64r93L17L87n13P97N0m60P78o46
1954I4k19N11p61k3L58p64M18K10m52R00O9r9Q38n18k41L17j024O7K68n90N34
1975a07L35n98P44m15k82O59n51p5M50p47J15M68n73P01K70k63Q09m46m26K64
1995C32r66j53L99o00O96N27l78Q45k3m29N27m83l23M88q71l11L48p97O78K25
$$ y = [-141, -571, -169, 478, -131, 667, 845, 109, 934, 339, -216, 361, -298, -517, -17, -575, -349, 75, -515, 36, 144, -377, 389, 212, -9, 669, -101, -86, 391, -516, -218, 124, -490, 224, 329, -48, 316, -4, -236, 488, -184, -233, 350, -562, -243, -39, -576, 84, 130, -176, 634, 285, 25, 544, -328, -157, 251, -536, 65, 228, -413, 201, 70, -330, 443, 160, -7, 514, -304, -326, -186, -901, -390, -127, -549, 309, 254, -68, 659, 77, 149, 479, -100, -99, 84, -719, -157, -150, -718, 228, -15, -115, 672, 86, 113, 377, -616, -299, 88, -425, 372, 422, -38, 740, 94, -125, 386, -375, -398, -40, -804, -386, -176, -628, 272, 341, 242, 1080, 562, 321, 638, -386, -319, -51, -641, -107, 228, -370, 374, -41, -323, 336, -215, -290, 160, -587, -472, -4, -577, 124, 394, 131, 940, 494, 68, 332, -634, -787, -388, -988, -292, 235, -143, 702, 679, 250, 777, 294, -29, 459, -412, -723, -375, -1172, -494, -269]
2015b69n7Q99K1k36M41n99k81K00n06J47M86o53K68P9o58P58l13j84Q49k85nM14
2037E16o42L77K69m71O97j91o73K08m81n27M73m24K85P50o06O56J46l35M41j32
2057C36j39N42m20k11L00r43K89K09n15N68j07m18N53j98m12P56k27J66P88n63
2077C54J80R4q56J78l4o29O70k49m14N79l95M9P80l45N72M57o13L19k41p14M37
2098A79n48k51M84l51J04L73n76M19L11k67P58K2m23N52n93m98N66o21L1M76o46
2119d99K78K3o69O65Km3R18k04l4M21p06j02K26o68M34l5m28L20k54l74P67k68
2141b30J06O40n26K70jp00L51K4k61P59q9j56M47o28k1J89o09J88O7m63L55p5
2163c63l05P11k22K63P00j99MK35q61j3j86n64O13j21j46P08m94L4M58n77L93
$$ y = [-269, -326, 573, 594, 358, 799, 200, -81, 119, -387, -240, 246, -407, -139, -60, -718, 40, -273, -457, 392, 107, 102, 516, -126, 251, 520, 49, 746, 555, -118, 90, -391, -918, -445, -869, -584, 166, -440, 216, 362, 27, 468, 336, 197, 739, 319, 108, 408, -535, -246, -37, -552, 16, -91, -509, 44, -154, -566, 190, -37, 129, 917, 354, 534, 628, -228, -50, -84, -713, -43, -292, -706, -127, -522, -473, 307, -38, 534, 991, 378, 697, 456, -258, 179, -369, -620, -136, -487, -383, -10, -586, -167, 144, -123, 635, 657, 234, 786, 193, -305, 261, -360, -329, 147, -499, -221, -198, -867, -202, -200, -243, 675, 471, 437, 858, 152, 50, 276, -392, 42, 7, -421, -101, -355, -729, 38, -230, -124, 516, -10, 260, 259, -441, -90, -66, -327, 432, 343, 187, 634, 6, -15, 174, -435, -247, -180, -643, -288, -363, -668, 43, -179, 84, 784, 585, 589, 824, -37, -50, -236, -800, -187, -308, -454, 254, -240, -206, 252, -325, 68]
2184F8L73m54K38j6o84N19l31L4N38j75rL67p47O2J78n68N79K42l49N77m87k55
2206c00N07m65O8N66n22K92J31n47M78q6l21N95j53k18L68o86Q8K52o25M59L44
2227B25k66M15k30m41M22k83k27O00n51L32L45o51M87o8j95M71p1l30L64m90l13
2248d55K48l84K55L96l26N60j1m04M29j93k96O31l97J27K35n96J1J75o30N34J16
2269B5l54O13k97j68L32l41L06M25n30M15p4q06L86k69l19P14j62L3N38n15J02
2290E4L11n53L56%l77L28k24m08M29k24J5M78k83J51M92o30J42j7k88M93q7j03
2312E5N33o10M4J32o09L93K64o45M41l8l87N28l59n0N53k64K32K26m85K48J35
2333C37m89L83j78k89K67m41k08M08k86K34M10k44N78J2l48M44k31n37M54m28
$$ y = [68, 441, -13, 225, 209, -475, 44, -287, -253, 285, 110, 101, 468, -279, -217, -39, -607, -28, 214, -135, 442, -45, -300, 207, -258, -190, 376, -146, 146, 277, -270, 208, 122, -199, 396, 243, 25, 393, -293, -205, 47, -578, -119, 225, -41, 374, 144, -297, 125, -158, -385, 215, -336, -4, 341, -310, 177, 109, -86, 385, 314, -16, 348, -142, -455, -207, -591, -336, 60, -266, 294, 283, -121, 308, 115, -181, 450, 53, 180, 415, -181, -170, 5, -625, -91, 25, -329, 284, -13, -181, 151, -190, 116, 541, 11, 426, 352, -454, -68, -337, -656, 58, -104, -71, 467, -48, 54, 365, -188, 168, 168, -209, 119, -105, -513, -84, -308, -293, 185, -98, 53, 545, -85, 57, 40, -248, 245, 158, 55, 588, -22, 22, 154, -455, -62, 202, -443, -2, -40, -427, 101, -258, -308, 245, -19, 213, 439, -46, 202, 337, -152, 231, 53, -236, 31, -410, -618, -210, -496, -262, 148, -96, 482, 494, 146, 590, 359, -178, 276, -152]
2353a52j96N44m45N4K75n19O65J23l32L24k77m00K90k43QL05l04L49K18k97M22
2374D12m1m45L25k20l33K99l23r0M93m35L42L49l30M45j24l59L94m69l9L10l75
2395b14K30N7l60K79J71m72M68j05j59L30k63r4K50l66N2J91l54M00m2k77M88
2416B10k03q1P41n63N0K39n78J87J61o17L62M5k90N87j86j16M81m64O9K52n06
2437b20K49J45n29L69m7k36N39r9n6L22l74o5J75n01R3m6j47M40j64K0L99k47
2459B0J87K43n58N3L62n56K14ql36L95j19j21L85k28J06R9k07O2K09l97K51N8
2481A14k93M55k04k9K04k84M0J91l56J48R1m16L54n5k23M10k63R5K62l12P3J17
2503A19l55L24j17k83M97j01k08L55k37m9K77l47J83K9k59K52j45j61L01j55K7
$$ y = [-152, -348, 196, -249, -195, 80, -439, 226, 349, 17, 341, 64, -336, -46, -289, -281, 24, -280, 69, 287, -10, 412, 371, -74, 251, 31, -302, -3, -326, -416, 77, -358, -16, 333, 3, 448, 324, -35, 359, -110, -149, 161, -214, 16, 73, -287, -8, 163, -309, 159, 54, -105, 225, -38, -132, 118, -248, -196, -5, -359, 41, -1, -278, 210, 7, -74, 667, 104, 154, 393, -185, 2, 163, -454, -92, -47, -337, 250, 64, -52, 429, -35, 34, 286, -220, 29, 174, -355, 14, -33, -269, 270, 171, 115, 437, 63, -2, 173, -328, -235, -281, -428, 12, -152, -132, 267, 20, 207, 450, -108, -55, 307, -249, -35, -43, -379, 16, -103, -224, 161, -67, 39, 138, -69, -7, 202, -195, 56, 114, -179, 276, 72, 43, 247, -37, 3, 194, -162, -14, 77, -339, 15, -40, -263, 147, -116, -21, 241, -71, 2, 119, -236, 88, -29, -312, 185, 84, -124, 231, -6, -55, 222, -125, 58, 87, -172, 80, -65, -226, 75, -80, -53]
2524e3K66j49l7K30l90Q0J27l14L49%j60K86j60k87M21l74N6K16l11J38P7k56
2546b45M21j55p3L20k04j5K11m14M2K58m04K78M8k01K06o3j48K37k34JK96l34
2568a72J54J54l62K43Q0j81K62k0k39L26l43M0K03m24L01J66m04L27n1k96K21
2589a5k0j87L11k00J32K67l37R4K9k29M23j08k27K59j29k95K56k02J31J13j72
2610a06K29j8k68K29m1k36M25j24P0K88l97K3M7l10R7L2k50K59j07k0K90k04J4
2633g8L11j83J42p9l11J88j25k27L34or1M26l06J29N6l19J49M7k26K44q5k13L58
2656A35j91Q9K51k53J13R9k80p7O2k62K17J09k16L31j35l0J92k89N5J50j84R6
2678a8J29k90K41k22n1J96m5P8k3l9J17J19k62K28L9r9K47l27j12J10k97j0K59
$$ y = [-53, 213, 64, 27, 257, -133, -53, 74, -240, 109, 109, -51, 235, 75, -212, 209, -165, -109, 107, -204, -66, 11, -245, 176, 21, -52, 268, 64, 49, 260, -154, -112, 146, -258, 20, 68, -133, 73, 10, -138, 99, -135, -134, 162, -172, -18, 136, -226, 17, 97, -84, 178, 158, -81, 245, -98, -58, 145, -279, 22, 188, -216, 111, 60, -236, -15, -35, -222, 89, -111, 21, 288, -49, 45, 74, -155, 268, 160, -67, 192, 63, -232, 24, -178, -47, 66, -106, 123, 105, -163, 66, 25, -211, 214, 90, 160, 448, 51, 74, 121, -189, -92, -60, -310, -51, -158, -178, 112, -92, -78, 233, 50, 192, 113, -198, -10, -135, -362, -28, -34, -125, 301, -5, 124, 180, -139, 10, 57, -169, 75, -10, -223, 135, -56, 33, 284, 31, 144, 243, -37, -114, -52, -314, -97, 12, -204, 127, -8, -38, 154, -135, -80, 70, -114, -18, 111, -179, 62, -160, -211, -15, -60, 18, -5, -44, 73, 192, -70, 158, 197, 98, 345, 18, -94, 16, -281, -291, -32]
2701c2k37L36P6j87L69p7m04L21o2j08K54l74L0R6j32J18Q7j63K51j09l08K19
2723c6j11j43J47L0K58J76l73L80p8j99Q0j25j33Q3j82q1K72j91J41J25J8K21
2745B79L9k32J04j52j10J41j88l0K60j94J0J56k09J25O1o0J02k54o0L59l45J76
2767b2J33k62J82J01j70J41l5k22K92k38k5L53j88M2J42l62J83J8k20L56k74m1
2789a16J57l9j22O7m9K17J61l60J16M0j92L7N6o5K79j99o0K09l21K31J5j81J47
2812B8pj02K47j56j12K51k17P6K26k92J19qj16P4q5j2J28j65N5J40k42M7K42k85
2836a66K05N1j42J58j12n7K14q5m6K39k90N1N3j89P4o0q0K40j84QL07m07J48L34
2860B64l90K37J26k06J57p6k12J86p8j22L41l66P4N0j27J28K5k67L87j3j01J35
$$ y = [-32, -269, 67, 143, -44, 325, 248, -156, 165, 103, -5, 249, -125, -95, 1, -131, -13, 74, -89, 162, 53, -255, -36, -147, -290, -143, -113, 145, 321, -52, 328, 250, 51, 131, 6, -127, -44, -226, -307, -35, -226, -85, 40, 58, 279, 318, 86, 190, 38, -72, 69, -119, -149, 111, -83, -73, 83, -126, -1, 60, 0, 102, -152, -212, 147, -198, -22, 111, -151, 31, 132, -38, 103, 68, -154, 138, -100, -125, 228, 40, 82, 224, -138, 45, 63, -157, 199, -75, -116, 41, 2, -120, -53, -102, 115, 276, -84, 32, 72, -120, -83, -27, -92, 187, -12, -72, 137, -184, 47, 62, -119, 28, 21, -81, 166, 10, -102, 149, -68, 8, 234, -58, 61, 53, -63, 11, -74, -86, 42, -123, -68, 72, -170, -123, 119, -166, 39, 90, -52, 106, -6, -63, 151, 66, 20, 259, -31, 20, 73, -116, -42, -102, -182, 58, -126, -118, 189, -218, -70, 264, -126, 111, 237, 31, 188, 112, -100, 86, 8, -114, 227, -139, -65, -15, -142, -14, 11, -256, 131, 118, 17, 152]
2882A52m0j09R9k56J78M2k97K76nj03J54k15LK68p1Q3q7j22m1J01k31J49J09j08
2906g1K06j17m1J51r9l6P7p0j1J04k98J26k5o3K21q8M2K9j02J3Q5m6J8O6r1J3
2932gl5L4J67j29P8J72k72O1%k35K00L0k40M2J89j91J93j25m1K58k78J91N2p3
2956D1O5j17l0K13j52l5R2r8L4J35k73J59J2k09K17r8O3l8K8l8M8k7m9J44k51
2981a64P6O6j40J78R7k44J65L1j46J33j53J50k8j93JL13k30K20j3k49K60k33J43
3004D0R7k62J80o7q9M0Q9j57K58j01j16J80j66K8N1j06R6P3k8M5k9j39J98j2j45
3029d2J91j70M2P8k64J51J04l24K11rn2L15k96O6N1j22j9K25k51P5J39J9n4j43
3053g9l5K36k32o6K64j59J79J8j31J10J59l00J16K8j74J17n5q7P9LJ7Mm4J14n7
$$ y = [152, 112, 3, 102, -154, 24, 66, -231, 45, 40, -63, 91, -124, -121, 147, 76, 159, 72, -50, -91, 10, -221, -72, 37, -71, 135, 18, -23, 128, 29, -7, 70, 0, -11, 93, -205, -79, -104, -167, 54, -34, 8, 37, -65, -52, 33, -13, 5, 71, -20, -7, -42, -8, 159, 30, 108, 280, 8, 69, 69, -166, 34, 64, -176, -134, 55, -136, 57, -68, -109, 149, -129, 62, 114, 41, 106, -11, -41, 172, 20, -15, 77, -21, 13, 148, -125, 34, 46, -163, 54, -44, 19, -19, 9, -29, 19, -8, -57, 87, -164, -88, -22, -162, 16, 113, -131, 34, 65, -81, 52, -101, 49, 21, -172, -171, 142, -88, 132, 119, -130, 130, -103, 40, 137, -125, 55, -12, -101, -61, 28, -129, 129, 28, -88, 92, -74, -46, 5, -101, -5, 68, 40, 85, 56, -83, 115, 103, -42, 149, -21, 21, 99, -165, -14, 90, -234, -23, -32, -84, 231, -65, 1, 52, -70, -89, 136, -115, -40, 99, 118, 64, -79, -114, 122, -110, -176, 88, -71, 108, 126, -5, 105, 264, -36, 80, 108, -66, 51, -4, -91, -12, -9, 8, 12, -32, 82, 25]
3078B5n2K15l41rK26j21J57J9q6j63J92qj2L1j44Q3j73j4J32j95J26J53j84J85
3102D2l3j12K03j9k04K66j54p9J86m7j0J80k28j4N6p7O4j23J9K19k16L9j4m5K04
3127A03j22j7K02k78J43L3q8J6J21m6j30J11j09J09r1kM0k5j33K51j84j9K78j25
3151C8k3J41r9l5J01q8J43k55m1N6L7n7J26r9M4J5n8j8L3j22J52j15N0K19k06
3176f1J6J82o0j05O7n7J71l9k50K19Oj03J13j21NO6r9k8J71q8Q7K2r0K9l9n9J37
3203I2o9o3J28o1j7m6j57K08l2j70L07j79j22K60k6r8J61j09P7o9j26J77j57j5
3227a06K36k26K8K05k48J9J50j65J43K4j62K23k27pJ93r5R0nj15N3K5q6J94j74
3251c3k0Q4p4Rm2J05M4qj12j5J9l4J32L7j10Q3r7J7J50j99P5J73k82J30j3r5J53
$$ y = [25, -27, 188, -153, -162, 64, -57, 100, 119, 33, -130, 62, 54, 42, 73, -71, 12, -161, -175, -43, -238, -112, 41, -143, 42, 9, -103, 100, 81, -123, 143, -11, -90, 96, 49, 39, 219, -9, -23, 33, -44, 20, -103, -84, 135, -81, -42, -56, -101, 103, -19, -36, 166, -112, 31, 64, -24, -8, 113, 67, -63, 48, -61, 48, -43, -45, -5, -30, -163, 88, -96, -115, 163, 38, 15, 156, 57, 22, 123, 35, 178, -77, -118, -62, -25, -82, 44, -55, -11, 4, -54, -72, -39, -161, -9, -124, -74, 145, -61, -45, 137, 77, -28, 39, -18, 153, 114, -136, 83, 89, -14, 99, -22, -17, 49, -50, -78, 93, 5, 92, 114, 24, 53, 14, -45, 92, 23, -40, 88, 27, 10, -36, -193, 15, -17, -187, 120, -59, -181, 79, 53, -45, 116, 7, 84, 15, -111, 66, -91, -106, 130, -96, -68, 137, -111, -92, 58, -107, 36, 60, -102, 121, -106, -113, 80, -15, 75, 70, -45, 8, 33, -53, 141, -33, -53, 31, -43, -34, -76, 29, 73, 65, -47, -62, -43, -77, 55, 92, -18, 65, -32, -15, 135, -64, 11, 184, -98, 32, 19, -76, 77]
3278G7q9m1L9qp3Q8pK4J65j66N7M3k13J35Jl3ql2K0J22r9j00P0k7J48j4o2o5J14
3307F6j15N4m4M3Q5j14O4q7K2J30n7k6q6P7j51Q4j0K4L8r0O4O1l1O5n9l4J05n5
3335B3O5k9p8o3M2M6m1J49j94J44K5k03J91j22l7R7p6J06k0n8N4J50k49J10n4
3360b2M5o6M7j24J30k8O6m1K5Q9n8l3N1k2r1J05q3P2q3n3j0R0K8J7Rj71J0R1m7
3389e7J73j33K5J08j36Q5o1Q0lj27J19L8n7j85Q7N8r4Q0o5M6M1p1k1J2p8J40p1
3416f7o4J81j82J89J23k03O1Pj26J71o7l5M4p0l0N7q7QK27k51P8m3k5Q8J08k26
3442a34N9R0n3O7l7p6J62j01J3J46j87R2L8j19O1j29J15q8j3J06M5j40K27r6j3
3467C5nj23Q2J24j51r0Q8q2J18j69N2J32o5MLQJ49nr1J9j4o9J10n5j9J90j57n5
$$ y = [77, -12, -53, -14, -22, -95, -7, -14, 10, 175, 9, 66, 109, -104, 31, 32, -1, -9, -41, -21, 101, 2, -98, -28, -55, 93, 79, 17, -48, 66, -49, 5, -39, 4, 89, -25, 39, -48, -26, 104, 47, 21, -65, 12, -139, -55, -65, -41, -3, -93, -29, 32, 1, 66, 7, -27, 78, 23, 88, 59, -19, -82, -40, 6, -35, 114, -80, 64, 89, -114, 77, -45, -82, 15, -61, 45, 25, -33, 21, 171, -78, 32, -22, 23, -43, 4, -120, 10, -18, 48, 7, 32, 121, 63, 30, 81, 59, -32, 73, -10, 62, -21, -74, -84, 6, 34, 51, 60, -111, -101, -10, -57, 116, -17, 8, 116, -20, 65, 4, 84, 81, -46, 73, 111, 54, -131, -44, 14, -80, 0, -65, -19, 22, -49, -70, -58, -136, 4, -67, -131, 50, -132, 57, 180, -23, 38, 45, -81, 90, 23, -12, 32, -38, -68, -11, -98, -90, 137, -114, -36, -79, -104, -16, 92, -134, -75, 15, -38, 29, -8, -84, 78, -23, -10, 136, -51, 41, 79, -40, 21, -108, 7, -81, -94, 12, 57, -83, 144, 48, 35, 30, -93, -11, 113, -38, -128, -40, -122, -4, -173, -121, 11, -54, -50, -47, -39, 110, 105, 14, 33, 19, -50, 60, 5, -14, 176, 19, -36]
3495c6J64k12K1J93k49O2R9j52O3J3L4K0Mj32P4N0O3J2r3m8R3p2J01r2q7J75o7
3522Aq0J38j54J6J65j13O2L1j58M7Q4j47O9J25j39J1l0K07m5r3j3L1j02J49k4
3547C8j07K13j40j04J43j38J16n3L3o8JJ36K9q2p3J54k22J08P9j03J13J09k72
3570i0O8n0pP7L8j6L0j51LJ21j7k9Q2q0P5J5q8P9j48J92q8j85J45KK6o1K26k27
3598e8J46p9L3Nk5l0J21j60jJ36n6r8Q4k7k0Jm0J37q4o9R6n3K9k5L5M9P9j78J74
3627A22j37L2P3j47R8n9o1lR1j61K12r1j1Q8J2j11J31k5Q5j79q9J26K2r8N4P3
3653D7p6O0r1p9J22j16K37o7q3J40r0Jj42K16j14J56j21j2O7j73J23j5q0J24k3
3678A1J1J25j37L8j01O2jK5q7m4R6j1R5n8L4q8J07j17J04p2M1j3j74O7K20k17
$$ y = [-36, 128, -84, -63, 130, -119, -57, 42, -110, -47, -34, 0, 20, 24, -108, -34, 16, 79, 91, -2, -50, 43, -29, 72, -20, -107, 68, 1, -79, 59, -95, -79, 86, -27, 35, 66, -92, -45, 39, -108, -39, 86, -53, -42, -72, 135, 90, -3, -16, 15, -87, 62, 38, -69, 144, 4, -100, 43, -95, 21, -32, 1, -67, -66, 70, 99, 17, -56, 98, -124, -16, 63, -40, 73, 182, -90, -22, -72, -79, -2, 36, 20, 50, -101, -98, 23, 6, -23, 59, -21, 54, 69, -19, 60, -88, 104, 16, -169, -24, -22, 4, -57, 169, -58, 88, 9, 42, 47, 22, -8, 113, -47, -48, 88, 32, -66, 18, -9, -29, -28, -68, 69, -15, -84, 12, -41, -12, -37, -2, 47, 126, -52, 122, -15, 17, 90, -57, 41, -18, -79, -82, 9, -152, 60, -31, -42, 46, 58, -53, 78, 53, 138, -41, -130, -4, 18, -80, -26, 47, -29, 31, -60, -139, -17, -133, 104, 37, -46, 94, 4, 5, -137, 79, -35, 121, 0, -12, 55, -118, 5, -10, -90, 34, 11, 22, 147, 10, 48, -53, 9, 8, 33, -54, -98, -2, -13, 82, 24, 58, -30, 77, -40, 64, -8, 33, 20, -154, -87, 133, -84]
3704h4Q7Oj24J13j30Q9N0q9J31l1pQ4p4n4Q3p7M4mM4k10L09k28rn9K6J14p3L3
3732d0K9O2l3J12r0m4J47m9l1j11J3K6L1q7o6O6L6J40k18J56J2j75K05Rj75J66
3758I1j0j32J7k1R1Qj96K22m8k5M6j73N9J07q4l4J62Jq6P2q6J42j10r0O3Q9j98
3785a23R7p5J03r1L0M4k3o1K9K6j19K07r6O9oq7R7j36J73j70J04Mj5p2L6P7j9
3812CMr1Q1m7J21j15j0L8j00J22P3j19K1O2j05L9k4j05J65m7R3o9q2M9M5l5l9
3839g2J18j31J14J0j70J05LR4q5Np0%N1Q1q3j85K06J1L2j92O0J85j36N1k5J38
3865A15q8l7K7m3J18r3P4Q7o6j2J8j38j3o3J70J4j48J21k1n5Pn3l8J12p2j49K15
3892a1mq3J53j01L3J9O4r8N0n5R3j3P9j0j14J0p7J06o6K7k4n1K2om4L7P9o3P5
$$ y = [-84, 3, 9, -115, -2, -132, -43, 7, -82, 49, 18, 11, 95, 21, -33, 50, -27, 17, 13, 57, -153, 156, -72, -81, -140, -114, 0, -73, -40, -11, 51, 18, 130, 40, -4, 143, 94, 63, -48, -35, -9, 22, -65, -131, -65, -29, 111, -107, 49, 61, -114, 91, 100, -75, 91, 81, -51, -34, -55, 36, 44, -152, 70, 22, -3, 43, -130, -71, 36, -48, -82, 80, 81, -5, 67, -19, 123, 13, -77, -14, 75, -123, -26, -101, 2, -89, -59, -15, -38, -99, -70, -44, -163, 44, -52, 17, 11, -76, 21, -115, 58, -112, -8, -4, -19, -91, -55, 22, 3, 7, -84, -3, -50, 71, -44, -54, -16, -116, 6, 79, -40, -19, 43, -62, -23, -47, -152, 13, -34, 59, -10, -92, -43, 2, -33, -72, 46, -85, 29, 39, -131, -26, -23, 71, -14, -9, -79, -79, -28, 53, -30, -215, -9, 2, 34, -158, -98, 87, -49, 2, -23, 115, 27, -10, 17, -26, 92, -1, 73, 160, 94, 82, 100, -38, -51, -114, 56, 70, -78, 43, 22, -33, -26, -79, -117, -5, -77, -226, -11, -15, -98, 55, -46, -13, 6, 70, -28, 22, -33, 60, 47, 126, 116, 2, 12, -65, 41, -25, 2, -22, -73, -51, -57, -101, -64, 15, -48, 27]
3921B7q6K84j37j08J36q4K3N4p6N9j09lnN5n0O6q3Q4lj13J70j18JJ34l1k79J55
3948c7PK14k17k5J5P5M1j08J7j00J48N4o6L5k6N9q7n6M0J4lK7o5j09J58k0r1o
3976a12K42q8l1Jo6J26j32J17n5M6j5o4O1Q2j60O8m1qR0j10K7P6o8o4O0mM5k8
4004eo6N6N5R8l0j09j6K1l7R5K3q6M3l4nl5L8jm0Nn2P7L6r2K07j81qJ11o7M1k2
4035B0Kp7N6k4mm3J77j18N5J18j05m3j03J31n3P9j50j9P7J34j57j8J0MP7p9J50
4062I7j85R1pJM3p5Q8p5R3n1L1n6j4P7n9K4R2j14P7mO7j98L6l5J40r5Q7q3J35
4091A28j25L6L6j69J15m6j3J02l3N9m6j08K18j63R4r8J7q0N0m7O9O7m4J3k4j2
4117dJ2l3J49j11%n9O4k7J7j08M2P2o3J24N1pn3p0n1J62j45o4J35Q5j38Q0Oq7
$$ y = [27, -59, 225, 88, -20, 116, 32, 55, 109, 33, 92, -17, -20, -25, 30, -20, 46, -37, 47, 44, -69, 101, -17, -16, 118, 87, -192, -37, -30, 184, -33, -58, -43, 32, 73, -35, -18, -118, 30, 84, 18, 53, 27, 86, -1, -57, -17, -3, -6, 21, -44, -153, 5, -15, -106, -112, 130, 42, 11, 12, -54, 72, -60, 57, 2, 48, 33, -31, 30, 112, -48, 20, -21, -29, 61, -49, -22, 54, -14, -78, -18, -22, 23, -5, -71, -15, 40, 138, 108, -1, -17, 4, -33, 62, 85, -1, 42, 8, 3, -32, 6, 5, -35, -30, -82, -5, 31, -61, 146, -35, -43, 68, 1, 42, 20, 22, -55, 1, -23, -27, -70, 107, -11, 44, 162, 57, 14, -89, 42, -11, 68, -82, -101, -24, 110, -47, -65, -55, -51, 26, -53, 97, -88, 3, -4, -3, 40, -35, 53, -22, 71, 20, 51, -5, -19, 58, -1, 23, 115, 1, 78, 74, 141, -57, -21, -56, 84, -11, 76, -7, 128, 3, 39, 75, -94, 21, -25, -38, 64, 31, 90, 44, -64, 154, -9, 85, -13, 4, -76, -26, -73, -4, 63, 19, 32, 8, -4, 8, -25, 124, 13, 13, -46, 18, -9, 8, -100, -58, 14, -49, 75, 126, 119, 66, -4, -55, 107, -38, -102, 33, 118, -20, 60, 66, -21]
4145b1N4o2j6P4j03Q4L4o6J10k0j50J39j34P6J02j93J61M3p5R0j01o0P7l6k2O1
4171D6j53N8J37o2l7P4j60qJ32N6mm7j29J40j0j7KJ2j4L7j17K5k5R2n2J5o2N9
4199a2nj2Q5rP2j16J8m3J44k00K65j93o6J92j07J23j68o6J05L0m4j0N0j37k1Q9
4225c6J7J30p0k6o2pJ0J00p6M4j57J79o1K6P2j38L6q1K05l16K66r3j11K05j5j57
4251a16J19M9k1j09Q6O6n0N7mm1P2J5j91K4Q8j23P7L2QK2lj96J11L4o1j9M3J21
4279I0m1%j29m4Q4R9m3j13R4k7n4J49j5m9J99j01r8J22j56J7P2k18M9M0J60p6
4305A1j38J35PJ6r9R0n7q9Q4J7M2oj7o9L9J3l6J44q3j3n0O1L2nj2j1J04k9k15
4334a34K10m2J0M6p4p7J26L1j07J9k5J20n3q5jJ5Lk8Q3n7M8j9o9Q9n4K8m1J3l1
$$ y = [-21, 33, -29, -45, 29, -74, 10, 44, -22, 88, 68, -82, 57, -77, -1, 101, -92, 69, 112, 37, 127, 26, -34, 43, 7, -15, 46, -107, -49, 88, 26, -11, 63, -97, -105, 27, 83, 79, 32, -97, 43, 33, 16, 18, 30, 16, 53, -64, -39, -64, 28, -24, -9, -71, -12, -17, -29, 56, 47, 119, 3, 21, -22, 122, -78, 187, -6, -72, 120, 13, 136, -32, -98, 7, 37, -7, -17, 33, -104, -125, -36, -19, 111, 41, 15, -47, -54, -44, 56, -20, 24, -133, 46, -15, 11, 83, -55, -19, -100, 105, -211, 55, -38, -149, 56, 41, -116, 3, 52, 31, -78, 8, 74, 24, 81, 77, 36, 108, 123, -68, -44, 44, -79, -2, 30, 38, 60, 57, -139, -28, 6, -55, -74, -31, 90, 49, 49, -80, -124, -40, 59, 16, -97, -3, -30, -84, 65, 50, 1, 200, 99, 1, 123, -33, -16, 56, -162, -113, -73, 87, 11, -127, 8, 15, 31, -68, 22, -35, -124, -40, -23, 19, 13, -4, -73, -34, -21, -57, 87, 4, -9, -59, 2, 34, 29, 17, 6, 110, 81, -134, 76, 34, 44, 90, 16, -61, 65, 96, -11, 8, -17, 103, 50, -35, -36, -21, -18, -46, 37, -20, 28, 9, -60, 29, -25, 3, -38, -25, -56]
4363e6J00j02J16k7L5j26Q5pM9m8m8J18j65J14p3o7J98O9j08j59J64j05M5l8R4
4388E8N5n3K0j35K9m5P1k8M1N8m9pQ0j01J04j33M1rK0m4J38n8J2j48J01oj8P0
4416F4j2q2O4l7m6O2N6o4l3K5%m4M5r9K52k48N4R1j9L1j8k35J98r4J00m4k4O5
4444Hk7M4m3l1M4J7R0l2j2l2q5M2J15o2l1k3j8p3J38Q7j73qO1N7j26Ol5O4Q8o7
4474a7L1j65J21J44p8J5o6K5Ll7m5J77p1m6qRK2j01J49r9J08m9k1J1q2j8J39n6
4502eO7K8j67Q9r3K0J50o5j6l2m0J28l6p4pJ10j41Q1Q8k0n2L1M6o3l5n5N4n5P3
4531IJj9j16Q0M0o0R0l1Kp9J01j36R7R9M0j86K0M2R4q3j5J7r7J0J45j31M5P4l3
4560B0K3m2j65Q1J01l7J9O0o5j00r1J08N7M7j89J74j11J97q8j7K1m3K8N1j49L8
$$ y = [-56, 44, -58, 58, 31, 66, -60, 25, 18, 67, 19, -29, 89, -76, 38, -35, -102, 96, 165, 57, -102, 62, -43, 2, -36, 58, 113, 60, 80, -55, -26, -71, 0, -28, 13, 71, 22, 15, 95, -6, 98, -35, 6, -3, 17, -27, 111, 53, 65, -83, 18, 12, -6, 64, 52, -30, 34, -3, -49, 13, 69, 5, -28, -3, -3, -47, -2, -101, 151, -97, -43, 48, 29, 60, 42, -193, 5, -89, 11, -33, -57, 8, -19, 25, -18, -49, -5, 12, 102, 70, 58, 26, -59, -17, 98, 36, 5, -18, -36, -109, 29, 116, -57, -65, -4, 53, -73, -67, -102, -38, 50, -17, 14, -151, -30, 114, 36, 51, -15, 10, 13, -24, -69, 108, 37, -9, -17, -8, 14, -87, 62, -37, 71, 22, 1, 12, -70, -88, 51, -5, 62, 90, -77, 12, -81, -61, 89, 24, 8, -24, -64, 64, 28, -46, -53, 57, -84, -3, 85, 65, 13, 44, 90, 27, -8, -63, -9, -64, 9, 10, -9, -125, -45, -5, -65, 25, -6, -4, -83, 18, -118, -21, 78, 118, -68, -48, -6, 88, 5, -10, 7, -90, -80, 65, -66, -21, 53, 20, 43, 1, -164, -83, 18, -19, 0, 60, -5, -105, -196, -88, -31, 16, -173, 1, -110, 87, -1, -18, 3, -40, -12, 39, -110, -72]
4586g2J12o1P2n3j28J15nQ7j28M6N3m2O5r1N6K1J7L6k44J20K5Lm9M2M9jl3j5n5
4615e8j9K5R7q1L7J8JL4m9J5J04j79N6j04J15N6q0j6O0n0J13o1K2n6Q3o8o3K5
4643b3K7L3j25rL1P8P6o0n6j0j6Q5J3m0l6J40j1k58J18P4l1r0K5k8Q1j09Q5J43
4671A07j13J5N7j34R7m6R7j7o9N5j81J80j11J37n3j20J11j02J15r7L6J15oj57
4695h4J45p3m7Q3l6M4O8j46J29n2n4O0J2lj4k2mK1j70K9K19j57KJ49j07J17k74
4722a65J94p6J64j45o3J46j02j45K55Oj77O4P9o8jNj7R5n3J8L2k3l1j6qj9N9m
4750DJ7Np6J4k7J36j56J65j54J21r0j0J20j35J36o2j7m2J34j17J00l8r9J07L2
4775F8k12Q5MO7oL5k4J3L4j06J17p0j0l8N1p3M0J32mj73N0l2R2o4J34K1j65o0
$$ y = [-72, 40, -21, 51, -2, -130, -15, -20, 67, -61, -15, 38, -4, 61, -30, 26, 47, 64, 100, -144, -24, 1, 4, -45, -3, 46, 45, 12, -3, -58, -77, -52, 45, -36, 1, 19, 20, 54, 5, 20, 124, -55, 1, -103, 12, 68, -12, -28, 32, -18, 95, 34, 56, 0, 83, 15, -48, -23, 4, 37, -88, -97, -66, 12, 88, 28, -28, -38, -54, 31, 44, 4, -32, 108, 97, -161, -43, 31, 0, -90, -65, -93, -12, -121, -36, 107, -6, 9, 66, -68, 29, -17, 80, 63, -6, 49, -132, 48, -63, 74, 21, -99, 12, -90, 25, -72, -36, 79, 73, -84, 61, -12, -59, 24, -12, 32, 100, -46, 83, 31, -23, 37, 49, 46, 32, 10, 6, 27, -143, -114, 105, -52, -50, 99, -8, 109, -165, 29, -47, 117, -28, -91, 55, -47, -192, 63, 69, -108, -44, 35, -33, -34, -29, -46, 49, -4, 14, 46, 23, -8, -24, -32, -51, 8, 4, 21, 26, -50, -36, -63, 73, -83, 82, -72, 49, -41, -51, 69, -66, 70, 8, -9, -51, 83, -34, 66, 28, -71, 36, 68, -144, -59, -55, 12, 6, 41, 17, 30, 64, -42, 75, 5, -5, -43, 8, -65, -25, 107, 103, -70, -20, -52, 40, -24, 110, 131, -34, -94]
4803i4J74Jp1Lm5M4M0j05k7J72j34k1P3j43O3R4K1p0L1nj7N3r4K2K3N6O7j54M9
4832Flj5K5j7j07J44m2M5K2j26QJ17o0n7P6N0o2r2r4K51j6L7p7Q2j79J15r2J39
4860G8j22N3n2o2J05M9j31L5k9K0J60o8q0J3j9J1J2Rp7J22R1j16o5Q0o0R8j0k8
4888A7m2j08Q4J86k60J97j83PN3M3j7Jq1J11J9j35J23n0k1J70j31J00l5j0o5r9
4914a26J46k1K6r2R5o4O0k4L9noJ6k3J8P7j14j31J88j60%J29k7L0j80P0O2j8K3
4942a2LK8k1J7L3n2n3J94p7k6L9j32K8K4o3Q4n6j02J09n2J00M7p0j7J17m5L6k09
4970a28O1K42k52J22o1l9O8k1L6r7J04q9M6j5pP9n3L9j9j08J43l7k8R8j00J07
4996I1m2K1p2k7l4J8J83j61JN2N9j6j5n7No6J5J09j05MR3j9o4K8p9QJ40l0j32
$$ y = [-94, 80, 81, 10, 13, -32, 12, 52, -53, -80, 92, -42, -63, 10, -133, -70, 24, 45, -25, 6, 1, -16, 37, -57, -35, -12, 44, 111, -43, 6, 3, -12, 13, -4, -111, 33, -9, 36, 58, -68, -60, 57, -3, -60, 16, 66, 4, -88, -182, 69, 53, 90, 13, 95, -84, 31, -61, 78, -44, 9, -43, -105, 0, 49, -82, -47, -76, -56, 104, 36, -44, -31, -50, -39, -27, -18, -95, 27, 118, 2, -63, 17, -43, 55, 45, 17, -25, -133, -49, 137, -123, 74, -109, -102, -49, -6, -23, -22, -103, 8, 27, -108, 15, -35, -56, 114, -17, 83, 48, 38, -27, -126, 20, -1, 25, -67, 28, -36, 24, 0, 39, 34, 28, 44, 21, 39, 116, 2, -129, 59, -101, -101, 28, 1, 31, -149, -79, -17, -35, -12, -9, 19, -2, 15, 48, -4, -57, 137, 60, 34, 73, -59, -31, -7, -70, 14, -42, -144, -35, -87, 13, 60, -10, -27, 90, 45, 81, -128, -67, 175, -77, 45, -16, -55, 13, -8, 28, -69, 35, -54, -8, -23, -30, 49, -4, 35, 16, -92, 51, 14, -14, 84, -16, 91, 49, 70, -2, -29, -63, -45, 138, -23, -22, 30, 89, 73, 58, 1, 6, -60, -45, 64, -41, -37, 56, 37, -27, 1, -78, -70, 70, 40, -92]
5025i2N4L9M1j46J42J2l5K4j41J17RrK6L0n3P6Jq7L2j15N0m5J81j48O5lJ7L9j65
5054h4p1K01j11N1M2m0lL4j9J63j80k9J10Rj43L3R8r4O9K8Lm8j03J03j13J48L8
5081I2j50K3k4L6J51j1k03L2J06j19J20Pp9%rK0R0K1j19J80j84jo4J19n8Kj7P1
5109C2j7NK9m6Rl1jK9J04j59J46j69J52o6M2j3k1k9M4j67J2P5J1%M4O2m8P4k7
5138G6Qk26J67q2J12j12n3R6N8j4K4j08p6J02P2o0L9l1n5k8%J17L2N2j63J37N3
5165A37j61O6jj32J41K0q0pMn7J96j76P0L0q9Q8m3m0P9N8j48K9n5J14q4j4L8l6
5193e3lQ6p7q1K6Q9q9Q9N9j25J28j89K5J51n2m6j6k1J34%r2Q2K5Qj68J65qJ1j12
5222e4LJ43j78P4p7O6R1k6j16J19k3j24J75np3q7J44r3JJ03j5j28L8Q0n7J19j18
$$ y = [-92, -38, 1, 42, -104, 38, 50, 15, 39, -102, 15, 24, 15, 41, 71, 18, 94, 95, 8, 40, -75, -25, -70, 111, -37, 28, 25, 42, 81, -84, -155, 46, -65, -14, 28, -12, -15, 19, 0, 163, -17, -46, 64, 73, -70, -37, 61, -33, 36, 64, 67, 19, -84, 19, -94, 54, 92, -58, -35, -59, -23, 128, 117, -86, -54, 52, -67, 53, 60, -19, -19, -28, -8, 82, 103, -16, 164, -20, -21, -85, 34, -24, -22, -39, 32, 15, 20, 49, 3, 12, -19, -20, 9, 113, -46, 100, -69, 83, 17, 59, 46, 25, -4, 40, -127, -115, -40, -29, -29, 15, 77, 29, 103, 76, 84, -142, 25, -57, 55, -57, -110, -14, 44, 30, 54, -54, -130, -28, 44, -16, 23, -8, -63, -91, -91, 26, 58, 110, -53, 84, 137, -24, 42, 41, -91, 50, 70, -10, -17, -13, -70, 126, -50, 20, 50, -39, 49, 6, -34, 45, 103, -45, -16, -71, 43, -41, -55, -17, -53, -56, 30, -47, -128, -102, -13, -102, -13, 46, -79, 49, -140, -115, 36, -16, -62, -78, -99, 35, 35, -57, 25, 50, 58, -110, 55, 47, 58, -54, -51, 92, -86, -12, -89, -23, 68, 42, -74, 45, 22, -102, 73, 68, -5, -92, 52, -41, -40, 63, 48, -80, -42, 38, -19, 100, -18]
5249a8qQ0j0l3j0rk2M7Rl2N0n2M9nj35J36P0K7q3L1r8J13j13kj11J54lK4p7L6
5279EL3o8p0M4J4QL6j72P6J26n5oO3m1n7lQ9Q5k52K4J39oo7n1J25Lqm1MK8l5L2
5311BK4L1J2j50J23j54J15K0n9LO8o3oQ9r1o5N9J18k9k7J7q5N2J33k17l5P6L3
5339fq0J3J45M4n7l5j9K5j62P2j1J79o4m7l1n9J44K8j33k6J18Ol0Kl1LLo6J58
5368H3j11Ml6N1M5P8j48K0M1O6k2q8NP4J9m3p4j8J15k5J7q4J18j3m9j33O9J63
5396A24k20N8j3J8J10j48L3k1j3L6M6j6l3R0j58J61r2O2o5kk0L8N3j57K37l8p1
5423aO9j10K3q5R8P3j65K9L2j1M7O7n7M4p4L7L4M1j56Q4p0P1oJ2nqo2R1j06on7
5454a27J69j60J70m8L4o5N2j31J53k3L2No8lN6m4K7j1j9P6n0n3j14O1J05kJ0R
$$ y = [-18, -26, 54, 44, 11, 1, -8, -30, 17, 26, -6, 44, -8, 41, 36, -99, 37, 107, 134, 51, 82, -16, 97, -16, -18, -129, 25, 22, 46, -31, 5, 38, -30, -100, -56, -42, -34, 2, -170, -94, 32, -23, -29, 34, -7, -64, -67, 22, 107, -145, -121, 18, 12, -55, -106, 19, 22, 14, -27, -23, 5, -30, 2, 26, 57, 69, -81, 42, -112, 3, 23, -36, -33, 35, -28, -34, 55, -36, -101, -42, 76, 47, 20, 37, -48, 4, 137, -80, -115, -39, -6, -86, -73, 72, 116, 59, 24, 5, 30, -132, -60, -71, 108, 44, -3, -34, -93, 51, 79, -54, -80, 38, 44, 14, 16, -15, -12, -9, -75, 83, -28, -24, -60, -9, 36, 114, -34, -14, 27, 93, 71, -17, -12, 62, 81, 38, -36, -54, 61, 36, 53, -31, 87, 74, 25, -108, -39, 124, -96, -38, -51, -33, 77, -71, -38, -59, -72, -36, 10, -6, -39, 51, -107, 54, -38, 24, -41, -43, -63, -25, 28, -129, 108, 70, -1, 68, -42, -19, -104, -6, 67, -98, -69, -37, -48, -1, 66, 9, 53, -21, 16, 50, 91, -65, 19, -51, 20, 14, 26, 21, 13, -49, 42, -64, -70, -127, 42, -118, 52, 4, 38, -27, 25, -106, 47, 24, 56, 61, -7, -10, 46, 2, 29, 18, -1, 75, 25, -28, -142, -81, 24, 22, 32, 41]
5482D1O6j81J01p9K0J4J6R6r6n2M1l3l6J55p0n3O9l6J7J64o0p0pm5nL0P6m9Mq7
5512d9k0L7r0J34M1r3J11j37Q1j13M0N3J58k12J11r1K9J4j24J20k0Q6q0qK0J09
5538A07j42MJ8j03J38n0JJ9j09J49l4n8K3M5JQ0j20J07m6k0n8L4J8K5J08j14m9
5565b6k6j4k1N0P9K1j02P7n1K7q8J21rl0Q1j42k1R7p9J68j23P6j8j06pJ62r7J7
5593A6Rj22J44q5L2J55j20r1J11R6j23K0rM0R5j64K2N1j53M4J44r9o9O3j06J12
5619A3j28K13M0j34L3KOr8K4J38p3j46J79k6m4L6n6mk4J34J3j86J65J7j80J23
5645C7n3M8m3J9P5j13J3j0j7Q0n2R6o2oN0J22j89J4N2l3l4On5P4j2lq2l0L4QJ00
5676C4l8j17J45N8k10OQ9M6J0P0j28J08m6L9r1N9K3k0p0J10p8j06M6K0O7n4K3
$$ y = [41, 107, -74, 27, -52, -32, -18, -2, 94, -2, -54, -13, -46, -82, 73, 3, -50, 19, -17, 0, 164, 104, 34, 27, -18, -23, 7, 83, 34, 38, -49, -69, -32, -122, 12, 53, -40, 71, -66, 15, -98, -58, -5, 153, -59, 52, -39, -10, 4, -120, 0, -20, 66, -14, -22, -2, 107, -35, -31, -13, -116, 22, -28, -27, -8, -117, 32, -2, -60, -37, 8, 9, 89, -31, 76, 30, 10, -48, -14, 4, 29, 137, 23, -26, -52, -66, -87, -37, 42, 63, -39, 38, -13, 14, -74, 47, 38, 8, 89, -53, -74, 23, -56, 112, -11, 65, 47, -59, -66, 96, -1, 16, 25, -97, 47, -38, -6, 149, 29, -62, 49, 145, 22, 42, 33, 73, 168, 4, 26, 77, -76, -32, 112, 13, -56, 7, -99, 13, -115, 98, 138, 4, 37, 39, 45, -53, -29, 109, 36, -110, 69, 43, -1, 35, -21, -25, -49, 85, 98, -88, 77, 94, -86, 37, -16, 32, -11, 8, 83, -30, -17, -27, -44, 36, -16, 80, 18, 12, 62, 184, -5, 9, 61, 28, -6, 0, -55, 19, 7, 4, -78, -108, -74, -66, 34, -4, -121, 24, 82, -128, -122, -33, 13, 23, 93, -35, 73, 27, 66, -25, 34, 57, 37, -33, 77, -1, -107, -61, -41, 26, -28, -5]
5703em0R2J8o8q2J41K2k6k3j26K22j99J29Nn%k9j39O9R7j33M5O4L6m0Q2j52j7
5731f2Q0j0k2j8k4J23p0n0LQ0n9m9Q4l6L3n0J44j83qN8j31K24p4o2R0l5j0o0P9
5760a5j8L0K8l4P6j01J13j83J95j26k8P6Q6j04O1l7q9J56j29N9n5kK9m8J2P9m4
5787a3Q1m8n1k6M2kL3mj01L7m5N1J42r5j6n1M3l3J42P2k93R4j2K6J3lk6J57k1
5816I3R0m2j16J0k6l3n8PR5NJ2j5o8L3n1R1j10M0JR1m4M4L9q3q4J58l4k6J38k06
5846d9OL8M8Jj4N3q0j75J58Qp2L3P7Q2o2J6n9o3p4J65N9j20J16j72J06j14n1P4
5874f5j0Q8J18k71J6R9j8k2O1l2j3k7M8J1PK0j12R5K3J7M7n1N3n5lL8j8N5q1L0
5904D8l3j07J10k3L8m0M3k8K3p9j4J82r3j1l0M4N5p4n4Q6j7j5M4p7J73j29p1j1
$$ y = [-5, -45, 47, 65, -3, -85, 56, 78, 52, 29, -97, 125, -74, 55, 60, 55, 55, 26, -113, -44, 53, -80, -35, 29, 65, 25, 107, -45, -62, 18, 8, -14, -32, -56, 67, -3, -53, -50, 30, -29, -78, 6, -30, 3, -47, 97, -86, -94, -36, -167, 57, -17, -79, 11, -24, -34, -94, -15, -33, -3, 25, -9, 67, -34, 79, -104, 91, -35, -63, 13, 99, -5, 56, 19, -70, 86, -43, 16, -39, -41, -12, -60, -48, 31, -13, 68, 20, -31, -57, -15, -17, 16, 12, -89, -52, -97, -46, 96, 1, -15, -66, -23, -56, 86, 158, -135, -41, -53, -27, -14, -17, -43, 114, 93, 183, 141, 25, 35, 9, -24, -82, -75, 20, 25, 37, 22, -46, -13, -64, 27, -83, -43, -42, 49, 5, 49, 88, 5, -79, 79, 45, 19, 157, -49, -43, -5, 43, 44, 30, 83, 3, -172, -14, -6, -78, -45, 32, 114, 52, 68, 9, -54, -128, 37, 96, -24, 92, -80, 26, -88, -139, -65, -75, 13, 131, -140, -124, -25, -43, -65, -4, -36, -49, -76, -28, -17, -10, 10, -102, -7, 16, 33, 80, 29, 82, 27, 24, 62, 44, 99, 18, 48, 15, -92, 18, -5, 33, -7, 36, 8, 31, -48, -62, 120, 27, 16, -14, 30, 85, 11, -43, 43, 26, 11, 55, -22, 151, 22, -49, -60]
5932f0P9m3MJ37j04PJ3m6p5K04j66L6l7J07m1j6o3Q4J3m8l7Q5nj47J38j18J60
5959F1j98M2P4k7r2J65J0l6O8r7n9N7q3J59j09K9N6j27M9j4J66j06L6lmN5j09
5986c7O3r0J3J42J7j10l1m2O4j9k9R4P3j01K9l4n7K1L0m6mK8Q5m7n7k8R1j02N9
6015b5J0J27o8o0K1O1j08j6J46L4k21R1P7j04J68j24n2k8R1k2J5QK2q9m3k2J16
6042ERk9j7K0j20M8R2k9J11o8j95J49m9L0J13n8l3Q9l8O7j66J17L0j29O2m8K1
6069a6J13p9l7K4J3MN5n1k14P9R7J15j41J34K5j84o2KJ11j02P7lJ58j79R2j20
6095h9MJ01o2k2J40l2o9K2k0Q9n0j57K60j63qJ03l1m0Q3j28K0PN0jk0P5m9q2J04
6124C5qj22L1Q2Po6R5o3l1k1J66j07j52K05q2Q1J1j44N5M0k9J31q4K6n5j2j0n9
$$ y = [-60, 19, -24, -20, 117, 13, 20, 33, -13, -88, 116, -50, -14, -51, 56, 15, -1, -64, 20, 33, -15, -52, 33, 28, -119, 19, -99, 61, -137, -95, -21, -48, -140, 25, 35, -1, 67, -30, -89, -32, -115, 44, -65, -36, 20, -107, -58, -72, 94, -12, 24, 21, 17, 72, -37, 26, -64, -51, 91, 108, -2, -33, -75, -11, -30, -59, 35, 108, 7, 36, 2, -55, -34, -4, -50, -54, -26, 59, 12, -45, -73, 18, -84, -25, -15, 112, 44, -16, 5, 66, -42, -58, 88, 122, -99, -8, 69, -35, 133, 9, -43, -71, 20, -2, 13, 21, 43, -46, -89, -111, 5, 14, -15, -32, -12, -132, -84, 8, -21, 90, 22, -173, -24, -73, -43, 70, 12, -21, 68, 30, 97, -69, 48, 78, -51, 11, -37, -16, 97, 18, -19, 5, 18, 22, 77, 26, -188, -109, -12, 103, -38, 96, 121, -63, -125, -123, -12, -114, -37, -40, 118, -61, 31, -89, -85, 16, -46, -68, 72, 40, -29, -7, -27, 62, 12, -145, 115, -48, -56, 47, 16, -24, 59, -69, -49, -42, 8, 7, -13, 62, 13, -69, 35, 27, -95, -64, 18, 25, -41, 54, -9, -40, -61, 105, -2, -154, 51, -31, 50, 61, -83, -28, 12, -17, 114, 30, 56, 1, -11, -21, -80]
6152h0K7j5J48m6j3m4N7ro8K6l8L1L2M0o2m3Jj9Q0J1n0M8j11l4J83m1J02j5k56
6181a58P0J28Jm4J8m7Q7j0q2K7LOr4L3J08o0J37k77J60l6R4l2r0R3r7j22J59P5
6209E0p7P3k1j6m7q2P8j9p7J20mJ26j26M0k6J16k37J55p0J2m1J23j03NQ6m0j5
6236a7O1opn9KJ19m0j19P1r8J21J03k6q0p2L1q4L3Oo3j3J50m2K0m3J36q3P5k1
6265E5k3j28L0J57r9L5l7L1J3J5j07J27m5j79J66K0n3k4K5pJ12p4q2J85p8l7P5
6292G3q9P7n3j06N1J19j22O7j6m6J49j4J0n1K5j6l5n4J05j51J31k7k3Q9n0L0k59
$$ y = [-80, -53, -68, 80, 34, 21, -23, 34, 25, -43, -17, -55, -24, 8, 48, -14, -57, -56, -75, 5, 16, -34, 14, -97, -131, 52, 11, 113, 98, -158, -88, 40, 41, -3, 15, -32, 55, 45, -37, -10, -7, -1, -95, -62, 46, -14, 123, -154, 6, -30, 64, 32, -58, 35, -62, -184, -25, 50, -27, 46, 25, 9, -38, -120, -42, -61, -138, -18, -22, 104, -22, 18, -8, 108, -129, 26, -44, -32, -73, 50, -53, -48, 38, -2, -17, 44, 38, 31, -28, -26, 93, 53, -66, 5, -93, 28, 131, 105, 25, -47, -16, -100, -67, -61, -124, -137, 13, -29, -9, -52, 84, 1, 76, 55, 32, -96, -66, 91, -8, 27, -10, 21, 34, 49, -58, 69, 24, -155, 11, 31, -22, -46, -21, -28, 84, 10, -72, 113, 35, -2, 73, -16, 61, 8, -98, -47, 72, -50, 17, 1, -45, 104, 90, 100, 49, 74, 58, 23, -31, 74, -77, 54, 27, 4, 93, 43, 73, -186]
$$ [...]
8191c
##END NTUPLES=NMR FID
##END=
