##TITLE=1H_DE-80H_X3
 200.13MHz, d2o
 8 sc
 
 19ns.26.2.2025
##JCAMPDX= 6.0         $$ Bruker NMR JCAMP-DX V2.0
##DATA TYPE= NMR FID
##DATA CLASS= NTUPLES
##ORIGIN= UXNMR, Bruker Analytische Messtechnik GmbH
##OWNER= pz
$$ XWIN-NMR		Version 3.5
$$ Thu May 29 12:47:08 2025 Russian Standard Time (UT+4h)  Yarkov@DPX200
##.OBSERVE FREQUENCY= 200.1313
##.OBSERVE NUCLEUS= ^1H
##.DELAY= (6, 6)
##.ACQUISITION MODE= SIMULTANEOUS
##.ACQUISITION SCHEME= undefined
##.AVERAGES= 8
##.DIGITISER RES= 18
##SPECTROMETER/DATA SYSTEM= spect
##.PULSE SEQUENCE= zg30
##.SOLVENT NAME= CDCl3
##.SHIFT REFERENCE= (INTERNAL, CDCl3, 0, 14.3821)
##AUDIT TRAIL= $$ (NUMBER, WHEN, WHO, WHERE, WHAT)
$$ ##TITLE= Audit trail, XWIN-NMR		Version 3.5
$$ ##JCAMPDX= 5.01
$$ ##ORIGIN= Bruker BioSpin GmbH
$$ ##OWNER= Yarkov
$$ C:/Bruker/XWIN-NMR/data/yarkov2/nmr/H-C/1/audita.txt
$$ ##AUDIT TRAIL=  $$ (NUMBER, WHEN, WHO, WHERE, WHAT)
(   1,<2025-05-29 12:46:27.60 +0400>,<Yarkov>,<DPX200>,
      <created by zg, POWCHK disabled, PULCHK disabled
       configuration hash MD5:
       00 E9 B6 7A A2 85 ED C7 34 08 36 98 17 FE 4E 26
       data hash MD5: 16K
       B8 61 A8 06 43 FF 4D 98 B3 D4 DF 22 CB F5 AD E4>)
$$ ##END=
$$ 
$$ hash MD5
$$ 52 CD 39 5A 24 9E 18 AF 2D 42 CD 90 FF A4 36 7C
##$RELAX= 
##$RELAX= 
##$RELAX= 
##$RELAX= 
##$RELAX= 
##$RELAX= 
$$ Bruker specific parameters
$$ --------------------------
##$DU= <C:/Bruker/XWIN-NMR>
##$EXPNO= 1
##$NAME= <H-C>
##$PROCNO= 1
##$TYPE= <nmr>
##$USER= <yarkov2>
##$AMP= (0..31)
100 100 100 100 100 100 100 100 100 100 100 100 100 100 100 100 100 100 
100 100 100 100 100 100 100 100 100 100 100 100 100 100 
##$AQSEQ= 0
##$AQ_mod= 1
##$AUNM= <au_zg>
##$AUTOPOS= <>
##$BF1= 200.13
##$BF2= 200.13
##$BF3= 200.13
##$BF4= 200.13
##$BF5= 200.13
##$BF6= 200.13
##$BF7= 200.13
##$BF8= 200.13
##$BYTORDA= 1
##$CFDGTYP= 0
##$CFRGTYP= 5
##$CHEMSTR= <none>
##$CNST= (0..31)
1 1 145 1 1 1 1 1 1 1 1 1 1 1 1 1 1 1 1 1 1 1 1 1 1 1 1 1 1 1 1 1 
##$CPDPRG= <>
##$CPDPRG1= <>
##$CPDPRG2= <>
##$CPDPRG3= <>
##$CPDPRG4= <mlev>
##$CPDPRG5= <mlev>
##$CPDPRG6= <mlev>
##$CPDPRG7= <mlev>
##$CPDPRG8= <mlev>
##$CPDPRGB= <>
##$CPDPRGT= <>
##$D= (0..31)
0 0.7 0 0 0 0 0 0 0 0 0 0.03 0 0 0 0 0 0 0 0 0 0 0 0 0 0 0 0 0 0 0 0 
##$DATE= 1748508386
##$DBL= (0..7)
120 120 120 120 120 120 120 120 
##$DBP= (0..7)
150 150 150 150 150 150 150 150 
##$DBP07= 0
##$DBPNAM0= <>
##$DBPNAM1= <>
##$DBPNAM2= <>
##$DBPNAM3= <>
##$DBPNAM4= <>
##$DBPNAM5= <>
##$DBPNAM6= <>
##$DBPNAM7= <>
##$DBPOAL= (0..7)
0.5 0.5 0.5 0.5 0.5 0.5 0.5 0.5 
##$DBPOFFS= (0..7)
0 0 0 0 0 0 0 0 
##$DE= 6
##$DECBNUC= <off>
##$DECIM= 32
##$DECNUC= <off>
##$DECSTAT= 4
##$DIGMOD= 1
##$DIGTYP= 9
##$DL= (0..7)
0 120 120 120 120 120 120 120 
##$DP= (0..7)
150 150 150 150 150 150 150 150 
##$DP07= 0
##$DPNAME0= <>
##$DPNAME1= <>
##$DPNAME2= <>
##$DPNAME3= <>
##$DPNAME4= <>
##$DPNAME5= <>
##$DPNAME6= <>
##$DPNAME7= <>
##$DPOAL= (0..7)
0.5 0.5 0.5 0.5 0.5 0.5 0.5 0.5 
##$DPOFFS= (0..7)
0 0 0 0 0 0 0 0 
##$DQDMODE= 0
##$DR= 18
##$DS= 0
$$ [...]
##$SUBNAM2= <"">
##$SUBNAM3= <"">
##$SUBNAM4= <"">
##$SUBNAM5= <"">
##$SUBNAM6= <"">
##$SUBNAM7= <"">
##$SUBNAM8= <"">
##$SUBNAM9= <"">
##$SW= 18.0517328524113
##$SWIBOX= (0..15)
0 0 2 0 0 0 0 0 0 0 0 0 0 0 0 0 
##$SW_h= 3612.71676300578
##$TD= 16384
##$TD0= 1
##$TE= 0
##$TE2= 300
##$TE3= 300
##$TEG= 300
##$TL= (0..7)
0 120 120 120 120 120 120 120 
##$TP= (0..7)
150 150 150 150 150 150 150 150 
##$TP07= 0
##$TPNAME0= <>
##$TPNAME1= <>
##$TPNAME2= <>
##$TPNAME3= <>
##$TPNAME4= <>
##$TPNAME5= <>
##$TPNAME6= <>
##$TPNAME7= <>
##$TPOAL= (0..7)
0.5 0.5 0.5 0.5 0.5 0.5 0.5 0.5 
##$TPOFFS= (0..7)
0 0 0 0 0 0 0 0 
##$TUNHIN= 0
##$TUNHOUT= 0
##$TUNXOUT= 0
##$USERA1= <user>
##$USERA2= <user>
##$USERA3= <user>
##$USERA4= <user>
##$USERA5= <user>
##$V9= 5
##$VALIST= <valist>
##$VCLIST= <CCCCCCCCCCCCCCC>
##$VD= 0
##$VDLIST= <DDDDDDDDDDDDDDD>
##$VPLIST= <PPPPPPPPPPPPPPP>
##$VTLIST= <TTTTTTTTTTTTTTT>
##$WBST= 1024
##$WBSW= 4
##$XGAIN= (0..3)
0 0 0 0 
##$XL= 0
##$YL= 0
##$YMAX_a= 119505
##$YMIN_a= -83276
##$ZGOPTNS= <>
##$ZL1= 120
##$ZL2= 120
##$ZL3= 120
##$ZL4= 120
##$ABSF1= 10
##$ABSF2= 0
##$ABSG= 5
##$ABSL= 3
##$ALPHA= 0
##$AQORDER= 0
##$ASSFAC= 0
##$ASSFACI= 0
##$ASSFACX= 0
##$ASSWID= 0
##$AUNMP= <proc_1d>
##$AZFE= 0.1
##$AZFW= 0.1
##$BCFW= 1
##$BC_mod= 2
##$BYTORDP= 1
##$COROFFS= 0
##$CY= 83.5205535888672
##$DATMOD= 1
##$DC= 2
##$DFILT= <>
##$DTYPP= 0
##$F1P= 10.8118882576601
##$F2P= -7.23987719738617
##$FCOR= 0.5
##$FTSIZE= 0
##$FT_mod= 4
##$GAMMA= 1
##$GB= 0.15
##$INTBC= 1
##$INTSCL= 1
##$ISEN= 128
##$LB= 0.25
##$LEV0= 0
##$LPBIN= 0
##$MAXI= 10000
##$MC2= 0
##$MEAN= 0
##$ME_mod= 0
##$MI= 1.114404
##$NCOEF= 0
##$NC_proc= 0
##$NLEV= 6
##$NOISF1= 3.799351
##$NOISF2= 2.8
##$NSP= 1
##$NTH_PI= 0
##$NZP= 0
##$OFFSET= 14.38212
##$PC= 1
##$PHC0= -1708.697
##$PHC1= 8.766559
##$PH_mod= 1
##$PKNL= yes
##$PPARMOD= 0
##$PSCAL= 0
##$PSIGN= 0
##$REVERSE= no
##$SF= 200.129724274929
##$SI= 16384
##$SIGF1= 3
##$SIGF2= 2
##$SINO= 400
##$SIOLD= 16384
##$SREGLST= <1H.CDCl3>
##$SSB= 0
##$STSI= 0
##$STSR= 0
##$SW_p= 3205.1282051282
##$SYMM= 0
##$S_DEV= 0
##$TDeff= 0
##$TDoff= 0
##$TI= <>
##$TILT= no
##$TM1= 0
##$TM2= 0
##$TOPLEV= 0
##$USERP1= <user>
##$USERP2= <user>
##$USERP3= <user>
##$USERP4= <user>
##$USERP5= <user>
##$WDW= 1
##$XDIM= 8192
##$YMAX_p= 0
##$YMIN_p= 0
$$ End of Bruker specific parameters
$$ ---------------------------------
##NTUPLES= NMR FID
##VAR_NAME=  TIME,          FID/REAL,        FID/IMAG
##SYMBOL=    X,             R,               I
##VAR_TYPE=  INDEPENDENT,   DEPENDENT,       DEPENDENT
##VAR_FORM=  AFFN,          ASDF,            ASDF
##VAR_DIM=   8192,          8192,            8192
##UNITS=     SECONDS,       ARBITRARY UNITS, ARBITRARY UNITS
##FACTOR=    0.0002768,     1,               1
##FIRST=     0,             0,               0
##LAST=      2.2672688,     0,               0
##MIN=       0,             -83276,          0
##MAX=       2.2672688,     119505,          0
$$ Real data points
##PAGE= N=1
##DATA TABLE= (X++(R..R)), XYDATA
$$ [...]
1000d79n87J526l4r80J655l23r05P98m45j29j09q71O36K80j177J376M04j228J290
1019F98J07k59O32p63K28N31j525O05N53j470M67L33n80O82l79j02R69j243K96
1038b20J088j236P9N83q28L59j86k84Q52q90j62J248j094j45J125q61K74L04l86
1057c80P48m23o79J480j011n62J236p34l14Q66m18N46L6n10J153l14p54J263m52
1076G77r24O24l58L0L59j050P44j8q20J106J07p85O88k58n7M72r77M53J47j280
1096a020N66M69j044M31M1m14N45l15J40R03j097L86J001r71K80N72o97M50k21
1115Ej67O59q38rJ278q45lQ16m42J58N0m62O83m52o55J027q39l69Q36l67l64N19
1137B19n55O21m8o69P68l54p81R03m17n79O86o48K90L36q18R51J33o93R09r9k73
$$ y = [-479, -1066, 460, 426, -554, 1101, 778, -127, 671, 226, 97, -12, -883, -247, 33, -1144, 232, 636, -592, 698, 805, 546, 1178, 415, 643, 1174, -351, 254, 807, -663, -196, 137, -443, 239, -140, -242, 727, -516, -220, 868, -368, -289, 294, -534, -175, -361, -645, 207, -683, -845, 403, -691, -836, 289, -572, -298, 6, -380, 368, -55, -734, 746, -265, -827, 409, -325, -639, 227, -191, 355, 391, -119, 1034, 720, -34, 1229, 777, -147, 477, 119, 149, 508, -542, 202, 184, -636, 470, 577, -208, 480, 222, 165, 637, -340, 113, 260, -1020, -454, 15, -1029, -598, -557, -971, -426, -741, -601, 302, -795, -409, 592, -379, -99, 473, -224, 226, 5, -162, 497, -341, -350, 928, 83, 80, 896, 454, 612, 662, 200, 883, 431, -224, 803, -36, -405, 431, 64, -300, 219, -336, 285, 237, -432, 336, -18, -799, 104, -313, -892, -206, -854, -564, -228, -1046, -95, 38, -655, 254, 155, -118]
1158a18O61l47o8M43q98P08K58j153O64L05p78M52R2j89L72o34K87P74j060L51
1178A22N85q49K89J69n61M32m65j75O77p53P7P94q98J86N35n33L27J6l87Q74n67
1199a05j94Q41o86j74O06m36J07L15n32N78j22o37Q29l28m77P27l23k88N71n36
1219b64M16p1n80Q72l7p71P53o3m55N70l34j19L55p75M57K39p66N73K70o82N77
1240A65j16j69L97n21K23L98p00K53M80q53L52L13m26O31m03k62P93q35L7P06
1260D63q76Q9N16m99L24Lk36O70m53j40Q03n94j74N21n46J61J01o69O27k37m56
1281f02P65k69k81O82j18j12K04n11M38J78p94N60P0o41N08j9k05L34l10J02K93
1302B72o72N49J27p44O52K9m58M98r5j93L93n30K07M09q08L99J73n27K51K23n15
$$ y = [-118, 543, 196, 128, 571, -327, 381, 639, -514, 150, 455, -323, 129, 221, 32, 404, -230, 57, 831, -229, 122, 707, -142, 147, 316, -245, 187, -278, -453, 224, -529, -452, 342, -556, -370, 165, -368, -41, -25, -412, 462, -105, -299, 542, -144, -318, 288, -148, -41, 274, -258, 320, 198, -439, 390, 62, -415, 312, -11, -299, 272, -264, 152, 81, -499, 373, 336, -435, 318, 255, -200, 370, 36, -83, 272, -503, -46, 193, -573, 0, 270, -412, 165, 49, -120, 277, -244, -21, 377, -323, -70, 410, -443, -91, 222, -204, 427, 24, -238, 555, -280, -243, 463, -413, -324, 192, -307, 17, 20, -216, 454, 1, -139, 664, 70, -104, 417, -129, 32, 133, -536, 91, -146, -602, 163, -106, -387, 295, 177, 65, 269, -242, 196, 374, -420, 140, 210, -431, 77, 58, -147, 187, -123, -21, 272, -400, 149, 276, -468, 184, 213, -245, 253, 158, -35, 358, -172, 35, 444, -364, 35, 208, -319, -68, 155, -360]
1323c60N11k76j09N62n36J59M71o47J96O3l82M02o1k77O51m36q2O02l47p3L40
1344C71l58J39n7k95M06k37m40O41l21k57O89l06L0K08k13L46J5o56O27j30n53
1365c51N39l26l41M30l82K24L03m79M25K71n96M94P1l43L43j41k35K49m40J57
1385a28K12n46L44L58o31N47r6j55M71k86k1M16n00k8K61n45J47K53l77M55k33
1406h2j06O09k42j73N89m12o0K19l42J48j91l38M26l13k06O08l33l9N68k96M4
1427G8K75m05L32n6o01M70k49m00M93l01m3L63k79K05L64m57M16J15l79L77o3
1448B55l69L20l58m8M16m58K29M33m85J88K05l00K80k65q0L06l43l6L00n22J78
1469a54M08m70J81J53k55L13l13k04N50n85N8L31k20j2L52m42L62J1k05M02k49
$$ y = [-360, 151, -125, -234, 328, -208, -49, 422, -225, -29, 34, -348, 54, -7, -284, 367, -69, -151, 451, 104, 31, 371, 13, 152, 95, -200, 206, -31, -471, 170, -151, -408, 281, -25, 5, 213, 0, 346, 361, -295, 332, 202, -351, 188, -138, -479, -49, -431, -207, 96, -383, 42, 313, -283, 211, 282, -61, 282, 141, -94, 155, -285, -128, 84, -462, -118, 240, -391, 156, 60, -95, 376, 90, 69, 485, -15, -43, 218, -327, -180, 73, -304, 151, -82, -188, 421, 179, 6, 595, 183, 123, 342, 0, 148, -43, -381, 45, -268, -474, 134, -199, -238, 330, 34, 78, 353, -52, 280, 224, -377, 93, -156, -556, -63, -364, -407, -44, -323, -118, 246, -211, 205, 320, -59, 318, 255, -114, 206, -152, -200, 216, -242, -13, 420, -65, 123, 328, 28, 308, 43, -37, 269, -74, -110, 190, -332, -154, 254, -216, -35, 118, -137, 176, -137, -341, 209, -376, -318, 13, -207, -219, 133, -309, 53, 64, -141, 261, 12]
1490A2k54N86m05k7L09k51P5K65k97K30j9k93L59k92k07L26j84n5K09k78K00J58
1512A67l36M03J63m53L36k04k78L14l02q5K26l74K64K65n14M12K24k30K11o9j65
1533b5L37l61O4K58m38J04K53l15J53J32p7K31l42M2L40l84r9L00l32M6J50l07
1555b70K35l5n5L99k36j66K90r1j27J65l42Q7J87m15K99O0j75L18o0k49L91k93
1577h3J60jj92K92j9m14M38l3j84K77k04k8L02k40j00J08l59J80J09l03K74J56
1599A36l67K28m0Q2J14o2j7L0k91R4J92m76K83q4q0L67k30M7K64k42J59J41k64
1622a6K22o9l69K48r1k71M72k09j15L94l21O6K20j48J63p2q1J10j14l30M15j90
1644h6j57L10j79J31J93l16K79ll33L28j30l08K89j02j39J93k53K50Nk18K30J83
$$ y = [12, -242, 344, -61, -88, 221, -30, 45, 310, 13, 243, 224, -69, 290, -2, -209, 117, -67, -122, 87, -191, 9, 167, -169, 234, 397, -56, 280, 76, -202, 112, -190, -275, -49, -423, -159, 106, -408, 4, 228, -2, 209, 140, -25, 312, -49, 15, 273, -165, -61, 192, -123, 30, 162, 85, 316, -26, 16, 356, -28, -127, 173, -159, -113, 37, -270, -35, -70, -125, 274, 38, -128, 162, 71, -56, 109, -233, -146, 41, -374, -75, -15, -190, 128, 68, -181, 210, -83, 77, 76, -116, 176, 157, -257, 181, 148, -36, 241, 37, 9, 311, 71, -29, 79, -280, -100, 9, -294, -20, 136, -231, -3, -43, 39, 153, 91, 74, 104, -187, -93, 99, -377, -94, -178, -258, 109, -121, -74, 190, -52, 107, 248, -16, 206, 137, -232, 16, -75, -346, 126, -83, -198, 196, -125, -59, 161, 13, 176, 104, 23, 133, 19, -311, 104, -86, -243, 67, -112, 19, 212, -104, 175, 172, -161, 167, 37, -271, 18, -84, -223, -30, -283, -33, -28, -246, -16, 167]
1666A67k81K65j54l8K35l48J40J87k17p3R5k29J21J67k36K84j49N1J66k12L6K68
1688B45l15L6K62l98J65L4k36L53j40j54L99k71j6J94k06qJ84l41J07J94l25M72
1710B35j90k03K88k37q5L07k96L40n3j71J73o5k90J82J28l46K90pk30J71MQ1Q7
1733A13k07J13P7k21J77o6j18K09j15K7N3n7J85J16k71J88L0k15K55k27j01J61
1755A06k35J29J43p4q2K73j77j2K9j72R8k71l4K85k64O1J79j51N1J42o9Q6r2j80
1779b31K34jl10K89j60M0L16o9J4L4o1J61p8k45J89j66p6J62j56M5K73k06K98
1802B96n4j38J72l7k44J09j63k36J78k31K63K6j77J94M2M3O8N5k13J11k23jJ09
1825e1l40J09Q3l6K45P4j27K66p5j58K94j76j52J24j15n6O2q9J00L3j66L55K0
$$ y = [167, -114, 151, -3, -41, 194, -154, -14, 173, -44, -117, -22, -251, -130, 37, -199, 85, -64, -13, 153, -59, -23, 245, -70, -34, 228, -170, -5, 29, -207, 146, 6, -148, 251, -20, -36, 158, -48, -56, 128, -213, -106, 88, -237, 235, 45, -158, 130, -107, -192, 115, -181, 159, 106, -65, 108, 43, -247, -65, 63, -283, 7, 0, -230, -59, -55, 26, 113, -94, 19, 96, -125, 52, -14, -132, 77, -38, -11, 42, -15, 170, 286, 15, 203, 233, 18, 273, 46, -55, 106, -129, 0, 143, 69, -13, 260, 83, 71, 100, -72, 26, -245, -279, 6, -258, -197, -18, -169, -118, 24, -45, 41, -51, -231, 3, 2, -308, -19, -179, -139, 177, 108, 122, 156, 95, 256, 178, -67, 122, -44, -120, 42, -114, -69, 204, -2, 296, 242, 104, 276, 239, -5, 104, -59, -295, -117, -348, -85, -59, -236, -42, 0, 43, 111, 166, -47, 64, -159, -160, -51, -391, -282, -199, -235, 10, 84, -43, 223, 148, -10, 284, 108, -44, 80, -35, -91, -29, -118, -18, 15, -151, 204, 224]
1848B24j94L51k36k04K13k04j17J52k35K80J7k57J81J44j17J74j43n5J01j99l4
1869a58J56l23K17J69l09L97k42P8K54j15L5K7k95J26j2j47O0O7p9K34k8r6J49
1892A65l9L2O1k14k6oj42J41N0q2L9K8m2J63k4j34J55j77m3J21k10K06L3k78K62
1917C9p0KK31k59K0N5n7k5J55j43J35qk34K07N0k68L21j57L3J21k83O3K22k73
1941a23J47m5j02K57j42p6K62k50L8K01l78K60Pj78N8J53j77K77k68L3P8r5M7
1964a6rq8Q9R6j77Q4J16k72K12j44j06K32k45J99%m8Q2P9j10K41L2j30L1j52L9
1989C5K6k63J83R6j04P7K07k77J55J7j72J18J8n0j1q4j17J83j77Q6J05k35L03
2012A19M3l21K68r3n0J19k05L8J32k07J13Nj38J33J2j31K03Np5J84j05P6j5K2
$$ y = [224, 30, 381, 145, -59, 154, -50, -167, -15, -250, 30, 47, -210, -29, 115, -2, 172, 29, -26, 75, -124, -158, -2, -325, -108, 61, -248, 149, -93, -15, 239, 124, 159, 186, -109, 17, 5, -142, -82, -15, -94, 140, 112, 16, 165, 126, 158, 219, 5, -21, -27, -169, -28, 22, -60, -21, 7, -35, 128, 104, -30, 125, -52, -95, 26, -184, 22, 55, -223, 39, -31, -29, 202, -57, -37, 18, -39, -64, 91, -52, 83, 75, -159, 48, 98, -170, 151, -6, 27, 148, -135, -72, 150, -123, 24, -21, -123, 134, -8, -84, 178, -72, -34, 167, -211, 49, 56, -122, -64, 89, -88, 189, -79, -46, 32, -63, -16, -25, -113, -24, 72, -105, -21, 95, -177, 35, -109, -215, 17, -228, -29, -29, -77, 5, 84, -26, 215, 247, 117, 148, -4, 35, 61, -202, -19, 77, -27, 50, 257, -20, 135, 152, -20, 98, 116, 66, 55, -29, -146, 37, -140, -54, 51, -184, 119, 162, -159, 109, 16, -34, 85, -120, -82, 50, -157, -44, -39, -177, -44, -32, -163, 40, 45, -30, 154, 49, 125, 110, 132]
2036A32n4j15%J06n4k38J38P4p8J99q1J00lj3J69p0k20J0N3j27R7k30K5K47k05
2061a38N1J81r9K9R5j31Q8j5j47J12q0k14J91j47K18J4K7r5J49j08K09Rk12L7
2085B4k2q2J38q6q0K5j13J90J25r2J32j5j96J61m7j95K06k21J40J29l20J70J8
2108a1k0O5m8n5N1k3L4L5o1r9J34j4oM6j01Q0lj30K11j12l4N2j18N2K55k72J49
2135E7J27k17J85J1l00J97j05J3J3j41J88K8j02J0J65k36Q5K2L3J61k64N5O7k11
2159a59J02n3M2J43o1P0K1l3p1J24o2j29N9o1J6j4l6P2J28j92P2J53j27Q0k8j46
2185i0J80k10j6J13j12J57Q3j21N7j11R8N1j56J47q3j84J11M8m8P3Q8n2Q5j22
2209a4LP5oPJ54k64rK8j53Q7N4k4J16p4j42J92k0l8J46j73m3K07k09K25o4k01
$$ y = [132, 78, -37, -37, 69, 15, -223, -85, -11, -89, 110, 29, 129, 126, 113, 282, 212, -8, 2, 55, -72, 25, -205, -180, 67, -138, -87, 94, -5, 24, 119, -12, 76, 61, -86, 26, -54, -268, -77, -224, -6, 8, 35, -60, 89, -19, 190, 199, -13, 24, 2, -80, 58, -28, -108, -83, -196, -6, 119, 27, 159, 144, -52, 109, 62, -133, 73, -148, -8, 121, -199, -29, -11, -31, 34, -14, -69, -18, -41, -7, 28, -33, -132, 2, -12, -18, 28, -73, 7, 4, -126, 85, -27, -61, -9, -127, -75, 180, -92, 57, 184, -33, 152, 163, -137, 60, -45, -32, -19, -160, 28, 56, -46, -36, 129, -107, -22, 0, 33, 194, -70, -15, 52, -159, -57, -110, -68, 75, 14, 84, 105, 72, 1, 125, 63, -66, -7, -68, -52, -66, -102, -30, 98, -94, -22, 131, 4, 84, 56, -90, 90, -120, -136, -23, -135, 22, 105, -16, 41, -70, 28, 79, -77, 70, -13, -197, -86, -38, -86, -13, 75, 23, 108, -14, -11, 64, 58, 65, 219, -45, -54, -26, -179, -92, -38, -62, 54, -20, -162, 30, 10, -28, 118, -55, -98, 109, -100, 125, 61, -140]
2235a40J34m2j45J50j0L9L3k6Q3M0k34J49L0j61J90o1r2K51l12P8R8q9N3J46j07
2260E5m9Mm2Q2l4q3Q6o3n1N9p1Q0m1j5J36K9j82J67p6J2J88k14L1M2j43n3Q4L0
2288c2l0P9m9R4o7M8M2j86J74O3j34M2r0j0J1N4l2M2K5j32K54j85K7L5j51J39
2314C1n1o4P3J6o2K00q8k1m4n5J44j18j67J83k9n9J54kp4J61j83K0K00j37n4M0
2340A4j48R3N1j0N9J2j43J98j20J4O9j03L1L5j82J22j4JM9o6n2J41o5R0N6j64
2366c2R4j1j41J37J12j89N0K9j18J37j05N9j1j03P0J27j79J3J38j63J31q5J13
2389G3K5j53M1J10O0r3no9j9o3k9K53j50n4J02j04J70j09N8p6J56q1j00K29k09
2414c7Q7L0m1j46L4pJ19p0O1Q9K0o7J4j06q9J70j30K7m2O1R7j49R6N8l7pP0j16
$$ y = [-140, -6, -48, -193, -43, -53, -14, 19, -7, 76, 116, -118, 31, 61, -100, 90, 29, -63, 188, -124, -46, 52, -37, 16, 162, 55, 6, 10, -32, 50, 16, -67, 19, -44, -95, -36, -107, -27, -68, -83, 53, 82, -100, 67, -9, 3, 191, -23, 8, 50, -93, -146, -62, -32, -62, 17, -32, 62, -5, 43, 85, -101, 73, 136, 2, 44, -46, -56, -45, 9, -23, 19, 44, -88, 166, -19, 8, 43, -108, 31, -20, -84, -11, 5, -57, 143, 55, 34, -10, -65, 79, -39, -206, -23, -52, -111, 43, 41, -33, 128, -55, -35, 165, 28, -26, 14, -134, -41, 10, 0, 59, 71, -72, 126, 6, 20, 89, -14, 17, 52, -130, -8, -22, -21, 28, -38, -90, 51, -14, 76, 132, -32, 62, 51, -90, 47, 159, -30, 20, 49, -69, 68, -37, 22, 11, -92, -22, 105, -74, -61, 77, -86, 45, -40, 73, 98, -55, -14, 96, 156, 63, 58, -11, -30, -93, -122, 131, -19, -73, 29, -75, 95, -14, 44, -32, 124, 43, -57, 172, -37, 50, 80, 39, -107, -73, -80, 39, -31, 30, 119, 139, 72, 86, -20, -109, 61, -69, -42, -84, -23, 74, -75, 21, 79, 42, 35, 105, -11]
2442a1o0l2O4ko7p0J40M4q5J16o3K8N4j34P2J1j17J98p0K3O4j59mJ16l7r0J00
2469B9k0M3r7K7m0O1j26J71m5L0m6qJ22L1k21J66k00P3J69j66k9M9m7J05L7l3
2495C5q8Q2n9j3M7O4qj30J43j02r5J02J59j45l5pQ6j7M6k0j14K5p6M4J39j43M7
2522c3j6P2Q0j53J24m5m1O3j39rJ21J00n3j7j42O6oo8J58j04r8J71oJ5K7p2Ml3
2550c4J25j48Q5o5O6m2j55J00O1J7K0j65J47l3o0J47k0Jn8L4nN4Rj3l3P6j43J32
2578A00r1N8p8m8O6j08K7NJ25o2m7o7J56jj33J86p1m2k6J5p3L1q5J88K8q8K1M4
2606C0o2Q6l0pJ40q9j53J23o1Q7k7p0m2R2o9J61j00j01J93r5Q1Ln0O8j4j71j2
2633h9J70j05l1k7N0J16j39L5j5K9L2K7j55O6pj37K32j63K0J28l8r2J00k0R0o7
$$ y = [-11, -71, -103, -39, -41, -108, -178, -38, 6, -79, 37, -26, 2, 56, -78, -6, 5, -112, 86, 16, 39, 103, -56, -60, 56, 19, -71, 29, 9, 52, -45, -18, -58, 3, -123, 48, 3, 33, -13, -21, 101, 132, -89, 77, -123, -50, 119, -47, -76, -27, -74, 31, 68, 35, -53, 29, -30, -43, 4, 68, 60, -70, 73, -29, -124, -22, 137, -8, -43, -50, 36, 19, 65, 45, -69, -44, -120, -76, 63, -80, -33, -49, 23, 103, -50, 74, 29, -12, 51, -88, -97, 24, 124, 71, 54, -88, -22, -28, -96, 62, -42, -140, 31, 25, 40, 67, -5, -1, -34, 91, -57, 28, -37, 29, -13, -168, -68, -7, 10, 30, -135, 12, -21, -81, 66, 46, 47, -11, 23, 18, 72, 81, 68, 35, 111, -32, 100, 9, 67, -11, -59, 7, -101, -74, -69, 56, -6, -53, -120, 36, 35, -98, 88, 17, -25, -51, -36, -109, -78, -163, 25, 53, -35, -14, 30, -32, 54, 24, 17, 157, 68, -85, 38, -23, 64, 37, -33, -75, 17, -52, 109, 9, -92, 101, 6, 87, 90, 40, 108, 94, -77, -89, 81, -24, -55, -82, -32, 84, -55, -20, -35, -6, 26, 53, -102, -36, -43, -180, 52, -111, -91, 37, -1, -93, 7, -13, 77, 10]
2659A0j01J84j02l7k3QL0n1LN6J9J2O2m4J1M4j17P1L2m3j22K46k68M5J01l1O7
2686F2n4j13J23j40P2J23j44J09k3p0r4K11r1J19L0j06j01J93r3P0Kj30J08j50
2710h7P7J20j55N8m4Nj3J41k06J40N9k60O5J16n5N7l7J9m5j7j2J47omk24K22q2
2737b1j01J64p5N3j1l9KK04j38j19L5J48j77N5j3O5m4q0J28Mn6O6j27R0O5q1N8
2764E5N7j39R6o4j61J49J0k3J13p4j1J0n0N3K0K5j06L9O3j12M1j4Nj04R3N5o5
2791c9J2N1M3m6n9K7R9j09K3J05j22m2O5J0k8j3k1l4J34On1m8l7J72J4j17k9P9
2819D5Qk3q2N4N9j35OJ07m6n3O4PJ07j84P8J19j79j5J15L6j12K7j3k2M5j8J40
2846A35j50j9J81j55k4K0K4j08P9j7r5J68j28J73k4j03MjJ34j51jR8l0J76j68
$$ y = [10, -91, 93, -9, -46, -69, -61, -31, -82, -79, -23, -4, 8, 70, 26, 37, 81, -36, 35, 67, 24, -98, 148, -120, -75, 26, -5, 62, 8, -105, 18, -122, -50, 73, -71, 38, 15, -55, -149, 62, -29, 90, 120, 14, -87, 106, 13, 83, 85, -45, 63, -87, -10, 110, -45, 13, -31, -26, -39, 102, -104, 36, 95, -165, -100, 16, -39, 18, -19, 0, -45, -62, -74, 73, 67, 63, -161, 61, -21, -122, 42, -33, 20, 9, -30, -28, 176, 38, -81, -46, 102, -75, -20, -33, 32, -12, -92, 36, 40, -16, 50, -77, 13, 78, -3, 55, 112, -27, 69, 5, -156, -7, 3, -20, 93, 19, 8, 18, -32, 21, 41, 66, -40, -1, 62, -50, -9, -23, -18, -122, -29, 26, -39, -27, 24, 67, 21, -38, -11, 88, -21, 2, 107, -15, -57, 8, 18, -10, -23, -44, -78, 56, 62, 11, -37, -74, 98, 112, -5, -34, 45, 53, 30, -52, 2, 61, -74, -68, 39, -7, -60, 4, 11, 118, -66, 12, 131, -48, -63, 52, 88, -24, 3, -10, -32, 13, -5, 135, -15, -34, 147, -8, -32, -12, 12, -96, -17, -34, -129, 39, -89, 84, 60, -43, -39, -40, 94, -57, -58, 40, 10, 186, 18]
2871A8n3o1K01j24K4j2o0Q2M0r1L1K7q6R4m3r0M7P9l5n7q9l9J97oq5J97j13J68
2899A61n9p3K7q9J91m2k65J44J24j15O9NJ4j10M5k1l4q0J47K3q4o2k0J72j37K4
2925d5K7N8o9L7J5k1j42J09r3J12R2l9l5M1n4J04K0q9K7j17J9l2J2J05m5l8N8
2952A7p0J06o0Mj42K22O1j75Q9j59j5J22K5k6%j0R9m2l3j6K1q0J33j27L7Ln4J16
2980D6j77R6O9p5lK0M9j6R6j15J67n2k21K57j76j4J07m5o5P9p7J27j59O0L7l0
3006a5O9Lm3n9L6Q8j00M5L8K9j51JJ2K9j8J25j36K0n1M1J8Ll1O6p7M3J02L9r1
3035C5K2j3j06J04j26M0P2n3lN3K3pr8RR1n4qL4J3j3mp0m1L3J2J37l3q0p6J82
3065G5n7M0l8j86K24j15J66j86P6M1lo7R3K6k4Jmj27l8J35j34N8OR8oj00J9lM6
$$ y = [18, -35, -96, 105, -19, 5, -7, -67, 15, 55, -36, -5, 22, -64, 30, -13, -103, -56, 23, -12, -69, -158, -197, 0, -6, -91, 106, -7, 161, 102, 29, 56, -33, 158, 116, -149, -5, 119, 4, 73, 78, 92, -18, 27, 6, -28, -108, 39, 62, -22, -84, -104, 68, -69, -45, -18, 40, -29, 8, 23, 2, -140, -31, -124, -12, 80, 41, 6, 47, -7, 97, 117, 28, 55, -62, -43, -75, -63, 42, -3, -41, 17, -53, 53, -7, -3, -145, 77, 138, -37, 52, -107, -122, 0, 25, -1, -1, -11, 88, 46, 13, -3, 18, -62, 71, -56, -19, -16, -70, 46, -131, -35, 34, -41, -44, -24, 25, 9, 105, -10, 157, 105, -116, 141, -35, -49, 58, 13, -52, 27, -50, 77, -82, -22, 15, -15, 54, 57, 14, -45, -9, 79, -21, 24, 62, 91, -60, -59, -47, -18, -36, 89, -47, -27, -78, -37, -19, -16, -47, 19, -58, -15, 87, 126, 35, 57, 44, -62, 42, -84, -44, 28, -25, -28, 25, 48, 41, -57, -48, 43, -11, -19, 15, 28, 15, 11, -59, -100, -67, -55, 82, 49, -31, -107, 75, 18, 58, 20, -166, 58, -57, 109, -77, -1, 40, 37, -30, 63, 89, 65, 66, 62, -65, -103, 32, -102, -44, -38, 60, 54, -46, -27, -30, 16]
3094A6k4j5mJ9l0Q3j6o4L3Q7r7J6N0N2j08N6m9q4J55k6o3q6J71j29O5J9j54J66
3122C9L5r2O7J7q4k8R2q4O1N7j76L0Mo6J28j1K2o9M2l2R4j51J82k1n4j00l6J13
3150b1L5K1n1K3N4j9M6p8k12K47r8J4M6k4rm7J59j5j5j5J0k1k0P3j30J71j72N6
3178HR8j41l2P5R9p8j04K04p0p1j5K6n2J1R2j51R6J77k30K8O3o6J07l4J4L5r1
3205bl4pJ0MK0p6J39N0j96M9M9J38J0j07k00K02l8o1O6k6L1j7mJ1m3O0m5j6o5
3234i8P4k2QR6J8j27J6o6J27J59k07j9j9m7J35r4k0J57j00P2L9j78J23n9m1M8
3260b5l6Q2m1kM9Mq7J9J15j54J9J6M4O4q3L5K5n2J02j15N3j18J32L0q3oj2l6R7
3289C6m3K8L1j02J01K5q8J3k5j4l6qQ9l4l4O0j28Q3L3q2P0l5P6N8j10r0J88K3
$$ y = [16, -8, -23, -27, -8, -38, 45, 29, -35, -2, 85, -12, 4, 54, 106, -2, 54, 5, -79, 76, 50, -13, -99, 72, -57, 8, 27, -127, 39, 74, -18, 49, 66, -18, -46, 46, -38, 23, 80, -96, -66, -62, -128, 0, -11, 11, -58, -16, -48, 46, -105, 77, 56, 2, -98, -134, -21, 14, 35, -16, 7, 61, 42, 88, 10, -202, 45, -53, -39, 7, -17, -26, -73, 86, 71, 56, 41, 51, 30, 10, 83, -47, 124, -48, 8, 106, -35, -67, 8, 107, 29, -75, 129, 59, -12, -27, -1, -53, -42, 50, -101, -5, 172, -58, -30, 33, -33, 74, 40, 54, 89, -2, -36, -43, -33, -29, -9, -85, 54, 104, -92, -43, 6, 144, 154, 47, -153, 49, 11, -50, 16, -10, 21, 4, 0, 11, -32, 28, -17, -33, -98, -24, -46, -38, 58, 76, -51, -35, -101, 26, 185, -22, -41, -60, -107, 28, -66, -86, 71, -29, 43, 82, -96, 27, -32, -73, -25, -61, 21, -20, -22, 27, 31, -56, -37, 78, -76, -57, -41, 3, 67, -16, 19, 44, -8, 94, -21, 32, -86, 46, 76, -7, -13, -25, -61, 36, -7, 21, 52, -50, 51, 76, -12, 1, -24, -38, -74, -82, 7, -27, -61, -1, -129, -46, -13, -95, -25, -60, 16, 74, -36, -126, 62, 85]
3317H5q1k9K7n3Q4n8o7K7R9%L1j36N2q5J01M5o0J40o9p1m3L6M5Mj06L0M9l1P8
3346D4r9J08k21J09L9M5j53J47M6j12NN4rm8J35q1lo1J28j61R8kJ32n4p4o4J6
3373c6O1j6j11R4n5pJ15q7P2Lj3J7P5j79QjJ14j3m1o6K3N0o9J54j12O4l5Mj8j1
3403a6L6n4J02j50Q0m4L4J2p1K0J21r9m9Q3kO0n7n3j5L7l7M7M9J8q1kk4J44q4
3432EL6L5n0o1N4r5R3j07O1J05j31O8k0lL2j71J06Ro2k2P1P5m9Q0j19K7L8k5J69
3461A49k26Q1O8q8K2O4r2k1K6n1N7J30j73m4K9K0N1j7L6j36J76j10P5n5omM%M1
3490Fj40J07mP6j27K03k23O0JJ5j7m3J42M1j08J14j29NP9j9m1j8O8k3o7j1J8r7
3518a32J49o4Pj20J65K8q0Q4o8l1O0j22J69K7j08P4pq5J33j4j12m8J9N9P4q6N0
$$ y = [85, 4, -25, 2, -51, 33, -25, -92, -65, 34, 34, 65, -71, -19, -104, -3, 42, -18, 122, 53, -18, -61, -25, 20, 24, -82, -52, -3, -34, 44, -55, 53, -168, -59, -20, 25, -128, 19, 65, -47, -42, 12, 3, -45, 90, 9, 6, -55, 73, -88, 10, 8, 140, 86, 12, -52, -36, 25, 9, -102, -8, -63, -70, 45, -42, 30, 33, 20, 37, 112, -67, -59, -60, 54, 41, 0, -66, -43, 7, -62, 92, -20, 44, 9, 13, -5, -16, 20, -34, 68, -82, -2, -46, -12, 0, -71, -51, 70, -29, -78, 5, 3, 63, 6, -47, -62, -25, -62, -15, 34, 52, -29, -31, -55, 89, 5, 41, 76, 26, -35, 19, -76, 17, -90, -29, 76, -55, 13, -7, -10, 22, -149, -43, -34, -96, -118, -47, 28, -21, 59, -60, -33, 5, -20, 149, -77, 4, 72, -16, 6, 70, -22, -43, -17, -68, -11, 119, -54, -98, -69, -49, 2, -15, 21, -115, 61, -49, 26, -29, -35, -39, -35, -35, 6, -134, -27, -31, 45, -82, 121, -102, -42, -41, -26, -43, -86, 56, 97, -11, 103, -26, -21, 58, 39, -2, -20, 48, 25, -42, -53, -35, -132, 17, -47, -40, -160, 5, 33, -47, 37, -31, -62, -2, -124, 45, 72, -36, 38, 31, -54, 79, 65, -47, -95, -76, -17, 57, -29, 21]
3545B1lm0j2N1o7Q3n8m6J38r4J9P0m7%m3k4O0j55J55N3m8K2j05O0p9J15m5Q0j37
3574g6R2P6q2J4rL2j3J6j05R7L9q9K5L1N7q1Np8MM8p4Q1O3j06J32n1j03R1l7j40
3604a41J52qJ36j78M4p7m1M0L1K9r6J13m0p6J25j6J01p6m1N1k0K7m5q0O2k9J41
3631H8q7N0m5O9j23j6P6pKL4q3N9p3oQ6n4l0M8J9k8l2J8P4q0K2N4l4l9M0KJ11
3662A15m6rl6l5J7K5L3m1Oj23R5P6n0n1L4N7p9J8k3P6m5j03L4R2m3M8o8m4J82
3691A12j58J8O3p1O4j6L0j35R2r5J14k0J4Q7j13MK3K0l5J41j95J26j00l9M6K8
3717EK2J0N8p2O8m2no8oJ22q2l8n9L5J8J9Q0j07N1P1r5L8j6n4L1j10K11o6Ol1
3747fn2o5L8L1Q3j02K2J9M3K4K5p2L0po6Q7k5j4J6Rq6N0R8j32J47l0J4m2k08J94
$$ y = [21, 18, -22, -34, 17, -50, 33, -25, -71, 67, -27, -8, 62, 15, 15, -28, -52, 8, -147, 8, 61, 13, 35, -70, -10, -89, 26, -19, 61, -76, 16, 92, 10, 24, 15, 47, 34, 50, -55, 42, 81, -8, 17, 48, 105, 24, 29, -49, -45, 3, -71, 10, 73, -33, 99, 48, -55, 36, -1, -141, 11, 3, 139, -39, 5, -72, -113, -73, -42, -13, -109, 4, -36, -112, 13, -3, 98, 22, -19, 32, 12, 39, -6, -86, -24, -53, 88, 1, 51, 6, 75, -48, -64, 12, 5, 7, 41, -42, 17, -56, -62, 24, -30, -60, -12, 7, -21, -53, -35, 39, -41, -19, 35, 1, -38, 2, 4, 115, 69, 60, 24, -11, 6, 31, 64, 23, 29, -94, 1, 77, 27, -24, 10, 67, -12, 6, -17, 59, 14, -89, -55, 37, -6, 42, -26, -70, 112, -46, -28, 35, -36, 28, 12, 42, -93, -1, -96, 18, -2, 12, 99, -14, -10, 13, 33, -2, 139, -56, 70, -30, -69, -23, 5, 27, 37, 95, 23, 91, 49, 44, -24, -30, 92, 10, -28, -87, -52, -34, -15, 65, -42, 9, 80, -15, 23, 7, -47, -16, -126, 85, 19, 25, -6, -58, -123, -85, -54, 29, -73, -51, -32, 11, 35, 60, -12, 18, 11, -55, 32, 7, -7, 9, 18, -68, -18, 80, -52, 95, 65, 79, 37, -171, 23]
3777B3j8j0K9r5J9O6K3j01M4R4n3L4k0l1j62J43O7l3r3O3%j2N5mJ3k1k9J44j31
3806Dl9K3J36j81K8M1L4J5j41O3P8r6R2p5j27K67o6l8M5N8j28p7O8NjJ49l2p6
3834B9J46j73J0L1j15J75j59Q9J4o1K4J0J1j14J37m8Mj5N6k15N8J91j67OJ20l
3860D1j9K4lj68J04l6k4J71j46k2J19m1k3R7p0l2J10qn5j43J71Qj11J21j52J22
3886C5k4n7l8J00J05o5o4m3jQ8Rj08M8j5k3N2N5K1n4j12P0QO8q5p9J27n7K3q3
3915i9J92L1k21J34q3O4rK9n2%Pk0rm7o1J97O8j69M7L8o5l2O6o5K9L0j60J57k5
3944b8n4K9j1k8M9LP9r8J26o2M2n7l5M1j8Q9j33J17j22Q2M4l5J8k0j5j1j5o6R9
3973A0q6L7R1Jj69J21k6Q6l3q0ll0O6rj7L8N8j4%k2N0p8J1Q2r1nj4N9j5k0n0J9
$$ y = [23, 5, -5, 24, -71, -52, 14, 37, -64, -20, 74, 21, 55, 35, 4, -158, -15, 52, 19, -74, -11, -11, -23, 32, 28, 41, 20, -9, 135, 4, -35, -12, 124, -57, -29, 12, 46, 61, -80, -17, 61, -35, 57, -18, -145, 122, 56, 18, 63, 121, -7, -84, -16, -11, -12, 137, 105, 29, 175, 2, 12, 43, -72, 103, -56, 33, 47, -14, 10, 20, 31, -83, 54, 6, 10, -5, 51, -164, -106, 85, -82, -76, 44, 41, 22, 46, 43, -125, -21, -57, -81, 90, -56, -78, 41, 0, -23, 74, 4, -28, 82, 74, 19, -124, 47, 55, -56, 65, -87, 35, 11, -46, -84, 16, 121, 56, -8, -51, -52, 36, 45, -63, -15, -30, -53, -1, 54, 75, 21, -91, -21, -13, 55, -30, -109, 18, -39, -16, -99, 93, 124, -97, 37, -46, 18, 9, 38, -14, -14, -7, -27, -36, -83, -144, 53, 121, -48, -1, 37, -28, -60, 6, -59, -30, 0, -160, -3, -28, -82, -53, -64, -92, -43, -40, 39, -59, 67, 5, 47, -10, -45, -4, -22, 67, -66, 51, -71, 11, 55, 20, 38, 18, 3, -8, -23, -89, 10, -76, -39, 52, 53, -116, 5, -21, 65, 32, -48, -51, -81, -15, -24, -41, -3, 55, 41, 41, 19, 69, -9, 2, 84, -7, -12, -26, 33, 18, -2, -52, -33]
4005c3p3K8n6J95o6Lm2Q6q3P8KKj7n2O1p7K1M4K3m9p1J68j30Q2j25Q8mRj58J61
4035A5j20Q7K9n9l0R2lj18J53o9%m1R2rM3j35P4Q5l9j44J13J26j49L5r5Q5M9k5
4063D2J6j71J06PmO1m7J0K7j8k9J5j0O1J4p7J31j7o3j38P8r7Q8m6M8n6N9K9m0
4092b1K0J22o4m2R8k03J01%j16J47j8N2j57J37j66J51q8k2N9L5q6J5L1l9P0j3
4118CM3q8J4J3j07J41m7n1j5J49K9j47K7P6RM6j64N7n7O1L5J5j28J01Mj3Q9m7
4146D8j0M8j26J7J04j29J48O6j56j17J10l9j53R1m2J34j3K9K3l4O9j95J06O4l1
4171A2n4pl0J04J33j37M7j2j28J43j95J9J53j30M0J6PO6r1M6k5O8O1r4M2q3J16
4198H7l5J0j82J91q9J1M9j0j49J06P9M4j14J06l5j03Pm6N1J26j19R1l5o7Q8j04
$$ y = [-33, -106, -78, -134, 61, -5, -2, -44, 42, -41, 37, 39, 41, 24, -28, 33, -44, -23, 21, 44, -5, -76, 92, -38, 44, -81, 7, 3, 12, -146, 15, -105, -18, 11, -48, -78, 14, 11, -107, 46, -23, -23, -64, 28, 19, 62, -73, 1, 86, 47, -97, 16, 142, -7, 28, -67, 18, 67, 42, 58, -113, -7, 0, -4, 57, 10, 20, 47, 29, 0, 15, 5, 66, 80, 3, 134, 117, 54, -84, -6, -103, -15, -61, -13, -69, -10, 19, -21, -1, 121, 57, 15, 113, -90, 11, 11, -105, 42, 24, 76, -81, 56, -110, 41, -47, -69, -10, 25, -61, -46, -15, -54, 16, 3, 46, -42, -28, -15, -122, 19, -28, -79, -94, 55, 84, -63, -36, 40, 49, 95, -69, -12, -69, -8, 27, 42, -86, 15, 19, 6, 95, 48, 38, 86, -40, -23, 81, -48, 100, 166, 10, -107, 3, -36, -189, -98, -140, -6, -19, 10, 33, -1, 68, -127, -21, 43, 12, -42, -49, -79, 25, 158, 21, 68, 56, -72, 71, -124, -105, 48, -82, -42, -26, -19, 47, -44, 2, -23, 45, 106, 12, 54, -29, 87, 52, 62, -120, 71, -18, -7, 42, 32, -117, -11, 68, 112, -2, 104, 69, -34, -27, -73, -22, 104, -15, 76, 41, -26, 62, -42]
4224d2J18j15rL6L3q4O9M5m4J9k7r8O4Q3j0j3jJ22j20j19J35Mnj2NK0J3n1j49
4253a33J60L1Pn1o4Q8j16%K38k14q3Q8q6K01k2j9o1O4n9L2J09j19R3p3qjK3K1
4281D6%M6l7j01p4O0J39j45J72o3o5Q6r5O6l2J0j0M0m1j7J1L9k7Nj46J06J7L7
4309B7L0j27O6L2j64J12n5M8J66k13M2N5qL0l6J4O9k8j6r0R3k8OQ0j35m5P8M9
4337E2r7R9n0J29j44Q8j85J05O4j10J11j6j23N3R2k01K20o8j29J7j8J60p5k7J33
4362H0j00J02j9m7r9J60on3J2l3o5M5J15j01p2O4O6j02J6M9j09J82j36J21j06
4387c6J38r2J17j92R8j2L9Pq9K7LL9j12J8Q8r2J9N5R0o8j45R9m1j0L0j3O2l2j05
4416a10J15m3mJ22j02L9R7q4q8R5R9p3l1o0K09k02PL3q3N3M3L0j7L9j11j7r6J64
$$ y = [-42, 76, -39, -48, -12, 21, -63, 6, 51, 7, 26, -1, -99, -35, 48, 38, 25, 24, 146, 26, -93, 42, 46, 41, 29, 34, 54, 67, 16, -133, 27, 58, 65, 14, -50, 38, -78, -78, 160, -54, -137, -49, -135, 66, 44, 25, -36, 28, -31, 1, 110, -9, 84, 11, 3, 2, 25, 46, 46, 92, 55, -46, -120, -60, 79, -66, 106, 43, -22, 64, -31, 35, 3, 13, 3, 43, 2, -15, -4, 35, 8, 13, -133, -27, -10, 27, 57, -70, -4, 28, -136, -24, -79, -31, 135, -78, -36, 19, 11, 41, 5, 19, 88, 60, 44, -46, 47, 19, 25, 105, -30, -75, 3, 52, -45, 54, 4, 133, -11, 77, -108, -3, 61, -49, 62, 46, -77, -24, 68, -133, 87, 19, -110, -93, -111, 49, -26, -53, 80, -20, 82, 63, 16, -83, 77, 71, 18, 30, -3, -68, -23, 92, -9, -81, -17, 49, -53, -37, 12, -97, 85, -51, 70, -36, 102, 10, 127, -65, 33, 21, 60, 67, -22, 5, 8, 47, -65, -47, 41, -51, -32, 23, 113, 45, -100, -1, -42, -52, -22, -35, 27, -5, -110, 5, -38, -42, 80, -22, 17, 114, 30, -58, 37, 136, 63, 32, -28, 181, -21, -14, 19, -64, -11, 32, 62, 45, 84, -27, -44, -140, 24]
4444B4K2q7O0q5n4J03p6J59m1r9Q2K0l6L2q3L7oKR1k7j79K26p1K0l6k1J09k00
4472a14R2J19j70R6q9J41j31N2o4l5Q5P1k6O3p3oj3o1Q1n8j45K31j37J56n2J7
4498C0M2j14J82j66M9O7j23J22p9M2j6N9j19n7P8r0R0p0J14j11J35q3Q2o5l9K6
4524a4k6M0o4j2O1N0j02M9K3j30K09j48O2oj05O3J64k08O4J6R8j77Q0R1p1j09
4550a02Q2N7M5j69J81o4o6J32q8%J46k10j0J38n0j10J47m4n6J08j21rM5N8k3K4
4576D1l5P3Oj27K9r3J60j12J20o6n5K11j04j57J56o5N8k3k9K8Ml6M2L2j41J16
4602C3jl8P4j1r7P4Kmq5L3k8j6R1l7K7j01N0R6m2R2k13J42k9k2Lp2N2o0P9N7p0
4633b1J22j50J68j74P8k1j5M1q1J06l1P2p8o9l5J23p0Q9N9j92J5rM8l7N7Q7l3
$$ y = [24, 46, -41, 19, -66, -120, -17, -93, 66, 25, -74, 8, 28, -8, 24, -59, -22, -28, -26, 65, 38, -141, 85, 14, 34, -2, -23, 86, -114, -22, 97, -73, 23, -66, 75, -56, -4, -68, -103, -18, 53, 27, 90, 17, 11, -2, -63, 18, -40, -185, 46, -91, 65, 13, 30, 72, -42, 140, -26, 23, 90, -33, 89, 10, 52, 36, 95, -24, -81, -3, -93, -3, -73, 41, -70, 65, -18, 64, -1, -40, -14, -40, 0, -64, -76, -15, 35, -67, -18, 5, -125, 84, -64, -2, -8, -113, -50, 114, -94, -30, -14, 84, -93, -13, 78, 7, -102, -20, 37, 82, -87, 94, 30, -36, 96, 8, 8, 154, -56, -66, 72, 22, -88, 59, 15, -41, 67, -54, -63, -18, 40, 17, 41, 6, 79, 85, -42, -13, -106, 54, -58, 62, -4, -59, 152, 48, -109, 47, -18, 40, 17, -12, 16, 20, -16, 26, 58, -83, 33, 32, -6, 68, 57, -40, 34, 36, 32, -53, -20, -48, -64, 27, -10, 17, -84, -34, 62, 20, 112, -101, 41, 12, -10, -7, -79, -27, -87, -8, 49, -21, 101, -49, 119, -55, 23, 2, -13, 28, -53, 53, 22, 94, 16, -53, -88, 35, -35, 54, 113, -79, -64, -73, -25, -62, -5, 82, 49]
4660D9Nj0j17R1Ro7M0J7j01M4PR1l2n2OqK9j12J24qk3k8J9L9Q0r4L5m0K3j7O5
4691F4n4k1n5K2J18j14M6j37l3P8J13k7L6j35K01k92L27j18J2nr1J41k33N8n1
4716a50J12P7q3k7J11j32r6K49l4P0j01n0J9Oj7M4N7j20J35r5n5J26m3J4q0m4
4742a07J12L3o9Q0j69Q1j42P7M9Q4j0p3Q0q4P1K6m5Q6j49n1J55O6j19Qo9J04m9
4769b4J3J1J9J4o8J9k7J0L2j9PJ14j36M7p1k0L5k1rJ02j36R4J8l9P3j02j2R9J
4798B4j05K5N6O0M4q7r9K9O4l5Q6l3J8P2l1p0m1n8J46j19R7j02J35n4j2k0P2l9
4826B3jj04J13j04L5rN0N2l1L3j39J84j82N4J2Q5r0j29J22O6j15P1nj6l7J36n9
4853A5j12J09j3M1r7R2O3j82K5L6LL2L9K8r5o4L5P7j08O7J0p8Q1l2N8j00J7M8
$$ y = [49, 54, 44, -73, 18, 27, -40, 0, 17, -84, -40, -33, 58, 26, -26, -20, -28, 1, -111, 13, 5, -18, -46, -27, 12, 92, -2, 33, -7, 16, -1, 64, 10, -11, -66, -44, 74, -40, 6, -131, -164, -86, 27, 0, 36, -99, 102, -190, 137, 19, 31, 26, -65, 76, -157, -99, -150, -38, 39, -44, -71, 40, -92, -188, 61, 27, 97, -4, -54, -35, -29, -46, -2, 55, -65, 70, -25, -80, 46, 3, 17, -63, -107, 5, 38, -31, 49, -120, -39, -181, -104, -55, 29, 19, -54, 26, -58, 13, 39, -6, 80, -69, -120, 35, 101, -18, -10, -79, 25, -24, -11, 0, 19, 33, -35, -16, -43, -33, -1, -20, -13, 101, -35, 12, -59, -79, -44, -65, -74, 28, -108, -14, 4, -35, 38, -64, -76, 23, 24, -81, -56, 0, 60, 104, 17, -82, -53, 11, -24, 62, 29, 47, 119, 88, 18, -23, -81, 65, -54, 43, -59, 76, 22, 10, -10, 62, 23, 22, -82, 31, -73, -38, -47, 3, 55, 24, 57, -82, 102, -80, -26, -14, 71, -19, -148, -26, 40, -75, -4, -9, -25, -62, 74, 15, -97, 12, -1, 40, -57, 35, 98, -84, -59, -23, -20, 12, 51, 79, -16, -80, -45, 32, -76, -9, 1, -77, 4, -28, 30, -70, -53, -5]
4881el6k5J3J3Q8j15o2R9L6Q0j58N9p3J46n9M8r4N1p7M4J41j12J34r0ko3j51J46
4909b4J7k6L5k3l4k9J17k9q0K5J24j38Q5m4o1O1NK5j4K1j2l0J77n8l6ro5Q2j24
4938f2J17N1j29o8M5MOQ9j54J7l3L8jN2J1J6K5k9P8k31J81r5J47o9n4l1k6J40
4966C5k5j8P3j32N6L0J0o2l9O4L9P2j19L2N1n2N1l1O8j66O1p0k4N9mJ71j68M1
4994CLj26J04N2j81J06L5N7q2k7J44j37J19q0m6J44l4j18R3j06J57M4r3R2k14
5019i1LQ5pQ1j21O7O0k8o0L6NQ8j35nj5R0p5p1K0O5N8k3q7L2P1j07O5Nj3j5ML2
5051A4m6j19J30l2L0o3K07j33K2K3Q7L0k00K0Po7J28q4pK8k0QNO3O5j35P8m2j09
5080a12J6J3M5J12n9J9KK4m9m0P6o4o6J53q3J01m0j7KM2l0j22Q1k1J0J5O9p9O5
$$ y = [-5, -41, -66, -53, -40, 48, -67, -129, -30, 6, 86, -72, -13, -86, 60, 1, 49, -45, 6, -71, -27, 114, 2, 136, 46, 44, -19, -170, -24, -7, -33, 2, -21, -55, -84, 33, 4, -76, -51, 73, -65, 20, -24, -85, -24, -19, 6, -8, 13, 1, -29, 148, 90, 54, 45, -20, 62, -62, 55, 106, -23, -91, -46, -42, -36, 53, -101, -84, -117, -79, -80, -28, -17, -1, 24, -5, 73, -158, 23, -72, 75, 6, -48, -79, -105, 35, 10, -8, 65, -67, -11, 19, 29, -33, -72, -8, 31, 103, -16, 16, 67, 15, 66, 35, 103, -63, -2, -72, -96, -37, -41, 130, -38, 3, 6, -120, -16, 36, -145, -39, -4, 53, -29, -56, 88, -49, 70, -10, -56, 88, 54, -64, 29, -77, 80, 124, 31, 123, -91, -88, -3, -10, 71, -50, 17, 77, 49, -11, 25, 30, 118, -17, -22, -37, 53, -22, -93, -73, -8, 50, 27, -60, -28, 43, -64, 1, 6, -7, -22, -18, 14, -32, -151, -21, -53, -23, -86, 121, -12, 10, 33, 120, 150, -50, -30, -23, -90, 38, -46, -53, -25, -45, -37, -32, 31, 96, -39, 39, -3, -112, -96, -83, -38, 74, 15, 34, 36, 60, 11, -29, 47, -17, -83, 70, -13, 88, 48, 31, 33, 75, 45, -77, 4, -17, -7, 8, 77, -2, 63]
5109F3J8m9R3j83L7R1P7k02nJ26k3l7m4m5J00q8N9k8j01J02j9J3L6kJ03j15l4
5136e7r5N2mK4J38l0m3k9M4P8r7L3l7L6j33J52J5p9M5k5J07j73L2O6k09J36L1
5163b2m8J21r4MM0J7p1j5J50k9p9NN1m4Q1o1p4J26q1N5k1L6K0l4o4NN0p8J36j85
5193a03J72q3N7l5Mn5o6Q6O6p7l3L1n6J23l8j10P1J16r3j5J25j33L4J00n8j6r2
5220g8J34r2M9J19j98Q0K3K5K9o1n9rO7j6k7N5q3n2Q8k2O0p5k5J37l6q3O4l7J
5249b2l3O8o6J66l5k09J38N3K5j55l8J99j00K3k5R9j41L9j4m5K7J30j39J08j33
5274h0P2R9j20O0jO7m3n9M0Pm7K5j43K41j69M1L7j11J04M2j22K0J0L8q9P1n6J46
5302H0j01O6j22l7Q5k0N6n4L9J4j3L1j03N7M0K6n1K3n6M4j2o1K2p4N0Q9l0q7O3
$$ y = [63, 81, 32, 125, -58, -21, 70, 147, -55, -60, 66, 43, 6, -38, -83, 17, -71, -12, -40, -141, -39, -58, -45, -9, -11, 92, -23, -57, -152, -100, -104, -80, 58, 28, -15, -44, 0, 78, -19, 14, -23, 13, -120, 32, 47, -32, 13, -12, 95, -78, -46, 20, -189, -53, -22, -70, 51, -43, -39, 1, 18, -53, -68, 82, 53, -26, -21, 30, -14, 67, 6, -68, 58, -23, 32, 11, 47, 67, 33, -31, -26, 24, -54, 82, -103, 69, -14, 43, 8, 12, -43, -109, -23, 43, -34, -67, -36, -92, 31, -7, -117, -46, 70, -23, -38, 87, -46, -12, 88, 30, 14, -78, 56, -36, 13, 132, -66, 14, 37, 62, 91, 30, -29, -38, 29, 13, -14, 41, -42, -94, -6, -28, 32, -43, -68, 69, 33, -50, 14, -23, -22, -55, 13, -53, 113, 78, -131, 7, 60, 85, -70, -108, 91, -9, 14, -11, 88, -53, -14, -28, -73, -46, 84, -55, 53, -80, -8, 91, -29, 31, 30, 97, 54, -5, 35, 42, -5, 20, -123, 118, -51, -10, 27, -84, 20, 62, -60, -40, -30, 8, -81, -10, -66, 80, -21, 45, -77, -114, -29, -49, 7, -47, -8, 6, -7, 24, -79, -22, 18, 44, -7, 16, -40, 4, -8, -69, -47, -121, -71, 18, -12, -99, -36]
5331c6O0J7j06R8l7ON6o4m2J21j09p6l4K36j51J14r1J26l1j95J37Q7r7j2K0Q1
5357G8k2j64J82l6n8l0r5P6L9J29k5j29M0q4L6N1n8J00j53L4K3J30K1r4j0oN9
5384C4L6kr1OR1j29P9q0K6J55j40P6j62J54q1k6J41p1k8j7J05r8J94j35p4Q4j16
5411f9M9K2k3L1mn4J43j00R1q7r5N9Q8j10m9J60j26j3R1Jj6J0L7Q4j64j7Kk7J26
5440D0o4J70j34l7M9m2j02J95q9jj1K9N1j81Q9M6J7Rj85J26J04L2j19n5r2K02
5466D7j29Q7j2n1O7L2l9P8r0jK2MPk6P2j55J11KM3Pj9m1K8j3m9R4j19L4Mq4M5
5497d4Pj1M3P0o4M6j18J34q3k9L8M5n3j2m8K3L7N9j43j31L23j17L3j37K00L3j23
5524b2l5n8L2J26m0P2o1k8rj5P5j05J36nr9J9M3j4J3KL2j68J06j5Q6J5j91J11
$$ y = [-36, 24, 41, -65, 33, -4, 2, 58, -6, -48, 73, -36, -112, -146, 90, -61, 53, -38, 88, 57, -138, -1, 86, -11, -23, -3, 78, 56, -108, 74, 38, -20, -50, -145, -69, -30, 99, 74, -55, -15, -99, -63, -12, -70, 30, -123, -89, -66, 64, 85, -9, -19, -25, 34, 70, 68, -23, -17, 74, -55, 24, -56, -30, 125, -15, 61, -101, 53, -28, -54, 87, 16, -12, -29, 76, -22, 172, 37, -37, 47, -69, -20, 2, -21, 10, 6, -48, 95, -5, 86, -1, -96, -37, 51, -59, -108, 52, -74, -87, 4, 5, -11, -1, 36, 120, -44, -61, -59, -86, 40, -24, 146, 12, -25, 24, -18, -120, 75, -14, -15, -26, 3, 54, -127, -38, 8, 25, 34, -151, -25, 79, 111, -8, -63, -155, 47, -82, 5, -7, -58, 9, 41, 2, 80, -10, -11, 11, 15, 22, -4, 68, -87, 24, 26, 69, 76, 57, 16, 44, 31, -18, 76, -43, -9, -5, -89, -44, -37, -48, -5, 65, 1, 47, -71, 63, -20, -49, -11, 34, -19, -31, -79, -56, -19, 40, -103, -234, 89, -28, 5, -132, 68, 101, -22, -57, -115, -83, 43, 3, 75, 14, -14, -23, -38, 37, -68, 68, 63, -36, -17, 26, 12, 25, 27, 59, -109, -3, -18, 68, 83, -108, 3]
5552CR2r0o3J9l6N6J11O7m8m8m3j56J62j7n7N7m3J2j2N4K3N0O2j49O6j57O9j5
5580c1lO3pl8P0mK2k5M0j98J27j05J21O2j91K9l7J37j06Q9Q9q9M2o4O3%q9pL0
5609a0J7j50K46j45M2mP8q9l1Q3o5M8n6K9K3K1N1j12Qp4o0O0K02q8p0J7n2P8n5
5638e8M7J4nl7P5L8r7l5J13n7M7k9K8R9j83M5n1J27n3n5P7j13rP9R8K9j15p6K2
5667c5k3J20r2K8P7k4j39J23j4M3o1m1N7L3L5k07K15k03R9j6r%lJ68j92R0j9N9
5695F9M5j48L5m4j9K9J04l1m5mp3N9N9n3J51k31K2L7N2k8P0r1J00j05j3J02j66
5722a17k2N6O6pJ03L5r7N8r1p3J86j03L3jl3j12N4M3K6r9QJ08jj2k6J22m4m8M
5751A6q8O4l5O6J7j23J35j01m8N7N3q5P4p1oj3J17j9k7j18O7Q9R8q2o9J10j66
$$ y = [3, 95, 5, -58, -39, -75, -19, 92, 159, 111, 63, 20, -136, 26, 9, -48, 9, -34, -22, -34, 20, 43, 93, 155, 6, 72, -85, -16, -31, -34, 29, 22, -16, 54, 50, 72, 47, 87, -111, 16, -89, 32, 94, -97, -68, -105, 32, -74, 15, 104, 15, 57, -7, 56, 56, -33, -40, -10, 7, -143, 103, -42, 0, -4, 74, -15, -46, 37, -28, 20, -36, -7, 16, 37, 88, -24, -16, -90, -150, -90, 112, 24, -46, -29, -81, -3, -58, -11, 3, -2, -39, 36, 74, -23, -58, 55, -2, 45, 16, 44, 143, -40, 5, -46, 81, 28, -27, 50, -63, -72, 7, 105, 134, 19, -57, -35, -58, 62, -30, -2, 75, 51, -88, 35, 21, 64, 3, -38, 19, 52, 87, -120, 95, -108, -9, -25, -34, -34, -37, 131, -61, 29, 10, 69, 114, -34, 1, -43, -62, -33, 71, 40, -5, -9, -82, -23, 36, -17, 134, -97, -75, -38, 14, -14, 56, -35, 65, -40, -53, 49, -117, -139, -83, -17, -24, 79, 114, 17, 75, -16, -89, 97, -6, 27, 26, -7, -119, -65, -22, 4, -95, -87, 21, 20, 8, -18, 104, 60, 12, 16, -72, -8, -43, 23, 40, -83, 52, -49, -97, -40, 13, -72, 2, -69, -75, -88, 29, 10, -17, -135, -68, 21, 119, 37, -32, 78, -88]
5778h8Q1J39j10l2O2L3j84P8J72q1l9P8j5r2J20k07J23q8J01q7P9oN0k0q0j36
5804a49J73q3r0J55Q7r9o7J02m2K4j56J6Q6Q1m8N4n1q6J59k3jj8p0K6M6P2j52
5831e4L2m6P8Q6q5j05J32j5l6K0K8n0m9k5J62j51P3O5q5%k4l6R4n3rO4k5j2o5
5860i1J88j41N1j21J66r9K3m7J42J4j59J41j23k3Q0n7N1J3nK5m3O4L9nOj26o7
5887a04J22jk2n0M9P1k8PKP2j31l2Q3J0N7j43N4j04J26K4M7k38Q4LO9J8oP2q4
5916B7p8P5K1j65J77q2L1L8jk8P3j59m0N1O5j0k0K8q8K09j34J05j48j00J26JP8
5943E2k1j02J26N1k13Q8J23j96J97k9j9l1n0J21m1j00k0K8L4N7j45J57l2j38P9
5968b4n5l3jJ37n4R5j5o9J16l5n4N0j95K62j36m6J26O8j71m2J84j47P8jo5Mn7
$$ y = [-88, -7, 132, 22, -10, 52, 85, -99, -21, 151, 70, 31, 109, 94, 2, 122, -85, 38, -50, 51, -36, 43, 37, 87, 67, -13, -149, 24, -59, -149, 6, 93, -6, -73, 29, -13, 11, -145, -129, -43, 38, -10, 44, -7, -93, 66, 43, 42, 24, -46, -20, 26, 98, -54, -22, -68, 10, 96, 11, -94, 38, 23, -13, 7, 35, -15, -64, -89, 73, -78, -5, 60, -25, -25, -49, -85, 9, -44, -53, 11, -14, -26, -91, 97, -44, 7, -114, 52, -47, -24, -71, 71, 85, -74, 67, -56, -79, 1, -56, -5, 8, 3, 28, -15, 49, 88, 83, 89, -37, -104, 18, 17, -5, -55, -6, 65, 37, 44, 46, 118, -13, -45, 38, 48, 105, -38, 16, -88, 38, 62, 109, -129, -45, -42, 27, 45, 39, 111, 27, -51, 24, 45, -120, 57, -25, 6, 44, 43, 15, 88, -71, -111, -60, 5, -5, -25, 3, -85, 124, -10, 95, -53, -153, -27, -26, 52, 31, -71, 55, 106, -107, -19, 104, -92, 105, 76, 57, 26, -24, 97, 56, -44, -64, -36, -2, 55, -90, 67, 35, -103, -24, -79, -112, -113, 24, -30, 65, 50, -19, 97, 62, 8, 58, -137, 125, -11, -57, 69, 137, -34, -76, 108, -39, 39, 38, -27, -23, -80]
5995h0P8Q4j00pj4J48j47O0oj21J06Q4j05N4L6j13o3P1J5m4Q2N2r7Rk0L8Q8l5
6023E3o5O0l5L2J0q7J37j23K4J3p7J3m8J40j01N3j1J0R7k07J12l4M9J27j57L3
6049A8j2r8J11j3m7J12j28J40j72j9K5N5j9j17J69r7J09j0j6Q3n5J9O1j03q0O0
6075b4j5NO9k4Q8j28l0J29R2j55Q4j35JK8k0k6M0l8J9J53j16j04K3M1O9qJ1n5
6103b6K0j53O1K34j91kn1J45j22J6O6j3K2Q8k6Rn9J4jJ4r8MJ06j03M6J5j1N0j20
6132f6R6n5O8o4j05J65k1j57J81j72J92o8RN1m1O1j73J32N5j00k1l1L9J09j20
6157c6j3Q3m7m6J01j02O5N3j19P3j07P7j2O8j5l8J7O5j03%R8K4p1j83K47j49O0
6184a0l7L1n9O8k1J6J40n0l7l9nJ9j8K0k1l3n3R8r0J15K0N4n9j12J38J1q0q7J54
$$ y = [-80, -2, 82, -18, -25, -39, 109, -38, 22, 16, -105, 1, 85, -20, 34, 70, -43, -106, -35, -20, -64, 18, 70, -27, -18, -38, 0, 88, 53, -12, 48, 13, 45, 55, -32, 105, -18, 6, 19, -58, -45, -93, 47, -54, -1, -12, -2, 95, -112, 0, -34, 15, 142, -15, 18, 6, -92, 19, 6, -41, 71, -57, 83, -89, -108, -83, -28, -47, -164, 5, -92, 17, 7, -9, 74, 19, 38, 99, -4, -84, -24, -39, -34, 35, 11, 99, -29, -59, 70, 162, 7, 91, -44, -43, -15, -35, -61, -21, -59, -40, 113, -3, -107, -84, -43, 26, 18, 29, -26, -6, -159, -98, 136, -55, -57, -108, 37, -85, -69, -3, -16, 6, 94, 68, 77, 18, 32, 31, 45, -53, -49, 57, -46, 0, 15, 4, 54, -66, 30, -25, 43, -21, -126, 39, 18, -139, 42, -130, 62, -6, 3, 54, 13, 74, -99, 33, 88, -12, -33, -64, -25, 84, -36, -49, 34, -13, -59, 42, -60, 5, 58, -61, 12, -95, -18, -30, 38, 23, -15, 2, 67, -36, -36, 62, 86, 15, -168, 79, -70, -10, -47, -16, -75, -7, -28, -12, 128, 78, 41, 2, -3, 16, -2, 18, -3, -36, -89, 9, -81, 34, 54, 108, 49, -63, 75, 86, 6, -81, 73]
6213G3j32k2R3l1J07k14J60j40K9m0O6k9J07j9j9M9M5n8j8j09R2l5j3R2j5l1j
6240a3O1On3J0m4P3o5J29o6N9k2j01m6J12l3m3n7JJ09O4j39k1J67n6rj49K10m1
6268D3p7J07j2lj23K0m5J25m5k2Q9j48P9R2p0o2O3Jj20J09P6j02J9q5J05K3j32
6295i5Q1M4J7q4N7N4l7n5K1k0n5k3Q1k8l5K03k40M5J60L6j68l1J89m2j27QP1j62
6323a35R9K7N8Om9L0p2O6j6j3k2M0L2lr1J7K0J02j01n8N6K0mJ8kq7K8P1j17K3
6353e7O5O1lj17Q9j32J66q9oom4K1Q6m4j04R8j60K35o0m0R1q1L5nK4j8r8J29j03
6382f7R1k0J4j7J8k8m1J1Q5m8N8m4L2p4l0%K2O9Q6j86P9m2p5p0J50J60m1on7O1
6412I0j45M8j26K08m2Mj0p6m2J76j9k6q4K1RQ5n8ko3Q3K9K8j03N2q6J06j38O0
$$ y = [73, -59, -81, 12, -19, 88, -126, 34, -106, -77, -117, -51, -80, 27, 8, -11, 38, 83, 25, 7, -102, -10, -45, -58, 34, 19, -12, -13, 48, 54, 1, 11, -33, 40, -25, 104, 38, 97, 75, -26, -72, 40, 7, -36, -93, -92, 17, 81, -58, -79, 88, 32, 23, -126, 84, 43, -34, 73, 61, 58, -65, -45, -90, 35, -10, -32, 57, -91, -12, 80, 10, -52, 11, 12, -108, 1, 77, -25, -6, -91, 14, 37, -95, -14, 30, 47, -37, 20, 74, 37, -18, 3, -17, -72, -95, -14, -42, -77, 126, -114, -69, 91, 127, -41, -72, 117, 75, -52, -44, 27, -135, -36, -9, 49, 55, 6, 36, -36, 30, 14, 1, -21, 19, 51, 48, -43, -26, -6, 96, -5, -63, -7, 13, 9, 27, 25, -62, -34, 37, -80, -57, 8, 69, 66, -51, 38, -94, 72, -17, -23, -29, -73, -52, 34, -10, -114, -16, -176, 59, -1, -41, 50, -31, 4, -1, 23, 5, -93, 36, -67, 24, 4, 18, 1, 19, -9, -50, -39, 46, -2, 56, 12, 44, -30, -60, -60, -38, 31, 117, -69, 10, -32, -107, -177, -27, 133, 92, 86, 29, 90, -55, -7, -133, 75, 33, 37, 27, -49, -91, 85, 66, 40, -44, -23, -14, 71, 13, 11, -52, 31, 60, 88, -15, 37, -49, 57, -81, -21]
6440b1k7o8P1r8J45o6L2n7J49r4Mj2N7N9J4o2J02j33K05j51p2j8N5j00n7J81p9
6467d1NJ30n2j68J12M7m2Mm3Rm5P9n5j6qR2p3J03Nn7N5o9k4l0J1K8l2O8P8o6n9
6498e4M3k8M3rq3J75j70N6J40o2l3j5l5K4j6Q5j22N4mK8N6q1j6N3K8j32J10n8
6526b3J9K5j20R1K4k3J4N5j45J26o8l3Q4L4j12L8N4Oj67J29P9J6q7J19r3q6K4
6553b0q8K21k76R9M6J8oR9p6%Om3o1K7M5p8R6n2J24j24Q1j33J00L7r6J14L0j04
6581a4q5m7J99m0j6m5P0J8k7Oq7M8K9Oj0r0P2p0J27l5n1M8o5N4qR3n6o5L8K7L5
6612E9j7j08N4jq4J39O4j14L4p0J9J19J09k87J71q8M4l8jn2OJJ07Kk9j7j07J04
6640A9lP8j01k0O6j6l3L7N7j4j30N3o7J62o7j11k6O4J00j30P6J2K0j6N8J0n9J2
$$ y = [-21, -48, -116, -45, -143, 2, -64, -32, -89, 60, -34, -30, -42, 15, 74, 88, 26, 128, -5, 200, 49, -23, -41, 14, -86, -143, 38, -41, -36, 94, 42, -126, -14, 33, -9, -5, -48, -39, -84, -5, -60, -76, -84, 8, -65, 38, 43, -14, 41, -28, -52, -82, -71, -43, -75, -7, 71, 5, -54, -11, -39, 4, -5, -88, 87, -83, -27, 113, 51, 18, 3, -32, -8, -24, 61, -61, -7, -11, 17, 73, -8, -24, 29, 57, -75, 35, -23, -4, 21, -99, -8, 16, -7, 7, 62, -83, 43, -25, -58, 26, 60, -52, -14, 40, 46, -121, 8, 87, 103, 16, 135, 42, -44, -20, -108, 113, -163, -64, -18, 0, -6, 93, 17, 17, 23, -20, -81, -54, -9, -87, 9, -43, 81, -43, 38, -95, 5, 42, -54, 60, 90, -14, -99, -146, 53, 13, -3, -48, 22, 40, 13, 19, -68, -20, 9, 15, 5, -85, -13, -83, 44, 9, -42, 6, -59, -5, -13, 80, 24, -41, -3, 24, 59, 42, -66, -12, -13, -97, 42, 106, -8, 26, -44, -25, 94, 203, -84, 87, -1, 43, 5, 4, -48, -42, -41, 66, 68, 39, 22, -85, 19, 16, 94, -7, -27, 39, 23, -10, 27, 84, 70, -60, -7, -74, 88, 21, -90, -116, -52, 48, -82, -6, 6, 26, 10, 68, 78, 19, 31]
6668C1l4J2m3K9J32j86J22pl5P2J4j43J23m5j5Jj7j6L7l2J0r0R7L7j50rJ79p8
6696dL2j1l7N3q3J39j22P4p5Q5j5NK0j3j15j9Q4n6J35Q8m8J5k24N5O6p9j2L2o7
6725i7P6J16r4j51J89k2LJ8j23K8J04q9J19j34m5J93k43J08M7O2p9k3J18l7l1
6750A3k6l0R3P4o6j87M9O3J30j11L6m4L0j00R8r8Q1N5K0j22k6MR4j6q1RJ7Q5q7
6779d3Q3m7o1J19q3Q9m5J70j92q4J42j73O6Q7n2n5J3Q9m9M3rnM1m4R7j97j0L3
6807g7Q3L9j19K2M4n4P3mm2mk0o6K08j37J5J51k2L2j27j10J47j9L2%M4o8r1n0
6835a20J86p5l3J09Jj37j5P5O5J4q4mOj1l5P4j25J90n5j04P0K3Kn1j7J36r0j31
6863a36J58o0Q4nr9Q1j01R2m3j21J35kM6r9J8O7o3lL4K9l6RnP7K3p3j16J70q5
$$ y = [31, -3, 9, -34, -5, 127, -59, 63, 56, 21, 93, 107, -36, 87, 42, 27, 28, 11, -5, 32, 0, 10, -80, 17, 54, -96, -105, 74, -4, 28, 17, -20, 33, -50, 89, -33, 41, -34, 51, 36, 41, 61, 48, -67, -86, -2, -58, 77, 165, 117, 132, -92, -37, 29, -50, -62, -30, -97, -21, 95, 1, -150, 39, 17, 20, 38, -85, -57, 47, -42, 77, -57, -102, 91, -152, -44, 3, 65, -14, -37, 81, 44, 13, -13, -43, 50, 124, 58, -129, -80, -17, 113, 2, 38, -6, 24, -76, 22, -76, 5, 60, 80, -42, -68, -64, 30, 14, -67, -58, -41, 44, -43, 40, -7, -68, 51, -32, 57, 12, 182, -10, -94, 48, -125, -59, 28, -24, -79, -66, 23, -26, 17, 8, 3, 44, 0, 97, -100, -110, -77, 6, 45, -74, -52, -8, -62, 11, 7, -35, -39, -59, -125, 83, -54, -39, 112, 90, 122, -5, -115, 32, 13, 45, 45, 89, 21, -70, -120, 66, -9, -42, 67, 68, -69, -84, -9, 56, 70, -14, -18, -12, -23, -58, 16, -109, 81, 26, -78, -8, 15, 17, -34, -51, 85, -5, -136, 22, -38, 46, 41, -58, 23, -78, 14, -29, -150, -15, -17, 29, -70, -52, 15, -48, -51, -17, 12, -24, -15, -20, 57, 80, 7, -109, 61, -24]
6892b4m3Q2o0J33j58RP0MM7j6j06N0N8o5J0on0m3K15j10K7j27P4L1PO1j27NR2
6921D0J7j06M4J19j37M3n8J00%p9N1m4L4l7N9l4Q5j23L5JJ7m7L0m7m6j8L7R3j22
6950i3k6Q4Nj7J51j89j05K20R2m8k4r4k7P9k3p1Q0MJ6M7l3oo7J1Q7n5JJ8n4J4
6980b3M5k3L9Q8p9q7O6m1l2L5n6J23j12k3J71j61J9J00O3j23k7J5L4j07L5ol5
7007a02J32N5j82J10k9J96j23Pj56Q5J9J5jK3l2o8P0r1L3M4L6m4M5r1L3M7l7o4
7035g0O5J0NR6j19k5n3Q2L4Q9k11J28o0j2O3p4J45j15l8J01L0k5j09J9l2Q7p8
7062f7O7n5N7q5M7m0R1l1n6J5R5j72jK10j24K06j86k9ON0Lj40P9Q6K0m9M8l0n5
7091d0J19k7j59J37j02J37p7J37q7j24J27Oj24JJ76r3lj23K40p1k81K52k5RJ43
$$ y = [-24, -67, 15, -45, 88, -70, -61, 9, 13, 60, 44, -62, -12, 46, -19, -9, -15, -65, -108, 107, -3, 24, -103, -29, 2, 9, 70, -57, -52, 40, 57, -49, -5, 114, -23, 20, -38, 62, 62, -17, 34, -10, 24, -13, 46, 12, 97, -26, 9, 10, 27, -20, 10, -37, -83, -101, -64, 29, -93, -119, -35, -30, -47, 104, -85, -190, 30, 122, 74, 50, -44, -71, 8, -15, -86, -6, -2, 14, 61, 28, 22, -45, -34, 53, -2, -1, 17, -37, -23, 22, -1, 38, 126, 47, -40, 26, -15, -47, -12, -68, 55, -57, -80, 91, -70, -51, 49, 112, -11, -38, -23, 11, -96, -61, -67, -102, 30, 85, -97, 13, -16, 180, 57, 64, -92, -7, 12, 27, 26, 49, 17, -51, 19, -72, -39, 5, 41, -3, 42, -49, -16, 31, -6, -70, -5, 5, 10, 106, -13, -38, -91, -9, 25, 114, -97, 31, -29, -41, 22, -52, 93, -22, -60, 41, 71, 46, -63, -44, -76, 11, -67, 0, -55, 2, -83, -36, -76, 15, -16, -72, -57, 38, -134, -135, 75, -49, 157, -29, -58, -52, -2, 1, -139, -60, 26, 46, -3, 45, 15, -40, 79, 52, -107, 30, -72, 65, -12, 125, 38, -86, 41, 47, -77, -76, 100, 7, 4, -119, 121, 50, -231, 21, -4, 5, 148]
7116A48k17R5J4r0m2J23p8j0K2N6n6M2lkm7RN0n0Q5j42J56n2Q3l8j00J07r9N6
7144B0j9j7o2P0l1P2q7J58J5k43K17j19R0j72M2N4q9R1K4o8M9l2M3k1p7J51n0
7171Ip3J9L7n7R9r2R3p3J46j53M6N8n0QP2j78J76rp5Rl6N0q6J53n4l0l0K6o6M0
7201b1p6J21J5p7Q2n7j0j4oM4Q0Oj08P4m6J6j2O3k06J28Nn4J07qK6J8k43K15j52
7230i0J73j34J30M0k01J11N4o7j3o1L0N6j3q0J78n3o8J0k8Q6m0o9rJ26k36J22
7256d6j00J10M9Ok6M7l7l8J10k0n1jQ8k4o3J1oQ2o3k8J8j11P5L6Mp0N7l1p1l4
7286a27P8J08m8o7Q7n6P4m2MK1M8r3Q2k0j01P6o6J44q3o8R9L9N6j00L4j72J59
7313F6n3k5L9Mro6P4k8jp3O3j05J10O6j41RJ14l1J1q7L3P0J2o9N8j23J56l2o7
$$ y = [148, -69, 26, 40, -50, -92, 31, -47, -57, -35, 21, -35, 7, 4, 2, -45, -36, 14, -36, 49, -93, 63, 11, 94, 56, -44, 63, -36, 20, 1, -16, -78, -8, -39, 33, -54, 104, 119, -124, 93, -26, 64, -108, -66, -12, -101, -10, 14, -54, -5, -37, 6, -15, -92, 59, 9, -64, -45, -8, -65, 34, -58, 35, -38, 108, -45, 1, 59, 9, 17, 89, -89, 87, 78, 3, 12, -24, 26, -60, 93, 39, 9, -21, 5, -61, -21, -97, 24, 39, -38, 44, -13, -23, -37, -43, 1, 81, 87, -21, 53, 7, 23, 11, 74, -132, -4, 1, -53, 54, 46, 72, 90, -153, 62, -90, 83, -51, 79, 119, -82, 29, 83, 16, 3, -58, -28, 28, 15, -65, 113, 60, -8, 2, -26, 60, 20, -49, -58, 68, -168, -46, -146, -36, 13, 19, -7, 40, 3, -35, 75, 55, 4, 3, 91, 67, 4, 15, 9, 91, 28, 0, 18, -93, -18, 18, 22, -48, 9, -22, -93, -127, -49, 59, 11, -56, 31, -25, 49, 7, 11, 32, 80, -13, 69, 49, -52, 24, -42, 102, 19, -49, 50, 89, 145, 45, 79, -93, 66, 13, -12, 27, 31, 22, -44, 30, 2, 1, -72, -9, -114, -4, 62, -79, -70, 44, 13, 24, -63, -30, 40, 52, -17, 41, -82, 74, 42, -25]
7342b5J1n2J57j05O9J8m8k5J30k08M6R9rq8K8k1K8j1K2r7R9m2O6n5J5pm6p8J84
7371E5j40M5J17j31N2l5J9r3J30l1N3N7p7L4j22R6J6n3l9O8K6r3J21m5K3j11M
7398e4P2K4p1J27j53J7o1K9J10k9n4J9K7j4J6j52J40%n1P1r4M0PN4L4k0Rm2j49
7427a48N1J07nn6O4k4M8j14J31o0k6J0k2JQ9P8j42J12j56R6P3o7o8J1j4o1R3j0
7455iKK3j07pJ32J8l3j12K08r2q1R8j51N7N4o0R0QMj09Q3L2O7j30PP1q8l0Q1m0
7485a4M1j18j0J36j2Qqm7L8l5mL4q1J28J2j07P8mj01N6Q7j36NJ04j1m4j3j13K6
7514a05J37P4j19R2r3J04j64K58j30K1l8J2n3N4r0M8Rj4j7Q8j61mR8j2J4q9P1
7541ip0R2%M0r3OLK6n7Q7l0O3j23R9j16J9M7M2mr1j5L6J19m9n1R5j7j12N2L7o2
$$ y = [-25, -14, -66, 91, -14, 55, 73, 25, 0, 130, -78, -32, 67, 58, -30, -2, -23, 5, -6, 16, -81, 18, -24, 42, -13, 2, -5, -51, -129, 55, -85, -40, 77, -54, -2, -37, -18, -111, 19, -12, 41, 98, 21, 55, -67, 29, 45, -8, -47, 21, 47, -46, 75, 30, 53, -58, -54, 18, 42, -29, 98, -55, -38, -99, -70, 40, 11, -43, -24, 3, -11, 5, -147, -7, -7, -58, 13, -81, -41, -34, 20, 54, 34, 43, 1, -148, -97, 10, 5, -51, 13, -11, 37, -77, 54, -6, -32, -22, -44, -43, 46, 124, -18, 94, -62, 34, 107, 40, -28, -17, -31, -92, 1, -9, -7, 16, -91, -98, 34, 52, 19, -93, 115, 23, -58, 40, -111, -54, 0, -60, 30, 38, 42, -67, 16, 48, 115, -15, -8, 63, -25, -55, 26, -14, 27, -91, -101, 35, 23, 31, 23, -24, 14, -21, -25, 9, -72, 56, 68, -39, 39, 35, -66, -10, 77, -59, -54, 50, 39, -5, -18, -131, -105, 32, 106, -13, 79, -14, 90, -74, 184, 54, 75, 37, 49, -4, 50, -40, 8, 17, 3, -14, 74, -87, -91, 7, -5, 9, -80, -9, -79, 13, 13, 53, -40, -34, -31, -5, -62, 25, -5, 58, -65, 34, -82, -63, -16, 26, 22, -69, -84, -48, 71, 22, -29, 66, 49, -63, -11, 26, -36]
7572c6N0m5Q3q3M0J1m9k7pP0p9J28n3on5M2Q7r9K1K7k5l0J4P3p1K0l8N2mJ8q0
7603e1k2RRJ54r8n8J24j60Q5n0K8j1R8j34J61p3Mm6J36j14O8q2ql8j7M4Q8k4j06
7632h4R0K5j39J62o2J3k1N4K5j65N9q7R2J41l2j03n9J41j50J25j14M4pK5J20o9
7658B4m3k7J06l4J9K5l3p9nPM5k9NK7N0r5k0P3j00J06j1j2j7Q8k8n5O6K2j07M1
7688Il9O8M9j20K8J3j22J99r5N2jm3O7%j41J71k7j69J17n3n9P7J7M8L5j18J21
7715H4j05L1q4J02p0J4m0J47n5K1qkj0r0j0Q4n3L2O4r3J8J11M7o3J0j46J62o6
7743C2Jk4rp3K0J88o0L0l5jj17N9J1l7K1j26P8N0j9Q8j22P6Q8j61RN9P6r5n3L0
7773a6R3j69M8N7K4k8M0J7p8j14J05j5O5pM9p4Q7j05Q5p3J3k6Q5q4N2Rq5K2j07
$$ y = [-36, 14, -31, 52, -31, 9, 20, -29, -56, -63, 7, -72, 56, 3, -3, -58, -16, 71, -28, -7, 20, -5, -35, -21, 52, -19, 1, -37, 15, 11, 29, -51, -73, -64, -55, 99, 1, -57, 67, -93, -8, -58, -30, -41, 57, -77, 84, 11, 15, -31, 105, -9, 59, -23, -31, -69, -86, -42, 46, 22, -84, 6, 31, -108, 54, -8, 5, -16, 38, 63, -102, -43, -130, -38, 103, 71, -32, -91, 50, -100, 25, -89, -45, -52, -27, 93, 24, -19, -46, 60, 26, 45, 70, 37, -42, -47, -40, 5, -24, -19, 8, 58, -37, -57, 16, -84, 22, 11, -1, -18, 70, 42, -13, 53, 75, -32, 9, -30, 38, 87, -33, -5, 8, -114, 85, -10, 42, 41, -2, 65, 65, -76, 95, 68, -101, 16, -37, -96, -19, -2, 46, 81, -37, 84, -21, 10, -74, 28, -42, -28, -68, 79, 24, 45, 37, 35, 25, -65, -75, 9, -44, -12, 52, -41, -23, 88, 135, 72, 82, -64, 98, 32, 33, 9, 0, -73, -53, 135, 75, 105, 70, 69, -48, 11, 22, -15, 6, -120, -42, 8, -11, 77, -45, 31, 119, -42, -33, 26, 102, 7, -46, -16, 77, -92, -44, 13, 37, 9, 49, 66, -12, -126, -21, -36, 29, 22, 71, -3, 84, -21, 64, -9, 4, -22, 63, -21, 31, 40, -45, -23, -130]
7802a30J75p6o1R7n3K4K4pJ11p5K2k6Q3j94Q3M4Q8j11o4P3m2M8M9j6j1r1m3J23
7830D4R4k19J09n6J9M6n3J2m2j4K5K7k6J44r8n%K9L3m5l3K3P8j76N8P6l1q0O7
7859Fl7N7n5J08j85N9j1N9PJ12k3m9j39k4Q0j7LJ12n1L8r7Q6o4J09l8q4K5n4K1
7888d6l6L6j0J62l3j74J05r3P5l8J97j75p6J42Pj2Ll4j9M7j08j0k5K23p1k1n0
7915c4j6M1n8J16j37K16q9l5M0r6%M8L1qJ3q8r1J10J24n4k1m5n8N0O0%N3r4OJ11
7945I5mo4k6k8P7n8POq1J40p1k5rR0j02J3O0lpL0r7n2J82j11P2J6Qn0m0j0L0o4
7977g6J94j15K51k49%N5l0pj0k4j1O1j62P1O8RJ1j16K16r7o1N8n1O5K3q1J05j42
8005d5P1N6j11P2l5q6M5R1j17K9m8P4q8O3jj1m0K3J6J5J25o6K1p8L0n4J4l7N7
$$ y = [-130, 45, -31, -92, 5, -48, -24, 0, -7, 104, 29, 51, 25, 108, -86, -3, 41, 129, 18, -46, 27, -15, 33, 82, 66, 55, -36, -79, 44, 138, -81, 28, -28, -9, 37, -16, -4, -46, -60, -35, -8, -34, 110, 12, 7, 7, 36, 69, 24, -9, 14, 92, -84, -26, 50, 19, -61, 6, -31, 26, -29, 79, -106, -47, -58, 1, 8, 120, 97, 48, -91, -115, -35, -52, -49, 63, 12, 50, -47, 39, -25, 84, 46, -38, -13, -67, -46, -82, -46, -56, 106, 73, -101, 4, -89, -14, -52, 145, -30, -106, 36, 43, 31, 34, 0, -19, 28, -80, -90, -115, 108, 37, 16, -34, -50, -9, -67, 49, -88, 128, 39, 4, 44, -52, -52, -4, 27, 19, 32, -56, -147, -37, 87, 33, 12, -33, -91, -41, 19, 19, 72, -22, -16, 95, 91, 27, 1, -27, 50, -8, -1, 5, -76, 64, -7, -32, -41, 49, -53, -40, 20, 17, 10, 40, -57, -109, 73, -38, 34, 50, 58, 8, -32, -42, -12, -76, 118, 3, 254, 5, 5, 60, 30, 23, 13, -11, -22, 39, -123, -52, 16, 25, 36, -80, 136, 39, -22, 36, -15, 50, 73, -8, 97, -45, 26, 82, -29, 43, 8, -78, -33, 58, -59, -30, -78, -4, -92, -29, -30, -41, -81, -58, -42, -27, 98, 32, 53, -25, 5, -49, -35, -72, -15]
8034a5J23k16P0K0M1p8Q0L2j53J18o8k0m6J02q3J46o2l0o4L9L8n4N1qkJ11j08
8061c6L7p7m5R7n6J11n0P0p5Q6k6N2j03j6l9Q3m6J02jl5o1K1l3j4k2l3N6J49j49
8090e3M9J00n0j10J5M0j1l3K2K8l8j8P7p7N7P5j76J33p8K7M1j04J61j01N8o6R0
8117E8k0lo6J31l5m4Pm9l7j13J99q9M0r9J14L0m2PLK0n3R5o2l0J2M3m9L3j41J3
8147a27N9K19k75Q9J36j04m6P0N5p4k2P6jj09R4J03p6M0Nk02NJ38p6K4j3N5p9
8174c6l2N8P1m4j4q7M3J21p6k9M0M8n8O4l3oP5
$$ y = [-15, 108, -108, -38, -18, 23, -55, 25, 57, -96, 22, -46, -66, -112, -10, -93, 53, -9, -39, -103, -64, -26, -80, -29, -37, -39, 72, -36, 1, -76, -121, -24, -80, 31, -19, 51, -24, 62, 36, 88, -15, -31, -70, 13, -33, 69, 68, 33, -28, -7, -40, -54, -76, -109, -53, 96, -53, -4, 96, 46, -64, -49, -9, -20, -53, -31, -3, -41, -59, 18, -59, -2, 73, -103, 30, -48, -21, 20, -84, 77, -24, 34, -32, 58, 38, 35, -31, 100, 65, 21, 28, -21, -58, -171, 28, -61, -21, -120, -6, 24, -18, -11, -8, 12, -41, 54, -8, -38, -26, 17, -32, 1, -140, -127, -68, 151, -124, -35, 101, -3, -49, 21, 76, 2, -20, 56, 55, -54, 40, 143, 67, 107, 112, -90, -85, 53, -23, 1, -12, 43, -36, -68, -10, 61, 17, 3, -84, -41, 80, 4, -25, 15, 63, 5, 69, 36, 30, 105]
8191A05
$$ Imaginary data points
##PAGE= N=2
##DATA TABLE= (X++(I..I)), XYDATA
0@%%%%%%%%%%%%%%qJ6j6J6j6K4l2L2m0M8n6O5p3Q8j02J16j34J52j69J93k18K43
36A29k74L07l44L86m31M79n31N88o50P18p94Q76r64J061j169J289j420J566j731
55i09J915k123K359k636K961l344L812m396N149o160P600r834J3794k2959Q6845
70G2074M7431p2989M894n0220k4495j7710j4657j4195r867J7278O5276J3559P494
83B3873K4968q143p796J1625j9461j8670l5555l3530J3756N476o578K2993k285
96b9327j849K8055J4365J2083N61k7142J575M489q965J3655m170j9489Q063M793
110c303J3307J6254j7079l541N678j2418J7462J3329k1131l652J718M4J2975m697
124A4946n004o077k5385Q907J8170j8674k584M718r971J1976J4540Q052M779j9252
$$ y = [0, 0, 0, 0, 0, 0, 0, 0, 0, 0, 0, 0, 0, 0, 0, -8, 8, -8, 8, -8, 16, -16, 16, -24, 24, -32, 33, -40, 48, -54, 62, -72, 80, -89, 104, -114, 129, -145, 162, -182, 204, -227, 252, -279, 309, -341, 377, -417, 459, -505, 556, -613, 676, -744, 822, -909, 1006, -1117, 1242, -1394, 1567, -1777, 2035, -2361, 2788, -3372, 4228, -5606, 8188, -14771, 72074, 119505, 46516, 51410, 1190, -23305, -41015, -55672, -69867, -79734, -62456, 2820, 16379, 23873, 48841, 40698, 32902, 44527, 25066, 6396, -29159, -62689, -48933, -43457, -50035, -27042, -29327, -31176, -3121, 11244, 23327, 23888, -3254, -1679, 2810, -6155, 7500, 3330, -16159, -8096, -3303, 10004, 26258, 9179, 5638, 11316, -1102, 16360, 29689, 8558, 4906, 6624, 6668, 19643, 14946, 9942, 3865, -21520, -12613, 5557, -13117, -15701, -10983, -20954, -8978, 5562, 13614, 18393, -859]
138h59Q27J9313j3012m605M098k3252r472O902N261Q249j2109l982J9698j018
152c961O729K3005r194r992M407j0Q988o940j8310K617r376r141J7688Q81r177
167a1786J355K76J5243R971p413Q980l700j7425J2366O691j1785l954q323O12
181h892P297l455J0600K606j8916P880J2445o656K379m066q422K169l097Q632
195E04P576j6298J295R668p239P734N416j1346j604j974L207R825q524j625N914
210B529j0629N690J1480q529k941k523l161R901j651j437Q693q997j168J4506
224A1763j700j945j857q326L883k605m364R523q127j0216J2252K963m01L670m281
239B32K320k228n527J2616k504j5454P373L578m166N727L33q5k135p443J0285
$$ y = [-859, -32, 19281, 6269, 1664, 5762, -17490, -26962, -20060, -14799, -6550, -18659, -22641, -2943, -3961, 2768, 25773, 16579, 6587, 10994, 10984, 19972, 13032, -5278, -2661, -12037, -21178, -3490, -2609, -11786, -10431, -10155, 5088, 15059, 7646, 16626, 12926, -4499, 7867, 14558, 2773, -1181, -9504, -8892, -1595, -5050, 5550, 8156, -10760, -2880, 9565, 2909, 5288, 1222, -7200, -5031, -8128, 504, 8080, -8218, -6923, 2745, -4494, 3240, 8656, -2690, -4294, -6268, -3061, 6764, -1760, -3385, 2529, -8100, -2410, 9070, 541, -2400, -4923, -8084, 1817, 166, -1271, 7422, -1575, -2743, 11763, 10063, 8118, 6261, -2065, 1818, -787, -5151, 4372, -3755, -13971, -1719, 1244, 843, 4513, 232, 2552, 324, -5203, 7413, 4909, -10545, -3172, 406, -3760, 1967, 2300, 2215, 80, -7363, 2922]
254B922L033j4525M063L102p870O493M556K71J948n855N804P305r905K134K929
269F405j1400J591L657k195L275m883NQ531n098J590O654q804j404L428l494L538
285A396k598m220O495l858r60R587n179l638M859l293J295J124m049M620l816
300b235m068J0224k832o269O905k251k554L436j437L669j872m913R573k84p332
315b240P934o68o599L002j110M22r09n699O524J508p851P617L298o757L055N79
331B106j129R26n707K765L144q520L527N634n586K220J973j199K791m733L65N245
347C822p726p52N940n034R2L645r18L083k320l27P265m864k697P080m655l448
363a814L996j782L87j399k686N701k767l257P973k837m523N461j002r29J255l319
$$ y = [2922, 5955, -8570, -4507, -1405, -9275, -2782, 1774, 2045, 3993, -1862, 3942, 11247, 1342, 3476, 6405, -4995, -3404, 253, -1942, 1333, -3550, -3545, 4986, -112, 1478, 8132, -672, -2076, 1352, -2142, 1396, -1202, -5422, 1073, -2785, -3745, 5842, 663, -2975, 1884, -1409, -114, 1010, -3039, 1581, -2235, -6303, 3921, 1089, -5180, 1725, -526, -3080, 356, -1081, 2588, 716, -4197, 5376, 5092, -2240, 5694, 5026, -1573, 1429, 319, 741, -168, -5867, 657, 2165, -5686, 1931, 5229, -1528, 1527, 2106, 977, 1903, -3804, -1039, 2105, -6415, -2888, 2746, -2840, -620, 1353, 154, 2945, -1788, -1423, 3822, -3904, -4656, 1284, -3750, -3658, -13, -931, 2152, -168, -495, 6770, 1906, -791, 6289, 1634, -1814, 2182, 400, 787, -612, -3298, 2403, -364, -3621, 4352, 1515, -3008, 2453, 1451, 522, 1777, -1542]
379a542J944j641m019O445j197n418N792r6j664M381j383K85n53n240L854K97
395B45o888L314L54l319N202K111J937K909l445L445L372o552O81J16p629m60
411d607M94q6K688l141K618O450l396K530N516o035k968M95j840N50m099j136
427e967M766l809J179Q861k390k429K504j661L14j822k741K311m619k257Q203
442D43M6j498M504q74N34J665j821K033l671o209M369j73k675L836j056j189K859
459A123o13L011J92o200J651O19l695L695K04k925K022j78L101L139m382J000
475A764Q70n516K583K053m186l71p67R63L759j825J700K685n786J598N093l215
491A402o80j84j802J932q91J105L081o124j395M906k934o64J654l135L43K07J365
$$ y = [-1542, 402, -1239, -5258, 1187, -10, -5428, 364, 268, -1396, 2985, 1602, 1887, 1334, -3906, -52, 245, -6643, -3329, -2975, -6294, -1092, 1019, 2956, 5865, 2420, 5865, 9237, 2685, 3366, 3482, -4147, -4607, -4113, -4199, -1511, -4652, -2034, 4416, 1020, 3550, 9066, 3031, 63, 558, -1282, -732, -4831, -5967, -1201, -5010, -3831, 5030, 2640, 211, 2715, 1054, 1368, -454, -3195, -884, -5503, -7760, 443, 489, -1009, 3495, 2621, 3155, 4820, 2999, 5032, 1361, -4848, -479, -652, -3327, 509, -547, -1736, 1123, 510, 3521, 3713, -2487, -836, -217, -3912, -217, -13, -2938, -916, -1094, 2007, 5146, 764, 1764, 2634, -2882, -299, 1754, -2432, -2803, -3570, -2607, 1152, -673, 1027, 3712, -2074, -476, 4617, 1402, 722, 538, -1264, 668, -223, 882, 3963, -2161, -3556, 1350, -1584, -2248, -594, -3729, -3386, -3179, -1814]
508a814N594k684k253M968j346p46K846k846k035j509j946M257n59l654L705k87
524c09j386M961M42q94n57l241K659J041m508K025o63m450L172K215k55M95k642
541a895J435K331l034K552J218o169Q00K173j240J390j257p78J955j838L246L814
557D703m616J88K612k129J544O39k363k25k759N83M010l148p62K659k850J309
573f05L084j192O12k131j536L726j307j491K588l030j367L110j84P06j347k759
589c123K631m77j939L886j364l082K584J232J515R29k252J801j89l138L370j1
605B373m903N23Q0O9J966q64J825P27k789L520K328m019P0m87k662R47l97K06
623a487R03l129J790M176j655J100J154k846K51n6o61R76l557j179K900j344J254
$$ y = [-1814, 3780, 1096, -1157, 3811, 2465, 1719, 4565, 1719, -316, -1825, -3771, 486, -73, -3727, -22, -309, -1695, 3266, 3708, 2814, 2257, -984, 1675, 2716, -1792, 233, -430, -4880, -1708, 507, 252, 747, -1895, -460, 1871, -1163, 1389, 2607, -3562, -2762, -589, -1829, -439, -1696, -2474, -519, -2357, 889, 4703, 87, 275, 2887, 758, 2302, 2941, 578, 353, -2406, -1823, 2187, -961, -1723, 936, -1914, -605, 2479, 1287, 1899, -232, -1768, 1958, 651, -840, 1748, -1282, -2649, 461, 277, 983, -364, -3123, -492, -969, -2908, 978, -386, -3468, -884, 348, 1863, 2792, 540, 2341, 2152, -986, 2384, 2373, -2530, -2007, -1927, -1858, 108, -756, 1069, 1796, -993, 2527, 4855, 836, 906, 419, -2243, -1296, -1693, -1487, -584, -3713, -1923, 2253, 598, 1698, 2852, 6, 257, 201, -460, 516, -3041, -4220, -1320, -2664, -1410]
640a410L206j827O11J303n6K227j709k481J585k367j258L188j661j178R36m5K339
657A403N20j181K388j793k348L289p76k578M98j428K01P58p32K473o62k653L587
674I66O84j991J617j092j521K31q89J687J52l283K114J809j666K272J116j389
690H17M69p82R54J162l203J30J225k754J481J779j341O85n70L29K313j851m45
707C98J769l180l15J981j266j24m77o25K077p41m27K625k095j421K366q59l77
724f91N36j345J018k37p81L067j054k148K583n39p01J517j049o8N8j130K622j17
742A541k265K068l87j665J925m43q31K66j663J486P17k088J776L86k247J742L87
759G05q52O84j539K89J268j986J123J347k544P83J224q42R48q26l98J638k095
$$ y = [-1410, 1796, -31, 580, 1883, 1827, 4054, 2345, -136, 1449, -918, -2176, 1012, -649, -1827, -891, -936, 1403, 1923, 742, 3130, 1337, -1011, 2278, 1502, -1076, -578, -2006, -1805, -1047, -1779, 694, 32, -2621, 966, 1650, -341, 1276, 184, -1337, -1106, -1995, -308, -156, -3439, -1325, 484, -1182, 1090, 2206, 817, 1286, 504, 1458, 2620, -583, -453, 772, -1982, -501, 1278, -63, 622, 52, 381, 2694, 843, 398, 2167, -1013, -1328, 653, -613, -737, -1214, -1839, 238, -503, -930, 1695, -400, -1821, 545, -314, -691, -155, -1500, -482, -719, -1500, 1567, 513, -1635, 948, 409, -292, 1225, 176, 108, 166, -964, 1658, 1541, -724, 1344, 957, -708, 1217, 774, -57, 209, -1454, 32, 749, -1339, 437, 823, -1424, 318, 705, -147, 537, -1002, -713, 555, -1431, -308, 1039, -1505, -722, 502, -340, 608, -218, -616, 1022, -1073]
776a073L50K462k281l85J552p92N94M4n94J418j577n08K604j720j031J820j190
793c07m3O87n43Q41r45j095K441q82j475K050p96o90J376n42O72l9j750J663j20
812E03j978J889m20j286J251n00L01P48j265J036O95j930J410N52j706P32Jm46
830d13R36j056O27J091k109J096J112j793K98M77p90O58o83L9J383j769M28J880
848A412j672J20J272j310L15k11m54J346j480l86K105j475l72J712j041j75M20
865A26o63J084r03q61K124q96j031K061p13k04Q11q99O80j84j508J516l11j663
883a434J521oq36Q15k72M95N67j426J223N60j991J033K60j297O48k83k14P74j123
902i86P98R74j666P95J133j547N00L01p57N76q39j4J215j515N42J612j466M75
$$ y = [-1073, -723, 1739, -542, -927, 625, -167, 427, 471, -123, 1295, -282, -790, 1814, 94, -937, 883, -307, -350, 337, -206, 635, -310, -1405, 1036, 154, -1321, 729, -67, -757, 619, 77, 749, 710, -1040, 623, 503, -1475, 414, -6, -1292, -41, -541, -240, 508, -757, 279, 974, -956, 454, 1006, -700, 32, 33, -413, 523, -533, 94, 1185, -924, 172, 1284, -509, -211, 266, -524, 134, -549, -510, 873, -896, -468, 1412, -260, -140, 1132, -178, 137, -74, -528, 818, -662, -1048, 1057, -418, -790, 922, -119, -294, 126, -537, 547, -356, -1217, 907, 11, -1020, 1041, 328, 124, 935, 36, 716, 532, -976, 540, 229, -1434, 87, 81, -755, 60, -212, 283, 850, -576, 647, 1207, -784, 249, 509, -788, -140, -423, -637, 137, -986, -188, 786, -880, -85, 1048, -499, 1, 302, -455, 121, -718, -732, 483, -1032, -490, 1122, -344, 131]
920A31Q54q15N24k64m40J060j490k91J434j332n9J206j006M58N73n50J154o27
938E20q54J706r95q61J183r04k00K96o12P75j03j076J551k37j194J256k05o61
956f15M06n63Q10J81j428J374L35j475J307L47j218O00l36j6O63j177P77Q88j688
975h28J106R24j237O34J03n14N96r19R8J005j675K53J351j191N38N97p31O19l32
994C97k94Q93j336m55R40j200rQ64q83O68P4l84J402m52p06J349q49n97J092r64
1014d50j23J29p16Q88j31q91J558j82q25J444p6l80O75o92N98J7j187R97qj392
1034g47J114J55p84O98l54K33M44j050Q56M60j569O72L96j210P02j33m41N72p52
1053g38L37Q42j116K28R44j106L99L29n76O76p97j97J201j055j30J097q55J07
$$ y = [131, 985, 170, 694, 430, -10, 1050, -440, -731, 703, -629, -688, 518, -488, -30, 543, -7, 1147, 520, -334, 1372, 377, -484, 699, -205, -405, -109, -721, 54, -49, -1125, 426, 189, -1005, 251, 46, -615, -209, -772, 38, 219, -1209, 165, 500, -975, 332, 679, -539, 61, -275, -291, 372, -805, -28, 860, -828, 278, 1202, -35, 599, 702, 188, 784, -135, -37, 968, -707, -454, 897, -294, 244, 841, 110, 729, 397, 103, 996, -340, -795, 145, -1055, -1064, -200, -1083, -415, -341, -725, 677, 225, -481, 868, 19, -578, 514, -450, -573, -444, -1160, -272, -403, -1294, 264, 82, -743, 701, 625, 245, 920, 228, 826, 843, -344, 653, 645, -747, 367, 522, -262, 436, 82, 315, 759, -291, 565, 1025, -544, 128, 524, -686, 16, -117, -558, 14, -738, -401, 441, -675, -447, 497, -609, -210, 119, -457, 219, -578, -775, 426, -629, -759, 338, -517, -410]
1071d10P96o12N80j61l67J159n58n05J281p56p12P05m79J07L9q21Q08j02p78J381
1091E95l02p90J199k59k47M47o73N10j65j038Q91P3j348J114j79m61Q28l51K07
1110E1N80j087O78M56j136O45J96p55N66l20r4N42q92J88R03j011K40O44q24K56
1130a74K59m52P30o86l06J103r91L1Q62o81Q9M63l17M77p0k45Q20o81m26J046
1150H51p15l47N85o43K78J14n75R94l45n16J038l57m40O55m68r4J64o00M68j17
1170g0q28Q26o2p86P74j29l46N98m18K45M74q46O87L71q79O32J07n14M81l32L6
1191B1M95p60K54N84r91M92N37p49L57q3k14N78p24nP94r02J8P33n99J8L17n18
1213c47O91l95l09Q13o50k57P80o53j03M81m41M45P2n67R06k09o15Q17k70m05
$$ y = [-410, 386, -226, 354, 193, -174, 985, 427, -78, 1203, 447, -265, 440, -39, 68, 107, -714, 94, -8, -786, 595, 293, -497, 702, 443, 196, 643, -30, 480, 315, -723, 168, 241, -1107, 7, -172, -633, 195, -156, 51, 631, -456, 222, 678, -458, 187, 383, -372, 194, -126, -220, 322, -570, -382, 521, -490, -250, 394, -430, -174, 85, -367, 363, -323, -629, 474, -517, -486, 376, -305, -216, 247, -70, 407, 337, 92, 912, 231, -195, 851, 136, -211, 374, -269, 9, 123, -452, 542, 197, -319, 719, 362, -78, 577, 109, 15, 179, -421, 47, -70, -898, -72, -134, -920, -146, -275, -621, -23, -441, -196, 278, -568, 119, 490, -389, 243, 350, -164, 317, -15, 21, 516, -244, 10, 594, -397, 95, 632, -117, 240, 157, -57, 521, -203, -208, 586, -316, -298, 435, -164, -146, 171, -347, 344, -51, -360, 453, -197, -454, 326, -327, -430, 51, -390, 55, 127, -440, 466, 257, -358, 459, 189, -216]
1233b16O31m65K9P4m46N11M7p36P37K0m73N24j82k62N26o02L35K87p70N28K34
1254C31p15N03J06m54N02m42J42N05q58L14M14q22L03L20m97M03L2j36M58m24
1274a5k8P86r06K18L73o48M2R9l09M92k87l60R14o80O0O36m87J3M74n89M02J02
1296C02n81P06m82m29R25m24k75O11l96N5Q7m59N90k2o63N81ll48N14j31j54L85
1318C89n19J99K47p03M84J33o43M95r4k90M81l69K00K49m62J33M27o77K69K02
1338A51n09L88m7k17O02m72j02O70o33J37M33n47K05n0l44L68l61j86O64l63j39
1359c52N67k49J51J94l54N54j68m34M59k62l75M93l74j58L19l46K70J55l71N60
1379B79Kn18N59N0n49M63l27OJ97n40K02J50n94M99K97n71N56q0j75L49m32J78
$$ y = [-216, 415, -50, -21, 53, -393, 118, 165, -571, 166, 186, -287, 237, 55, -207, 319, -283, 52, 339, -431, 97, 331, -384, 119, 225, -229, 273, -169, -27, 478, -380, -66, 348, -474, -171, 149, -348, 55, 87, -49, 409, -15, -43, 743, -163, 55, 428, -220, -178, -79, -388, 104, -183, -543, 371, -309, -249, 387, -100, -87, 387, -202, 200, 302, -279, 427, -55, -484, 441, 17, -258, 353, -43, 12, 99, -360, 230, 208, -455, 126, 123, -225, 289, 158, 4, 389, -130, 69, 316, -387, 97, 230, -413, 82, -12, -302, 179, -190, 10, 259, -203, -70, 357, -320, -51, 151, -358, 30, -17, -234, 368, -104, -206, 464, -169, -32, 401, -146, 59, 9, -335, 33, -328, -514, 150, -213, -352, 215, -34, 117, 311, -43, 511, 343, -91, 368, 106, -269, 224, -150, -308, 11, -335, -65, 90, -281, 279, 281, -237, 322, 372, -177, 286, -41, -35, 162, -378, -176, -26, -620, -121, 176, -395, 161, 81, -94, 255, -177, 1]
1401AK83o36K25K38m84J30K66l54M21r7l8N48l47K9L50m64J42K2l94K50j61l35
1423d05N56m22o9N72k78P0K68k59J78J10l01L32m03l03M58k71l83N33l10NM24
1444A02l65L12m0k13M07r2l23M05j14l81L20k59P2K19k98M16N3l35M60j70l67
1465a91M53j37j43L48m09J33K44l90J56K58m43L09L1l27M03l38q4L18n16J53L23
1486A51m74K80O1k14J77n9j91L88k49j66O02n39J17L39l71J86M8k09M44l11j37
1507a27M23l74j39L51k67l9K19k24L27P7k92N25k09l41M66l65k05L39l50J17J91
1528A03m01L21ol31L91P2j23J63q7j99L43n17J30K66n61L07K80l97M18Rj84K70
1550B67l10J08K29l53q5K39l31J97J14k03K56n4r8L87k03l4K26m11k05L76k55
$$ y = [1, 284, -352, -127, 111, -373, -243, 23, -331, 90, -7, -45, 503, 156, 185, 535, 71, 213, 235, -159, 91, -70, -405, 151, -271, -340, 232, -46, 24, 292, 33, 211, 321, 20, 352, -51, -354, 104, -167, -550, -17, -327, -322, 102, -263, 49, 9, -204, 203, 111, -212, 193, 79, -302, 18, -241, -169, 50, -248, 168, 221, -114, 346, 176, -191, 262, 125, -18, 330, -79, 54, 298, -92, 64, 322, -121, 188, 219, -108, 295, -43, -127, 191, -325, -172, 151, -323, -43, 18, -196, -19, -78, -269, 119, -130, -296, 306, -233, -116, 223, -148, 38, 86, -123, 321, 10, -127, 296, -78, -217, 134, -133, -172, 47, -177, 150, 227, -65, 460, 251, -90, 376, 11, -194, 145, -205, -88, 103, -298, 23, 17, -314, 77, 149, 26, 189, 102, -97, 246, -271, -141, 125, -436, -129, 151, -246, 172, 181, -3, 267, -43, 65, 294, -59, -144, 95, -236, -39, 75, -128, 128, 74, -24, 363, 160, 126, 352, -59, -264, 112, -143]
1571a43K6P3q7K83j58j94M58k34j74L33m05K6J28k51K23O9k51M34pj91L30j22
1593A66j14J39m23K19L5m21L19R3l67L37R7j02L36k12N8K38m56K56K9l78J04k
1615d9k11J83n4rK04j56J40K67k97l9K15l36J50j9k81K30j52O5K35k91L8M35m33
1638a65K22J37k47J78K6k64K45j77k08J74j59Q9J90j60R4K40k90K58o3j50K66
1659B36j94j64L18k72o7J94k02j8L36m01L65n3j58K70k2k77K09k4j79J84k43J70
1681HJl17J87J40l60K45K7j30L32k94R8L16m57J76J83l74J68J03k49K90j24jK67
1704B35k16J42K26k89n5O2k74J64L5k44L20j54p5L99k22k9J80k25QP9l78K46R
1727e6j46K06j50o7L63k19K4K12k15Q9K0k20K99q2k07J94q2RK33k77J72J18k49
$$ y = [-143, -117, -44, -131, 152, -6, -200, 258, 24, -150, 183, -222, -196, -68, -319, -96, -27, -278, 156, 149, -42, 288, 166, 52, 191, -232, -13, 22, -399, -80, 13, -354, -17, 80, -22, 314, 102, 160, 398, -58, 198, 227, -151, -47, -49, -260, -77, -131, -140, 64, -92, 48, 315, 18, -21, 194, -142, 8, -11, -292, -62, -214, -149, 86, -205, -167, 268, -165, 57, 194, -53, 125, 151, -113, 132, -45, -253, -79, -238, -149, 41, -119, -25, 215, -75, 183, 120, -30, 236, 42, -122, 196, -76, -143, 51, -151, -169, 167, -234, 131, 78, -80, 190, 168, -109, 100, 76, -103, 81, -162, 8, 9, -308, -121, 19, -341, -96, -69, -199, 133, -161, -63, 253, -204, -28, 155, -219, -51, 52, -197, 93, -31, -32, 235, 19, 161, 387, 98, 43, 105, -169, -5, 30, -214, 106, -48, -123, 276, 54, 25, 205, -20, -12, 67, -311, -65, -56, -202, 4, -146, -213, 150, -69, -45, 167, -48, 41, 61, -159, 140, 58, -149, 45, -37, -28, 205, -72, 100, 218, -31]
1750c1J74J15l20J32j4k14K24j50J5J76j93O3K50k73O2J60l16R7J05k33K01o7
1772c7o8K58k66J01K05l51J95O2k16K51j39k23J35k7q5K51q8L8J38j79J95m2k83
1795a75L07l9j86K71l32M8R5j66J28J38j54J85L4j35J03o0j24J63k01l6K26k39
1817a49J37L7p4K46L0k40K33j24j35J95k72j42K15k71J55J89j59K86M3k96L02
1838B06oj52Q4k42m7J42j63j45L20k08K56n7Q7J66m7o9Q6j86j00K74l21j5J01
1861c6j34J31J11j61J44J06k34K73k16kOk09jJ37j22K32m9j29L86p8n2J30k47
1884a4KK86m93O2J77l36L10n6r6J80O6M4M4j11J0L3r6O3k2k87K40p0j15J60N1
1909C2j9J47k48M9J10p5l3N8j27J3m2j2K03M2j27K05j28N3Rj65J20Lk15J77j42
$$ y = [-31, 143, 258, -62, 70, 56, -158, 66, -84, -69, 107, -86, -23, 227, -46, 16, 176, -140, -43, 62, -171, 30, -37, -105, 153, -113, -12, 193, -158, 37, 99, -117, 134, -5, -228, -93, -120, -205, 46, -42, -4, 134, -45, 150, 108, -175, 132, 93, -93, 178, -154, -106, -11, -177, -49, 89, -65, 120, 154, 19, 122, 62, -62, 101, -100, -136, 90, -149, -12, 25, -49, 197, 227, -13, 220, 96, -39, 156, -116, -258, -43, -314, -159, 30, -129, 157, 200, -96, 206, 200, 48, 132, -110, -157, -15, -178, -323, -3, -211, 45, -12, 75, 241, 194, 125, 211, 25, -75, 199, -122, -137, -36, -170, -39, 72, -89, 55, 161, -73, 200, -16, -18, -12, -221, -222, -85, -207, 25, -24, -153, 233, 155, 103, 233, -14, -12, 274, -219, -157, 20, -316, -6, -62, -158, 22, 88, 132, 176, 65, 75, 108, 12, 75, 53, -234, 6, -64, -179, -19, 32, 13, 160, -88, -39, 71, -4, -37, 21, -106, -93, -135, -147, 56, 98, -29, 176, 48, 101, 110, -55, 65, 68, -147, 30, -112]
1934a12m1K27r4l2K51k05J7P9j80J85N6l26K17q4q7K19m5j13L04j89N4Kk22J96
1958G7L7k94J03r7j8J72J24j59J64m6j5J85l21J50m4j48J87o1k40L11j35j26K37
1981D3j62P0N8j49J37J7j96J29P0j61K04j43M4R3j24J09O6j74N3J50k36K02l4
2004F6l8J77j56j07J76M0k04P6q4J4O9j85Q8R9nO7Mj36R6j19r4M5k9J4l1q8J54
2031i1m9K6K32m8L5R3k43J90pk23m5J02j29K24k03L0K87j80l1J55m6M3Q0j67R5
2056A30lk14J39l0o4J22l11Q9K54j20M3M1j13J92j41j22J37k15K9J63j73NR6q4
2080a50M7J48j8M5M8o8J06q1p2P6k67M0J89q7k9O6j66J52Q8n3J90l1j88K12j30
2105F7K9L2k04Q5K03l90J88o0o0J66j50M3M8o4P3NJ9n9J11k95J82L5j19J79j36
$$ y = [-112, -153, 74, -20, -52, 199, -6, 11, 90, -90, 95, 151, -175, 42, -42, -129, 90, 45, -68, 236, 47, 101, 103, -119, 77, 114, -180, -77, -174, -192, -20, 104, -55, 109, 63, 48, 233, -88, 62, 18, -130, 57, -4, -244, 67, -68, -194, 43, -119, -49, 9, -140, -3, 14, -182, -53, 17, -144, 60, -83, -39, 54, -70, 39, 105, -69, -16, 134, -102, 100, 66, 28, 205, 49, -58, 118, 158, -46, 30, -54, -40, 29, -156, -68, 31, 26, 93, 97, -39, 57, -62, -156, -111, -140, -126, -157, -245, -91, -140, -114, 118, 70, 105, 198, -45, 145, 138, -85, -130, -28, -157, 67, -136, -106, 181, 1, -30, 125, 79, 122, 202, 35, 130, 127, -87, 52, 22, -42, 80, -231, -142, 112, -8, 35, 76, -37, 155, 14, -108, 29, -186, -157, 6, -167, -162, -66, -150, -103, 45, 27, 72, 120, 52, 158, 77, 5, 81, -186, -146, 43, -44, -73, -7, -173, -21, 67, 14, 204, 173, -15, 197, 67, 96, 128, -76, 9, 212, -178, 10, -50, -110, 56, -94, -51, -3, -67, 6, 11, 30, -29, 82, -213, -31, 4, -115, 64, -72]
2130g2nJ43j91O1R8q6P9m1l0K9R7j04M0P5r9R2j24J64Q4k12N5P3k24L7J58j15
2156a8K18p8j29R2j87J06J26j99j%j01J66j5N7J9n4L3mP5j51J70k65R1Q5j04Q9
2182B1r5L2P9R1n9N2j18p2J43k47R7P5k2J45r9m7J54j26p4J91k32J09P5p7r3J5
2208h2MM9M3k6K07j53N3L6j38RJ13k85J39N2j36O8n3l3J35j15N0Q5p2J05J03j75
2234a7M9%m6j7j8j7O7o4j3O2L3P6l1l2n8N0j45R4N5j25J57m2j32J95j40J28M1
2261A10r4m0N6P1M1j00L4q3j04Q4rj17R3N3j13J24K5j51M9J96j20J13j89L3J12
2286G4k04K7J16l9r9J58nj27Q0P9o0n1M4O8m9n3J95j48P8q0j55J82j01J2J23k8
2312C7P3j52q4K51o4j31J3J4N1j8k9l1J12o9j3J92k16J71K1k23J31k9l3q6J9m6
$$ y = [-72, -77, 66, -125, -64, 34, -52, 27, -14, -44, -15, 82, -22, 18, 93, -6, 86, -38, 126, 210, -2, 53, 126, -98, -61, 97, -18, 200, 122, -7, 85, -102, 4, 130, -69, -70, -70, -171, -5, -20, 37, 56, 2, 35, 31, 106, -45, 125, -140, -49, 36, -68, 21, -74, -42, 37, 128, 69, 121, 3, -69, 74, -173, -76, -1, -23, 122, 23, -24, 130, 4, -70, 121, -111, -2, 73, -4, -97, -82, -78, -29, 14, -12, 195, 42, 95, 131, -7, 2, 115, -170, -31, 21, -115, -47, -100, -133, 2, -113, -63, 22, -50, 55, 158, -17, 32, 32, -14, -31, -49, -66, 1, -63, -76, -14, 19, 95, 64, 32, -26, 24, -121, -27, 28, -97, 60, 18, -114, 81, -59, 69, 110, 16, -24, 32, 103, 144, 44, 78, -5, -109, -25, -34, -151, -58, -5, -118, 6, 31, -120, -71, 125, 5, 118, -71, -38, 74, -130, -103, 13, -26, -125, 33, 28, -99, -19, 60, 0, -51, -7, 61, 12, -41, 154, 6, 84, 4, -151, 31, -70, -58, 65, 37, 110, -42, -126, 125, 61, -70, -57, -43, 8, -10, -39, -70, 42, -27, -40, 152, -64, 107, 128, -95, 36, 7, -26, -112, -93, -139]
2338a39J49L3J00p8l0k5J2l6p2O3n0J71J0j17J48j80M6Pj28J11O0j32Q6L9k01
2363a53J34k06J25J47Kk2J06n9o8K5p4K9J3p6K7r9J85p4o4J33j0Q5q4N6j18M6
2389Fj5n2J18o2J6Q6q5O2K7j18J43j66j7J48o5r1L9M0j00J91j53n9J30j04Q6L9
2415D4q3J02j35j8J11qQ6l1j52J21jk5Rj4r7J59j6j53J23N1j12P5m2P2K1j29Q4
2442D2j28O3J04j38P5J7q3NM6qj7L3j01J68q4L3j46J41j10Q7Mp2J25m5J05p0j21
2469g5K1N8j1lr6J53k9j5j05J44j63J62K3j8Q0j76J0J13j6j80J79n4m0Q6n8N3
2495D3K4j19M6N8o1M4k4m0m1Q0K9n0o3j6K06j77J73j20k2J1P0k4j09j6J03P4l4
2522D5j6Nj47K24n6r5J53j44q0J71nJj06R2p7J6k7k8K07j07q9J69o1j3L9j09J72
$$ y = [-139, 10, 43, 143, 65, 35, 10, 22, -14, -86, -23, -73, 98, 108, -9, 139, -41, 5, 12, -116, -5, 55, -77, 9, 48, -153, -19, -225, -100, 47, 49, 27, 133, 74, 6, 31, -43, -14, -1, -77, -50, -149, 36, -38, -102, 31, 21, 106, 22, 78, -40, 6, -9, -61, 57, -5, 11, 97, 12, 74, 101, -17, 126, -40, -57, 91, 26, -65, -26, 14, -86, 105, -48, -107, 23, -81, 5, 44, -39, 63, -72, -90, 21, 13, 99, 68, -84, 37, 36, 11, 20, 6, -91, 68, 52, -101, 22, 73, -39, 36, -6, 66, 87, -42, 42, -86, -23, 81, -57, 18, 35, -48, -43, 3, -5, -22, 11, -90, 78, -6, 27, -119, 22, -88, -1, 3, -69, 56, 11, 116, 46, -75, -54, 4, -7, -10, -106, 47, 18, 3, -102, 42, -121, 41, 64, 46, 126, -50, -40, 73, 57, -123, 56, 2, -38, 48, -10, 43, 67, -52, -6, 52, -9, 35, 11, -29, -70, 10, 39, -11, -74, -90, 116, -61, 112, -8, -30, -19, 51, 27, -82, -98, 5, 79, 45, 29, 34, -113, 111, 55, -40, 113, -31, -111, 60, 55, 56, -50, 42, -35, -19, -46, -74, 133, 26, -63, 106, 45, 32, 71, -38, 134]
2549A34k59Q8J17r6M9j18Q5ML0j60J77o6L9N4j01K7N9k05J03J00j54q2J86j71
2573a60J98n9q8J47q8J02o5PO4N8k56J86m3K6q7ro8J26nNL8r1oN4pR8J9j40J34
2602I0n8M2%j87J19l5Q8j07J53j14N3N5j27J23Jj08L4n5j8M2p2J37k9j17N4m5
2628h1J05J18j51QO0l1P0j08j20J49K5l9m7J13j52J74m2J2Rr9N4O6n0P6j11l9
2654c1O0j34lJ81q1K4J6K6m2Q2k14L5k1R0N0K1j58J04m2o3K05p4k6m8k0M5j5j69
2682b02J84j7l9J77o0p0J21k2K7l3Qj46n5Q4Q9q3n4J43j33K8R5j6N0m5L7j7j10
2709e9K5m0J03J08j24j28J65l2qO5J5j32J5P0j20Q6lL2l2j10j0J38J2R4r0q5N1
2736FR1n5j13M2n0k4J62j98J46J4J7J78l02L2J5KP5j39K07j46l8J53l5Kj0o4P5
$$ y = [134, -125, -37, 80, -16, 33, -85, 0, 4, 34, -126, 51, -15, 24, 78, -23, 4, 63, -142, -39, 61, -93, -175, 11, -160, 38, -21, -109, 38, -50, 52, -13, -6, 58, 116, -140, 46, 3, 29, -58, -67, -135, -9, -14, -9, 29, -62, -68, -14, -21, 77, 96, -44, 90, 32, 74, 74, -113, 6, -29, 59, -48, 105, -9, 44, 99, -28, 95, 96, -12, 22, -33, -51, -9, -81, 56, 27, -90, -36, -81, 24, 142, -9, -1, 59, 28, 98, -10, -130, 19, 44, 5, -42, 71, -81, 93, 51, 63, 72, -27, 27, 93, 43, 119, 8, -31, 29, -105, -108, 73, -8, 16, 32, 58, 16, 98, -116, -81, -102, -12, 38, 59, -99, 5, -37, -100, 105, 31, 5, -43, -63, -18, -33, -202, -18, -35, -74, 103, 43, -27, 94, 72, 99, 66, 74, -72, -127, -43, 46, -37, -91, 52, -81, -53, 42, 26, 76, 31, 68, 51, -59, -34, -74, 29, 137, 13, -115, 50, 18, 10, 75, 90, -42, -27, 43, -77, 9, 6, 38, 6, -104, -114, 24, 36, 130, 40, -45, 6, 97, 42, -71, -29, -79, -103, 59, -139, 7, 21, 38, 216, -86, -54, -39, -37, 38, -101, 106, -40, -78, 75, 40, 42, 32, -32, 43]
2763D3q1L8j84K62m8m8N6l9M3O8j25P0J06k47R4Qn2M9J0K6K4q7L1Mm0K6m6m5N
2792g9K31j29kP3j35N4m4L5M3j17J4J36j50J61n0K3J1j9l9p4J9J4M3J7JO9j22
2819a6J40o2l1M2j14J22n6K8n1J1j83K62j34J0pk1K0L1O1j09N5jQ2n5n7o9o1J31
2847c2M3N3j26J65j30M7o5l0K1N1j67J68o2L4O8r1N2RN4p3J42j16PQ4l0p7M1p7
2875c7O6J5n8J5l5L8N4j26K09o0q4N5p2K1qn8M1O5q3K0M6r0J42j32R3r2J09J6
2903G0j17R4o7J28j61J04j2o0m6J64j57O9L7j09J28j12MQ7q0k2R2j52J93j26K6
2928b5J4l0L1J23o9r4J23q2K8j04R9J44p6qj70J56o7m2K6r3K23j34L0L3o8o8R9
2955aj2L7o3KJ7l1RJ2L0m1r0R0%M3n5R9m1M1r8pKJ14j45Q6k4J44j75LK11k53Q5
$$ y = [43, -38, 0, -184, 78, 30, -18, 38, -1, 42, 110, -15, 55, 161, -86, 8, 16, -36, 13, 23, 49, 73, -14, 17, 21, -19, 7, -39, -84, -79, 152, 23, 21, 94, -41, 13, -31, 4, 47, -70, -56, 80, -70, 91, 41, 64, 75, 56, 17, -57, -38, -24, 19, 36, 37, 106, -16, 124, 62, 31, 73, -41, 81, 25, 53, 2, 13, -170, 92, -42, -32, -39, -60, -40, -9, 52, -57, -2, -3, 79, 24, -33, -102, -163, -32, 11, 64, -62, 103, -27, 20, -45, -75, -54, -3, -170, -2, -64, -30, 38, -53, -1, 8, 62, -11, 131, 15, 22, 106, 76, -1, 40, -37, 29, 44, -14, 1, -34, 4, 58, -68, 141, 81, -3, 52, -20, 1, -7, -65, -24, 41, -42, -22, 24, -66, 76, -56, 37, -55, 54, 70, -47, 47, -20, 108, -53, 51, 39, -21, -67, 97, -60, 9, 46, -63, 65, -47, -43, 44, -36, -58, 34, -118, 75, -51, -25, -11, -41, -10, 113, 44, -50, 73, -9, 19, -85, 14, 158, 82, 74, -96, 60, -7, -49, -23, -116, 107, -27, 3, 36, -32, -100, -1, -13, 24, -39, -37, -20, -51, -42, -30, 0, -41, -131, -41, -41, 2, -53, 46, 5, 46, -52, -59, -57, 57, -88, -2, -26, 118, -57, -54, 157, -96, -11]
2986a1o2R6j8r5J91j00K3p1J59k26J05R9r5j3n2M3j03J87O0o3Q4j52p8N2qk9J49
3013G2K8k48K08l3k07K84j11k6P6p3M3n8L4k8Q9l5K9qj95K00J7k0Qj81J48JpJ7
3041B4K0j19M5JR6m2j2M9J0q2p2n3j09K52l9N6Lo2o1J40n3nN2k9M0k9l5k0J05
3070G1j03j2J99p6k7j16M8R1j45J25j14J92j59J15j68J45j26j7Q4r1JJ39r7J9
3094b2n5LJ45l6j18O9L6j58J09%L5n7P2r0Ok6J46q2L3m1n9J78o6ml2M9p2N3q4
3123f8PJ51j18L0l4J15p6o3N9N1M6j38O3j19O2O0l1m6NN6n4M6J1p8P0L9J27j99
3151b6k8j3J47n0m3L4K5m4K9j43J45J1j73N4N1q3J20l9J26q2M5p8k7J53j41K3
3177gk3rlR0qk2jkj7k3L8pR9k06K29j72L2o2j4L0J96o7J2m0m8P5L4o5PL4j39J00
$$ y = [-11, -73, 23, 5, -90, 101, 1, 24, -47, 112, -114, -9, 90, -5, -18, -70, -27, -130, 57, 117, 54, 138, -14, -92, -40, -48, -77, 72, 100, -148, 60, 27, -180, 104, -7, -33, 43, -30, 13, -45, -11, -39, 50, 15, 44, 36, -159, 41, 58, 38, 46, -135, 13, 14, 7, 24, 44, -75, -30, -29, 67, 25, 13, 62, 72, -10, -82, -135, -244, 8, -31, 25, 28, -34, -95, 45, -8, -13, 39, 10, 50, 21, -14, -34, 71, -32, -44, 155, 79, 52, -64, -16, 75, -70, 55, -59, 133, -26, 89, -79, 66, -60, -77, 7, -84, -83, 56, -41, -22, -77, -74, 71, 35, -83, -14, 22, -136, -27, -27, 8, -49, 23, -67, -61, -87, 59, -23, 10, -31, -90, 88, 22, 18, -14, 35, -37, 16, -68, -61, 90, -28, 2, -32, 83, 7, -56, 3, 54, 100, -38, 25, -94, -32, 28, -3, -49, -44, 12, -42, 4, 15, -63, 7, 46, 173, -26, -54, -67, 80, 30, -13, 21, 46, 2, 31, -112, 33, 44, -129, -75, -24, -107, 13, -26, 100, 18, 63, -15, -42, 111, -30, -7, -30, -39, -42, 48, 40, 18, 17, 15, -2, -25, 13, 6, 105, -101, 128, -44, -12, -74, -88, -58, 138, 71, 83, 43, -5, 70, 104, 39, 46, 80, -59, 41]
3209D1k3n7R9j31J03o0M7l1Rl7n8J17m0MKJ15o8r8J14k0M8l8J2r9J46K3j27L6
3237B9j32N7m4J04m6J7J0N9p0K4K8j10J52J8j75O7M1p0Q0k0j06L8l8K8M3N7n2
3264a1k0N7j53K0J38q1p6Q7J13n7r3N6jP3%j36J37m3q2J32Ro8o8L8K8q6R0lJ5
3293A5n7J63j44o5O4M4%l6j5n7K37j29j17J43q1q0J30o9O8L2o0R0j70J10l2L4
3319A8K4j3l3J40j43k9K4L8n5P2l8n4O5K6j86K46j15l7M2j4K8o9K3N2K6j80j5
3346a57J87m4j22O0L8L8J5J14j54O9m4j5P6K9j10Q7L4m1Op3K5O1l6o9M4j40Q4
3373c8j9P7K3J1p3P4n9J51j40lk6m2J04r3L6J0M5R0r7J33k00%R4j23J01m5o2J48
3401G7k3r1L1l1K2K6J46j15q2M2k4%m3P4K0m6J03q1r6J2l8J89j46QR5Oo7J4m4
$$ y = [41, 18, -39, 60, -71, 32, -28, 19, -12, -3, -40, -98, 19, -21, -17, -15, 100, 32, -66, 48, 28, 76, 38, 50, -49, 97, 120, -7, 29, -103, -46, -90, 14, -32, -15, -5, 54, -16, 8, 36, -74, 78, 96, -79, -12, 29, -41, 39, 19, -87, -49, -87, -59, -16, 41, -11, -31, 26, -127, -107, 31, -50, -126, -39, 74, 17, -76, -20, -21, 52, 52, -84, 53, 10, -72, 60, 69, 1, -67, -29, -1, -87, 3, 0, 15, -42, 121, -23, -88, -24, 20, 20, -16, -31, -88, 149, 20, -97, 46, -35, -115, 15, -54, 14, 46, -14, 76, -94, 16, -16, 18, 42, 29, -4, 136, -7, -36, -12, 26, -29, 43, 5, -49, 16, 42, -144, 102, -13, -50, -8, -22, 6, -63, -40, 12, 38, -142, -157, 30, -14, -136, -76, -38, 0, 15, 129, -25, 44, 0, -15, 61, 90, -20, 67, 101, 60, 66, -7, 18, 79, 43, -26, 18, -122, -38, -57, 20, 43, 54, -19, 55, -4, 147, 7, 4, -22, -64, 40, -53, -17, -7, 38, 128, 31, 164, -36, -36, 58, -65, 36, -9, -71, 77, 54, -37, -6, -37, -15, 11, 157, 42, -40, 2, -22, -22, -65, 9, 29, -17, 86, 5, -91, -79, -117, 72, -74, -66, 29, 35, -32, -18, -62]
3430f2M8l5R7l4k8M4m0O3l1K0%jo1P5q8M2P2j26P0J05j08rkqlO6k0K2p5K1Nm5
3462b6k7L5J9k5p0k8N5J23j25N1J18J5q4j01n7Q4L2o2M7p3Q3O8q8N5J8m4K2Rl
3491B1o0K8mL6j43J79j07nJ6M9j19J55nl6Q1Kl6l6o2k8pR5M7j11N4K4q7J39N5
3520A35j58J62q0p1n6J52j21L6L4q7O8L2q4JJ21J3k07P4J20m6o3L6p6J15o1r0
3546a01N8O4o0k1N2K5k0j14J78j21M5m5J96j59o4R7o4J23p9Q7M6n4P2j35J06r2
3572B0O6r1K4k5N8R3j08k5m1nJ3Qp0P0J7N5p5N2j23M6M0r8M3J66j18L7O5k19P1
3601e4%J19n4j09O6o0MR0L8K8M6j20k5OK5O8j10K5J2O2j51J8K10jr0j2o8J20r7
3630a4O1L9q4J13j51k9j5J20P4p3p0N7q7M0P9k8K2km1l1J70j56P3o7M0qj8Pm6
$$ y = [-62, -14, -49, 48, 14, -14, 30, -10, 53, 22, 42, 42, 41, -20, 55, -33, 9, 81, -45, 25, 130, 22, 13, 11, 3, 0, 66, 46, 68, -7, 14, 19, -26, -53, -18, 1, -24, -94, -122, -67, 56, -69, -18, 100, 115, 31, -70, -127, -43, -11, -73, -26, -99, -16, 52, -36, 19, 37, -7, 15, 24, 21, -39, -11, -15, 21, -122, 57, -50, -55, -39, 10, -109, 46, 41, 5, 86, 88, 52, 16, -46, -74, -81, 14, 61, -50, 4, 28, -59, 80, 135, -23, 139, 59, -12, -68, 84, -37, -1, 33, -54, 14, 46, -38, -37, 84, 97, -110, -36, 84, 38, -25, 11, -65, 50, -11, -101, -43, 21, -39, -60, -8, 17, -3, -117, 61, -60, -15, -60, 136, -23, -87, 10, -54, 69, -10, 77, 123, 69, 141, 6, 112, 20, 86, -5, 19, -6, 52, 145, 37, 12, -29, -34, -21, -13, -83, -13, 4, 59, -16, 36, -87, -41, -1, -99, -56, 110, -8, 29, 94, -125, -54, -54, 65, 11, -98, -32, -92, -88, 2, 40, 68, 114, -6, -31, -25, 0, 68, -42, -17, -5, 57, -94, -76, 134, 133, 43, 31, -37, 83, -14, 47, 86, 2, 115, -36, -65, -80, 40, 114, 41, -29, 28, -59, -19, 60, 32, 54, 52, 11, -20, 150, -6, 67, 0, 40, 32, 14, 21, -25]
3659b5rk9O6k1L5n7L9j8K6Qo0l7O8K3jm3L1O4j48J20K0K5J5j17k2K4q6J29o7J56
3689A09j40l0RP2j13M8L7J3l8p4J56Jq4PP0p6L1l5M8L4ml0n2O7j9L0l5K7r9L8
3719c2ql6Q5j01J66r5J01%j30J14j22M6O6L8r3j00J68j00P1Jl6l1prj6J10qLj66
3748a21J81j86J19R1j06k0J13K7q4o0Ql1R0Mj14O3l3P6n4J10k12J44r4J02rK1
3774B5j43N3m8Q9o4J31p1Q4j29J51l3l5kP6j10O4J01k36J34j6K6o9Q7o8N3L1q4
3801cP1j60J3N8n3R4k3K2M2k8p6Q0K4m9l6j9O6O9o7Jm1J9K4Q7j28MQj00J28L0
3831E7K6k20J31On9P3N9n3r7Q1M0j49O2N3K0J5n1N9p0J8o4J19P8j21l6j5N3l8
3859b3n4L3N6R4j56k4P4p7J53q5k8J6J57j39pJ69j10o3K1q8J56p5o9R0j81J30
$$ y = [-25, -34, -63, 3, -18, 17, -40, -1, -19, 7, 15, -45, -82, -14, 9, 8, -35, -4, 60, -88, 32, 52, 77, 92, -25, -47, -23, -109, 20, -47, 109, -31, -61, -52, 20, -93, -45, -8, 5, -33, -107, 49, 50, -34, -27, 43, -33, -2, -37, 11, 45, 41, 11, -41, 26, 7, 37, 2, 29, -70, -32, -40, -76, 9, -92, 74, -21, 80, 80, -50, 64, -58, -12, 54, 92, -1, -101, 67, -33, 38, 39, 3, -28, -35, -44, -60, 50, 42, 45, -121, 60, -126, -7, 84, -22, -42, 71, 98, 14, -46, -38, -69, 21, 25, -89, -26, -59, 17, -37, 73, -139, 5, -89, 13, 4, 25, -118, -65, -113, -24, -88, 43, -28, 56, -73, 78, 45, 10, 8, 84, -26, 38, 139, -97, 37, 21, 47, -22, 65, -3, 50, 81, -3, 68, -92, -79, -21, -74, 20, -3, 19, 61, 33, -43, 37, 61, 12, -24, -43, 23, 92, 25, 26, -15, 4, 28, 115, -13, -9, -1, -101, 27, 57, 83, -137, -6, 0, -59, 14, 73, 20, -77, 4, 44, -105, -43, 10, 30, 45, -6, 53, -17, 1, -63, 56, 134, 13, -23, -38, 15, -23, -77, -44, 12, 106, -50, -74, 0, -77, 76, -9, -37, -21, 136, -3, -10, 159, 49, -14, 7, -81, 75, 0, -69, 21, -160, -30]
3885c0kM3j13R8m7L5l1o8P4mo5M9Q9j17N8P0M6j81L2Q2k8j8J09o0L1l0j0K8r5
3914e5N9m2L3Q4o7M3l8k0R2j19J3J5K6q2J06o4K0J9j09J09loJ7m1J2n3P6j23O5
3943c3OP3o0P6j23O1p4J15J24j02o8J6n5M5O4o8OP7n4J6k9m4K8q8%J02J9l8M0
3972C2qlN4j37l9J19n1R9m1m1M7K1q1r1O2J43p5j0j11R6K5k3M6rq2l8J07j2m9
4001e0K9kRM0J5r6L8L6k7n4kK1R6j4M5p2r9n3Q7k4J05j30pK4M9M3P7Q6k39J29
4031F0j6J9j68J33m3N6J8n0O2j09M0J19p5p9J24j65PJ18n1k5J01k12K00o6k22
4056b24J51R1p1N1n1K9k6P0KNK3j0k9L9j01p1R2j4J07n6o9J3Q1P2j27M6j01J17
4084C9n7nJ28p4j46Q2Q4N1l4j62J89j64J53j25M6mj05R9k8M8m8n0Q0P7j21R8o4
$$ y = [-30, -32, 11, -102, -4, -51, -16, -47, -115, -41, -45, -110, -61, 28, -89, -31, 39, 85, -96, -64, 18, -10, -28, 81, 21, 52, 22, 12, 40, -55, 4, -38, -5, 79, 12, 55, 17, -3, 89, -30, -17, -2, 24, -58, 48, -16, 4, 23, -86, 23, 20, 14, 31, -10, 2, -51, 25, -98, -33, -27, 46, -14, 62, -61, 0, -74, 41, 165, 63, -5, 11, -44, 1, 65, -3, 3, 80, 26, 42, 13, -31, -3, -91, -91, 11, 30, -8, 32, 24, 21, 75, -62, -101, 18, -33, 66, 25, -16, 31, 52, -29, -120, -58, 85, 10, 0, -111, -15, 10, -13, 33, 24, -58, -96, 11, -1, -50, -21, -23, -14, 26, 41, -55, -17, 19, -8, -62, -64, -43, 53, 39, 84, 12, -87, -140, -53, -77, 28, -102, -109, -85, -36, 7, 84, 170, -69, 60, 44, 63, -105, 28, -15, 41, 59, 9, 71, -38, 2, 121, 46, -33, 91, -74, -67, 51, 0, -25, 76, -136, 64, -2, -224, -73, 18, -53, -2, -53, -24, -50, 20, 22, 27, 50, 40, 11, 50, -51, -122, -30, -44, 63, 7, -62, -49, 32, 104, -23, 23, -78, 39, -18, -23, 105, 31, -115, -33, 51, 102, 68, -94, 95, -69, 84, -41, 5, 1, -104, -5, -33, 15, -33, -83, -3, 74, -47, 51, -13]
4111a3jQ1k6j41J65j07O0M0j9o1j9N0nPj4N8k2L5m8p7J06P3j90R6j79J95m1J6
4139A9oK3N8j30m6J11m0O1m0r1L3O4L6J2l4k9j50J74m3RM4p0k6J12Lj94J73K9
4167F2m6O7o0Q6j94P5j4J00r0J18j54J0N8L5O7n0j17pO6j65J72n9o8O6O8j28J63
4194F1ln4J6J5o7J21o7M1kol2l4o8M4Q2k6k6lJ17j38MM6L1j98J14O0ok9j27J59
4224B5rl0L4j07N3m6O2M6j8l1j35J04L8p0J65K5o5j35P7L1j0P1K0M4k29J26P0
4251A06j41QK0m9J7J4o7N3J12J00j61M2n6Q1p6m0K7LQ0m4j8L7j0o2l7O9L5o1J17
4280I9j29O3r4J60l9r1%r6Q2m5J42K4p7k7N4m8p3J24L2j41M5J14o9n6j5k0N7P0
4308D6J0Nm8k8J1O3J1l9K1j13L5p1N3K8o6P8LLq2N2Q9q4P4j08R2K2l9J22j32O1
$$ y = [-13, -14, 67, 41, -100, 65, -42, 18, 58, 39, -22, -41, 9, 4, 11, -3, 55, 33, 68, 20, -57, 49, 122, -68, 28, -151, 44, 3, 19, 13, 36, 94, -36, -82, 29, -11, 50, 10, -81, -48, 16, 52, 64, 30, 1, -149, 25, -18, -9, 35, -35, -61, 51, 54, -140, 33, 62, 16, 83, 23, 109, -85, -10, -24, 76, -14, 104, -50, -40, 18, 53, 120, 70, -47, -54, 12, -153, 19, -40, -108, -42, 26, -102, 61, 58, 4, 20, 35, -32, 89, 22, 63, 61, 55, 23, -11, -79, -35, 47, 21, -5, -8, 109, -29, -25, 21, 52, -146, -32, 28, 22, -7, -134, 25, 16, -14, 20, -87, -34, -80, -18, 28, 10, -21, -156, -52, -14, -84, 81, 106, 41, -94, -17, 14, 4, 75, 95, 139, -90, 36, 106, -35, -27, -7, -56, -39, -25, -92, -39, 73, 173, 12, 54, -2, 79, 3, -37, -10, -7, 73, 29, 11, 48, 38, -24, -61, 8, 43, -18, 99, -30, 33, -61, 99, 60, -31, -31, -127, -45, -90, 52, 76, -1, -28, 26, -22, -95, 29, 61, -80, -35, 79, 10, -46, -61, -81, -24, 46, 56, 61, 13, -15, -4, 59, 70, 31, 52, -61, -26, -97, -44, -16, -82, -4, -1, 2, -80, -28, 61, -23, 51, -57, 35, 57, 18, 140, 8, 69]
4338F9r1j6N6K1j3j38J24k8j04J72j17J47j75J31n7N4l7N9j03j3rk3J35JL2o1
4364A6J9jj1Lq3J24j07O2k8P7j25k8J71j17Q0o1p1K2J42K7k4r6kJ03j09L7M7J1
4392G8r9n7Q0l6L8m7J07k17J00N8J4l3j07J47p0R0K5j47J38j09N6rk6k9K8O1j11
4419g7m3k8J24j3N0M5j27R9k3q3K6J66j36k1Qj5J16j15p5J7J92j20l8J48j46l3
4445a02J36j01Q0K3j19K4M1k9M2N3j38N9L3l7j13K67K9q5p4oO4Q3o5j95O6Q2j0
4472HjN8l1j8o0m5J09r3J1jRP8%j8k48J77rP4J34j55jN1k2j9J8j8L4k2P2j39R8
4503C1o1M6j8KmJ68p1r2l7N1M3n8L1q1M9l0m3j4O1l5P3R3j81Q5J5L7l7Q0r2k7
4533a6J00j61n7J82M8n5j4N9k01J52O7p1NMm7K1j20J77Nq5J6O1k7K6j00jOL1R
$$ y = [69, -22, -38, 18, 39, 26, -112, 12, -16, -120, 52, -65, 82, -93, 38, -19, 35, -2, 57, -46, -59, -68, -91, 44, 45, 77, 16, 35, 34, 23, 26, -57, 67, -40, 22, -6, 71, -54, -82, 89, -28, 52, -9, -80, -58, 84, 111, 87, -9, -11, 92, -17, 20, 67, 78, -21, -78, 2, -34, 4, -43, 64, -153, -53, 5, 19, -14, -121, 26, -44, 46, 71, -76, 62, -47, 9, 0, -26, -55, -27, 34, -77, -120, -148, -24, -37, 13, 58, -69, 30, 7, -76, -50, 116, -20, -41, -33, -48, 68, -47, -122, -105, 87, -33, -71, 77, -69, -102, 34, -67, 13, 36, -83, -59, -18, -47, -5, 48, -90, -31, 2, -35, -148, 119, 148, 63, -11, -17, 47, 130, 65, -130, -64, 18, 8, 7, 65, 34, 16, -44, -89, 20, -73, -62, -63, -54, 24, 24, 6, -242, -65, -74, 0, 134, -21, -22, 29, 7, -12, 6, -12, 22, 0, 72, -67, 31, -30, 16, -2, 0, -4, 164, 93, 1, -36, 15, 58, 0, 31, -50, -1, -31, -74, -88, -27, -62, 11, 104, -77, 8, 23, 60, 23, 103, 11, -16, 84, -77, -134, 48, 96, 41, 27, 86, -115, 37, 104, 33, 38, 42, -5, 16, -104, 73, 78, -7, 9, 70, 43, 69, -31, -32, -26, 5, 14]
4562A4o7R9p4Q7q7P9Qn1j5M6j71J87Lp5M8L9j34J75j45o4J42m2r0R6j23J64k5
4589B4K8o7J28l8L8r8n1J56j67K7M2M0j79J09l5J06r2r3O7Q9o8L0n2J2ro3P4j
4617d3P1j07L3M3P7k9m5p5J23k1k4J11p5M7j3j09k2J0Rj7N5R2r1P7o6q4RN2K2
4646A0o7lN2p0M4or8J13J48k18L6M1M0Pj0o9Q1o6q8J19m8m2J17M1j23Q4ko7K2
4675b2K3r3K12r4n9J1J30j95J95j37J56j09j62J56Q2k03J10q5J68j08O9j9j71
4698a45J85j01O7O4j4m3q1J11j24m1J83n2r0R1R8l7r1m8n9P2mK1J07j83J24j24
4724a14R0rR2j69K22m1r5QK6q3l3P9l7J12k03K00q9N5r2K9OJ25o4j6k2j39K54
4751I2q4j8j55J10J8J25O4j18o6K05j84m5m0J65r9%J17k07J65n7L4L2j21L8J7
$$ y = [14, -53, 46, -28, 59, -28, 51, 59, 8, -7, 39, -132, 55, 58, -17, 31, 70, -64, 111, -34, -98, 44, 2, -88, 8, -115, 49, 24, 52, -15, 113, 75, 113, 15, -36, 120, -47, -20, 22, 62, -117, -8, -43, 63, -29, -122, -55, 34, -34, -4, -56, -44, -53, -116, -42, -43, 28, -79, -46, -3, 74, 45, 0, -75, 48, 27, 3, 114, 39, 86, 73, -36, -58, -48, -39, -56, -1, 91, 0, 77, 11, -73, -64, -12, 10, -57, -60, -8, -78, -34, -40, -138, -25, 123, -95, -59, -18, 22, 29, 19, -50, 31, -35, -123, -4, -52, -94, 23, 64, -59, 25, 23, -44, -22, 1, -92, 120, 26, -33, -22, 108, -87, 108, -29, 127, 18, -144, 12, 94, -109, 1, -84, 84, -24, 45, 26, -145, 40, -61, 6, 70, 56, 13, -68, 43, -81, -122, 61, 9, -81, 10, 108, 71, -20, -68, -127, -55, -59, -38, 69, -114, 10, -114, -24, -33, 59, -110, 112, 71, -24, -16, 10, -73, -106, -27, -64, 48, -155, 45, -44, 11, -81, -52, -46, 79, 15, -1, -23, -162, 92, 8, -10, -165, -55, -37, 88, 152, 34, -32, 173, -11, -56, -96, 69, -30, -30, 87, -120, 45, -12, 22, 54, -67, -29, -12]
4776a2L3k7j04J13P5j60OM2M3kl7m7J89j84J04m5K1oq3K8J93q3rrm9j7J0l4L5
4805a6l0M8O9p3P8o2N1Ko6J23j24L4J18j75k2M9j8P7j28J7K52j69p6J69n4j4p
4832E3j42N7M0k7L8N7m7q3O5p0Q0p1O7MQ8rj07L7J03j18O4k9q4p5P8J6r0J12j
4861Fj02J57n0l5KJ54j21l3n5Q8k6M8lom3L4P4r6O8n2k8J12pn5N7r5j8j4J32r5
4891bM2p7J46j02J23n3j25O2M3j19J15p5k8J35L3j12M4p5R1j29o0J17k2M0M3n6
4917anj30K29j06Q0j40N0n4P1P4k3l6j27O7K1L0j35J05k7J11k8O0j76J44K0r6
4943b2l0J06o4Q4o2Pr1N7L8rk7J11p2j6m2K8MJ0p0J17j07J04o1k5J00j57jJ36
4971D6j19J02J19j76N1J7%J4j23Q2j5O8o6L6k4L0J0J6j05jO0j18K22k01M6k5K2
$$ y = [-12, 21, -6, -110, 3, 78, -82, -76, -34, 9, 7, -30, -77, 112, -72, 32, -13, 8, 2, -81, -53, 140, 57, 48, 39, -10, -27, -17, -51, -16, -46, 2, 71, -2, 76, 14, 65, 67, 1, 124, 0, 34, 152, -23, -45, 4, -14, 63, -65, -48, 204, 35, -41, 128, 74, 60, 53, -89, -32, 8, -19, 19, 76, 29, -54, 11, -59, 21, -50, 17, 21, 109, 100, -7, 30, 133, 15, 79, 50, -34, -109, -31, -15, -105, 7, 6, -96, 61, 11, -24, -22, 132, 11, -22, -77, 11, -15, 33, 30, 24, -19, 15, 89, -7, 61, 9, -19, 93, 86, 31, 88, -7, -25, -39, 93, -2, 40, -37, 109, 7, 130, 77, -48, 14, 57, -62, 53, -22, -50, 85, 118, 6, 50, -25, 66, -63, -123, -6, -28, 12, 55, -1, -6, -136, 93, -13, 67, -73, -23, -77, -6, 68, 45, 9, -118, -51, -30, 0, -135, -30, -57, 54, 26, 86, -90, 54, 74, -22, -52, 54, -10, 74, 12, 19, -72, -15, 23, 14, -13, 98, 26, 10, -32, -4, 0, 10, -60, 57, -50, 54, -7, -32, 68, -89, -90, 46, -73, 29, 148, -28, 23, 40, 40, 54, -69, 13, -2, 66, 0, 36, 12, 42, 52, 68, -37, -38, 22, -96, 126, -75, -29, -54, -32]
4998c2O2J4q3P6r5Q2o8M8K7p3qJ7J01j77N1L5O3k3l8j9J14K9j20O2Q9j37R1o1
5026B7K7j58P5j6R5k7j3L2j63J80n0L2J6q8R2r4q8J88n0p7J18Jj52L0O6n5J1J12
5054G1m6K0o4k9P0M2l3p2J01K9j39M5r8J11R1j31KM9k1J0N6r8qLM4M6j13N5L3
5083B6q1O9MNM8r2M9M6l4ol0j13J54n1j9OJ41j46o2J08N3k4j12J14j12J00K4q4
5111a9o3M6j5R4j1qN5m2j5kq4M1N3j08M2J7J58q5q1J18j66M3R5j36J61j65L9L8
5139@J02m1l9p4P0O7o4Pk8j0p1jL1j3J19r3O8l2n9lNK07j90R0j39rJ43m6nK3q0
5170f5J90j01k8N2q5O0k0P5n2M3J9j45K12j26k3n1J6k7O3M1k7Jl4kL7p0J12q7
5198b2o3O6N1qr4K4l6J4J53j20O9l4NO1r0L9Q5n1p0P3nJ6o4M6MM8o6J8n4L7K2
$$ y = [-32, 30, 44, -39, 37, -58, 24, -44, 4, 31, -42, -50, -33, 68, -109, -58, -23, 40, 17, -21, -40, 74, 103, -17, 45, 134, -3, 88, 27, 54, -104, -29, -45, 50, 23, 10, 42, -121, 59, 9, 41, 57, -31, 61, -33, -121, 67, 17, -60, 58, 59, -93, -63, 3, -52, -41, 71, 25, 45, -19, -48, 22, 64, 31, -41, 60, 89, -50, -5, -103, 8, 99, -32, -30, 19, -2, 8, 64, -34, -42, -39, 5, 51, -62, -7, 26, -55, 14, 18, 23, 71, -21, 28, 74, 40, 34, 4, -109, 45, -6, -25, -19, 122, -24, -86, 22, 75, 51, -61, 53, -59, 41, 65, -19, -82, -36, -51, 43, 32, 24, 79, 37, 22, 20, -64, -23, 30, -78, -36, -19, 139, 54, -27, 91, -75, -32, 63, -73, 88, -77, -38, 0, 102, 61, 22, -52, 18, 85, 21, 28, 0, -10, -81, -82, -51, -64, 55, -38, 30, -2, -61, -64, -59, 148, -42, 48, -91, -100, 43, -3, -8, 15, -65, 125, 24, -4, 48, -37, 23, 3, 78, 26, 69, 88, -57, 155, 29, 6, -45, -29, -56, 7, 48, 21, 22, -12, -14, 23, -47, 65, -22, -85, -19, 32, 24, -70, -46, -82, -68, 85, -35, 34, 0, 5, 66, -24, 15, 100, 49, -21, 52, 47, 63, -1, 45, 49, 97, 31, 49, -5, 32, 54]
5229E4O2r7K7o2J8mn5R0l0J18j80m7R7j2K4k0kPk3K2nnP8j1K4J5n8j3K4j64J79
5260E1k0p5M0l2K6K2j03K04r1j7Q5l3j27J78j15q5J19o9P9k8M8r6O2Pm8L6j3P3
5288G8p6r3J70j47M1K0j3J8Q7o6m0p3J10n6j8M3k1plJ04j0n9L1Q4j22Oj7L4j21
5317a16K2J11O1j73J22p2M6l2p3PQ5K1m1OM9kLJ8K4mq6j0O4K8j08J48j19l5M8
5346hr1J25M7n9Pm0J22j88R9Pp2m1J84p7Kp4K2j0J72j10O4o3L5j43J67j62P3j2
5374b4N6j3K4j9m2L5L3K4p1j8q5K05m3Rk04J25L6m0qlJ8k7M2K3n2J37n3K0j55
5403g0nJ43k7ok3k4O3k0l0K9L3q9l0p9J87kk6L0l5K5j45J27rj34k0J19J4m0J20
5432G6nj3n8M5Pl9m1j7m8K3N1l0K5r2K03r6O4p6N5m9J27k32KJ47lO3r3n2R2M6
$$ y = [54, 116, 19, 46, -16, 2, -2, -57, 33, 3, 121, -59, -106, -9, -21, 3, -17, -19, -12, -35, -13, -18, -23, 55, 44, 68, 83, 25, 12, 36, -128, 51, 31, -44, -4, -36, -10, 12, -91, 113, 22, 5, 90, 57, -70, 108, -7, -92, 27, -42, 37, 9, 57, -39, 23, 30, -18, 18, 5, 78, 2, -91, 79, -68, -27, -7, -20, -2, 85, 19, -21, -94, 16, -40, -58, -15, -36, -43, -46, 58, 48, -11, 20, 104, -18, -12, -29, 5, -116, -94, 17, 78, -95, 27, -45, 1, -31, -104, -97, -12, 9, -32, -26, 23, 21, 24, 42, 66, 62, -24, -34, 30, 58, -50, 98, -21, -56, -8, -99, 26, 73, 14, 21, -19, 103, -85, 14, 21, -51, -92, 92, 15, 17, -57, -35, -45, 127, 17, 81, 18, 53, -90, 77, -85, -12, -24, 32, 19, 43, 24, -18, 17, 50, 74, 3, -15, -100, 105, 62, 71, -133, -8, 28, -12, -20, -23, -5, -32, 10, 33, -19, 118, 65, 85, -70, -75, 68, 41, 35, 12, -12, 51, 31, 1, 30, 63, -26, -56, -135, 52, 50, 24, 54, 19, 44, -101, 26, 17, -117, -137, -18, -4, -44, 76, 71, 58, 0, 45, 52, 13, -28, -45, -93, -70, -19, -49, -24, -116, 87, -9, 55, -21, 34, -15, 112, -120, -118, 29, 26, 89, -4, -56, 36, 82]
5462H2j40N2J21j33JL3K2rr9N2J3R3j11J15n2m9o0M5o8K04j20J3rJ33k05N6R1
5489G1j37K08j26j72K24Rj01N3J3j26J56o7Q9j44L7P9j9%kl9n2Q2j21Q9K6m8M9
5516C1N6j26k4PJ14p9N4RLP2k34J53O7L0j30J6m3O9o3n4J26o3n2J32j32J8L7l6
5544d2m4J89p6l4l6J47j87M2l1J25j1o6J15j33j8Q6k5n9R7o6P7q5Q1O8j5k6j16
5571d3O7o5L9j04L6O6p0J54j72J16j5p1J14k4J6om6MN0o6M6j19J68n6j21J72j20
5598e0nJ41j08r6K09j00R4j16R0j5N0j17l0J02p5J86q5r8J46j59Q3q9o0L5j6P6
5624gj26J81k0k7Rj2q1Jrj4J85j5m8j03Q3Pl2M8p6PJ03L0r0P1m0Qj22P4p7J05
5654A3km3Q5r9M0p1J47l2j26k3M2J04p2l1J75j13j8K8q3J1pK2Q5O3q8M0o0k8K3
$$ y = [82, -58, -6, 115, -18, -17, 16, 38, 29, -70, -18, -5, 88, -23, 92, 40, -9, -69, -24, -92, 112, -8, 5, -4, 129, -76, -20, 71, -66, 142, 16, -156, 68, 77, -24, 29, 42, -84, 72, 5, 94, -50, -13, 66, 47, 47, 45, 6, -46, 36, -85, 4, 30, -18, 31, 87, -39, -63, -56, 58, -21, 33, 42, 45, 117, -117, 36, 103, 133, 3, 19, -24, 45, -18, -72, 54, -9, -61, 71, -61, -43, -6, -42, -86, 103, 27, -7, -43, 104, -83, -41, -72, 53, 42, -24, 91, -42, -60, 26, 1, -58, 39, -27, 50, -35, 46, 114, 99, 73, -43, 24, -41, -2, -106, -70, -4, -74, 80, -92, 24, 9, -62, 52, 28, 44, 38, -8, -4, 46, -20, 26, -93, 75, 19, -102, 70, -50, -55, 86, -22, -118, 91, -9, 85, -31, 59, 44, 94, -23, -53, 49, -26, 160, 75, -23, 123, -36, 47, -42, -102, -67, -83, -7, -133, 48, 28, 1, 10, -2, -83, -82, -91, -105, 80, 65, 17, -86, -3, 4, -28, 20, -56, -49, 54, 84, -6, 65, 25, 33, -89, -15, -92, 13, 11, -32, 53, -46, -6, -77, 70, 38, -88, -111, -69, 35, -37, -68, 107, -6, -24, 4, -79, -68, -75, -53, 32, 95, 7, 47, -13, -41, -18]
5683a8m7J35m5j5No2M2k0MJ84k78J40m5o2K13k08J69nj25j0K3M4o9N7p3R3Or5
5711f2L9q8J11P4n1k3n9N2p4J5r3K36j36K3JM3k0P4k6q2Q9p4R4M4j31M7j7j8P0
5740E8J1j3r5J18p1l3K8k1J43j59O4l8l6M0KM3n6O3j8j4J0j2J3J48j40o2L4j38
5768a31J83n7j2N6p9R0r2K5J2ML8r1%N9O5j56M3QkL1l8R2m4j2L0J7m5M9j25%J18
5799C6j42J01mM9n2J19l4q8J1J5P8j61N2J4k7M5j35K42p3l9K1o2j2J55j21LP7
5826F8r7PlJ8p5J29l3Rp9J30m1oj08R2N1K7j07j7M7K3rm9J0L7q4J83j98J45r5
5855b5p0J26p6nJ00J7o1j4J5n4O7n7Q4K8o6k2J4m7oP5J9j27N4n0L6R5Pn4p4J19
5885D8j20l9J45l2QJ5o3M2M3l9p2K5k3L9L6L7n1J7K8QQ6j09l2o8N9Om5J13j65
$$ y = [-18, -65, 70, 25, 10, 15, -47, -5, -25, -21, 163, -115, 25, -20, -82, 131, -77, 92, 87, -38, -48, -25, 19, -50, 7, -66, 27, 33, -62, -23, -111, 0, 74, 23, 0, -59, -7, -81, -66, -159, 77, -59, -36, -35, 8, -12, 62, 36, -46, 43, -31, 63, 107, -24, 23, 6, -12, 58, 69, 56, -39, 79, 8, -25, 3, -18, 125, -34, 30, -8, -44, -4, -2, 41, -15, 48, 30, 16, 26, 14, 27, 175, 35, -27, 7, -131, 52, -5, -17, 39, -40, 50, -42, -17, -5, -1, 37, -54, -54, 5, 70, -86, -43, -35, -37, -6, -44, 48, 4, -8, 22, 39, -6, 43, -82, -82, 36, -106, -5, -9, 40, -12, 107, 73, -15, -4, 11, 89, -72, -20, -6, -33, 12, -123, 119, 46, 7, 28, -34, -46, 109, -12, -9, 68, -29, -22, -25, -7, -82, 47, 14, 23, -56, 74, 33, 27, -81, 11, 62, 89, -18, -35, 12, 35, 26, -23, -13, 24, -60, 123, -75, 70, -25, -95, 31, -45, -50, 50, 67, 6, -8, 7, -47, 20, -37, 47, 75, 9, -13, 1, -46, -52, 23, 42, -85, -31, -81, -45, 50, 57, 3, -71, 48, -72, -111, 34, 2, 10, 25, -38, 4, 47, 8, -64, -39, -62, -23, 13, 50, -1, 16, 44, 52, 138, 29, -3, -71, -12, -6, -51, 62, -103]
5914a03J56k8N9p9n0n9R5M4Qk7N0j44J57p9L8l4m1J20kj9j51J12q3M2N6m0o5O7
5942@q4N2Q1Q2q8J18j49o7j13K23R7j95O1j1N5j12J3M7l2M4O9p8j01n4J61J5j22
5969h8O7Q7o4q9M0Q1m4R4o3r7M6m4R1o0MR3o9K3rk3M7M6q0L5pk9j9%J40q8j2k0
6001a1K1P8j31M3J6o6J85j6j16n7L5J6M6ql2J3j2Q5j32j6N5J8j2P9l8Np0jj0k4
6031e7j0L1N9JR6J9j19o2J9P5k8o1J83k19J32n8P7n1jl8N6j35j0J09q0J51k05
6058a26J14L4m6J5Q4j64J92m4mo6p3O9OmJ02j01M5r4J06j29N8M7K3n1M8n8R7M4
6086A24j91O4R1k06Q3J4MOO5j04N8m7Pk5K4j8O7r5Q5Q5r6J42j38m2L7N0m2M4j20
6115g4M4R0M0n5L0Pj06L5n5J32j27P6j23P9N6j7j43J29j8n6J39k15K7K7Q9j41
$$ y = [-103, 53, 25, 84, 5, -45, -104, -9, 35, 43, 16, 66, -78, 79, 0, 38, 4, -37, 83, 81, 62, -89, 23, -60, -18, 38, -2, -67, 0, -84, -32, 49, 131, 43, 161, 12, -55, -168, 55, 152, -43, 18, 7, 62, -50, -37, 10, -22, 22, 91, 13, -88, -142, 19, 34, -88, -21, 66, 2, -87, -47, 34, -10, 84, 21, -76, -30, -74, 17, -43, -39, 54, -15, 8, -1, -24, 23, 69, -11, 24, 17, -12, -31, -31, 109, 21, 9, -11, 10, 88, -43, 0, 16, -50, 135, 119, 3, -54, -19, -3, 43, 35, 3, 16, 4, 89, -43, -59, -4, 14, 2, 81, 43, 48, -22, -23, -33, -57, -67, -36, 23, 24, 120, 139, 20, -42, -23, 52, 24, -37, 146, -73, 59, 1, 78, 27, 26, -12, 44, -91, -101, 8, -72, 79, -126, -12, 22, -24, -9, 75, -89, 103, 59, 55, -11, -84, -15, -9, -13, 89, -12, 33, -61, 45, -84, -26, 21, 44, -7, 41, -17, 80, 124, -67, -3, 88, -118, -35, -21, -17, -11, 54, -50, 8, -39, -32, -57, -33, -51, 16, -79, 6, 91, -5, 137, -1, -43, -6, 44, 2, 46, -74, -30, 60, 100, 45, 75, 82, -24, 11, -44, 88, -39, 37, -86, -7, 49, 32, -111, 18, 0, -56, 83, -132, -105, -78, 11, -130]
6141a30R2l4l5k2J82K8m8r2O8J1M3o2n2L9j7J22pn3J9L6o3K3kO4o9O4j4j23L5
6170Cj0M5j8m4J15j06J1j01J41n5k0P7j43O4J73k53R4M8q4J28q6P5o3n6K4P0o7
6197c8R3j28KJ12q4p4J66r4O0j05P7o4r3K17n5l6J00j4l1Nm4N7o4NN2q0J03n5
6225a0J80o7j44P6j4q2J13q0O8R4j00q8J41k1L2Pq8k1J18r8j39K00m2k1p2oLQ9
6253B8mm3L1Q9o3j7K0n4Q8j81J05M9p5N0k2p2k2J17jn6J6J11j14K3M5j6k3Qm5
6282b8O8qj53Q0m6R2K0lN1p6M3l4p9N7L4J01k16O5O1j2m3o2P8l0J30r5qK3o0N2
6312BJ61j06q8P4n7l0Ok4J12j7j12J90j94O1j8Qo0J20Pj2j57K65j66J1K8j3k0
6339b9K5k3q8J37j04J48j05L1k9L6k7L2n0O9n1O2L1j26J51o5p1kJ11O3j96J50
$$ y = [-130, -38, -72, -107, -129, 53, 81, 33, -59, 9, 20, 63, 1, -51, -12, -29, 93, 86, 33, 52, 88, 25, 48, 46, 110, 41, 105, 91, -32, 3, -7, 38, 20, -24, 91, -15, -4, -105, 36, -19, -39, 38, -105, -41, 132, -121, -27, 21, -63, 65, -21, 54, -9, -65, -41, 29, -38, 55, -73, -71, 41, -43, -117, 49, -45, 15, -90, -13, -77, -170, 47, -8, -44, 56, 42, 11, 16, -28, 29, -35, -30, 22, -58, 45, -10, 170, 103, -41, 35, 21, -61, 52, -28, 40, 134, 34, -54, 87, 66, 98, 105, 17, -4, 114, 16, -123, 77, 35, 14, -58, -64, -61, 28, 24, -19, 12, 101, 38, 21, 41, -13, 75, -106, -1, 48, -27, 23, 1, -71, -93, 24, 23, -33, -17, 94, -20, 3, 48, 32, 9, 17, -28, 40, 32, -121, -41, -87, 5, 25, 22, 73, -3, 40, 6, -73, -16, 18, 119, -97, -32, 29, 17, -26, -88, -10, -40, 90, -5, -13, 10, -50, 2, 163, 57, -31, 43, -14, -44, -38, -62, 50, 33, -79, 111, -83, -22, -40, -32, -92, 28, 35, 23, -134, 131, -35, -24, 4, -9, -29, -4, -27, -115, 22, -82, 66, -39, -8, -37, -1, -28, 4, -46, 23, -28, 34, 65, -61, 90, 25, -46, -48, 63, 126, -70, 80]
6365H0j12M0rN2k4rN1M2p4m7L3L3qo0J28j53q6N9J2L6O7j09OO9l9Q2j66R3k6M0
6395An0K7j2j2RJ9O3l7K2k1j0qN6n2n4Q9L0n0l5Q5r0J2J31j33J0kL7k0O9r2Rk
6427a1m0J19j37M7Q6j98J23m2q1L4O0j7n5J53j1k7l5R4r2k5J03n7O6j64K31k30
6453a06L5J52j12L7p2J02j8n4N4l7M0j2No0jqM6k9K1m5J59q7q1J89j07K4r8L8
6481b5m2%J00q0K3OP9q3J05l8N3j14J35j45R0Q4k06J14o5Rl5O5k8K0m9J12j06
6508b1p7O9J2p8P4J10j63J09n3o2qJ14p3r6R7J9k7K7j08J67o2M8M6j51m3J89l0
6535B9j9P8r8O7k5j3N4j50J27M3j63Q3o0J06o9j38J42m8mom0J21j21J25m1Q0q2
6562b2Q5j42J43j57J87P4j98J05j18M0nJ3K0o0M1r2J68n8Qn3l8R1j20J44k1l4
$$ y = [80, -32, 8, -1, 51, 27, 18, 69, 111, 37, -10, 23, 56, 48, -12, 116, -37, -123, -64, -52, -16, 51, -58, -52, 17, -22, 60, -106, -13, -39, 1, -49, -22, -34, -46, -37, -18, 45, 8, 30, 9, -1, -9, 47, -5, -59, 30, 60, 10, -25, 60, -30, -18, 113, -20, -10, -12, 25, 5, 74, -18, -9, -11, -51, 68, -69, -22, 64, -134, -11, -53, -134, -100, -40, -57, -112, 41, 30, 3, -32, 62, -30, -55, 48, -9, 57, -107, 124, -106, -71, 81, -31, 6, -66, 36, 18, -36, 18, -19, 21, 9, 14, -46, -47, -55, -9, -38, -17, -62, 97, 10, -71, 118, 11, 35, -63, -25, -67, -67, 33, -47, -24, -18, 61, -22, 83, 45, 98, -16, 119, -26, 64, 148, -58, 56, -9, 0, -35, 30, 2, 22, -27, 85, -21, -98, -29, -17, -95, -21, 89, -74, 35, -18, -80, -88, 26, -47, -143, -46, -27, -54, -27, -135, 32, -30, 18, 64, -87, -130, 59, 29, 10, 88, -10, 57, 32, 19, 73, -77, 50, 93, -70, 13, -47, 59, -10, -148, -6, -54, -58, -64, -104, 17, -104, 21, -20, 60, -22, 63, -79, 64, -93, 94, 168, -30, 75, -43, -3, -8, 5, 25, -35, 6, -86, 82, 24, 32, -21, -59, 32, -88, 56, 35, 1]
6588AK9Q7m5j10N3J6n8j7l6P5l0n4K8J36j40J47k19J74l6m3m8J25l4l9R1r8J0
6615c5q7K34N1n3q5N3L2l3o0J44r8m3p5Q1P8k2o5L7Q7j48r1J71j09M2j08J13l1
6642b0K7J37j22j6q0Q3J6n5Q5n6PoNl7N7l6l7J32n4J61Pk21k3R2j42Q1J28q2P
6671C8r1L9lj7J29j94M9K0J4O9q8j17J49M7J4q9J44j23J44n8k31J29M7l0n6J98
6697A33j50J28m9j01Q2J8M3j18L4j04M9J09o6m8M8r9J08p0oJmk8J08K8j95J76
6723B7K9q2m5J08l3j3O4j5j8j04R2L7p1j2Q7k5K8P3j02J3j51Q9K0J8j34Q0M3N1
6751E4n6L9mm0K7j46J46n5K6J12j4L8j17J5l7m3L4m0L0K4j2J05j47m8J14o5j3
6778g3LJ26j39K7K8J9J3pm1M1j0m8M9l5Q7q8R2q3O6rKp2J05o9q0J26l8L1j19J84
$$ y = [1, 30, 117, 72, -38, 15, 31, -27, -44, -80, -5, -35, -89, -61, 75, -65, 82, -137, 37, 1, -42, -90, 35, 1, -38, 53, -45, -35, -122, 112, 163, 110, 25, 78, 110, 77, 17, 161, 63, 20, -55, 26, 104, 82, 17, 54, 141, -7, -98, 73, -36, 6, -102, 11, -20, 7, 144, 22, 6, -74, 9, 25, -30, 55, -1, 6, 0, 5, -32, 25, -11, -48, 84, 30, 191, 198, -23, -46, 46, -96, -15, 113, 31, 38, -53, -14, -17, -34, 95, -99, -50, -30, -16, 53, -35, -152, -3, 44, 58, -31, 113, -10, 134, 76, -155, -26, 21, -9, -65, 133, -17, 111, 62, -39, 43, 61, 104, -14, 20, -84, -35, 74, 8, -40, 8, -91, 17, -53, -59, -58, -62, -90, 18, 46, -149, 27, 56, -26, -71, 37, 4, -9, 55, 40, 22, -82, 10, 47, -24, -36, 51, 26, 54, 127, 25, 38, -113, -24, -4, 14, -120, -40, 3, 54, -2, 37, 33, -7, 20, -126, 20, -35, -9, 103, 89, 127, 10, 25, -12, -55, -21, -61, -31, -7, -19, 86, -61, -109, 5, -60, -73, -70, 56, -83, -56, -28, -9, 4, -3, -44, -3, -13, -61, -12, -47, 40, -48, 44, -39, 27, 18, 20, -52, 53, -16, -96, 30, -8, 23, -96, 88]
6808H8N6k10J56j30N2m3N2q2m3R7Pj52J70Q3j8o9Jj38J56k5J3o9R8n4j1P8j13
$$ y = [88, 144, -66, 90, -40, 12, -31, 21, -61, -104, -7, 0, -152, 18, 101, 83, 14, 15, -123, 33, 8, 21, -48, 50, -4, -15, 63, -50]
$$ [...]
8191f2
##END NTUPLES=NMR FID
##END=
