##TITLE=1H_DE-80H_X3
 200.13MHz, d2o
 8 sc
 
 19ns.26.2.2025
##JCAMPDX= 6.0         $$ Bruker NMR JCAMP-DX V2.0
##DATA TYPE= NMR FID
##DATA CLASS= NTUPLES
##ORIGIN= UXNMR, Bruker Analytische Messtechnik GmbH
##OWNER= pz
$$ XWIN-NMR		Version 3.5
$$ Mon May 26 10:51:52 2025 Russian Standard Time (UT+4h)  Yarkov@DPX200
##.OBSERVE FREQUENCY= 200.1313
##.OBSERVE NUCLEUS= ^1H
##.DELAY= (6, 6)
##.ACQUISITION MODE= SIMULTANEOUS
##.ACQUISITION SCHEME= undefined
##.AVERAGES= 8
##.DIGITISER RES= 18
##SPECTROMETER/DATA SYSTEM= spect
##.PULSE SEQUENCE= zg30
##.SOLVENT NAME= CDCl3
##.SHIFT REFERENCE= (INTERNAL, CDCl3, 0, 14.3821)
##AUDIT TRAIL= $$ (NUMBER, WHEN, WHO, WHERE, WHAT)
$$ ##TITLE= Audit trail, XWIN-NMR		Version 3.5
$$ ##JCAMPDX= 5.01
$$ ##ORIGIN= Bruker BioSpin GmbH
$$ ##OWNER= Yarkov
$$ C:/Bruker/XWIN-NMR/data/yarkov2/nmr/H-C/1/audita.txt
$$ ##AUDIT TRAIL=  $$ (NUMBER, WHEN, WHO, WHERE, WHAT)
(   1,<2025-05-26 10:51:06.96 +0400>,<Yarkov>,<DPX200>,
      <created by zg, POWCHK disabled, PULCHK disabled
       configuration hash MD5:
       00 E9 B6 7A A2 85 ED C7 34 08 36 98 17 FE 4E 26
       data hash MD5: 16K
       F4 4E F8 58 D2 46 D3 A7 55 9C 56 05 3C 87 D3 88>)
$$ ##END=
$$ 
$$ hash MD5
$$ B5 D3 86 C2 C8 0D 6C D7 B9 9F 93 F1 DF E0 9C 1C
##$RELAX= 
##$RELAX= 
##$RELAX= 
##$RELAX= 
##$RELAX= 
##$RELAX= 
$$ Bruker specific parameters
$$ --------------------------
##$DU= <C:/Bruker/XWIN-NMR>
##$EXPNO= 1
##$NAME= <H-C>
##$PROCNO= 1
##$TYPE= <nmr>
##$USER= <yarkov2>
##$AMP= (0..31)
100 100 100 100 100 100 100 100 100 100 100 100 100 100 100 100 100 100 
100 100 100 100 100 100 100 100 100 100 100 100 100 100 
##$AQSEQ= 0
##$AQ_mod= 1
##$AUNM= <au_zg>
##$AUTOPOS= <>
##$BF1= 200.13
##$BF2= 200.13
##$BF3= 200.13
##$BF4= 200.13
##$BF5= 200.13
##$BF6= 200.13
##$BF7= 200.13
##$BF8= 200.13
##$BYTORDA= 1
##$CFDGTYP= 0
##$CFRGTYP= 5
##$CHEMSTR= <none>
##$CNST= (0..31)
1 1 145 1 1 1 1 1 1 1 1 1 1 1 1 1 1 1 1 1 1 1 1 1 1 1 1 1 1 1 1 1 
##$CPDPRG= <>
##$CPDPRG1= <>
##$CPDPRG2= <>
##$CPDPRG3= <>
##$CPDPRG4= <mlev>
##$CPDPRG5= <mlev>
##$CPDPRG6= <mlev>
##$CPDPRG7= <mlev>
##$CPDPRG8= <mlev>
##$CPDPRGB= <>
##$CPDPRGT= <>
##$D= (0..31)
0 0.7 0 0 0 0 0 0 0 0 0 0.03 0 0 0 0 0 0 0 0 0 0 0 0 0 0 0 0 0 0 0 0 
##$DATE= 1748242266
##$DBL= (0..7)
120 120 120 120 120 120 120 120 
##$DBP= (0..7)
150 150 150 150 150 150 150 150 
##$DBP07= 0
##$DBPNAM0= <>
##$DBPNAM1= <>
##$DBPNAM2= <>
##$DBPNAM3= <>
##$DBPNAM4= <>
##$DBPNAM5= <>
##$DBPNAM6= <>
##$DBPNAM7= <>
##$DBPOAL= (0..7)
0.5 0.5 0.5 0.5 0.5 0.5 0.5 0.5 
##$DBPOFFS= (0..7)
0 0 0 0 0 0 0 0 
##$DE= 6
##$DECBNUC= <off>
##$DECIM= 32
##$DECNUC= <off>
##$DECSTAT= 4
##$DIGMOD= 1
##$DIGTYP= 9
##$DL= (0..7)
0 120 120 120 120 120 120 120 
##$DP= (0..7)
150 150 150 150 150 150 150 150 
##$DP07= 0
##$DPNAME0= <>
##$DPNAME1= <>
##$DPNAME2= <>
##$DPNAME3= <>
##$DPNAME4= <>
##$DPNAME5= <>
##$DPNAME6= <>
##$DPNAME7= <>
##$DPOAL= (0..7)
0.5 0.5 0.5 0.5 0.5 0.5 0.5 0.5 
##$DPOFFS= (0..7)
0 0 0 0 0 0 0 0 
##$DQDMODE= 0
##$DR= 18
##$DS= 0
$$ [...]
##$SUBNAM2= <"">
##$SUBNAM3= <"">
##$SUBNAM4= <"">
##$SUBNAM5= <"">
##$SUBNAM6= <"">
##$SUBNAM7= <"">
##$SUBNAM8= <"">
##$SUBNAM9= <"">
##$SW= 18.0517328524113
##$SWIBOX= (0..15)
0 0 2 0 0 0 0 0 0 0 0 0 0 0 0 0 
##$SW_h= 3612.71676300578
##$TD= 16384
##$TD0= 1
##$TE= 0
##$TE2= 300
##$TE3= 300
##$TEG= 300
##$TL= (0..7)
0 120 120 120 120 120 120 120 
##$TP= (0..7)
150 150 150 150 150 150 150 150 
##$TP07= 0
##$TPNAME0= <>
##$TPNAME1= <>
##$TPNAME2= <>
##$TPNAME3= <>
##$TPNAME4= <>
##$TPNAME5= <>
##$TPNAME6= <>
##$TPNAME7= <>
##$TPOAL= (0..7)
0.5 0.5 0.5 0.5 0.5 0.5 0.5 0.5 
##$TPOFFS= (0..7)
0 0 0 0 0 0 0 0 
##$TUNHIN= 0
##$TUNHOUT= 0
##$TUNXOUT= 0
##$USERA1= <user>
##$USERA2= <user>
##$USERA3= <user>
##$USERA4= <user>
##$USERA5= <user>
##$V9= 5
##$VALIST= <valist>
##$VCLIST= <CCCCCCCCCCCCCCC>
##$VD= 0
##$VDLIST= <DDDDDDDDDDDDDDD>
##$VPLIST= <PPPPPPPPPPPPPPP>
##$VTLIST= <TTTTTTTTTTTTTTT>
##$WBST= 1024
##$WBSW= 4
##$XGAIN= (0..3)
0 0 0 0 
##$XL= 0
##$YL= 0
##$YMAX_a= 204075
##$YMIN_a= -198035
##$ZGOPTNS= <>
##$ZL1= 120
##$ZL2= 120
##$ZL3= 120
##$ZL4= 120
##$ABSF1= 10
##$ABSF2= 0
##$ABSG= 5
##$ABSL= 3
##$ALPHA= 0
##$AQORDER= 0
##$ASSFAC= 0
##$ASSFACI= 0
##$ASSFACX= 0
##$ASSWID= 0
##$AUNMP= <proc_1d>
##$AZFE= 0.1
##$AZFW= 0.1
##$BCFW= 1
##$BC_mod= 2
##$BYTORDP= 1
##$COROFFS= 0
##$CY= 83.5205535888672
##$DATMOD= 1
##$DC= 2
##$DFILT= <>
##$DTYPP= 0
##$F1P= 10.8118882576601
##$F2P= -7.23987719738617
##$FCOR= 0.5
##$FTSIZE= 0
##$FT_mod= 4
##$GAMMA= 1
##$GB= 0.15
##$INTBC= 1
##$INTSCL= 1
##$ISEN= 128
##$LB= 0.25
##$LEV0= 0
##$LPBIN= 0
##$MAXI= 10000
##$MC2= 0
##$MEAN= 0
##$ME_mod= 0
##$MI= 1.114404
##$NCOEF= 0
##$NC_proc= 0
##$NLEV= 6
##$NOISF1= 3.799351
##$NOISF2= 2.8
##$NSP= 1
##$NTH_PI= 0
##$NZP= 0
##$OFFSET= 14.38212
##$PC= 1
##$PHC0= -1721.387
##$PHC1= 23.96656
##$PH_mod= 1
##$PKNL= yes
##$PPARMOD= 0
##$PSCAL= 0
##$PSIGN= 0
##$REVERSE= no
##$SF= 200.129724274929
##$SI= 16384
##$SIGF1= 3
##$SIGF2= 2
##$SINO= 400
##$SIOLD= 16384
##$SREGLST= <1H.CDCl3>
##$SSB= 0
##$STSI= 0
##$STSR= 0
##$SW_p= 3205.1282051282
##$SYMM= 0
##$S_DEV= 0
##$TDeff= 0
##$TDoff= 0
##$TI= <>
##$TILT= no
##$TM1= 0
##$TM2= 0
##$TOPLEV= 0
##$USERP1= <user>
##$USERP2= <user>
##$USERP3= <user>
##$USERP4= <user>
##$USERP5= <user>
##$WDW= 1
##$XDIM= 8192
##$YMAX_p= 0
##$YMIN_p= 0
$$ End of Bruker specific parameters
$$ ---------------------------------
##NTUPLES= NMR FID
##VAR_NAME=  TIME,          FID/REAL,        FID/IMAG
##SYMBOL=    X,             R,               I
##VAR_TYPE=  INDEPENDENT,   DEPENDENT,       DEPENDENT
##VAR_FORM=  AFFN,          ASDF,            ASDF
##VAR_DIM=   8192,          8192,            8192
##UNITS=     SECONDS,       ARBITRARY UNITS, ARBITRARY UNITS
##FACTOR=    0.0002768,     1,               1
##FIRST=     0,             0,               0
##LAST=      2.2672688,     0,               0
##MIN=       0,             -198035,         0
##MAX=       2.2672688,     204075,          0
$$ Real data points
##PAGE= N=1
##DATA TABLE= (X++(R..R)), XYDATA
$$ [...]
$$ plain form
1795 826 -1126 294 514 -1141 434 45 -311 838 -501 36 920 -984 822 1066 -1297 745 569
1812 569 -1126 882 324 -724 660 -331 -186 522 -836 506 153 -1239 904 154 -1097 1125 -205
1829 -205 -752 1155 -372 -104 776 -865 233 374 -1066 636 -150 -1236 740 -415 -741 790 -536
1846 -536 -288 440 -605 930 234 -940 1317 4 -1046 1478 -124 -824 1153 -357 -526 671
1862 671 -254 206 -157 -631 950 -581 -737 1393 -951 -656 1572 -708 -470 1105 -618 -29 294
1879 294 -322 734 -347 -483 856 -968 -298 1196 -1171 -298 869 -713 275 381 -487 669 -425
1896 -425 -272 1238 -866 -205 1403 -1217 -213 1186 -749 -54 365 -437 277 -319 119 672 -1370
1913 -1370 359 1184 -1681 331 1495 -1338 80 885 -639 267 221 -147 199 -788 690 476 -1443
$$ packed form
1795H26j952J420K20j655J575l89l56J149j339N37Q84j904J806K44k363K042j76
1812E69j695K008n58j048J384r91J45P08j358J342l53j392K143p50j251K222j330
1829b05n47J907j527K68Q80j641J098J41j440J702p86j086J976j155l26J531j326
1846e36K48P28j045J535o96j174K257j313j050K524j602p00J977j510j69J197
1862F71r25M60l63m74J581j531j56K130k344K95K228k280K38J575j723N89L23
1879B94o16J056j081j36J339j824O70J494k367Q73J167j582R88J06q68J156j094
1896d25J53J510k104O61J608k620J004J399j935O95M19q02P14n96M38N53k042
1913a370J729Q25k865K012J164k833J418Q05j524R06m6l68L46r87J478k14j919
$$ plain form
1930 -1443 719 624 -1632 672 557 -1137 592 97 -496 457 -375 555 534 -1323 754 561 -1191 890
1948 890 265 -1119 634 41 -434 242 -575 396 69 -1239 1106 255 -1512 1265 423 -1167 1155
1965 1155 448 -829 313 119 279 -145 -663 921 -524 -1242 1428 -432 -1429 1474 -340 -1201 1012
1982 1012 -112 -246 143 -424 633 -203 -450 1321 -675 -720 1379 -631 -659 1216 -525 -324 284 -691
2000 -691 564 -258 -662 941 -708 -528 1563 -566 -576 1208 -376 -183 578 -147 312 -352 -145 951
2018 951 -1031 -243 1488 -1423 -439 1529 -974 -395 908 -556 -62 143 -14 519 -650 212 892
2035 892 -1274 392 1144 -1286 202 700 -1062 255 341 -555 299 -501 86 788 -845 241 916 -1159
2053 -1159 516 771 -815 272 183 -433 435 -319 176 477 -1170 263 739 -1394 751 630 -1181
$$ packed form
1930a443K162r5k256K304j15j694J729m95n93R53q32R30k1j857K077j93j752K081
1948H90o25j384J753n93m75O76q17R71l27j308K345q51j767K777q42j590K322
1965A155p07j277J142j94J60m24n18J584j445p18K670j860r97K903j814q61K213
1982A012j124j34L89n67J057q36k47J771j996m5K099k010k8J875j741K01O08r75
2000f91J255q22m04J603j649J80K091k129j0J784j584J93P61p25M59o64K07J096
2018I51j982P88J731k911R84J968k503N79J303j464M94K05j57N33j169Q62O80
2035H92k166J666P52k430J488M98j762J317Q6q96Q54q00N87P02j633J086O75k075
2053a159J675K55j586J087q9o16Q68p54M95L01j647J433M76k133K145j21j811
$$ plain form
2070 -1181 471 511 -606 452 -12 -40 313 -593 850 466 -1168 881 178 -1404 946 153 -1036
2087 -1036 641 -383 -417 451 -591 233 173 -790 800 82 -719 935 -266 -559 847 -246 -31 601
2105 601 -809 361 352 -1012 835 98 -1108 814 -150 -817 806 -266 -308 473 -552 503 157 -610
2123 -610 944 -295 -642 1265 -498 -647 1125 -636 -421 785 -582 75 176 -613 571 -181 -429
2140 -429 826 -531 -254 937 -706 199 835 -940 341 365 -852 646 -16 -704 611 -489 -328
2157 -328 748 -573 -39 436 -706 524 189 -449 890 -342 -259 1071 -634 -201 973 -853 -4
2174 -4 797 -783 106 245 -725 417 -134 -157 707 -590 12 795 -789 452 602 -996 537 310 -835
2193 -835 782 -5 -669 608 -505 -340 582 -788 -5 170 -789 524 43 -482 828 -476 -270 909
$$ packed form
2070a181J652M0j117J058m64k8L53r06J443l84j634K049p03j582K350p93j189
2087a036J677j024l4Q68j042Q24o0r63J590p18q01J654j201k93J406j093K15O32
2105F01j410J170rj364J847p37j206J922r64o67J623j072m2P81j025J055l46p67
2123f10J554j239l47J907j763j49J772j761K15J206j367O57J01p89J184p52k48
2140d29J255j357K77J191j643R05O36j775J281K4j217J498o62o88J315j100J61
2157c28J076j321N34M75j142J230l35o38J339j232Q3J330j705M33J174j826Q49
2174dQ01j580Q89J39r70J142n51k3Q64j297O02P83j584J241J50j598J533k27j145
2193h35J617p87o64J277j113J65R22j370P83J75r59J313m81n25J310j304K06J179
$$ plain form
2211 909 -621 159 689 -919 331 523 -811 527 207 -643 554 -205 -257 626 -657 231 378 -847
2229 -847 831 265 -852 854 81 -641 907 -198 -432 780 -648 -189 263 -669 206 10 -712 590
2247 590 -300 -585 811 -654 -129 974 -594 230 596 -805 432 238 -658 641 -136 -633 656
2264 656 -410 -116 607 -521 129 250 -672 572 74 -529 888 -341 -447 1093 -535 -206 973
2281 973 -713 37 468 -562 266 -19 -610 464 -457 -223 779 -894 -50 744 -903 278 667 -849
2299 -849 552 292 -505 539 -189 -377 610 -566 130 643 -752 289 315 -672 564 58 -483 657
2317 657 -378 -18 791 -743 198 809 -996 349 673 -733 449 196 -656 384 -332 -61 325 -802
2335 -802 324 225 -975 682 306 -1038 781 261 -746 789 70 -130 408 -346 354 190 -677 646
$$ packed form
2211I09j530P80N30j608J250J92j334J338l20q50J197p59n2Q83j283Q88J47j225
2229h47J678n66j117J706p73p22J548j105k34J212j428M59M52r32Q75j96p22J302
2247E90q90k85J396j465N25J103j568Q24L66j401J237j94q96J299p77m97J289
2264F56j066K94P23j128O50J21r22J244m98o03J417j229j06J540j628L29J179
2281I73j686P50M31j030Q28k85n91J074r21K34J002j673Q44P94j647J181L89j516
2299h49J401k60p97J044p28j88R87j176O96N13j395J041K6r87J236n06n41J140
2317F57j035L60Q09j534R41O11j805J345L24j406J182k53q52J040p16K71L86j127
2335h02J126r9j200J657l76j344J819n20j007J535p19k00N38p54P00j64q67J323
$$ plain form
2353 646 -135 -808 822 -75 -769 769 -373 -427 497 -468 306 282 -668 654 113 -667 971 -154 -734
2372 -734 805 -207 -439 372 -485 178 -105 -621 752 -205 -753 990 -465 -673 992 -323 -422 700
2390 700 -321 -21 230 -181 477 -453 -330 856 -686 -269 984 -878 -254 912 -591 64 386 -347
2408 -347 256 -17 -35 763 -599 4 864 -782 -8 721 -827 0 414 -485 280 -185 -305 638 -817
2427 -817 -74 840 -963 61 824 -726 199 632 -435 221 -60 -47 406 -589 240 549 -1034 258
2445 258 514 -1201 349 421 -931 148 204 -164 394 -279 162 337 -678 616 355 -895 630 133
2463 133 -935 579 73 -589 379 -224 -57 337 -764 378 305 -825 760 342 -649 541 98 -388
2481 -388 574 -128 88 352 -529 517 -37 -681 784 -74 -1041 703 38 -668 475 -202 -138 235 -353
$$ packed form
2353F46p81o73J630q97o94J538j142n4R24r65P74k4r50J322n41p80J638j125n80
2372g34J539j012k32Q11q57O63k83n16J373r57n48J743j455k08J665j315r9J122
2390G00j021L00K51m11O58r30J23J186j542M17J253j862O24J166j503O55L22p33
2408c47O03k73j8P98j362O03Q60j646P74P29j548Q27M14q99P65m65j20R43j455
2427h17P43R14j803J024P63j550R25M33j067O56k81J3M53r95Q29L09j583J292
2445B58K56j715J550P2j352J079N6l68N58o73M41J75j015J294k61j250J525m97
2463A33j068J514n06o62R68o03J67L94j101J142p3j130J585m18r91J190m43m86
2481c88R62p02K16K64q81J046n54o44J465q58r67J744o65p06J143o77O4L73n88
$$ plain form
2500 -353 483 -58 -459 730 -352 -679 961 -369 -474 752 -542 -171 417 -364 147 -128 -413 579
2518 579 -204 -279 722 -436 -185 795 -290 172 623 -366 315 88 -345 661 -348 -381 555 -623 -265
2537 -265 784 -574 -155 465 -402 197 184 -293 444 -447 -206 747 -618 -15 736 -783 21 584 -694
2556 -694 195 98 -541 311 -199 -167 485 -417 64 634 -684 474 489 -548 391 314 -431 631 -153 -278
2576 -278 443 -624 35 450 -635 43 289 -655 460 155 -445 354 -210 -142 393 -518 211 340 -776
2595 -776 414 278 -806 488 -19 -655 450 -118 -228 284 -485 135 304 -400 458 157 -552 729
2613 729 15 -418 698 -236 -219 538 -393 11 306 -576 246 24 -474 481 -196 -350 566 -495 -50 530
2633 530 -402 228 262 -632 332 142 -541 522 -92 -417 525 -352 -136 362 -409 44 203 -476 470 -48
$$ packed form
2500c53Q36n41m01J189j082l27J640j330j05J226j294L71N88p81N11k75k85R92
2518E79p83p5J001j158K51R80j085M62M51r89O81k27m33J006j009l3R36j178L58
2537b65J049j358M19O20q67N99j3m77P37q91K41R53j365O03P51j519Q04N63j278
2556f94Q89r7o39Q52n10L2O52r02M81N70j318J158J5j037R39p7p45J062p84j25
2576b78P21j067O59M15j085O78K46r44J115l05o00P99n64O8N35r11P29J29j116
2595g76J190j36j084J294n07o36J105n68j10N12p69O20J69p04Q58l01p09J281
2613G29p14m33J116r34J7P57r31M04K95q82Q22k22m98R55o77j54R16j061M45N80
2633E30r32O30L4q94R64j90o83J063o14l25R42q77K16M98p71M53J59o79R46n18
$$ plain form
2653 -48 -348 583 -204 -83 742 -379 -66 552 -395 204 419 -393 309 -90 -351 416 -256 -179 440 -628
2673 -628 -17 295 -550 431 172 -629 538 -33 -343 626 -112 -254 564 -422 -76 361 -504 223 123 -479
2693 -479 512 -125 -274 517 -439 -41 488 -456 59 437 -644 217 319 -472 361 4 -298 376 -324 -108
2713 -108 351 -630 109 288 -653 367 170 -481 550 -79 -370 512 -128 -63 469 -509 202 238 -520 332
2733 332 54 -446 537 -213 -175 376 -500 4 479 -504 251 352 -556 405 100 -400 615 -103 -306 424
2753 424 -205 5 327 -575 299 18 -516 505 -194 -493 516 -162 -272 627 -323 -208 493 -286 360
2772 360 173 -299 403 -223 -310 495 -395 -234 533 -679 -35 390 -492 201 93 -514 358 -70 -240 507
2792 507 -379 -171 560 -402 111 272 -466 164 33 -350 373 -248 -358 431 -518 20 649 -562 -16 485
$$ packed form
2653d8l00R31p87J21Q25j121L13O18r47N99K15q12P02l99k61P67o72P7O19j068
2673f28O11L12q45R81k59q01J167n71l10R69p38j42Q18r86L46M37q65P27j00o02
2693d79R91o37j49P91r56L98N29r44N15L78j081Q61J02p91Q33l57l02O74p00K16
2713a08M59r81P39J79r41J020j97o51J031o29k91Q82o40O5N32r78P11L6p58Q52
2733C32k78n00R83p50L8N51q76N04M75r83P55J01r08R61l05n00J015p18k03P30
2753D24o29K10L22r02Q74k81n34J021o99k99J009o78j10Q99r50J15P01p79O46
2772C60j87m72P02o26q7Q05q90J61P67j212O44M25q82O93j08o07Q72m28j70P47
2792E07q86K08P31r62N13J61p38O30j31l83P23o21j10P89r49N38O29j211N46N01
$$ plain form
2812 485 -407 254 304 -293 232 -202 -75 409 -411 211 461 -764 169 415 -729 389 146 -494 205
2831 205 35 -111 361 -288 147 370 -485 326 293 -487 506 111 -446 373 -104 -329 255 -413 81 287
2851 287 -592 285 199 -638 392 160 -529 487 31 -191 335 -219 237 119 -584 466 -42 -573 518
2870 518 -28 -617 539 -134 -360 388 -210 -36 65 -251 395 -6 -317 531 -165 -404 600 -212 -318
2889 -318 556 -350 53 159 -347 340 -145 -490 551 -141 -256 650 -119 -326 610 -299 -43 327 -155 227
2909 227 -150 -147 596 -450 -397 704 -570 -122 656 -332 -145 135 -289 157 -140 -180 384 -443 82 721
2929 721 -550 48 555 -776 148 496 -467 87 63 -279 165 -262 71 325 -571 40 541 -567 186
2948 186 371 -471 159 68 -166 385 -321 -31 451 -627 136 442 -725 17 428 -617 199 108 -358 253
$$ packed form
2812D85q92O61N0n97N25m34J27M84q20O22K50j225R33K46j144J118k43o40O99
2831B05j70j46M72o49M35K23q55Q11l3p80R93l95n57Q19m77k25N84o68M94K06
2851B87q79Q77q6q37J030k32o89J016m56k22N26n54M56j18p03J050n08n31J091
2870E18n46n89J156o73k26P48n98J74J01l16O46m01l11Q48o96k39J004q12j06
2889c18Q74r06M03J06n06O87m85l45J041o92j15R06p69k07R36r09K56L70m82L82
2909B27l77LP43j046N3J101j274M48P78r88J87K80m24M46k97m0N64q27N25O39
2929G21j271N98N07j331R24L48r63N54k4l42M44m27L33K54q96O11N01j108P53
2948A86J85q42O30r1k34N51p06K90M82j078P63L06j167P42M11j045Q16r1m66O11
$$ plain form
2968 253 -290 85 386 -423 357 312 -765 499 342 -615 397 111 -585 263 -77 -127 229 -362 240 162
2988 162 -424 537 35 -497 578 -82 -407 660 -141 -94 306 -487 264 95 -525 400 -3 -557 450
3007 450 -116 -379 426 -270 30 212 -192 283 128 -383 554 -66 -379 629 -160 -391 518 -140 -226 228
3027 228 -258 68 28 -215 435 -217 -250 690 -390 2 656 -340 -32 507 -372 126 177 -388 361 -207 -337
3048 -337 435 -300 -134 363 -589 -99 290 -449 256 107 -348 399 -42 -183 481 -294 -265 531 -466 8
3068 8 439 -373 83 113 -380 351 -177 -187 287 -481 -24 550 -465 164 418 -579 247 252 -279 362 14 -247
3090 -247 344 -310 49 216 -546 155 81 -622 324 49 -430 385 -161 -176 430 -291 79 413 -314 196 225
3111 225 -399 317 99 -328 449 -225 21 381 -429 58 323 -400 274 183 -518 488 175 -460 434 -130
$$ packed form
2968B53n43L75L01q09P80m5j077J264j57r57J012k86o96Q48l40n0L56n91O02p8
2988A62n86R61n02n32J075o60l25J067q01M7M00p93P51j69o20R25m03n54J007
3007D50n66k63Q05o96L00J82m04M75j55n11R37o20l13J008p89k31R09o58q6M54
3027B28m86L26m0k43O50o52l3R40j080L92O54r96L08N39q79M98N1n65P49n68j30
3048c37P72p35J66M97r52M90L89p39P05j49m55P47m41j41O64p75K9P96r97M74
3068HM31q12M56L0m93P31n28j0M74p68M57N74j015O29K54r97Q26Nn31O41l48k61
3090b47N91o54L59J67p62P01p4p03R46k75m79Q15n46j5O06p21L70L34p27N10K9
3111B25o24P16k18m27P77o74K46L60q10M87K65p23O74r1p01J006l13o35Q94n64
$$ plain form
3131 -130 -165 447 -346 -30 262 -477 256 -94 -389 481 -20 -438 528 -259 -204 363 -375 134 215 -397 226
3152 226 151 -399 401 -131 -241 320 -270 -79 287 -351 83 138 -438 298 2 -345 489 -27 -226 557 -268
3173 -268 -111 304 -266 92 234 -413 263 -2 -388 367 -228 -244 412 -471 -60 423 -342 101 229 -369
3193 -369 214 20 -235 381 -120 -25 400 -442 41 318 -506 249 227 -366 276 -139 -297 354 -214 -143 349
3214 349 -460 -39 362 -480 159 223 -358 335 -20 -353 452 -271 -76 376 -581 152 193 -620 233 -18 -633
3235 -633 293 94 -303 303 -147 -37 339 -362 219 148 -432 366 -6 -494 423 -153 -479 481 -279 -205 180
3256 180 -344 45 268 -284 367 106 -300 446 -130 -214 347 -271 -149 397 -405 190 102 -397 228 10 -473
3277 -473 502 -26 -265 558 -114 -105 351 -199 36 68 -206 440 -30 -208 447 -312 -243 563 -438 -133 362
$$ packed form
3131a30l5O12p93L16K92p39P33l50k95Q70n01m18R66p87N5N67p38N09Q1o12O23
3152B26p5n50Q00n32j10N61n90J91L66o38M34N5n76P36k96l47Q34n16j99P83q25
3173b68J57M15n70L58J42o47O76k65l86P55n95j6O56q83M11M83p65M43J28n98
3193c69N83j94k55O16n01R5M25q42M83K77q24P55k2n93O42m15j58O51n68P1M92
3214C49q09M21M01q42O39O4n81O93l55l33Q05p23J95M52r57P33M1q13Q53k51o15
3235f33R26j99l97O06m50J10L76p01N81p1n80P98l72m88R17n76l26R60p60P4L85
3256A80n24L89K23n52O51k61m06P46n76q4N61o18J22N46q02N95q8m99O25k18m83
3277d73R75n28k39Q23o72RM56n50K35L2k74O46m70j78O55p59O9Q06j001L05M95
$$ plain form
3298 362 -337 63 172 -190 248 -66 -326 392 -279 -122 506 -429 29 366 -525 65 83 -321 262 -82
3318 -82 -272 309 -370 -67 479 -490 -24 386 -360 188 162 -257 380 -100 -13 334 -424 24 388 -578 168
3339 168 409 -497 114 241 -507 214 65 -206 403 -260 141 278 -443 361 215 -535 364 267 -523 335
3359 335 -44 -271 175 -152 61 110 -484 231 107 -439 393 130 -319 446 105 -252 405 -164 137 217 -418
3380 -418 272 53 -482 427 -7 -489 437 -103 -289 300 -268 4 102 -320 276 -16 -345 503 -66 -310
3400 -310 623 -269 -406 435 -241 -98 253 -323 39 -30 -174 410 -256 -224 547 -153 -203 488 -57 10 290
3421 290 -252 198 148 -53 266 -128 -201 476 -370 -239 344 -357 -69 321 -213 41 -27 -189 382 -115 -89
3442 -89 517 -418 15 491 -454 15 244 -294 71 27 -229 229 -128 -23 185 -493 140 426 -528 219 313
$$ packed form
3298C62o99M00J09l62M38l14k60P18o71J57O28r35M58L37q91N90J8m04N83l44
3318h2j90N81o79L03N46r69M66M10p46N48k6m19O37m80Q7L47p58M48L64r66P46
3339A68K41r06O11J27p48P21j49k71O09o63M01J37p21Q04j46p50Q99r7p90Q58
3359C35l79k27M46l27K13M9n94P15j24n46Q32k63m49P65l41l57O57n69L01Q0o35
3380d18O90k19n35R09m34m82R26n40j86N89n68K72R8m22N96k92l29Q48n69k44
3400c10R33q92j37Q41o76J43L51n76L62o9j44N84o66L2P71p00n0O91n45O7K80
3421B90n42M50n0k01L19l94p3O77q46J31N83p01K88L90n34K54o8j62N71m97K6
3442h9O06r35M33M76r45M69K29n38L65m4k56M58l57J05K08o78O33K86r54P47R4
$$ plain form
3463 313 -509 183 138 -271 386 -132 -31 379 -495 -40 327 -499 147 111 -354 236 58 -334 265 -81 -117
3484 -117 370 -308 224 234 -483 267 259 -428 302 -1 -272 255 -57 -60 202 -319 183 181 -443 346 -41 -478
3506 -478 407 80 -190 384 6 -88 241 -261 30 125 -388 240 -18 -396 376 -106 -356 286 -196 -77 386
3527 386 -259 75 28 -264 266 73 -305 372 -40 -250 448 -159 -53 123 -275 137 -2 -371 250 -102
3547 -102 -255 445 -229 -154 469 -141 -152 303 -181 10 51 -257 311 -119 -147 230 -276 -116 381 -344 73
3568 73 341 -366 113 55 -432 182 26 -216 378 -126 -29 492 -261 79 145 -342 134 88 -247 254 -61 -213
3590 -213 292 -279 -53 375 -245 17 307 -312 167 178 -188 178 -24 -130 399 -312 -35 286 -373 110
3610 110 231 -380 203 26 -385 165 -135 -161 341 -192 45 375 -288 101 123 -338 277 111 -239 236 -125
$$ packed form
3463C13q22O92m5m09O57n18J01M10q74M55L67q26O46l6m65N90j78l92N99l46l6
3484a17M87o78N32J0p17P50qo87P30l03k71N27l12lK62n21N02ko24P89l87m37
3506d78Q85l27k70N74l78r4L29n02K91R5n13O28k58l78P72m82k50O42m82J19M63
3527C86o45L34m7k92N30j93l78O77m12k10O98o07J06J76l98M12j39l69O21l52
3547a02j53P00o74P5O23o10j1M55m84J91M1l08N68m30k8L77n06J60M97p25M17
3568G3K68p07M79n8m87O14j56k42N94n04R7N21p53L40O6m87M76m6l35N01l15j52
3590b13N05n71K26M28o20K62K90o19M79J1l66L66k02j06N29p11K77L21o59M83
3610A10J21o11N83j77m11N50l00k6N02n33K37L30o63L89K2m61O15j66l50M75l61
$$ plain form
3631 -125 -217 304 -337 -15 314 -370 102 195 -306 184 72 -307 295 -131 -103 251 -350 40 109 -332 120
3652 120 -28 -408 241 -82 -384 238 -79 -224 262 -156 17 282 -199 283 65 -235 294 6 -217 430
3672 430 -117 -126 361 -353 3 78 -376 43 97 -247 315 -61 -162 282 -124 -26 297 -135 63 125 -302 209
3694 209 24 -278 281 -123 -252 292 -264 -79 270 -348 2 232 -329 179 -41 -87 276 -178 -8 347
3714 347 -276 -21 295 -319 89 169 -416 204 97 -348 214 -120 -119 115 -199 14 299 -273 122 185 -243
3735 -243 330 74 -118 236 -204 -100 194 -192 -3 173 -350 202 141 -363 226 -51 -92 220 -137 26 179
3756 179 -281 165 165 -280 174 89 -350 109 29 -331 260 -151 -86 67 -199 125 -6 -206 210 10 -274 388
3778 388 -56 -278 415 -74 -157 309 -281 18 177 -232 159 -93 -280 237 -72 -231 342 -143 -40 285
$$ packed form
3631a25r2N21o41L22L29o84M72R3n01M90j12l79O02m26K8L54o01L90O9m41M52
3652A20j48l80O49l23l02O22l17j45M86m18J73K65m81M82k18l00N29k88k23O47
3672D30n47rM87p14L56P5m54M19N4l44N62l76j01M44m06R8L23m32J98O2m27N11
3694B09j85l02N59m04j29N44n56J85L49o18L50K30n61N08k20m6L63m54J70L55
3714C47o23K55L16o14M08Q0n85O20j07m45N62l34JK34l14K13K85n72L95O3m28
3735b43N73k56j92L54m40J04K94l86J89J76n23N52o1n04N89k77m1L12l57J63J53
3756A79m60M46%m45M54q5m39M59q0l60N91m11O5J53k66L24j31k00M16k00k84O62
3778C88m44k22O93m89q3M66n90K99J59m09L91k52j87N17l09j59N73m85J03L25
$$ plain form
3798 285 -99 41 93 -227 343 -3 -98 347 -220 -45 309 -150 -126 350 -197 -48 49 -125 20 -101 -115 353
3820 353 -215 2 493 -305 -8 388 -230 13 143 -226 88 -124 -259 208 -230 -129 213 -326 89 282
3840 282 -344 86 238 -100 216 52 -122 234 -120 17 364 -210 18 214 -333 82 149 -227 169 -93
3860 -93 -210 152 -318 57 217 -334 63 333 -383 194 155 -282 215 15 -151 56 -92 -85 -3 -138 176 33
3882 33 -383 183 37 -281 279 73 15 258 -82 -129 124 -203 115 91 -193 168 -7 -277 241 -123 -262
3903 -262 215 -107 -61 124 -192 234 45 -285 210 26 -326 260 -129 -138 293 -133 -124 101 -251 73 -102 -323
3925 -323 335 -54 -186 398 -126 -120 301 -99 -66 296 -101 -11 37 -184 144 -110 -120 326 -173 -130 304 -230
3947 -230 0 124 -277 -4 20 -270 200 -19 -117 309 -147 -29 411 -187 53 152 -214 27 43 -220 44
$$ packed form
3798B85l84J40N2l20N70l46r5M45n67J75L54m59K4M76n47J49R7j74J45j21j4M68
3820C53n68K17M91p98K97L96o18K43J30l69L14k12j35M67m38J01L42n39M15J93
3840B82o26M30J52l38L16j64j74L56l54J37L47n74K28J96n47M15O7l76L96k62
3860i3j17L62m70L75J60n51L97K70p16N77l9m37M97k00j66K07j48PQ2j35L14j43
3882C3m16N66j46l18N60k06n8K43l40m7K53l27L18k4k84L61j75k70N18l64j39
3903b62M77l22M6J85l16M26j89l30M95j84l52N86l89rM31m26RK25l52L24j75k21
3925c23O58l89j32N84n24OM21m00L3L62l97R0M8k21L28k54j0M46m99M3M34n34
3947b30K30J24m01K73K4k90M70k19r8M26m56J18M40n98K40R9l66K41J6k63K64
$$ plain form
3968 44 -129 -87 228 -94 -17 267 -348 66 327 -225 127 106 -77 219 -41 66 161 -217 18 49 -258 183
3990 183 179 -317 175 166 -305 156 -57 -106 262 -226 82 204 -242 149 137 -348 197 44 -143 149 -151 -55
4012 -55 97 -183 45 49 -295 196 147 -361 192 11 -272 148 -38 -42 209 -180 130 116 -255 135 10 -307
4034 -307 95 17 -243 176 -124 -168 66 -147 5 203 -142 149 36 -66 199 104 -109 255 -109 -58 244
4055 244 -204 126 58 -233 224 -22 -169 331 -87 -104 221 -161 -88 188 -158 144 115 -178 54 -87 -87 236
4077 236 -192 -233 227 -78 -77 137 -259 -15 105 -226 59 31 -187 337 -172 -62 410 -148 153 206 -282 65
4099 65 82 -352 262 -12 -135 226 -100 60 277 -274 90 285 -215 57 140 -244 220 -7 -123 217 -143
4120 -143 -53 177 -266 -46 147 -349 75 142 -342 207 -156 -144 193 -175 -96 196 -130 141 171 -270 244 -38
$$ packed form
3968D4j73M2L15l22P7K84o15M14K61n52L52k1j83K96k60J07R5l78K35L1l07M41
3990A83mm96M92rm71M61k13m9L68m88L08J22m46L91j2m85N45j53j87K92l00R6
4012e5J52k80K28Ml44M91m9n08N53j81k83M20j86mK51l89L10j4l71L90j25l17
4034c07M02p8k60M19l00m4K34k13J52J98l45K91j13j02K65r5k13L64l64N1L02
4055B44m48L30o8k91M57k46j47N00m18j7L25l82P3K76l46L02k9k93K32j41%L23
4077B36m28m1M60l05JK14l96K44J20l31K85k8k18N24n09J10M72n58L01N3m88L47
4099F5J7m34O14k74j23L61l26J60K17n51L64J95n00K72Q3l84M64k27j16L40l60
4120a43R0K30m43K20J93m96M24O7m84N49l63J2L37l68P9K92l26K71L0m41N14k82
$$ plain form
4142 -38 -240 190 -42 -240 107 -86 -32 280 -139 59 178 -257 268 15 -172 207 -145 -127 163 -121 -30
4163 -30 210 -294 44 132 -273 143 18 -223 290 -109 -193 247 -175 29 262 -161 27 96 -211 234 -25
4184 -25 -235 143 -146 -350 106 -119 -55 197 -208 168 50 -215 158 -69 -193 58 -54 -153 252 -262 -42
4205 -42 124 -233 -5 -65 -122 157 -31 -269 298 -229 -65 118 -271 -40 97 -141 141 36 -92 212 -91
4226 -91 -26 272 -144 -34 165 -306 83 153 -253 79 -10 -104 142 -89 -156 79 -258 2 194 -355 73 131
4248 131 -273 218 145 -218 218 -34 31 166 -190 44 137 -263 131 187 -204 42 -38 -195 130 75 -121 178
4270 178 -142 78 263 -104 182 109 -206 112 9 -258 237 -50 -161 120 -149 -82 101 -220 81 55 -161
4291 -161 310 9 -183 107 -113 -169 224 -224 12 91 -190 159 83 -177 238 -73 -108 219 -153 -162 230 -87
$$ packed form
4142c8k02M30k32j98L47j93N4L12m19J98J19m35N25k53j87L79l52J8K90k84R1
4163c0K40n04L38Q8m05M16j25k41N13l99q4M40m22K04K33m23J88O9l07M45k59
4184b5k10L78k89k04M56k25O4K52m05L76j18k65L73k27j24K51j12r9M05n14K20
4205d2J66l57K28o0n7K79j88k38N67n27J64J83l89K31J37k38K82j05j28L04l03
4226i1O5K98m16J10J99m71L89P0m06L32q9r4K46k31o7K35l37K60J92n49M28N8
4248A31m04M91p3l63M36k52O5J35l56K34R3m00L94N6l91K46q0j57L25n5j96K99
4270A78l20K20J85l67K86p3l15L18j03k67M95k87j11K81k69O7J83l21L01k6k16
4291a61M71l01j92K90k20n6L93m48K36P9k81L49p6k60M15l11l5L27l72rL92l17
$$ plain form
4313 -87 32 205 -68 41 122 -133 225 -66 -101 158 -266 -123 149 -136 49 93 -241 170 -106 -188 158 -69
4335 -69 -65 228 -114 -13 326 -298 -17 152 -60 15 -7 -41 206 -171 -195 156 -169 72 205 -270 80 108 -173
4358 -173 186 184 -84 205 -32 40 248 -241 44 179 -281 65 141 -297 32 -99 -98 183 -79 -62 143 -188
4380 -188 46 199 -228 107 211 -175 102 -10 -124 142 -102 -21 76 -245 153 159 -290 205 82 -224 182
4401 182 -6 -173 99 -82 -76 231 -156 161 85 -157 148 -64 -264 245 -112 -191 246 -81 -121 53 -242 53
4423 53 94 -214 215 -13 -202 293 9 -98 232 -239 -37 12 -154 108 9 -283 247 -77 -142 343 -83 -159
4445 -159 126 -97 -114 252 -100 70 122 -156 71 -44 -71 276 -194 -170 206 -205 -143 132 -161 7 -52 -166
4467 -166 202 -36 -155 183 -130 27 222 -182 45 131 -242 160 81 -155 230 -67 -118 127 -213 -140 184
$$ packed form
4313h7J19J73k73J09Q1k55L58k91l5K59m24J43K72k85J85M4l34M11k76q2L46k27
4335f9MK93l42J01L39o24K81J69k12P5k2l4K47l77k4L51l25K41J33m75L50K8k81
4358a73L59kk68K89k37P2K08m89K85J35m60L46P6m38L29j31JK81k62J7K05l31
4380a88K34J53m27L35J04l86K77j12j14K66k44Q1R7l21L98Om49M95j23l06M06
4401A82j88j67K72j81OL07l87L17p6k42L05k12k00N09l57p9M37l27m0J74k95K95
4423E3M1l08M29k28j89M95k84j07L30m71K02M9j66K62r9k92N30l24o5M85m26p6
4445a59K85k23j7L66l52J70N2k78K27j15k7L47m70K4L76m11O2K75k93J68n9j14
4467a66L68k38j19L38l13J57J95m04K27Q6l73M02p9k36L85k97n1K45l40P3L24
$$ plain form
4488 184 -110 -24 113 -211 -1 130 -205 156 -92 -11 214 -174 89 128 -215 77 115 -219 30 25 -187 119
4510 119 0 -25 37 -42 39 117 -206 98 188 -177 123 40 -101 115 -52 23 124 -227 -66 124 -222 122 133
4533 133 -231 191 -96 -94 156 -1 -62 295 -193 29 119 -254 41 33 -247 136 -26 -211 128 -182 -14 94
4555 94 -143 33 153 -186 148 133 -100 236 -15 -260 223 39 -24 157 -94 -36 9 -222 -32 101 -257 82
4577 82 18 -105 225 -244 -139 113 -146 41 212 -234 147 67 -228 196 -20 -123 127 -97 -145 245 -130
4598 -130 7 136 -205 90 63 -17 253 -13 -112 141 -147 5 59 -177 -25 183 -113 66 -71 -57 130 -35
4620 -35 7 63 -176 -24 170 -209 38 33 -223 90 58 -87 228 -141 -6 164 -165 153 161 -171 117 72 -148
4643 -148 134 18 -142 247 -31 -65 290 -85 53 197 -125 114 99 -146 103 -57 -312 152 -132 -110 114
$$ packed form
4488A84k94Q6J37l24K10J31l35L61k48Q1K25l88K63L9l43K92L8l34K49nk12L06
4510A19j19k5O2p9Q1P8l23L04R0l65L00q3j41K16j67P5J01l51J61J90l46L44J1
4533A33l64M22k87KK50j57o1L57m88K22R0l73K95qk80L83j62j85L39l10J68J08
4555I4k37J76J20l39L34j5k33L36k51k45M83j84o3J81k51N8M5k31J90J33l58L39
4577H2o4j23L30m69J05K52k59J87J71m46L81q0k95M24k16j03K50k24m8L90l75
4598a30J37J29l41K95k7q0K70k66r9K53k88J52N4k36J52K08k96J79j37J4J87j65
4620c5M2N6k39J52J94l79K47nk56L13l2j45L15l69J35J70l29L18Ql32K88m5k20
4643a48K82j16j60L89k78l4L55l75J38J44l22K39j5k45K49j60k55M64k84K2K24
$$ plain form
4664 114 -121 124 14 -104 77 25 -142 180 1 -158 226 -72 -54 183 -176 64 -11 -98 100 -33 -196
4685 -196 177 -49 -111 223 -136 36 101 -8 75 49 -53 62 59 8 150 53 -193 178 -53 -91 155 -183 7
4708 7 170 -74 34 -74 -21 154 40 -75 210 -98 67 73 -86 17 88 -160 80 62 -49 59 -83 -139 167
4731 167 -75 45 155 -160 -55 11 -105 119 -10 -76 171 -158 54 123 -97 15 162 -234 94 69 -138
4752 -138 114 49 -134 37 -80 0 237 -50 67 77 -129 206 98 -150 140 -71 -170 146 -102 30 71 -238
4774 -238 69 168 -238 108 84 -157 87 -16 -111 196 -35 52 62 -190 57 134 -126 131 66 -133 184 27
4796 27 -38 59 -143 -41 2 -127 72 74 -168 82 -4 -42 147 -90 65 151 -151 -46 144 -49 41 18 -207 191
4820 191 -112 -144 224 -79 -156 114 -106 15 30 -59 65 1 7 202 -118 16 136 -37 -22 147 -137 29 112
$$ packed form
4664A14k35K45j10j18J81n2j67L22j79j59L84k98J8K37l59K40p5q7J98j33j63
4685a96L73k26o2L34l59J72O5j09Q3k6j02J15ln1J42r7k46L71k31l8K46l38J90
4708GJ63k44J08j08N3J75j14j15K85l08J65Oj59J03P1k48K40j8j11J08j42n6L06
4731A67k42J20J10l15J05O6j16K24j29o6K47l29K12O9k20J12J47l96L28k5k07
4752a38K52o5j83J71j17Q0K37k87J17J0k06L35j08k48K90k11r9L16k48J32M1l09
4774b38L07R9m06L46k4k41K44j03r5L07k31Q7J0k52K47P7k60K57o5j99L17j57
4796B7o5R7k02J02M3j29J99Kk42K50q6l8J89k37J55Q6l02J05J90j93R0k3k25L98
4820A91l03l2L68l03p7K70k20J21J5q9J24o4OJ95l20J34J20j73J5J69k84J66Q3
$$ plain form
4843 112 -169 12 -49 -153 84 -94 -85 189 -84 20 126 -166 -26 189 -20 165 -54 -88 231 -3 -76 32
4865 32 -76 -94 115 -121 138 22 -153 180 11 -20 234 13 34 129 -75 -83 115 -19 117 110 -206 22 65
4888 65 -162 114 -10 -67 124 -51 41 16 -81 74 141 -73 89 80 -105 82 -117 16 174 -162 78 12 -3
4911 -3 104 133 -129 129 21 -112 101 -69 -44 107 -24 132 -44 -158 28 -88 -157 56 21 -210 83 -71
4933 -71 -34 86 -69 2 110 -73 64 78 -112 201 -62 8 112 -123 -72 155 79 43 119 -197 102 17 -65 130
4957 130 -131 -14 76 -103 -22 157 -122 -18 53 -75 65 57 -84 41 -46 -102 3 -118 -130 6 -80 -50 121
4980 121 -141 37 -32 -115 111 -7 -56 213 -112 28 145 -56 91 -25 -137 40 -42 -123 154 -39 -55 188
5002 188 -83 -16 83 -183 208 -9 -96 116 52 -187 153 -101 -29 69 92 -41 -5 -108 -81 -56 -238 -2 86 -101
$$ packed form
4843A12k81J81o1j04K37j78RK74k73J04J06k92J40K15k09J85k19l4L19k34p3J08
4865C2j08j8K09k36K59j16j75L33j69l1K54k21K1R5k04qJ98j34J36pl16K28M3
4888F5k27K76j24n7J91j75R2k5r7J55O7k14J62rj85J87j99J33J58l36K40o6j5
4911cJ07K9k62K58j08j33K13j70K5J51j31J56j76j14J86j16o9K13l5k31K93j54
4933g1L7J20j55P1J08j83J37J4j90L13k63P0J04k35N1K27p6l6P6l16K99q5q2J95
4957A30k61J17R0j79Q1J79k79J04P1j28J40qj41J25q7n6J05j21j2J36q6L0J71
4980A21k62J78o9q3K26j18m9K69l25J40J17k01J47j16j12J77q2q1K77j93j6K43
5002A88k71O7R9k66L91k17q7K12o4k39L40k54P2R8K3j33L6j03K7K5j82K36Q8j87
$$ plain form
5026 -101 50 -106 -56 108 -100 72 117 -60 132 -45 -91 90 -54 -186 34 -43 -55 173 -91 94 24 -217
5048 -217 148 -43 -7 175 -10 -101 283 -20 -41 48 -200 -99 78 -125 53 5 -104 61 -28 -51 89 -125
5070 -125 26 63 -151 45 54 -73 91 26 -168 160 26 -86 158 7 -4 -60 -81 -33 60 22 55 59 -62 175
5094 175 -36 -45 35 3 -43 134 -27 60 84 -102 66 -15 21 67 -74 -43 31 -121 52 163 -144 123 6 -157
5118 -157 197 -71 -133 72 43 29 181 -106 43 127 -78 36 -23 -111 59 -109 -61 113 -51 -23 103 -104 -80
5141 -80 92 -107 62 85 -41 -3 -2 11 116 -175 -44 55 -164 -19 68 -138 -3 11 -73 -102 33 35 115 -170 45
5166 45 147 -243 89 97 -198 -22 68 -109 125 -143 -95 130 -68 72 69 -139 -4 64 -110 180 -13 -179 84
5189 84 -1 -48 45 -188 -38 152 -115 35 11 -153 97 -48 -101 -54 -40 -49 113 -126 63 63 -127 91 133 -83
$$ packed form
5026a01J51j56N0J64k08J72M5j77J92j77m6J81j44j32K20p7j2K28k64J85p0k41
5048b17L65j91L6J82j85r1L84l03k1Q9k48J01J77k03J78m8j09J65q9k3J40k14
5070a25J51L7k14J96Rj27J64o5j94L28j34j12K44j51j1n6k1M8R3l8L3Mj21K37
5094A75k11rQ0l2m6J77j61Q7K4j86J68q1L6M6j41L1P4j52J73J11l07K67j17j63
5118a57L54k68o2K05k9j4J52k87J49Q4k05J14n9q8J70j68M8J74j64K8J26k07K4
5141h0J72j99J69K3j26L8JJ3J05k91J31R9k19J45Q7k06J35J4q4k9J35KQ0k85K15
5166D5J02l90L32Qk95J76R0j77K34k68M8K25j98J40lk08J35O8j74K90j93j66K63
5189H4q5m7R3k33J50J90k67J50k4j64K50j45n3M7J4rJ62k39J89%j90K18M2k16
$$ plain form
5213 -83 180 3 -23 108 -157 -84 60 -115 60 -8 -76 84 69 -168 158 -33 -19 110 -40 -63 105 -52 -70
5236 -70 30 -94 75 58 -89 148 -79 -244 151 26 28 135 -49 -11 70 -76 109 -33 9 110 -14 -61 102
5259 102 -170 -21 54 -205 79 -60 -104 110 -58 -82 131 -90 33 6 -30 -39 -31 -208 51 6 -82 130 -66 -46
5283 -46 129 -83 32 87 -118 6 -16 -89 37 12 -181 145 72 -73 229 -131 40 33 -175 81 26 -220 -76
5306 -76 -81 -24 164 47 -89 171 -11 -50 69 -183 20 16 -5 148 -107 -94 190 7 28 70 -10 -2 114 -217 38
5331 38 63 -199 69 138 -20 75 89 -195 69 -144 9 60 -175 84 117 18 124 -37 -90 125 -125 2 20
5354 20 -78 -63 31 -149 47 42 -42 16 34 -52 68 53 -42 85 27 24 275 -13 -58 -14 -53 131 -103 14 124 -31
5380 -31 15 110 7 -87 144 -235 128 -6 -128 23 -28 -69 41 -95 -63 82 -125 24 47 -192 41 -77 20
$$ packed form
5213h3K63j77k6J31k65P3J44j75J75o8o8J60j5k37L26j91J4J29j50k3J68j57j8
5236g0J00j24J69j7j47K37k27j65L95j25KJ07j84L8Q1j46J85j42M2J01j24m7J63
5259A02k72J49P5k59K84j39m4K14j68k4K13k21J23k7l6rQj77K59m5q8K12j96K0
5283d6J75k12J15N5k05J24k2p3J26k5j93L26p3j45L02l60J71pk08K56n5k46J44
5306g6nN7J88j17j36K60j82l9J19k52K03mk1J53k55J3K84j83K1M2q0QJ16l31K55
5331C8K5k62K68O9j58R5J4k84K64k13J53N1k35K59L3r9J06j61n3K15k50J27J8
5354B0r8J5R4j80J96nq4N8J8q6J20j5r5J27n8lK51k88m5M4l9J84k34J17J10j55
5380c1M6R5j03r4K31l79L63j34j22J51n1m1J10j36L2J45k07J49K3k39K33j18R7
$$ plain form
5403 20 7 -107 -86 56 -13 -29 98 -191 32 12 -82 34 -3 -100 132 35 -177 89 -69 -17 99 -172 -48 56
5427 56 -122 36 -44 -18 142 -47 -42 95 -123 -23 195 -143 21 13 -115 129 -50 -53 48 -74 -96 62 -80
5450 -80 10 78 -183 151 46 -83 -12 39 -40 202 -47 -64 22 -92 -38 -54 -162 103 -49 -59 8 45 -80 165
5474 165 8 -94 80 -78 30 90 -81 -70 100 18 93 -169 -42 -61 -42 3 231 -13 22 28 -141 42 107 -94
5498 -94 3 -21 -51 124 -50 -7 194 -162 57 8 -111 2 -119 -151 53 103 78 33 -132 3 58 40 83 116 -22
5523 -22 163 25 -237 124 -13 -48 133 -47 48 29 -31 63 65 -161 47 -54 -43 233 -66 -27 117 -101 94
5546 94 80 -125 106 25 -50 -3 -104 6 -6 -46 -97 84 -89 -23 50 -88 42 -1 -134 83 36 -48 76 -150
5570 -150 89 11 -77 -34 56 -48 1 -87 -178 47 128 -84 37 -173 -25 76 -48 51 -52 -5 -2 44 -22 65 -109
$$ packed form
5403B0j3j14K1J42o9j6J27k89K23k0r4J16l7r7K32r7k12K66j58N2J16k71J24J04
5427E6j78J58q0K6J60j89NJ37k18J00K18l38J64qj28K44j79lJ01j22k2J58j42
5450h0R0O8k61L34j05j29P1N1p9K42k49j7Q6j14N4j6j08K65j52j0O7L7j25K45
5474A65j57j02J74j58J08O0j71J1J70q2P5k62J27j9J9M5K28k44L5Oj69J83O5k01
5498i4R7k4l0J75j74M3K01l56K19m9j19J13j21l2K04N0k5m5j65J35N5j8M3L3j38
5523b2J85j38k62L61j37l5J81j80R5j9o0R4Kk26K08j01J1K76k99L9J44k18J95
5546I4j4k05K31q1p5M7j01J10j2m0n1J81j73O6P3j38J30m3j33K17m7q4J24k26
5570a50K39p8q8M3R0j04M9q8r1K25Q1k12J21k10J48J01j24R9j03M7LM6o6Q7j74
$$ plain form
5595 -109 8 19 -24 -81 80 -108 63 140 -49 163 -83 -137 -33 -47 -83 85 -135 -33 107 -154 12 59 -68
5618 -68 120 -53 21 127 -41 -10 179 -63 24 75 -198 35 16 -32 23 67 -58 82 -99 7 46 -45 -125 76
5642 76 4 -43 23 5 19 -7 -33 80 -62 -30 9 -73 26 89 -196 55 -3 -17 26 -12 11 107 1 -14 105 -148 7
5669 7 99 -39 101 126 -111 28 56 -97 30 -37 13 36 -78 -55 194 -108 8 50 -45 -22 -90 -52 24 -28 -100 171
5695 171 -126 59 7 -116 -2 -97 -83 92 -36 43 -31 -69 156 3 -93 29 65 -147 118 -32 -32 76 -89
5718 -89 -14 19 -84 141 122 -127 50 185 -129 100 -21 -98 97 -84 -19 100 -91 -88 190 -71 157 77 1
5741 1 8 -155 28 84 17 -51 27 -186 8 -46 43 5 27 -62 92 57 39 30 21 -4 40 36 -5 119 18 -6 25 28 125 28
5771 28 44 83 -20 -52 97 -114 43 -45 10 52 -76 -146 -5 -14 -15 90 -139 58 45 -100 20 22 -34 108 -66
$$ packed form
5595a09J17J1m3n7J61j88J71P7j89K12k46n4J04j4l6J68k20J02J40k61J66M7j27
5618f8J88j73P4J06j68L1J89k42Q7N1k73K33j9m8N5M4j25J40j81J06L9r1q0K01
5642G6p2m7O6j8J4k6k6J13j42L2L9q2R9O3k85K51n8j4M3l8K3R6j06j5J19k53J55
5669GR2j38J40K5k37J39K8j53J27o7N0K3j14K3K49l02J16M2r5K3o8L8P6n2p2K71
5695A71k97J85n2j23J14r5J4J75j28P9p4l8K25j53r6J22L6k12K65j50%J08j65
5718h9P5L3j03K25j9k49J77J35l14K29j21p7J95j81O5J19j91LK78k61K28q0p6
5741APj63J83N6o7o8P8k13J94n4Q9l8K2q9J54l5j8rrk5M4mm1J24j01k4L1LR7r7
5771B8J6L9j03l2J49k11J57q8N5M2j28p0J41rjJ05k29J97j3j45J20Kn6J42j74
$$ plain form
5796 -66 -86 46 -150 -53 -67 -128 -2 -8 -23 11 40 42 34 -38 -2 21 34 -31 -43 -92 -60 85 5 99 62 -76 42 -53 -15
5825 -15 48 -66 -56 30 -41 -41 110 -109 3 -149 -2 68 -85 23 47 -29 15 1 -93 -46 59 -4 60 46 -100 75
5851 75 121 -60 22 -19 -63 91 13 85 13 -58 78 -65 -40 94 -116 -69 82 -10 -5 56 -70 -16 -69 -19 -152 104
5877 104 46 85 -28 38 146 -30 3 88 88 165 121 -35 65 -35 -88 51 -60 -105 79 -106 3 55 -55 -30
5901 -30 2 -65 129 46 -28 83 -171 -61 -31 65 -56 -62 -86 133 -29 -15 -24 -23 -9 54 19 215 60 -90 113 67
5927 67 19 11 120 -45 82 -31 8 82 -113 -10 95 -55 48 -30 -10 76 9 -100 88 55 -38 107 -33 64
5951 64 24 -62 60 44 4 126 -82 -50 58 -88 -81 -4 66 80 70 -101 -73 15 -51 104 124 -84 60 -82 77
5976 77 83 -45 -11 -2 -48 144 -1 -61 39 21 67 -22 104 -20 -11 10 97 49 -139 -57 38 -89 84 9 96 81 2
$$ packed form
5796f6k0J32j96R7j4o1J26oj5L4K9Kqp2L6K3J3o5j2m9L2J45q0R4l7j38J18r5L8
5825a5O3j14J0Q6p1%J51k19J12j52J47P0j53J08K4p6M4j4r4M7J05o3O4j4j46J75
5851G5M6j81Q2m1m4J54p8P2p2p1J36j43K5J34k10M7J51r2NO1j26N4n3N0j33K56
5877A04n8L9j13O6J08j76L3Q5%P7m4j56J00j00n3J39j11m5J84j85J09N2j10K5
5901c0L2o7J94q3p4J11k54J10L0R6j21ok4K19j62J4rJJ4O3l5J96j55j50K03m6
5927F7m8qJ09j65J27j13L9P4j95J03J05j50J03p8K0Q6o7j09J88l3r3J45j40R7
5951F4m0q6J22j6m0J22k08L2J08j46PP7P0J4j0j71K8Q8o6J55K0k08J44j42J59
5976G7Oj28L4Rm6J92j45o0J00j8M6q9J26j24RK1Q7m8j88Q2R5j27J73p5Q7j5p9
$$ plain form
6003 2 74 165 -26 96 6 -42 13 38 -27 98 -83 -74 76 -121 48 20 -92 84 35 -34 65 74 -6 84 -147 -129 83
6030 83 -4 -7 41 -15 18 -50 31 -20 -19 3 92 -21 -22 51 38 -52 18 -138 -52 68 -5 55 18 31 72 -22 -32 -18 1 20
6060 20 -24 -58 45 -2 -99 38 52 22 75 18 -82 -71 -85 18 -86 -100 -49 -52 -67 -10 -6 -47 115 37 29 69 -131 -28
6088 -28 36 -3 152 101 -108 -25 -72 -24 115 8 67 104 53 80 41 -143 -33 -62 -80 4 40 40 -59 -28 -21 -3 55 71
6116 71 -36 -25 -16 -24 -76 72 -34 -92 74 -60 -40 -74 -4 73 -84 -105 -91 -87 -162 23 -7 -27 79 -65 37 -66
6142 -66 -54 55 48 11 -50 31 -65 -1 -60 -32 86 -36 26 45 -118 3 -26 -39 27 3 -96 -42 -116 -109 -3 -159 148
6169 148 28 -48 -99 -18 -40 145 -93 -120 46 -95 8 -45 -144 36 56 -53 -29 43 -85 103 -77 -114 -8 -16
6193 -16 35 164 21 -49 29 -128 32 -76 59 190 -48 23 92 -117 -17 -86 -102 -118 -58 -56 0 -14 -59 -8 -25 134
$$ packed form
6003BP2R1j91J22r0m8N5K5o5J25j81RJ50j97J69k8j12J76m9o9R9Rq0R0k31J8K12
6030H3q7lM8n6L3o8Q1n1JK2Q9j13jP3j3r0P0j56Q6J20p3O0l7J3M1r4j0J4J9J9
6060B0m4l4J03m7r7J37J4l0N3n7j00J1j4J03j04j4N1lj5N7Mm1J62p8qM0k00J03
6088b8O4l9J55n1k09Q3m7M8J39j07N9L7n1K7l9j84J10k9j8Q4L6%r9L1PJ8N8J6
6116G1j07J1Rqn2J48j06n8J66j34K0l4P0P7j57k1J4Mp5J85l0k0J06j44J02j03
6142f6J2J09pl7o1Q1r6O4n9K8J18j22O2J9j63J21k9j3O6k4r9N4p4PJ06j56L07
6169A48j20p6n1Q1k2J85k38k7J66j41J03n3r9J80K0j09K4P2j28J88j80l7J06q
6193a6N1J29j43p0P8j57J60j08J35J31k38P1O9k09J00o9j6j6O0KN6j4m5N1j7J59
$$ plain form
6219 134 56 -26 -40 -69 44 18 -10 -37 -42 74 -40 37 46 -4 71 -48 0 -20 50 -5 92 -39 -103 -76 -106 185 -116
6246 -116 -54 -95 -169 110 -65 47 -92 -100 -44 43 -4 -37 67 32 -46 104 -124 1 97 -18 51 -39 -127 64 -8
6271 -8 -11 -1 47 -26 71 21 -42 -39 -27 10 82 -25 57 43 -93 110 -127 -43 -74 36 -39 -11 -29 11 -177 -166 43 86
6299 86 -63 16 -26 -74 43 -71 79 58 -16 10 -103 -7 33 -16 -2 52 17 8 101 -90 39 -35 1 -31 51 -131 -78
6326 -78 17 23 60 -86 -70 -70 -37 31 -27 -64 72 -85 -28 -18 34 112 51 -63 -8 94 -120 13 -21 61 10 -5 23 -74
6354 -74 74 65 44 -88 6 -53 58 61 35 -105 21 -22 36 22 -45 -21 42 39 91 -168 -66 -7 150 -44 -8 -3 11 39
6382 39 25 -121 120 44 -19 -16 35 132 -17 -35 108 -2 70 43 -9 -12 7 -11 18 36 -98 62 -19 -31 69 -92 20
6409 20 2 -75 33 9 4 -31 17 -89 83 -10 -106 96 -134 24 -123 9 -19 -18 22 37 63 -95 118 1 -16 -63
$$ packed form
6219A34p8q2j4k9J13k6k8k7nJ16j14P7Rn0P5j19M8k0P0n5R7j31o4K7l0K91l01
6246a16O2m1p4K79j75J12j39qN6Q7m7l3J04l5p8J50k28J25R6j15O9r0q8J91p2
6271hlJ0M8p3R7n0o3LJ2L7P2j07Q2j4j36K03k37Q4l1J10p5K8j8M0j88J1K09M3
6299H6j49P9m2m8J17j14J50k1p4K6j13R6M0m9J4N4l5rR3j91J29p4L6l2Q2j82N3
6326g8R5OL7j46J6%L3O8n8l7J36j57N7J0N2P8o1j14N5J02k14J33l4Q2n1j5K8r7
6354g4J48rk1j32R4n9J11Lk6j40J26m3N8j4o7K4O3lN2k59J02N9J57j94L6NJ4K8
6382C9j4j46K41p6o3LN1R7j49j8J43j10P2k7n2lJ9j8K9J8j34J60q1j2J00j61J12
6409B0j8p7J08k4nl5M8j06J72r3r6K02k30J58j47J32k8JM0J5K6j58K13j17j7m7
$$ plain form
6435 -63 -4 76 -85 -38 -87 48 27 -14 45 -21 64 64 103 32 -55 -25 -27 -26 10 82 -7 115 66 -60 78 32 -96 -39 -10
6464 -10 43 -32 -2 -44 -9 -71 98 32 -146 12 -82 116 42 -18 -17 4 -20 29 3 -109 100 -37 -19 5 78 -16 3
6491 3 -12 16 91 -39 -2 66 -145 -73 8 -59 20 -59 -25 -44 44 -39 71 56 -48 86 -19 25 -30 -65 92 -6 44
6518 44 52 -12 117 92 -68 176 20 -20 -53 43 -34 -4 -53 65 34 63 -65 93 -58 -60 -124 -88 57 -62 -22 -102
6544 -102 -35 32 -29 -23 8 60 -117 116 62 -8 53 -29 47 67 17 -58 -5 -95 34 -15 -23 -64 23 -113 -9 30 -103 -16
6572 -16 -117 39 -7 -153 -11 -38 -61 -75 47 -44 73 -25 27 24 8 84 54 -83 -38 -33 -50 59 61 -34 -23 -103 -3
6599 -3 5 -75 -40 9 -37 22 92 -108 80 2 21 88 -16 17 -54 -103 15 -55 92 -82 -2 20 -70 -11 4 73 -46 -26
6627 -26 22 -208 94 57 -31 0 120 -25 -42 33 -3 93 15 -18 -74 -122 -2 54 -87 -71 1 66 38 2 -111 103
$$ packed form
6435f3N9Q0j61M7m9J35k1m1N9o6Q5%L9p1q7L0kJL6P2q9J22m9j26J38m6j28N7K9
6464a0N3p5L0m2L5o2J69o6j78J58r4J98p4o0JK1k4M9k6j12K09j37J8K4P3r4J9
6491Cj5K8P5j30L7O8k11P2Q1o7P9p9L4j9Q8q3J10j5j04J34j05M4n5l5J57r8N0
6518D4Qo4J29k5j60K44j56m0l3R6p7L0m9J18l1K9j28J58j51ko4L6J45j19M0q0
6544a02O7O7o1OL1N2j77K33n4p0O1q2P6K0n0p5N3r0J29m9qm1Q7j36J04L9j33Q7
6572a6j01J56m6j46J42k7k3j4J22r1J17r8N2lj6P6l0j37M5Nj7J09Kr5J1q0J00
6599cQq0L5M9m6N9P0k00J88p8J9O7j04L3p1m9J18p0J47j74Q0K2r0N9J5O9j19K0
6627b6M8k30L02l7q8L1J20j45j7P5l6R6p8l3n6m8J20N6j41J6P2O5k8l6j13K14
$$ plain form
6653 103 35 52 14 134 -56 68 32 62 7 -16 1 -174 7 -56 -13 51 -85 -40 -83 26 -26 29 -56 -59 -11 -132
6679 -132 16 79 -36 18 39 -61 27 -24 -88 5 -90 22 -49 -60 -23 7 -57 -78 12 -111 75 -21 -29 62 -159 -29
6705 -29 117 69 -10 45 9 83 0 31 49 28 47 111 -25 -33 81 -163 6 -40 16 47 99 -14 12 -41 -21 9 -55 31
6733 31 27 92 69 15 -96 15 -44 -54 57 -33 10 3 -6 12 74 -40 60 49 -13 18 120 -67 60 -136 -50 18 -35
6760 -35 43 70 -64 74 8 -49 -13 -35 -46 -101 14 14 -32 -38 -95 66 -46 -73 -56 94 47 33 -108 36 14 68 -16
6787 -16 7 -77 58 41 53 -55 18 -3 -31 -4 106 -71 -20 42 -64 4 -56 68 -12 -42 -92 28 -78 -36 21 -16
6813 -16 16 -35 36 -24 23 14 -3 -27 -210 -14 0 6 28 -46 -19 64 21 37 121 25 -53 -29 45 22 60 -15 72 -19 -97 -7
6843 -7 0 -36 84 -65 -23 -24 -5 -9 60 38 57 42 82 -42 -42 57 -92 -6 178 96 -36 -116 11 -92 102 41 -32 47
$$ packed form
6653A03o8J7l8J20j90J24l6L0n5k3J7j75J81o3M3O4j36M5m3J09n2N5q5lM8j21
6679a32J48O3j15N4K1j00Q8n1o4R3r5J12p1j1L7L0o4k1R0j23J86r6qR1k21J30
6705b9J46m8p9N5l6P4q3L1J8k1J9O4j36qJ14k44J69m6N6L1N2j13K6n3K0L0o4Q6
6733C1mO5k3n4j11J11n9j0J11r0M3prJ8O2j14J00j1o2L1J02j87J27j96Q6O8n3
6760c5P8K7j34J38o6n7L6k2j1n5J15%m6on7J61j12k7J7J50m7j4j41J44k2N4q4
6787a6K3q4J35j7J2j08P3k1k8K7J10j77N1O2j06O8o0J24q0l0n0J20j06M2N7l7
6813a6L2n1P1o0M7rj7k4j83J96J4OK2p4K7Q3m3J6Q4r6p8K4P4k3L8p5Q7r1p8R0
6843gPl6J20j49M2jJ9mO9k2J9j5M0j24%R9j49Q6J84q2j32q0J27j03J94o1p3P9
$$ plain form
6871 47 -106 94 85 -23 -17 40 51 69 -17 64 49 -72 -110 30 -37 52 59 19 -8 0 -52 -6 -140 -55 99 35 146 -5
6899 -5 -69 36 101 17 92 27 -4 67 -45 97 75 28 75 -27 71 8 -57 60 -52 -12 -70 -85 -19 -75 29 17 38
6926 38 -59 -42 -123 2 96 56 -141 9 -22 -75 -9 106 7 91 45 -116 87 -37 -27 -62 -16 -104 30 -64 -39 43
6952 43 -111 -121 -25 52 146 18 111 -19 -90 -84 -52 51 -47 26 71 58 52 8 107 29 44 62 -65 -53 67 -4 97 12
6980 12 43 -27 75 -48 42 -114 -27 110 104 153 29 -9 -23 10 -72 -42 -72 -17 102 8 18 92 -27 74 -1 -16 31
7007 31 -120 31 -9 30 0 -16 10 -39 10 77 -91 -58 -10 77 -2 -11 -4 -95 -54 -5 -13 -87 67 14 18 -64 -23 -16 -13 30 170
7038 170 -63 -114 91 -13 44 61 68 3 52 8 42 -19 -58 -18 16 16 37 36 -124 -91 -56 -20 -48 -27 0 -74 63 15 6
7067 6 -49 78 -51 21 90 21 51 64 -62 -87 58 134 -11 33 -60 67 -10 -40 -32 -112 114 41 -34 -26 -77 30 53 137
$$ packed form
6871D7j53K00rj08ON7J1J8q6Q1j5j21l8J40o7Q9Pm0k7Qn2M6j34Q5J54o4J11j51
6899eo4J05O5q4P5o5l1P1j12J42k2m7M7j02R8o3o5J17j12M0n8j5O6n6J04j2K1
6926C8r7J7q1J25R4m0j97J50l1n3O6J15r9Q4m6j61K03j24J0l5M6q8J34r4K5Q2
6952D3j54j0R6P7R4j28R3j30p1OL2J03r8P3M5j3om4R9p8J5J8j27J2J20p1J01q5
6980A2L1p0J02j23R0j56Q7J37oM9j24l8j4L3q2L0l0N5J19r4J0P4j19J01p5j5M7
7007C1j51J51m0L9l0j6K6m9M9O7j68L3M8Q7p9rPr1M1M9qp4J54n3Mq2M1PLM3J40
7038A70k33n1K05j04N7J7Po5M9m4L4o1l9M0L4%K1jj60L3L5L6k8K1K7p4J37m8r
7067Fn5J27j29P2O9o9L0J3j26k5J45P6j45M4r3J27p7l0Qq0K26p3p5Qn1J07K3Q4
$$ plain form
7095 137 -10 45 29 68 71 3 33 -51 -45 -38 34 83 47 2 -86 -44 -119 -4 -135 72 72 56 76 57 -83 -18 -44 0 -84
7124 -84 42 -41 43 43 4 72 -72 -67 -30 -49 1 52 -54 30 -50 -2 54 -27 -16 93 -6 -11 32 -8 -62 4 -80 -66 90
7153 90 31 -75 -33 -1 -17 -30 -8 75 -45 -20 83 73 -31 -66 -131 -15 -8 -39 103 24 16 81 -2 -64 -3 -112 -102 -62
7181 -62 -37 20 4 -55 57 44 25 88 -45 4 -15 -11 -19 88 82 92 109 27 19 50 2 95 155 -21 42 59 74 -7 -5 -64 6
7212 6 13 -18 -19 5 -47 -39 53 87 52 4 4 88 83 80 9 -29 32 -4 -66 -6 -22 -14 30 -117 -111 24 30 -80 46 -53 14 44 21
7245 21 -6 -49 44 11 -9 2 58 -15 11 28 -1 17 -14 13 -109 25 -34 -37 -67 -58 -11 119 -30 28 -1 -31 -37 -43 69 31
7275 31 15 -47 -122 -53 -75 -27 -26 -111 54 -22 0 -13 -50 16 -61 65 -55 29 50 -46 94 48 30 -142 -108 39 -27 23
7303 23 127 -78 -145 86 -106 -3 -10 -58 24 42 -95 100 -121 -8 131 -35 -61 -88 5 -46 67 -57 73 -11
$$ packed form
7095A37j47N5j6L9Lo8L0q4OPP2M9l6m5q8M2p5J15j31K07%j6K0j9j40O5k6M4q4
7124h4J26q3Q4%l9O8j44NL7j9N0N1j06Q4q0M8N6q1J1J09r9nM3m0n4O6q4J4J56
7153I0n9j06M2L2j6j3K2Q3j20K5J03j0j04l5o5J16Pl1J42p9qO5q3o2O1j09J0M0
7181f2K5N7j6n9J12j3j9O3j33M9j9MqJ07oJ0J7q2qL1m8R3O0j76O3J7J5q1Kn9P0
7212FPl1jK4n2QR2L4l5m8%Q4nlp1l8O1l6o2O0j6QM4j47OJ35Oj10J26r9O7L0k3
7245B1k7m3R3l3k0J1N6p3K6J7k9J8l1K7j22J34n9ll0RM7J30j49N8k9l0ooJ12l8
7275C1j6o2p5O9k2M8Jq5J65p6K2j3l7O6p7J26j20Q4K1r6J40m6j8j72L4J47o6N0
7303B3J04k05o7K31j92J03pm8Q2J8j37J95k21J13J39j66k6k7R3n1J13j24J30q4
$$ plain form
7327 -11 -56 119 54 -53 80 63 104 -21 -101 28 43 -59 76 -32 -67 53 4 -22 -99 23 136 -93 17 -25
7351 -25 -154 -96 -20 -108 -66 6 -136 89 7 54 -1 -120 34 -5 -23 -50 14 -156 -15 -25 28 45 -75 -114 1 -39
7377 -39 17 -62 3 23 -127 -61 10 36 -150 66 47 30 40 58 207 73 -10 -41 23 16 -77 -62 0 -3 35 28 72 -1 -31
7406 -31 -8 -79 -5 44 -15 -9 -13 -13 13 -44 70 16 -48 -93 89 16 11 25 109 -125 -85 -53 103 -58 -2 58 -52 41 23
7435 23 -19 -42 -42 -23 -63 30 -128 57 -32 -61 63 -49 65 50 -45 75 103 -70 -103 0 14 -70 -81 -106 35 -29
7461 -29 52 37 -16 34 -20 84 -44 86 -9 -1 15 9 35 -6 -12 16 10 -29 31 57 45 -58 27 -9 4 -103 -9 -61 -11 67
7491 67 -92 -75 87 29 -36 25 20 -71 32 197 128 -16 100 81 -59 -76 233 17 53 26 64 84 -10 59 33 -17
7517 -17 14 -1 -40 43 101 -105 -64 31 44 -10 -65 89 88 5 8 178 -29 5 -168 93 79 6 5 9 -18 -37 6 -114 107
$$ packed form
7327a1m5J75o5j07J33j7M1j25q0J29J5j02J35j08l5J20m9k6p7J22J13k29J10m2
7351b5j29N8P6q8M2P2j42K25q2M7n5j19J54l9j8k7O4j70J41j0N3J7j20l9J15m0
7377c9N6p9O5K0j50O6P1K6j86K16j9j7J0J8J49j34q3l1O4pr3J5O2lL8pM4p3l0
7406c1K3p1P4M9n9Om%K6n7J14n4o4m5J82p3nJ4Q4k34M0L2J56j61N6O0j10R3j8
7435B3m2k3%J9m0R3j58J85q9k9J24j12J14j5r5J20K8j73l3J03J4q4j1k5J41o4
7461b9Q1j5n3N0n4J04j28J30r5QJ6oK6m1oK8ol9O0K6j2j03Q5l6J3j07R4n2N0P8
7491F7j59J7J62n8o5O1nr1J03J65o9j44J16j9j40j7L09k16L6k7L8K0r4O9k6n0
7517a7L1j5l9Q3N8k06M1R5J3n4n5J54jq3LJ70k07L4j73K61j4p3jMk7j9M3j20K21
$$ plain form
7546 107 119 33 13 99 52 4 -18 -48 73 -148 -1 133 -16 79 117 58 -3 -10 10 3 78 2 69 -23 8 -64 -105 7
7574 7 24 -8 94 -73 -56 -41 -28 -54 -49 -13 -74 58 -59 -15 -37 -55 96 -80 105 103 -9 62 33 -77 11 79 -8
7601 -8 46 -32 -7 85 -97 66 119 -63 -9 28 -49 -97 -9 -12 107 -122 -79 -24 -33 -9 -94 85 30 -70 -41 67 -29 -50
7629 -50 65 -41 -25 41 37 5 6 16 -41 5 -122 -41 -165 70 0 40 -39 -31 15 21 28 84 -37 229 54 110 55 94 50
7658 50 -78 -19 -77 -96 73 96 44 79 -51 -108 51 32 -64 67 -64 33 -26 43 -60 -41 -80 19 -23 -18 -75 -23 15
7685 15 -89 81 38 -32 69 68 -46 -52 12 -30 35 -97 62 -47 -98 -3 -11 -5 120 69 19 -161 36 55 -93 -5 0
7712 0 30 -7 -21 -42 -12 11 138 -18 5 -8 -20 -40 73 -6 -85 64 -44 -11 -5 83 91 50 -31 1 -20 8 48 -95 -9
7741 -9 43 71 -3 36 -107 -13 65 58 26 28 -118 190 -27 -49 23 -14 -31 119 50 32 -9 -118 6 -119 28 -21 -27 -60
$$ packed form
7546A07J2q6k0Q6m7m8k2l0J21k21J47J34j49R5L8n9o1pK0pP5p6O7r2L1p2m1J12
7574GJ7l2J02j67J7J5J3k6NL6o1J32j17M4k2j8J51j76J85kj12P1k9j10Q8O8q7
7601hN4p8K5R2j82J63N3j82N4L7p7m8Q8lJ19k29M3N5rK4q5J79n5j00K9J08r6k1
7629e0J15j06J6O6ml2JJ0n7M6j27Q1j24K35p0M0p9QM6OPN6j21K66j75N6n5L9m4
7658E0j28N9n8j9J69K3n2L5j30n7J59j9r6J31j31R7n9O9j03J9l9R9m2Nn7N2L8
7685A5j04J70m3p0J01jj14oO4m2O5j32J59j09n1R5qOJ25n1n0j80J97J9j48Q8N
7712@L0l7j4k1L0K3J27j56K3j3j2k0J13p9p9J49j08L3OQ8Qm1q1L2k1K8M0j43Q6
7741iN2K8p4L9j43R4P8pl2Kj46L08k17k2P2l7j7J50o9j8m1j09J24j25J47m9ol3
$$ plain form
7769 -60 -54 -36 22 -51 33 -40 93 -153 46 56 68 16 41 56 57 -22 -56 28 -38 -60 14 -34 1 -72 -207 52 74 -13 77
7798 77 -86 -23 10 -11 114 61 6 76 -13 -47 -102 -17 -62 62 -59 -49 84 -77 -27 -31 -41 -95 129 20 3 -71 -9
7825 -9 -17 17 6 50 -23 135 52 -61 -56 -48 -70 -62 -60 48 133 32 -1 12 -19 22 27 13 -21 -110 47 68 38 54 59 -36 -100 99
7857 99 -81 36 -35 61 38 125 -92 50 -48 86 -45 -23 162 -118 -105 -88 -5 -26 19 -59 8 -67 50 47 -65 -3
7883 -3 63 33 -94 -49 5 -89 6 69 -86 119 74 18 -7 -83 18 66 46 -76 14 49 37 -1 47 -7 22 -56 -73 -141
7911 -141 62 53 -93 -10 -48 -29 35 71 -74 7 -34 -82 -11 -116 53 -25 -22 -42 -37 -18 -7 -124 -52 -43 -29 -105 34 -22
7939 -22 52 -85 82 -51 -38 98 86 0 -141 -29 -94 -44 101 -51 51 -88 -87 75 32 -3 8 -25 36 94 2
7964 2 -21 41 -11 -7 81 -95 38 -18 1 -17 60 -66 -12 1 -72 -27 -89 64 17 27 49 -89 -43 -18 -2 70 -12 96
$$ packed form
7769f0OJ8N8p3Q4p3J33k46J99J0J2n2K5J5Jp9l4Q4o6k2P4m8L5p3j35K59K2q7R0
7798G7j63O3L3k1J25n3n5P0q9l4n5Q5m5J24j21J0J33j61N0mj0n4K24j09j7p4O2
7825iqL4j1M4p3J58q3j13NQk2QKJ08Q5j01l3J3l1M1Nj4l4q9J57K1l0J6Nr5o4J99
7857I9j80J17p1R6k3Q7k17J42r8J34j31K2J85k80J3J7Q3k1M5p8O7p5J17lj12O2
7883cO6l0j27M5N4r4R5O3j55K05m5n6k5p6J01M8k0j22R0L5j2l8M8n4K9p8j7o8
7911a41K03rj46Q3l8J9O4L6j45Q1m1m8P1j05J69p8Lk0NJ9J1j17P2RJ4p6J39n6
7939b2P4j37J67j33J3J36j2q6j41J12o5N0J45j52J02j39JJ62m3l5J1l3O1N8r2
7964Bk3O2n2MQ8j76J33n6J9j8P7j26N4J3p3M5o2J53m7J0K2j38M6K5J6P2q2J08
$$ plain form
7992 96 69 23 18 -103 116 5 62 94 -98 -68 -4 -6 27 40 -14 -75 -91 -45 -15 38 -69 37 -36 58 -1 -30 38 -13
8020 -13 -50 14 -61 22 -49 36 -60 -36 -90 -12 -7 -58 -2 59 38 -68 -27 43 -64 -150 86 -76 41 80 -124 23 84
8047 84 -95 19 -94 -18 -13 -29 -61 125 32 -43 -72 -84 82 -34 33 -27 100 -16 -21 29 -48 -5 34 5 47 -95 8
8074 8 -19 -22 66 62 15 53 80 -49 -81 -82 -74 55 -91 -35 -6 -66 49 -50 -107 -9 21 41 87 -84 38 7 -13 39 -15 55
8104 55 62 -135 -61 78 38 29 134 45 19 -63 13 -151 -78 -103 3 69 -56 11 -18 -29 -13 20 -11 54 -64 43 -125
8131 -125 -103 -31 -1 -111 -1 4 -28 28 37 -33 83 -10 -8 9 42 2 64 -37 11 -16 -39 8 27 -41 64 -47 14 -24
8159 -24 0 120 -1 18 18 -12 46 -13 -32 40 19 -9 51 -24 3 93 -26 40 -50 -91 50 17 -109 18 21 16 65 26 -7
8188 -7 13 40 -18
$$ packed form
7992I6k7m6nj21K19j11N7L2j92L0O4kL3J3n4o1j6M6L0N3j07J06p3R4n9k9O8n1
8020a3l7O4p5Q3p1Q5r6K4n4P8Nn1N6O1k1j06M1P0j07q6K36j62J17L9k04J47O1
8047H4j79J14j13P6Nj6l2J86r3p5k9j2J66j16O7o0J27j16nN0p7M3L9k9M2j42J03
8074Hk7lQ8mm7L8K7j29l2jQJ29j46N6K9o0J15r9n7R8L0K0M6j71J22l1k0N2n4P0
8104E5Pj97P4J39m0rJ05q9k6q2P6j64P3k5J06O6j25O7k9j1J6L3l1O5j18J07j68
8131a25K2P2L0j10J10Nl2N6Rp0J16r3KJ7L3m0O2j01M8k7k3M7J9o8J05j11O1l8
8159b4K4J20j21J9%l0N8n9j9P2k1k8O0p5K7R0j19O6r0m1J41l3j26J27LnM9l9l3
8188gK0K7n8
8191a8
$$ Imaginary data points
##PAGE= N=2
##DATA TABLE= (X++(I..I)), XYDATA
$$ plain form
0 0 0 0 0 0 0 0 0 0 0 0 0 8 -8 8 -8 16 -16 16 -24 24 -32 40 -48 56 -64 74 -88 104 -120 136 -152 176 -200
33 -200 224 -256 288 -321 361 -402 449 -499 555 -612 681 -753 830 -916 1012 -1114 1229 -1351
51 -1351 1489 -1641 1812 -2002 2217 -2461 2742 -3070 3455 -3918 4486 -5204 6139 -7418 9274
66 9274 -12229 17650 -30807 130069 60797 -198035 116544 138165 -109645 -52131 132399
77 132399 -16488 -105343 49644 62823 -109185 -25106 87546 -41201 -75802 44149 4046
88 4046 -47005 2456 15155 -26424 -26685 27076 27207 -63802 -20873 75771 -15595 -73515 38154
101 38154 37290 -55961 -20081 45888 -18367 -50712 51504 30181 -90648 17275 100924 -61798
113 -61798 -47742 100018 -870 -70556 57873 45625 -62632 -733 75620 -16787 -60521
$$ packed form
0@%%%%%%%%%%%Qj6J6j6K4l2L2m0M8n6P2q8J04j20J38j62J92k24K56k88L28l76
33b00M24m80N44o09O82p63Q51r48J054j167J293j434J583j746J928k126K343k580
51a351K840l130L453l814M219m678N203n812O525p373Q404r690J1343j3557J6692
66I274k1503K9879m8457J60876o9272k58832L14579K1621k47810N7514J84530
77A32399j48887q8855J54987J3179j72008Q4079J12652j28747l4601J19951m0103
88D046n1051M9461J2699m1579k61N3761J31r1009M2929R6644r1366n7920J11669
101C8154q64r3251L5880O5969o4255l2345J02216k1323j20829J07923Q3649j62722
113f1798J4056J47760j00888o9686J28429j2248j08257O1899P6353r2407m3734
$$ plain form
124 -60521 51747 44246 -58455 1662 47314 -26135 -3014 29783 -23025 -8330 25608 -667
136 -667 -11244 -3804 8627 6957 -17884 -2351 10911 -15320 -8887 1129 -14444 -13340 -4961
149 -4961 5622 -10690 -33941 14705 22056 -39759 -328 35373 -24881 -6195 35475 -11807
161 -11807 -14752 29342 11740 -21338 3506 32707 -6678 -22552 28946 6541 -29038 26112
173 26112 13394 -36845 11374 21574 -22233 -2651 13390 -3595 -4547 1122 6178 -3067 -3294
186 -3294 13430 -6298 -12746 14929 -661 -10792 5509 -6230 -94 6036 -13592 4795 7855
199 7855 -16317 7565 10437 -15623 3736 10622 -8483 -5141 4063 7797 -5173 -9145 12971
212 12971 -2371 -13819 17364 -496 -18636 13893 1245 -15417 9402 2140 -7480 4092
$$ packed form
124f0521J12268p501j02701O0117M5652p3449K3121L2797n2808J4695L3938k6275
136f67j0577P440J2431j670k4841J5533J3262k6231O433J0016j5573J104Q379
149d961J0583j6312k3251M8646P351o1815L9431L5701o0254J8686M1670m7282
161a1807k945M4094j7602l3078K4844K9201l9385j5874N1498k2405l5579N5150
173B6112j2718n0239M8219J0200m3807J9582J6041j6985r52N669N056r245k27
186c294J6724j9728o448K7675j5590j0131J6301j1739O136O130j9628J8387L060
199G855k4172K3882K872k6060J9359O886j9105L342R204L734j2970l972K2116
212A2971j5342j1448L1183j7860j8140L2529j2648j6662K4819p262r620J1572
$$ plain form
224 4092 -615 32 1629 745 6745 -5105 -1258 12437 -7329 -3007 11611 -10082 -2610 9992
238 9992 -9406 112 5691 -8317 3312 1638 -5646 6312 -2560 -5386 4378 -3915 1253 2856
252 2856 -6611 5325 278 -6353 11236 -849 -6950 11333 -3211 -5058 10875 -3152 -2250 6348
266 6348 -4343 1976 3724 -2188 4904 -2565 -1537 7084 -7081 -498 6758 -12263 -1317 6283
280 6283 -10744 360 3717 -7930 1554 59 -2079 4961 -4880 -121 5648 -7142 2574 5600
294 5600 -7258 3201 1402 -5359 6528 -1661 -4459 6288 -5676 -2464 6334 -6155 419 3234
308 3234 -6918 4656 3391 -3325 7199 732 -522 7883 -1673 3576 6318 -6729 4346 4673
322 4673 -7990 5593 2541 -8277 3626 -130 -3640 2946 -3699 115 1378 -7313 4443 2102
$$ packed form
224D092m707O47J597q84O000j1850L847J3695j9766M322J4618k1693P472J2602
238I992j9398R518N579j4008J1629j674p284J1958q872k826R764q293N168J603
252B856r467J1936n047o631J7589j2085o101J8283j4544j847J5933j4027R02Q598
266F348j0691O319J748n912P092p469J028Q621j4165O583P256j9021J0946P600
280F283j7027J1104L357j1647R484j495k138P040r841M759N769j2790R716L026
294E600j2858J0459j799o761J1887q189k798J0747j1964L212Q798j2489O574K815
308C234j0152J1574j265o716J0524o467j254Q405r556N249K742j3047J1075L27
322D673j2663J3583l052j0818J1903l756l510O586o645L814J263q691J1756k341
$$ plain form
336 2102 -8574 4692 162 -6657 5811 -1593 -4221 4001 -5767 -2325 2764 -6585 -167 -1557
350 -1557 -7765 3273 -2308 -5288 6767 -2872 -3635 6839 -1065 2635 5589 -2907 5799 3656 -2667
365 -2667 9012 1569 -3196 8426 -862 -1627 7461 -2003 235 2926 -4071 3352 496 -4665 4704
380 4704 -3629 -4856 6679 -3599 -3208 4319 -5904 -141 2686 -7573 892 587 -6898 464 -2913
395 -2913 -2535 3095 -6660 -1853 4396 -5803 2076 4471 -6131 2832 3061 -2497 4750 -1083 -1498
410 -1498 6226 -3418 -755 5334 -2853 2649 1617 -5990 5351 2928 -4650 3653 -563 -1318 5759
425 5759 -1649 1206 3912 -2721 5491 2607 -5362 7443 2761 -6332 3763 -435 -2848 3597 -4300
440 -4300 -3995 -266 -3664 2210 -3348 -8074 4627 -2070 -7442 3627 -2969 -3789 4449 -4475 -2624
$$ packed form
336B102j0676J3266m530o819J2468p404k628Q222r768L442N089r349O418j390
350a557o208J1038n581k980J2055r639p63J0474p904L700K954q496Q706k143o323
365b667J1679p443m765J1622r288p65R088r464K238K691o997P423k856n161R369
380D704q333j227J1535j0278L91P527j0223N763K827j0259Q465l05p485P362l377
395b913L78N630r755M807O249j0199P879K395j0602Q963K29n558P247n833m15
410a498P724r644K663O089q187N502j032p607J1341k423p578Q303m216p55P077
425E759p408K855K706o633Q212k884p969J2805m682r093J0095m198k413O445p897
440d300L05L729l398N874n558m726J2701o697n372J1069o596q20Q238q924J851
$$ plain form
455 -2624 4024 -486 2845 -734 -3107 7704 1231 -3025 5695 -2031 -583 7616 -3154 -2627 4310
470 4310 605 1416 -2919 -1192 8220 -3322 -4666 6836 -3872 -2394 8298 -4893 -5657 5303
484 5303 1786 -709 -2136 702 5111 -3801 -446 5044 -6726 1649 7620 -10402 -2959 8711
498 8711 -3043 -3745 179 -1143 1871 -1731 -275 1231 -6300 3025 5137 -9483 -234 6812 -3855
513 -3855 -1550 340 80 4397 -2046 -806 2682 -4894 4366 6691 -9599 -228 9593 -2930 -2453
528 -2453 3300 2178 1529 -1144 2629 922 -4715 7500 2851 -12523 4317 7703 -9210 -813
542 -813 2924 -5787 765 2315 -3546 -3592 -261 5001 -3797 -7937 7829 2378 -8133 4370 1397
557 1397 -4319 6399 1813 -3756 1277 834 3729 -260 -6137 4764 2909 -6227 1581 337 -2704
$$ packed form
455b624O648m510L331l579k373J0811o473m256Q720p726J448Q199j0770N27O937
470D310l705Q11m335J727R412j1542j344J1502j0708J478J0692j3191p64J0960
484E303l517k495j427K838M409q912L355N490j1770Q375N971j8022P443J1670
498H711j1754p02L924j322L014l602J456J506p531R325K112j4620R249P046j0667
513c855K305J890k60M317o443J240L488p576R260K325j6290R371R821j2523M77
528b453N753j122o49k673L773j707n637J2215m649j5374J6840L386j6913Q397
542h13L737q711O552J550n861m6L331N262q798m140J5766n451j0511J2503k973
557A397n716J0718m586n569N033m43K895l989n877J0901j855r136P808j244l041
$$ plain form
572 -2704 3670 -956 -2639 982 645 4084 -2502 -5596 8123 1653 -6801 5903 333 -5958 6525
587 6525 1758 -6160 1655 3756 -728 -5185 -817 5907 -3780 -3610 5460 -5589 -3169 9335 -4267
602 -4267 -6026 6420 166 -2631 673 -901 1698 -895 -1573 2196 -3626 122 5202 -5091 -1763
617 -1763 5515 -701 1154 438 -2096 5055 516 -1656 5150 -2140 -1269 6654 -3358 -2612 6085 -628
633 -628 -3188 -496 -520 558 -3131 -369 1192 -7334 929 5860 -8479 -1189 7379 -4562 -1124
648 -1124 4651 -1973 672 2191 -709 290 -579 2819 988 -5392 2670 2682 -4754 3001 1206 -5263
664 -5263 2949 614 -2956 2825 -1446 -519 3197 -3436 561 4379 -1898 574 1054 -855 2664 -955
680 -955 -628 1860 -3663 1306 2471 -5974 1946 2976 -6087 2512 3393 -4528 1703 1779 -2645 448
$$ packed form
572b704O374m626j683L621l37L439o586l094J3719o470q454J2704n570o291J2483
587F525m767p918P815K101m484m457M368O724r687J70R070j1049K420J2504j3602
602d267j759J2446o254k797L304j574K599k593o78L769n822L748N080j0293L328
617a763P278o216J855p16k534P151m539k172O806p290Q71P923j0012P46Q697o713
633f28k560K692k4J078l689K762J561q526Q263M931j4339P290Q568j1941L438
648a124N775o624K645J519k900R99q69L398j831o380Q062J2p436P755j795o469
664e263Q212k335l570N781m271R27L716o633L997L818o277K472M80j909L519l619
680i55L27K488n523M969J165q445P920J030r063Q599Q81p921O231P6m424L093
$$ plain form
696 448 506 1313 -515 -3193 2893 -171 -3644 4627 -1045 -4427 4667 -1418 -3702 4342 -1319 -2319
712 -2319 2400 -1714 483 1706 -1337 1898 -186 -836 3381 -1348 -498 2433 -3691 999 2462 -4568
728 -4568 2018 1590 -4940 2796 1745 -3316 2875 397 -1999 1671 -268 1074 505 -2251 2520 -769
744 -769 -2762 4389 -1661 -3231 4404 -2512 -2532 4117 -2602 -1887 2193 -2149 475 723 -1563 2120
760 2120 -928 -755 3223 -1560 200 2039 -3525 1566 1743 -4286 2195 764 -4471 2348 366 -2423
776 -2423 2684 -929 -1103 2447 -797 982 978 -1162 2688 -934 -1249 5121 -1609 -2316 4600 -1962 -1326
793 -1326 3173 -2651 -318 993 -3439 1044 603 -2244 827 -1517 -250 1916 -2998 1201 2384
808 2384 -4260 1112 1922 -3448 1879 -223 -3244 2788 -1162 -2058 2985 -1042 -717 1689 -1094 2244
$$ packed form
696D48N8Q07j828k678O086l064l473Q271n672l382R094o085k284Q044n661j000
712b319M719m114K197J223l043L235k084o50M217m729Q50K931o124M690J463p030
728d568O586m28o530P736j051n061O191k478k396L670j939J342n69k756M771l289
744g69j993P151o050j570P635o916k0O649o719P15M080m342K624K48k286L683
760B120l048J73L978m783J760J839n564N091J77o029O481j431n235O819j982k789
776b423N107l613j74L550l244J779mk140L850l622l15O370o730p07O916o562O36
793a326M499n824K333J311m432M483m41k847L071k344J267K166m914M199J183
808B384o644N372Q10n370N327k102l021O032l950q96N043m027L25K406k783L338
$$ plain form
824 2244 608 -1832 3325 -278 -1425 4071 -995 -444 3706 -2430 606 3371 -2901 310 1365
839 1365 -2778 639 -573 -1664 1589 -2575 -1256 2048 -2362 561 893 -3164 2158 111 -3374
854 -3374 3199 -832 -3550 2660 -1083 -1880 2190 -1674 -81 755 -1839 2069 327 -1423 2676 -1468
870 -1468 -217 4594 -2393 -278 4563 -2286 369 3403 -1379 1091 850 -1182 1650 -1298 -411 2503
886 2503 -3137 -681 2514 -2429 842 1181 -3066 1995 486 -2192 1962 -1497 -1190 2100 -3527 -857
902 -857 2569 -3363 -823 854 -2844 558 -70 -1473 636 -2297 905 2919 -3836 1319 3997 -3291
918 -3291 1862 3546 -2063 2603 2584 -1403 904 938 1551 822 -3210 1917 1530 -3622 2684 670 -4306
935 -4306 2800 966 -3420 1220 -145 -443 400 -3061 1021 1331 -3118 1400 -223 -3376 2968 711
$$ packed form
824B244j636k440N157l603j147N496n066N51M150o136L036K765o272L211J055
839A365m143L417j212j091L253m164J319L304m410K923L32m057N322k047l485
854c374O573m031k718O210l743p97M070l864J593Q36k594L908j742j750M099m144
870a468J251M811o987K115M841o849K655L034m782K470k41k032K832k948Q87K914
886B503n640K456L195m943L271L39m247N061j509k678M154l459L07L290n627K670
902h57L426n932K540J677l698L402o28j403K109k933L202K014o755N155K678p288
918c291N153J684n609M666j9l987K307L4O13p29m032N127l87n152O306k014m976
935d306P106j834m386M640j365k98Q43l461M082L10m449M518j623l153O344k257
$$ plain form
951 711 -3193 910 -96 362 259 -2460 2270 932 -3288 3148 443 -3222 4659 921 -4049 2209
967 2209 1637 -633 36 -1118 968 -522 -1238 3147 -2344 -2376 5546 -1592 -3764 4651 547 -1730
983 -1730 1947 -849 280 1258 -513 1069 -2343 -854 4174 -2620 -2733 3142 -1854 -1646 1389 -2292
999 -2292 -181 485 -1555 964 -1925 -350 4814 -2552 -2445 4695 -558 -1136 2615 -1200 -414 1262
1015 1262 97 369 -2269 1050 3389 -4497 -825 4959 -3092 -727 3460 -3150 -333 3345 -1099
1030 -1099 -1342 -564 1345 1582 -3148 676 2488 -3419 976 1862 -4097 1407 2173 -3297 -128 440
1046 440 283 1746 -2417 368 2675 -2160 1501 2187 -3244 1512 2171 -2291 148 202 221 465 -2905
1063 -2905 1062 1817 -3316 1649 1033 -4502 2583 2473 -3673 670 1251 -699 740 -436 1069 596
$$ packed form
951G11l904M103j006M58j03k719M730j338m220O436k705l665P881l738m970O258
967B209n72k270O69j154K086j490p16M385n491l2P922p138k172Q415m104k277
983a730L677k796J129R78j771J582l412J489N028o794j13N875m996K08L035l681
999b292K111O66k040K519k889J575N164p366J07P140n253n78L751l815P86J676
1015A262j165K72k638L319K339p886L672N784q051K365M187o610K817L678m444
1030a099k43P78J909K37m730L824J812n907M395Q86n959N504P66n470L169N68
1046D40j57J463m163K785K307m835L661O86n431M756O59m462K439N4J9K44l370
1063b905L967P55n133M965o16n535P085j10o146M343N81j950J439j176J505m73
$$ plain form
1079 596 -1722 2073 -584 -2863 3822 -37 -4089 2179 1 -1927 1846 -1119 -675 1267 -951
1094 -951 1571 -118 -1932 3102 -113 -2549 2592 -156 -1229 1307 -1657 116 1250 -1590 1230
1109 1230 -896 -2445 3218 -615 -2760 2959 -743 -1837 2439 -871 -446 1696 -420 603 -534
1124 -534 -280 2737 -1915 -1537 3092 -2359 -1054 2823 -2797 -890 2352 -1532 345 698 -826 1430
1140 1430 -961 -578 2465 -1222 141 1634 -2661 568 1638 -2250 909 -191 -1945 1835 -1250
1155 -1250 -1398 2395 -2091 -909 2158 -2055 -4 1773 -1478 612 444 -260 1789 -1214 116 1814
1171 1814 -2281 860 2212 -3270 932 1841 -2867 1309 1488 -1588 1140 -27 -328 1566 -687 964
1187 964 753 -2064 1614 501 -2093 2221 -610 -2203 2155 -1162 -1594 1856 -1733 -620 1032 -2095
$$ packed form
1079E96k318L795k657k279O685l859m052O268k178j928L773k965M44J942k218
1094i51K522j689j814N034l215k436N141k748j073K536k964J773J134k840K820
1109A230k126j549N663l833k145N719l702j094M276l310M25K142k116J023j137
1124e34K54L017m652L78M629n451J305L877n620J907L242l884J877L53j524K256
1140A430k391L83L043l687J363J493m295L229J070l888L159j100j754L780l085
1155a250j48L793m486J182L067m213K051J777l251K090j68p04K049l003J330J698
1171A814m095L141J352n482M202R09m708M176J79l076K728j167l01J894k253J651
1187I64k11k817L678j113k594M314k831j593M358l317m32L450l589J113J652l127
$$ plain form
1203 -2095 533 547 -1928 1018 -68 -671 1667 -1211 104 1588 -2226 1034 1525 -2780 1270 622
1219 622 -2559 1883 273 -1510 1921 -460 -600 1656 -455 881 819 -1288 1773 -73 -1308 2465
1235 2465 -901 -1245 2505 -1628 -543 2169 -2287 -452 1251 -1902 381 308 -1432 903 -687 -268
1251 -268 1816 -1302 381 1412 -2167 1175 1209 -2308 1429 -72 -2479 1467 -534 -1462 1430 -1187
1267 -1187 -533 1213 -1286 782 497 -1322 1597 -104 -738 2331 -1010 -142 2593 -1612 501 2266
1283 2266 -2082 408 1407 -1633 822 209 -1134 859 -1073 -165 1497 -1602 741 1026 -2098 1554
1299 1554 530 -2190 1736 -232 -1987 1596 -719 -973 1192 -1651 -103 751 -1782 806 257 -1531
1315 -1531 1230 -524 -550 1865 -1266 24 1909 -1698 1087 1809 -2023 1112 781 -1964 1199 116
$$ packed form
1203b095K628J4k475K946j086o03K338k878J315J484l814L260M91m305M050o48
1219F22l181M442j610j783L431k381j40K256k111J336o2k107L061j846j235L773
1235B465l366l44L750m133J085K712m456J835J703l153K283p3j740K335j590M19
1251b68K084l118J683J031l579L342L4l517L737j501k407L946k001r28K892k617
1267a187O54J746k499K068k85j819K919j701o34L069l341Q68K735m205K113J765
1283B266m348K490R99l040K455o13j343J993j932R08J662l099K343K85l124L652
1299A554j024k720L926j968j755L583k315k54K165k843J548Q54k533K588n49j788
1315a531K761j754k6K415l131J290J885l607K785P22l832L135l31k745L163j083
$$ plain form
1331 116 -1440 684 -906 -38 683 -1295 1349 342 -1999 2294 488 -1660 2443 68 -1443 2096
1347 2096 -274 -581 1266 -1108 344 -9 -1530 1447 -754 -1992 1374 -1095 -1236 1565 -1444 -599
1363 -599 1051 -1375 908 683 -1459 1762 -43 -1503 2241 -215 -1050 1489 -857 -341 854 -662
1379 -662 847 -472 -960 2231 -645 -1072 2778 -1147 -1051 2564 -1133 -618 1984 -751 -386 146 -140
1396 -140 1111 -1386 -498 1526 -2205 -361 2074 -2477 -504 1744 -1677 140 777 -658 1100 -566
1412 -566 -398 1832 -943 272 1606 -2108 32 1692 -1549 -75 330 -780 775 -919 69 1390
1428 1390 -1892 631 1982 -2423 729 2531 -1947 -146 1351 -224 443 -39 178 283 -1577 1296
1444 1296 741 -2895 1394 1039 -3322 804 1161 -1787 559 279 -709 207 -246 1044 -163 -1996 1746
$$ packed form
1331A16j556K124j590Q68P21j978K644j007k341M293j806k148M103k375j511L539
1347B096k370l07J847k374J452l53j521K977k201j238L366k469j41K801l009Q45
1363e99J650k426K283k25k142L221j805j460L744k456q35K539k346N16J195j516
1379f62J509j319m88L191k876m27L850l925R6L615l697N15K602k735L65N32k86
1396a40J251k497Q88K024l731J844K435m551J973K248l421J817O37j435J758j666
1412e66J68K230k775J215J334l714K140J660l241J474M05j110J555j694R88J321
1428A390l282K523J351m405L152J802m478J801J497j575O67m82K17J05j860K873
1444A296n55l636M289l55m361M126L57k948K346k80r88R16m53J290j207j833L742
$$ plain form
1461 1746 528 -2391 1399 498 -1742 1373 -3 -750 1055 -432 471 235 -1505 2076 749 -2140
1477 -2140 1724 816 -1518 1540 491 -863 475 8 765 -596 -1378 2060 -753 -2482 2260 -184
1493 -184 -2162 1960 -303 -1948 1475 645 -542 -431 9 1195 -1200 -826 2291 -1479 -1426 2405 -1405
1510 -1405 -1479 2098 -463 -882 275 -342 935 -298 -827 1289 -881 -112 2037 -1350 -311 1974
1526 1974 -800 -430 779 -265 758 -751 -643 1561 -1375 -489 2266 -1851 -928 2323 -746 -443
1542 -443 1004 -328 349 -141 7 919 -1143 505 1247 -2467 344 2197 -2423 -493 1455 -1345
1558 -1345 -26 473 -574 46 -696 414 806 -1620 956 1165 -1863 691 1009 -1435 1076 245 -1163
1575 -1163 643 -288 53 631 -1694 699 1163 -1589 782 1029 -1397 775 501 -450 772 -109 407
$$ packed form
1461A746j218k919L790r01k240L115j376p47J805j487R03k36j740L581j327k889
1477b140L864r08k334L058j049j354J338m67P57j361p82L438k813j729M742k444
1493a84j978M122k263j645L423q30j187J11M40J186k395L74L117l770N3L831l810
1510a405p4L577k561m19J157o17J277j233n29K116k170P69K149l387J039K285
1526A974k774L70J209j044J023j509J08K204k936Q86K755m117R23L251l069L03
1542d43J447j332O77m90J48R12k062J648P42l714K811J853m620J930J948k800
1558a345J319M99j047O20p42J110L92k426K576K09l028K554L18k444K511q31j408
1575a163J806r31L41N78k325K393M64k752K371K47k426K172k74r51J222q81N16
$$ plain form
1592 407 507 -1346 1267 693 -1849 1143 387 -1930 1338 243 -1520 638 -171 -544 162 -716 821
1609 821 -44 -1333 1422 -31 -1232 1780 -297 -1363 1333 -439 -448 639 -1093 233 327 -1110 929
1626 929 -108 -1034 1287 -435 -548 1437 -381 11 775 -710 934 392 -830 1410 -382 -1062 1796
1643 1796 -356 -1077 1383 -747 -621 536 -726 200 -129 -783 828 -477 -498 1511 -1128 -434 1701
1660 1701 -1181 -84 1181 -1233 -112 339 -990 576 -215 -749 781 -926 -101 1131 -753 340
1676 340 726 -1057 975 625 -780 1389 -181 -642 1475 -568 -144 1262 -1022 -77 708 -951 336
1693 336 -76 -889 637 -520 -310 1193 -1021 -184 865 -1354 520 861 -1436 501 260 -1219 718
1710 718 -43 -699 526 -742 -12 738 -924 677 393 -1113 1136 149 -780 1515 -120 -415 1537
$$ packed form
1592D07J00j853K613n74k542K992p56k317L268j095j763K158q09l73P06q78J537
1609H21q65j289K755j453j201L012k077j066K696j772rJ087j732J326R4j437K039
1626I29j037r26K321j722j13J985j818L92P64j485J644n42j222K240j792o80K858
1643A796k152p21K460k130J26J157j262R26l29o54J611j305k1K009k639O94K135
1660A701k882J097J265k414J121M51j329J566p91n34J530j707Q25J232j884J093
1676C40L86j783K032l50j405K169j570m61K117k043M24J406k284R45P85j659J287
1693C36m12q13J526j157K10J503k214Q37J049k219J874L41k297J937k41j479J937
1710G18p61o56J225j268P30P50j662J601k84j506K249r87r29K295j635k95J952
$$ plain form
1727 1537 -417 85 979 -812 496 538 -886 829 -38 -916 742 -469 -132 1009 -1053 205 639
1744 639 -1251 784 623 -1199 854 -70 -1046 809 -534 -759 578 -864 -208 164 -1120 563 -261
1761 -261 -1115 1228 -301 -723 1402 -587 -341 1478 -538 287 1006 -724 533 352 -532 1024 -307
1778 -307 -503 1021 -733 -57 992 -862 295 386 -1066 851 282 -916 1005 -395 -678 1107 -738
1795 -738 -389 859 -1022 -187 427 -754 366 -378 -632 744 -727 -374 1200 -1190 -97 1161 -1028
1812 -1028 437 948 -913 375 477 -517 799 -230 -126 642 -1151 397 985 -1328 481 515 -1138
1829 -1138 836 145 -750 951 -208 -195 821 -768 357 735 -1092 663 511 -1029 650 -163 -981
1846 -981 437 -506 12 538 -1325 362 593 -1335 944 554 -1263 848 465 -801 924 195 -252
$$ packed form
1727A537j954N02Q94j791J308M2j424J715q67q78J658j211L37J141k062J258M34
1744F39j890K035j61j822K053r24r76J855j343k25J337j442O56L72j284J683q24
1761b61q54K343j529m22K125j989K46J819k016Q25P19j730J257j81q84J556j331
1778c07j96J524j754O76J049j854J157R1j452J917n69j198J921j400k83J785j845
1795g38L49J248j881Q35O14j181J120p44k54J376j471L53J574k390J093J258k189
1812a028J465N11j861J288J02r94J316j029J04P68j793J548N88k313J809L4j653
1829a138J974o91q95J701j159J3J016j589J125L78j827J755j52j540J679q13q18
1846i81J418r43N18N26j863J687K31j928K279l90j817K111l83j266J725p29m47
$$ plain form
1863 -252 242 -561 604 136 -1053 1011 -273 -1372 1413 -32 -1258 1055 -229 -569 609 -195
1879 -195 270 230 -660 785 -133 -678 1351 -567 -949 1102 -507 -390 648 -682 153 -122 -836 849
1897 849 -178 -822 1392 -601 -670 1634 -371 -423 937 -258 156 88 -333 583 -844 -491 1445 -1330
1915 -1330 -769 1676 -1075 -729 1245 -654 -262 581 -340 166 -291 176 1033 -1168 128 1364 -1329
1932 -1329 112 1031 -1265 53 532 -875 197 -17 -125 558 -1089 215 1245 -1041 213 1014
1948 1014 -1098 445 825 -700 327 -72 -23 512 -1042 321 856 -1728 440 1057 -1535 571 913
1965 913 -1100 190 483 48 133 -458 650 213 -1252 1225 578 -1583 1160 461 -1697 740 446
1982 446 -920 96 -308 61 226 -702 816 1 -1109 1306 172 -1194 1236 160 -761 717 -270
$$ packed form
1863b52M94q03J165m68j189K064j284j099K785j445j226K313j284l40J178q04
1879a95M65m0q90J445r18n45K029j918l82K051j609J17J038j330Q35k75p14J685
1897H49j027o44K214j993o9K304k005n2J360j195M14o8m21R16j427L53J936k775
1915a330N61K445k751L46J974j899L92Q43r21N06m57M67Q57k201J296J236k693
1932a329J441R19k296J318M79j407J072k14j08O83j647J304J030k286J254Q01
1948A014k112J543L80j525J027l99M9N35j554J363N35k584K168O17k592K106L42
1965I13k013J290K93m35Q5n91J108m37j465K477o47k161K743o99k158K437k94
1982D46j366J016m04L69J65r28J518q15j110K415j134j366K430j076r21J478r87
$$ plain form
1999 -270 166 282 -923 522 12 -942 1174 -74 -1374 1040 -102 -845 745 -121 -6 195 -186
2016 -186 933 -330 -647 1564 -572 -1192 1591 -297 -1185 1033 -352 -561 501 -232 354 -259 -318
2033 -318 1010 -669 -347 1512 -895 -412 1323 -649 -187 815 -645 124 -3 -328 717 -651 -455
2050 -455 978 -967 -345 1120 -865 -124 742 -590 298 160 -215 883 -600 -151 1208 -883 -55
2067 -55 1093 -1196 -236 938 -735 13 306 -360 287 -474 349 844 -1082 415 960 -1278 586 883
2085 883 -1072 372 428 -599 571 -174 -279 326 -831 91 511 -1031 580 307 -1010 749 243
2102 243 -474 755 -402 -42 839 -778 322 583 -1296 445 462 -1087 488 -34 -778 476 -263
2119 -263 -152 464 -798 405 252 -957 1065 227 -1117 1085 99 -888 863 -138 -356 531 -541
$$ packed form
1999b70M36J16j205J445n10r54K116j248j300K414j142p43J590q66J15K01l81
2016a86J119j263l17K211k136o20K783j888q88K218j385k09J062p33N86o13n9
2033c18J328j679L22J859k407M83J735j972M62J002j460P69j27l25J045j368J96
2050d55J433j945O22J465j985P41Q66j332Q88j38l75J098j483M49J359k091Q28
2067e5J148k289R60J174j673P48K93o66O47p61Q23M95j926J497N45k238J864K97
2085H83j955J444N6j027J170p45j05O05j157R22M20j542J611k73j317J759n06
2102B43p17J229j157L60Q81j617J100K61j879J741J7j549J575n22p44J254p39
2119b63J11O16j262J203j53j209K022q38j344K202r86r87J751j001k18Q87j072
$$ plain form
2136 -541 225 255 -657 434 -165 -697 1063 -349 -457 1037 -722 -178 907 -604 256 643 -906 517
2154 517 148 -765 668 -250 -580 509 -598 -48 491 -759 408 181 -861 914 -92 -769 1045
2171 1045 -329 -474 1187 -420 -284 730 -621 126 274 -537 420 -323 -501 693 -658 -196 866
2188 866 -773 76 809 -824 579 649 -775 612 25 -482 776 -267 -304 503 -628 34 383 -858
2206 -858 370 -100 -842 749 -254 -551 912 -481 -196 874 -731 68 573 -688 306 257 -539 503
2224 503 -359 -363 628 -687 -57 698 -1002 281 611 -879 688 400 -821 775 -54 -391 664 -369
2242 -369 77 435 -643 317 243 -816 564 -136 -834 883 -324 -548 784 -668 -24 698 -634 362
2260 362 418 -649 521 140 -591 690 -273 -423 566 -548 62 364 -889 430 7 -917 838 -42
$$ packed form
2136e41P66L0r12J091n99n32J760j412j08J494j759N44J085j511Q60L87j549J423
2154E17l69r13J433r18l30J089j107N50N39j250J167k27j042J775j006o77J814
2171A045j374j45J661j607J36J014j351P47J48q11R57p43j78J194j351M62J062
2188H66j639Q49P33j633J403P0j424J387n87n07J258j043l7Q07j131O62L49j241
2206h58J228m70p42J591j003k97J463j393K85J070j605P99N05j261R94m9p96J042
2224E03q62mR91j315O30P55j700J283L30j490J567k88j221J596q29l37J055j033
2242c69M46L58j078R60p4j059J380p00o98J717j207k24J332j452O44P22j332R96
2260C62N6j067J170l81p31J281r63j50R89j114O10L02j253J319m23r24J755q80
$$ plain form
2278 -42 -826 949 -104 -421 931 -343 -135 351 -521 435 52 -447 698 -462 -521 986 -599 -448
2296 -448 864 -814 -96 631 -694 222 279 -602 597 -133 -255 880 -529 -309 829 -697 6 458
2314 458 -678 213 41 -478 661 -382 -373 757 -779 -117 1034 -593 93 636 -671 305 351 -155
2332 -155 437 -513 -238 702 -753 261 526 -1261 137 640 -1002 288 370 -687 445 -56 23 485
2350 485 -588 277 557 -945 584 493 -918 496 112 -711 502 -196 -241 421 -589 180 346 -800
2368 -800 590 362 -945 724 284 -563 539 -90 -118 316 -400 406 220 -912 756 50 -1046 811
2386 811 -79 -842 543 29 -450 414 38 148 -97 -392 891 -109 -675 976 -267 -670 946 -304
2404 -304 -677 588 -422 -190 247 -388 426 -187 -545 785 -292 -366 984 -387 -382 711 -408 74
$$ packed form
2278d2p84J775j053l17J352j274K08M86q72R56l83m99J145j160n9J507j585J51
2296d48J312j678P18P27j325R16N7q81J199p30j22J135j409K20J138j526P03M52
2314D58j136Q91j72n19J139j043RJ130j536O62J151j627O86N43j307R76M6n06
2332a55N92r50K75R40j455J014K65j787J398N03j642J290Q2j057J132n01P9M62
2350D85j073Q65K80j502J529r1j411J414l84q23J213o98m5O62j010P69J66j146
2368h00J390k28j307J669m40q47J102o29k8M34p16Q06j86j132J668p06j096J857
2386H11q90p63J385n14m79Q64l76J10k45k95J283j000n66J651j243m03J616j250
2404c04l73J265j010K32M37o35Q14o13l58J330j077p4J350j371NJ093j119M82
$$ plain form
2422 74 273 -402 504 -259 -511 840 -506 -571 905 -609 -362 917 -427 -143 296 -144 412 -118 -156
2441 -156 660 -790 -71 1061 -770 -124 838 -815 -150 494 -500 179 -104 -260 432 -551 114 714 -814
2460 -814 215 768 -795 391 559 -620 369 147 -302 516 -552 -142 510 -790 246 543 -863
2477 -863 133 305 -620 334 135 -192 367 -282 226 630 -727 619 496 -946 558 459 -850 363
2495 363 134 -612 211 -191 31 204 -642 306 30 -738 833 216 -798 660 -37 -613 592 -108 -182
2514 -182 180 -537 328 137 -778 502 -97 -805 663 -61 -330 572 -263 -87 426 -298 491 143 -537
2533 -537 724 -4 -559 819 -162 -518 599 -337 -256 382 -333 213 -138 -478 740 -228 -434 775 -474
2552 -474 -374 962 -472 -262 563 -424 165 189 -387 296 -326 -287 599 -456 -59 597 -685 -61 556
$$ packed form
2422G4J99o75R06p63k52J351j346o5J476j514K47J279j344K84M39m40N56n30l8
2441a56Q16j450P19J132j831O46R62j653O65O44r94O79k83j56O92r83O65O00j528
2460h14J029N53j563J186J68j179R89k22m49Q18j068M10O52j300J036K97j406
2477h63R96J72r25R54j99l27N59o49N08M04j357J346j23j442J504r9j309J213
2495C63k29p46Q23m02K22J73q46R48k76p68J571o17j014J458o97n76J205p00p4
2514a82L62p17Q65j91r15J280n99p08J468p24k69R02q35J76N13p24P89l48o80
2533e37J261p28n55J378r81l56J117r36Q1O38p15N46l51l40J218r68k06J209j249
2552d74J00J336j434K10Q25r87N89K4n76O83o22L9Q86j055L97O56j282O24O17
$$ plain form
2571 556 -523 353 128 -473 575 -14 -236 706 -373 -168 602 -590 106 397 -523 157 65 -405 494
2590 494 -221 -198 606 -605 70 659 -575 348 496 -618 207 370 -370 262 -215 -294 347 -434 101 346
2610 346 -792 229 376 -613 498 144 -536 553 -129 -177 541 -333 -38 479 -427 220 272 -610 365
2629 365 -103 -414 509 -293 -248 589 -563 221 363 -481 297 389 -636 402 55 -435 452 -153 -140 388
2649 388 -370 72 156 -662 359 -64 -563 594 -69 -615 568 -252 -157 551 -304 -10 251 -490 340 49
2669 49 -309 486 -256 -362 616 -462 -150 529 -571 68 286 -429 410 81 -463 483 -41 -117 574 -228
2689 -228 -108 470 -472 351 213 -484 203 -128 -413 681 -300 -409 517 -455 -121 612 -451 140 325
2708 325 -407 430 114 -156 520 -347 -213 476 -381 105 342 -670 245 257 -525 411 -51 -428 397 -188
$$ packed form
2571E56j079Q76k25o01J048n89k22R42j079K05P70j192O96K91r20O80r2m70Q99
2590D94p15K3Q04j211O75N89j234R23J48j114Q25J63p40O32m77p9O41p81N35K45
2610C46j138J021J47r89J111l54o80J089o82m8P18q74K95N17r06O47N2q82R75
2629C65m68l11R23q02M5Q37j152P84J42q44P78R2j025J038l47m90Q87o05J3N28
2649C88p58M42Q4q18J021m23m99J157o63n46J183q20R5P08q55K94K61p41Q30k91
2669D9l58P95p42j06R78j078L12O79j100O39K18p15Q39l29n44R46n24p6O91q02
2689b28J20N78r42Q23j38o97O87l31k85J094r81j09R26r72L34P33j063N91J85
2708C25p32Q37l16k70O76q67J34O89q57M86K37j012R15J2p82R36m62l77Q25n85
$$ plain form
2728 -188 -146 486 -530 19 283 -424 395 232 -412 439 -99 -373 525 -403 -166 426 -624 14 334 -520
2748 -520 267 223 -454 356 129 -181 394 -273 45 450 -502 301 257 -783 382 115 -477 522 -106 -476
2768 -476 460 -265 -21 450 -339 164 231 -501 560 119 -433 563 -264 -324 579 -223 -127 322 -549 49 140
2789 140 -586 408 -66 -458 474 -118 -283 561 -274 12 435 -301 305 111 -430 379 -166 -380 580 -305
2809 -305 -373 706 -401 -103 417 -374 -22 34 -225 234 -106 -117 528 -451 -45 712 -453 -23 458 -528
2829 -528 52 164 -368 143 -169 -248 430 -403 -34 575 -611 7 562 -446 277 336 -317 358 -129 -144
2849 -144 389 -396 -23 437 -706 57 491 -657 50 294 -360 348 -83 -126 160 -360 297 412 -537 296
2869 296 443 -785 454 321 -537 254 49 -326 139 -155 166 231 -573 385 191 -528 549 35 -639
$$ packed form
2728a88M2O32j016N49K64p07Q19j63o44Q51n38k74Q98r28K37N92j050O38L20q54
2748e20P87m4o77Q10k27l10N75o67L18M05r52Q03m4j040J165k67n92R99o28l70
2768d76R36p25K44M71p89N03O7p32J061m41n52R96q27o0R03q02R6M49q71N98R1
2789A40p26R94m74l92R32n92j65Q44q35K86M23p36O06j94n41Q09n45k14R60q85
2809c05o8J079j107K98N20p91L52N6k59M59l40j1O45r79M06P57j165M30M81r86
2829e28N80J12n32N11l12p9O78q33L69O09j186O18N55j008P23N9o53O75m87j5
2849a44N33p85L73M60j143P63M34j148P07K44o54P08m31m3K86n20O57J15r49Q33
2869B96J47j228J239j33q58P91k05l75M65k94L21O5q04R58j94p19J077n14o74
$$ plain form
2888 -639 534 38 -205 407 -89 46 264 -473 372 45 -599 417 -14 -572 421 -40 -359 355 -181
2907 -181 6 140 -311 497 120 -460 655 -87 -520 679 -204 -513 477 -237 -137 77 -415 296 -211
2926 -211 -210 589 -306 -344 663 -278 -196 728 -285 -98 310 -224 214 -49 -354 421 -336 -201 583 -498
2946 -498 -276 428 -480 -76 442 -308 265 -6 -260 493 -169 -93 750 -532 -120 534 -432 -122 266 -502
2966 -502 -105 -72 -233 347 -267 -105 474 -535 67 694 -505 230 530 -525 133 190 -178 304 -254 98
2986 98 305 -372 85 216 -698 246 240 -463 386 78 -303 386 -104 17 384 -235 219 287 -612 430 387
3007 387 -557 330 59 -379 219 -97 -171 175 -477 195 182 -607 318 274 -684 572 159 -387 427 16 -148
3028 -148 209 -340 249 2 -464 416 -125 -456 529 -153 -405 523 -252 -242 460 -188 -8 237 -321 453
$$ packed form
2888f39J173m96k43O12m96J35K18p37Q45l27o44J016m31n58R93m61l19P14n36
2907a81J87J34m51Q08l77n80J115p42m33J199q83l09R90p14J00K14m92P11n07
2926b11JP99q95l8J007r41Q2R24j013J87M08n34M38k63l05P75p57J35P84j081
2946d98K22P04r08M04N18p50N73k71k54P53o62P6Q43j282M12O54r66L10L88p68
2966e02L97L3j61N80o14J62N79j009O02O27j199P35L00j055O58N7l68M82n58L52
2986I8K07o77M57J31r14R44op03Q49l08l81O89m90J21L67o19M54O8q99J042m3
3007C87r44Q87k71m38N98l16p4L46o52O72j3p89R25m4r58J256m13n46Q14m11j64
3028a48L57n49N89k47m66Q80n41l31R85o82k52R28p75J0P02o48J80K45n58P74
$$ plain form
3048 453 1 -416 460 -289 -276 355 -287 -75 284 -410 131 161 -485 387 -85 -245 556 -8 -206 547 -281
3069 -281 -70 346 -325 127 28 -365 335 -151 -283 576 -398 -194 481 -397 22 472 -470 33 262 -321
3089 -321 369 -14 -96 296 -306 9 406 -411 132 335 -521 245 94 -557 275 -153 -367 459 -266 -108
3109 -108 570 -324 15 333 -358 309 15 -334 353 -102 -267 435 -408 -76 267 -529 121 289 -497 178
3129 178 214 -363 350 13 -188 300 -194 152 360 -382 333 190 -533 363 105 -435 484 -246 -339 536 -284
3150 -284 -6 413 -480 163 217 -396 338 -71 -289 379 -176 -305 480 -290 25 293 -553 179 182 -483 449
3171 449 -38 -455 412 -163 -206 326 -390 54 354 -330 338 101 -265 422 -169 -292 435 -313 -239 494 -380
3192 -380 47 383 -512 195 110 -234 407 -51 -147 423 -238 -114 447 -405 58 294 -325 228 72 -415 254
$$ packed form
3048D53m52m17Q76p49J3O31o42K12L59o94N41L0o46Q72m72j60Q01n64j98P53q28
3069b81K11M16o71M52r9l93P00m86j32Q59r74K04O75q78M19M50r42N03K29n83
3089c21O90l83q2L92o02L15L97q17N43K03q56P66j51o51Q32m28k14Q26p25J58
3109a08O78q94L39L18o91O67k94l49O87m55j65P02q43L32L43p96O50J68p86O75
3129A78L6n77P13l37k01M88m94L46K08p42P15j43p23Q96k58n40R19p30r3Q75q20
3150b84K78M19q93O43N4o13P34m09k18O68n55j29P85p70L15K68q46P32Lo65R32
3171D49m87m17Q67n75m3N32p16M44L00o84O68k37l66O87n91j23P27p48P4P33q74
3192c80M27L36q95P07q5l44O41m58r6N70o61J24N61q52M63K36o19N53j56m87O69
$$ plain form
3213 254 -221 -310 289 -226 -76 346 -357 65 243 -265 302 -2 -212 413 -238 22 403 -434 -33 367
3233 367 -545 73 246 -519 84 95 -398 337 -124 -133 409 -376 191 381 -523 266 163 -451 304 70 -433
3254 -433 383 -137 -69 365 -310 63 287 -485 267 109 -528 447 -44 -322 264 -153 -58 350 -320 49 335
3275 335 -561 325 163 -575 278 101 -513 306 -33 -91 280 -316 203 163 -383 475 -70 -437 516 7 -317
3296 -317 507 -205 -198 293 -336 59 161 -373 247 -65 -405 460 -161 -280 432 -291 -1 426 -214 105 70
3317 70 -274 304 -111 -165 428 -352 -300 362 -376 -155 281 -375 85 226 -195 291 -183 -280 601 -289 -164
3338 -164 621 -457 -190 476 -403 69 179 -293 -6 -17 -128 299 -285 -6 330 -500 -45 402 -420 91
3358 91 338 -260 253 99 -101 311 -466 -54 371 -394 82 293 -475 260 229 -350 239 10 -251 214 -251
$$ packed form
3213B54m75q9N99n15J50M22p03M22J78n08N67l04k10O25o51K60L81q37M01M00
3233C67r12O18J73p65O03J1m93P35m61rN42p85N67J90r04P89j03o14P55k34n03
3254d33Q16n20O8M34o75L73K24p72P52j58o37R75m91k78N86m17R5M08o70L69K86
3275C35q96Q86j62p38Q53j77o14Q19l39n8L71n96N19m0n46Q58n45l67R53n09l24
3296c17Q24p12PM91o29L95J02n34O20l12l40Q65o21j19P12p23K90M27o40L19l5
3317G0l44N78m15n4N93p80N2O62p38K21M36o56M60J41m21M86m74r7Q81q90J25
3338a64P85j078K67O66q79M72J10m72K87j1j11M27n84K79L36q30M55M47q22N11
3358I1K47n98N13j54k00M12p77M12M25p65M76K11p68P35l1n79N89k29k61M65m65
$$ plain form
3379 -251 97 403 -499 234 388 -569 268 189 -449 372 71 -226 137 -188 55 87 -351 345 160 -440 510
3400 510 109 -491 399 -81 -321 264 -71 44 159 -371 257 131 -413 458 -31 -348 432 17 -305 431
3420 431 -92 -17 252 -251 280 119 -395 433 -20 -335 454 -121 -299 424 -81 -119 89 -204 235 65 -351
3441 -351 413 -120 -327 521 -182 -292 479 -266 -178 434 -219 94 -1 -314 353 -349 -210 450 -424 -129 390
3462 390 -389 23 372 -380 228 108 -131 363 -162 -68 561 -232 -91 444 -422 1 317 -448 158 -25
3482 -25 -332 278 -208 -31 374 -339 13 448 -356 55 261 -337 278 109 -319 262 -151 -81 306 -497 18
3503 18 295 -448 148 267 -533 218 110 -319 199 -104 -18 272 -264 190 280 -330 283 138 -358 317 -17
3524 -17 -312 251 -107 -209 254 -382 131 294 -363 303 212 -376 387 70 -315 252 -114 25 274 -340 181
$$ packed form
3379b51L48L06r02P33J54r57Q37p9o38Q21l01k97L63l25K43L2m38O96j85o00R50
3400E10m01o00Q90m80k40N85l35J15J15n30O28j26n44Q71m89l17P80m15l22P36
3420D31n23P5K69n03N31j61n14Q28m53l15P89n75j78P23n05l8K08k93M39j70m16
3441c51P64n33k07Q48p03j10P71p45Q8O12o53L13r5l13O67p02J39O60q74K95N19
3462C90p79M12L49p52O08j20k39M94n25R4O29p93J41N35q66M23L16p65O06j83
3482b5l07O10m86J77M05p13L52M35q04M11K06n98O15j69m28N81m13P0L87q03N15
3503A8K77p43N96J19q00P51j08m29N18l03Q6K90n36M54R0o10O13j45m96O75l34
3524a7k95N63l58j02M63o36N13J63o57O66r1n88P63l17l85N67l66J39K49o14N21
$$ plain form
3545 181 162 -429 354 47 -437 330 -58 -364 364 -90 -154 265 -321 52 131 -278 283 -21 -319 199 -53
3566 -53 -229 412 -295 -171 309 -301 148 196 -319 135 -14 -252 283 -82 -83 406 -270 80 292 -167 74
3587 74 125 -284 310 31 -313 341 -193 -259 370 -351 -76 307 -275 153 265 -313 128 -21 -78 353 -332
3608 -332 -119 460 -284 -36 351 -341 219 171 -335 179 -37 -221 318 -159 -70 364 -257 108 156 -279 231
3629 231 94 -219 299 -97 -187 339 -250 -53 281 -223 123 180 -435 165 135 -221 312 -119 -147 237 -137
3650 -137 95 388 -308 125 225 -484 273 16 -372 269 -194 -122 299 -161 -70 213 -283 114 195 -376 304
3671 304 41 -249 272 23 -98 324 -138 -95 239 -336 7 137 -232 139 -90 -238 334 -127 -190 295 -271
3692 -271 106 244 -131 181 171 -368 318 -5 -274 328 -172 -126 291 -99 -136 215 -266 243 72 -112 217
$$ packed form
3545A81j9n91P83l07m84P67l88l06P28m54o4M19n86L73P9m09N61l04k98N18k52
3566e3j76O41p07J24M80o10M49M8n15M54j49k38N35l65jM89o76L50K12m59K41
3587G4N1m09N94k79l44O54n34o6O29p21K75L83n82M28J12n78M41j49n7M31o85
3608c32K13N79p44K48L87o92N60m8n06N14k16j84N39m77Q9M34o21L65M8m35N10
3629B31j37l13N18l96r0N26n89J97L34n04L46N7o15O00l0l56N33m31k8L84l74
3650a37K32K93o96M33J00p09P57k57l88O41m63P2M21m60R1K83m96L97Q1n71O80
3671C04k63k90N21k49j21M22m62M3L34n75L43J30l69L71k29j48N72m61o3M85n66
3692b71L77J38l75L12j0n39O86l23k69O02n00M6M17l90l7L51m81N09j71j84L29
$$ plain form
3713 217 15 -172 302 -259 -164 404 -202 -7 243 -155 140 12 -257 198 -167 -121 347 -148 -101 278 -215
3734 -215 76 295 -308 269 -45 -211 358 -99 -174 271 -209 -55 309 -297 7 83 -263 155 104 -206 304
3755 304 -110 -159 282 -259 97 428 -430 77 228 -340 143 214 -214 10 -90 -187 207 -332 -33 172 -306
3776 -306 177 166 -304 247 49 -255 218 -3 -38 116 -101 131 157 -300 161 19 -345 154 -39 -353 205
3797 205 -138 -95 194 -229 111 162 -260 267 207 -309 341 -70 -214 270 11 -202 217 -235 47 54 -272 164
3819 164 -19 -250 323 -178 -340 358 -188 -153 189 -182 48 48 -96 227 -51 -282 203 -189 -128 305 -243
3840 -243 -59 328 -336 81 156 -285 209 4 -108 245 41 -140 328 -267 -171 316 -175 93 199 -162 182
3861 182 -45 -77 197 -209 -188 435 -222 60 183 -412 97 307 -254 151 36 -100 151 -129 42 258 -321
$$ packed form
3713B17k02j87M74n61R5N68o06J95K50l98K95j28k69M55l65M6M68m95M7L79m93
3734b15K91K19o03N77l14j66N69m57p5M45m80J54L64o06L04P6l46M18n1l10N10
3755C04m14m9M41n41L56L31q58N07J51n68M83P1m28K24j00r7L94n39K99K05m78
3776c06M83j1m70N51j98l04M73k21l5J54k17K32K6m57M61j42l64M99j93l14N58
3797B05l43M3K89m23L40N1m22N27o0n16O50m11j44M84k59k13M19m52K82Pl26M36
3819A64j83k31N73n01j62O98n46L5L42l71K30%j44L23k78k31M85l92O1M33n48
3840b43J84L87o64M17P5m41M94k05j12L53k04j81M68n95R6M87m91K68J06l61L44
3861A82k27l2K74m06K1O23o57K82J23n95N09K10n61M05j15j36K51k80J71K16n79
$$ plain form
3882 -321 37 232 -395 122 135 -208 101 26 -182 237 -63 -30 176 -209 77 276 -235 92 46 -293 254
3903 254 42 -145 196 -275 -42 244 -325 203 131 -264 214 231 -298 271 60 -227 63 -2 -1 95 -202 116
3925 116 108 -311 237 12 -238 292 53 -305 289 -13 -102 224 -121 167 79 -222 289 -33 -189 339 12
3946 12 -182 182 -202 -67 173 -230 116 118 -243 156 -12 -148 321 -25 -156 168 -129 -27 261 -143 221
3967 221 -3 -208 281 55 -204 266 -226 -286 347 -126 -53 224 -236 18 86 -181 200 -24 -129 240 -68
3988 -68 72 284 -199 8 201 -107 91 123 -141 64 -122 -108 234 -75 54 271 -245 101 316 -225 162
4009 162 38 -158 141 -16 -85 213 -305 -125 219 -274 44 200 -290 152 81 -62 291 -46 -138 230 -181
4030 -181 95 126 -190 222 174 -371 246 56 -222 183 -103 -33 297 -236 -23 181 -254 224 134 -222 142
$$ packed form
3882c21L58J95o27N17J3l43L09p5k08M19l00L3K06l85K86J99n11L27m6l39N47
3903B54k12j87L41m71K33K86n69N28p2l95M78J7n29N69k11k87K90o5JR6k97L18
3925A16qm19N48k25k50N30k39l58N94l02q9L26l45K88q8l01N11l22j56N28l27
3946A2j94L64l84J35K40m03L46Kl61L99j68j36M69l46j31L24k97J02K88m04L64
3967B21k24k05M89k26k59M70m92o0O33m73P3K77m60K54O8k67L81k24j05L69l08
3988f8J40K12m83K07J93l08J98L2k64K05j86J4L42l09J29K17n16L46K15n41L87
4009A62j24j96K99j57o9K98n18J80L44m93L18J56m90M42p1j43L53l37r2L68m11
4030a81K76L1l16M12m8n45O17j90k78M05k86P0L30n33K13K04m35M78r0l56L64
$$ plain form
4051 142 6 -167 269 -110 -23 150 -280 -78 144 -287 104 175 -360 141 -44 -205 230 -129 -14 187 -185
4072 -185 -91 160 -219 157 138 -202 228 -56 -188 300 -135 -105 169 -302 78 67 -288 145 47 -183 279 -24
4094 -24 -212 348 -170 -8 252 -117 38 138 -206 98 -3 -175 272 3 -179 213 -110 -103 122 -294 66
4115 66 176 -197 164 -24 -213 242 5 7 268 -211 -37 248 -247 29 150 -288 71 -98 -161 211 -182
4136 -182 87 278 -293 176 180 -143 197 254 -141 117 -4 -171 174 -132 -120 70 -146 2 -20 -251 90 176
4158 176 -188 246 63 -94 185 -100 -77 339 -160 -52 259 -300 205 102 -221 152 -87 -94 418 -135 -85
4179 -85 160 -119 60 196 -248 287 -46 -333 285 -14 -166 182 -140 -148 207 -20 150 -53 -166 100 -28
4200 -28 -136 190 -110 -119 252 -91 -140 281 -165 84 -31 -236 257 9 -217 240 -91 -104 226 -171 -95 141
$$ packed form
4051A42j36j73M36l79Q7J73m30K02K22m31L91P1n35N01j85j61M35l59J15K01l72
4072a85R4K51l79L76j9l40M30k84j32M88m35L0K74m71L80j1l55M33r8k30M62l03
4094b4j88N60n18J62K60l69J55J00l44L04j01j72M47k69j82L92l23PK25m16L60
4115F6J10l73L61j88j89M55k37KK61m79J74K85m95K76J21m38L59j69o3L72l93
4136a82K69J91n71M69Ml23L40N7l95K58j21j67L45l06J2J90k16J48k2k31L41Q6
4158A76l64M34j83j57K79k85K3M16m99J08L11n59N05j03l23L73k39pN12n53N0
4179h5K45k79J79J36m44N35l33k87O18k99j52L48l22qL55k27J70k03j13K66j28
4200b8j08L26l00rL71l43m9M21m46K49j15k05M93k48k26M57l31j3L30l97P6K36
$$ plain form
4222 141 -187 20 92 -278 201 -12 -178 192 -88 -156 309 -232 -95 218 -173 -32 -16 -221 139 -73 -120
4243 -120 182 -313 -96 275 -126 -29 317 -287 63 103 -142 198 -110 -44 243 -55 -16 212 -224 114 175 -168
4265 -168 103 105 -202 110 -75 -123 216 -122 0 251 -222 165 158 -224 201 70 -262 140 -4 -70 95 -169
4287 -169 3 223 -219 2 199 -330 135 121 -210 190 39 -77 79 -12 64 86 -229 175 93 -426 206 26
4309 26 -272 126 -22 -124 181 -119 36 158 -131 145 56 -144 225 -24 -242 294 -96 -154 210 -237 -134
4330 -134 22 -198 62 21 -332 214 -20 -196 294 -80 -180 169 0 -27 87 -96 107 -96 -14 143 -122
4351 -122 -118 276 -173 -140 146 -154 54 213 -108 87 8 -85 183 -105 -127 250 -10 -58 197 -235 -82 112
4373 112 -228 74 -29 -257 104 -132 -88 174 -53 -43 190 -281 43 131 -297 98 30 -73 87 -49 -33 182
$$ packed form
4222A41l28K07P2l70M79k13j66L70k80o8M65n41J37L13l91J41J6k05L60k12m7
4243a20L02m95K17L71m01R7L46o04L50M0k45L40l08O6K87k98L9K28m36L38O1l43
4265a68K71Kl07L12j85m8L39l38J22K51m73L87pl82M25j31l32M02j44o6J65k64
4287a69J72K20m42K21J97n29M65j4l31M00j51j16J56r1P6K2l15M04q2n19O32j80
4309B6k98L98j48j02L05l00J55J22k89K76q9k00L69k49k18N36l90n8L64m47J03
4330a34J56k20K60m1l53N46k34j76M90l74j00L49j69k7J14j83K03k03Q2J57k65
4351a22ML94m49L3K86l00K08J59l21J95p9r3K68k88k2L77k60m8K55m32J53J94
4373A12l40L02j03k28L61k36M4K62k27J0K33m71L24Q8m28L95o8j03J60j36J6K15
$$ plain form
4395 182 -169 -55 199 -272 109 168 -166 86 88 -107 126 -35 -58 106 19 88 202 -259 158 107 -276 230
4417 230 56 -94 45 -118 -101 151 -199 174 214 -183 203 70 -208 231 15 -84 223 -2 -44 158 -138
4438 -138 99 151 -213 252 -19 -282 109 52 -121 156 -104 -145 207 -116 193 113 -188 194 -24 -140 273
4459 273 19 -215 195 -156 -156 235 -84 -11 -73 -289 160 92 -184 82 -83 -112 307 -5 -15 85 -177 211
4481 211 125 -315 177 70 -192 159 -58 -95 48 -195 -56 217 -356 -4 63 -163 136 70 -52 358 -90
4502 -90 -158 240 -201 -55 295 -214 25 91 -190 64 -79 -77 99 -149 -156 165 -113 25 216 -268 74 3 -135
4525 -135 174 41 -57 259 -150 -86 225 -225 35 69 -188 153 23 -90 141 -39 -67 165 -87 63 141 -297
4547 -297 -23 195 -162 33 -4 -257 58 -78 -124 109 -143 45 169 -265 66 102 -229 139 49 -146 171
$$ packed form
4395A82l51J14K54m71L81N9l34K52Kj95K33j61k3J64q7O9J14m61M17n1l83N06
4417B30j74j50J39j63J7K52l50L73M0l97L86j33k78M39k16r9L07k25m2K02k96
4438a38K37N2l64M65k71k63L91n7j73K77k60m1L52l23L09q0l01L82k18j16M13
4459B73k54k34M10l51%L91l19P3o2k16M49o8k76K66j65k9M19l12j0J00k62L88
4481B11q6m40M92j07k62L51k17l7J43k43J39K73n73L52O7k26K99o6j22M10m48
4502i0o8L98m41J46L50n09K39O6k81K54j43KJ76k48pL21k78J38J91m84L42p1j38
4525a35L09j33r8L16m09O4L11m50K60L4k57L41j30j13K31j80k8K32k52J50P8m38
4547b97K74K18l57J95l7k53L15j36m6K33k52J88J24m34L31L6l31L68r0j95L17
$$ plain form
4568 171 -97 -26 198 -161 -31 35 -137 12 -48 -291 166 6 -161 146 -34 -103 257 -110 -36 159 -144 220
4590 220 89 -163 149 54 -95 315 -94 -57 63 -94 16 135 -168 90 14 -210 170 -96 -134 204 -135
4611 -135 -67 309 -108 -11 74 -154 66 -25 -101 112 -45 -274 321 -188 -55 217 -148 30 128 -132 131 53
4633 53 -169 90 54 -279 104 -70 -121 121 -80 151 -48 -91 99 77 -157 175 -185 8 186 -133 -95 217
4655 217 -224 -3 139 -139 73 96 -175 78 57 -3 273 -237 -10 78 -125 84 -44 -143 221 2 -173 162
4677 162 14 -69 96 -191 75 83 -139 82 24 -265 73 -116 -159 53 -91 -47 161 -205 140 40 -167 129
4699 129 97 -106 107 96 -74 31 -102 1 131 -102 96 146 -183 106 82 -251 60 7 -185 152 7 -97
4721 -97 140 -39 7 41 -193 127 -17 -103 53 -23 -62 111 -187 -100 148 -145 137 174 -232 151 16 -57 120
$$ packed form
4568A71k68P1K24l59J30O6j72J49o0k43M57j60j67L07j80o9L60l67P4J95l03L64
4590B20j31k52L12r5j49M10m09L7J20j57J10J19l03K58p6k24L80k66l8L38l39
4611a35O8L76m17R7Q5k28K20r1p6K13j57k29N95n09J33K72l65J78R8k60K63p8
4633E3k22K59l6l33L83j74n1K42k01K31j99m3J90k2k34L32l60J93J78l19L8L12
4655B17m41K21J42k78K12K3k71K53k1o0K76n10K27Q8k03K09j28r9L64k19j75L35
4677A62j48q3J65k87K66Qk22K21n8k89L38j89m3K12j44M4K08l66L45j00k07K96
4699A29l2k03K13j1j70J05j33J03J30k33J98N0l29K89k4l33L11n3j92L37j45j04
4721i7K37j79M6L4k34L20j44q6J56p6l9J73k98Q7K48k93K82L7m06L83j35p3J77
$$ plain form
4744 120 -127 -83 121 -51 -9 110 -231 85 64 -130 106 93 -214 69 -77 -130 288 -212 -20 141 -164 58
4766 58 141 -230 146 -18 -151 49 -79 -8 156 -208 -157 45 -76 102 41 -84 168 -34 -16 138 -70 -27
4788 -27 200 -139 45 125 -169 74 100 -26 67 7 -30 83 -93 -4 118 -116 49 213 -106 85 26 -141 133
4811 133 -55 -22 228 59 163 154 -80 50 21 -164 161 12 -161 163 -37 -114 156 29 -15 171 -112 185
4833 185 90 -251 84 92 -95 186 -20 30 115 -112 -56 69 -115 -37 -33 -252 218 -51 -38 196 -12 -84 163 -157
4857 -157 80 59 -80 76 -152 -134 57 -113 -116 63 -34 -116 120 -133 -66 17 -139 -27 58 -109 129 10 -15
4880 -15 129 -139 -30 20 -26 2 75 -207 32 93 -173 59 -62 -158 194 -114 -4 135 -54 18 158 -101 7
4903 7 124 -98 118 -64 -41 106 -69 -38 70 -248 -42 109 -79 7 35 -45 41 -88 -112 81 -59 105 136
$$ packed form
4744A20k47M4K04j72M2J19l41L16k1j94K36j3l07K83j46n3M18n00J92J61l05K22
4766E8Q3l71L76j64j33K00j28P1J64l64N1K02j21J78o1j25K52k02J8J54k08M3
4788b7K27l39J84Q0k94K43K6j26R3o0l7J13j76Q9J22k34J65J64l19J91n9j67K74
4811A33j88L3K50j69J04rk34J30k9j85L25j49j73L24k00p7K70j27m4J86k83K97
4833A85r5l41L35Qj87K81k06N0Q5k27N6J25j84P8Mk19M70k69J3K34k08p2K47l20
4857a57K37k1j39J56k28J8J91j70lJ79r7q2K36k53O7Q3j56J12Q5j67K38j19k5
4880a5J44k68J09N0m6K8P3k82K39O1k66K32j21r6L52l08J10J39j89P2J40k59J08
4903GJ17k22K16j82K3J47j75L1J08l18K06J51j88Q6K8q0Q6j29k4J93j40J64L1
$$ plain form
4926 136 -87 110 133 -163 57 76 -74 151 -82 -97 51 -100 103 125 -72 152 162 -123 80 59 -21 90
4948 90 14 52 67 -102 119 119 -160 42 62 -235 99 -36 -108 172 -85 16 111 7 64 35 -76 116 -18 -106
4972 -106 84 104 1 131 -39 5 220 -39 1 98 -161 94 8 93 84 28 8 223 -113 -81 171 -90 -41 31
4996 31 -70 97 -8 -89 -41 -74 26 149 -107 -18 42 -19 -9 2 -240 127 -20 -190 194 100 -28 130 -91
5019 -91 -9 156 -176 80 -56 -180 39 46 -84 108 -146 95 183 -26 -52 106 -123 6 -37 -103 85 -9 -32
5042 -32 -1 -118 -129 163 -90 -52 60 -67 -74 -48 -199 75 -87 20 247 -90 -77 132 -31 107 85 -60 73
5065 73 -7 -158 -29 -104 58 -12 -146 132 152 -113 44 106 -154 30 240 -138 39 -90 -75 100 -50 4 55
5088 55 -139 59 -50 -216 35 34 -97 99 -37 1 124 -74 -38 169 45 -36 19 -161 67 77 -66 163 30
$$ packed form
4926A36k23J97K3k96K20J9j50K25k33j5J48j51K03K2j97K24J0k85K03k1q0J11
4948I0p6L8J5j69K21%k79K02K0k97L34j35p2K80k57J01R5j04N7k9j11J92j34q8
4972a06J90K0j03J30j70M4K15k59M0R7k59K55q6Q5rn6k0K15l36L2K52k61M9P2
4996C1j01J67j05q1M8l3J00J23k56Q9O0o1J0J1k42L67j47j70L84r4j28J58k21
5019i1Q2J65l32K56j36j24K19Pj30J92k54K41Q8k09k6J58k29J29m3o6J88r4k3
5042c2L1j17j1K92k53L8J12j27pK6j51K74j62J07K27l37J3K09j63J38k2j45J33
5065G3q0j51J29p5J62p0j34K78K0k65J57O2k60J84K10l78J77j29J5J75j50N4N1
5088E5j94J98j09j66K51jj31J96j36L8J23j98L6K07j24q1N5j80K28J0j43K29j33
$$ plain form
5111 30 -111 -11 -12 -74 13 13 63 -66 -24 110 76 -154 131 -19 -181 214 -147 -93 113 40 117 9 -136 30
5135 30 -48 -173 161 -127 -155 91 -117 -25 22 6 0 170 -52 4 -133 -86 89 -44 102 88 -222 -1 89 -218
5159 -218 108 65 -7 52 -25 -122 -24 -5 -136 177 -106 7 190 -98 122 125 -37 151 -72 -38 -46 -1 -12 128 -106
5184 -106 6 49 -159 53 -39 -76 75 -8 45 180 66 -1 101 18 90 -3 -178 22 83 -170 108 -62 -23 121
5208 121 -42 73 55 -33 -39 -7 -64 93 60 -72 160 8 -93 117 -99 59 22 -102 95 54 4 64 -12 20
5232 20 65 39 35 25 -102 40 51 -77 103 26 -24 210 -52 -22 186 -128 -76 9 -113 22 88 -76 180 80
5256 80 -33 153 -121 -50 112 13 -2 36 -36 8 18 -19 45 -23 -135 35 -75 -121 161 -115 0 137 -146 110
5280 110 135 -128 6 -10 -57 37 -63 -36 128 -112 6 -35 -75 30 160 -116 78 -21 -69 49 -53 -29 106
$$ packed form
5111C0j41J00jo2Q7%N0j29M2J34l4k30K85j50j62L95l61N4K06p3P7j08j45J66
5135C0p8j25L34k88k8K46k08R2M7j6oJ70k22N6j37M7J75j33J46j4l10K21R0l07
5159b18L26m3p2N9p7r7R8J9j31L13k83J13J83k88K20Lj62J88k23L4qM5j1J40k34
5184a06J12M3k08K12r2l7J51q3N3J35j14o7J02q3P2r3j75K00O1k53K78j70L9J44
5208A21j63J15j8q8oL2n7J57l3j32K32j52j01K10k16J58l7j24J97m1n0O0p6L2
5232B0M5k6mj0j27J42J1j28J80p7n0K34k62L0K08l14N2Q5j22J35O6j64K56j00
5256H0j13J86k74P1J62r9j5L8p2M4J0l7O4o8j12J70j10m6K82k76J15J37k83K56
5280A10K5k63J34j6m7R4j00K7J64k40J18m1m0J05J30k76J94r9m8J18j02K4J35
$$ plain form
5303 106 -70 144 112 -116 167 119 -205 117 -69 -173 103 -13 50 -8 -156 26 116 -103 75 133 -160 14
5325 14 -59 -111 38 -143 -15 177 -61 61 41 -34 21 -93 -169 -47 -13 -68 79 61 -92 70 -44 34 -19 -143
5349 -143 24 47 -33 72 56 -66 191 -191 -33 95 -200 -15 19 -69 111 33 -127 183 -26 -82 154 -3
5371 -3 -70 -24 -99 -83 59 66 69 10 -74 262 -6 -22 92 -178 -26 8 -105 -27 132 -130 135 94 -41 135 15
5396 15 -3 105 -44 -80 101 -140 81 66 -25 53 8 -83 56 -65 42 175 -147 -8 93 -153 149 101 -42
5419 -42 78 23 -7 93 -34 -19 65 -139 -154 93 -208 106 59 -208 -18 48 -98 79 -5 -40 194 -110 -104 141
$$ packed form
5303A06j76K14l2k28K83m8l24L22j86j04K76j16O3n8j48J82R0k19J78N8k93J74
5325A4p3n2J49j81J28J92k38J22k0p5N5j14p6J22L4n5J47j8j53J62j14P8n3j24
5349a43J67K3q0J05j6j22K57l82J58J28k95J85L4q8J80p8j60L10k09n6K36j57
5371co7M6p5J6J42PLn9q4L36k68j6J14k70J52L4j13P8J59k62K65m1j35J76j20
5396A5j8J08j49l6J81k41K21j5r1P8m5r1J39j21J07J33l22J39J01k46L02m8j43
5419d2J20n5l0J00j27J5Q4k04j5K47l01L14m7k67J90O6j46J77q4l5K34l04OK45
$$ [...]
8191C6
##END NTUPLES=NMR FID
##END=
