##TITLE=1H_DE-80H_X3
 200.13MHz, d2o
 8 sc
 
 19ns.26.2.2025
##JCAMPDX= 6.0         $$ Bruker NMR JCAMP-DX V2.0
##DATA TYPE= NMR FID
##DATA CLASS= NTUPLES
##ORIGIN= UXNMR, Bruker Analytische Messtechnik GmbH
##OWNER= pz
$$ XWIN-NMR		Version 3.5
$$ Thu May 22 18:11:06 2025 Russian Standard Time (UT+4h)  Yarkov@DPX200
##.OBSERVE FREQUENCY= 200.1313
##.OBSERVE NUCLEUS= ^1H
##.DELAY= (6, 6)
##.ACQUISITION MODE= SIMULTANEOUS
##.ACQUISITION SCHEME= undefined
##.AVERAGES= 8
##.DIGITISER RES= 18
##SPECTROMETER/DATA SYSTEM= spect
##.PULSE SEQUENCE= zg30
##.SOLVENT NAME= CDCl3
##.SHIFT REFERENCE= (INTERNAL, CDCl3, 0, 14.3821)
##AUDIT TRAIL= $$ (NUMBER, WHEN, WHO, WHERE, WHAT)
$$ ##TITLE= Audit trail, XWIN-NMR		Version 3.5
$$ ##JCAMPDX= 5.01
$$ ##ORIGIN= Bruker BioSpin GmbH
$$ ##OWNER= Yarkov
$$ C:/Bruker/XWIN-NMR/data/yarkov2/nmr/H-C/1/audita.txt
$$ ##AUDIT TRAIL=  $$ (NUMBER, WHEN, WHO, WHERE, WHAT)
(   1,<2025-05-22 18:10:14.71 +0400>,<Yarkov>,<DPX200>,
      <created by zg, POWCHK disabled, PULCHK disabled
       configuration hash MD5:
       00 E9 B6 7A A2 85 ED C7 34 08 36 98 17 FE 4E 26
       data hash MD5: 16K
       E8 8D 9A 57 E3 C8 C3 27 4A 66 2A 9E 60 6F 1E 39>)
$$ ##END=
$$ 
$$ hash MD5
$$ 3B 9A A8 34 FF CB 55 EB 16 20 53 59 CB 42 1D 8C
##$RELAX= 
##$RELAX= 
##$RELAX= 
##$RELAX= 
##$RELAX= 
##$RELAX= 
$$ Bruker specific parameters
$$ --------------------------
##$DU= <C:/Bruker/XWIN-NMR>
##$EXPNO= 1
##$NAME= <H-C>
##$PROCNO= 1
##$TYPE= <nmr>
##$USER= <yarkov2>
##$AMP= (0..31)
100 100 100 100 100 100 100 100 100 100 100 100 100 100 100 100 100 100 
100 100 100 100 100 100 100 100 100 100 100 100 100 100 
##$AQSEQ= 0
##$AQ_mod= 1
##$AUNM= <au_zg>
##$AUTOPOS= <>
##$BF1= 200.13
##$BF2= 200.13
##$BF3= 200.13
##$BF4= 200.13
##$BF5= 200.13
##$BF6= 200.13
##$BF7= 200.13
##$BF8= 200.13
##$BYTORDA= 1
##$CFDGTYP= 0
##$CFRGTYP= 5
##$CHEMSTR= <none>
##$CNST= (0..31)
1 1 145 1 1 1 1 1 1 1 1 1 1 1 1 1 1 1 1 1 1 1 1 1 1 1 1 1 1 1 1 1 
##$CPDPRG= <>
##$CPDPRG1= <>
##$CPDPRG2= <>
##$CPDPRG3= <>
##$CPDPRG4= <mlev>
##$CPDPRG5= <mlev>
##$CPDPRG6= <mlev>
##$CPDPRG7= <mlev>
##$CPDPRG8= <mlev>
##$CPDPRGB= <>
##$CPDPRGT= <>
##$D= (0..31)
0 0.7 0 0 0 0 0 0 0 0 0 0.03 0 0 0 0 0 0 0 0 0 0 0 0 0 0 0 0 0 0 0 0 
##$DATE= 1747923014
##$DBL= (0..7)
120 120 120 120 120 120 120 120 
##$DBP= (0..7)
150 150 150 150 150 150 150 150 
##$DBP07= 0
##$DBPNAM0= <>
##$DBPNAM1= <>
##$DBPNAM2= <>
##$DBPNAM3= <>
##$DBPNAM4= <>
##$DBPNAM5= <>
##$DBPNAM6= <>
##$DBPNAM7= <>
##$DBPOAL= (0..7)
0.5 0.5 0.5 0.5 0.5 0.5 0.5 0.5 
##$DBPOFFS= (0..7)
0 0 0 0 0 0 0 0 
##$DE= 6
##$DECBNUC= <off>
##$DECIM= 32
##$DECNUC= <off>
##$DECSTAT= 4
##$DIGMOD= 1
##$DIGTYP= 9
##$DL= (0..7)
0 120 120 120 120 120 120 120 
##$DP= (0..7)
150 150 150 150 150 150 150 150 
##$DP07= 0
##$DPNAME0= <>
##$DPNAME1= <>
##$DPNAME2= <>
##$DPNAME3= <>
##$DPNAME4= <>
##$DPNAME5= <>
##$DPNAME6= <>
##$DPNAME7= <>
##$DPOAL= (0..7)
0.5 0.5 0.5 0.5 0.5 0.5 0.5 0.5 
##$DPOFFS= (0..7)
0 0 0 0 0 0 0 0 
##$DQDMODE= 0
##$DR= 18
##$DS= 0
$$ [...]
##$SUBNAM2= <"">
##$SUBNAM3= <"">
##$SUBNAM4= <"">
##$SUBNAM5= <"">
##$SUBNAM6= <"">
##$SUBNAM7= <"">
##$SUBNAM8= <"">
##$SUBNAM9= <"">
##$SW= 18.0517328524113
##$SWIBOX= (0..15)
0 0 2 0 0 0 0 0 0 0 0 0 0 0 0 0 
##$SW_h= 3612.71676300578
##$TD= 16384
##$TD0= 1
##$TE= 0
##$TE2= 300
##$TE3= 300
##$TEG= 300
##$TL= (0..7)
0 120 120 120 120 120 120 120 
##$TP= (0..7)
150 150 150 150 150 150 150 150 
##$TP07= 0
##$TPNAME0= <>
##$TPNAME1= <>
##$TPNAME2= <>
##$TPNAME3= <>
##$TPNAME4= <>
##$TPNAME5= <>
##$TPNAME6= <>
##$TPNAME7= <>
##$TPOAL= (0..7)
0.5 0.5 0.5 0.5 0.5 0.5 0.5 0.5 
##$TPOFFS= (0..7)
0 0 0 0 0 0 0 0 
##$TUNHIN= 0
##$TUNHOUT= 0
##$TUNXOUT= 0
##$USERA1= <user>
##$USERA2= <user>
##$USERA3= <user>
##$USERA4= <user>
##$USERA5= <user>
##$V9= 5
##$VALIST= <valist>
##$VCLIST= <CCCCCCCCCCCCCCC>
##$VD= 0
##$VDLIST= <DDDDDDDDDDDDDDD>
##$VPLIST= <PPPPPPPPPPPPPPP>
##$VTLIST= <TTTTTTTTTTTTTTT>
##$WBST= 1024
##$WBSW= 4
##$XGAIN= (0..3)
0 0 0 0 
##$XL= 0
##$YL= 0
##$YMAX_a= 168743
##$YMIN_a= -122507
##$ZGOPTNS= <>
##$ZL1= 120
##$ZL2= 120
##$ZL3= 120
##$ZL4= 120
##$ABSF1= 10
##$ABSF2= 0
##$ABSG= 5
##$ABSL= 3
##$ALPHA= 0
##$AQORDER= 0
##$ASSFAC= 0
##$ASSFACI= 0
##$ASSFACX= 0
##$ASSWID= 0
##$AUNMP= <proc_1d>
##$AZFE= 0.1
##$AZFW= 0.1
##$BCFW= 1
##$BC_mod= 2
##$BYTORDP= 1
##$COROFFS= 0
##$CY= 83.5205535888672
##$DATMOD= 1
##$DC= 2
##$DFILT= <>
##$DTYPP= 0
##$F1P= 10.8118882576601
##$F2P= -7.23987719738617
##$FCOR= 0.5
##$FTSIZE= 0
##$FT_mod= 4
##$GAMMA= 1
##$GB= 0.15
##$INTBC= 1
##$INTSCL= 1
##$ISEN= 128
##$LB= 0.25
##$LEV0= 0
##$LPBIN= 0
##$MAXI= 10000
##$MC2= 0
##$MEAN= 0
##$ME_mod= 0
##$MI= 1.114404
##$NCOEF= 0
##$NC_proc= 0
##$NLEV= 6
##$NOISF1= 3.799351
##$NOISF2= 2.8
##$NSP= 1
##$NTH_PI= 0
##$NZP= 0
##$OFFSET= 14.38212
##$PC= 1
##$PHC0= -1711.203
##$PHC1= 12.56656
##$PH_mod= 1
##$PKNL= yes
##$PPARMOD= 0
##$PSCAL= 0
##$PSIGN= 0
##$REVERSE= no
##$SF= 200.129724274929
##$SI= 16384
##$SIGF1= 3
##$SIGF2= 2
##$SINO= 400
##$SIOLD= 16384
##$SREGLST= <1H.CDCl3>
##$SSB= 0
##$STSI= 0
##$STSR= 0
##$SW_p= 3205.1282051282
##$SYMM= 0
##$S_DEV= 0
##$TDeff= 0
##$TDoff= 0
##$TI= <>
##$TILT= no
##$TM1= 0
##$TM2= 0
##$TOPLEV= 0
##$USERP1= <user>
##$USERP2= <user>
##$USERP3= <user>
##$USERP4= <user>
##$USERP5= <user>
##$WDW= 1
##$XDIM= 8192
##$YMAX_p= 0
##$YMIN_p= 0
$$ End of Bruker specific parameters
$$ ---------------------------------
##NTUPLES= NMR FID
##VAR_NAME=  TIME,          FID/REAL,        FID/IMAG
##SYMBOL=    X,             R,               I
##VAR_TYPE=  INDEPENDENT,   DEPENDENT,       DEPENDENT
##VAR_FORM=  AFFN,          ASDF,            ASDF
##VAR_DIM=   8192,          8192,            8192
##UNITS=     SECONDS,       ARBITRARY UNITS, ARBITRARY UNITS
##FACTOR=    0.0002768,     1,               1
##FIRST=     0,             0,               0
##LAST=      2.2672688,     0,               0
##MIN=       0,             -122507,         0
##MAX=       2.2672688,     168743,          0
$$ Real data points
##PAGE= N=1
##DATA TABLE= (X++(R..R)), XYDATA
$$ [...]
$$ plain form
1782 1226 284 -250 758 -642 -684 133 -1681 -613 -175 -1141 258 287 -347 1157 336 11 1094 -524
1800 -524 -491 249 -1401 -616 -219 -1075 300 318 76 1703 860 600 1736 150 216 914 -985 -500 -383
1819 -383 -1440 24 -132 -766 1140 236 85 1611 135 144 705 -1005 -421 -429 -1695 -133 -676 -1208 578
1838 578 -63 -92 1129 -173 206 821 -834 100 -30 -1415 173 -132 -666 959 263 390 1609 297
1856 297 886 1288 -550 393 254 -1211 -31 -443 -1155 443 -473 -160 1139 -133 519 1061 -470 219
1874 219 183 -1057 -3 -755 -1239 219 -645 -432 871 -373 294 1026 -311 517 246 -1150 291 -474
1892 -474 -1121 530 -352 -24 1282 -73 690 1209 -223 860 454 -706 381 -463 -972 367 -664
1909 -664 -183 827 -363 422 862 -537 679 233 -952 395 -334 -888 498 -522 -275 795 -513
$$ packed form
1782A226r42n34J008j400m2Q17j814J068M38r66J399K9o34J504q21l25J083j618
1800e24L3P40j650P85L97q56J375J8k42J627q43k60J136j586O6O98j899M85J17
1819c83j057J464j56o34J906r04j51J526j476RN61j710N84qj266J562n43n32J786
1838E78o41k9J221j302L79O15j655R34j30j385J588l05n34J625o96J27J219j312
1856B97N89M02j838R43j39j465J180m12p12J598r16L13J299j272O52N42j531O89
1874B19l6j240J054p52m84J458q64K13J303j244O67P32j337Q28k71j396J441p65
1892d74o47J651q82L28J306j355P63N19j432J083m06j160J087q44n09J339j031
1909f64M81J010j190P85M40j399J216m46j185J347p29n54J386j020K47J070j308
$$ plain form
1926 -513 347 735 -750 330 34 -933 255 -403 -800 561 -582 -220 673 -594 430 778 -595
1943 -595 696 229 -636 689 -360 -582 785 -491 -87 639 -695 245 351 -719 380 153 -561
1960 -561 969 154 62 1217 -145 296 858 -628 136 127 -1138 73 -292 -1031 600 -227 -356 1034
1978 1034 -296 67 741 -885 -144 -180 -1392 -141 -577 -1317 342 -352 -284 873 -146 263 868 -341
1996 -341 414 335 -875 172 -302 -830 510 -195 -88 1125 -148 577 1178 -63 842 916 -351 861
2014 861 130 -527 595 -597 -629 224 -1003 -321 231 -1112 72 136 -544 887 273 -222 948 -317
2032 -317 -384 250 -1255 -762 -234 -1372 -359 -200 -874 659 168 -50 1388 170 193 1071 -408 -55
2050 -55 174 -1210 -104 -168 -999 588 209 -8 1236 172 465 1320 36 557 651 -766 48 -164 -1095
$$ packed form
1926e13Q60L88j485J080k96r67J188o58l97J361j143L62Q93j267J024L48j373
1943e95J291m67q65J325j049k22J367j276M04P26j334R40J06j070J099k27p14
1960e61J530q15r2J155j362M41N62j486P64rj265J211l65p39J631q27j29J390
1978A034j330L63O74j626P41l6j212J251m36p40J659o94O8J157j019M09O05j209
1996c41P55p9j210J047m74n28J340p05J07J213j273P25O01j241R05P4j267J212
2014H61p31o57J122j192l2Q53j227O82N52j343J184O4o80J431o14m95J170j265
2032c17o7O34j505M93N28j138J013J59o74J533m91k18J438j218K3Q78j479L53
2050e5K29j384J106o4q31J587l79k17J244j064K93Q55j284N21R4j417Q14k12r31
$$ plain form
2069 -1095 80 -515 -793 602 -457 -45 821 -301 560 824 -362 607 255 -855 265 -697 -1009
2086 -1009 208 -1078 -654 310 -812 166 473 -513 697 397 -234 989 144 -96 587 -556 -278 404
2104 404 -695 120 317 -724 461 132 -459 847 49 -95 1139 -119 96 707 -796 24 244 -911
2122 -911 141 -91 -830 480 -422 -343 821 -173 239 965 -371 400 284 -1002 -16 -334 -871 331
2140 331 -418 -348 720 -270 414 1142 -107 776 685 -419 520 -232 -1006 219 -819 -718 449 -575
2158 -575 78 713 -577 491 575 -524 625 -114 -796 408 -781 -605 511 -670 -27 627 -414
2175 -414 543 438 -555 642 -180 -564 638 -360 -283 620 -479 105 766 -329 658 583 -280 949 46
2194 46 -436 442 -644 -511 283 -963 -262 119 -932 223 138 -537 893 158 -232 831 -297 -280 332
$$ packed form
2069a095J175n95k78J395j059M12Q66j122Q61K64j186R69l52j110J120r62l12
2086a009J217j286M24R64j122R78L07r86J210l00o31J223q45k40O83j143K78O82
2104D04j099Q15J97j041J185l29n91J306p98j44J234j258K15O11j503Q20K20j155
2122i11J052k32p39J310r02P9J164r94M12P26j336P71j16j286R86l18n37J202
2140C31p49P0J068r90O84P28j249Q83r1j104R39p52p74J225j038J01J167j024
2158e75O53O35j290J068Q4j099J149p39o82J204j189J76J116j181O43O54j041
2175d14R57j05r93J197q22l84J202r98P7R03j099N84O61j095R87p5q63J229r03
2194D6m82Q78j086J33P94j246P01L81j051J155q5o75J430p35l90J063j128J7O12
$$ plain form
2213 332 -995 -315 44 -956 309 115 -450 806 277 260 1297 155 300 941 -561 152 254 -738
2231 -738 206 61 -610 646 -11 -261 854 -415 52 648 -448 83 183 -896 34 -397 -977 199
2249 199 -624 -866 262 -777 -260 418 -613 369 596 -190 947 408 -253 726 -237 -538 533 -704
2267 -704 -310 392 -733 167 467 -296 756 477 -52 1034 52 -148 524 -632 -176 378 -830 -68
2285 -68 -25 -920 210 -160 -679 474 -284 -424 659 -371 35 699 -447 437 432 -401 523 -51 -673 304
2305 304 -536 -432 391 -463 24 661 -369 521 474 -304 595 150 -580 466 -561 -547 255 -761 -122
2324 -122 465 -474 533 595 -190 678 273 -243 593 -356 -324 361 -784 -152 174 -748 376 250 -457 686
2344 686 229 -315 775 -245 -120 570 -603 -95 247 -693 221 -2 -674 417 -163 -414 639 -308
$$ packed form
2213C32j327O80L59j000J265j94n65J256n29j7J037j142J45O41j502P13J02r92
2231g38R44j45o71J256o57k50J115j269M67N96j096N31J00j079R30m31n80J176
2249A99q23k42J128j039N17O78j031R82K27p86J137n39o61R79r63l01J071j237
2267g04L94P02j125R00L00p63J052k79n29J086r82k00O72j156M56N54j208P62
2285f8M3q95J130l70n19J153p58j40J083j030M06O64j146Q84nq33R24n74o22R77
2305C04q40J04Q23q54M87O37j030Q90m7p78Q99m45p30J046j027J4Q02j016O39
2324a22N87r39J007O2p85Q68m05n16Q36r49L2O85j145O32L26r22J124j26p07J143
2344F86m57n44J090j020J25O90j173N08L42r40R14k23o72J091n80k51J053r47
$$ plain form
2362 -308 -196 541 -506 67 362 -636 353 94 -512 521 -210 -333 584 -274 -14 492 -520 107 28
2381 28 -757 127 35 -649 456 -26 -69 808 -100 210 867 -239 337 398 -795 165 -222 -790 333 -286
2401 -286 -156 841 -80 301 877 -199 295 270 -919 264 -320 -939 196 -483 -413 534 -226 121 745
2420 745 -317 448 214 -669 71 -241 -812 288 -351 -363 571 -298 336 791 -320 454 446 -367 404 -12
2440 -12 -552 396 -285 -224 570 -308 163 582 -491 180 291 -578 244 -96 -469 660 -370 -297 574 -376
2460 -376 152 445 -456 427 183 -651 283 -262 -703 273 -414 -331 499 -285 194 664 -340 535 335 -488
2480 -488 441 -176 -430 300 -411 -324 431 -411 69 458 -466 353 265 -464 372 -143 -479 312 -473 -318 329
2501 329 -372 118 529 -373 498 306 -389 553 -165 -256 515 -454 -360 439 -540 37 267 -500 513 139
$$ packed form
2362c08J12P37j047N73K95r98R89k59o06J033p31j23R17q58K60N06j012O27p9
2381B8p85Q84r2o84J105m82m3Q77r08L10O57j106N76O1j193R60l87n68J123o19
2401b86J30R97r21L81N76j076M94k5j189J183n84o19J135o79P0R47p60L47O24
2420G45j062P65k34q83P40l12n71J100o39j2R34q69O34M55j111P74qq13P71m16
2440a2n40R48o81O1P94q78M71M19j073O71J11q69Q22l40l73J129j030P3Q71r50
2460c76N28K93r01Q83k44q34R34n45m41R76o87Q3Q30p84M79M70j004Q75k00q23
2480d88R29o17k54P30p11Q7P55q42M80L89r24Q19q8p29Q36n15l36P91p85J55O47
2501C29p01M90M11r02Q71j92o95R42p18r1P71r69R4P99r79N77K30p67J013l74
$$ plain form
2521 139 -319 668 13 -154 668 -277 -200 411 -683 -29 173 -785 110 -131 -635 469 -222 -272 662 -154
2541 -154 99 596 -315 187 281 -679 24 -234 -613 220 -261 -275 642 -243 162 679 -152 463 462 -431 377
2562 377 -188 -623 124 -498 -465 386 -371 65 587 -188 588 590 -243 551 52 -538 334 -487 -706 53 -713
2583 -713 -352 319 -551 285 265 -282 648 239 -148 712 115 -4 522 -370 -193 141 -724 -105 -86 -630 287
2604 287 84 -335 609 72 -100 681 -272 17 208 -708 -68 -250 -842 68 -394 -458 519 4 147 762
2624 762 -163 273 477 -450 242 35 -604 141 -210 -388 447 -135 38 711 -68 426 515 -246 392 152
2644 152 -524 209 -371 -680 224 -465 -354 263 -333 291 560 -311 308 38 -510 242 -200 -493 366 -383
2664 -383 -182 455 -386 254 280 -262 193 180 -501 301 -225 -447 439 -131 186 755 -209 401 587 -182 445
$$ packed form
2521A39m58R87o55j67Q22r45P7O11j094O54K02r58Q95k41n04J104o91n0R34q16
2541a54K53M97r11N02R4r60P03k58l79Q33m81j4R17q85M05N17q31O15jq93Q08
2562C77n65m35P47o22L3Q51p57M36N22p75P76Kq33P94m99n90Q72q21k19P59p66
2583g13L61O71q70Q36k0n47R30m09l87Q60n97j19N26q92J77L34q65O19J9n44R17
2604B87k03m19R44n37j72P81r53K89J91r16O40j82n92R10m62o4R77n15J43O15
2624G62r25M36K04r27O92k07o39P45l51j78Q35n82J73O73p79M94Q9p61O38k40
2644A52o76P33n80l09R04o89J11O17n96O24K69q71O19k70n48P52m42k93Q59p49
2664c83K01O37q41O40K6n42M55j3o81Q02n26k22Q86n70L17N69r64O10J86p69O27
$$ plain form
2685 445 83 -503 283 -301 -523 121 -469 -125 473 -319 240 449 -154 443 133 -466 201 -410 -483 214
2705 214 -509 -121 281 -319 197 296 -257 516 88 -353 221 -316 -482 187 -649 -154 283 -458 318 458
2725 458 -185 707 327 -45 587 -99 -235 333 -498 -189 90 -522 155 348 -219 420 335 -161 603 -63
2745 -63 -53 260 -449 -89 151 -574 127 151 -291 327 144 -258 427 -213 -358 140 -483 -214 55 -437 251
2766 251 108 -224 416 55 -39 646 -103 -54 300 -478 -43 155 -460 120 249 -364 382 28 -129 503 -187
2787 -187 -145 346 -468 -123 210 -543 153 79 -374 417 178 -160 430 -222 -184 460 -328 -21 93 -497 95
2808 95 48 -338 282 -24 -202 616 13 56 594 -182 137 250 -493 115 -153 -505 194 -293 -374 209 -352
2829 -352 -134 306 -276 96 309 -378 273 45 -352 300 -66 -318 330 -350 -117 400 -350 123 394 -210
$$ packed form
2685D45l62n86P86n84k22O44n90L44N98p92N59K09o03N97l10n99O67o11p3O97
2705B14p23L88M02o00N16R9n53P73m28m41N74n37j66O69q36M95M37p41P76J40
2725D58o43Q92l80l72O32o86j36N68q31L09K79o12O77J93n67O39q5m96P64o66
2745f3J0L13p09L60K40p25P01K4m42O18j83m02O85o40j45M98o23K69K69m92O88
2766B51j43l32O40l61r4O85p49M9L54p78M35J98o15N80J29o13P46l54j57O32o90
2787a87M2M91q14L45L33p53O96p4m53P91k39l38N90o52L8O44p88L07J14n90N92
2808I5m7l86O20l06j78Q18o03M3N38p76L19J13p43O08k68l52O99m87q1N83n61
2829c52K18M40n82L72K13o87O51k28l97O52l66k52O48o80K33N17p50M73K71o04
$$ plain form
2849 -210 251 207 -298 428 -108 -176 393 -267 -107 319 -410 -19 232 -336 263 78 -216 401 -89 -286 371
2870 371 -400 -211 159 -539 -101 93 -481 201 -20 -352 449 -39 -88 506 -52 46 226 -408 41 178 -411
2891 -411 220 -115 -380 464 -27 -138 226 -230 40 357 -340 219 64 -398 220 -60 -220 366 -207 -195
2911 -195 299 -399 34 138 -440 91 56 -394 382 -33 -204 408 -235 -87 492 -226 110 464 -247 175
2931 175 187 -422 287 -2 -267 336 -281 -242 353 -405 -58 255 -389 317 66 -274 359 -93 -351 418 -137
2952 -137 -157 226 -330 -3 247 -372 240 174 -446 324 -154 -323 229 -314 -91 302 -386 95 262 -348 327
2973 327 208 -242 264 -181 -236 258 -291 -105 238 -320 92 322 -367 251 260 -186 310 -120 -267 436 -212
2994 -212 -2 387 -258 234 197 -262 376 -22 -235 290 -146 -245 311 -430 -86 297 -471 167 44 -421 171
$$ packed form
2849b10M61m4n05P26n36o8N69o60J60M26p29L91K51n68N99j85k94O17m90j97O57
2870C71p71J89L70o98M38J94n74O82k21l32Q01m88m9N94n58R8J80o34M49J37n89
2891d11O31l35k65Q44m91j11L64m56K70L17o97N59j55m62O18k80j60N86n73J2
2911a95M94o98M33J04n78N31l5m50P76m15j71O12o43J48N79p18L36L54p11M22
2931A75J2o09P09k89k65O03o17L9N95p58L47L13o44P06k51l40O33m52k58P69n55
2952a37k0L83n56L27K50o19O12o6o20P70m78j69N52n43K23L93o88M81J67o10O75
2973C27j19m50N06m45n5M94n49J86L43n58M12K30o89O18Rm46M96m30j47P03o48
2994b12K10L89o45M92l7m59O38l98k13N25m36r9N56p41L44L83p68O38j23m65N92
$$ plain form
3015 171 73 -273 433 -143 -276 335 -441 -142 227 -431 171 206 -286 213 42 -241 409 -142 -82 367 -235
3036 -235 45 365 -257 149 159 -280 297 93 -180 336 -93 -277 413 -195 -58 239 -370 192 215 -429 318
3057 318 -126 -298 314 -174 -157 414 -234 102 189 -403 201 74 -350 242 -92 -364 321 -155 -73 307 -263
3078 -263 199 332 -256 283 34 -415 202 -82 -255 281 -267 -103 426 -231 99 331 -362 202 175 -316
3098 -316 200 -240 -200 449 -199 -18 408 -212 209 271 -270 201 48 -438 231 -200 -376 302 -294 -160 206
3119 206 -393 121 264 -443 274 -14 -273 375 -76 -109 491 -176 -29 344 -327 168 205 -236 162 -66 -267
3140 -267 241 -52 -85 432 -113 102 389 -293 119 176 -398 254 -15 -455 271 -211 -309 296 -266 -103 153
3161 153 -306 145 48 -375 317 -59 -248 189 -255 -137 369 -321 54 297 -208 259 275 -258 172 150 -287
$$ packed form
3015A71r8l46P06n76j33O11p76K99L69o58O02L5m92M99j71k83O50n51O0M49o02
3036b35K80L20o22M06J0m39N77k04k73N16m29j84O90o08J37K97o09N62K3o44P47
3057C18m44j72O12m88J7N71o48L36Q7n92O04j27m24N92l34k72O85m76Q2L80n70
3078b63M62J33n88N39k49m49O17k84j73N36n48J64N29o57L30K32o93N64k7m91
3098c16N16m40M0O49o48J81M26o20M21O2n41M71j53m86O69m31j76O78n96J34L66
3119B06n99N14J43p07P17k88k59O48m51l3O00o67J47L73o71M95L7m41L98k28k01
3140b67N08k93l3N17n45K15K87o82M12N7n74O52k69m40P26m82r8O05n62J63K56
3161A53m59M51r7m23O92l76j89M37m44J18N06o90L75K43n05M67J6n33M30k2m37
$$ plain form
3182 -287 271 -107 -146 397 -361 -16 212 -331 170 89 -231 348 116 -365 368 -164 -61 419 -378 56 152
3203 152 -405 157 12 -455 89 -144 -285 362 -185 -120 332 -151 335 453 -94 290 89 -200 191 -197
3223 -197 -352 236 -226 -200 228 -286 57 301 -333 253 62 -324 223 -193 -337 163 -346 -141 198 -217
3243 -217 152 213 -286 147 232 -226 347 21 -42 326 -96 -67 349 -265 91 356 -260 227 108 -208 266
3264 266 2 -56 385 -58 91 272 -284 89 -6 -544 -85 -163 -584 136 -243 -292 271 -219 62 355 -276
3285 -276 257 208 -275 175 -119 -363 223 -232 -288 340 -158 113 153 -170 235 339 -154 410 60 -181 449
3306 449 -130 -92 445 -181 -73 207 -312 27 59 -334 101 6 -325 308 -91 -176 144 -358 -117 250 -380
3327 -380 30 46 -295 109 -23 -113 299 -36 -40 463 -137 -4 239 -270 206 30 -321 185 78 -221 238
$$ packed form
3182b87N58l78l9N43p58L45K28n43N01q1l20N79k32m81P33n32J03M80p97M34R6
3203A52n57N62j45m67N44k33j41O47n47O5M52m83M86J18n47L84k01k89L91l88
3223a97j55N88m62K6M28n14L43K44o34N86j91l86N47m16j44N00n09K05L39m15
3243b17L69O1m99M33Q5m58N73l26o3L68m22K9M16o14L56K65o16M87j19l16M74
3264B66k64n8M41m43J49J81n56L73r5n38M59p8m21P20l79m9N63m90K81K93o31
3285b76N33m9m83M50k94k44N86m55n6O28m98K71M0l23M05J04m93N64l50k41O30
3306D49n79L8N37o26J08K80n19L39L2l93M35r5l31O33l99q5L20n02K41L67o30
3327c80M10J6l41M04j32r0M12l35mN03o00J33K43n09M76j76l51N06j07k99M59
$$ plain form
3348 238 -88 -63 427 -239 167 329 -216 260 120 -169 173 113 -307 207 -174 -210 196 -347 -131 263 -277
3369 -277 329 295 -277 333 14 -111 428 -311 -196 215 -469 -51 55 -466 126 127 -236 275 -111 -136 276
3390 276 -323 -126 172 -329 -108 73 -374 272 23 -163 403 -54 -64 249 -212 -117 257 -386 15 166 -289
3411 -289 121 106 -270 250 -45 -16 315 -100 -71 298 -185 142 151 -227 267 4 -337 304 -95 -289 186 -258
3433 -258 -100 271 -222 91 213 -250 185 105 -160 219 -95 -219 224 -263 -69 163 -325 67 79 -267 204
3454 204 -82 -75 274 14 -167 188 -227 44 192 -413 220 143 -110 115 -14 -194 279 -78 -122 257 -189
3475 -189 14 183 -320 106 106 -319 227 36 -195 290 -129 -36 302 -240 38 277 -235 205 138 -344 158
3496 158 -172 -189 228 -235 -165 215 -228 17 194 -294 227 156 -225 231 72 -299 260 -161 -110 254 -288
$$ packed form
3348B38l26K5M90o66M06J62n45M76j40k89L42o0m20N14l81l6M06n43K16L94n40
3369b77O06l4n72O10l19j25N39p39J15M11o84M18J06n21N92Jl63N11l86k5M12
3390B76n99J97K98n01K21J81m47O46k49j86N66m57j0L13m61R5L74o43M01J51m55
3411b89M10j5l76N20k95K9L31m15K9L69m83L27Rl78M94k63l41O41l99j94M75m44
3433b58J58L71m93L13J22m63M35q0k65L79l14j24M43m87J94K32m88L92J2l46M71
3454B04k86PL49k60j81L55m15K71J48o05O33p7k53K25j29j80M73l57m4L79m46
3475a89K03J69n03M26%m25N46j91k31M85m19R3L38n42K78K39n12M40o7m82N02
3496A58l30j7M17m63P0L80m43K45J77m88N21p1l81M56j59l71N59m21N1L64n42
$$ plain form
3517 -288 39 158 -232 138 54 -34 261 -17 -172 264 -38 -18 188 -233 137 80 -356 92 92 -138 156 -80
3539 -80 -121 183 -143 -65 249 -324 71 90 -349 164 21 -204 203 -131 -33 327 -250 147 335 -248 197 164
3561 164 -273 237 17 -185 153 -180 -257 238 -215 -44 204 -150 86 253 -151 147 87 -142 250 -139 -166
3582 -166 185 -280 -78 189 -235 105 162 -188 262 49 -150 218 -57 -200 224 -242 72 170 -257 200 186
3603 186 -180 369 94 -142 309 -116 -64 128 -299 -113 270 -371 104 76 -303 183 53 -189 170 -27 -179
3624 -179 147 -261 49 235 -266 75 47 -176 121 -49 -189 132 -264 -43 232 -252 55 317 -192 208
3644 208 272 -156 259 -72 -108 238 -138 -280 73 -229 63 97 -199 174 174 -118 259 140 -153 291 -151 -74
3666 -74 121 -251 -74 213 -256 99 25 -148 261 -47 -60 312 -150 16 248 -219 8 -44 -339 128 5
$$ packed form
3517b88L27J19l90L70q4q8K95k78j55M36l02K0K06m21L70n7m36M48%k30K94k36
3539h0m1L04l26P8L14n73L95J9m39N13j43k25M07l34R8L60n77L97J88n83M45l3
3561A64m37N10k20k02L38l33p7M95m53J71K48l54K36J67m04K98o0k29L92l89k7
3582a66L51m65K02K67m24L40N7l50M50k13j99L68k75j43M24m66L14R8m27M57j4
3603A86l66N49k75k36M51m25N2J92m27J86L83o41M75k8l79M86j30k42L59j97j52
3624a79L26m08L10J86n01L41k8k23K97j70j40L21l96K21K75m84L07K62n09M00
3644B08O4m28M15l31l6L46l76j42L53l02K92L4k96L73%k92L77j19k93M44m42P7
3666g4J95l72J77K87m69L55p4j73M09l08j3L72m62J66K32m67K27n2k95M67j23
$$ plain form
3687 5 -268 186 -13 -176 258 41 -37 308 -110 83 92 -289 115 -70 -335 130 -49 -198 267 -129 72 375
3709 375 -80 265 214 -174 80 15 -121 263 -122 -253 113 -221 -115 170 -300 119 185 -226 127 99 -134
3730 -134 226 -43 -175 158 -182 -19 93 -326 -110 91 -215 203 2 -197 246 -69 -182 290 -130 -2
3750 -2 134 -272 96 26 -159 50 37 -82 233 6 -10 282 -77 -17 205 -181 133 211 -221 141 -12 -81 286
3773 286 -14 -77 259 -128 73 234 -257 97 40 -300 71 -98 -169 204 -137 -142 127 -262 -51 88 -308 139
3795 139 -33 -261 319 -146 -57 311 -79 -22 370 -150 21 212 -178 65 -64 -156 324 -71 -36 346 -51
3816 -51 -30 186 -133 84 157 -110 119 6 -229 97 -88 -150 197 -51 -25 347 -83 43 194 -205 113 -40
3838 -40 -293 151 -134 -151 244 -164 9 263 -139 61 249 -205 159 -2 -284 155 -106 -205 100 -105 36
$$ packed form
3687Ek73M54j99j63M34k17p8L45m18J93Rl81M04j85k65M65j79j49M65l96K01L03
3709C75m55L45n1l88K54o5j36L84l85j31L66l34J06K85m70M19O6m11L53k8k33
3730a34L60k69j32L33l40J63J12m19K16K01l06M18k01j99M43l15j13M72m20J28
3750bJ36m06L68p0j85K09j3j19L15k27j6K92l59O0K22l86L14P8m32L62j53o9L67
3773B86l00o3L36l87K01J61m91L54n7l40L71j69p1L73l41nK69l89K11J39l96M47
3795A39j72k28N80m65Q9L68l90N7L92n20J71J91l90K43j29r2M80l95L5L82l97
3816e1K1K16l19K17P3k67K29j13k35L26j85o2L47k48K6L72m30J26J51l99L18j53
3838d0k53M44k85j7L95m08J73K54m02K00J88m54L64j61k82M39k61r9L05k05J41
$$ plain form
3859 36 177 -105 78 144 -214 108 -49 -169 164 -33 -75 186 -128 -50 41 -56 151 140 -117 174 57 -93
3881 -93 228 -3 -8 225 -217 -46 264 -155 207 139 -274 184 33 -182 128 -107 -225 -28 -190 -66 136
3902 136 -293 114 20 -191 241 36 -39 215 -4 -34 164 -149 -58 80 -229 142 132 -126 256 53 -72 253
3924 253 8 20 159 -228 -4 139 -116 140 54 -158 171 -25 -87 338 -5 49 73 -342 -40 101 -245 31
3946 31 12 -203 95 2 -161 169 -146 1 162 -221 -96 154 -116 -79 28 -71 166 -46 -69 274 -119 -73
3968 -73 224 -111 36 101 -217 75 -43 -157 231 -7 -34 142 -62 -26 131 -164 63 102 -181 124 13 -90
3990 -90 56 -106 -117 169 -193 52 209 -179 89 158 -236 236 -13 -86 199 -164 -48 244 -212 66 168
4011 168 -255 -32 20 -145 -5 -11 -167 212 -17 -57 178 -116 -59 160 -92 246 92 -173 177 -75 -261 104
$$ packed form
3859C6J41k82J83O6l58L22j57j20L33j97m2K61l14P8R1r7K07j1k57K91j17j50
3881i3L21k31nK33m42J71L10m19L62o8m13M58j51k15L10k35j18J97j62J24K02
3902A36m29M07r4k11M32k05p5K54k19l0J98l13R1J38l09L71j0k58L82k03j25L25
3924B53k45J2J39l87K24J43k55K56q6k12L29j96o2M25l43N4K4m15L02J41l46K76
3946C1j9k15K98r3j63L30l15J47J61l83J25K50k70L7J07r9K37k12k3L43l93M6
3968g3K97l35J47O5l18K92j18j14L88k38k7J76k04L6J57k95K27L9k83L05j11j03
3990i0J46j62j1K86l62K45J57l88K68O9l94M72k49p3K85l63J16K92m56K78J02
4011A68m23K23N2j65J40oj56L79k29m0K35k94N7K19k52L38j54k65L50k52j86L65
$$ plain form
4033 104 -212 -155 115 -118 -50 110 -159 108 98 -213 301 44 -203 226 -10 -47 155 -233 72 161 -190 23
4055 23 89 -166 150 -87 66 300 -111 28 252 -157 82 95 -188 175 104 -223 135 -47 -65 199 -32 -15
4077 -15 208 -243 11 38 -234 108 12 -213 -74 -161 -171 192 -117 44 341 -152 63 139 -164 20 -31 -261
4099 -261 129 -197 -157 77 12 12 142 -164 99 107 -56 -33 -27 -241 101 -188 -246 188 -66 -22 153 2 128 50
4123 50 -226 199 -101 -121 157 -90 -74 189 -168 -52 224 -92 146 182 -101 174 58 -128 72 -93 -104 132
4145 132 -136 51 13 -261 82 49 -158 228 40 -121 169 64 -19 202 -118 7 72 -168 20 39 -129 7
4167 7 -17 -132 238 -34 -27 283 -155 -34 131 -202 31 18 8 212 47 -30 91 -117 -172 -4 -233 112 100
4190 100 -180 39 -10 -217 228 -117 -274 180 -120 -70 192 -136 55 -1 -247 53 -7 -162 233 27 -62 203
$$ packed form
4033A04l16N7K70k33O8J60k69K67j0l11N14k57k47M29k36l7K02l88L05Q9l51K13
4055B3O6k55L16k37J53K34m11J39K24m09K39J3k83L63p1l27L58j82j8K64k31J7
4077a5K23m51K54K7k72L42r6k25J39q7j0L63l09J61K97m93K15P6l03J84n1k30
4099b61L90l26M0K34o5%J30l06K63Qj63K3Ok14L42k89n8M34k54M4J75j51J26p8
4123E0k76M25l00k0K78k47J6K63l57J16K76l16K38L6k83K75j16j86K00j65j1K36
4145A32k68J87l8k74L43l3k07L86j88j61K90j05q3K21l20J25O5k40J88J9j68J36
4167Gk4j15L70k72PL10m38J21J65l33K33j3j0K04j65p7J21k08n5J68k29L45j2
4190A00k80K19m9k07M45l45j57M54l00N0K62l28J91n6k46L00o0j55L95k06q9K65
$$ plain form
4212 203 -157 -75 55 -148 51 59 -262 91 69 -149 82 -17 -45 204 -81 -67 203 -124 45 39 -202 26 -52
4235 -52 -95 280 -10 44 271 -153 25 228 -79 20 90 -68 212 50 -232 134 -107 -81 214 -64 -127 267
4257 267 -236 52 142 -56 2 -91 -164 43 -63 -96 288 -100 16 148 24 23 85 -80 70 49 -106 214 -24
4280 -24 -108 125 -136 31 152 -178 105 111 -195 99 144 -88 223 -83 -15 133 -228 21 149 -198 31 11
4302 11 -246 79 -49 -131 156 -69 -139 97 -143 50 95 -270 113 -34 -198 225 77 -84 197 2 8 174
4324 174 -67 7 122 -190 -19 -14 -126 130 44 -119 252 -27 94 275 -60 99 35 -134 108 43 -220 36
4346 36 -159 -208 88 10 -52 97 -104 37 44 -99 31 47 -292 78 -56 -71 158 -44 13 148 -78 30 66
4369 66 -88 136 114 -84 115 -96 -165 60 -69 -122 89 -151 161 69 -55 140 -40 -192 163 -74 -158 133
$$ packed form
4212B03l60Q2J30k03J99Ql21L53k2k18K31r9k8K49k85J4K70l27J69ok41K28p8
4235e2m3L75k90N4K27m24J78K03l07R9P0j58K80j62k82L66k41K6K95k78o3L94
4257B67n03K88R0j98N8r3p3K07j06l3L84l88J16J32j24jO2j65J50k1j55L20k38
4280b4q4K33k61J67J21l30K83Ol06K94M5k32L11l06O8J48l61K49J28l47K29k0
4302A1k57L25j28q2K87k25p0K36k40J93M5l65L83j47j64M23j48j61K81j95OJ66
4324A74k41P4J15l12J71Nj12K56q6j63L71k79J21J81l35J59o4j69K42o5k63K56
4346C6j95m9K96p8o2J49k01J41Pj43J30J6l39L70j34j5K29k02N7J35k26J08L6
4369F6j54K24k2j98J99k11o9K25j29n3K11k40L12r2j24J95j80j52L55k37q4K91
$$ plain form
4391 133 -101 -127 36 -133 13 85 -22 145 24 -84 178 -53 13 163 -213 -61 168 -153 -23 148 -145
4412 -145 123 20 -49 150 -67 -117 216 -56 -34 44 -201 50 127 -123 168 118 -66 58 -37 -87 162 -155 -26
4435 -26 43 -307 218 -22 -118 124 -10 -70 247 -16 -65 156 -148 -109 26 -187 8 67 -112 144 154 -88 227
4458 227 -79 -32 148 -145 -77 -21 -230 88 56 -256 245 111 30 316 -64 84 254 -145 2 -53 -211 65
4480 65 2 -300 78 -27 -66 313 8 -6 227 -15 -12 14 -209 -57 -136 -190 120 -23 -26 184 71 27 86 -45
4504 -45 -86 53 -183 49 -32 -153 164 -68 -93 109 3 53 246 20 187 165 -38 60 11 -100 88 -108 -69
4527 -69 152 -222 30 105 -90 133 22 -197 150 -138 -74 191 -33 68 129 -34 17 78 -39 28 2 -112 78
4550 78 -33 -144 170 38 68 158 -41 4 86 -116 77 109 -113 179 31 -168 113 -206 -77 91 -121 15
$$ packed form
4391A33k34k6J63j69J46P2j07J67j21j08K62k31O6J50l76J52K29l21J30J71k93
4412a45K68j03o9J99k17n0L33k72K2P8k45K51P7k50K91n0j84J24r5n0K49l17J29
4435b6O9l50N25k40r6K42j34o0L17k63m9K21l04L9J35k13J95N9j79K56J0k42L15
4458B27l06M7J80k93O8N6k09L18l2l12N01j34q1K86l80J48J70l99J47n5j58K76
4480F5o3l02L78j05l9L79l05j4K33k42LK6k23J52p9n4L10j43lK10j13m4N9j31
4504d5m1J39k36K32q1j21L17k32k5K02j06N0J93k26J67k2k03R8m9j11J88j96L9
4527f9K21l74K52P5j95K23j11k19L47k88O4K65k24J01O1j63N1O1j17O7k6j14J90
4550G8j11j11L14j32L0R0j99M5Q2k02J93L2k22K92j48j99K81l19J29J68k12J36
$$ plain form
4572 15 44 -178 -26 37 -168 83 -61 -79 158 -37 -76 128 -139 72 246 -65 112 55 -48 205 -23 -44
4594 -44 104 -8 -55 7 -272 -42 174 -22 -62 43 35 184 77 -64 126 -73 -97 132 -185 -212 50 -115 92
4617 92 39 -147 84 41 -6 202 -148 -55 147 -166 3 80 -239 61 -28 -179 142 27 -111 162 -88 -65 122
4640 122 -116 158 88 -61 218 -69 -164 21 24 -84 -38 -42 50 195 -33 18 99 -127 93 -5 -161 15 -167 -138
4664 -138 51 -90 52 27 -126 -49 166 -127 128 27 -18 120 -5 40 62 -129 -97 156 -74 -44 63 -38
4686 -38 46 2 -37 242 12 -81 218 -78 6 113 -82 -55 7 -105 84 -71 -74 104 -119 -119 169 -214 17 146
4710 146 -123 162 -6 -85 26 45 -108 149 -58 97 146 -197 61 25 -51 131 83 -91 140 -73 -4 190
4732 190 -91 -49 101 -196 -11 66 -121 48 61 -121 160 34 -202 182 8 -68 117 -106 -8 60 -248 -88
$$ packed form
4572A5K9k22J52O3k05K51j44j8K37j95l9K04k67K11J74l11J77n7j03K53k28k1
4594d4J48j12m7O2k79K30K16j96m0J05qJ49j07j41J90j99k4K29l17k7K62j65K07
4617I2n3j86K31m3m7K08l50R3K02l13J69P7l19L00q9j51L21j15j38K73k50K3J87
4640A22k38K74p0j49K79k87r5J85Lj08M6mR2J45k28N1Q1k26K20r8j56J76j82K9
4664a38J89j41J42k5j53P7K15k93K55j01m5J38j25M5K2j91L2K53k30L0J07j01
4686c8Q4m4l9K79k30r3K99k96Q4J07j95K7O2j12J89j55lJ78k23%K88l83K31J29
4710A46k69K85j68p9J11J9j53K57k07J55M9l43K58l6p6J82m8j74K31k13O9J94
4732A90k81M2J50k97J85P7j87J69J3j82K81j26k36L84j74p6J85k23R8O8l08J60
$$ plain form
4754 -88 -29 -132 94 0 0 162 -16 -135 161 -3 128 56 -74 26 10 -167 160 64 -195 105 -36 -9 82
4777 82 -151 32 45 -198 168 5 -195 152 -53 -60 70 -65 -65 100 1 142 22 -45 125 -39 -74 163 56
4800 56 -124 186 -78 8 266 -22 100 193 -183 86 61 -197 100 -99 -17 83 -14 89 39 -129 37 155
4822 155 -189 147 -81 -231 156 -58 -107 86 -125 3 65 -177 -72 -23 -35 -10 -60 -152 173 -14 -29 48 -89
4845 -89 -63 -25 -201 5 144 -203 24 55 -121 121 0 -27 95 -165 15 62 -101 4 19 -159 132 -42
4867 -42 -138 180 -149 -34 122 -124 15 45 -64 83 110 65 177 8 -33 129 -114 40 130 -189 -30 152
4889 152 -104 30 128 -4 28 56 5 137 -145 -28 230 -185 10 108 -286 115 -44 -89 77 -17 32 93 -86
4912 -86 -27 239 -95 18 68 -73 18 97 -130 96 82 -70 73 -141 -51 63 -17 -5 143 -78 2 76 -77 84
$$ packed form
4754h8N9j03K26r4%J62j78j19K96j64J31p2j30J00j6j77L27r6k59L00j41K7R1
4777H2k33J83J3k43L66j63k00L47k05pJ30j35%J65r9J41j20o7J70j64l5K37j07
4800E6j80L10k64Q6K58k88J22R3l76K69k5k58K97j99Q2J00r7J03n0j68J66J18
4822A55l44L36k28j50L87k14m9J93k11J28O2k42J05M9j2K5n0r2L25j87j5P7j37
4845h9K6L8j76K06J39l47K27L1j76K42j21k7J22k60J80M7j63J05J5j78K91j74
4867d2r6L18l29J15J56k46J39L0j09J47K7m5J12j69m1J62k43J54R0l19J59J82
4889A52k56J34R8j32L2K8n1J32k82J17K58m15J95R8l94M01j59m5J66r4M9O1j79
4912h6N9K66l34J13N0j41R1P9k27K26j4j52J43k14R0J14q0J2J48k21Q0P4j53J61
$$ plain form
4936 84 -41 -42 127 -32 -42 69 -26 46 128 -70 13 146 -25 240 -77 -30 53 -80 13 80 -158 -21 96 -148
4960 -148 86 187 -33 16 -113 13 206 -252 -136 121 -109 80 50 -118 -60 34 -19 122 -106 -147 31 -124
4982 -124 5 104 -95 102 -31 -48 100 9 -101 176 -196 -32 196 -31 69 45 -238 55 -42 -175 20 -46
5004 -46 -97 123 -50 -39 60 -34 28 51 -130 113 140 -135 68 49 -97 197 -151 25 83 -187 -21 185 -25
5027 -25 23 99 -42 80 -59 -4 237 -43 56 37 -54 58 60 -168 37 -99 -193 -11 -54 -79 165 -21 104 248
5051 248 -49 151 -3 -18 61 -76 -230 82 -91 -52 27 25 74 122 -114 -8 106 -50 95 96 -141 121 -187
5074 -187 -70 124 61 12 77 -3 115 122 -64 125 -78 -207 101 18 -43 144 -10 -36 220 -107 132 122 -74
5097 -74 99 14 -113 126 -19 -98 148 -36 85 151 -98 -29 47 -104 87 -81 -41 156 -170 -23 77 -193
$$ packed form
4936H4j25jJ69j59j0J11r5P2Q2j98Q3J33j71K65l17M7Q3j33R3O7k38J37J17k44
4960a48K34J01k20M9j29J26J93m58J16K57k30J89l0j68N8R4n3J41k28m1J78j55
4982a24J29R9j99J97j33j7J48r1j10K77l72J64K28k27J00k4k83K93r7j33J95o6
5004d6n1K20j73J1R9r4O2K3j81K43K7k75K03j9j46K94l48J76N8k70J66K06k10
5027b5M8P6j41J22j39N5K41k80R9j9r1J12Kk28K05j36r4J82m3k5K44j86J25J44
5051B48k97K00j54j5P9j37j54L12j73L9P9kM9M8k36J06J14j56J45Jk37K62l08
5074a87J17J94o3m9O5q0J18Pj86J89k03j29L08q3o1J87j54k6K56l27K39j0j96
5097g4J73q5j27K39j45p9K46j84J21O6k49O9P6j51J91j68M0J97l26J47J00k70
$$ plain form
5119 -193 32 62 -114 -61 89 -120 74 -8 -54 168 -145 46 153 47 10 53 -131 42 46 -75 132 116 -19
5142 -19 111 25 -154 107 -62 25 155 -106 24 27 -143 98 5 -33 67 -86 -55 189 -149 120 136 -211 -32
5165 -32 119 -53 122 88 -19 63 -59 -105 72 -14 51 73 -213 88 79 -193 55 -82 -95 187 -64 38 94 -43
5189 -43 54 65 -39 -13 -23 -76 86 50 -153 190 -34 -63 94 1 5 199 -92 168 54 -93 87 -41 -166 17
5213 17 -121 -10 58 -134 35 58 -122 87 -65 -156 126 -89 -90 151 -174 -57 123 -23 116 36 -125 88
5235 88 -55 -168 77 -90 -82 56 31 -10 28 -118 111 3 -192 -43 12 -100 106 -29 58 129 -91 -59 159
5258 159 -150 141 67 -87 4 -56 -4 61 -17 -62 156 -68 58 85 -25 45 95 -150 225 38 7 118 -32 -66
5282 -66 265 -97 66 120 -62 79 60 -117 116 14 -61 99 -23 18 134 -123 13 97 -98 151 -50 -39
$$ packed form
5119a93K25L0j76N3J50k09J94q2m6K22l13J91J07j06l7M3j84J73Mj21K07j6j35
5142a9J30q6j79K61j69Q7J30k61J30Lj70K41r3l8J00j53L1K44l38K69J6l47J79
5165c2J51j72J75l4j07Q2j22m6J77q6O5K2k86L01rk72K48j37j3K82k51J02N6j37
5189d3R7J1j04K6j0n3J62l6k03L43k24k9J57r3MJ94k91K60j14j47J80j28j25J83
5213A7j38J11O8j92J69K3j80K09j52r1K82k15jK41l25J17J80j46J39q0j61K13
5235H8j43j13K45j67QJ38k5m1L8j46K29j08j95J49N5j12K06j35Q7P1k20L2K18
5258A59l09K91p4j54R1o0N2O5p8m5K18k24J26K7j10P0N0k45L75j87l1J11j50l4
5282f6L31l62J63N4j82J41j9j77K33j02p5J60j22M1J16k57J36Q4j95K49k01J1
$$ plain form
5304 -39 286 -46 -37 51 -61 -83 -12 -57 -52 117 -82 -24 63 -96 151 26 -35 132 37 30 110 -64 0 -84 -159 -57
5330 -57 123 -150 120 86 -32 215 -89 -21 151 -104 71 70 -14 61 57 -60 4 -59 -46 59 -147 -5 104 -58
5354 -58 37 -13 -46 61 67 -110 123 -59 -87 125 -27 -120 100 8 -85 22 -177 99 23 -76 132 -99 3 86
5378 86 -65 -45 166 -7 69 209 -92 149 -26 -52 115 -107 12 62 -107 81 247 -129 101 84 -245 81
5400 81 36 -59 167 21 -128 -4 -69 -32 -14 -101 120 75 -44 -16 112 -30 16 -122 -114 76 -138 -98 66 -48
5424 -48 -23 33 -22 141 12 -122 51 -31 -25 161 -15 -48 185 -94 73 49 -44 160 -40 -121 -16 3 29 82 -36
5449 -36 -10 29 -119 93 -61 -165 196 -162 12 64 -73 -87 70 -138 24 97 -142 42 22 -22 22 -4 -58 121
5473 121 -181 105 -1 -45 -42 59 -78 55 0 -28 54 -43 -161 43 -121 -61 80 -101 119 -27 -24 26 19 -186
$$ packed form
5304c9L25l32RQ8j12k2P1m5NJ69j99N8Q7j59K47j25o1J67r5pQ0j74O4q4p5J02
5330e7J80k73K70l4j18K47l04O8J72k55J75jq4P5mj17O4o3J3J05k06J42J09j62
5354e8R5n0l3J07Oj77K33j82k8K12j52r3K20r2r3J07j99K76p6r9K08k31J02Q3
5378H6j51K0K11j73P6J40l01K41j75k6J67k22J19N0j69J88J66l76K30j7l29L26
5400H1m5r5K26j46j49J24o5L7J8q7K21m5j19K8J28j42M6j38QJ90k14M0J64j14
5424d8K5N6n5J63j29j34J73q2OJ86j76l3K33k79J67k4r3K04k00q1J05J9K6N3j18
5449c6K6L9j48K12j54j04L61l58J74N2j37j4J57k08J62P3k39J84k0m4M4k6n4J79
5473A21l02K86j06m4LJ01j37J33n5k8Q2r7j18K04j64O0J41j81K20j46LN0pk05
$$ plain form
5497 -186 59 17 46 133 -41 -2 161 59 59 130 -40 197 -37 -111 7 -27 12 136 -36 -41 14 -14 142 -1 -128
5522 -128 55 13 -36 45 9 32 116 -123 87 88 3 -2 3 -221 88 7 -41 104 17 -93 183 -95 10 103 -176 30
5548 30 88 -91 113 132 -27 144 21 31 121 -12 96 66 -130 17 108 -123 -33 5 -14 -24 -84 28 47 -145
5572 -145 83 75 -181 169 3 -30 109 -59 -45 23 -44 -6 47 -102 -44 16 -32 62 8 -107 23 -144 71 80 -23
5597 -23 90 81 -90 -114 60 -78 59 -37 -18 133 18 -72 125 -39 -100 123 -224 15 89 -74 90 -14 -87
5620 -87 13 -115 -24 120 -55 10 33 -98 -32 100 -35 138 45 -57 51 -12 31 88 -56 53 64 -84 -29 90
5644 90 -138 -50 -38 -57 52 -255 -62 164 -28 42 140 -32 25 65 -74 129 -31 -146 35 -16 -62 41 -67
5667 -67 -43 -47 -65 48 -32 -65 5 65 -22 111 -73 -200 165 -40 -57 49 -10 -17 36 -112 106 -3 -80 56 -37 -62
$$ packed form
5497a86K45m2K9Q7j74L9J63j02%P1j70K37k34p4J18l4L9J24j72nN5k8J56j43j27
5522a28J83m2m9Q1l6K3Q4k39K10Jq5nNk24L09q1m8J45q7j10K76k78J05R3k79K06
5548C0N8j79K04J9j59J71j23J0R0j33J08l0j96J47R1k31R0L8j9j0o0J12J9j92
5572a45K28qk56L50j66l3J39j68J4O8o7L8N3j49N8O0m8R4n4j15J30j67K15Rj03
5597b3J13rj71k4J74j38J37r6J9J51j15r0J97j64o1K23l47K39P4j63J64j04p3
5620h7J00j28R1J44j75O5K3j31O6J32j35J73r3j02J08o3M3N7j44J09J1j48N5J19
5644I0k28Q8J2j9J09l07J93K26j92P0R8j72N7M0j39K03j60j15J81n1m6J03j08
5667f7K4mj8J13q0l3P0O0q7J33j84j27L65k05j7J06n9pN3j48K18j09p7J36r3k5
$$ plain form
5693 -62 53 -99 -24 85 -117 190 -13 -75 45 89 -65 164 -131 32 121 -86 126 12 -48 51 -115 -113 53
5716 53 -91 -105 60 -3 37 40 66 65 -39 14 94 -3 -114 132 -47 -16 205 -58 65 106 -61 84 116 16 36
5741 36 20 -140 219 29 -77 122 -56 40 72 -41 14 78 -69 39 11 -95 129 -57 -10 128 -44 -33 138
5764 138 -8 18 74 -29 131 11 -81 -5 -116 65 47 -80 24 84 -118 -23 -10 -183 87 -42 -120 142 -75
5787 -75 -76 159 -3 -15 -59 -96 -5 75 -3 53 85 -7 56 -34 -116 147 -99 31 94 -98 1 80 30 46 67 6 122
5814 122 -62 87 30 -103 3 20 20 -73 -102 -47 90 -42 -128 138 -38 12 138 -116 -2 3 -102 41 73 -2
5838 -2 49 64 29 98 153 -27 153 -67 -67 67 -94 31 47 32 74 -33 -67 132 -79 -78 -49 -118 -13 32 -184 17
5864 17 8 -91 137 107 -153 139 -113 -42 98 -112 25 82 -171 -77 10 -61 -2 -22 18 99 20 109 183 -114 12 13
$$ packed form
5693f2J15j52P5J09k02L07k03o2J20M4j54K29k95J63Q9k07K12j14o0R9j66KJ66
5716E3j44j4J65o3M0LK6jj04N3Q0r7j11K46j79L1K21k63J23M1j67J45L2j00K0
5741C6j6j60L59j90j06J99j78R6L2j13N5O4j47J08k8j06K24j86M7J38j72J1J71
5764A38j46K6N6j03J60j20r2P6j11J81j8j27J04O0k02R5J3j73K70j29p8K62k17
5787g5jK35j62j2m4l7R1Q0p8N6L2r2O3r0q2K63k46J30O3j92R9P9n0J6K1o1J16
5814A22j84J49n7j33J06J7%r3k9N5J37j32q6K66j76N0J26k54J14Nj05J43L2p5
5838bN1J5l5O9N5j80J80k20%J34j61J25J6j5M2j07l4J99k11JK9o9J05M5k16K01
5864A7rr9K28l0k60K92k52P1J40k10J37N7k53R4Q7p1N9k0M0Q1p9Q9P4k97J26J
$$ plain form
5890 13 -58 -73 -43 -76 100 -22 -133 105 -31 -21 -2 -54 -26 -37 -37 90 99 -81 160 -18 -85 142 -53 -42 51 -80
5916 -80 57 51 -30 25 75 -65 40 -11 -61 10 -17 69 44 -129 147 86 -127 42 54 -128 47 55 -121 20 -43 -9
5942 -9 59 -116 136 37 -109 19 49 -59 66 -55 101 102 -3 -43 -27 46 88 132 -91 139 -75 -45 7 -38 -64
5967 -64 138 -155 -7 119 -90 48 81 -51 128 145 -11 152 -55 -18 134 -182 -7 45 -44 47 72 3 57
5990 57 -50 -8 118 -64 -41 51 -19 12 24 -114 80 -46 -119 104 46 -56 70 -115 125 -60 -15 76 73 -93
6014 -93 240 53 -25 -5 91 -10 92 -41 -8 20 -88 124 62 -74 -63 81 -3 136 3 -46 85 -7 -94 88
6038 88 -65 1 84 54 -5 18 -156 -14 18 35 86 7 46 -19 -51 157 -6 -117 99 -37 -62 90 -95 2 69
6063 69 130 16 98 -135 122 24 -20 7 -69 -99 116 51 -86 -11 -80 -3 146 -146 15 108 -48 95 -4 -23 99
$$ packed form
5890A3p1j5L0l3J76j22j11K38j36J0J9n2K8j1%J27Rj80K41j78o7K27j95J1R3j31
5916h0J37oq1N5N0j40J05n1n0P1k7Q6k5j73K76o1k13J69J2j82J75Qj76J41o3L4
5942iO8j75K52r9j46J28L0j08J25j21J56Jj05m0J6P3M2M4k23K30k14L0N2m5k6
5967f4K02k93J48J26k09J38L3j32J79J7j56J63k07L7J52l16J75N2q9R1K5o9N4
5990E7j07M2J26j82K3R2p0L1J2j38J94j26p3K23n8j02J26j85K40j85M5R1lj66
6014i3L33j87p8K0R6j01J02j33L3K8j08K12o2j36J1J44q4J39j33m9J31r2q7J82
6038H8j53O6Q3l0n9K3j74J42L2J7N1p9L9o5l2K08j63j11K16j36k5J52j85R7O7
6063F9O1j14Q2k33K57r8m4K7p6l0K15o5j37P5o9P7J49k92J61R3j56J43r9j9J22
$$ plain form
6088 99 6 -51 137 -111 90 66 -75 -42 31 -225 122 63 -36 70 -69 26 111 92 -48 -46 -122 95 15 -103 7
6113 7 46 -55 46 44 -108 -14 -55 -51 102 -160 64 43 -80 55 -17 -92 36 28 44 69 -77 46 124 -106 -83 56
6139 56 48 -23 -82 -58 121 -42 -25 108 -126 -34 11 -142 65 -19 -86 13 -52 11 79 -64 -50 24 22 -31 -45 -10 52 84
6167 84 -29 92 -75 -187 -16 -50 13 112 -147 11 56 -83 -75 -73 -9 107 -67 -76 28 65 -33 61 -19 59 53 16 67
6194 67 -71 -41 -4 -54 -83 61 -139 4 93 78 55 -53 45 27 52 -48 85 -167 -122 32 -19 33 56 -18 113
6219 113 10 -108 47 -26 -2 57 -41 41 3 -62 -66 -2 -23 -1 84 -66 78 76 7 136 -52 -81 137 -46 -18 70
6245 70 -109 -32 117 -89 92 13 -110 134 117 -103 75 -76 -53 39 -60 26 65 -150 62 111 26 116 -31 -75
6269 -75 -33 41 -114 52 -9 3 80 -14 130 -9 -46 104 -50 -75 111 -99 -22 7 -88 -8 107 -21 144 24
$$ packed form
6088I9r3n7J88k48K01k4j41L3P3k56L47n9r9J06j39R5Q5j9j40Kp6K17q0j18J10
6113GL9j01J01kj52R4m1MJ53k62K24k1j23J35p2p5J28qJ6K5j46J23P8k30K3J39
6139E6qp1n9K4J79j63J7J33k34R2M5j53K07q4o7R9o5O3O8j43J4P4kn3j4L5O2L2
6167H4j13J21j67j12J71l4O3R9k59J58M5j39QKO4J16j74rJ04L7r8R4q0P8ol7N1
6194F7j38L0L7n0k9J44k00J43Q9j5k3j08R8j8K5j00J33k52M5J54n1N2K3p4J31
6219A13j03j18J55p3K4N9r8Q2l8o5mO4k1K2Q5j50J44ko9J29j88k9K18j83K8Q8
6245G0j79P7J49k06J81p9j23K44j7k20J78j51K3R2r9Q6L9k15K12M9q5R0j47m4
6269g5M2P4j55J66o1J2P7r4J44j39l7J50j54k5J86k10P7K9r5Q0J15j28J65j20
$$ plain form
6293 24 -81 117 -9 -4 38 -134 -12 -36 -89 133 19 -62 -10 -75 -156 41 -42 -149 169 -95 35 85 -56 -119
6317 -119 41 -90 42 -72 -25 62 -106 -25 49 22 -52 23 -192 125 9 -96 72 37 -21 42 -36 -18 75 -118
6341 -118 -97 -24 -62 144 101 44 115 176 2 18 41 12 96 5 -6 70 -37 -25 13 -90 -13 -67 -109 9 -22 -24 78
6368 78 -64 27 -2 -49 -18 -81 -58 83 29 -23 134 -11 25 148 47 6 -56 -66 -46 -24 -6 118 -74 31 -6 -161
6394 -161 46 -18 -115 18 91 -87 -2 -73 -37 149 44 5 116 -85 25 -63 -26 -61 56 -33 66 -45 -42 -23 -94
6419 -94 39 129 -68 32 61 -43 37 47 -87 28 -52 -149 120 -77 66 171 -120 67 -11 -72 90 95 -80 1
6443 1 27 69 127 -40 37 64 -16 -111 8 -139 -34 44 16 10 -32 -70 8 -19 23 -49 -122 59 49 -78 73 121 -101
6470 -101 17 -19 -41 142 -107 -102 -1 -109 14 -32 -69 -34 77 -47 -58 11 -87 128 -59 -4 -79 -131 30 54 -188
$$ packed form
6293B4j05J98j26NM2j72J22k4n3K22j14q1N2o5q1J97q3j07L18k64J30N0j41o3
6317a19J60j31J32j14M7Q7j68Q1P4k7p4P5k15L17j16j05J68l5n8O3p8J8R3j93
6341a18K1P3l8K06m3n7P1O1j74J6K3k9Q4r1j1P6j07J2L8j03P7n4m2J18l1kJ02
6368G8j42R1k9m7L1o3K3J41n4n2J57j45L6J23j01m1o2j0K0K2J8J24j92J05l7j55
6394a61K07o4r7J33P3j78Q5p1L6J86j05l9J11k01J10q8L7l5J17q9R9j11LJ9p1
6419i4J33R0j97J00K9j04Q0J0j34J15q0r7K69j97J43J05k91J87p8o1J62Nj75Q1
6443AK6M2N8j67P7K7q0r5J19j47J05P8k8om2l8P8k7M2p2p3J81j0j27J51M8k22
6470a01J18l6k2J83k49NJ01j08J23m6l7L5J11j24j1O9r8K15j87N5p5n2J61K4k42
$$ plain form
6495 -188 166 77 -105 90 -55 -14 77 13 109 73 16 18 49 -80 76 16 -29 62 -54 -112 32 -59 101 82 25 40
6521 40 64 -169 115 30 22 95 54 -52 24 -62 -29 43 -135 108 91 -95 74 59 -74 82 -53 -122 83 -52 73
6546 73 21 -119 8 10 -15 95 -54 -123 111 65 58 -3 -27 -61 28 -72 -134 50 -133 55 85 -68 138 -106 -61
6571 -61 47 -97 80 16 -16 127 40 -114 62 -22 -26 12 -13 -33 45 -132 21 24 -24 -15 -12 5 70 -43 -70 20 -95
6598 -95 71 67 -47 68 38 -142 46 114 -100 19 39 -101 54 0 41 13 -60 35 85 -75 130 -9 -14 87 -1
6623 -1 -13 135 36 85 32 -57 -25 -15 5 24 -99 -15 85 -1 76 180 -20 3 179 -54 -10 57 -181 19 -30 -13
6649 -13 86 -101 -9 58 -92 105 83 -219 32 98 10 72 155 -20 75 -43 10 41 27 -123 120 -29 -46 16 -44
6674 -44 106 -11 -147 70 181 -119 109 -153 -6 44 -67 -10 87 -96 74 -32 -53 -10 63 -101 110 -30
$$ packed form
6495a88L54q9j82J95j45M1R1o4R6l6n7KL1j29J56o0m5R1j16n8J44r1J60j9n7J5
6521D0K4k33K84q5qP3m1j06P6q6L3P2j78K43j7j86J69j5j33J56j35o9K05j35J25
6546G3n2j40J27Kk5J10j49o9K34m6po1k4l4Q9j00o2J84j83J88L0j53K06k44M5
6571f1J08j44J77o4l2J43q7j54J76q4mL8k5k0P8j77J53Lm8RLJ7O5j13k7R0j15
6598i5J66mj14J15l0j80J88O8k14J19K0j40J55n4M1k8p3R5N0j60K05j39nJ01q8
6623aj2J48r9M9n3q9L2J0K0J9j23Q4J00q6P7J04k00K3J76k33M4O7k38K00m9J7
6649a3R9j87R2O7j50J97k2l02K51O6q8O2Q3j75R5j18N3L1j4j50K43j49j7O2o0
6674d4J50j17j36K17J11l00K28k62J47N0j11N7R7j83J70j06k1M3P3j64K11j40
$$ plain form
6696 -30 15 91 -30 -105 -65 -54 26 31 6 200 -43 131 109 -89 96 -5 43 28 -25 -109 180 24 -82 -6 -60 -135
6722 -135 122 -10 84 21 -103 -72 -31 -110 -109 -49 -86 90 -100 -10 54 -116 -44 90 -43 -35 -25 -33 99 -65 27 20 -79
6749 -79 -50 102 18 76 35 8 108 112 -38 114 61 -77 14 -154 92 -7 -50 3 8 -6 59 7 -8 -13 -55 -56 10 -53 -74
6778 -74 87 -60 97 69 -33 65 110 44 45 -43 107 24 -107 -55 115 -1 51 -9 -37 155 61 -103 122 -18 -45
6803 -45 38 -21 -44 29 6 -15 71 -73 69 28 13 -7 -96 41 -64 -64 58 27 -110 146 130 -126 108 83 -31 71
6829 71 -16 -123 -78 -27 86 57 -141 79 60 -112 40 -48 -73 105 -65 12 37 -77 37 27 -20 -10 110 -12
6853 -12 -87 47 -86 169 -140 -126 158 -146 127 -21 -56 71 4 -147 109 75 -84 -15 -56 -72 78 13 -5 22
6877 22 -4 107 -20 -45 28 13 -24 122 -45 -105 82 -153 18 78 -65 146 57 -192 113 -63 -111 90 -53
$$ packed form
6696c0M5P6j21p5M0J1Q0Nk5J94k43J74k2j98J85j01M8j5n3q4K89j56j06P6n4p5
6722a35K57j32R4o3j24L1M1p9JO0l7J76j90R0O4j70P2J34j33QJ0qJ32j64R2pr9
6749g9K9J52q4N8m1k7J00Mj50J52n3j38R1j68K46r9m3N3Nj4O5n2j5nm2jO6o3k1
6778g4J61j47J57k8j02R8M5o6Jq8J50q3j31N2J70j16N2o0k8J92r4j64K25j40k7
6803d5Q3n9k3P3k3k1Q6j44J42m1j5k0q9J37j05%J22l1j37K56j6k56K34k5j14J02
6829G1q7j07M5N1J13k9j98K20j9j72J52q8k5J78j70P7K5j14J14j0m7J0J20j22
6853a2p5J34j33K55l09J4K84l04K73j48l5J27o7j51K56l4j59O9m1j6J50o5j8K7
6877B2k6J11j27k5P3j5l7J46j67o0J87k35J71O0j43K11q9k49L05j76m8K01j43
$$ plain form
6900 -53 -96 28 -126 -109 -10 -52 84 6 25 62 -68 48 34 44 101 152 -132 -78 -22 -78 -5 -32 6 -8 49 21 51
6927 51 18 83 84 146 94 121 -23 129 53 -82 24 -10 72 153 -77 -11 -4 -55 -26 39 -48 -20 -23 -8 118 -7 38 117
6955 117 -43 71 90 20 34 8 -52 -68 -1 -60 17 -49 38 -31 60 -9 -80 14 -40 105 -85 64 29 15 107 39 -31
6982 -31 13 -75 61 85 -142 27 5 -11 17 -43 24 15 21 -32 98 -27 28 43 -80 75 -99 -23 61 23 -54 180 -10
7009 -10 28 3 -78 -1 119 -89 -8 75 -99 -40 41 63 -11 -55 -43 2 89 52 -29 5 -11 -44 13 109 59 -154 -26 -58
7037 -58 -30 16 50 -62 -41 -133 144 -33 -48 -11 84 23 98 92 -48 138 12 -61 74 -79 11 -48 -35 13 -100 -69
7063 -69 36 -24 -83 29 -67 163 91 -20 71 -5 -34 52 -141 13 124 40 -26 97 42 33 -4 -76 53 -21 -81 31
7089 31 3 -91 33 -39 2 33 -81 -8 61 -56 145 -15 -84 74 -39 -64 91 6 -60 115 0 -92 -39 -15 -75
$$ packed form
6900e3m3J24j54J7R9m2J36p8J9L7j30J16j4J0N7N1k84N4N6n6P3k7L8j4N7k8L0
6927E1l3O5JO2n2K7j44J52p6j35J06l4Q2Q1k30O6Pn1K9O5q7K8lJ5J26j25M5P9
6955A17j60J14J9p0J4k6o0j6O7n9P7o6Q7o9R1o9p1R4n4J45j90J49l5j4R2o8p0
6982c1M4q8J36K4k27J69k2j6K8o0O7rOn3J30j25N5J5j23J55j74P6Q4l8p7K34j90
7009a0L8k5q1P7J20k08Q1Q3j74N9Q1K2p4m4J2M5Q7l7q1L4j6l3N7R6n0k13J28l2
7037e8K8M6L4j12K1r2K77j77j5L7R5o1P5oj40J86j26p3J35j53R0n9J3M8j13L1
7063f9J05o0n9J12r6K30p2j11R1p6k9Q6j93J54J11q4o6J23n5rl7p2J29p4o0J12
7089C1k8r4J24p2M1L1j14P3O9j17K01j60o9J58j13k5J55q5o6J75j15r2N3K4o0
$$ plain form
7114 -75 63 -20 89 26 -70 5 33 121 198 -32 77 52 14 32 -83 -144 18 87 83 191 -65 61 55 -19 -95 -78 -36
7141 -36 16 -53 41 20 -11 58 27 17 3 17 15 -49 -12 -2 -18 63 -6 -31 63 -50 46 16 90 79 -36 22 -13 -4 -33 -5
7171 -5 59 121 -38 -82 155 -11 -34 88 -13 -78 -149 -164 147 56 25 -7 10 -37 -14 -101 2 -6 -111 -23 63 -149 -10
7198 -10 38 97 169 90 76 35 -40 60 76 34 80 48 -57 -54 -53 -88 47 6 -48 66 -1 -9 -38 -31 127 -7 -12 108 -6
7227 -6 5 74 -42 5 -28 -62 33 15 -72 54 43 -63 9 -91 -31 -23 -119 3 52 -16 70 5 -93 90 -20 53 -19 -41
7255 -41 18 42 23 -68 77 21 -43 -72 -79 -48 -92 -96 60 69 -71 17 40 -51 78 -40 -6 -81 -73 107 -46 -68 45 -7
7283 -7 17 96 -25 87 42 -22 64 3 -40 0 8 -112 99 63 -47 -21 -101 -18 67 -58 69 -36 -102 118 -69 -91
7309 -91 11 -215 -136 -44 -155 -24 125 53 18 -49 -30 96 -53 -94 29 -107 -178 -70 -32 49 40 -20 24 -15 -62 12
$$ packed form
7114g5J38q3J09o3r6P5K8Q8P7k30J09k5l8J8j15o1J62O9mJ08k56J26op4p6J7M2
7141c6N2o9R4k1l1O9l1j0j4J4ko4L7J0j6Q1o9k5R4j13R6l0P4j1j15N8l5Rk9K8
7171eO4O2j59m4K37j66k3J22j01o5p1j5L11r1l1l2J7m7K3q7J03qj05Q8Q6k12J39
7198a0M8N9P2p9j4m1p5J00J6m2M6l2j05LJl5J35m1n4J14o7qk9PJ58j34nJ20j14
7227fJ1O9j16M7l3l4R5j8q7J26j1j06P2j00O0Qr6J22M9o8Q6o5r8J83j10P3p2k2
7255d1N9K4j9r1J45n6o4k9pL1m4mJ56Rj40Q8K3r1J29j18L4p5QJ80j53k2J13n2
7283gK4P9j21J12m5o4Q6o1m3M0Qj20K11l6j10K6q0Q3Q5j25J27j05o6K20j87k2
7309i1J02k26P9R2j11J31J49p2l5o7J9J26j49m1J23j36p1J08L8Q1ro0M4l9m7P4
$$ plain form
7335 12 -33 -10 -6 2 -19 52 -29 11 68 -116 -45 -90 -88 72 -98 -110 93 -108 20 15 -33 30 68 -30 30 94 44 17 -94
7364 -94 -35 31 -74 -161 23 131 -19 -10 -57 34 -41 -21 4 7 -22 -19 50 54 63 -139 95 12 -10 48 102 -105 163 -42
7392 -42 -39 67 -10 5 -7 -62 128 21 -35 150 23 -51 79 -66 47 116 -122 28 85 -100 -59 -38 -24 -52 -112
7417 -112 -4 71 -35 106 39 -158 11 110 4 62 79 -42 76 -47 4 22 -92 -145 -1 -78 52 44 -69 134
7441 134 46 -27 -86 3 -27 16 -11 -53 37 -79 -115 16 29 85 26 -8 82 -12 -43 144 98 -32 85 -69 -40 -15 -133
7468 -133 55 24 -10 52 -5 -99 76 24 59 -55 -6 -13 -15 -60 70 63 -50 -23 -19 -6 95 51 -131 172 -22 44 31
7495 31 -110 43 -42 -62 164 -71 1 17 -131 15 23 -5 5 18 13 147 -122 52 96 -80 -44 163 -86 -23 -59
7520 -59 -61 -61 2 -12 -60 36 -75 -19 -131 -52 98 -33 27 27 -171 -8 -18 -53 167 13 -23 158 -19 2 -5 -125 30
$$ packed form
7335A2m5K3MQk1P1q1M0N7j84P1m5KJ60j70j2K03k01J28nm8O3L8r8O0O4n0k7j11
7364i4N9O6j05q7J84J08j50Rm7R1p5K0K5Lk9LO9MRk02K34q3k2N8N4k07K68k05
7392d2LJ06p7J5j2n5J90j07n6J85j27p4J30j45J13O9k38J50N7j85M1K1J4k8o0
7417a12J08P5j06J41o7j97J69R9j06N8J7j21J18j23N1J8j14n3J44p7J30qj13K03
7441A34q8p3n9Q9l0M3k7m2R0j16l6J31J3N6n9l4R0r4l1J87m6j30J17j54K9K5j18
7468a33J88l1l4O2n7r4J75n2L5j14M9pkm5J30pj13K7MJ3J01m4j82L03j94O6j3
7495C1j41J53q5k0K26k35P2J6j48J46Qk8J0J3nJ34k69J74M4j76L6K07k49O3l6
7520e9k%O3j4m8R6j11N6j12P9J50j31O0%j98J63j0l5K20j54l6J81j77K1pj20J55
$$ plain form
7547 30 97 -73 -14 90 -61 49 -51 2 11 -47 -132 2 -38 43 28 -43 -21 15 46 -25 -42 -48 77 -12 -44 100 -49
7574 -49 -15 -1 -42 80 26 -94 -44 64 83 133 -59 10 101 -66 -61 46 19 132 -37 -88 -53 -26 -90 -1 51 40 68
7601 68 -100 23 -94 -16 39 -45 -39 -29 -99 30 61 -82 -63 10 10 8 18 -54 77 53 -130 179 -60 -45 20 -46 -53 123
7629 123 46 -28 65 -4 88 -13 41 84 54 -47 67 -7 -8 -15 -78 136 137 -108 31 -37 -65 -3 25 6 91 -58 106
7656 106 175 24 42 58 -99 -11 -41 -77 -3 -67 -15 48 -114 40 -54 -8 26 -19 237 50 -159 56 78 50 -4 -21
7682 -21 99 -139 73 -46 -35 -69 129 14 -65 -82 25 -96 -34 -42 -32 78 51 50 3 49 -159 11 -6 -34 62 66
7708 66 11 56 -100 14 -9 8 101 85 -65 24 -40 30 32 -23 -77 -4 -89 -1 -47 8 148 -119 -51 -41 -113 -73 -6 -91
7736 -91 46 114 -13 -22 87 -24 -85 55 -85 70 13 23 -10 29 77 124 -131 53 -9 17 56 -23 -20 57 -93 -101 -3
$$ packed form
7547C0O7j70N9J04j51J10j00N3Rn8q5J34m0Q1j5p1K2L6L1p1j7oJ25q9l2J44j49
7574d9L4J4m1J22n4j20N0J08J9N0j92O9R1j67NJ07k7J13j69n1L5K7o4Q9N2j1K8
7601F8j68J23j17P8N5q4OJ0p0J29L1j43J9P3%kJ0p2J31k4j83L09k39J5O5o6pJ76
7629A23p7p4R3o9R2j01N4M3l0j01J14p4jpo3K14Jk45J39o8k8O2K8j9Q5j49J64
7656A06O9j51J8J6j57Q8l0l6P4o4N2O3j62J54r4M6L4m5K56j87k09K15K2k8n4j7
7682b1J20k38K12j19J1l4J98j15p9j7J07j21O2qJ0J10k7jm7M6k08J70j7k8R6M
7708F6n5M5j56J14k3J7R3j6j50Q9o4P0Kn5n4P3q5Q8m6N5J40k67O8J0p2M0O7q5
7736i1J37O8j27rJ09j11o1J40j40J55n7J0l3L9M8M7k55J84o2K6L9p9LP7j50qR8
$$ plain form
7763 -3 -63 -26 -39 -111 11 10 -32 73 -86 -11 41 -22 15 -36 -41 -102 141 45 24 3 24 102 -37 -68 -63 -14 -12 -41 -11 130
7793 130 32 78 47 -43 7 -8 -30 -22 27 36 -83 99 -38 44 15 -49 62 33 -117 -3 71 -46 -10 -27 2 14 43
7820 43 18 -82 -113 133 30 -14 184 32 -138 47 -8 -13 85 -74 59 161 -26 124 -19 -9 45 -48 109 45
7844 45 9 8 47 17 27 57 -94 46 44 -131 122 22 -10 22 31 31 37 -15 -24 82 8 48 61 -32 -14 34 -56 -6 91 -20
7874 -20 29 -133 -127 62 -131 64 63 -67 4 -67 35 87 -78 -3 50 0 58 17 36 33 87 12 48 -100 -1 98 -14
7901 -14 36 103 -51 32 -12 -66 -55 -16 -48 107 -20 23 86 25 54 45 22 16 -50 -40 53 30 38 5 12 -42 21 -11 19 40 -122
7932 -122 15 86 -119 77 -89 -30 50 -16 52 -76 -47 36 1 -16 -19 68 -76 -6 19 11 44 -77 57 32 36 60 57 -72
7960 -72 125 -13 -89 17 -38 -126 -43 -76 97 -67 34 113 7 -4 58 19 -61 72 14 -98 30 -102 131 131 -54
$$ packed form
7763co0L7j3p2J22jm2J05j59P5N2o3L7n1no1K43r6k1k1K1P8j39l1NM9Kk9L0J41
7793A30r8M6l1r0N0j5k2QM9Rj19J82j37Q2k9o4J11k9j50J14P4j17L6j7K9J2K9
7820D3k5j00l1K46j03m4J98j52j70J85n5nR8j59J33J02j87J50j43J0N4r3J57o4
7844D5l6jL9l0J0L0j51J40kj75K53j00l2L2R%On2rJ06p4M0J3r3J8M8r0N0R7j11
7874b0M9j62OJ89j93J95jj30P1p1J02N2j65P5N3n0N8m1J9lN4p5L6j48R9R9j12
7901a4N0O7j54Q3m4n4J1L9l2J55j27M3O3o1K9rk3oo6J0R3k3Ql3Pn4O3l2L0K1j62
7932a22J37P1k05J96j66N9Q0o6O8j28K9Q3l5j7lQ7j44P0K5qL3j21J34k5MK4lj29
7960g2J97j38p6J06n5q8Q3l3J73j64J01P9j06j1O2l9q0J33n8j12J28j32K33%j85
$$ plain form
7985 -54 103 43 -36 8 20 -14 -1 -20 -32 29 69 44 88 46 6 15 -16 70 40 6 -19 -34 43 38 -61 -43 50 -60 33 22
8015 22 38 -36 -34 66 -1 -177 -49 -19 17 51 43 -102 37 47 20 3 -30 -45 74 52 18 52 -5 -69 33 -4 6 -36
8043 -36 -103 98 22 -29 -27 -38 28 171 -77 25 1 11 121 32 -54 69 -167 -8 109 -7 -30 -45 -34 -118 -3
8068 -3 -5 8 -110 36 20 11 -50 145 -22 -58 -15 -160 -26 -57 -63 179 -44 -17 62 3 96 -1 -116 -64 12 9 26 91
8096 91 38 -87 74 12 60 -28 9 9 -21 -18 58 72 -15 -15 -51 66 73 -60 97 -137 -39 127 4 40 51 -36 -34 58 -33
8125 -33 7 -8 -14 26 -38 -77 142 -53 45 27 15 -2 -69 12 22 -21 -41 65 50 -70 63 -26 32 18 -62 66 97 36
8153 36 5 67 -10 41 42 22 103 -91 -1 -57 -15 55 34 10 151 -34 -53 26 29 27 24 55 -12 29 -85 -20 51 -127 -86 -64
8183 -64 40 11 -20 -44 68 -28 91 47
$$ packed form
7985e4J57o0p9M4J2l4J3j9j2O1M0k5M4m2m0Rl1Q6l0l4k5j5P7nr9J8R3j10R3j1
8015B2J6p4KJ00o7j76J28L0L6L4qj45J39J0k7j7l3j5J19k2l4L4n7o4J02l7J0m2
8043c6o7K01p6n1Kj1O6J43k48J02k4J0J10q9q6J23k36J59J17j16k3j5J1q4J15
8068ckJ3j18J46j6ro1J95j67l6M3j45J34l1oK42k23K7P9n9R3r7j15N2P6lJ7O5
8096I1n3j25J61o2M8q8L7%l0LP6J4q7%l6J17Pj33J57k34R8J66j23L6J1q7KR2r1
8125c3M0j5oM0o4l9K19j95R8j8j2j7o7Q1J0m3k0J06j5j20J33q9N8j4q0J28L1o1
8153C6l1O2p7N1Jk0Q1j94R0n6M2P0k1k4J41j85j9P9LklL1o7M1j14O5P1j78M1K2
8183f4J04k9l1k4J12r6J19m4
8191D7
$$ Imaginary data points
##PAGE= N=2
##DATA TABLE= (X++(I..I)), XYDATA
$$ plain form
0 0 0 0 0 0 0 0 0 0 0 0 0 0 0 8 -8 8 -8 8 -16 16 -24 24 -32 32 -40 48 -56 64 -72 81 -96 105 -121 137 -154
35 -154 177 -196 218 -246 274 -305 339 -374 416 -460 509 -560 617 -681 751 -826 909 -1004
53 -1004 1108 -1224 1355 -1504 1677 -1876 2113 -2396 2744 -3183 3761 -4551 5705 -7565 11058
68 11058 -19981 95893 168743 67596 64084 -5455 -35519 -65969 -89094 -97657 -108116 -94329
80 -94329 -5763 18270 27753 62949 58781 51961 65586 37125 14466 -33437 -81068 -62075 -56140
93 -56140 -67864 -34887 -37366 -42613 -8060 9294 27336 28737 -4241 9487 18271 136 22039
106 22039 18172 -14025 -5395 222 13627 28736 979 -2799 2996 -17911 7399 27078 2888
119 2888 7567 11434 13329 36658 25147 14578 12837 -20289 -12748 9043 -16684 -21860 -23500 -38154
$$ packed form
0@%%%%%%%%%%%%%Qj6J6j6J6k4L2m0M8n6O4p2Q8j04J20j36J53j77K01k26K58k91
35a54L31l73M14m64N20n79O44p13P90q76R69j069J177j298J432j577J735j913
53a004K112k332K579k859L181l553L989m509N140n927O944q312J0256j3270J8623
68A1058l1039J15874P2850j01147l512o9539l0064l0450k3125q563j0459J3787
80i4329Q8566K4033R483L5196m168o820J3625k8461k2659m7903m7631J8993N935
93e6140j1724L2977k479n247L4553J7354J8042J401l2978J3728Q784j8135K1903
106B2039l867l2197Q630N617J3405J5109k7757l778N795k0907K5310J9679k4190
119B888M679L867J895K3329j1511j0569j741l3126P541K1791k5727n176j640j4654
$$ plain form
133 -38154 -15415 -1602 5210 22592 1361 1141 30067 15858 10895 12222 -18506 -22085 -17792
146 -17792 -21536 -7824 -26689 -40766 -13001 -10869 470 30989 18701 13028 21245 16562 30677
159 30677 21147 -6144 -356 -14951 -26377 -1333 -9172 -22806 -14387 -15855 5111 21656 11226
172 11226 23117 14563 -7649 14037 16419 -874 1471 -12076 -11873 2005 -5783 6353 7748
185 7748 -17391 -985 12891 1567 9355 -657 -13933 -5085 -10730 883 13156 -10849 -6517
198 -6517 6641 -5701 5836 8637 -7695 -3347 -8257 -3805 14101 -2682 -6457 4551 -10012
211 -10012 -668 13765 -353 -761 -7170 -13860 3419 -2379 -5715 9042 -4412 -2226 18721 10778
225 10778 9601 7382 -6482 3007 903 -6047 7718 -6824 -18171 1398 -545 234 9162 -1472
$$ packed form
133c8154K2739J3813O812J7382k1231k20K8926j4209m963J327l0728l579M293
146a7792l744J3712j8865j4077K7765K132J1339L0519j2288n673Q217m683J4115
159C0677r530k7291N788j4595j1426K5044p839j3634Q419j468K0966J6545j0430
172A1226J1891q554k2212K1686K382j7293K345j3547K03J3878p788J2136J395
185G748k5139J6406J3876j1324P788j0012j3276Q848n645J1613J2273k4005M332
198f517J3158j2342J1537K801j6332M348m910M452J7906j6783l775J1008j4563
211a0012R344J4433j4118m08o409o690J7279n798l336J4757j3454K186K0947p943
225A0778j177k219j3864R489k104o950J3765j4542j1347J9569j943P79Q928j0634
$$ plain form
239 -1472 2282 2687 -5711 10095 2758 -15485 14 233 -4278 9146 2900 275 667 -10436 3805
254 3805 5817 -13967 -3436 -2518 -14299 -177 2369 661 5913 -3562 6740 16300 -1196 4527
268 4527 7621 -10601 -3165 2575 -1729 4039 -5165 -3504 8901 -3948 551 11597 -4986 -3457
282 -3457 4178 -2180 3584 -2005 -6513 5576 -4141 -4270 11326 -2234 -6450 2166 -5116 -458 906
297 906 -5264 5131 -1406 -7077 9385 635 -7444 3062 -4351 -4279 1194 -5354 2424 667 -7667
312 -7667 8670 6905 -2103 10591 5126 -1529 4802 -2520 -166 950 -10077 1439 3339 -7838
326 -7838 5017 5259 -3462 4736 1659 886 5126 -5759 -250 3547 -10457 -1491 3628 -7033 580
341 580 1861 -1538 4088 -3790 -1456 5903 -7888 -3725 4729 -7449 -3585 1132 -3934 1692 -2243
$$ packed form
239a472L754M05q398J5806p337j8243J5499K19m511J3424o246k625L92j1103J4241
254C805K012j9784J0531R18j1781J4122K546j708N252r475J0302R560j7496N723
268D527L094j8222P436N740m304N768r204J661J2405j2849M499J1046j6583J529
282c457P635o358N764n589m508J2089r717j29J5596j3560m216Q616p282M658J364
297I06o170J0395o537n671J6462q750q079J0506p413P2N473o548P778j757q334
312g667J6337j765r008J2694n465o655O331p322K354J116j1027J1516J900j1177
326g838J2855K42q721Q198l077p73M240j0885N509L797j4004Q966N119j0661P613
341E80J281l399N626p878K334P359j3791M163Q454j2178L864M717n066N626l935
$$ plain form
356 -2243 -1516 9735 -382 134 11833 438 -365 6967 86 2259 -970 -5877 3465 -4055 -7463
371 -7463 6716 -968 -4170 6927 2926 4523 5521 -2358 3430 -2140 -10715 1064 -3902 -12143 -1201
386 -1201 -2415 -1163 6423 2176 7413 6625 -4017 4610 1890 -11666 -5892 -8598 -12695 -3434 -3702
401 -3702 1989 8544 1777 11276 16563 4974 9003 6148 -6192 -3297 -6191 -7718 -2357 -9633 -4186
416 -4186 6192 -448 6952 12632 1174 2862 2345 -2996 1127 -6528 -8265 -299 -7554 -2301 9271
431 9271 493 1201 4712 -1255 2656 -1080 -6527 -1224 -9903 -10273 3580 -1560 -1867 5557 1230 4896
447 4896 7254 2657 7419 -468 -7886 2978 -834 -5089 2564 -2625 -3103 1778 -823 5574 2962
462 2962 -6548 2239 1758 -4372 4370 1335 -3498 817 -1591 3941 6335 -3891 1360 2414 -6204
$$ packed form
356b243P27J1251j0117N16J1699j1395q03P332o881K173l229m907R342p520l408
371g463J4179p684l202J1097m001J597R98p879N788n570q575J1779m966q241J0942
386a201j214J252P586m247N237p88j0642Q627k720j3556N774k706m097R261k68
401c702N691O555o767R499N287j1589M029k855j2340K895k894j527N361p276N447
416d186J0378o640P400N680j1458J688n17n341M123p655j737P966p255N253J1572
431I271q778P08L511n967L911l736n447N303q679l70J3853n140l07P424m327L666
447D896K358m597M762p887p418J0864l812m255P653n189m78M881k601O397k612
462B962r510Q787m81o130Q742l035m833M315k408N532K394j0226N251J054q618
$$ plain form
477 -6204 2435 3688 -3255 -205 -3216 -862 4995 -3084 -706 2329 -8186 -1895 4468 -1908 1176
492 1176 -590 -2023 5692 1708 3009 7727 -4159 -3667 2943 -4350 -2973 -3225 -9227 -3606 -4032 -2510
508 -2510 6453 -734 -2378 6565 2138 4247 8456 746 1179 -187 -3293 4784 -251 -6008 1431
523 1431 -2871 -3022 5618 1472 726 1210 -2820 5118 4880 -1720 4203 -1050 -7144 1206 -260 -2588
539 -2588 -940 -6308 -1443 1801 -3303 4142 2918 -6164 900 2555 -901 1910 -3819 -4270 -1111
554 -1111 -6070 1328 5047 -4502 390 4173 745 5838 3463 442 2680 -3594 -59 5984 -3700
569 -3700 -3149 456 -4658 335 2728 -96 2973 -2543 -2491 6269 367 -422 4589 -1943 -160 4346
585 4346 1245 3245 -1450 -6155 764 -3050 -5687 452 -5875 -7894 -1625 -2330 2325 3566 -1029
$$ packed form
477f204Q639J253o943L050l011K354N857q079K378L035j0515O291O363o376L084
492A176j766j433P715l984J301M718j1886M92O610p293J377k52o002N621m26J522
508b510Q963p187j644Q943m427K109M209p710M33j366l106Q077n035n757P439
523A431m302j51Q640m146p46M84m030P938k38o600N923n253o094Q350j466k328
539b588J648n368M865L244n104P445j224r082P064J655l456K811n729m51L159
554a111m959P398L719r549M892L783l428N093k375l021K238o274L535O043r684
569c700N51L605n114M993K393k824L069n516N2Q760n902p89N011o532J783M506
585D346l101K000m695m705O919l814k637O139o327k019O269p05M655J241m595
$$ plain form
600 -1029 5594 4440 811 7970 2673 -4075 -471 -3515 -2360 593 -4551 -844 87 -3558 6057
615 6057 7204 1136 5257 2325 -220 3468 -1671 -1780 -1847 -8895 -2278 1868 -3864 1034 1331 -2579
631 -2579 2945 2073 2211 3745 -4798 -3654 390 -6171 -2791 -206 -5759 -1430 928 1900 7294 2158
647 2158 1547 6676 598 1708 5639 -2102 -3095 -2514 -4265 1211 -708 -2164 4252 9 -62 7516
663 7516 2608 190 1085 -3313 -348 -1057 -4913 234 -3762 -6883 1885 930 -507 3331 -824 137
679 137 1339 -3042 1205 -1087 -7456 -827 -478 -2759 2844 930 263 3792 1108 5028 6186 -1504
695 -1504 1605 1732 -3670 1079 347 -2515 795 -1727 706 4813 -1081 920 2919 -3161 426 2131
711 2131 -2505 -373 -2642 -3522 1496 -2410 -1117 3068 -3431 -1494 2692 -1796 12 -464 -3213 1162
$$ packed form
600a029O623j154l629P159n297o748L604l044J155K953n144L707R31l645R615
615F057J147o068M121k932k545L688n139j09o7p048O617M146n732M898K97l910
631b579N524q72J38J534q543J144M044o561L380K585n553M329K358R72N394n136
647B158o11N129o078J110L931p741r93N81j751N476j919j456O416m243p1P578
663G516m908k418Q95m398K965p09l856N147l996l121Q768r55j437L838m155R61
679A37J202m381M247k292o369O629L49k281N603j914o67L529k684L920J158p690
695a504L109J27n402M749p32k862L310k522K433M107n894K001J999o080L587J705
711B131m636K132k269q80N018l906J293M185o499J937M186m488J808m76k749M375
$$ plain form
727 1162 -1081 -1169 4075 -1697 -2486 2978 -823 570 2734 -1123 1701 566 -1412 4655 779 -2238
743 -2238 3345 -99 -882 2680 -1184 -272 -491 -3735 1976 1129 -3327 2176 32 -2850 1967 -78
759 -78 -253 1176 -2999 958 2222 -3128 1407 1098 -3596 808 398 -832 1594 -2495 -812 1968
775 1968 -2816 962 3275 -2279 993 1771 -947 2052 -769 -1513 1807 -2893 -881 3191 -2311 -635
791 -635 1749 -1661 1511 1108 -1015 2517 -1521 -2044 2916 -1826 -1659 2230 -1671 522 2122 -646
807 -646 2680 282 -2020 3142 -480 -2166 2288 -1622 -1975 839 -2119 557 504 -2783 2115 305
823 305 -2921 2361 -304 -2476 1450 -909 265 1773 -2032 1664 1502 -2967 2003 1180 -2532 1257
839 1257 -444 -934 1563 -1816 609 2411 -2488 1492 2878 -1973 1163 730 -1477 1245 -1470 -738
$$ packed form
727A162k243q8N244n772p89N464l801J393K164l857K824j135j978O067l876l017
743b238N583l444p83L562l864R12k19l244N711q47m456N503k144k882M817k045
759g8j75J429m175L957J264n350M535l09m694M404m10j230K426m089J683K780
775A968m784L778K313n554L272P78k718K999k821p44L320m700K012M072n502J676
791f35K384l410L172m03k123L532m038n23M960m742J67L889l901K193J600k768
807f46L326k398k302N162l622j686M454l910l53K814k958K676n3l287M898j810
823C05l226N282k665k172L926k359J174J508l805L696j62m469M970q23l712L789
839A257j701m90K497l379K425J802m899L980J386m851L136m33k207K722k715P32
$$ plain form
855 -738 2330 -2770 -463 2605 -2449 19 1487 -1456 1040 -558 -1478 2175 -2088 -1740 2651 -1940
871 -1940 -849 2225 -1138 844 1004 -1064 2818 9 -1631 3188 -629 -1723 1944 -1610 -1035 437
887 437 -2370 946 250 -2394 2761 890 -1299 3236 775 -124 2360 -994 340 537 -3519 335
903 335 -196 -3647 1166 162 -1753 2072 -26 299 2179 -1899 568 1159 -3462 68 72 -3423 59
920 59 -359 -1088 2089 -734 660 2934 -1788 756 2258 -2426 114 508 -1884 1348 -447 -371 3173
937 3173 -649 508 4036 -478 828 2362 -1227 960 207 -1483 2068 -1189 -1835 2667 -1146 -1271
953 -1271 1760 -1740 -689 -123 -2690 710 -870 -3074 1569 -636 -1940 2290 -543 -558 1135 -1785
969 -1785 659 274 -3254 601 -471 -3262 1281 -170 -1276 1827 -444 1201 2802 -523 2347
$$ packed form
855g38L068n100K307L068n054K468J468k943K496j598r20L653m263L48M391m591
871a940J091L074l363J982J60k068L882k809j640M819l817j094L667l554N75J472
887D37k807L316o96k644N155j871k189M535k461q99K484l354J334J97m056L854
903C35n31l451M813j004j915L825k098L25J880m078K467N91m621L530Ml495L482
920E9m18p29L177k823J394K274m722K544J502m684K540L94k392L232j795P6L544
937C173l822J157L528m514J306J534l589K187p53j690L551l257o46M502l813j25
953a271L031l500J051N66k567L400j580k204M643k205j304M230k833j5J693k920
969a785K444l85l528L855j072k791M543j451j106L103k271J645J601l325K870
$$ plain form
984 2347 2323 -1865 1682 1072 -1829 1158 -582 -840 1902 -1017 1027 3048 -1283 1687 2773 -963
1000 -963 1623 578 -1670 774 -2080 -1654 1235 -2799 -1061 1632 -1859 447 1424 -1313 1042 -544
1016 -544 -1816 1360 -2230 -2702 731 -2988 -2091 644 -1998 231 414 -1279 2357 586 -971 2982
1032 2982 -108 -963 2326 -574 40 1258 -1450 1335 797 -1640 2542 771 -1331 2484 558 242
1048 242 2417 -307 1297 1911 -1617 1902 1218 -2324 1127 -2 -1812 1063 -1079 -633 1075 -2187
1064 -2187 456 1618 -2348 562 482 -2319 384 -983 -1996 402 -2536 -1463 1237 -2495 -384
1079 -384 1324 -1858 429 690 -1180 1473 -712 -1292 1965 -1520 -911 2003 -1550 -133 1567 -709
1095 -709 1881 1317 -116 3421 1090 390 3920 700 525 2632 -449 836 873 -1852 890 -525
$$ packed form
984B347k4m188L547o10k901K987j740k58K742k919K044K021m331K970J086l736
1000i63K586j045k248K444k854M26K889m034J738K693l491K306R77k737K355j586
1016e44j272L176l590m72L433l719Q97K735k642K229J83j693L636j771j557L953
1032B982l090q55L289k900O14J218k708K785n38k437M182j771k102L815j926l16
1048B42K175k724J604O14l528L519o84l542L451j129j810K875k142M46J708l262
1064b187K643J162l966K910q0k801K703j367j013K398k938J073K700l732K111
1079c84J708l182K287K61j870K653k185n80L257l485O09K914l553J417J700k276
1095g09K590n64j433L537k331p00L530l220j75K107l081J285L7k725K742j415
$$ plain form
1111 -525 -2561 1284 -695 -1852 1477 -932 -517 1143 -1558 365 39 -3101 73 -997 -3435 -107
1127 -107 -1756 -2549 208 -1794 -318 1314 -1823 1181 1740 -1468 1693 1332 -798 1731 156 194
1143 194 2336 -680 819 2581 -1019 1398 2315 -638 1534 865 -529 1727 -810 -799 1669 -1988
1159 -1988 -997 1069 -2087 -465 161 -1849 693 -613 -1533 1674 -1055 -1294 1674 -1329 -727 736
1175 736 -1820 158 -184 -2236 1060 -451 -1657 1994 -65 -581 2195 -136 983 1913 -707 1696
1191 1696 1164 -1594 1618 146 -1746 962 -890 -1080 1031 -1544 161 1037 -1801 1041 1027 -1542
1207 -1542 1148 140 -1154 1248 -891 -515 1390 -1706 135 1331 -1838 628 745 -1470 796
1222 796 -385 -926 1360 -1246 -648 1622 -1468 154 1668 -1072 1037 756 -825 1647 -322 -1036
$$ packed form
1111e25k036L845j979j157L329k409M15J660k701J923l26l140L174j070k438L328
1127a07j649p93K757k002J476J632l137L004N59l208L161l61k130K529j575L8
1143A94K142l016J499J762l600K417R17k953K172o69j394K256k537J1K468l657
1159a988R91K066l156J622O26k010K542j306r20L207k729k39K968l003O02J463
1175G36k556J978l42k052L296j511j206L651k059n16K776k331J119R30k620K403
1191A696n32k758L212j472j892K708j852j90K111k575J705Q76k838K842j4k569
1207a542K690j008j294K402k139L76J905l096J841J196l169K466J17k215K266
1222G96j181n41K286k606N98K270l090J622J514k740K109k81j581K472j969p14
$$ plain form
1238 -1036 1628 -1461 -1132 1182 -1585 -477 695 -1290 961 324 -1011 1903 41 -999 1778
1253 1778 -592 -635 1093 -1247 182 524 -1521 1159 376 -1567 1638 78 -1024 1301 -856 -424
1269 -424 831 -1598 336 731 -1941 1028 679 -1193 1514 272 -371 1474 -751 149 1276 -1714
1285 -1714 189 624 -1913 408 132 -1328 915 -544 -706 1488 -1067 13 1615 -1215 369 986
1301 986 -1271 855 31 -1051 1252 -756 -811 1456 -1224 -598 1165 -1289 229 640 -1052 1200
1317 1200 157 -722 1954 -133 -488 1984 -524 -125 1207 -1120 344 11 -1567 814 -344 -1511
1333 -1511 1211 -456 -807 1302 -589 226 941 -1222 776 404 -1737 815 -213 -1494 821 -696
1349 -696 -653 1095 -952 444 1279 -1277 949 880 -1343 862 -196 -1088 851 -1025 -483 1232 -1329
$$ packed form
1238a036K664l089L29K314k767J108J172j985K251o37j335K914j862j040K777
1253A778k370m3J728k340J429L42k045K680p83j943L205j560j102K325k157M32
1269d24J255k429J934L95k672K969l49j872K707j242o43J845k225R00J127k990
1285a714J903M35k537K321k76j460K243j459j62K194k555J080J602k830J584O17
1301I86k257K126q24j082K303k008n5K267k680O26J763k454J518M11j692K252
1317A200j043q79K676k087l55K472k508L99J332k327J464l33j578K381j158j167
1333a511K722j667l51K109j891Q15P15k163J998l72k141K552j028j281K315j517
1349f96M3J748k047J396Q35k556K226o9k223K205j058q92J939j876N42J715k561
$$ plain form
1366 -1329 352 1575 -894 1020 1116 -566 1397 76 -650 1263 -1141 -737 1065 -1663 -563 570
1382 570 -1455 361 314 -691 1553 223 -230 2100 -71 -106 1488 -927 -102 360 -1660 2 -672
1399 -672 -2024 762 -735 -1122 1342 -374 -65 1421 -537 627 833 -1366 644 -194 -1993 518
1415 518 -728 -1484 690 -841 -247 1137 -738 996 1396 -790 1299 808 -781 1072 -104 -708
1431 -708 948 -931 -11 1217 -1040 669 1503 -762 1115 848 -526 1111 -374 -811 797 -1624
1447 -1624 -903 464 -1872 -398 362 -1209 546 41 -823 1257 -518 -712 1167 -1008 -611 760
1463 760 -1204 50 293 -1296 811 -59 -1027 1346 -283 -351 1417 -321 359 1455 -169 1246 1234
1480 1234 -515 1342 319 -1010 855 -637 -1122 446 -1184 -355 498 -1299 608 746 -918 970
$$ packed form
1366a329J681J223k469J914R6j682J963j321p26J913k404M04J802k728J100J133
1382E70k025J816m7j005K244j330m53K330k171l5J594k415Q25M62k020J662o74
1399f72j352K786j497l87K464j716L09J486j958J164K06k199K010q38j799K511
1415E18j246p56K174j531N94J384j875J734M00k186K089m91j589J853j176o04
1431g08J656j879R20J228k257J709Q34k265J877k67j374J637j485m37J608k421
1447a624P21J367k336J474P60j571J755n05q64K080j775j94J879k175L97J371
1463G60j964J254K43j589K107q70r68K373j629o8J768j738O80J096j624J415j2
1480A234j749J857j023j329J865j492m85J568j630Q29Q53j797J907J38j664J888
$$ plain form
1496 970 260 -917 835 -797 -880 381 -1454 -244 569 -1302 621 964 -567 1207 419 -527 1032
1513 1032 -523 -480 837 -1307 -255 790 -1054 565 1042 -351 1450 490 -101 1452 -480 -465 784
1530 784 -1398 -687 166 -1603 60 -103 -1165 875 -118 -566 1397 -470 -538 848 -918 -223 400
1547 400 -1286 382 184 -897 1306 291 -290 1547 102 25 1053 -692 150 460 -1226 515 261
1564 261 -980 1100 294 -177 1501 18 242 1002 -964 0 218 -1844 -125 -562 -1731 240 -416
1581 -416 -583 1105 -320 307 1394 -624 498 761 -1192 373 -112 -1112 576 -527 -466 1302 -388
1598 -388 423 1384 -533 508 760 -1010 269 -284 -1258 576 -681 -744 1096 -452 233 1378 -252
1615 -252 721 879 -645 673 -280 -1371 578 -891 -1144 680 -679 -124 770 -672 820 753 -704
$$ packed form
1496I70p10j177J752j632q3J261j835J210Q13j871J923L43j531J774p88r46J559
1513A032j555M3J317k144J052J045j844J619M77j393J801r60n91J553j932J5J249
1530G84k182P11Q53j769J663j63j062K040r93m48J963j867o8J386j766O95O23
1547D00j686J668j98j081K203j015n81J837j445p7J028j745Q42L10j686J741k54
1564B61j241K080q06m71J678j483K24P60j966R64K18k062J719m37j169J971o56
1581d16j67J688j425O27J087k018J122K63j953J565m85j000J688j103O1J768j690
1598c88Q11R61j917J041K52j770J279n53r74J834j257o3J840j548O85J145j630
1615b52R73J58j524J318r53j091J949j469k53J824j359N55Q94j442J492o7j457
$$ plain form
1632 -704 1031 287 -750 970 -378 -693 626 -757 -32 550 -1090 193 317 -1042 588 230 -727
1649 -727 898 -284 -350 911 -835 26 685 -1121 259 552 -976 638 38 -580 1110 -355 -71
1666 -71 1137 -729 93 822 -820 466 317 -1037 763 -82 -495 1058 -313 -231 1246 -434 352
1683 352 940 -697 472 273 -911 520 -457 -950 377 -1002 -661 651 -873 54 639 -837 696
1700 696 488 -745 811 -119 -872 599 -857 -613 439 -829 -40 579 -853 771 410 -741 869
1717 869 108 -548 738 -488 -79 908 -459 665 977 -406 909 596 -464 902 -240 -560 548
1734 548 -930 -394 614 -1111 12 449 -966 335 132 -951 509 -528 -883 411 -945 -507
1750 -507 471 -860 115 461 -778 435 -74 -910 711 -487 -729 761 -650 3 1120 -163 1012
$$ packed form
1632g04J735p44j037J720j348l15J319j383P25N82j640J283J24j359J630l58r57
1649g27J625j182o6J261j746Q61O59j806J380K93j528J614o00o18J690j465K84
1666g1J208j866Q22P29j642J286j49j354J800q45m13J553j371Q2J477j680P86
1683C52N88j637J169j99j184J431r77m93J327j379L41J312j524R27N85j476J533
1700F96k08j233J556r30p53J471j456K44J052j268P89O19j432J624l61j151J610
1717H69p61o56J286j226M09R87j367J124L12j383J315l13j060J366j142l20J108
1734E48j478N36J008j725J123M37j415J301k03j083J460j037l55J294j356M38
1750e07R78j331R75L46j239J213n09q36J621j198k42J490j411O53J117j283J175
$$ plain form
1767 1012 1185 88 1526 833 -122 1175 -196 -610 507 -949 -463 339 -1050 349 624 -737 1044
1784 1044 494 -535 787 -451 -708 180 -1371 -908 -228 -1652 -261 27 -1064 759 325 -133 1197
1801 1197 -98 -125 690 -968 -480 215 -1238 -69 140 -872 804 623 314 1823 690 601 1496 -362
1819 -362 107 577 -1215 -199 -274 -1091 300 -106 -321 1202 31 256 1334 -225 0 262 -1203 -176
1837 -176 -470 -1316 130 -529 -740 976 -181 22 1029 -530 112 250 -1108 -59 -402 -1339 306
1854 306 -279 -354 1238 266 626 1462 35 701 751 -803 257 -208 -1118 305 -541 -635 908 -194 307
1873 307 1217 -203 648 772 -698 416 -121 -1135 242 -495 -680 507 -606 17 897 -581 475
1890 475 600 -847 341 -198 -1024 363 -738 -772 547 -733 -72 943 -381 569 832 -429 908
$$ packed form
1767A012J73j097J438o93r55J297j371m14J117j456M86Q02j389J399K75j361J781
1784A044n50j029J322j238k57Q88j551M63O80j424J391K88j091J823m34m58J330
1801A197j295k7Q15j658M88O95j453J169K09j012J676j81l09J509j133q9Q95j858
1819c62M69M70j792J016p5q17J391m06k15J523j171K25J078j559K25K62j465J027
1837a76k94q46J446o59k11J716j157K03J007j559O42J38j358J049l43r37J645
1854C06n85p5J592r72L60Q36j427O66N0j554J060m65r10J423q46r4J543j102N01
1873C07R10j420Q51J24j470J114n37j014J377p37j85J187j113O23Q80j478J056
1890D75J25j447J188n39q26J387j101l4J319j280O61J015j324R50K63j261J337
$$ plain form
1907 908 226 -619 674 -508 -736 428 -812 -129 727 -444 797 803 -500 980 159 -715 756 -461
1925 -461 -622 568 -665 -109 646 -684 571 691 -491 794 97 -862 368 -796 -914 225 -1019
1942 -1019 -207 493 -639 692 636 -446 856 151 -435 689 -476 -618 302 -1126 -351 400 -887
1959 -887 440 516 -555 720 249 -284 1014 -229 -15 988 -399 182 776 -610 531 414 -479
1976 -479 607 -1 -420 788 -481 -195 836 -580 267 529 -752 360 -24 -972 275 -639 -964
1993 -964 342 -843 -507 443 -645 84 548 -561 565 257 -787 350 -562 -1063 158 -852 -408
2010 -408 613 -443 681 1257 165 1420 1069 94 1271 41 -483 358 -988 -603 214 -1020 209
2027 209 613 -326 1039 697 -88 1161 -19 -469 545 -832 -593 -72 -1330 -534 -128 -1102 309 37
$$ packed form
1907I08o82q45J293j182k28J164j240O83Q56j171J241Oj303J480q21q74J471j217
1925d61j61J190j233N56P55j330J255J20j182J285o97r59J230j164j18J139j244
1942a019Q12P00j132J331n6j082J302p05n86J124j165j42R20j428P75P51j287
1959h87J327P6j071J275m71n33J298j243K14J003j387N81N94j386J141j17q93
1976d79J086o08m19J208j269K86J031j416Q47K62j281J112l84r48J247r14l25
1993i64J306j185L36R50j088P29M64j109J126l08j044J137r12n01J221j010M44
2010d08J021j056J124N76j092J255l51r75J177j230n24Q41j346L85Q17j234J229
2027B09M04r39J365l42p85J249j180m50J014j377K39N21j258P96M06r74J411k72
$$ plain form
2045 37 -512 879 -205 -446 758 -537 -104 486 -844 -22 90 -1061 145 -199 -704 844 -90 -38
2063 -38 1008 -38 550 1127 -76 756 539 -624 391 -198 -943 246 -663 -488 713 -352 331 1032
2081 1032 -219 776 870 -419 793 54 -693 246 -779 -890 92 -1081 -495 345 -749 345 395 -488
2099 -488 728 167 -252 1066 -158 -244 589 -788 -377 306 -945 14 66 -722 651 184 -437 972
2117 972 -208 -80 905 -433 104 502 -766 143 56 -779 579 -89 -419 865 -236 38 880 -418
2135 -418 363 618 -487 474 205 -881 330 -426 -710 517 -607 -224 615 -546 140 539 -473 423
2153 423 262 -605 495 -480 -950 208 -999 -610 262 -693 282 668 -349 760 694 -162 1032 -12
2171 -12 -419 645 -464 -184 613 -590 373 768 -112 966 573 -372 647 -346 -626 277 -987 -561
$$ packed form
2045C7n49J391j084k41J204j295M33N90j330Q22J12j151J206l44n05J548r34N2
2063c8J046j046N88N77j203Q32k17j163J015n89p45J189r09J75J201j065O83P01
2081A032j251R95R4j289J212p39p47R39j025j11R82j173N86Q40j094J094N0q83
2099d88J216n61m19J318j224q6Q33j377M11O83j251R59N2p88J373m67o21J409
2117I72j180J28R85j338N37L98j268R09q7q35J358o68l30J284j101K74Q42j298
2135d18P81K55j105R61k69j086J211p56k84J227j124L83Q39j161O86L99j012Q96
2153D23j61q67J100r75m70J158j207L89Q72r55R75L86j017J109o6q56J194j044
2171a2m07J064j109K80P97j203R63L95q80J078l93r45J019r93k80R03j264M26
$$ plain form
2189 -561 203 -1007 112 402 -409 820 386 -235 764 -361 -741 -15 -1236 -759 -155 -1122 52 306
2207 306 -472 907 596 -30 1133 155 6 852 -475 -119 380 -867 64 196 -512 835 271 -136
2225 -136 1031 -27 -20 830 -428 -8 379 -648 -54 -86 -1027 140 -359 -848 484 -378 -296 625 -429
2244 -429 137 681 -594 366 337 -683 386 -304 -714 256 -700 -516 463 -442 99 572 -328 587 623 -233
2264 -233 961 216 -273 656 -387 -416 294 -840 -347 134 -836 283 201 -458 827 238 26 1173 66
2283 66 25 630 -660 -45 189 -838 94 -28 -816 508 -71 -487 676 -371 120 735 -377 161 387
2302 387 -723 276 111 -470 655 -183 -585 447 -528 -301 479 -854 101 452 -448 640 338 -329
2320 -329 768 -95 -240 513 -521 -213 228 -869 2 237 -676 621 460 -99 974 258 -24 678
$$ packed form
2189e61P64j210J119K90q11J229m34o21R99j125l80P26j221M77O04r67J174K54
2207C06p78J379l11o26J163r78j49Q46j327L56M99j247R31J32p08J347n64m07
2225a36J167j058PQ50j258M20L87j027N94l2r41J167m99m89J332q62Q2R21j054
2244d29N66N44j275R60k9j020J069o90m10R70r56J84R79r05N41M73r00R15L6q56
2264b33J194p45m89R29j043k9P10j134M93M81r70J119q2o59J285n89k12J147j107
2283F6m1O05j290O15K34j027R32j22p88J324n79m16J163j047M91O15j112N38K26
2302C87j110R99j65n81J125q38m02J032r75K27P80j333R55L51r00J088l02o67
2320c29J097q63j45P53j034L08M41j097Q71K35r13J297j61n59J073p16k82P02
$$ plain form
2338 678 -477 -418 133 -1043 -254 -16 -840 456 183 -245 1036 215 299 878 -402 -43 174 -990 -178
2357 -178 30 -733 416 189 -350 844 39 -69 802 -536 -67 224 -848 -151 53 -706 471 250
2375 250 -131 980 134 79 678 -492 -243 108 -1039 -277 -231 -781 223 24 -237 1006 238 180 923
2394 923 -251 35 373 -738 13 -109 -807 349 8 -331 624 -51 28 677 -350 103 367 -619 235
2413 235 71 -678 334 0 -345 541 -195 -108 511 -470 94 401 -586 274 8 -674 326 -228 -564 466
2433 466 -454 -150 456 -471 142 423 -338 485 218 -386 562 -6 -268 559 -388 -200 383 -593 128 286
2453 286 -464 329 109 -449 580 -80 -318 582 -339 -89 641 -432 238 327 -496 324 31 -503 305 -238
2473 -238 -440 410 -626 -129 457 -405 202 407 -442 419 175 -399 573 -211 -332 345 -490 -33 418 -591
$$ packed form
2338F78j155N9N51j176P89K38q24J296k73m28J281q21Q4N79j280L59K17j164Q12
2357a78K08p63J149k27n39J194q05j08Q71j338M69K91j072O97K04p59J177k21
2375B50l81J111q46n5N99j170K49L51j147P62M6n50J004j99k61J243p68n8P43
2394I23j174K86L38j111P51j22o98J156l41l39R55o75P9O49j027M53K64r86Q54
2413B35j64p49J012l34l45Q86p36Q7O19r81N64L07r87Q60k66o82J000n54l36J030
2433D66r20L04O06r27O13K81p61Q23k67o04R48n68k62Q27r47J88N83r76P21J58
2453B86p50P93k20n58J029o60k38R00r21K50P30j073O70Q9q23Q20k93n34Q08n43
2473b38k02Q50j036M97N86q62O07K05q49Q61k44n74R72p84j21O77q35M57M51j009
$$ plain form
2493 -591 105 360 -513 483 115 -388 543 -335 -318 420 -557 -137 337 -566 305 291 -336 481 220 -303 645
2514 645 -107 -335 430 -535 -293 94 -687 17 173 -404 591 256 -67 855 54 68 611 -354 -46 242
2534 242 -749 -120 -167 -676 228 -57 -449 627 -35 64 607 -216 271 375 -524 190 -108 -634 264 -273
2554 -273 -559 493 -274 -138 603 -311 197 535 -369 300 265 -597 338 -389 -679 249 -465 -373 398 -401
2574 -401 144 512 -193 696 381 -12 683 91 -162 384 -495 -451 233 -835 -249 171 -519 550 489 -125
2594 -125 767 309 10 619 -246 -272 148 -684 -324 -13 -806 23 -166 -507 471 -8 -56 704 -46 50 523
2615 523 -312 183 117 -626 174 -145 -612 296 -261 -127 654 62 209 642 -299 321 310 -497 212 -133 -609
2636 -609 214 -296 -283 330 -218 155 648 -154 331 289 -511 192 -231 -692 226 -420 -459 240 -388 -78 570
$$ packed form
2493e91O96K55q73R96l68n03R31q78J7P38r77M20M74r03Q71j4o27Q17k61n23R48
2514F45p52k28P65r65K42L87p81P04J56n77R95l35l23R22q01J4N43r65L08K88
2534B42r91O29m7n09R04k85l92J076o62R9N43q23M87J04q99P14k98n26Q98n37
2554b73k86J052p67J36P41r14N08L38r04O69l5q62R35p27k90R28p14R2P71p99
2574d01N45L68p05Q89l15l93O95n92k53N46q79M4O84j068N86M20o90J069o1o14
2594a25Q92m58k99O09q65k6M20q32L60L11p93Q29j89l41R78m79m8P60p50R6M73
2615E23q35M95o6p43Q00l19m67R08n57J34P81n92J47M33r41O20j1q07P09l45m76
2636f09Q23n10J3O13n48L73M93q02M85m2q00P03m23m61R18o46l9O99o28L10O48
$$ plain form
2657 570 -256 352 416 -344 308 -100 -510 424 -334 -254 493 -325 49 441 -354 309 186 -360 281 -174 -364
2678 -364 276 -283 -275 337 -347 174 517 -221 395 357 -411 284 -94 -569 191 -440 -377 219 -383 -29 467
2699 467 -194 469 429 -229 440 10 -402 196 -491 -387 408 -474 147 449 -279 488 365 -253 339 -48
2719 -48 -448 227 -522 -515 164 -635 -33 310 -264 392 432 -124 443 81 -257 336 -333 -194 143 -574 -83
2740 -83 228 -351 284 236 -147 572 104 -203 438 -244 -77 292 -362 92 254 -399 302 126 -257 443 107
2761 107 -208 407 -313 -250 130 -551 67 77 -537 265 95 -381 472 -111 -247 456 -217 -41 312 -465 -18
2782 -18 95 -536 253 224 -248 531 73 -30 585 -192 30 474 -440 154 218 -511 457 149 -195 559 69
2803 69 56 570 -274 65 239 -511 -65 -67 -726 156 12 -449 362 -230 -196 451 -151 23 444 -410 107 47
$$ packed form
2657E70q26O08O4p60O52m08m10R34p58Q0P47q18L74L92p95O63j23n46O41m55j90
2678c64O40n59QO12o84N21L43p38O16l8p68O95l78m75P60o31O3N96o02L54M96
2699D67o61O63m0o58O69m30m12N98o87J04P95q82O21L02p28P67j23o18N92l87
2719d8m00O75p49PO79p99O02L43n74O56M0n56N67l62l38N93o69J39L37p17M91
2740h3L11n79O35m8l83P19m68l07O41o82J67L69o54M54J62o53P01j76l83P00l36
2761A07l15O15p20O3L80o81O18J0o14Q02j70m76Q53n83j36P03o73J76L53p77M47
2782a8J13o31P89k9m72P79m58j03O15p77K22M44r14N94O4p29R68l08l44P54m90
2803F9j3N14q44L39J74p50M46ko59Q82j44m61Q11n92L4O47o02J74M21q54N17o0
$$ plain form
2825 47 -529 48 -88 -384 309 -140 -116 454 -217 59 427 -246 396 360 -116 414 61 -199 583 -169 -92
2846 -92 430 -299 36 257 -445 203 146 -365 429 -57 -374 339 -201 -366 217 -504 31 177 -495 179 157
2867 157 -307 301 55 -161 456 -160 -238 401 -359 15 189 -403 337 -7 -296 336 -66 -31 587 -47 34
2888 34 564 -173 71 266 -361 215 -57 -489 256 -234 -263 363 -262 -146 435 -239 27 211 -298 301 219
2909 219 -364 378 -55 -159 494 -181 7 305 -368 131 195 -371 111 -9 -332 362 -158 -245 321 -276 112
2930 112 387 -390 183 141 -349 217 -113 -404 299 -211 -146 464 -220 0 287 -337 129 136 -478 244 -40
2951 -40 -397 390 -52 -100 406 -241 52 363 -243 222 67 -388 152 -69 -310 400 -291 -181 340 -311 57
2972 57 267 -311 170 164 -347 315 33 -275 392 -112 -46 398 -275 83 332 -405 71 59 -337 226 28 -261
$$ packed form
2825D7n76N77j36k96O93m49K4N70o71K76L68o73O42l6m76N30l53k60P82p52P7
2846i2N22p29L35K21p02O48n7n11P94m86l17P13n40j65N83p21N35J46o72O74k2
2867A57m64O08k46k16O17o16p8O39p60L74J74n92P40l44k89O32m02L5O18o34Q1
2888C4N30p37K44J95o27N76k72m32P45m90k9O26o25J16N81o74K66J84n09N99q2
2909B19n83P42m33j04O53o75J88K98o73M99O4n66M82j20l23O94n20q7N66n97L88
2930A12K75p77N73m2m90N66l30k91P03n10O5O10o84K20K87o24M66Po14P22k84
2951d0l57P87m42m8N06o47K93L11o06M65j55m55N40k21k41P10o91J10N21o51L68
2972E7K10n78M81on11O62k82l08O67n04O6M44o73L58K49p37M76j2l96N63j98k89
$$ plain form
2994 -261 415 -160 29 396 -336 154 344 -412 280 122 -319 328 35 -46 537 -175 -76 325 -437 -92 244
3015 244 -451 177 150 -221 471 -14 -223 534 -97 -159 346 -498 14 67 -460 36 -39 -344 432 -17 -196
3036 -196 404 -244 -149 361 -351 -43 83 -410 168 106 -311 493 81 -151 401 -143 30 319 -495 8 139
3057 139 -447 169 30 -344 422 -57 -57 444 -208 8 392 -271 96 178 -454 205 -15 -306 250 -56 -194
3078 -194 355 -273 -26 221 -284 94 79 -275 206 -2 -205 481 -34 -87 378 -239 -47 299 -350 141 123
3099 123 -463 245 -17 -337 343 -105 -271 263 -266 104 360 -296 129 41 -290 320 117 -166 322 -155
3119 -155 -72 179 -255 -137 122 -295 77 84 -353 169 8 -328 354 -140 -69 371 -212 76 148 -351 295 118
3141 118 -415 299 -106 -93 218 -149 -101 331 -285 142 257 -325 322 166 -205 290 -122 -314 267 -167 -127
$$ packed form
2994b61O76n75J89L67p32M90J90p56O92j58m41O47k93q1N83p12R9M01p62L45L36
3015B44o95O28k7l71O92m85k09P57o31o2N05q44N12N3n27M96p5l05P76m49j79
3036a96O00o48R5N10p12L08J26m93N78o2m17Q04m12k32N52n44J73K89q14N03J31
3057A39n86O16j39l74P66m79%N01o52K16L84o63L67Q2o32O59k20k91N56l06j38
3078a94N49o28K47K47n05L78j5l54M81k08k03O86n15n3M65o17J92L46o49M91j8
3099A23n86P08k62l20O80m48j66N34n29L70K56o56M25q8l31O10k03k83M88m77
3119a55Q3K51m34J18K59m17L72Pm37N22j61l36O82m94P1M40n83K88P2m99O46j77
3141A18n33P14m05J3L11l67M8M32o16M27J15n82O47j56l71M95m12j92N81m34M0
$$ plain form
3162 -127 357 -330 -59 206 -232 128 224 -259 296 -200 -258 383 -194 -132 314 -408 3 140 -360 284 -72
3183 -72 -192 286 6 -182 337 -178 -61 297 -368 -86 62 -439 120 36 -248 334 85 -15 519 -92 188
3204 188 396 -279 69 188 -416 168 -99 -431 275 -191 -180 374 -197 -31 221 -214 101 129 -300 178 -28
3225 -28 -287 179 -208 -292 200 -423 -70 256 -401 107 123 -406 319 178 -187 424 -45 -161 279 -296 -57
3246 -57 336 -297 140 159 -198 438 85 -101 535 28 -227 270 -357 -168 210 -613 102 23 -397 242 -22
3267 -22 -233 263 -141 -203 366 -371 -168 191 -405 104 18 -262 202 -133 -177 237 -208 -142 386 -174 88 278
3289 278 -145 351 223 -114 336 -9 -307 216 -411 -92 113 -332 149 160 -284 305 118 -165 403 -53
3309 -53 -238 206 -309 -152 166 -331 31 216 -250 313 263 -208 307 -39 -192 373 -198 -84 267 -264 119
$$ packed form
3162a27M84o87K71K65m38L60R6m83N55m96n8O41n77O2M46p22M11J37n00O44l56
3183g2j20M78k80j88N19n15J17L58o65K82J48n01N59q4k84N82k49j00N34o11K80
3204A88K08o75L48J19o04N84k67l32P06m66J1N54n71J66K52m35L15K8m29M78k06
3225b8k59M66l87q4M92o23L53L26o57N08J6n29P25j41l65O11m69j16M40n75K39
3246e7L93o33M37J9l57O36l53j86O36n07k55M97o27J89L78q23P15p9m20O39k64
3267b2k11M96m04o2N69p37K03L59n96N09q6k80M64l35m4M14m45O6N28n60K62J90
3289B78m23M96j28l37M50l45k98N23o27L19K05m45M81J1m44N89j87k83N68m56
3309e3j85M44n15J57L18m97L62J85m66N63n0m71N15l46j53N65n71J14L51n31L83
$$ plain form
3330 119 130 -159 240 72 -243 331 -83 -80 375 -250 -18 280 -255 74 241 -262 185 32 -289 130 -96
3351 -96 -325 258 -284 3 401 -227 246 277 -127 308 114 -291 232 -202 -304 257 -395 -139 272 -287 242
3372 242 313 -141 174 19 -224 305 -102 -122 434 -232 -27 236 -321 105 155 -266 277 14 -115 362 -43
3393 -43 -88 310 -237 -79 163 -285 83 42 -386 247 -54 -319 293 -82 -138 371 -241 148 175 -231 54 74
3415 74 -272 78 -91 -358 214 -103 6 395 -156 219 261 -182 151 137 -341 172 -98 -399 201 -161 -115
3436 -115 113 -129 13 261 -236 199 115 -85 321 -22 -308 197 -157 -133 208 -269 -1 128 -271 122 93
3457 93 -301 308 60 -60 303 -215 -122 235 -257 167 226 -317 148 53 -187 140 3 -274 298 -191 25
3478 25 276 -240 75 127 -419 246 26 -272 267 -176 -108 246 -152 132 343 -126 95 339 -127 221 66
$$ packed form
3330A19J1k89L99j68l15N74m14LM55o25K32K98n35L29J67n03M47j53l21M19k26
3351i6k29N83n42K87L98o28M73L1m04M35j94m05N23m34j02N61o52K56M11n59N29
3372B42P1m54L15j55k43N29m07k0N56o66K05K63n57M26N0m21N43k63j29M77m05
3393d3m5L98n47J58K42m48L68m1m28O33l01k65O12l75n6N09o12L89K7m06K85K0
3415G4l46L50j69k67N72l17J09L89n51L75M2m43L33j4m78N13k70l01O00l62M6
3436a15K28k42J42K48m97M35q4k00M06l43k86N05l54K4L41m77K68J29l99L93k9
3457I3l94O09k48j20L63n18R3L57m92M24N9n43M65r5k40L27j37k77N72m89K16
3478B5K51n16L15N2n46O65k20k98N39m43O8L54l98K84K11m69K21K44m66L48j55
$$ plain form
3499 66 -343 244 -199 -255 143 -277 -106 229 -137 39 308 -290 310 82 -129 299 -67 -210 286 -174 -133
3520 -133 176 -217 187 102 -309 156 -108 -172 299 -135 -215 179 -130 -23 303 -245 47 16 -272 209 -65
3541 -65 -171 294 -95 -58 239 -174 116 187 -253 92 -61 -249 171 -135 -184 260 -80 6 387 -130 221 190
3563 190 -213 120 83 -340 162 -128 -337 274 -152 -206 208 -90 115 293 -230 176 127 -222 151 29 -180
3584 -180 174 -208 -65 227 -225 79 235 -237 211 168 -231 227 -22 -180 149 -157 -112 143 -226 -19 227
3605 227 -258 151 -54 -164 237 -66 -62 300 -44 -40 205 -256 60 6 -366 73 46 -311 347 -21 -38 307
3627 307 -159 151 318 -205 87 151 -318 80 8 -403 181 -154 -141 258 -123 -59 318 -264 105 -20 -245
3648 -245 185 218 -124 253 -50 -68 128 -277 -126 167 -281 -96 126 -216 181 -7 -99 349 58 -99 233
$$ packed form
3499F6m09N87m43n6L98m20J71L35l66J76K69n98O00k28k11M28l66j43M96m60M1
3520a33L09l93M04q5m11M65k64o4M71m34q0L94l09J07L26n48K92l1k88M81k74
3541f5j06M65l89L7K97m13K90P1m40L45j53j88M20l06m9M44l40Q6L81n17L51l1
3563A90m03L33l7m23N02k90k09O11m26n4M14k98K05J78n23M06m9l49L73j22k09
3584a80L54l82J43K92m52L04J56m72M48m3l99M58k49j58L29l06M5K55l69K07K46
3605B27m85M09k05j10M01l03ML62l44MK45m61L16n4l72M39k7l57O58l68j7L45
3627C07m66L10J67n23K92O4m69L98p2m11N84l35J3L99l81O4L77n82L69j25k25
3648b45M30L3l42L77l03j8J96m05J51K93m48J85K22l42L97j88r2M48k91j57L32
$$ plain form
3669 233 -316 6 172 -229 -89 -80 -246 76 -48 -78 295 -19 -43 210 -191 -27 134 -304 -17 -61 -301 182
3691 182 -79 -185 333 31 -96 278 -20 124 225 -234 -13 53 -164 167 -64 -287 223 -142 -69 230 -273
3712 -273 -43 216 -176 124 150 -140 280 -93 -150 122 -138 -139 77 -320 72 194 -101 117 140 -125 342 70
3734 70 -74 271 -77 -34 180 -127 -125 88 -253 45 -2 -233 182 -35 -211 208 -130 -38 94 -196 84 46
3756 46 -240 74 -59 -162 226 -85 -31 274 -63 7 185 -270 94 73 -276 187 41 -260 170 -103 -7 277
3778 277 -112 101 274 -137 222 135 -178 69 56 -87 236 33 -98 191 -90 12 108 -250 13 -40 -323
3799 -323 82 -35 -200 160 -57 -50 347 -151 -13 119 -119 197 67 -338 -5 -82 -177 200 -76 62 305
3820 305 -170 44 302 -156 162 48 -210 107 97 -81 92 -48 -116 316 -32 114 230 -192 132 15 -162
$$ packed form
3669B33n49L22J66m01J40Rj66L22j24l0L73l14k4K53m01J64J61m38K87m4k40M83
3691A82k61j06N18l02j27L74k98J44J01m59K21O6k17L31k31k23N10l65P3K99n03
3712b73K30K59l92L00K6k90M20l73n7K72k60jK16l97L92J22k95K18K3k65M67k72
3734G0j44L45l48M3K14l07KK13l41K98m7k31M15k17j76M19l38R2J32k90K80l8
3756D6k86L14j33j03L88l11N4L05l37P0J78m55L64k1l49M63j46l01M30k73R6K84
3778B77l89K13J73m11L59q7l13K47j3j43L23k03j31K89k81J02R6l58K63n3k83
3799c23M05j17j65L60k17PL97m98J38J32k38L16j30m05L33p7r5L77k76J38K43
3820C05m75K14K58m58L18j14k58L17j0j78J73j40o8M32l48J46J16m22L24j17j77
$$ plain form
3841 -162 132 -53 -283 176 -159 -140 90 -132 51 266 -123 149 197 -156 144 -111 -239 63 -88 -94 49
3862 49 -196 66 211 -156 109 188 -66 157 -13 -72 118 -174 -90 152 -194 -8 208 -91 137 97 -102 154
3884 154 6 -237 57 -198 -79 211 -336 45 112 -72 219 18 -82 273 -24 -118 101 -197 -155 102 -166
3905 -166 41 194 -110 301 194 -60 265 49 -65 198 -66 10 181 -222 65 57 -145 283 102 -143 182
3926 182 -55 -173 79 -158 -211 62 -276 45 57 -193 110 -33 -127 278 -129 -101 195 -175 55 146 -159 174
3948 174 73 -273 41 46 -96 302 65 -110 266 -167 -83 152 -284 53 82 -203 80 -17 -149 147 -193 -56
3970 -56 174 -138 -73 150 -127 14 -9 -119 123 17 -199 150 -31 -114 219 -75 76 165 -201 103 60 -121
3992 -121 160 -46 -151 170 -116 -76 190 -52 85 56 -218 29 101 -195 228 -56 -90 151 -161 50 142 -127
$$ packed form
3841a62K94j85k30M59l35J9K30k22J83K15l89K72M8l53L00k55j28L02j51oJ43
3862D9k45K62J45l67K65P9k54K23j70n9J90k92Q4K42l46J86K16k99K28m0j99K56
3884A54j48k43K94k55J19K90n47L81O7j84K91k01j00L55k97r4K19k98M2K57k68
3905a66K07J53l04M11j07k54L25k16j14K63k64P6J71m03K87qk02M28j81k45L25
3926A82k37j18K52k37n3K73l38L21J2k50L03j43r4M05m07K8K96l70K30R1l05L33
3948A74j01l46L14Nj42L98k37j75L76m33Q4K35m36L37K9k85K83r7j32K96l40J37
3970e6K30l12O5K23k77J41k3j10K42j06k16L49j81q3L33k94J51Q9l66L04m3j81
3992a21K81k06j05L21k86M0K66k42J37k9k74K47P2k96M23k84l4K41l12K11R2k69
$$ plain form
4014 -127 33 103 -159 45 -37 -176 53 24 -159 -32 11 5 184 -220 80 169 -95 167 58 -92 189 84
4036 84 -164 182 -35 -126 142 -194 40 125 -35 138 -76 -137 174 -152 -115 111 -160 -109 151 -179 -13 68
4058 68 -238 120 65 -123 116 75 -100 271 -40 24 59 -230 -12 32 -212 171 59 -235 187 -111 -10 195
4080 195 -50 28 210 -63 -28 29 -249 93 -89 -224 128 48 -81 154 -82 104 124 -75 183 115 -112 2
4102 2 -137 -308 110 -189 -199 265 -110 12 118 -45 90 122 -121 142 -128 -245 34 -222 -176 47 -93 100
4124 100 214 -57 180 121 -95 155 -144 -140 45 -121 -197 41 -124 118 167 -258 210 225 -31 276 -25 -261
4146 -261 129 -178 -59 66 -88 27 63 -177 157 55 -91 253 -67 -100 79 -182 43 221 -213 111 207
4167 207 -110 71 99 -81 6 -107 -188 186 -230 22 208 -134 40 112 -100 88 104 -164 171 40 -34 194
$$ packed form
4014a27J60P0k62K04q2j39K29k9j83J27M3oJ79m04L00Q9k64K62j09j50K81j05
4036H4k48L46k17r1K68l36K34Q5j60J73k14o1L11l26L7K26k71N1K60l30J66Q1
4058F8l06L58n5j88K39m1j75L71l11O4L5k89K18M4k44L83j12k94M22k98J01K05
4080A95k45P8J82k73L5N7k78L42j82j35L52q0j29K35k36J86K0j99K58o8k27J14
4102Bj39j71M18k99j0M64l75J22J06j63J35L2k43K63k70j17K79k56M6K23j40J93
4124A00J14k71K37n9k16K50k99MJ85j66p6K38j65K42M9m25M68J5k56L07l01k36
4146b61L90l07J19J25j54J15L6k40L34j02j46L44l20l3J79k61K25J78m34L24R6
4167B07l17J81K8j80Q7j13q1L74m16K52J86l42J74P2k12J88J6k68L35j31p4K28
$$ plain form
4189 194 -81 -47 98 -298 69 109 -261 196 71 -127 162 -72 -127 166 -159 -130 110 -106 71 100 -183 207
4211 207 39 -72 140 -12 -25 100 -72 16 10 -289 -31 74 -264 141 68 54 260 41 113 155 -11 -90 105
4234 105 -182 30 82 -338 158 -32 -22 182 -10 58 261 -128 118 205 -218 66 -62 -102 106 -122 -132 87
4256 87 -145 87 195 -131 -43 84 -253 -28 -66 -86 124 -57 -50 117 -110 -60 170 -49 -111 246 -67 194 21
4279 21 -238 288 -65 -103 156 -44 -197 83 -165 -68 108 -136 140 20 3 323 -30 -130 148 -154 -18
4300 -18 144 -132 78 85 -181 111 62 -116 142 -101 -79 188 -44 -52 107 -247 10 134 -170 151 90 -46 120
4323 120 81 -18 203 -76 -2 182 -31 -3 202 -245 33 -15 -10 109 -276 -164 99 -63 -19 122 -130 18 96
4346 96 -191 150 25 -227 128 -67 -92 161 -117 54 113 -61 172 -50 -18 171 -83 -128 179 34 -132 102
$$ packed form
4189A94k75L4J45l96L67M0l70M57j25j98K89k34n5K93l25K9K40k16J77K9k83L90
4211B07j68j11K12j52j3J25j72Q8ok99K58J05l38M05p3j4K06k19P2M2j66p9J95
4234A05k87K12N2m20M96j90J0K04j92O8K03l89K46Q7m23K84j28m0K08k28j0K19
4256H7k32K32J08l26Q8J27l37K25l8k0K10j81PJ67k27N0K30k19o2L57l13K61j73
4279B1k59N26l53l8K59k00j53K80k48R7J76k44K76j20j7L20l53j00K78l02J36
4300a8J62k76K10Pk66K92m9j78K58k43K2K67k32qJ59l54K57J24l04L21o1j36J66
4323A20l9r9K21k79P4J84k13K8K05m47K78m8NJ19l85J12K63j62M4J41k52J48P8
4346I6k87L41j25k52L55j95k5K53k78J71N9j74K33k22L2J89k54m5L07j45j66K34
$$ plain form
4368 102 -199 156 109 -16 74 19 -195 85 143 -259 114 -122 -107 76 -133 155 56 -139 63 169 -7 211
4390 211 -73 -121 60 -66 16 83 -206 -34 193 -195 265 110 -123 66 -8 -49 251 22 -38 213 -95 -11
4412 -11 57 -146 28 44 -6 259 -14 -28 119 -90 19 120 -194 -78 128 -69 -11 10 -158 333 190 -164
4434 -164 192 5 -65 52 -232 -33 18 -147 149 6 -122 228 40 -27 190 -122 -62 121 -159 70 42 -80
4456 -80 149 66 4 252 41 85 181 -81 -50 157 -130 -55 -56 -183 -21 -11 -133 333 1 47 375 -57 24 159
4480 159 -122 86 5 -189 27 34 -105 212 -74 -36 261 -67 116 142 -146 98 89 -178 101 -155 -94 82 -11
4503 -11 -47 262 -40 43 154 -39 102 -34 -188 94 -41 -139 148 -158 -114 158 -68 141 139 -83 128 47 -133
4526 -133 139 -75 -213 36 -133 -74 231 -43 155 153 -116 151 -14 -147 114 27 -28 133 -3 -75 173 -10
$$ packed form
4368A02l01L55m7j25R0n5k14K80N8m02L73k36J5J83k09K88r9j95K02J06j76K18
4390B11k84m8J81j26Q2O7k89J72K27l88M60j55k33J89p4m1L00k29o0K51l08Q4
4412a1O8k03J74J6n0K65k73j4J47k09J09J01l14J16K06j97N8K1j68M91j43l54
4434a64L56j87p0J17k84J99N1j65K96j43j28L50j88o7K17l12O0J83k80K29k8j22
4456h0K29q3o2K48k11M4R6k62L1K07k87P5jj27J62J0j22M66l32M6L28m32Q1J35
4480A59k81K08q1j94K16Pj39L17k86L8K97l28J83K6k88K44rk67K79k56O1J76r3
4503a1l6L09l02Q3J11j93J41j36j54K82j35r8K87l06M4K72k26K09kk22K11q1j80
4526a33K72k14j38K49j69N9L05k74J98kk69K67j65j33K61q7n5J61j36p2K48j83
$$ plain form
4548 -10 127 168 -179 37 61 -127 30 -152 -198 31 -69 -178 179 -42 49 170 -151 224 -102 -111 55 -77
4570 -77 -200 190 -22 -107 210 6 189 212 -183 42 113 -118 213 -54 -66 75 -149 -88 141 -160 44 192
4592 192 -75 88 -14 -34 56 -197 -166 68 -199 -118 124 -194 14 179 46 259 -5 9 252 -22 97 183
4614 183 -215 -10 157 -81 72 30 -97 168 33 -32 184 -65 2 177 -76 3 165 -198 21 -62 -41 117
4636 117 36 -103 139 -102 -141 154 -45 17 62 -92 33 135 -98 81 -53 -98 176 -94 -228 49 -111 75
4658 75 97 -112 159 44 -95 220 13 -126 63 -186 14 111 -103 12 -51 -139 84 19 -46 67 21 -23 98
4681 98 99 -65 146 -107 -6 116 -118 47 45 -215 183 -41 -63 338 -38 -39 -22 -68 101 129 -42 195 2 -229
4705 -229 48 -159 -58 151 -162 -42 97 -166 -29 74 -120 267 162 -110 222 32 -55 62 -56 -39 105
$$ packed form
4548a0J37M1l47K16K4j88J57j82m6K29j00j09L57k21R1J21l21L75l26rJ66j32
4570g7j23L90k12q5L17k04J83K3l95K25P1k31L31k67j2J41k24O1K29l01K04J48
4592A92k67J63j02k0R0k53L1K34k67Q1K42l18K08J65j33K13k64J4K43k74J19Q6
4614A83l98K05J67k38J53m2j27K65j35o5K16k49O7J75k53P9J62l63K19q3K1J58
4636A17q1j39K42k41l9K95j99O2M5j54J25J02k33J79j34m5K74k70j34K77j60J86
4658G5K2k09K71j15j39L15k07j39J89k49K00R7k14J15o3q8K23o5o5J13m6m4J21
4681I8Jj64K11k53J01J22k34J65kk60L98k24k2M01l76jJ7m6J69K8j71K37j93k31
4705b29K77k07J01K09l13J20J39k63J37J03j94L87j05k72L32j90q7J17j18J7J44
$$ plain form
4726 105 -108 -81 -9 -12 74 27 -92 150 150 -41 205 -115 -48 72 -189 -112 81 -101 70 59 62 127 85 -96 152
4751 152 16 -48 131 -303 -12 -18 -216 64 17 -212 62 -21 90 104 -97 -118 119 -87 123 -12 -170 94
4773 94 24 -148 6 5 -69 1 -128 -58 165 -89 48 11 -132 49 -31 -69 197 1 -143 45 -202 24 127
4796 127 -158 114 -76 -166 76 -100 -138 88 -148 -77 123 -186 101 140 -107 84 45 -100 179 23 11 52
4818 52 -130 -72 120 -103 29 115 -205 76 -98 -178 70 -38 -89 25 -83 -63 177 -64 69 87 -125 109
4840 109 71 -77 -11 17 -116 91 -93 -63 59 0 11 0 -88 77 30 -17 178 -52 -60 124 -36 42 153 -74
4864 -74 71 15 -88 92 21 -68 159 -98 -211 100 -187 15 85 -91 103 116 55 105 41 -48 97 -75 -107 104
4888 104 -127 -52 -64 -169 72 96 -74 187 132 -142 119 8 132 58 26 -3 71 -175 145 116 -89 91 -87
$$ packed form
4726A05k13K7P2lQ6m7j19K42%j91K46l20O7J20k61P7J93j82J71j1LO5m2j81K48
4751A52j36o4J79m34K91oj98K80m7k29K74q3J11J4k01k1K37k06K10j35j58K64
4773I4p0j72J54jp4P0j29P0K23k54J37l7j43J81q0l8K66j96j44J88k47K26J03
4796A27k85K72j90r0K42j76l8K26k36P1K00l09K87L9k47J91l9j45K79j56j2M1
4818E2j82N8J92k23J32Q6l20K81j74q0K48j08n1J14j08K0K40k41J33J8k12K34
4840A09l8j48O6K8j33K07j84L0J22n9J1j1q8J65m7m7J95k30qJ84j60P8J11k27
4864g4J45n6j03J80p1q9K27k57j13L11k87K02P0j76J94J3o1N0o4q9J45j72l2K11
4888A04k31P5j2j05K41K4j70K61n5k74K61j11J24p4l2k9P4k46L20k9k05J80j78
$$ plain form
4911 -87 -1 130 -62 -122 183 -135 22 117 -143 33 72 -157 40 -77 -54 59 -168 -41 130 -109 30 19
4933 19 -115 88 63 -22 78 27 -50 176 -18 -64 -13 -135 -8 110 -39 82 123 -44 178 -52 -28 126 -117
4956 -117 -66 160 -136 -53 58 -262 85 159 -145 95 -60 -98 -10 -73 68 49 -127 -72 95 -241 113 -61 -25
4979 -25 73 77 64 108 -47 57 92 -131 -43 62 -120 43 67 -56 165 -134 -23 124 -97 13 139 -94 -69
5002 -69 21 -62 109 56 -93 241 78 -52 50 -192 6 34 -200 -10 45 -46 -3 44 -61 133 -62 12 -28 -1
5026 -1 -123 78 -93 46 -106 -204 120 115 -27 160 13 43 98 -8 35 36 -1 -56 0 -100 72 17 -203 216 31
5051 31 -135 188 -35 -23 91 -135 45 -18 -193 56 -207 -168 81 -204 -82 145 -26 39 71 -3 19 15 -52 33
5075 33 38 -106 57 -29 -52 148 -49 -3 65 -183 65 23 -25 -51 9 -123 197 -81 -59 -15 -159 6 6 -178 66
$$ packed form
4911h7Q6J31j92o0L05l18J57R5k60J76L9k29J97j17K3J13k27J27J71k39J39j1
4933A9j34K03k5q5J00n1p7K26j94m6N1j22J27J18j49J21M1j67K22k30K4J54k43
4956a17N1K26k96Q3J11l20L47P4l04K40j55l8Q8o3J41j9j76N5J67l36L54j74L6
4979b5R8Mj3M4j55J04L5k23Q8J05j82J63K4j23K21k99J11J47k21J10J26k33K5
5002f9R0q3J71n3j49L34j63j30J02k42J98K8k34J90N5r1M3M7j05J94j95P4m0K7
5026aj22K01j71J39j52r8L24nj42J87j47L0N5j06M3Jl7n5N6j00J72n5k20M19j85
5051C1j66L23k23J2J14k26J80o3j75K49k63L9K49k85J22K27j71O5L2p4K2mo7Q5
5075C3Nj44J63q6k3K00j97M6O8k48K48m2m8k6O0j32L20k78K2M4j44J65%j84K44
$$ plain form
5100 66 56 -115 163 -102 -75 119 -40 -23 91 -169 22 -2 -139 12 -26 -88 33 -125 -1 117 -100 -19 132
5123 132 28 147 107 -30 158 75 -132 115 -54 -89 29 -84 -28 -1 -220 74 124 -58 122 15 -186 29
5145 29 -4 -101 174 -71 37 58 -93 95 -16 -12 168 -83 -144 63 -88 -171 128 -95 81 -10 -76 30 16 -163
5169 -163 87 59 -18 67 -6 -165 115 -40 -94 99 -149 18 59 -110 37 -110 -50 7 37 -52 160 -86 -34 104
5193 104 -137 17 87 -42 62 -36 -50 64 -70 106 133 -116 103 100 -164 107 8 -60 106 -20 -97 155 -110
5216 -110 -87 88 -117 -44 63 -150 88 160 46 129 -27 4 156 -36 -104 84 -56 -116 49 -189 33 47 -55
5239 -55 118 -42 -79 87 -7 -74 -33 -77 51 -8 -109 6 72 -128 99 36 -157 124 54 -47 -5 -2 30 2 -209
5264 -209 69 17 -151 1 80 -43 84 -108 -47 40 -122 -51 138 -40 135 93 -95 121 -81 44 137 -129
$$ packed form
5100F6j0j71K78k65K7J94j59J7J14k60J91k4j37J51l8o2J21j58J24J18k17Q1J51
5123A32j04J19m0j37J88q3k07K47j69l5J18j13N6K7k19K94N0j82J80j07k01K15
5145B9l3r7K75k45J08K1j51J88j11MJ80k51o1K07j51q3K99k23J76r1o6J06j4j79
5169a63K50k8p7Q5p3j59K80j55n4J93k48J67M1j69J47j47O0N7L0q9K12k46N2J38
5193A04k41J54P0j29J04r8j4J14j34J76K7k49K19lk64K71r9o8J66j26p7K52k65
5216a10K3J75k05P3J07k13K38P2j14Q3j56L1J52j92o8J88j40o0J65k38K22J4j02
5239e5J73j60l7J66r4o7M1m4J28n9j01J15O6k00K27o3j93K81p0j01M2LL2k8k11
5264b09K78n2j68J52P9j23J27j92O1Q7j62P1J89j78J75m2j88K16k02J25R3k66
$$ plain form
5286 -129 13 192 -118 1 26 -227 88 -71 -18 138 -97 -99 125 -150 -128 115 -76 54 54 -22 68 -55 -153
5309 -153 53 35 -1 79 -205 4 197 -271 -12 -34 3 89 -32 -94 72 -7 -34 11 -78 42 84 9 77 100 -123
5334 -123 150 -91 -77 76 -96 81 126 -156 -41 123 -74 68 130 -137 90 22 -55 72 -86 -7 130 -84
5356 -84 122 -30 -131 4 -30 -126 21 49 -142 139 5 4 6 -136 40 139 -97 20 -91 -168 -22 -45 -7 43
5380 43 24 -28 72 -78 1 163 -91 -27 37 -54 92 -9 -69 143 -41 -77 129 -55 -19 14 -95 59 -73 -219
5404 -219 110 -72 -87 77 -128 -11 143 -188 -7 244 -93 66 -87 -164 152 -100 -114 172 -72 67 131
5425 131 -123 -22 -1 -65 21 -29 -56 4 36 121 57 -85 70 87 23 53 106 -161 156 -86 -99 171 -33 -110 122
5450 122 -64 62 111 -25 52 8 -146 -32 -39 -117 183 -50 -74 72 -57 -7 50 -127 23 -1 -62 -76 63 -59
$$ packed form
5286a29J42J79l10J19K5k53L15j59N3J56k35kK24k75K2K43j91J30%p6R0j23r8
5309a53K06j8l6Q0k84K09J93m68K59k2L7Q6j21o2J66p9k7M5q9J20M2p5O8K3k23
5334a23K73k41J4J53j72J77M5k82J15J64j97J42O2k67K27o8p7J27j58P9J37k14
5356h4K06j52j01J35l4r6J47K8j91K81j34jKj42J76R9k36J17j11p7J46k3L8N0
5380D3j9n2J00j50P9J62k54O4O4r1J46j01o0K12j84l6K06j84L6L3j09J54j32j46
5404b19L29j82j5J64k05J17J54l31J81K51l37J59j53p7L16k52j4K86k44J39O4
5425A31k54J01K1o4Q6n0k7O0L2Q5o4j42J55J7o4L0N3k67L17k42j3K70k04p7K32
5450A22j86J26M9j36P7m4j54J14pp8L00k33k4J46j29N0N7j77J50k4o1j4J39j22
$$ plain form
5474 -59 188 -73 -13 126 -102 -2 41 -82 17 0 -156 74 -45 46 70 -52 -16 152 -30 -74 79 -178 99
5497 99 27 -116 92 8 -55 15 -100 -12 -21 -118 -27 15 -68 14 37 -168 -84 -41 -58 13 36 -68 -22 -90 -25 31 -138 -12
5525 -12 100 -146 113 34 111 137 -127 -8 -59 -103 23 63 -46 12 16 -114 220 -49 40 97 -50 101 -38 -229
5549 -229 24 -5 -44 128 84 -86 234 28 -49 139 -13 40 -18 -153 -10 79 -146 6 -15 -46 48 -7 -20 -32
5573 -32 -105 10 154 -19 59 100 -76 134 -52 -27 77 -77 -180 123 -33 -117 82 -71 57 -65 -73 55 1
$$ packed form
5474e9K47k61O0J39k28J00M3j23R9j7j56K30j19R1K4j22L6J68j82m4J53k57K77
5497I9p2j43K08q4o3P0j15Q8rr7R1M2q3Q2K3k05Q4M3j7P1K3j04M6o8O5N6j69J26
5525a2J12k46K59p9P7K6k64J19n1m4J26M0j09N8Mj30L34k69Q9N7j47J51j39j91
5549b29K53k9l9J72m4j70L20k06p7J88j52N3n8j35J43Q9k25J52k1l1R4n5j3j2
5573c2p3J15J44j73P8M1j76K10j86K5J04j54j03L03j56q4J99j53J28j22qJ28n4
$$ [...]
8191C5
##END NTUPLES=NMR FID
##END=
