##TITLE=1H_DE-80H_X3
 200.13MHz, d2o
 8 sc
 
 19ns.26.2.2025
##JCAMPDX= 6.0         $$ Bruker NMR JCAMP-DX V2.0
##DATA TYPE= NMR FID
##DATA CLASS= NTUPLES
##ORIGIN= UXNMR, Bruker Analytische Messtechnik GmbH
##OWNER= pz
$$ XWIN-NMR		Version 3.5
$$ Tue May 20 18:59:05 2025 Russian Standard Time (UT+4h)  Yarkov@DPX200
##.OBSERVE FREQUENCY= 200.1313
##.OBSERVE NUCLEUS= ^1H
##.DELAY= (6, 6)
##.ACQUISITION MODE= SIMULTANEOUS
##.ACQUISITION SCHEME= undefined
##.AVERAGES= 8
##.DIGITISER RES= 18
##SPECTROMETER/DATA SYSTEM= spect
##.PULSE SEQUENCE= zg30
##.SOLVENT NAME= CDCl3
##.SHIFT REFERENCE= (INTERNAL, CDCl3, 0, 14.3821)
##AUDIT TRAIL= $$ (NUMBER, WHEN, WHO, WHERE, WHAT)
$$ ##TITLE= Audit trail, XWIN-NMR		Version 3.5
$$ ##JCAMPDX= 5.01
$$ ##ORIGIN= Bruker BioSpin GmbH
$$ ##OWNER= Yarkov
$$ C:/Bruker/XWIN-NMR/data/yarkov2/nmr/H-C/1/audita.txt
$$ ##AUDIT TRAIL=  $$ (NUMBER, WHEN, WHO, WHERE, WHAT)
(   1,<2025-05-20 18:58:20.53 +0400>,<Yarkov>,<DPX200>,
      <created by zg, POWCHK disabled, PULCHK disabled
       configuration hash MD5:
       00 E9 B6 7A A2 85 ED C7 34 08 36 98 17 FE 4E 26
       data hash MD5: 16K
       A1 E2 85 09 07 81 16 19 74 47 20 40 8B 91 B3 51>)
$$ ##END=
$$ 
$$ hash MD5
$$ A3 5F B6 A8 38 F7 42 C1 EF 75 F7 23 7B FB FB 39
##$RELAX= 
##$RELAX= 
##$RELAX= 
##$RELAX= 
##$RELAX= 
##$RELAX= 
$$ Bruker specific parameters
$$ --------------------------
##$DU= <C:/Bruker/XWIN-NMR>
##$EXPNO= 1
##$NAME= <H-C>
##$PROCNO= 1
##$TYPE= <nmr>
##$USER= <yarkov2>
##$AMP= (0..31)
100 100 100 100 100 100 100 100 100 100 100 100 100 100 100 100 100 100 
100 100 100 100 100 100 100 100 100 100 100 100 100 100 
##$AQSEQ= 0
##$AQ_mod= 1
##$AUNM= <au_zg>
##$AUTOPOS= <>
##$BF1= 200.13
##$BF2= 200.13
##$BF3= 200.13
##$BF4= 200.13
##$BF5= 200.13
##$BF6= 200.13
##$BF7= 200.13
##$BF8= 200.13
##$BYTORDA= 1
##$CFDGTYP= 0
##$CFRGTYP= 5
##$CHEMSTR= <none>
##$CNST= (0..31)
1 1 145 1 1 1 1 1 1 1 1 1 1 1 1 1 1 1 1 1 1 1 1 1 1 1 1 1 1 1 1 1 
##$CPDPRG= <>
##$CPDPRG1= <>
##$CPDPRG2= <>
##$CPDPRG3= <>
##$CPDPRG4= <mlev>
##$CPDPRG5= <mlev>
##$CPDPRG6= <mlev>
##$CPDPRG7= <mlev>
##$CPDPRG8= <mlev>
##$CPDPRGB= <>
##$CPDPRGT= <>
##$D= (0..31)
0 0.7 0 0 0 0 0 0 0 0 0 0.03 0 0 0 0 0 0 0 0 0 0 0 0 0 0 0 0 0 0 0 0 
##$DATE= 1747753100
##$DBL= (0..7)
120 120 120 120 120 120 120 120 
##$DBP= (0..7)
150 150 150 150 150 150 150 150 
##$DBP07= 0
##$DBPNAM0= <>
##$DBPNAM1= <>
##$DBPNAM2= <>
##$DBPNAM3= <>
##$DBPNAM4= <>
##$DBPNAM5= <>
##$DBPNAM6= <>
##$DBPNAM7= <>
##$DBPOAL= (0..7)
0.5 0.5 0.5 0.5 0.5 0.5 0.5 0.5 
##$DBPOFFS= (0..7)
0 0 0 0 0 0 0 0 
##$DE= 6
##$DECBNUC= <off>
##$DECIM= 32
##$DECNUC= <off>
##$DECSTAT= 4
##$DIGMOD= 1
##$DIGTYP= 9
##$DL= (0..7)
0 120 120 120 120 120 120 120 
##$DP= (0..7)
150 150 150 150 150 150 150 150 
##$DP07= 0
##$DPNAME0= <>
##$DPNAME1= <>
##$DPNAME2= <>
##$DPNAME3= <>
##$DPNAME4= <>
##$DPNAME5= <>
##$DPNAME6= <>
##$DPNAME7= <>
##$DPOAL= (0..7)
0.5 0.5 0.5 0.5 0.5 0.5 0.5 0.5 
##$DPOFFS= (0..7)
0 0 0 0 0 0 0 0 
##$DQDMODE= 0
##$DR= 18
##$DS= 0
$$ [...]
##$SUBNAM2= <"">
##$SUBNAM3= <"">
##$SUBNAM4= <"">
##$SUBNAM5= <"">
##$SUBNAM6= <"">
##$SUBNAM7= <"">
##$SUBNAM8= <"">
##$SUBNAM9= <"">
##$SW= 18.0517328524113
##$SWIBOX= (0..15)
0 0 2 0 0 0 0 0 0 0 0 0 0 0 0 0 
##$SW_h= 3612.71676300578
##$TD= 16384
##$TD0= 1
##$TE= 0
##$TE2= 300
##$TE3= 300
##$TEG= 300
##$TL= (0..7)
0 120 120 120 120 120 120 120 
##$TP= (0..7)
150 150 150 150 150 150 150 150 
##$TP07= 0
##$TPNAME0= <>
##$TPNAME1= <>
##$TPNAME2= <>
##$TPNAME3= <>
##$TPNAME4= <>
##$TPNAME5= <>
##$TPNAME6= <>
##$TPNAME7= <>
##$TPOAL= (0..7)
0.5 0.5 0.5 0.5 0.5 0.5 0.5 0.5 
##$TPOFFS= (0..7)
0 0 0 0 0 0 0 0 
##$TUNHIN= 0
##$TUNHOUT= 0
##$TUNXOUT= 0
##$USERA1= <user>
##$USERA2= <user>
##$USERA3= <user>
##$USERA4= <user>
##$USERA5= <user>
##$V9= 5
##$VALIST= <valist>
##$VCLIST= <CCCCCCCCCCCCCCC>
##$VD= 0
##$VDLIST= <DDDDDDDDDDDDDDD>
##$VPLIST= <PPPPPPPPPPPPPPP>
##$VTLIST= <TTTTTTTTTTTTTTT>
##$WBST= 1024
##$WBSW= 4
##$XGAIN= (0..3)
0 0 0 0 
##$XL= 0
##$YL= 0
##$YMAX_a= 268505
##$YMIN_a= -335029
##$ZGOPTNS= <>
##$ZL1= 120
##$ZL2= 120
##$ZL3= 120
##$ZL4= 120
##$ABSF1= 10
##$ABSF2= 0
##$ABSG= 5
##$ABSL= 3
##$ALPHA= 0
##$AQORDER= 0
##$ASSFAC= 0
##$ASSFACI= 0
##$ASSFACX= 0
##$ASSWID= 0
##$AUNMP= <proc_1d>
##$AZFE= 0.1
##$AZFW= 0.1
##$BCFW= 1
##$BC_mod= 2
##$BYTORDP= 1
##$COROFFS= 0
##$CY= 83.5205535888672
##$DATMOD= 1
##$DC= 2
##$DFILT= <>
##$DTYPP= 0
##$F1P= 10.8118882576601
##$F2P= -7.23987719738617
##$FCOR= 0.5
##$FTSIZE= 0
##$FT_mod= 4
##$GAMMA= 1
##$GB= 0.15
##$INTBC= 1
##$INTSCL= 1
##$ISEN= 128
##$LB= 0.25
##$LEV0= 0
##$LPBIN= 0
##$MAXI= 10000
##$MC2= 0
##$MEAN= 0
##$ME_mod= 0
##$MI= 1.114404
##$NCOEF= 0
##$NC_proc= 0
##$NLEV= 6
##$NOISF1= 3.799351
##$NOISF2= 2.8
##$NSP= 1
##$NTH_PI= 0
##$NZP= 0
##$OFFSET= 14.38212
##$PC= 1
##$PHC0= -1194.148
##$PHC1= 10.73376
##$PH_mod= 1
##$PKNL= yes
##$PPARMOD= 0
##$PSCAL= 0
##$PSIGN= 0
##$REVERSE= no
##$SF= 200.129724274929
##$SI= 16384
##$SIGF1= 3
##$SIGF2= 2
##$SINO= 400
##$SIOLD= 16384
##$SREGLST= <1H.CDCl3>
##$SSB= 0
##$STSI= 0
##$STSR= 0
##$SW_p= 3205.1282051282
##$SYMM= 0
##$S_DEV= 0
##$TDeff= 0
##$TDoff= 0
##$TI= <>
##$TILT= no
##$TM1= 0
##$TM2= 0
##$TOPLEV= 0
##$USERP1= <user>
##$USERP2= <user>
##$USERP3= <user>
##$USERP4= <user>
##$USERP5= <user>
##$WDW= 1
##$XDIM= 8192
##$YMAX_p= 0
##$YMIN_p= 0
$$ End of Bruker specific parameters
$$ ---------------------------------
##NTUPLES= NMR FID
##VAR_NAME=  TIME,          FID/REAL,        FID/IMAG
##SYMBOL=    X,             R,               I
##VAR_TYPE=  INDEPENDENT,   DEPENDENT,       DEPENDENT
##VAR_FORM=  AFFN,          ASDF,            ASDF
##VAR_DIM=   8192,          8192,            8192
##UNITS=     SECONDS,       ARBITRARY UNITS, ARBITRARY UNITS
##FACTOR=    0.0002768,     1,               1
##FIRST=     0,             0,               0
##LAST=      2.2672688,     0,               0
##MIN=       0,             -335029,         0
##MAX=       2.2672688,     268505,          0
$$ Real data points
##PAGE= N=1
##DATA TABLE= (X++(R..R)), XYDATA
0 0 0 0 0 0 0 0 0 0 0 0 0 0 0 -8 8 -8 8 -8 12 -16 16 -18 24 -26 32 -37 41 -49 56 -64 75 -85 95 -109 124 -139
36 -139 155 -173 192 -213 239 -264 293 -325 359 -396 436 -481 530 -584 641 -708 779 -863 952
55 952 -1056 1176 -1312 1472 -1664 1897 -2186 2559 -3053 3743 -4785 6515 -9906 19016 -96865
70 -96865 -228384 48026 173239 185876 244555 268505 189794 64564 25243 72430 -50843
81 -50843 -165281 -120310 -119619 -110344 -24317 1852 21005 -327 -5688 135628 185560 78208
93 78208 35891 -10515 -68271 -70831 -63981 -1564 13233 -67392 -21200 34930 -37429 -53034 -43792
106 -43792 -76255 -69360 -35799 45973 72035 -15614 22773 104783 54663 76031 125051 48571
118 48571 -21340 -62517 -90377 -104074 -149609 -109460 -26831 -26821 36077 109679 71567 62860 68855
131 68855 65871 102016 58209 1972 13097 -47016 -91296 -55406 -56018 -48553 -32074 -11868 56837
144 56837 40363 -10570 27853 5451 -30828 29699 50445 21479 -20273 -65035 -38033 -40642
156 -40642 -71959 -6918 7623 -38016 5643 36653 24177 16717 -11751 9621 37118 21804
168 21804 62334 59998 -18281 -25419 -18113 -11941 27936 10891 1253 13372 -34255 -28287 5269
181 5269 -29032 -27787 -7883 -1195 35135 23732 5163 14188 -30592 -23042 36789 19900 12692
194 12692 13143 -30026 -29057 -26234 -27708 8834 -7185 -14401 30649 12807 -1318 12476 -17308
207 -17308 -12652 5579 4287 35624 13249 -29524 -5740 -14025 -19557 22108 19009 16821 19537
220 19537 -6204 11277 3564 -36902 -6540 4731 -9594 23909 21568 970 -3145 -25464 -710
233 -710 20406 -7790 12019 11539 -30657 -14651 -10033 -19426 2821 -8360 1558 29795 435
246 435 -2408 3199 -28663 -13854 3366 6222 34780 12859 -6007 18608 -6929 -11986 18607
259 18607 -1328 -5562 770 -13591 1734 -9570 -22869 12740 4520 204 35350 12624 -8562
272 -8562 -5350 -28054 -15629 -2330 -10350 17095 12516 -5039 18454 3783 -5401 14375 -6491
285 -6491 -3775 10702 -16189 -10446 -5669 -24673 -1934 5612 5883 29014 9792 2176 14533 -16568
299 -16568 -12278 6626 -14480 -103 10530 -7222 4792 -3271 -11165 8872 -5305 375 19821
312 19821 -7872 -4229 6630 -18387 -3450 5854 -6658 11636 5529 -3347 10002 -11271 -9069
325 -9069 9158 -8218 6669 19674 -3439 7390 4077 -14041 3450 -3802 -9776 7495 -8346
338 -8346 -6633 5174 -13413 1004 9398 -6640 15740 15370 -3476 9879 -2790 -12907 -178
351 -178 -12561 -3690 6715 -12070 3023 6275 -13480 5569 4837 -8200 7932 -1753 -6026 5523
365 5523 -11366 -1871 10279 -4030 14308 19683 2587 16194 4811 -11018 1112 -14747 -18186
378 -18186 -3852 -17607 -7421 3412 -7140 13140 16442 4745 23136 12111 -3477 6435
390 6435 -11394 -16712 -8613 -22425 -9117 -182 -10154 11542 12267 -289 17695 9311 965 12846
404 12846 -2256 -3132 3285 -12735 -2055 782 -13386 2541 -1910 -12024 6395 -2603 -7263
417 -7263 8256 -4070 -788 9202 -2138 8369 6207 -7236 8538 -272 -10593 8050 -3393
430 -3393 -7391 7899 -2483 2658 7777 -5712 4334 35 -10689 8681 1673 -3808 14327
443 14327 1429 -441 11027 -6369 -5362 -3310 -19103 -11448 -13582 -18456 152 -5228 -83 24586
457 24586 14949 19576 32012 10170 5321 2041 -16537 -12979 -19424 -23926 -6797 -15517 -11018 10021
471 10021 -319 6722 19801 5230 11217 11950 -3829 2883 -3491 -9135 4658 -3418 1833 14861
485 14861 -3530 1369 7708 -11840 -2168 4190 -6076 4896 1701 -1967 6833 -6151 -2655 6185
499 6185 -11852 -3825 1767 -16943 -5645 -3691 -15269 378 2051 1636 13251 3989 5806 7741
513 7741 -9101 2495 6299 -8276 7778 8965 -4028 8259 4343 288 9328 -264 4658 9623
527 9623 -6199 -215 -2596 -17682 -4435 -6384 -11223 7030 -507 -6362 5377 -3301 -769 5091
541 5091 -1502 9809 5454 -6251 8432 -857 -13523 3084 -1446 -2994 8651 570 1776 -898
555 -898 -14541 -2641 -3186 -10422 6303 953 -4692 9215 42 1953 14296 2366 6110 10619
569 10619 -2510 244 -6702 -14024 -2311 -7791 -1018 20127 8826 9225 17794 1155 1109 2476
583 2476 -9920 -6720 -14319 -21960 -11563 -18785 -14759 2203 -3854 7541 21819 11240 15818 11697
597 11697 -5984 -2168 -6891 -10606 1617 -5817 -5525 2781 -7358 2562 12255 2427 13542 13750
611 13750 36 7171 1319 -7745 -1332 -7744 -2765 5727 -3080 4877 3890 -13275 -3262 -1934
625 -1934 -10214 2617 39 -6061 1030 -6378 -1798 6703 -517 9208 11143 1056 10012 2786 -9479
640 -9479 -1171 -11043 -14254 93 -5002 -2479 2878 -5345 1504 3565 1840 17485 11793 2807 11443
655 11443 -2199 -8975 -153 -8135 -5786 263 -4786 3752 2429 -3774 6808 -442 -2929 11945
669 11945 2851 -106 4872 -10611 -11420 -5893 -10118 287 2123 -2001 6440 -1884 -2215 8856 -2597
684 -2597 -263 9049 -3461 1309 6715 -4007 -762 -1696 -4128 5739 1126 2346 7396 -9232 -7614
699 -7614 -155 -10492 -81 8061 -150 7026 5964 845 7220 -1204 -1010 4212 -7591 -2388 696
714 696 -13415 -6807 -3572 -10617 3980 8384 6201 12465 3907 1898 4614 -4925 3314 5543 -7733
729 -7733 1100 -492 -11937 -1094 -2736 -7214 1933 -673 2345 6739 -1725 4276 2704 -7535
743 -7535 5767 5863 -3042 6679 -1117 -9456 -1954 -6749 -3669 3099 -2773 4306 4135 -3444 6881
758 6881 1540 -5472 6539 376 -2459 7581 -927 -3169 -402 -6608 1717 2922 -950 9053
772 9053 953 -6275 4433 -2665 -3692 6308 -1325 -358 2804 -5168 -508 -3058 -9257 345 -3694
787 -3694 -3782 7648 -2046 -2455 5586 -4112 580 7649 268 4150 1602 -4338 1625 -4892 -4798 5530
803 5530 -3169 -79 9086 -1312 1874 4609 -4027 2539 2533 -657 6917 -629 -2761 3174 -6225 -1926
819 -1926 4443 -5038 1365 3014 -6457 -182 -2158 -7007 759 -3398 -1616 4648 -4837 -580 2869
834 2869 -6993 1523 4239 -2711 5610 3008 -1568 4496 -2033 -1559 4066 -3348 2454 5089 -4195
849 -4195 2502 1060 -6168 3715 1056 -1169 6394 -657 -90 4238 -3745 1667 3745 -3472 4239
864 4239 1534 -4959 2007 -5276 -8130 -1 -5759 -2478 3104 -4068 1165 1980 -3922 5114 2260
879 2260 -1927 6356 -923 -3326 2671 -5378 -3151 1201 -4538 2685 3467 -2090 6010 1753 -1904
894 -1904 6344 355 767 6235 -2864 64 2044 -5988 901 1213 -3614 4693 1040 -1035 5406 -2776
910 -2776 -1704 3339 -5664 -1153 1166 -7372 -1020 -2814 -6856 2185 -1624 -1517 6242 -1135 891
925 891 4627 -4173 610 1186 -5153 3382 973 -3215 5430 -177 -1017 5913 -741 1811 4247 -4378
941 -4378 1222 -158 -6702 2336 -303 -2517 6452 1151 1422 7074 -1427 1109 3010 -5677 -176
956 -176 -1281 -7815 -746 -4540 -6154 2178 -3071 -497 5590 -2233 2311 4103 -3615 2595 795
971 795 -4093 3872 -926 -1973 5342 -2253 -542 4376 -3389 1419 2903 -4173 2349 -702 -4491
986 -4491 3600 -1489 -1092 5840 -1551 1540 5715 -2819 2369 1977 -5082 1707 -1670 -5351 1778 -4030
1002 -4030 -4384 1931 -4129 796 4564 -2111 4126 3049 -3600 4527 693 -3082 3190 -2890 -2634
1017 -2634 2263 -4168 695 2357 -4386 3271 2477 -2357 5177 498 -2874 3234 -2854 -985 3315
1032 3315 -4009 171 1390 -4519 2921 1097 -3091 4070 -1699 -2121 5198 -1805 -472 3559 -3630
1047 -3630 1084 2243 -2783 3210 -1122 -4560 2808 -3186 -2802 4256 -3555 -1207 3783 -1768 3089
1062 3089 3172 -1315 4162 -139 -2180 4313 -2828 -3243 1618 -6186 -2202 1524 -4984 812 563 -3445
1078 -3445 3691 1135 647 5839 -937 1374 4881 -2569 2248 3184 -5418 -39 -557 -4752 813 -2476
1094 -2476 -3089 1558 -3932 940 4794 -2534 3504 4357 -2935 3719 2438 -2047 3025 -1995 -2475 1441
1110 1441 -4253 12 1553 -5612 1107 1039 -4314 4406 1679 -2767 3637 -556 -471 3914 -1507 1241
1126 1241 697 -4678 2057 -75 -4475 3361 -1453 -4489 3394 -474 -109 4002 -1504 1293 1472 -2478
1142 -2478 4495 505 -3934 3015 -2291 -3901 4040 -1760 -1250 2155 -2910 1418 2132 -1737 3560
1157 3560 -1084 -3642 4262 -1686 -1969 3974 -4014 -2509 2565 -2389 1460 1512 -2580 1883 -1261 -920
1173 -920 5709 -1823 -1010 4500 -3354 124 4223 -2698 236 -61 -4087 1157 -2147 -2614 2022 -4392
1189 -4392 -977 4215 -2731 2105 4606 -2435 2846 3375 -900 2797 -1211 -1863 1455 -4039 -140
1204 -140 2633 -5365 -71 2246 -3926 2176 1892 -2119 2521 -444 -436 3355 -2497 827 2562 -3572
1220 -3572 2250 1713 -4653 2385 -192 -4401 2486 -1449 -2939 803 -2739 1139 2131 -2654 3527
1235 3527 1958 -3262 5200 2182 -2321 3497 -866 -1513 2052 -2611 556 895 -3784 2444 742
1250 742 -2857 3480 -547 -2375 4102 -1100 -1160 2819 -3075 -48 1384 -1870 2776 -356 -2827 3764
1266 3764 -1731 -2159 3983 -2988 -2813 1298 -3227 -361 570 -2893 1863 -496 -765 5558 -860 -647
1282 -647 4522 -1978 832 4117 -2455 28 207 -2890 2563 -68 -1349 2432 -2816 -490 4279
1297 4279 -1729 1225 2385 -4215 1042 1836 -2243 1713 -1288 -2703 1523 -2189 854 2723 -4775
1312 -4775 -308 1684 -3737 2261 1695 -3749 183 -914 -4 3398 -1175 531 1991 -3547 2321
1327 2321 3606 -2302 2198 258 -2869 3580 824 -337 2318 -2544 7 2129 -1969 2368 41
1342 41 -4339 1813 -273 -2874 3234 -1355 -2645 1867 -1471 1300 1468 -2772 1761 -381 -2933 3775
1358 3775 -306 -3115 2386 -1929 -1629 2168 -2111 -128 390 -2926 2328 356 -1819 3924 -131
1373 -131 -173 5483 275 560 3692 -1573 1133 1554 -2583 682 -1708 -3405 1781 -2581 -1857 2469
1389 2469 -3416 -979 3213 -1571 1097 1830 -1878 1965 123 -448 3159 -2545 -1843 1833 -4008 -716
1405 -716 1362 -4427 -714 335 -1932 3165 750 -214 3562 -486 1446 4334 -1457 1054 1491 -3987
1421 -3987 1174 779 -2954 1106 -1423 -1920 2012 -1659 559 2226 -2798 2013 3053 -1616 3024
1436 3024 1308 -2706 1605 -1073 -1901 1026 -3516 -1861 129 -3665 1298 1312 -2516 3112 1269 -1087
1452 -1087 3535 -421 -1495 1119 -2866 -395 1175 -2550 1919 1222 -1140 4679 1986 -51 4214
1467 4214 -375 -957 1868 -2956 -1299 -347 -3669 955 -152 -2271 2483 -965 -2023 2533 -1812
1482 -1812 -1016 1552 -2665 25 1541 -1476 2947 1296 -777 3659 16 -669 2415 -2745 -1857 381
1498 381 -3469 -89 484 -2546 1877 566 -484 3929 340 121 2757 -1550 -210 1538 -3301 -263
1514 -263 -287 -3048 1391 -311 -1403 2437 -1113 -333 3007 -1419 1003 2008 -2461 1200 715 -2388
1530 -2388 1715 -720 -1507 2052 -1593 -643 1537 -3166 -418 228 -2999 1135 189 -1718 2607 -32
1546 -32 135 4106 -87 946 2942 -1481 670 503 -3242 184 -1540 -2739 1735 -991 -582 2712
1562 2712 -1266 798 2586 -1657 1318 785 -2706 701 -1230 -2508 1148 -1756 -503 2355 -1280
1577 -1280 1502 2681 -1187 2088 1618 -1212 2254 -82 -1538 1412 -2436 -1355 532 -3535 -341
1592 -341 489 -2459 1491 782 -1495 2803 668 212 3112 -376 494 1509 -2821 337 22 -3469
1608 -3469 745 -661 -2438 1472 -1159 -1396 1803 -1281 920 2557 -456 2626 1526 -1340 2753
1623 2753 -8 -2160 1587 -2257 -2899 19 -3277 -1431 -314 -2182 1992 1750 49 4478 1427
1638 1427 83 3494 -648 -614 1730 -2485 -1131 -370 -3124 452 -735 -1967 1869 -871 -705 2868
1654 2868 -1422 -113 2428 -1578 1126 1742 -872 1590 -429 -1730 1625 -1672 -1202 1792 -2266
1669 -2266 -188 2220 -1482 1481 1501 -1613 1710 563 -805 1098 -2191 -1570 417 -3039 363 1809
1685 1809 -1897 1391 1794 -1040 2231 744 -576 1789 -1696 -714 1069 -2701 -338 312 -3006 1362
1701 1362 1159 -1166 2286 179 -1120 1666 -593 426 1349 -1956 1216 636 -2191 2200 445 -2330
1717 -2330 1437 -830 -1572 1130 -1321 -595 392 -2154 1419 1133 -978 3065 406 -1329 2626 -48
1733 -48 -933 1704 -1764 -1114 24 -2328 778 -317 -1842 2100 -175 -371 3573 131 -49 2267
1749 2267 -1829 -744 479 -2112 -257 -1224 -2209 1486 -692 483 4479 -67 575 3068 -1138 -366
1765 -366 228 -3051 -1649 -2516 -2616 1232 -1108 174 3617 0 1827 4062 -411 1165 710 -3019
1781 -3019 -769 -1256 -2145 497 -1603 -43 1712 -1132 1895 2738 -2264 219 467 -3004 177 -259
1797 -259 -827 1303 -456 1211 3014 -513 2077 1875 -2597 55 -781 -3504 -504 -1851 -2311 658
1813 658 -724 985 2767 358 3126 2116 -819 2466 447 -2528 493 -1999 -3041 -239 -2061
1828 -2061 -763 631 -1152 2052 1555 -440 3573 520 -1731 1491 -1483 -2437 671 -1645 -632
1843 -632 452 -1253 1702 897 -177 3296 84 -1450 1829 -2005 -1738 735 -2238 -1013 881 -807
1859 -807 1999 984 -163 2400 -814 -900 2306 -1901 -1136 1331 -2324 -299 1250 -601 1602 670
1875 670 -301 2087 -1240 -698 1169 -2955 -1330 833 -2166 572 1338 -1006 1122 808 67 2681
1891 2681 -36 710 1842 -2467 -663 224 -3467 -167 522 -2370 1252 253 -308 2118 -108 1238
1907 1238 2322 -1264 1295 985 -2990 230 -415 -2649 1148 178 -611 1660 -687 59 929 -2077
1923 -2077 706 595 -2166 1471 305 -1867 2000 335 -449 2264 -217 472 991 -1920 426 -816
1939 -816 -2738 1263 155 -1178 2551 -40 -1062 1181 -1341 -356 790 -1568 906 -13 -1565 1949
1955 1949 -208 -848 2837 -293 -281 2168 -1344 -544 -19 -2157 199 251 -788 2485 -441 -1191 1561
1972 1561 -1646 -958 1529 -1526 383 1070 -1066 873 527 -580 1906 -202 -63 1964 -1991 -867
1988 -867 287 -2911 -435 764 -1148 1651 961 -562 1546 -580 260 2312 -988 932 1836 -2080
2004 -2080 -148 -9 -2559 530 -287 -889 1346 -648 -183 1103 -1924 495 1463 -1249 1738 976
2020 976 -1567 1116 -597 -1247 1475 -270 511 1439 -1499 345 -279 -2663 566 -353 -1347 2176 349
2037 349 -322 1883 -674 406 1436 -1201 1245 523 -2107 229 -1353 -2438 1272 -110 230 2647
2053 2647 -40 495 890 -1689 519 -351 -1759 1028 -834 -1637 1081 -1803 -944 1670 -555 1362
2069 1362 2463 -409 1296 113 -1896 1191 -727 -759 1482 -1604 -1350 318 -2635 -332 762 -1061
2085 -1061 2174 1478 -72 2469 38 -226 2113 -642 374 1562 -2178 -601 -1286 -3471 -295 -719
2101 -719 -875 2309 157 523 2375 -852 467 1668 -817 1303 864 -1814 526 -1358 -2039 615
2117 615 -1132 -172 1791 -1064 220 470 -2361 609 491 -808 2398 951 52 2008 -1015 -750
2133 -750 722 -1903 20 288 -2213 125 -547 -1479 1665 531 975 3543 217 509 699 -3053 -1143
2150 -1143 -842 -2824 546 -135 -846 1844 -166 391 2609 -111 1369 1989 -1328 261 -612 -3172
2166 -3172 -369 -1277 -1457 1731 0 32 1519 -1438 325 1200 -912 2091 1646 -775 1678 -452
2182 -452 -1984 456 -1525 -835 898 -1498 572 735 -1875 1131 528 -761 2260 520 -700 1048
2198 1048 -1780 -1176 369 -1299 1217 1444 -375 1952 169 -1605 1023 -1228 -1271 1316 -977 185
2214 185 901 -1327 500 560 -812 2206 346 -889 1218 -1695 -1653 589 -1312 478 1939 -355
2230 -355 1585 586 -1448 621 -1492 -1513 1321 -1123 -866 1404 -1425 -235 1107 -1039 1668 814
2246 814 -286 1749 -566 -824 1184 -1135 232 1809 -967 489 302 -2455 -499 -1073 -1833 933
2262 933 -187 433 2122 -556 1352 1512 -1258 1247 980 -1445 373 -748 -2098 -196 -1565 -381
2278 -381 1641 -921 931 1072 -1570 578 339 -1637 1469 470 -153 1630 -340 -176 649 -1621 481
2295 481 838 -1333 1030 -442 -2299 479 -731 -1127 1533 -112 344 1296 -710 1013 523 -974
2311 -974 1810 306 -1321 1534 -1037 -1944 182 -1817 -368 1042 -465 1683 1180 -539 2092 -30
2327 -30 -1129 1317 -1271 -1345 716 -1947 -755 1 -1285 1292 1437 472 2435 3 -683 1058 -1783
2344 -1783 -1194 829 -1819 -318 719 -1026 753 443 -602 1389 -146 182 1975 -1374 -714 839
2360 839 -1767 217 1131 -932 895 -293 -1094 835 -906 -450 1095 -1675 -136 1180 -1243 585
2376 585 733 -1120 1097 1093 113 1996 -79 -152 667 -1528 4 718 -2115 277 -186 -1982 1004 292
2394 292 -648 1285 -105 555 1505 -995 606 -140 -2429 534 36 -1349 1679 383 -684 1355
2410 1355 -226 -41 931 -1070 218 -89 -2001 689 -587 -1435 1380 -191 -282 2093 7 342 1063
2427 1063 -888 416 -148 -1547 932 -972 -1433 1273 -877 -748 1674 -378 79 1260 -785 667
2443 667 160 -877 989 -873 -944 1594 -898 -324 1672 -1111 -288 780 -1303 278 -348 -1394 252
2460 252 -1202 -756 1527 -678 640 2057 -640 729 1314 -1049 573 73 -1041 529 -789 -141
2476 -141 1202 -1157 269 1110 -1521 254 494 -1717 -57 -127 -1066 1111 -231 159 1385 -490 933
2493 933 1369 -1206 626 121 -1819 467 -126 -1061 669 -384 -56 841 -865 654 379 -1305 832
2510 832 280 -1179 1354 311 -634 1061 -346 52 896 -1036 458 -317 -1689 661 -304 -1217 1247
2527 1247 -156 -368 1573 -483 -14 628 -1023 424 208 -722 1330 -342 -1058 1295 -872 -685 1405
2544 1405 -625 -82 647 -1168 90 62 -1123 1065 -415 -625 1513 -634 -517 1238 -808 227
2560 227 1115 -807 707 354 -852 625 -1147 -729 1018 -1059 -155 1223 -1208 6 721 -1065
2576 -1065 539 277 -563 1348 -135 -260 1150 -1010 188 1080 -1201 473 371 -1387 144 -244
2592 -244 -704 1092 2 434 1479 -830 179 451 -1645 272 188 -1309 1121 180 -409 1399 79
2609 79 317 1581 -320 591 278 -1886 -37 -752 -1923 409 147 -366 1767 210 323 1175 -845
2626 -845 519 430 -932 1154 237 -1328 682 -811 -761 744 -644 -197 713 -1041 -168 37 -1136
2643 -1136 924 277 -169 1969 8 28 1251 -877 -342 711 -1164 335 207 -1254 455 -904
2659 -904 -1170 923 -618 -129 1121 -515 460 923 -640 1022 762 -268 1063 -408 -1264 -180 -2133
2676 -2133 -1404 262 -862 728 1460 84 1317 907 -397 1018 -558 -1008 412 -1537 -915 62
2692 62 -1454 486 1067 -39 2134 1093 -252 582 -1260 -1211 147 -1408 51 896 -948 681 439
2709 439 -939 1123 -248 -712 904 -855 -526 504 -1250 -138 1046 -313 1545 934 -330 839
2725 839 -830 -1637 160 -1341 -471 424 -664 306 707 -724 938 847 -322 1508 210 -104 809
2742 809 -1000 -448 352 -1062 584 417 -1059 261 -449 -1250 566 -370 133 1452 -11 766 1373
2759 1373 -685 253 286 -1194 786 -45 -771 498 -1156 -732 399 -717 392 906 -772 571 -20
2776 -20 -1103 752 -117 -78 1423 -185 209 1064 -961 19 98 -1351 586 -18 -1063 705 -732 -903
2794 -903 1071 -265 631 1447 4 742 172 -1212 304 -532 -1028 750 -255 -447 996 -744 -201
2811 -201 560 -779 677 689 -524 625 -680 -935 625 -678 -179 1390 -513 145 772 -1094 202
2828 202 80 -473 964 132 -127 1562 -551 -172 681 -1138 14 559 -1041 7 -228 -1164 568
2845 568 -16 142 1500 33 573 1086 -929 221 284 -1233 371 173 -590 856 -316 -626 421
2862 421 -1016 30 985 -1087 574 345 -1154 759 239 -178 1461 445 367 711 -909 119 -72
2879 -72 -1484 101 73 -945 1216 -129 -742 707 -491 51 986 -352 513 111 -1358 567 -16
2896 -16 -512 1129 -9 -594 896 -534 -569 273 -1452 -203 95 -776 1011 -29 -731 873 -51 -274
2914 -274 1569 -131 117 728 -767 75 23 -697 717 -228 -513 995 -623 -587 971 -1032 23 1056
2932 1056 -414 638 279 -575 497 -366 -385 883 -507 -31 881 -1266 -117 412 -1107 299 541
2949 541 -253 468 -250 -312 665 -780 -152 793 -1113 340 721 -994 585 318 -556 706 -290 232
2967 232 798 -1042 -69 389 -1269 230 409 -818 740 209 -500 824 -344 -119 992 -589 619
2984 619 579 -883 635 66 -1211 797 67 -719 672 -291 -670 118 -1011 -18 425 -754 896 320
3002 320 -731 1102 -36 -666 794 -194 -257 589 -663 -46 210 -821 861 -118 -609 1100 -488
3019 -488 -596 713 -888 -553 765 -338 454 751 -309 937 -208 -678 949 -579 -426 849 -874
3036 -874 16 736 -809 296 5 -574 550 -588 -934 647 -964 -379 960 -492 581 1288 -231
3053 -231 488 185 -815 191 -656 -831 341 -1014 -138 772 -877 549 887 -503 741 322 -649
3070 -649 664 -245 -264 624 -842 152 745 -732 581 394 -1339 511 -215 -1240 281 -297 -383 609
3088 609 -563 412 658 -631 932 607 -870 660 -83 -827 725 -88 -233 732 -314 281 324 -973
3106 -973 520 -131 -771 619 -471 -883 1126 -255 14 772 -501 362 289 -808 490 -178 -789 751
3124 751 -383 -650 1047 -391 -172 639 -797 135 -141 -709 404 -212 -496 1077 18 -339 1036
3141 1036 -411 36 880 -548 -38 66 -980 250 -487 -644 803 -860 174 832 -628 449 830
3158 830 -869 125 204 -601 717 -212 54 929 -561 -63 584 -854 -31 389 -725 557 158 -783
3176 -783 742 -247 -258 819 -471 87 889 -886 476 598 -995 800 181 -669 677 -285 -390 567
3194 567 -618 -29 501 -1019 217 142 -941 973 144 -713 864 -180 -432 735 -378 258 513
3211 513 -634 504 77 -520 893 -152 -783 749 -719 -262 608 -699 156 451 -657 665 112
3228 112 -516 1090 -206 -479 915 -507 -584 655 -1017 29 156 -835 493 -255 -742 998 -528
3245 -528 -273 934 -763 49 677 -694 459 514 -712 832 -105 -505 846 -596 -379 482 -1058
3262 -1058 -172 585 -599 472 274 -540 981 6 -257 953 -465 -186 705 -901 198 277 -805
3279 -805 278 210 -488 820 -174 -562 702 -481 26 652 -875 346 344 -533 572 89 -421 704
3297 704 -40 -233 1041 -465 -75 543 -906 521 357 -776 629 -173 -719 450 -564 -330 745
3314 745 -805 92 459 -808 358 299 -529 784 -137 -294 1079 -352 -431 446 -927 -38 269 -838
3332 -838 430 -29 -643 717 131 -16 876 -357 48 741 -698 313 434 -807 361 -189 -521 538
3350 538 -303 -384 392 -610 -152 639 -690 475 426 -740 573 363 -568 680 -301 -352 738 -785
3368 -785 -38 201 -588 178 9 -840 678 -227 -298 500 -652 11 837 -131 625 575 -445 751 193
3387 193 -300 681 -168 -400 683 -584 -374 423 -822 -18 221 -766 538 -108 -445 368 -544 -169 945
3406 945 -210 96 655 -430 454 419 -493 465 -100 -489 773 -311 68 898 -861 -25 526 -707
3424 -707 385 304 -720 349 -102 -373 793 -544 -157 673 -786 454 596 -761 127 129 -697 588
3442 588 -144 -301 551 -401 -20 578 -430 426 428 -712 572 88 -654 477 -1 -245 610 -327 -57
3461 -57 273 -986 157 -118 -789 483 85 -593 845 116 -300 819 -88 746 895 -471 381 -24
3479 -24 -921 571 -413 -762 456 -374 -501 358 -541 105 298 -676 473 22 -460 636 -215 -372 825
3498 825 -209 -7 1073 -338 397 251 -306 536 110 -576 527 -409 -289 715 -735 -228 372 -691
3516 -691 233 276 -452 584 -84 -231 446 -398 -257 773 -492 15 493 -780 258 174 -547 308 -166
3535 -166 -247 445 -292 -26 436 -686 383 593 -595 389 356 -660 442 -180 -443 394 -720 -149 384
3554 384 -651 165 433 -569 541 503 -333 687 190 -267 442 -543 -46 226 -594 74 190 -775 708
3573 708 -180 -804 395 -33 -368 629 -53 83 319 -493 435 320 -584 756 -125 -545 769 -168 -183
3592 -183 467 -504 111 27 -657 237 -76 -402 530 -164 -612 749 -304 -367 500 -402 108 329 -382 502
3612 502 38 -216 799 -162 -357 538 -600 -419 518 -565 -5 265 -587 295 -170 -24 543 -275 -74
3631 -74 748 -401 127 943 -343 277 603 -590 507 -314 -118 357 -491 -151 409 -523 -51 826 -471
3650 -471 411 417 -188 436 260 -39 371 -337 -102 211 -735 7 110 -905 221 188 -588 206 -114 -294
3670 -294 460 -93 383 531 -451 470 565 -741 302 -152 -561 307 -348 -504 266 -428 26 300 -388 492
3690 492 200 -508 799 137 -476 340 -388 -489 602 -216 69 207 -393 442 152 -538 638 -288 -144
3709 -144 783 -168 -236 487 -440 4 292 -500 583 -89 -483 419 -249 -270 636 -363 176 447 -358 -18
3729 -18 435 -452 9 -253 -609 294 -478 -588 519 -408 -79 565 -384 80 463 -159 387 -7 -280 574
3749 574 -469 -282 429 -605 12 354 -629 162 121 -40 689 155 -267 492 -420 -47 622 -444 333
3768 333 455 -493 189 265 -513 330 -234 -679 174 -372 -9 260 -656 194 299 -472 586 398 -435 648
3788 648 -114 -242 651 -293 -168 57 -697 313 81 -613 268 -141 -440 609 -41 -140 507 -80 38 261
3808 261 -584 400 261 -538 719 -29 -134 593 -476 -247 359 -510 -341 30 -352 368 90 -441 515
3827 515 -39 -35 715 -186 -4 573 -490 -15 68 -574 65 -102 -352 489 -137 -284 521 -363 136 389 -216
3848 -216 151 177 -594 313 -33 -447 482 -214 -95 730 -241 95 411 -478 47 -113 -759 -62 -170 -615
3868 -615 416 -382 -179 503 -348 3 295 -483 501 296 -292 433 98 -225 301 -325 228 430 -506 133
3888 133 295 -625 109 63 -651 534 -497 -419 487 -288 276 357 -368 383 325 -413 319 -30 -473 225 -305
3909 -305 -193 220 -548 54 535 -633 498 460 17 406 -40 -250 346 -295 -271 420 -469 -37 225 -517
3929 -517 177 179 -321 397 -5 -221 291 -144 -76 238 -245 2 202 -360 505 87 -317 648 -116 -371 555
3950 555 -234 47 339 -745 -63 -80 -654 10 -86 -319 390 -175 5 686 -258 154 426 -293 483 276
3970 276 -344 562 -282 -301 373 -224 -320 387 -413 -158 97 -579 187 110 -564 356 -141 -127 736 -339 -275
3991 -275 419 -464 53 331 -379 116 96 -165 318 -152 -327 581 -421 -179 404 -281 -8 299 -261 124
4011 124 239 -434 400 -157 -136 136 -235 -136 549 -441 388 355 -490 333 206 -182 461 -56 -143 233 -443
4032 -443 -78 444 -515 269 236 -201 264 -4 -510 385 -404 -370 84 -430 279 32 -701 178 271 -367 569
4053 569 299 -367 496 -110 -54 559 -549 393 79 -616 195 189 -652 407 50 -166 559 -324 -37 136
4073 136 -275 227 103 -468 491 78 -152 624 240 -124 395 -231 -36 211 -673 17 -149 -418 375 -216
4093 -216 -112 727 -97 42 692 -80 273 405 -278 58 40 -456 243 -419 -138 546 -413 -45 403 -314
4113 -314 84 377 -373 244 62 3 538 -154 -74 573 -399 -30 572 -542 145 404 -578 95 -150 -442
4133 -442 79 -299 -46 402 -421 281 469 -649 449 163 -601 124 67 -501 377 -179 -13 239 -361 74
4153 74 404 -310 372 -57 -606 380 -240 -612 122 -299 -22 216 -95 310 265 -265 686 179 -430 424 -43
4174 -43 -412 245 -223 -227 251 -397 81 230 -543 291 47 -361 375 55 -260 320 -91 112 301 -386 140
4195 140 352 -321 228 -109 -440 423 -364 -353 347 -324 154 158 -375 316 215 -123 409 95 -60 850 -199
4216 -199 3 516 -466 -39 173 -641 206 -59 -98 396 -349 5 404 -276 255 244 -367 165 221 -530 146
4237 146 -5 -153 306 -171 -310 135 -457 -38 98 -553 86 432 -390 225 238 -203 264 -110 -4 385
4257 385 -497 361 308 -569 302 287 -176 536 91 -223 218 -201 -98 159 -461 -207 189 -525 217 51 -469
4278 -469 739 329 -251 619 -24 -198 80 -440 68 -9 -451 399 -182 -483 405 -150 -305 422 -30 -92
4298 -92 467 -113 208 -16 -485 378 -84 -190 486 -275 -170 519 -377 -137 45 -319 112 39 -271 478 73
4319 73 -363 646 -132 -104 634 -136 -108 146 -227 168 72 -185 225 -303 -193 431 -288 -79 463 -446 17
4340 17 284 -578 61 139 -78 371 -112 -118 677 -223 14 509 -237 239 188 -342 227 -47 -280 261 -556 -333
4362 -333 242 -409 -135 342 -176 383 236 -320 618 25 -403 297 -335 -178 139 -548 -58 295 -130 156
4382 156 224 -481 169 37 -228 275 -333 -9 141 -254 387 495 -363 391 -113 -326 281 -270 -458 284
4402 284 -316 -186 408 -189 334 194 -254 345 -125 -245 305 -178 -248 488 -335 -23 351 -244 -7 177
4422 177 -431 514 -61 -156 485 -140 53 226 -223 183 314 -333 292 230 76 429 -119 -81 553 -217 -235
4443 -235 282 -656 -130 40 -716 31 7 -173 471 -22 -187 424 51 92 223 -599 -56 -77 -517 309 35
4464 35 -362 360 -61 -88 412 -353 -146 303 -561 136 81 -307 430 -37 -74 326 -2 -37 434 -368 121 104
4486 104 -414 175 80 -467 -97 -144 -320 337 -60 -66 102 -173 158 192 -304 238 -20 -426 383 14 -200 135
4508 135 -139 -34 170 -323 315 80 -239 291 -21 -452 368 -103 -186 508 -189 -92 289 -437 117 72 -376
4529 -376 144 99 -395 206 121 -133 373 -327 -68 168 -379 160 143 -163 281 16 -192 453 -125 -62 452
4550 452 -427 -11 606 -519 262 171 -390 377 -277 -155 442 29 -149 330 -299 251 105 -252 570 51
4570 51 -216 429 128 -217 368 -225 -195 99 -534 -40 -8 -268 416 -92 -184 361 7 -145 283 -36 -69 230
4592 230 -303 -3 44 -223 202 -21 -159 424 -319 -41 478 -310 -23 192 -329 77 5 -357 188 -317 -293
4613 -293 155 -369 29 51 -238 210 288 -381 248 267 -444 158 -57 -282 6 -136 72 486 -383 93 442
4634 442 -216 264 -70 -190 142 27 -200 205 -188 207 241 -337 405 38 -430 206 -286 -274 109 -476 -60
4655 -60 186 99 53 221 -86 154 157 -299 286 28 -560 102 -254 -305 78 -295 93 187 -140 188 154 -343 301
4678 301 -167 -206 212 -281 -61 361 68 -19 83 -90 271 -38 -98 500 -176 -175 244 -271 -10 123 -224 95
4700 95 143 -254 227 -185 -67 239 -164 -5 398 -576 -89 176 -244 17 29 -28 209 -91 -206 270 -145
4721 -145 -188 376 -235 -14 275 -210 230 237 -216 112 19 -215 206 -300 -92 307 -498 206 42 -582 104
4742 104 197 -366 72 -54 -149 285 -159 242 341 -109 90 296 -448 94 -73 -265 239 20 5 305 -310
4763 -310 36 230 -97 177 -124 -314 394 62 -175 253 13 -49 130 -45 -144 -27 -550 178 -187 -350 212
4784 212 83 -164 165 104 -114 397 -201 -184 57 -234 66 -123 -270 299 -49 -45 251 -105 17 14 -431 -87
4806 -87 156 -206 173 98 -41 405 -111 83 179 -247 100 308 -348 64 154 -336 189 -171 -101 401 -10 114
4828 114 159 -362 -67 315 -270 110 110 -135 118 29 -63 51 -212 -71 235 -289 56 235 -198 156 189 -279
4850 -279 254 -152 -257 160 -331 165 358 -245 83 265 25 331 40 -217 194 4 -106 172 -221 20
4870 20 58 -298 256 -303 -322 329 -14 -262 -41 10 -35 191 41 356 258 -240 109 45 -250 212 -38 -272
4892 -272 434 -97 -276 157 -50 -69 179 -102 373 148 -127 185 -102 -172 240 -265 -233 87 -181 -82 155
4913 155 -114 88 -177 -293 321 -83 -148 274 -135 -383 18 -159 -13 333 -304 271 -68 -46 143 -156 -58
4934 -58 149 -277 -3 32 -233 87 -39 -197 103 1 -235 257 -227 66 425 18 199 209 -177 369 57
4955 57 -56 129 -31 -207 28 -93 -225 -40 -322 107 150 -387 239 168 -70 413 -61 -75 232 -159 139
4976 139 45 -477 -52 31 -329 -140 -20 -237 65 -217 -33 275 -81 16 67 -262 57 87 -309 238 -1 -552
4998 -552 205 -217 -264 140 -321 104 43 -106 -100 188 -315 264 -242 -48 236 -167 273 126 -295 203 77
5019 77 -361 39 -410 -347 45 -141 -219 348 -280 23 446 -236 -155 -103 -237 -47 -149 -207 341 -228 -85 245
5041 245 -92 156 331 -285 143 170 -55 222 -96 -95 85 -225 -37 192 -239 -7 118 -3 234 167 -183
5062 -183 311 -54 -199 268 -22 -112 235 -209 149 -10 -387 -8 -169 -10 144 7 58 253 -33 -192 465
5083 465 -175 222 125 -327 231 53 19 28 -67 -340 127 -166 -101 -8 -366 -34 -53 -330 39 59 62 133 40 -121
5107 -121 199 -11 40 30 -256 78 174 -117 65 -43 -259 171 -97 151 81 -257 -9 217 -133 93 42 32
5129 32 336 -117 -98 82 -206 34 170 -89 -61 -130 20 324 94 -290 173 53 -117 150 -83 -7 313 -114
5151 -114 193 54 32 212 -43 -168 203 64 -160 194 -349 20 169 -190 157 32 -252 100 34 -189 420
5172 420 -34 47 433 -167 -104 391 -163 -44 258 -77 42 -222 -263 213 -307 -124 274 -142 -25 211 26
5193 26 194 60 -208 38 -80 -127 45 -173 165 114 -151 -55 58 -321 185 278 -193 -46 -326 -237 287 -130
5215 -130 206 185 -224 306 -123 -75 243 100 -71 143 36 0 99 -42 62 315 -58 122 -10 17 57 -99
5237 -99 -22 100 2 -157 -17 -220 34 212 -306 6 -239 -133 47 55 -68 235 -220 9 147 -451 89 26
5259 26 -76 155 -105 -78 112 107 -53 122 -112 -100 102 36 195 -88 -140 187 -53 -47 292 -2 -232 79 -87
5282 -87 -190 139 19 113 242 -128 367 34 -151 278 -124 -195 340 -148 -135 351 -180 -32 -10 -18 147 -62
5304 -62 96 123 -395 110 185 -34 38 73 -118 44 104 -355 368 17 74 167 -121 -61 31 -49 191 152 -71 197
5328 197 515 -22 -113 -161 79 113 -305 101 -36 -360 50 158 -260 170 80 -247 80 -150 2 356 -200
5349 -200 73 -80 -183 240 -2 -45 105 -17 -116 227 -63 126 165 34 18 -45 -133 -45 5 -425 374 -156 -299
5372 -299 190 -104 173 -8 -54 121 12 -56 87 -23 -78 118 -12 -173 40 71 -60 90 -289 41 120 24
5394 24 148 -40 66 66 92 -41 399 -190 6 -157 -155 145 -174 -100 -2 -53 -223 331 -74 -8 464 -294 46
5417 46 284 -364 31 226 -70 220 17 -57 -2 -242 -65 159 -156 136 91 -87 -73 -10 143 155 -52 -6 434
5440 434 17 31 193 -318 91 201 -46 183 65 -264 49 -199 -269 14 -159 -38 -76 -221 3 161 -204
5461 -204 77 -23 -94 135 86 36 109 -100 139 58 -234 24 24 -40 107 -72 -87 130 -213 -70 143 -277 154
5484 154 94 -126 363 -250 -302 301 -153 -2 340 -49 -59 51 -230 135 27 -174 232 -137 -19 212 -151
5505 -151 -30 170 -380 -21 59 26 91 164 -123 -99 -139 -16 364 -249 -126 240 -206 -74 125 34 167 89 -72
5528 -72 116 121 205 52 -55 33 226 -201 39 -27 -261 206 35 -205 51 -136 -321 157 -226 -78 197 -81
5550 -81 121 227 31 51 -17 -146 172 -87 -104 121 -348 41 32 -188 237 109 -67 120 206 -226 105 -106
5572 -106 -238 260 -143 -22 144 -128 9 -108 -140 219 1 -69 196 188 -54 212 -78 113 291 32 229
5593 229 -105 -145 213 -29 -56 136 -262 164 126 154 38 107 -288 109 347 -132 332 -89 100 157 -276 -106
5615 -106 285 25 -44 131 -157 103 135 -91 254 -46 -382 119 -355 -88 282 -240 -65 198 -130 -99 -225
5636 -225 -79 86 -190 83 73 -117 27 238 -121 82 -35 -18 118 -45 -64 -111 -150 -34 32 -287 7 162
5658 162 -17 -68 89 -179 102 14 43 230 -115 49 85 -44 -56 -3 -103 95 -85 -136 236 13 -78 213 -178
5681 -178 0 8 5 -12 -10 56 292 -30 -98 43 149 -22 47 -13 3 -84 -84 84 174 60 56 43 -62 311 -66 63
5707 63 157 -149 -34 -21 17 206 -2 -223 -67 67 -105 171 -6 -115 -30 -134 254 59 -233 -21 61 14
5729 14 204 80 -82 17 -207 26 -83 -56 89 -65 -156 124 86 -142 155 -10 61 197 -48 243 84 -152
5751 -152 112 86 27 194 -69 55 78 2 259 149 -294 40 35 -346 32 177 -254 -57 14 -57 106 -28 -20
5774 -20 256 -110 209 24 137 -99 14 -66 174 -77 -82 184 -324 -8 62 -31 180 169 -109 220 149 -81 170
5797 170 183 -169 117 -190 -32 296 -163 19 80 -57 283 138 -341 -139 -131 92 159 -166 147 71 -200 116
5819 116 -126 26 55 -46 -103 161 -352 -286 17 -226 8 30 -41 5 -149 -300 203 -47 -84 85 -177 -86 71
5842 71 -131 -87 372 -373 146 219 -313 515 -125 36 -73 20 107 -78 -240 -54 52 -236 2 -167 -197 354
5864 354 -193 -246 130 70 -111 207 -223 147 -37 -175 142 141 -145 155 61 -74 139 56 -32 95 -209 29
5886 29 -19 -287 204 -198 41 30 75 146 -10 -293 114 34 60 -159 91 -192 -46 -195 -189 152 -104 209 213 -20
5910 -20 150 128 -136 208 73 46 51 85 121 215 -90 -23 208 -15 114 71 24 136 129 62 229 -151 103 -90 -146
5935 -146 126 195 -141 77 -20 -207 133 110 -130 68 -97 -97 18 -6 247 -11 20 80 226 -375 160 -20 -72
5958 -72 210 -46 78 19 -379 -108 -47 -66 93 -6 -234 167 -9 -54 135 -248 204 -52 -173 -88 223 89
5980 89 -38 -99 -88 111 -81 -252 70 57 16 111 -20 -2 -61 -107 -45 66 233 125 -262 104 53 -184 -132 -69
6004 -69 -319 -66 -121 -15 105 51 99 16 -159 -44 507 -187 28 8 106 -53 172 81 66 -20 144 182 -80 -16
6028 -16 35 43 -17 -145 -133 119 -103 -18 80 -101 -61 181 -41 119 27 -298 90 159 135 154 -165 -127 -53 -178 -16
6053 -16 -1 -335 110 239 -173 -9 -9 -121 115 91 -74 55 29 31 46 -39 217 13 -258 69 -72 -175 71
6076 71 25 44 62 -71 -40 150 -24 -62 -79 -108 57 23 3 159 9 -161 -47 -50 85 73 -62 85 -85 -307
6100 -307 132 130 5 322 -48 -168 164 -95 93 202 -42 74 48 -146 60 28 -143 188 -198 10 57 -118
6122 -118 -151 -12 -54 138 -159 48 183 -80 -76 -31 -8 -128 73 -133 -60 -31 -366 102 157 -166 72 -58 -38
6145 -38 113 -68 -35 273 -31 -114 -128 111 154 -77 -52 205 74 -45 5 -216 52 -23 -134 78 -95 -3 288
6168 288 -53 -142 -200 -110 17 209 -191 91 250 -95 -61 -165 7 105 125 -17 183 1 20 102 -46 -2 35
6191 35 -236 212 47 -210 -54 122 31 11 219 -146 17 -212 167 18 -231 69 -91 -55 97 -127 83
6212 83 248 53 20 66 -234 -180 130 -20 77 23 21 90 186 -138 347 -123 -42 307 -6 129 -53 -228 289 -206
6236 -206 28 253 -81 58 -44 -35 84 83 -31 -45 -71 -254 77 -61 42 -99 -138 92 266 -56 -49 -23 -282
6259 -282 158 -151 -189 148 -43 132 31 -98 60 46 -145 -92 50 -155 128 -111 -95 -8 -86 60 110 -69
6281 -69 -44 129 58 -69 -45 -53 0 -28 98 -86 79 -104 68 -161 -52 174 -126 -47 289 -80 26 -144 -300
6304 -300 57 -39 79 -58 66 23 107 -238 -83 -62 -186 108 -116 32 300 -149 86 31 -164 9 196 -34
6326 -34 63 184 173 -5 -179 -31 142 11 -105 77 -139 -86 -21 -130 96 180 -16 76 -133 -218 72 -62 70
6349 70 -1 -316 -36 2 -28 0 91 -120 248 -18 143 163 -8 139 125 8 86 95 -258 -78 -75 -224 152 67 -80
6374 -80 52 -152 54 17 -23 253 86 -92 44 48 -67 205 -90 6 176 -89 -80 118 -113 -90 -174 113 56 -251
6398 -251 42 158 -102 -72 -150 -72 7 -8 -51 -65 -153 -44 118 -34 -172 109 -109 94 -38 -273 210 -55 -218
6421 -218 -37 -54 -98 -135 -73 -3 73 -50 283 194 2 198 -149 -201 10 -264 -237 -18 -139 64 32 -108 60
6444 60 -34 -32 16 89 84 330 13 38 105 -331 26 156 -333 -61 240 -20 82 -16 105 190 -125 -61 60 119 -6
6469 -6 -133 -211 -89 -84 -90 85 -73 -121 -37 -37 -145 140 -16 -195 -210 -275 266 84 -171 -61 -114 -64 195 -68 171
6494 171 48 -201 78 -241 -152 162 24 -296 104 34 -28 247 55 5 257 51 -66 7 -38 123 108 135 51
6517 51 -250 46 84 55 -146 89 -64 -3 -131 26 105 -316 -81 -6 73 -1 87 -203 40 5 -32 62 238 -176
6541 -176 273 88 83 138 -69 150 169 46 43 118 -13 106 91 -15 71 76 3 210 -95 162 268 -79 -193 -86
6565 -86 -235 113 -167 19 181 -164 66 90 -141 -39 -188 35 55 206 -78 196 73 50 153 -297 12
6586 12 101 44 -149 224 -130 31 128 -94 155 -22 -166 82 -134 32 -39 -111 212 127 -103 40 258 16
6608 16 107 7 -29 -1 -37 67 -166 -63 -84 273 -160 -17 -106 62 22 -30 31 49 -152 -177 47 -243 -204 -114 -195
6633 -195 317 -111 -326 145 -216 90 134 -135 -90 -54 -47 220 -13 -3 7 -53 37 162 -207 -302 95 -13 244
6656 244 52 -216 -4 97 -175 -84 -40 -16 -55 -159 -140 -45 -205 284 196 -177 -18 -99 177 70 36 -25 -199
6679 -199 -109 -96 251 -179 25 -199 -41 41 6 86 108 -12 -139 115 -265 64 -6 83 -141 150 12 133 -27
6702 -27 -70 -72 40 -131 -139 -82 -166 -67 -63 62 -148 -50 79 -174 80 258 -390 -94 10 -137 28 -117 -104 56
6726 56 -92 -118 157 86 67 276 -206 20 79 -230 -67 79 35 84 -104 -13 62 -76 20 89 20 -73 63 -34 -128
6751 -128 274 -188 82 64 -81 98 -174 -14 109 -59 -69 31 -206 31 -37 -218 26 -46 153 38 32 -133
6773 -133 -15 65 23 175 -99 107 97 -35 147 36 -62 108 33 -16 209 -39 82 -49 -206 -41 -98 -45 -139
6796 -139 -172 68 150 121 -44 95 -107 -66 35 -70 -8 -142 -40 -25 12 114 165 38 -18 158 -1 -217 -84
6819 -84 -84 52 -49 167 206 -185 163 21 113 -124 -173 -97 -158 129 -119 -20 249 62 252 -18 -282 173 87
6842 87 -157 145 -92 -26 -201 -187 0 95 -93 103 -15 0 114 -165 37 209 67 147 -252 -252 316 51 -14
6865 -14 17 -250 80 10 -149 143 95 -32 35 -183 48 260 139 83 32 -54 -187 106 -81 152 -57 -21 117
6888 117 83 106 -18 65 -78 2 -29 37 -113 -80 -4 -14 -23 160 39 47 251 -306 41 62 -36 167 208 103 116 -99
6914 -99 -149 -97 -4 -11 62 57 64 -144 -388 36 -287 -20 294 -74 -62 268 -125 -21 144 86 73 105 71 349 -76
6939 -76 96 174 162 -96 67 -115 5 -42 -198 262 -171 18 353 24 -58 151 59 94 184 -274 22 16 76 92
6963 92 41 -95 164 -38 -42 -126 -11 -9 191 -85 -127 141 -51 -30 -69 -20 18 52 -82 59 86 66 14 -82 -64 -26
6989 -26 -86 101 -6 -176 190 -26 -37 -114 -132 -160 105 27 -149 18 -84 -32 -109 -55 97 128 -27 -18 -235 27
7013 27 190 -56 130 -139 -121 84 115 -32 -45 -19 -59 -41 -64 105 187 -239 50 208 -122 219 -50 -35 126
7036 126 130 -156 -196 134 -50 -45 -111 56 68 74 37 134 12 -59 42 38 48 -263 49 140 -23 -79 42 -13 9 99 -29
7063 -29 -100 -31 -40 86 98 106 186 87 -88 24 129 21 -98 -10 78 -154 -98 47 -110 -29 45 -127 70 212 27
7088 27 281 -50 -266 300 -19 -96 -78 -157 10 -199 -18 136 -10 -69 11 -104 51 6 -105 -203 -8 31 -9
7111 -9 105 -185 88 38 27 30 -42 132 92 156 20 49 -36 71 -23 -208 280 -227 -35 81 -193 -40 89 -255
7135 -255 407 53 -145 10 -164 -45 24 217 -73 -59 80 175 13 -230 67 -129 -47 18 -76 -11 61 34 -95
7158 -95 9 -41 10 -149 75 -147 17 -95 115 107 -152 128 -171 -48 152 1 41 6 -39 -37 41 -12 110 -32
7182 -32 -44 15 -29 -116 45 -99 -20 -36 -161 198 -6 -235 -94 -87 173 172 -138 77 111 21 -27 163 13 224 86
7207 86 -14 120 -108 -98 39 -151 60 110 43 -29 87 10 156 -51 24 99 96 110 -72 65 91 84 -27 209 -1
7232 -1 -172 75 -24 -41 -110 -74 185 56 -101 39 -120 -208 -46 -23 -116 83 -78 89 40 52 169 -23 100 -20
7256 -20 15 -105 -174 74 -125 37 169 -155 36 122 94 173 -53 51 -138 -134 118 261 35 95 22 -33 247 -14
7280 -14 -82 7 -275 -52 -164 -70 202 -69 23 -127 34 -71 99 -180 39 17 -117 12 -86 153 -14 -84 -34
7303 -34 -139 -45 67 8 -200 34 155 23 -30 -187 -95 -62 -74 106 -5 -132 120 132 -34 43 72 -174 43
7326 43 152 -44 56 -98 31 137 -97 13 23 -96 -4 -67 -165 79 -138 -138 196 -82 -120 -17 40 135 4
7349 4 -148 182 12 -33 -30 268 -114 20 -125 89 42 -24 90 117 -266 -133 26 -30 133 -162 104 -12 -122
7372 -122 -50 33 65 29 163 2 3 -43 -64 75 43 -56 167 -130 -51 82 -35 219 -35 21 168 -281 -363 206
7396 206 -2 -69 -118 -14 51 318 -255 -106 41 -115 108 17 -139 273 90 -218 80 129 -174 75 -26 -123
7418 -123 27 -73 67 14 10 -158 -212 37 -172 -29 -183 181 78 151 -95 -1 85 -183 -73 -103 -161 -80 -2 -77
7442 -77 104 -130 94 23 -78 -208 25 -12 -20 -51 129 0 42 -50 -80 -151 -8 -4 -98 -123 173 134 -23 153 -17
7467 -17 -59 -43 29 -126 -32 -70 95 -97 3 107 47 -31 73 -106 59 100 -14 -40 -2 -243 79 51 -238 183
7491 183 -157 -84 -43 -60 -98 72 -140 205 108 -7 259 -47 163 112 -214 137 106 -218 122 -111 -123 125 -10
7514 -10 120 -70 26 -151 128 105 -67 174 -14 152 27 -101 24 -204 136 235 -102 -48 -224 214 141 76
7536 76 -44 9 30 8 92 113 -35 -8 -159 -198 4 -59 50 -236 57 -64 -79 -222 16 31 -139 -36 -77 21
7560 21 101 31 81 59 -139 243 -1 -88 -45 -297 -75 -16 -194 -194 -5 164 139 196 -67 148 -53 -194 186 191 -409
7585 -409 55 -121 -197 42 -146 190 -41 -68 96 -70 41 38 -62 -203 129 -93 132 -130 69 136 -154 96
7607 96 -4 -64 -293 99 100 -12 -63 -81 -165 43 -179 51 -182 -30 12 102 -135 36 -184 -27 52 -119 -177 -36
7631 -36 -97 -40 121 -101 48 78 -22 -39 -133 -89 -85 -126 -23 -5 -217 207 82 -87 141 -43 21 -75 25 -112
7655 -112 324 -72 -7 -45 -161 132 116 -96 99 -212 -75 20 -98 -65 -102 -115 30 180 163 77 -244 -112 153
7678 153 144 -81 -67 21 118 44 158 -79 171 -111 29 132 241 180 -56 167 29 -38 121 174 -36 50 204
7701 204 -48 75 -29 116 20 -145 -2 213 -95 2 9 77 -79 -28 -115 162 -31 -49 158 -124 -64 99 -117
7724 -117 274 -73 -116 -100 -52 181 59 -18 -35 284 12 6 148 30 104 31 18 -102 51 94 -134 -29 67 63 -3
7749 -3 79 -78 -141 141 -200 212 84 32 39 177 -2 99 128 160 205 -117 -76 -17 -46 -88 78 215 -330 -38 -63
7774 -63 -66 15 -55 206 -65 -36 -24 93 -104 -43 17 62 -98 -73 -120 -75 -40 95 -115 -1 -125 -28 27 38 -20 -138
7800 -138 89 -103 -101 33 -53 11 -64 -52 137 -184 -156 -148 5 58 -220 98 -4 -33 17 220 114 35 62 -101 -48
7825 -48 -6 -46 247 -162 -142 101 7 -76 118 95 33 114 -105 -56 -4 -213 58 -67 -27 -242 33 35 -84 -176 -18
7850 -18 196 96 109 32 -22 40 168 -105 74 44 -98 -97 65 48 -60 54 4 133 86 141 109 130 90 76 -170
7875 -170 8 -102 -98 -11 -19 156 301 -93 -48 5 38 167 -394 -85 -108 -115 87 -137 -141 -19 -30 22 -211 -44 -56
7900 -56 -39 -41 -59 27 1 75 -65 -187 182 48 -95 87 110 109 96 232 -17 86 -178 -176 -122 -85 -44 -96 -30 132
7926 132 -151 -54 -259 -276 -7 -111 -32 67 51 70 61 -75 -134 -10 -2 5 104 -110 -96 -59 -210 -59 149 -30 22 205
7952 205 -147 248 -44 145 83 -138 120 127 -160 -8 35 -143 -109 -23 -85 34 62 -7 39 -153 -66 91 27 -54
7976 -54 65 127 26 -63 -40 -63 -236 29 88 100 -18 69 163 38 -72 -56 197 31 -136 86 -33 66 59 -11 57
8001 57 131 58 -64 -25 87 -79 -8 -11 -33 -112 -19 100 92 281 245 -121 64 -416 -75 -8 -97 73 -205 -253 -33
8026 -33 -30 -126 -85 68 -85 99 121 -166 64 -61 -122 101 -6 15 -116 20 -109 -147 83 90 -70 -12 185 227
8050 227 -50 203 -19 11 -26 -62 -6 7 108 -60 94 -143 154 -366 -89 38 -89 68 -91 32 55 -32
8072 -32 34 189 -9 -125 109 119 3 28 -18 -49 138 57 -232 -75 -170 76 -150 233 232 -107 -104 36 -159 -4
8096 -4 85 -41 -5 -8 -219 50 194 -24 69 69 -27 -85 -109 37 -66 6 82 -37 -11 72 -119 -132 171 -117 37 -37
8122 -37 65 227 -19 23 184 63 -99 -242 97 193 54 -56 -226 159 -21 -119 -223 -80 -28 61 32 49 47
8145 47 76 -86 59 53 76 -93 97 -23 -22 -24 -81 46 168 -44 -119 261 -61 -17 109 -4 53 307 132 300
8169 300 -74 30 64 -180 -64 -24 123 116 210 -27 112 -278 33 -20 30 -124 -170 -45 -135 115 -75 9
8191I
$$ Imaginary data points
##PAGE= N=2
##DATA TABLE= (X++(I..I)), XYDATA
0 0 0 0 0 0 0 0 0 0 0 0 8 -8 8 -14 16 -16 24 -32 32 -40 49 -62 72 -86 101 -118 136 -158 182 -208 238 -271
32 -271 305 -350 391 -440 496 -557 623 -694 774 -858 952 -1055 1167 -1289 1422 -1569 1729
49 1729 -1905 2098 -2313 2547 -2811 3105 -3440 3818 -4253 4757 -5355 6069 -6945 8052
63 8052 -9495 11469 -14341 18940 -27501 49043 -228795 -335029 -89255 -178689 -64470 26617
75 26617 85114 80125 157639 255827 203728 40694 63160 38709 -46758 -61693 -86989 -129135
87 -129135 -115829 -101208 38461 118553 14861 -22131 20388 12860 47753 72895 99708 104694
99 104694 12242 6299 72501 -7953 -63588 -41069 -69094 -76043 -57019 -37032 -30670 -110646 -91038
112 -91038 37815 35180 44290 125828 83590 31293 40214 27690 19641 -18344 -34443 -314 -50590
125 -50590 -81077 -49169 -103712 -117983 -47104 -6856 57400 81467 52498 90316 80905 34495
137 34495 64689 46515 -4875 -16732 -40505 -32420 -49463 -103134 -49134 -3429 -8961 74256
149 74256 117626 65434 29596 -605 6931 9211 -43060 -20926 -8478 -76670 -50712 -1088
161 -1088 -27935 -30995 -25647 -2605 36227 14702 19031 21425 -54462 -53342 5262 19280 50396
174 50396 47328 20806 35897 3568 -10024 29617 -8074 -35909 -7366 -10448 -1800 -8733 -34970
187 -34970 -9389 -14022 -7032 65235 52644 7960 11248 -19778 -26239 -4507 -11218 13788 8644
200 8644 -20480 16546 11404 -25280 -7624 -17711 -18898 11862 2678 12211 4730 -41604 -14029
213 -14029 11476 -1230 30271 27692 527 3886 -20458 -17759 -1193 -32478 -8669 26748 6678
226 6678 23424 24934 -9003 -4650 -9271 574 29600 220 -4829 8846 -26587 -11672 15168
239 15168 -1182 16379 16141 -109 18304 -8349 -31534 -15130 -33980 -21736 13190 4597 17110
252 17110 9986 -18548 8070 5800 -8704 23881 8807 -11586 5398 -8511 -5918 771 -14525
265 -14525 13413 17817 -3298 23390 7091 -28977 -10058 -13271 -10564 13688 3040 11427 11732
278 11732 -16391 3425 5691 -15030 10086 6045 -5740 13988 -5367 -10938 5195 -14395 -1396
291 -1396 16096 -1571 8414 -379 -18630 849 -11251 -11481 22195 4923 2445 22309 -2387
304 -2387 -5710 -1420 -14796 2770 -1776 -9587 15260 -4715 -14819 11383 -4002 -1731 18031
317 18031 800 6505 5691 -16016 -3229 -11198 -20763 5612 -2077 -1799 18123 -3179 1 13583
331 13583 -5890 8043 15463 -2920 7688 -2261 -14632 -332 -15864 -12061 9298 -7395 3321
344 3321 18029 -3879 4529 6578 -8024 7981 1775 -4414 10890 -7739 -7648 7734 -10240 1038
358 1038 12412 -6931 5210 2884 -15095 -2567 -11994 -15804 2847 -8063 877 16257 -2041
371 -2041 9093 15764 -3295 10459 8944 -4811 7847 -5211 -10594 2061 -14390 -7820 5270
384 5270 -11265 1851 8014 -6861 9469 7730 -805 15608 4463 1133 11082 -8723 -7483
397 -7483 -4189 -24605 -11219 -5938 -16349 5582 7954 3398 21150 13048 12716 18571 -3247 -609
411 -609 -767 -22356 -9067 -6434 -18009 1517 1298 -385 16103 5450 4784 8889 -11847 -5527
425 -5527 -3254 -19070 -1193 816 -6815 14508 11396 5443 15753 -457 -3873 -2245 -18447 -6519
439 -6519 -4414 -15691 6680 8490 2422 24202 17899 10399 17898 258 -4318 -6193 -24164 -15456
453 -15456 -16602 -25061 -2102 -2028 -4671 16631 7478 4231 18284 7029 9099 13303 34 6482
467 6482 -1582 -13809 747 -10825 -18180 -87 -11372 -12515 2012 -7612 -1083 6779 470 14317
481 14317 11324 2877 14752 -1752 -10602 3039 -11013 -8246 7559 -2980 3799 9371 -409
494 -409 9097 5177 -411 11874 -1471 -3186 8957 -9718 -6942 4954 -10705 -2844 5368 -5298
508 -5298 109 -6587 -12293 -3109 -14305 -7409 9658 -4694 2614 12462 -4760 1558 4676 -5696
522 -5696 4822 1225 -1555 10846 518 1303 10388 -1727 7451 12835 -2628 7056 1735 -17050
536 -17050 -6864 -8299 -11408 1093 -2150 5458 10270 -4943 5656 7318 -11174 1675 4957
549 4957 -5337 5267 143 -3836 3587 -5671 2357 11381 -2673 2921 -755 -17240 -7039 -10526
563 -10526 -15267 4127 597 843 15699 7302 6188 6701 -5329 1492 -2879 -11653 2835 -6476
577 -6476 -15150 2919 1058 5973 23201 17916 19944 18905 2058 3022 -6236 -19393 -11173 -19185
591 -19185 -19727 -1996 -8989 -6151 6810 -1452 6565 14982 7552 12800 2982 -11126 -5295 -15383
605 -15383 -15025 1004 -6461 -1049 9772 -1388 5492 9427 -2040 5601 5107 1345 9720 843
619 843 -563 5001 -9209 -903 10796 -1318 5331 6375 -8790 -5070 -8254 -10428 427 -5748
633 -5748 -2167 7574 -2576 4023 8500 -3553 5524 5742 -2679 8876 3366 -7640 -3256 -12653
647 -12653 -12306 -3665 -6553 4890 6252 -5692 5857 4468 -5052 8305 6064 -522 5656 -2166
661 -2166 -2527 -605 -10494 -877 2815 -2767 13219 11760 1129 8075 -2326 -8159 2277 -4327
675 -4327 -2994 388 -9733 -4893 -4626 -7406 7264 3016 -234 13485 2769 -2232 6503 -5588
689 -5588 -8074 -2865 -6599 2231 2122 -2560 5801 -3800 -6388 8364 982 2237 11311 -1772 -2047
704 -2047 1757 -7039 -363 -142 -3612 5832 -290 -1011 6969 -6859 -5340 3787 -5838 1534 8274
719 8274 -1650 454 -2602 -6413 2552 -1647 1792 10379 -3263 -1285 4637 -8321 -1416 3458 -5521
734 -5521 3026 3859 -374 5902 -1314 -1101 3819 -6168 2652 7480 -7163 -1204 -1117 -12761 -2472
749 -2472 468 -1240 7655 1945 2693 6534 -3982 1710 3620 -7841 1814 1890 -6961 2487 -1835
764 -1835 -8538 -376 -3146 808 7406 83 5026 2965 -7197 4535 4412 -2490 8918 4419 -2226
779 -2226 4017 -2852 -2935 -233 -7903 181 1635 -5128 4782 3 -7359 3589 -1745 -2910 7660
794 7660 -943 -2197 952 -6684 -1071 -963 -4933 5542 218 -3809 6887 -2392 -5367 3180 -4316
809 -4316 -760 5591 -463 4789 2532 -4002 4822 259 -1598 8647 279 -221 5967 -4127 -670
824 -670 3384 -3970 3062 2841 -2323 3502 -3975 -6627 731 -7678 -3467 4604 -4517 582 3969 -4410
840 -4410 1657 453 -3543 4231 -1598 -1704 4668 -5356 -2805 2871 -5308 2509 5261 -1807 4761
855 4761 1079 -4358 3376 -2426 -1671 5534 -1797 2649 6181 -2698 4187 3459 -3633 5455 2018 -2672
871 -2672 3054 -4640 -5301 -337 -7202 -645 2832 -4445 3575 2439 -3997 4003 -350 -3273 3791
886 3791 -3192 -2067 2161 -6680 -1839 -153 -6337 3036 2380 -1639 6517 335 -1472 5364 -2467
901 -2467 -284 4585 -3615 1664 2390 -3959 3600 367 -2380 6782 897 705 6735 -2477 -613 2230
917 2230 -5689 139 212 -5353 2176 -2095 -4925 2924 -3796 -2715 3799 -3932 265 2439 -5835 1048
933 1048 -99 -4984 4317 1048 -639 6193 -763 404 3801 -4560 175 1449 -6217 1088 -334
948 -334 -4761 3793 217 313 8131 1866 4831 8441 -1393 2384 1806 -6624 -88 -3280 -7119 758
964 758 -4780 -4329 3182 -3295 367 5200 -2408 3090 2483 -3951 2912 -1773 -5125 3460 -2464 -1702
980 -1702 4850 -2438 621 2898 -4161 2152 979 -4579 3247 -1262 -3830 4301 -1281 56 5823
995 5823 -1375 3290 5146 -2846 3229 663 -5468 1447 -2737 -3849 2570 -4370 -1708 3065 -4208
1010 -4208 2028 4295 -2990 3309 997 -3293 3264 -2029 -2646 2834 -4287 -758 3582 -3777 2015
1025 2015 2213 -4280 2909 1047 -2266 4858 -1387 -1803 3402 -3423 814 3015 -4411 1638 687 -4746
1041 -4746 3388 -233 -3630 3521 -1910 -738 4628 -1792 1924 2482 -3787 2996 1291 -3616 3862
1056 3862 -2070 -5025 2752 -2635 -1853 2248 -3267 1064 2232 -1710 5548 2160 -2325 5118 26
1071 26 -1343 4665 -2686 -2246 498 -6270 -1309 -294 -5120 1181 -1446 -2828 4720 -56 1070 6880
1087 6880 -1516 1338 5531 -1914 1661 1089 -4023 696 -3359 -3416 3180 -4600 -2685 3389 -4174 380
1103 380 4506 -1733 2999 2301 -1578 4281 403 -538 3718 -3730 -1457 2335 -5269 250 1725 -5711
1119 -5711 739 1195 -2454 3707 770 -549 3274 -2620 1595 3670 -4020 1487 1028 -5953 1442
1134 1442 689 -3585 2127 -1974 -2182 2473 -1905 2418 3338 -3907 2639 1982 -3646 4072 622 -4060
1150 -4060 1677 -2147 -1606 2655 -2334 984 1318 -3488 4341 2571 -2625 4402 -848 -3899 3310
1165 3310 -976 -1395 1633 -3808 -611 520 -2765 3656 -487 -3953 4266 -795 -1453 5983 -520
1180 -520 -784 3295 -1442 1724 1659 -2895 1615 -2579 -4282 2724 -3337 -3882 2942 -3789 -1220 4108
1196 4108 -1137 2115 2285 -690 3990 362 -887 4031 -3422 -2533 3506 -3780 -854 2510 -3512
1211 -3512 418 919 -1955 2881 -694 -1237 3584 -2331 344 3998 -3420 1242 3532 -3275 2231
1226 2231 1853 -3489 999 -1538 -1805 1447 -4310 -892 1351 -5202 1649 3574 -3931 2437 2221 -1846
1242 -1846 3390 372 -333 2607 -2963 619 2316 -4152 1430 1284 -3920 3176 1269 -2577 2906
1257 2906 -955 -1377 2708 -1295 838 1151 -3463 2538 1270 -2824 4109 428 -3121 3750 -395
1272 -395 -1662 1524 -3366 -1056 -773 -3766 1700 -1352 -4586 2978 -393 -1412 5017 -385 -982 3014
1288 3014 -1112 2144 2282 -2586 1302 -1446 -2838 3731 -1239 -2070 2751 -3110 -90 4433 -1064
1303 -1064 1295 1512 -2193 2745 937 -297 3274 -3218 -2015 3429 -2860 -764 1836 -4712 -1569
1318 -1569 279 -1693 2403 -769 -1872 2638 -1571 893 4965 -2575 -891 825 -4334 970 799
1333 799 -3535 177 -1538 -1359 3628 422 2470 3965 -1870 3346 4384 -2000 2364 243 -4593
1348 -4593 368 -1634 -2454 263 -3856 -756 1776 -2285 3621 3084 -2384 3626 2122 -1152 3445
1363 3445 -362 -2200 196 -4125 -2053 -1499 -6146 -1382 -1643 -4226 2792 1084 -652 5120 2014
1378 2014 2431 6005 1074 1799 1828 -2935 884 -1459 -4778 480 -3165 -3634 2947 -1278 -977 3358
1394 3358 -373 1877 3438 206 3367 227 -2448 3050 -1348 -2376 1890 -4200 -3271 670 -3242
1409 -3242 -128 387 -2825 1831 778 -57 4691 -191 -557 3079 -2417 -29 2495 -3560 -550 154
1425 154 -2941 1750 415 -756 2545 -1841 -217 3963 -1811 678 2531 -2784 1727 2291 -1101
1440 -1101 2660 -249 -1545 1918 -2258 -1090 1509 -4196 -488 1200 -2787 1942 1187 -2236 2239
1455 2239 -146 -1387 1854 -2935 -1726 258 -3762 725 1315 -2269 3297 1890 -278 4231 768
1470 768 -334 2491 -1707 188 1432 -2804 910 800 -2258 2945 626 -1924 2026 -1913 -2695 783
1486 783 -3672 -1232 128 -3172 1727 1947 -464 4292 1559 43 3838 -272 -749 1347 -3860 -1934
1502 -1934 -740 -4048 296 -195 -2262 2798 489 338 4225 103 622 2794 -1599 757 1169 -2995
1518 -2995 296 -1507 -2890 1673 -1353 -1543 2189 -1706 439 2773 -933 1985 1663 -1353 2648
1533 2648 576 -1639 2183 -1748 -1812 1473 -2662 -507 642 -3513 116 -385 -2614 2046 -157 -1358
1549 -1358 3083 -158 611 3298 -976 1182 1846 -1741 1333 -225 -2915 1046 -1418 -1840 2416 -1050
1565 -1050 418 2925 -1090 1053 1372 -2151 937 -888 -2926 1054 -2267 -2095 1426 -2156 114
1580 114 2683 -1121 2110 2226 -895 1993 292 -1338 2081 -1375 -923 1915 -2423 -484 948 -3260
1596 -3260 232 409 -2226 1351 -384 -894 2290 -926 680 3100 -886 1073 2069 -2152 1047 -57
1612 -57 -2798 691 -1319 -2110 1260 -1958 -396 1671 -1748 1544 2201 -1132 2864 1719 -1322 2556
1628 2556 -368 -1173 974 -2674 -1343 -94 -3711 -334 -408 -3018 1816 1043 -249 4049 1193 789
1644 789 3186 -688 643 1090 -2465 448 -728 -3038 1009 -1351 -2432 1883 -714 -592 2422 -1001
1660 -1001 453 1059 -1359 1780 467 -1349 2111 -711 -1727 1995 -1927 -1121 1422 -2027 303
1675 303 1868 -683 1643 306 -857 2378 -819 -860 1986 -2670 -1789 1099 -2676 7 1365 -1154
1691 -1154 1946 1065 30 3282 -490 -565 1727 -2516 -545 1137 -2899 -327 266 -2690 1062 367
1707 367 -371 1955 -903 1 2098 -1569 913 1705 -2580 989 1168 -1432 1579 87 -1458 760
1723 760 -1610 -368 951 -2782 277 247 -2799 1745 1591 -632 3028 1025 -285 2009 -1083 -313
1739 -313 94 -3455 -610 -508 -2945 1805 746 -1133 3025 883 306 3017 -240 -438 -310 -3162
1755 -3162 -586 -1195 -2833 1699 -624 -1536 3588 1242 790 3398 250 346 491 -1894 266 -1612
1771 -1612 -3442 287 -2026 -1900 2715 -552 145 2875 -512 1223 2498 -514 1075 -609 -1879
1786 -1879 925 -1707 -871 2121 -2190 -846 2253 -1177 768 1432 -1498 134 -1012 -1475 1281 -1696
1802 -1696 -448 2123 -1064 1399 3594 -394 1764 1295 -2026 -297 -1817 -3136 -956 -3202 -1553
1817 -1553 1232 -1125 2356 4039 419 3585 2930 -739 1179 -849 -2673 -1365 -3306 -1585 238
1832 238 -1832 1677 2309 -1194 2737 1975 -1202 1617 -476 -2156 -447 -2574 -700 620 -1393 2003
1848 2003 1471 -1344 2580 951 -1542 1750 -869 -1855 1020 -1546 -437 587 -1546 1125 360 -1324
1864 -1324 2814 291 -1774 1855 -1039 -1598 1454 -883 -87 724 -1000 1425 441 -1020 2231 -372
1880 -372 -1083 2358 -1243 -1254 884 -2446 -1153 82 -1638 1175 648 -399 2516 -380 22 3050
1896 3050 -800 60 2028 -2283 -693 -320 -2873 -510 -912 -1024 1937 -326 559 3065 -964 666
1912 666 2518 -1420 605 980 -2024 128 -791 -1656 901 -1125 341 2059 -1333 641 1178 -2651
1928 -2651 260 355 -2214 1043 323 -626 1836 -336 468 1559 -1517 1203 1171 -2259 736 -364 -3113
1945 -3113 837 49 -172 2724 49 426 853 -1887 65 -522 -2988 828 -375 -2060 2293 121
1961 121 -450 2259 364 1180 1999 -1022 544 -842 -3087 567 -756 -1554 2567 141 -371 1707
1977 1707 -1409 -642 252 -1816 711 544 -551 2506 311 -124 2527 -662 -402 1645 -2285 -1868
1993 -1868 -1211 -3845 -943 -527 -377 3326 1787 1685 4164 182 206 1196 -2493 -1062 -121 -2321 -108
2010 -108 -896 -1489 1425 -545 259 2604 -659 409 915 -2573 -369 384 -1722 1675 1139 -54 1865
2027 1865 -1110 -768 451 -2564 -167 666 -1726 1259 1139 -1289 1592 458 -225 2078 -366 -146
2043 -146 393 -2853 -970 -691 -2500 1301 1168 -547 2302 460 -542 1779 -578 200 1707 -900
2059 -900 1079 497 -2378 265 -1081 -2298 1112 -604 -963 1283 -1211 -387 1531 -554 2372 2404
2075 2404 238 2742 30 -1795 687 -2572 -1945 254 -2312 -494 392 -2058 505 460 -505 2969
2091 2969 1519 513 3016 -469 -761 699 -2161 -111 880 -1664 678 -385 -2014 506 -1315
2106 -1315 -1090 1714 -494 692 2013 -1063 591 1051 -1128 1833 1071 -503 1880 -1242 -1791 -32
2122 -32 -2668 -827 1086 -1357 1031 910 -1572 1175 25 -928 2253 122 289 1917 -1383 -442
2138 -442 186 -2443 270 406 -1299 1673 -441 -1462 1301 -927 -30 2598 83 1606 1639 -1677
2154 -1677 49 -1040 -2746 415 -1118 -878 1883 -682 188 1885 -566 1367 1918 -470 1506 -365
2170 -365 -2597 -571 -2271 -1761 1210 -570 1284 2530 -914 829 826 -1984 730 -185 -914 1607 -677
2187 -677 -527 1232 -1296 544 1866 -747 1310 566 -2288 -363 -1469 -1968 895 -281 846 2432
2203 2432 -552 832 824 -1791 595 439 -1368 1508 -197 -1516 869 -1374 -323 1470 -647 1402
2219 1402 1021 -1503 642 -584 -1949 1533 268 -100 2027 -417 -133 451 -1964 306 330 -1095
2235 -1095 2048 367 -1218 1523 -880 -1362 834 -1010 -203 453 -1599 70 -417 -1614 1474 643
2251 643 242 3146 182 29 1123 -1789 -534 450 -1432 631 -62 -1657 707 -1571 -1424 1184
2267 1184 -772 508 2611 -393 982 1299 -865 829 16 -583 1325 -1342 -1511 238 -2529 -965
2283 -965 1148 -1271 1239 1740 -637 937 -67 -1291 983 -783 133 1971 -623 741 1433 -1805
2299 -1805 626 624 -1540 851 -385 -1698 81 -1666 -776 938 -523 1658 2228 -737 1658 478
2315 478 -2089 594 -304 -1204 890 -867 -516 521 -1685 798 1074 -1143 1942 921 -893 1500
2331 1500 -563 -1469 450 -1227 -457 875 -1244 501 33 -1705 1448 358 -223 2463 -78 -679
2347 -679 966 -1579 -997 -241 -1841 42 302 -704 1734 17 -925 1893 -450 -57 1697 -1158
2363 -1158 -649 242 -1550 694 475 -263 1646 165 -219 1716 -1359 -1224 163 -2549 -849 691
2379 691 -996 960 441 -471 1658 504 532 2004 -950 -159 641 -2042 -119 492 -1816 416 217
2396 217 -601 1319 -407 -289 923 -1454 570 1446 -1273 825 552 -1869 819 306 -459 1227 -254
2413 -254 -158 1045 -853 382 622 -2020 346 188 -1774 784 -168 -1169 966 14 324 1479 -520
2430 -520 905 524 -1470 703 -314 -1894 755 -556 -1239 1229 -263 259 1170 -785 688 139
2446 139 -1305 1001 -332 -1465 1239 -232 -599 1813 -96 463 1158 -889 216 -322 -1528 892
2462 892 -780 -1581 1050 -894 -498 1875 -555 123 1075 -650 519 384 -599 1109 -595 -383 1463
2479 1463 -904 7 1515 -1177 -182 703 -1215 -47 -501 -1140 637 -837 -338 1632 -885 164
2495 164 1402 -1012 589 1485 -961 411 68 -936 682 -906 -385 707 -1389 351 1374 -1244
2511 -1244 664 478 -1461 663 262 -574 1158 -177 -74 1125 -887 495 859 -1589 783 37
2527 37 -1705 837 -103 -897 959 -338 180 1144 -578 719 475 -1287 750 150 -1138 1292 116
2544 116 -891 1058 -372 -330 620 -951 488 82 -1634 603 -238 -1187 1028 -222 -462 1595 -233
2561 -233 -50 735 -901 181 205 -738 1321 157 -581 1470 -859 -867 831 -1253 -387 583 -815 381
2579 381 155 -826 1180 -35 -269 1941 -212 -252 1018 -1542 -592 437 -1055 764 504 -450 1183
2596 1183 -524 -905 813 -1109 -285 995 -1053 232 703 -1361 528 443 -475 1208 -42 -105 1233
2613 1233 -873 17 769 -1056 927 1064 -1198 377 -544 -1649 -6 -972 -546 1240 -304 1042
2629 1042 1557 -701 991 453 -1132 808 -127 -1340 391 -1120 -733 520 -552 921 1220 -554
2645 -554 815 -107 -1908 104 -1081 -920 1335 289 731 1916 12 1095 693 -1146 528 -472
2661 -472 -1880 -27 -1391 -1440 393 -676 569 1902 427 1568 1193 -975 263 -668 -1110 708
2677 708 -485 -419 848 -1072 -301 744 -855 426 481 -966 669 -385 -895 668 -733 -253 1332
2694 1332 -346 354 878 -1073 93 -170 -988 1218 334 -87 1244 -834 -603 694 -1149 158 512
2711 512 -764 954 128 -670 788 -375 -422 971 -631 -89 610 -1506 -398 -193 -977 1380 922
2728 922 323 1682 -146 -747 247 -1707 -828 -134 -1717 293 334 -748 1216 547 126 1863 473
2745 473 598 1143 -1194 -843 -386 -1988 29 -28 -633 1057 -141 -401 780 -655 16 835 -607 427
2763 427 820 -795 492 -167 -820 1152 3 -137 819 -1211 -625 20 -1591 306 628 -636 1042
2780 1042 661 -479 959 -306 -241 656 -995 181 729 -1012 392 -14 -1242 708 355 -275 1048
2797 1048 -624 -561 293 -1277 -36 530 -763 819 613 -1001 844 -366 -934 930 -189 43 1058
2814 1058 -357 198 350 -1404 687 190 -608 991 -547 -1226 424 -1023 -307 866 -158 846
2830 846 808 -310 940 -38 -939 895 -610 -656 1064 -839 -630 197 -1209 355 431 -161 1205 -134
2848 -134 -318 686 -1159 -565 1252 -765 135 1316 -402 561 272 -1019 429 -507 -162 1142 -665
2865 -665 -408 442 -1308 15 657 -412 699 336 -582 515 -83 -149 912 -417 426 1562 -615
2882 -615 575 488 -1423 126 -118 -860 450 -477 -535 437 -821 367 987 -795 885 672 -650 1045
2900 1045 -77 -916 635 -287 -95 812 -472 410 60 -1441 313 -160 -1066 959 135 -943 882
2917 882 -458 -190 768 -274 787 439 -600 581 -227 -1189 795 -587 -847 1042 -227 -371 677
2934 677 -635 84 349 -654 746 -72 -679 1107 -611 -799 904 -433 14 1369 -312 481 109
2951 109 -771 576 -482 -548 727 -644 -271 1041 -1068 -293 603 -521 488 568 -410 353 -472 -583
2969 -583 741 -667 -48 1228 -684 231 782 -1056 137 50 -715 513 -274 -259 792 -708 139 1089
2987 1089 -722 701 916 -814 524 -29 -705 418 -227 -68 710 -788 471 406 -1191 102 123
3004 123 -1272 541 337 -590 790 -164 -22 1025 -164 957 477 -1125 418 -266 -1503 556 -373
3021 -373 -1010 909 -10 20 657 -562 236 137 -998 587 -91 -846 1100 -23 -546 1121 -130 -62
3039 -62 760 -395 316 90 -827 283 -384 -622 1238 -296 -335 1288 -603 -268 506 -764 114 260
3057 260 -620 779 -60 -559 907 -672 -400 1052 -782 -366 438 -762 130 248 -388 682 48 121
3075 121 1189 -558 129 936 -1175 -19 660 -647 124 219 -670 468 -226 -433 441 -1035 -186 673
3093 673 -1114 231 759 -868 645 793 -281 867 -144 -274 532 -1135 -69 163 -1183 420
3109 420 447 -1164 892 225 -599 602 -363 -328 475 -483 178 493 -856 663 342 -495 1051 165 -783
3128 -783 706 -366 -346 563 -700 156 184 -782 705 71 -756 749 -409 -644 862 -493 -317 713
3146 713 -500 539 587 -550 779 -440 -738 809 -654 -639 705 -932 -402 849 -375 492 598
3163 598 -316 1040 -318 -556 917 -483 -358 727 -756 -88 756 -779 268 252 -645 489 -553
3180 -553 -589 562 -543 -149 755 -802 330 712 -663 738 319 -472 520 64 -528 669 -618 -235
3198 -235 459 -873 373 529 -805 346 105 -703 351 -298 -319 561 -670 227 970 -708 700 384
3216 384 -780 665 96 -688 616 -557 -658 565 -837 8 350 -895 467 492 -785 1035 31
3233 31 -654 843 -224 -89 941 -593 157 440 -816 554 61 -840 524 -232 -700 681 -533
3250 -533 -155 650 -466 417 725 -422 734 45 -699 632 -393 -490 713 -626 -245 417 -921 112
3268 112 81 -818 558 43 -175 1014 -319 -395 943 -702 94 633 -753 321 136 -716 486 -190
3286 -190 -431 872 -368 -299 751 -654 -139 342 -814 408 194 -853 697 -71 -209 790 -361
3303 -361 -166 680 -702 334 346 -828 546 217 -659 709 -309 -520 644 -371 -215 700 -919
3320 -919 131 283 -717 653 175 -642 806 -247 -181 738 -406 27 491 -785 -200 173 -788 552
3338 552 -242 -595 729 -294 152 954 -695 -36 497 -548 399 237 -723 533 -198 -439 668 -255
3356 -255 -244 589 -747 -7 436 -836 395 217 -485 710 130 194 1039 -468 231 597 -685 258 274
3375 274 -944 180 91 -826 541 -252 -446 701 -452 216 347 -733 757 450 -390 586 67 -505
3393 -505 691 -38 -346 521 -437 68 246 -1058 160 -201 -636 426 -78 -538 777 -594 -374 550
3411 550 -487 207 338 -520 592 335 -378 1018 -279 -231 745 -514 -228 209 -754 -47 287 -367 619
3430 619 -25 -398 681 -267 97 1012 -699 -211 330 -996 152 143 -649 201 -155 -618 570 -418 49
3449 49 863 -561 292 730 -241 547 213 -606 432 -110 -339 461 -612 -428 560 -873 51 552 -676
3468 -676 352 19 -749 537 -92 -144 665 -557 -61 601 -610 326 437 -664 483 282 -507 670
3486 670 -25 -442 460 -715 -7 256 -622 144 49 -976 257 -249 -784 696 -254 -260 771 -432 561
3505 561 602 -315 546 279 -583 596 -83 -711 431 -548 -358 537 -521 220 219 -489 535 -36 -298 727
3525 727 -271 -595 696 -205 -254 657 -384 -12 146 -515 517 -221 -640 585 -374 -346 678 -600 -1
3544 -1 672 -398 140 595 -778 309 -205 -188 408 -621 -222 821 -765 -284 350 -763 256 294 -344
3563 -344 442 -43 -237 939 -147 150 623 -498 133 400 -788 146 114 -869 287 -94 -450 387 -458
3582 -458 84 386 -559 399 351 -736 686 277 -485 678 75 -184 562 -129 156 434 -540 344 157
3601 157 -778 713 115 -785 564 -180 -450 395 -418 -68 126 -648 317 140 -497 887 -73 -401 972
3620 972 -125 -255 471 -437 123 271 -633 186 -220 -568 467 -307 -539 826 -126 -37 862 -213 209
3639 209 257 -501 457 208 -457 574 -509 -367 329 -531 -224 337 -468 248 448 -556 419 170 -70
3658 -70 683 -285 41 662 -479 -51 438 -564 -269 261 -378 248 -66 -253 487 -303 89 800 -449
3677 -449 167 518 -650 345 151 -659 318 -78 -363 665 -321 50 441 -677 208 271 -785 577 329
3696 329 -651 577 -191 -356 440 -344 142 364 -257 271 80 -517 438 4 -392 441 -64 -199 578 -261
3716 -261 -35 249 -350 403 189 -490 550 -41 -610 401 -174 -266 590 -113 6 418 -487 443 243 -446
3736 -446 316 -416 -397 463 -500 -198 518 -432 -2 313 -238 624 -10 -407 704 -195 -229 654 -549 -97
3756 -97 392 -381 85 305 -462 326 -175 -584 495 -283 -454 667 -206 476 738 -196 531 581 -239 567
3776 567 211 -396 242 -737 -188 344 -826 -172 367 -644 154 232 -163 488 35 -240 714 -259 -99 614
3796 614 -649 184 263 -721 72 103 -488 259 92 -265 372 -385 -36 350 -819 121 347 -577 329 227
3816 227 -220 538 -136 -159 385 -502 -34 179 -576 152 -55 -502 444 195 -189 661 41 57 674 35 64
3837 64 -26 -451 222 -127 -684 199 -93 -428 591 -304 -204 681 -380 114 266 -290 139 48 -514 406
3857 406 13 -7 784 -135 79 683 -414 335 285 -523 109 -97 -354 249 -404 -160 642 -512 27 353
3877 353 -510 75 -48 -391 399 140 -234 599 -115 116 626 -114 107 269 -359 65 150 -522 64 -158
3897 -158 -510 500 -242 -162 414 -164 237 444 -389 250 191 -451 469 -109 -208 223 -205 -119 393 -439 170
3918 170 186 -274 410 78 -23 569 -210 -223 199 -480 -152 190 -656 282 79 -544 570 -15 -306 543
3938 543 -44 -68 542 -481 -31 320 -610 285 544 -386 403 223 -182 537 -7 90 410 -311 -47 217
3958 217 -593 259 40 -680 164 -210 -503 298 -341 81 597 -321 251 435 -354 522 163 -491 560 -52
3978 -52 -325 19 -447 -125 69 -545 160 129 -134 398 -67 -460 471 -121 -64 450 -80 261 326 -369 157
3999 157 116 -397 460 -261 -453 222 -234 -259 358 -438 39 277 -350 290 124 -301 450 -212 -366 531 -256
4020 -256 -169 295 -303 -33 146 -562 107 351 -164 400 -147 -81 726 -453 -98 725 -428 152 376 -397
4040 -397 308 196 -315 412 -7 -197 369 -596 -86 142 -723 62 119 -570 414 183 -278 538 -181 14
4060 14 333 -294 17 216 -581 221 -112 -438 431 377 -281 410 -272 126 385 -515 154 268 -669 305 10
4081 10 -358 548 297 -176 466 -117 76 354 -278 435 156 -607 460 -258 -683 546 -207 -257 326 -375
4101 -375 71 142 -414 364 277 -284 415 -93 -428 403 -116 -215 559 -154 -133 279 -456 51 -232 -431 79
4122 79 -137 -412 592 36 140 682 -98 268 353 -258 20 -103 -350 187 -363 -395 292 -520 -22 668 -324
4143 -324 255 324 -285 274 52 -312 326 -239 -85 276 -267 -135 575 -441 36 294 -215 506 121 -369
4163 -369 388 -347 9 323 -304 -96 479 -497 217 506 -384 412 97 -172 355 -394 44 267 -393 -3
4183 -3 198 -288 277 152 -430 540 -45 -300 263 -257 81 299 -119 291 56 -128 467 88 -388 649
4203 649 -168 -382 348 -360 -425 9 -324 193 200 -501 575 60 -206 449 -178 -226 512 -62 -186 36 -392
4224 -392 54 -100 -225 269 92 -231 693 -228 -126 505 -401 -88 243 -267 214 -154 -158 571 -350 -20 383
4245 383 -189 -96 476 -477 97 150 -430 211 193 -354 360 -216 -105 260 -282 -68 296 -364 153 426 -170
4266 -170 53 -47 -380 311 -307 39 123 -688 -125 68 -748 327 26 -498 462 211 -156 447 -24 -33 416
4287 416 -142 291 356 -451 161 -5 -627 207 -54 -354 393 -474 -289 186 -473 208 81 -328 247 93
4307 93 -175 350 -208 -350 355 -171 -61 247 -448 140 -42 -483 210 -151 -251 520 -268 -28 575 -115
4327 -115 236 188 -128 -36 158 -85 56 -265 -322 312 -115 -56 521 -322 -18 294 -134 -35 172 -531 284 -217
4349 -217 -209 323 -233 -41 730 -72 515 432 -477 148 130 -393 347 -270 -92 176 -369 -116 351 -478 87
4370 87 260 -471 296 -76 -294 368 -114 -75 401 -141 155 385 -387 109 -84 -486 263 -220 -157 244 -212
4391 -212 -97 438 -260 142 261 -349 182 90 -422 474 -22 -577 353 -346 -52 237 -492 111 169 -572 466
4412 466 156 -204 406 -81 -269 431 -327 -116 393 -392 -179 62 -409 115 90 -183 375 -422 -135 226
4432 226 -162 -247 88 -59 152 205 -193 438 43 91 405 -189 -137 356 -399 -211 336 -447 37 209 -445
4453 -445 387 -95 -304 434 -366 -69 386 -327 143 387 -240 134 191 -308 340 -82 -96 481 -384 6 236
4474 236 -285 -127 191 -562 143 -110 -511 233 -238 -42 375 -211 180 284 -251 48 354 -210 101 -133
4494 -133 -225 39 94 -176 180 -378 74 287 -362 274 -49 -284 271 -141 -233 252 -181 -132 580 -260 -101
4515 -101 301 -291 209 -60 -290 362 -109 -17 151 -209 -50 330 -451 -15 338 -214 419 147 -86 419
4535 419 -40 -247 431 -216 -118 483 -290 163 74 -322 181 36 -408 206 -302 -168 281 -258 23 121 -253
4556 -253 107 417 -434 158 21 -237 172 -281 -91 20 -358 -62 226 -414 445 281 -204 408 180 -123
4576 -123 488 -157 88 432 -404 -29 122 -262 -72 -103 -600 209 -168 -299 582 70 110 498 -136 330 379
4597 379 -300 309 -205 -540 266 -115 -173 502 -28 225 232 -301 228 236 -408 249 -150 -324 427 -255 -256 576
4619 576 157 -9 378 -324 48 148 -16 97 33 -196 227 -189 -52 531 -301 -57 268 -293 38 63 -491
4640 -491 216 -60 24 480 -126 142 456 -183 312 146 -251 205 8 -306 238 -397 -417 116 -328 -129 246
4661 246 -151 238 391 -172 543 268 -415 488 -173 -120 282 -422 -87 219 -203 99 280 -453 245 77
4681 77 -162 308 -63 30 55 -176 30 -34 -221 558 58 -370 220 11 -206 316 -88 -276 4 -283 -110
4702 -110 238 -26 254 -14 17 432 97 -157 453 -139 -270 85 -418 -120 11 -352 382 -68 -350 530
4722 530 -312 -294 258 -367 85 39 -142 196 220 -164 230 141 -248 326 -271 183 187 -523 5 275 -602 176
4744 176 17 -157 447 -97 14 315 -291 -269 268 -544 184 297 -409 314 85 -344 2 19 -307 53 -187
4765 -187 -185 151 -597 127 175 -402 396 351 -397 315 -182 -148 253 -155 199 175 -8 360 144 -288 197 -72
4787 -72 -428 -112 -226 -192 142 -241 62 274 -119 59 196 -182 241 -157 -403 382 -81 -179 418 -224 -24
4808 -24 -178 -266 298 -40 -453 232 -167 -207 252 -384 -29 290 -355 -3 227 -131 273 152 -49 391 -280
4829 -280 -294 396 -198 62 260 -382 48 142 -198 123 -89 -64 277 -65 120 259 -21 351 259 -197 177
4850 177 100 -142 77 -234 -43 134 -357 -194 80 -56 -57 192 -296 68 188 -137 90 -13 -28 76 -125
4871 -125 -12 120 -385 13 194 -282 -35 58 -132 123 42 -33 219 -34 -139 205 -153 64 92 -213 208
4892 208 69 -271 73 -177 -156 132 -111 155 169 -285 88 147 -240 324 -92 -448 264 16 -144 223 -197
4913 -197 90 -39 -291 200 199 -296 385 -139 -232 301 -91 -52 182 -347 -13 147 -124 87 -112 -43 470 16
4935 16 -72 233 -90 -43 305 -169 -113 145 -61 180 -235 -51 246 -88 -9 319 -308 77 176 -174 23 256
4957 256 -136 153 35 -9 -26 -283 -32 259 -298 -37 270 -341 96 270 -270 238 30 77 279 159 315
4978 315 271 -373 61 94 -376 -216 -69 -287 134 22 63 64 -255 -51 202 -193 17 97 -322 205 93 -191
5000 -191 114 -81 65 258 -84 53 308 -493 -45 344 -422 29 156 -36 143 -169 -80 277 -251 50
5020 50 40 -205 141 -20 -317 353 -34 -166 475 -119 -120 162 -72 65 151 -492 266 0 -240 202 -166 -72
5042 -72 108 -428 -55 321 -235 -71 98 -30 220 105 -279 329 -266 -229 196 -422 -71 270 -252 34 136
5063 136 -211 290 86 -42 276 -127 -74 318 -246 -53 108 -153 179 -22 -117 40 78 -329 52 -307 -103
5084 -103 187 -67 -60 270 -44 174 334 15 21 -25 -98 245 -166 -372 155 -521 101 20 -324 282 73 44 185
5107 185 -246 -77 382 -89 23 132 -315 -56 131 -252 45 82 -212 62 -119 -112 111 -27 -65 96 -183
5128 -183 -7 204 -214 10 -136 -127 235 -129 -233 51 -406 76 -4 -71 -65 -183 -195 188 -243 -75 278 -11
5150 -11 -100 126 -121 11 26 -42 -36 -226 -138 247 -11 -128 210 -190 -100 157 -58 62 -3 -193 18 -11 -199
5173 -199 448 -212 94 234 -200 138 330 -132 286 31 -132 -11 117 -107 189 -115 -162 -17 -150 59
5193 59 63 -154 71 -55 -193 376 -80 -264 64 -38 -131 326 -150 -5 245 -430 142 -51 -4 84 -80 -53
5215 -53 152 -217 -326 308 -267 251 89 -200 260 178 -291 337 -170 -159 11 -21 52 374 -52 2 193 -25
5237 -25 123 19 -76 -77 -140 -90 168 -151 113 -58 -248 287 175 -344 205 114 -174 111 44 -31 201 -83 -14
5260 -14 -41 -331 319 138 -103 189 4 -10 288 -31 -142 196 -82 84 101 -191 175 23 -247 -4 -246
5281 -246 -248 276 12 -24 130 -168 201 33 -102 140 124 -51 318 -281 -278 295 -147 -55 30 -31 7 -81 -116 253
5305 253 41 -340 367 -228 -53 25 -246 96 192 -114 -108 143 -39 152 -44 -24 91 51 -303 19 -212 -5
5327 -5 59 -270 -23 74 135 249 -140 -41 320 -55 44 189 -109 -80 301 -388 -158 24 -150 212 142 115 252
5350 252 -239 0 181 -290 86 284 -170 205 -60 -285 204 70 -86 78 -1 104 207 -245 58 173
5370 173 -104 5 53 -269 275 -65 -115 83 -262 57 82 -203 284 44 -163 84 59 -101 36 -187 -250 268
5392 268 -90 366 229 -292 0 177 -122 131 -118 188 205 -328 17 -25 -248 33 170 -187 126 -172 -161
5413 -161 138 87 -143 7 62 -160 67 -1 1 206 -35 272 -109 -292 217 38 20 -136 -66 50 137 -79 197
5436 197 -39 -55 79 53 -201 203 -285 -112 157 -180 87 34 -104 235 135 -232 192 -233 -103 91 -89
5457 -89 31 155 -264 56 -101 -195 134 163 -107 138 -97 -201 126 0 140 212 -63 21 213 -234 231 -95
5479 -95 -260 264 27 -251 67 -174 -285 319 -113 15 130 -212 -98 -70 -172 212 -105 -62 87 -222 44
5500 44 -66 -191 165 -48 -223 -104 -357 11 298 19 70 305 -245 -6 53 -5 271 -83 -161 6 -113 -109
5522 -109 -2 -199 50 246 -247 180 65 -73 339 -64 80 146 -137 -310 263 -171 180 -37 -89 -2 -308
5543 -308 -196 131 70 -70 -55 -113 -107 376 -111 10 118 -183 -36 -155 -317 229 45 -185 288 -65 142 53
5565 53 -167 -113 155 -270 188 98 -70 339 -16 -151 234 13 -234 94 -59 13 102 -179 92 -201 -133 -89
5587 -89 -14 101 1 -274 -88 156 -187 73 14 -102 37 297 -181 169 170 -39 297 -100 -61 189 -48 135
5609 135 287 27 145 -174 -40 200 -218 -68 156 -82 194 -29 -263 291 23 -15 192 330 10 12 82
5630 82 -329 92 -184 50 -109 -352 -15 -195 -124 -102 87 157 273 -14 -152 177 -252 150 203 2 60 -158
5652 -158 -133 141 56 31 57 -308 -12 111 -298 80 -72 -117 129 131 -163 115 77 59 7 -182 -5 83 -209 87
5676 87 17 136 -82 -109 -33 -121 -64 -100 295 -265 -102 153 -55 137 72 -11 77 115 -130 60 -244 -45 214 -201
5700 -201 208 58 -52 -39 -50 165 81 -156 -49 -66 -131 -86 137 -120 191 276 -296 264 41 -13 223 55 88
5723 88 -70 -204 -158 -11 -102 -42 141 -299 401 -109 -237 59 -1 -67 151 -30 27 167 -133 59 21 -191 23
5746 23 96 -58 -120 -258 31 94 -97 -41 -26 -31 102 16 -53 293 -34 10 148 -78 -80 215 -333 99 -13 73 189
5771 189 82 -371 -23 83 -141 169 -91 1 296 -256 174 138 -235 170 -243 -179 220 26 -21 183 -224
5792 -224 -41 33 -245 261 -113 -29 109 212 14 460 -185 -164 -125 -81 73 141 -59 268 -80 -64 -36 148 -41
5815 -41 121 -89 -13 73 -125 24 137 18 161 157 -60 85 101 -9 101 -217 36 -7 -230 46 116 -48 130
5838 130 -20 -140 111 -248 51 260 -108 -106 230 -76 49 136 49 52 -139 -114 79 -161 -67 -72 -18 47 53 -504 -69
5863 -69 -204 -133 254 37 -148 -12 60 -99 231 -190 40 45 -174 46 18 34 40 -67 -175 191 -37 22 65 -1
5887 -1 171 0 -70 186 89 -82 -7 135 10 228 -275 -30 -145 -290 169 -61 -310 -19 82 -69 188 5
5909 5 53 288 2 -126 -24 -54 164 201 -41 144 110 40 200 -118 38 -108 71 -50 13 43 265 -153 -90
5932 -90 36 23 -153 118 -227 -53 0 16 108 60 -256 150 78 -123 184 67 64 71 -125 82 164 -192 20 -103
5956 -103 -200 226 135 -58 32 -106 -55 217 -110 -4 81 -56 111 -77 -98 259 127 93 114 -50 -20 -25 2 75
5980 75 25 -148 283 177 17 167 -222 -74 -5 -73 21 -63 2 -127 -1 52 419 -92 -220 -75 201 121 136
6003 136 -174 129 67 121 -12 28 -182 33 132 -230 36 -144 -67 98 -200 -82 126 -41 -29 42 -79 127
6025 127 43 -192 179 13 10 237 -28 73 190 7 20 -7 47 56 -145 120 175 -75 -40 63 -143 28 112 -30
6049 -30 76 -76 31 51 92 -98 -97 -345 94 102 76 145 67 -84 -164 -58 -112 178 -177 165 80 108 203 68 -119
6074 -119 -147 -153 -309 146 9 -171 125 -116 -9 263 216 100 279 -78 65 0 20 234 85 -88 267 -252
6096 -252 199 30 174 53 -24 -212 -136 38 -224 94 -199 143 84 -210 -47 -158 -246 159 -181 -182 36 -101
6118 -101 -159 251 -134 -97 59 16 -28 76 -137 118 -120 -115 67 101 -71 82 19 188 186 -95 -115 149 -82 183
6142 183 -170 -14 133 -29 126 -26 -122 -162 123 -131 -20 -98 -42 44 -157 21 91 5 -43 -65 -170 137 194
6165 194 -182 -10 184 -84 -170 -137 -4 62 -184 4 3 -119 -115 105 -133 245 215 -149 94 54 34 -173 109
6188 109 -163 112 -47 262 181 -79 -69 -20 -84 136 98 -158 193 69 -26 41 4 29 220 -154 93 129 111 96
6212 96 111 -72 131 95 147 95 -34 14 201 3 -82 12 -116 132 32 -134 111 -117 -112 250 -336 -30 43 -224
6236 -224 142 -76 -107 51 10 -197 35 -1 34 55 15 48 260 -134 110 171 -52 99 85 -152 -104 93 -15
6259 -15 5 -140 189 -7 -79 74 66 -175 -8 -177 18 -23 -65 154 103 -120 223 12 -29 41 -72 -191 122
6282 122 -256 74 236 -99 70 57 -245 -98 -30 -264 233 -28 -138 162 -45 -151 -80 -156 85 68 -64 158
6304 158 -38 -213 198 -19 -39 218 -56 105 286 -309 81 48 -86 -2 -83 -200 108 11 -69 -77 -353 36 -105
6327 -105 -14 115 82 27 31 -57 -37 163 -184 42 122 -121 -12 -60 -144 11 108 -96 29 13 107 -45 -127 103 107
6352 107 176 -7 -71 -84 -78 209 -72 12 37 -75 34 -40 18 38 -123 138 69 -243 163 -57 -143 239 66 134
6376 134 -19 -21 10 143 -49 80 80 -63 142 -133 -17 157 32 56 45 -89 -41 -74 -139 -143 101 -172 8 -43
6400 -43 29 74 -114 -12 192 -57 -121 199 -115 191 89 -259 122 -170 -279 235 -156 163 -26 206 -54
6421 -54 195 34 34 -180 -178 151 -39 35 -14 0 100 -92 -163 -74 -40 131 -8 -16 -108 32 -221 -27 67 -123 -110
6446 -110 258 -287 -26 -33 123 -9 -5 -76 61 -129 10 24 -192 -53 -134 -90 -44 130 -128 167 -141 55 -65
6469 -65 -188 3 95 -95 -18 -93 -159 187 18 -225 58 -3 -146 42 -278 8 110 -186 302 235 -134 148
6491 148 -103 -197 137 -14 8 -10 41 -35 242 73 -97 78 -50 153 148 24 91 -264 -287 179 21 -6 21 -4
6515 -4 -23 -96 45 178 113 -136 51 -186 -128 166 -23 256 23 -135 122 -60 164 166 -48 -28 53 -98 7
6538 7 235 -207 241 -100 -152 177 -82 -106 28 -331 19 56 65 58 174 24 76 -22 -106 228 -61 -117 89 -30
6562 -30 170 102 -113 51 -19 -199 192 118 -17 -65 -80 -33 -28 -50 44 -31 -177 59 -28 -72 94 9 -185 17 127
6587 127 121 -25 -45 83 206 -84 13 -4 -97 22 -3 -136 66 -92 -213 287 82 -37 154 17 228 203 -166
6610 -166 -132 73 -42 4 -111 26 164 -129 70 -83 99 113 118 -258 193 141 -38 -45 178 166 -32 40 -136
6633 -136 -58 -34 -53 -19 -122 109 -186 -31 155 55 99 -107 -106 39 176 -106 87 25 -217 115 72 -16 216
6656 216 -261 -89 208 -134 33 -66 -218 94 -22 -115 -49 -71 92 168 -16 327 164 -249 171 136 -347 138
6678 138 78 2 173 -194 -168 59 -117 31 65 -75 71 200 -131 -25 57 79 50 -12 -13 108 -122 -81 252 98
6702 98 101 194 -111 29 -147 80 262 -59 62 111 -37 186 98 -165 61 10 -132 79 -402 65 14 -38 -23
6725 -23 123 -39 -127 83 56 170 -111 -200 148 -122 -121 4 46 318 122 -196 82 83 -65 4 16 -64 57 61 53
6750 53 92 -168 -292 175 -151 157 53 27 -41 -28 -238 -37 61 -146 -112 -169 39 276 17 284 -108 -268 172
6773 172 4 72 73 -39 58 -3 -278 -3 100 128 17 89 -11 378 115 -13 135 -147 108 130 -129 -69 35
6796 35 -170 243 -12 -71 -20 -23 114 217 139 64 -11 81 180 56 -71 54 -234 25 -26 -68 -20 231 -252 55
6820 55 -1 -68 55 -18 58 161 -222 -167 39 -134 -80 156 161 4 108 13 -269 -17 5 106 41 23 -44 22 -50
6845 -50 -81 27 31 -110 -93 2 70 -30 -26 -179 80 9 -218 -114 41 -111 106 217 -132 187 -28 -263 133
6868 133 -175 -39 109 -187 -179 81 15 90 -314 -108 217 -72 103 65 22 -115 76 207 284 47 -1 29 188
6891 188 -143 115 -200 124 103 -49 90 187 192 83 153 -68 93 -170 -1 -71 -73 187 279 -130 88 -78 0
6914 0 45 -239 -72 209 44 -46 -7 26 96 -23 -70 -81 48 -166 -4 -95 -119 -40 116 -109 19 121 -165 267
6938 267 47 221 294 -31 -53 -8 -143 58 -78 -81 22 -94 51 107 -53 49 -66 -341 -113 -80 46 -75
6960 -75 86 72 146 27 205 36 -215 54 -146 -31 125 8 -103 37 -190 97 100 174 -32 70 -72 258
6982 258 65 23 56 -116 -216 304 159 51 3 -101 -203 -33 44 19 -1 -357 254 89 -45 260 85 12
7004 12 -48 -63 330 95 -120 67 135 82 147 -135 -203 141 -160 30 11 -39 -6 156 -20 81 163 -34 118 8
7028 8 -99 229 -18 23 21 -150 145 -38 -125 63 -45 -134 235 -22 -176 18 -191 97 -47 -119 -47 209 -67
7051 -67 -249 -133 -1 83 84 239 -65 -2 65 27 -218 35 58 -152 42 24 -48 212 -222 -129 -81 -118 268 -105
7075 -105 122 -43 -169 4 -8 5 -69 59 43 43 131 179 55 35 -188 222 82 57 231 114 -58 91 85 37
7099 37 86 190 -112 193 -175 29 19 -163 -87 -47 33 87 20 -160 -132 16 131 33 -65 37 10 -29 200 -139
7123 -139 119 83 -179 158 2 -134 78 -16 -53 9 -13 52 148 -193 175 -94 10 126 -201 -84 180 177 345
7146 345 166 -105 -84 173 101 -52 61 96 209 149 -63 51 -13 -25 25 8 -47 1 -202 212 106 -171 20
7169 20 -39 31 97 7 -41 148 -24 59 158 -55 185 117 -197 111 41 21 -42 123 20 102 -52 -54 90 -251 168
7194 168 287 14 -131 -115 -121 -47 -20 -146 -104 -273 68 15 -85 42 -138 -187 81 84 1 253 19 -81 -7 123
7218 123 -153 81 -167 64 110 -40 43 -38 -147 103 -69 -52 265 -275 70 -76 -99 97 1 -159 90 -215
7240 -215 8 70 -37 -91 11 -20 159 -294 63 -4 -83 141 16 -147 110 106 40 -129 78 -135 -3 48 220
7263 220 135 68 -149 122 133 -60 88 47 -28 -106 -35 86 41 -81 71 80 32 244 -241 -52 96 -169 -43 78
7287 78 -32 -49 -95 -166 136 91 -4 -25 -102 -27 129 -130 163 202 -175 16 43 64 79 85 142 230 -75 41 121 -266
7313 -266 -49 -109 53 203 -56 -75 123 -88 137 194 46 58 66 -71 -121 105 -168 -43 -75 -13 59 106 -163 113
7337 113 41 21 -170 -191 -138 160 -91 195 -36 -22 246 -11 145 87 9 141 -27 -32 3 33 -318 53 -48 16
7361 16 209 -84 -41 168 -128 68 139 -173 194 -248 -178 -257 -18 -110 54 22 -128 -100 26 82 -112 -212 -115
7384 -115 8 -198 105 -153 -46 76 106 39 176 -155 189 -62 -221 42 9 -124 38 54 -128 -26 -146
7405 -146 -86 253 -25 231 111 116 43 -109 -125 27 -7 106 -29 -155 123 -1 -149 97 102 -107 260 81 107
7428 107 73 -28 165 1 -123 69 202 -229 -106 124 -33 105 103 -59 166 209 -109 133 -230 -200 236 -19
7450 -19 -1 88 185 96 -187 -3 -85 20 101 151 -118 -15 -65 -99 -24 -32 64 123 -185 -66 17 56 48 59 -20 266 -88
7477 -88 -149 246 -71 33 70 90 0 -57 -197 57 -4 -219 76 6 -162 143 108 -62 122 176 64 -60 -168
7500 -168 -46 -47 -88 33 71 115 212 -219 88 82 2 -94 270 -121 -52 133 42 161 114 -138 37 -97 -33 -76 17
7525 17 -39 52 -19 114 124 -147 84 -32 112 12 65 94 35 81 35 116 26 99 -32 -161 -183 -244 -29 198 -18
7550 -18 70 31 6 -89 64 140 85 -80 21 -49 -126 106 -60 -211 34 32 70 93 36 -52 -32 107 -101 17 -142
7575 -142 -14 68 68 -132 85 90 83 4 -120 197 85 99 36 -145 123 123 -188 -88 -102 -127 -5 33 31 192 -94 -15
7601 -15 172 39 10 1 62 132 -160 -94 99 -52 -147 165 90 -131 112 -27 176 43 -147 -40 -169 29 139
7624 139 40 115 49 -111 -43 288 104 179 -14 -60 -115 57 34 82 -73 -83 -29 272 56 -112 -2 -77 94 -24
7648 -24 7 -129 22 -14 95 71 27 119 119 31 -204 29 -72 -136 2 195 -67 -109 -75 -179 -1 -119 64 158
7672 158 -43 176 74 -106 114 21 -7 12 -6 -107 38 -51 39 32 189 -54 92 -80 83 -1 43 79 249 142
7696 142 5 -22 125 58 12 3 -68 -118 167 -10 147 232 -279 -130 -3 -21 -85 123 -32 104 28 -41 61 -130
7720 -130 -5 10 61 -23 42 5 -1 209 -98 145 -192 -65 -15 -39 -45 107 -21 222 -56 -205 107 136 -94 -266
7744 -266 -150 142 213 -189 -252 17 36 20 302 186 -22 225 -55 -210 17 44 -134 -175 89 94 -14 -9 -45 -24
7768 -24 1 8 1 -111 -137 -13 137 63 172 133 -94 -79 -41 -146 180 93 -46 185 116 73 83 -136 -233 -92 105
7793 105 -54 -55 -41 -154 49 -235 -146 89 -168 -21 -206 92 189 -83 -79 -21 -58 68 66 91 56 3 -199 248 -50
7818 -50 0 47 -69 311 -236 -42 -115 -1 -318 63 180 116 -133 40 21 -94 45 46 -212 225 114 -50 -46
7841 -46 149 -16 -42 10 -238 -30 51 166 101 -57 88 -126 71 151 -72 38 -48 319 219 166 54 -281 201
7864 201 -186 146 143 -112 45 111 -249 -72 190 -43 186 -187 134 125 -43 2 -1 -171 126 -14 -174 -38 -87
7887 -87 -51 18 31 -153 -214 -236 -124 20 -151 -129 186 -8 66 54 -124 -121 41 -92 -153 79 0 -3 156 228 264 57
7913 57 8 3 132 52 -62 -154 146 53 -9 24 -75 -366 -2 -130 113 69 -73 -42 141 4 15 131 134 -84 -98
7938 -98 -11 -50 -79 -72 -148 -43 27 -49 33 121 151 -12 69 -54 -211 -254 19 -41 -18 -22 145 37 -147 -139 28 197 125
7965 125 -75 123 -98 -155 153 -12 72 55 -80 223 124 -152 195 -15 120 -134 -28 -212 -127 6 -8 -14 -40
7988 -40 167 156 -221 -151 171 254 -1 -352 35 -80 21 138 141 -324 -52 -172 -100 47 6 -29 87 142 176 -12
8012 -12 -249 -176 153 43 59 -64 16 155 -182 30 92 -29 -7 282 -143 31 82 -141 54 144 -122 -95 -161
8035 -161 -40 -115 -38 7 89 237 211 147 -177 -73 133 -23 -11 -247 -96 -5 90 65 30 64 -15 -58 32 197 57
8060 57 -119 132 -142 45 -5 -227 33 -192 -103 25 20 71 21 198 43 44 105 -97 46 30 -218 17 -36 -79
8084 -79 -81 -60 82 -63 -16 253 -120 -183 131 -59 114 98 -4 17 76 23 33 168 -93 -38 57 -20 107 117 76
8109 76 74 199 196 46 -219 137 82 -83 -173 -150 -172 6 151 -59 71 -86 -26 72 145 -27 6 38 29 -98 -116 60
8135 60 -44 82 96 -58 214 -17 202 -48 -8 -178 -9 8 22 124 114 75 -65 -224 133 -33 87 59 -187
8158 -187 16 94 -63 -64 89 -45 -77 -147 150 177 66 19 123 -167 6 22 -173 78 114 38 -130 68 66 35
8182 35 99 -124 -116 -13 -193 176 -3 81 107
8191A07
##END NTUPLES=NMR FID
##END=
