##TITLE=1H_DE-80H_X3
 200.13MHz, d2o
 8 sc
 
 19ns.26.2.2025
##JCAMPDX= 6.0         $$ Bruker NMR JCAMP-DX V2.0
##DATA TYPE= NMR FID
##DATA CLASS= NTUPLES
##ORIGIN= UXNMR, Bruker Analytische Messtechnik GmbH
##OWNER= pz
$$ XWIN-NMR		Version 3.5
$$ Thu May 15 14:28:44 2025 Russian Standard Time (UT+4h)  Yarkov@DPX200
##.OBSERVE FREQUENCY= 200.1313
##.OBSERVE NUCLEUS= ^1H
##.DELAY= (6, 6)
##.ACQUISITION MODE= SIMULTANEOUS
##.ACQUISITION SCHEME= undefined
##.AVERAGES= 8
##.DIGITISER RES= 18
##SPECTROMETER/DATA SYSTEM= spect
##.PULSE SEQUENCE= zg30
##.SOLVENT NAME= CDCl3
##.SHIFT REFERENCE= (INTERNAL, CDCl3, 0, 14.3821)
##AUDIT TRAIL= $$ (NUMBER, WHEN, WHO, WHERE, WHAT)
$$ ##TITLE= Audit trail, XWIN-NMR		Version 3.5
$$ ##JCAMPDX= 5.01
$$ ##ORIGIN= Bruker BioSpin GmbH
$$ ##OWNER= Yarkov
$$ C:/Bruker/XWIN-NMR/data/yarkov2/nmr/H-C/1/audita.txt
$$ ##AUDIT TRAIL=  $$ (NUMBER, WHEN, WHO, WHERE, WHAT)
(   1,<2025-05-15 14:27:31.62 +0400>,<Yarkov>,<DPX200>,
      <created by zg, POWCHK disabled, PULCHK disabled
       configuration hash MD5:
       00 E9 B6 7A A2 85 ED C7 34 08 36 98 17 FE 4E 26
       data hash MD5: 16K
       0E F2 53 93 B1 76 E9 1A C2 6D B6 00 A5 FB B4 B7>)
$$ ##END=
$$ 
$$ hash MD5
$$ 48 06 4F 11 1C 47 BF 9A 6F CD 6B A6 3D 04 C3 74
##$RELAX= 
##$RELAX= 
##$RELAX= 
##$RELAX= 
##$RELAX= 
##$RELAX= 
$$ Bruker specific parameters
$$ --------------------------
##$DU= <C:/Bruker/XWIN-NMR>
##$EXPNO= 1
##$NAME= <H-C>
##$PROCNO= 1
##$TYPE= <nmr>
##$USER= <yarkov2>
##$AMP= (0..31)
100 100 100 100 100 100 100 100 100 100 100 100 100 100 100 100 100 100 
100 100 100 100 100 100 100 100 100 100 100 100 100 100 
##$AQSEQ= 0
##$AQ_mod= 1
##$AUNM= <au_zg>
##$AUTOPOS= <>
##$BF1= 200.13
##$BF2= 200.13
##$BF3= 200.13
##$BF4= 200.13
##$BF5= 200.13
##$BF6= 200.13
##$BF7= 200.13
##$BF8= 200.13
##$BYTORDA= 1
##$CFDGTYP= 0
##$CFRGTYP= 5
##$CHEMSTR= <none>
##$CNST= (0..31)
1 1 145 1 1 1 1 1 1 1 1 1 1 1 1 1 1 1 1 1 1 1 1 1 1 1 1 1 1 1 1 1 
##$CPDPRG= <>
##$CPDPRG1= <>
##$CPDPRG2= <>
##$CPDPRG3= <>
##$CPDPRG4= <mlev>
##$CPDPRG5= <mlev>
##$CPDPRG6= <mlev>
##$CPDPRG7= <mlev>
##$CPDPRG8= <mlev>
##$CPDPRGB= <>
##$CPDPRGT= <>
##$D= (0..31)
0 0.7 0 0 0 0 0 0 0 0 0 0.03 0 0 0 0 0 0 0 0 0 0 0 0 0 0 0 0 0 0 0 0 
##$DATE= 1747304851
##$DBL= (0..7)
120 120 120 120 120 120 120 120 
##$DBP= (0..7)
150 150 150 150 150 150 150 150 
##$DBP07= 0
##$DBPNAM0= <>
##$DBPNAM1= <>
##$DBPNAM2= <>
##$DBPNAM3= <>
##$DBPNAM4= <>
##$DBPNAM5= <>
##$DBPNAM6= <>
##$DBPNAM7= <>
##$DBPOAL= (0..7)
0.5 0.5 0.5 0.5 0.5 0.5 0.5 0.5 
##$DBPOFFS= (0..7)
0 0 0 0 0 0 0 0 
##$DE= 6
##$DECBNUC= <off>
##$DECIM= 32
##$DECNUC= <off>
##$DECSTAT= 4
##$DIGMOD= 1
##$DIGTYP= 9
##$DL= (0..7)
0 120 120 120 120 120 120 120 
##$DP= (0..7)
150 150 150 150 150 150 150 150 
##$DP07= 0
##$DPNAME0= <>
##$DPNAME1= <>
##$DPNAME2= <>
##$DPNAME3= <>
##$DPNAME4= <>
##$DPNAME5= <>
##$DPNAME6= <>
##$DPNAME7= <>
##$DPOAL= (0..7)
0.5 0.5 0.5 0.5 0.5 0.5 0.5 0.5 
##$DPOFFS= (0..7)
0 0 0 0 0 0 0 0 
##$DQDMODE= 0
##$DR= 18
##$DS= 0
$$ [...]
##$SUBNAM2= <"">
##$SUBNAM3= <"">
##$SUBNAM4= <"">
##$SUBNAM5= <"">
##$SUBNAM6= <"">
##$SUBNAM7= <"">
##$SUBNAM8= <"">
##$SUBNAM9= <"">
##$SW= 18.0517328524113
##$SWIBOX= (0..15)
0 0 2 0 0 0 0 0 0 0 0 0 0 0 0 0 
##$SW_h= 3612.71676300578
##$TD= 16384
##$TD0= 1
##$TE= 0
##$TE2= 300
##$TE3= 300
##$TEG= 300
##$TL= (0..7)
0 120 120 120 120 120 120 120 
##$TP= (0..7)
150 150 150 150 150 150 150 150 
##$TP07= 0
##$TPNAME0= <>
##$TPNAME1= <>
##$TPNAME2= <>
##$TPNAME3= <>
##$TPNAME4= <>
##$TPNAME5= <>
##$TPNAME6= <>
##$TPNAME7= <>
##$TPOAL= (0..7)
0.5 0.5 0.5 0.5 0.5 0.5 0.5 0.5 
##$TPOFFS= (0..7)
0 0 0 0 0 0 0 0 
##$TUNHIN= 0
##$TUNHOUT= 0
##$TUNXOUT= 0
##$USERA1= <user>
##$USERA2= <user>
##$USERA3= <user>
##$USERA4= <user>
##$USERA5= <user>
##$V9= 5
##$VALIST= <valist>
##$VCLIST= <CCCCCCCCCCCCCCC>
##$VD= 0
##$VDLIST= <DDDDDDDDDDDDDDD>
##$VPLIST= <PPPPPPPPPPPPPPP>
##$VTLIST= <TTTTTTTTTTTTTTT>
##$WBST= 1024
##$WBSW= 4
##$XGAIN= (0..3)
0 0 0 0 
##$XL= 0
##$YL= 0
##$YMAX_a= 160298
##$YMIN_a= -182341
##$ZGOPTNS= <>
##$ZL1= 120
##$ZL2= 120
##$ZL3= 120
##$ZL4= 120
##$ABSF1= 10
##$ABSF2= 0
##$ABSG= 5
##$ABSL= 3
##$ALPHA= 0
##$AQORDER= 0
##$ASSFAC= 0
##$ASSFACI= 0
##$ASSFACX= 0
##$ASSWID= 0
##$AUNMP= <proc_1d>
##$AZFE= 0.1
##$AZFW= 0.1
##$BCFW= 1
##$BC_mod= 2
##$BYTORDP= 1
##$COROFFS= 0
##$CY= 83.5205535888672
##$DATMOD= 1
##$DC= 2
##$DFILT= <>
##$DTYPP= 0
##$F1P= 10.8118882576601
##$F2P= -7.23987719738617
##$FCOR= 0.5
##$FTSIZE= 0
##$FT_mod= 4
##$GAMMA= 1
##$GB= 0.15
##$INTBC= 1
##$INTSCL= 1
##$ISEN= 128
##$LB= 0.25
##$LEV0= 0
##$LPBIN= 0
##$MAXI= 10000
##$MC2= 0
##$MEAN= 0
##$ME_mod= 0
##$MI= 1.114404
##$NCOEF= 0
##$NC_proc= 0
##$NLEV= 6
##$NOISF1= 3.799351
##$NOISF2= 2.8
##$NSP= 1
##$NTH_PI= 0
##$NZP= 0
##$OFFSET= 14.38212
##$PC= 1
##$PHC0= -1345.591
##$PHC1= 7.133752
##$PH_mod= 1
##$PKNL= yes
##$PPARMOD= 0
##$PSCAL= 0
##$PSIGN= 0
##$REVERSE= no
##$SF= 200.129724274929
##$SI= 16384
##$SIGF1= 3
##$SIGF2= 2
##$SINO= 400
##$SIOLD= 16384
##$SREGLST= <1H.CDCl3>
##$SSB= 0
##$STSI= 0
##$STSR= 0
##$SW_p= 3205.1282051282
##$SYMM= 0
##$S_DEV= 0
##$TDeff= 0
##$TDoff= 0
##$TI= <>
##$TILT= no
##$TM1= 0
##$TM2= 0
##$TOPLEV= 0
##$USERP1= <user>
##$USERP2= <user>
##$USERP3= <user>
##$USERP4= <user>
##$USERP5= <user>
##$WDW= 1
##$XDIM= 8192
##$YMAX_p= 0
##$YMIN_p= 0
$$ End of Bruker specific parameters
$$ ---------------------------------
##NTUPLES= NMR FID
##VAR_NAME=  TIME,          FID/REAL,        FID/IMAG
##SYMBOL=    X,             R,               I
##VAR_TYPE=  INDEPENDENT,   DEPENDENT,       DEPENDENT
##VAR_FORM=  AFFN,          ASDF,            ASDF
##VAR_DIM=   8192,          8192,            8192
##UNITS=     SECONDS,       ARBITRARY UNITS, ARBITRARY UNITS
##FACTOR=    0.0002768,     1,               1
##FIRST=     0,             0,               0
##LAST=      2.2672688,     0,               0
##MIN=       0,             -182341,         0
##MAX=       2.2672688,     160298,          0
$$ Real data points
##PAGE= N=1
##DATA TABLE= (X++(R..R)), XYDATA
0@%%%%%%%%%%%%%%%%%%%%%kJ0j6J6j6J6j7K2k9L2l6M4n0N5o3P1q0R3j03J13j28
42f8J44j60J78j97K20k43K65k93L25l59L94m33M75n21N74o33O96p66Q45r30J024
63E37j125J224j302J285r19j007J8592J43013k07096r6180K54916l0710k04101
76a22873Q3448J52488j16840r1725J40294K3823j46389N2224J03187q0231m4052
87d6646N5457J4193k0297k4211K7580K0128n9447J8649O2353o2146j9167O1834
99B8280l0059k6359N4364n046o1805K5548P1222o1215n6557J14263j1281j37068
111i5713J10204Q9329j71904M14J58299p4326j02299J07807M9502j24310o974
122e9971J35541m3661j16226R2656N5032j01007J1953O6925l4442l3934J6778
$$ y = [0, 0, 0, 0, 0, 0, 0, 0, 0, 0, 0, 0, 0, 0, 0, 0, 0, 0, 0, 0, 0, 0, -2, 8, -8, 8, -8, 8, -9, 13, -16, 16, -20, 24, -26, 29, -34, 37, -43, 50, -53, 60, -68, 76, -84, 94, -103, 117, -126, 139, -154, 171, -188, 206, -227, 248, -273, 301, -332, 364, -402, 443, -487, 537, -588, 636, -666, 619, -300, -1307, 17285, 160298, -46798, -142978, 111938, 81228, -122873, -39425, 113063, -3777, -95502, 44792, 68615, -77774, -25550, 77637, -2594, -46646, 8811, 23004, 2707, -21504, 6076, 26204, -33243, -14594, 47759, -14387, -33554, 28280, -1779, -28138, 26226, 21180, -40625, -15077, 56145, -5070, -61627, 52636, 41355, -95713, 14491, 103820, -68084, -67670, 90629, 16303, -85996, 21811, 71313, -52997, -59971, 75570, 31909, -84317, 8339, 63371, -37636, -25683, 41242, 6800, -27134, -10356]
133a0356L8105p963n7632L0072M6712n6248o371N4020k6573l5606L1950K7843
145B7953l2274k3183M5756n016m7630N4079J1306p5660M5354M1763p2292J8471
157a1373N1504n6447j6894O0737l708n7373J8775N3179m8665k8490P7594k1361
169A7478o9278O2017K6240n7835J1361K5713j4637q430L624J9854j0501l1081
181b5475K8808J7796l1182R07J4495k612r007k299K5858j2827l5205M2782J1696
194B3735m9258K8403J8466m3096J9623K4977k9897l544J8071l982j3073J0769
206A194J6008l2583m072M8532k8529l0686N1964j1903m0275M0357J2065l5041
218a2969J319J9722M130j9821j335K6558j9472j8014L3361k337k3677P482O124
$$ y = [-10356, 27749, 19786, -37846, -7774, 38938, -17310, -23681, 30339, 3766, -31840, 110, 27953, -4321, -27504, 18252, 13236, -34394, 19685, 30991, -44669, 685, 42448, -29844, -11373, 40131, -16316, -33210, 27527, 23819, -33554, -14779, 38400, -10265, -38755, 38839, 17478, -51800, 10217, 36457, -21378, -10017, 15696, 1059, -7371, -3747, 16107, 5606, -25475, 3333, 21129, -10053, -9146, 5349, 2737, -6270, -8569, 17289, 4462, -30743, 12039, 23735, -25523, 2880, 21346, -21750, -2127, 22850, -7047, -10591, 7480, 3498, -9575, 1194, 17202, -15381, -19453, 29079, 550, -30136, 21828, 9925, -30350, 10007, 22072, -12969, -11650, 8072, 12202, -7619, -8954, 17604, -1868, -19882, 13479, 11142, -12535, -5053, 1071]
231A071O256q793j1879K6200q533k7709L5766N536l6892J6027J5635j5202j7N618
245C084J354r780j697K0229j3102j3317K3895j3708r771L0211j8210j6954K8543
258A0777o808j3756J4477J003q362n191J1332J1876k5200l82K7052k0189q008
271a1379K3884j1568j0011Q098J821P045j2426o756K2904j0649j3385K3026n693
284D911j5550J1025N126q63q539k117J5959j1610p654K2057j3575j2354K1315
297H131p003o806J1351r817L05Q540n505K387k657j331P891r782N044J0159k1352
312a0445N914J8428j8584k46J1459r826R81K153R49M413j3911M264J6201j5962
326d212j272J3194j0157j12N148j462L895j0893J113J6988j5169m690J6788j2049
$$ y = [1071, 7327, -1466, -13345, 12855, 4322, -23387, 12379, 17915, -18977, -2950, 12685, -2517, -2534, 3084, 4438, -5342, -7039, 13190, 88, -13229, 10666, -3042, -12813, 17398, -812, -17766, 10777, 3969, -9787, 4690, 5693, -2669, -7860, 3472, 15348, -9852, -10234, 16818, -3371, -11379, 12505, 937, -9074, -976, 845, 7890, -4536, -11292, 11612, 963, -12422, 10604, 4911, -10639, 386, 5512, 4649, -3890, -6007, 9952, -1658, -9312, 12745, -830, -13184, 8131, 1128, -5678, 5673, -4144, -3839, 4701, -804, 1583, -1074, -2405, 5486, -4296, 748, 10907, -10445, -4531, 13897, -4687, -4933, 6526, -3300, -2319, -166, 783, 5196, -8715, -4451, 11750, -4212, -5484, 7710, -2447, -2559, 2589, 1127, 5022, -5871, -4758, 12230, -2939, -7629, 9159, -2890]
340b890l752J2321n743j231m75j896R090o160l167R397r377J967R538j1810M862
355F74M840j3643J0530N650j4326N248L165l791L167m494M478J359j2312J2174
369B719N783j6557P032N772p716N192k341j52M992j1250O567J0276j6775K305
383d153J0479r002J457K299k216K649o602M772P929j3516L219R025j0781N476
397A035M008j0273P508J00o824R340l603o005O073j722J716o59o251R231k696
412I78q507J3481l279j0546J0652q62l035M019o308M901K616j0107Q953K611j2431
427f864O414M009m433R80l616M789J464r841J0347K228j4472J0094M672j0342
441d571O697m64n158O939l545r76M517o193K393K001l584N417n650l032J1552
$$ y = [-2890, -6642, 5679, -64, -1295, -1770, -3666, 5424, -736, -3903, 5494, -3883, -1916, 7622, -4188, 674, 5514, -8129, 2401, 8051, -6275, -1027, 2138, -1653, 1514, -2980, 1498, 2857, -9455, 2719, 8502, -8055, -1023, 4749, -2967, 2225, -116, -268, 4724, -6526, 41, 10317, -6458, -4153, 6326, -2676, -1219, 1080, -1136, 1513, -5089, -317, 7612, -5904, -2685, 6340, -4441, 1035, 5043, -5230, 2278, 2378, -4446, 4894, 1291, -4714, 1359, -363, 1353, 694, -5557, 3674, 978, -7529, 5952, 2673, -7873, 2779, 1917, -1118, 2901, -3407, 1494, 4110, -5997, 2956, 5567, -6864, -450, 3559, -874, 106, -3510, 1279, 2743, -7098, 3249, 5477, -8995, 1099, 5771, -4571, 2126, 1662, -3496, 3443, -102, -1078, 3439, -2754, -361, 1640, -1944, 3473, -2177, -5209, 6343]
456F343p916l804J1626q044k718Q823m660Q03P52n140P850j592o996P985k218
471A094m521M670j187J833k778n335J1702l233j1113J3804j443j1779J1400J050
485D164p598M019o73J015R60m166M660j851m185P382m490k031P102q650J890R092
501F640j1008J361Q128q375K413M143n121K912j540r07N595n229l67L704m389
516b040L671q05m625Q203n375n570J3427o167q935J2563k264o728O536k12k034
531c55q58O55N061n644j857P805o809j33P358q792K120O115r561M639N150j0089
547e195M205M207n177K287j55j54J208l771M733O11p103O639n80n637P862m400
563d20m426R978o370l407R999o438l650P645j752k307J09J663K093o118L478O151
$$ y = [6343, -1573, -5377, 6249, -1795, -4513, 4310, -350, 453, 1205, -3935, 3915, 2323, -4673, 3312, 1094, -3427, 1243, 56, 1889, -889, -6224, 5478, 2245, -8868, 4936, 3493, -8286, 3114, 4164, -3434, 585, -88, 927, 1887, -2279, 2381, 530, -3655, 3727, -763, -2794, 4308, -4342, -2452, 6640, -4368, -3007, 5121, -3254, -841, 3302, -1819, 1093, -447, -1354, 4241, -988, -1355, 2349, -2040, 1631, 826, -3799, 4404, -971, -6541, 6886, 719, -8216, 4347, 2083, -4645, 1891, 1679, -355, -1213, -558, 4503, -1141, -2998, 4807, -2002, -2135, 5223, -3569, -1449, 4666, -4895, -256, 4894, -5195, -990, 3217, -1960, 327, 172, 18, 1226, -2545, 2188, 2799, -4304, 2335, 1755, -3882, 3980, -420, -4846, 5132, -1238, -4645, 5354, -1084, -4734, 2911, 1159, -1148, -1039, 624, 2717, -3401, 77, 6228]
579F228j0721K474Q527j0086K322N777q687L894L301o608M408L70m151L685k63
594D70m06R7k464N195k336m442Q681m178n879J0125l998n201Q312m872k274O830
610C660n033m62L758l628J154O90J65J138m885M491L385r553N875N141j1542N492
626a54N927r606L236L132m760K850m16j276J955k830K195R62l505M343k413k831
642c191P836n317l176R270o235l083Q802n411k439N415l244L29J147j933K166
657I36k295N20L226n040K925K514p123O091K241r200O844K293q331N669J696n469
673b503K576L32l29K87k562L739j357l575O358l071l508P421m661j910P437o090
689a416r01O440n280Q9L652l808J138J58m76K083l624J417K902n659L688K342
$$ y = [6228, -4493, -2019, 6508, -3578, -1256, 4521, -4166, -272, 3029, -3579, 829, 1199, -2952, 733, 470, 64, 161, -2303, 2892, 556, -3886, 4795, 617, -5262, 4863, 865, -4336, 3976, -896, -3170, 3660, -1373, -1835, 1923, -1705, -551, 139, 304, 1442, -3443, 1048, 4433, -5120, 755, 5896, -5646, -154, 5773, -3833, -597, 2535, -2225, 625, 209, -1067, 888, -1942, 253, 1215, -2290, 2053, -360, -3191, 4645, -672, -3848, 5422, -813, -3896, 4906, -505, -2944, 2471, -773, -444, 703, -1230, 936, -1359, -839, 2387, -2653, 272, 2786, -4337, 1754, 3995, -5205, 1639, 3932, -4399, 1270, 2966, -2503, 73, 405, 76, 363, -2199, 1540, 183, -3392, 2966, -105, -3613, 3808, -853, -2763, 4674, -1416, -2317, 4123, -1157, -1068, 2584, -1224, -86, 72, -404, 1679, -1945, -528, 2374, -3285, 403, 2745]
705B745o847N302J352o523O321k73n760N788m78l689L443j124l66L35j552L616
721B290l237k220O734m561k526P544n329j598O515m756q8L765m023J721J373k900
737a296K760j638r07L001l586J781J801n444M410J324o220N567K03n721N837n72
753A300l814M461j892j046K657k354J239P6k204L722k778j411N314n114n82O420
769C994n837n12N562m847N45L149l010J449m70p77L034l202K39L334m594K049
785A06K043m682L559L2m319N366j428m057N575k134k249L974k285K9J508k272
801a234K799j173k357M425l092j129M893m679j23M724n379J341L786n159J750
816f07K130k770J833q18k05K211l500J979K524n222K849J970m820L409Q8l495
$$ y = [2745, -4102, 1200, 2552, -3971, 2350, 2077, -3683, 2105, 1627, -2062, 1381, 257, -109, 226, -1326, 2290, -947, -3167, 3567, -994, -3520, 4024, -1305, -2903, 3612, -1144, -1232, 2533, -1490, 231, 1604, -1296, 1464, -174, -1081, 1920, -1666, 115, 1916, -3528, 882, 2206, -4014, 1553, 1756, -3965, 1872, 1300, -2514, 1947, 55, -991, 1666, -688, 551, 627, -1577, 2145, -633, -2044, 3270, -1844, -2426, 3994, -1843, -2355, 3207, -1640, -1095, 2054, -956, 493, 23, -754, 2280, -922, -683, 2651, -1943, 106, 2149, -2533, 1026, 1058, -3261, 2105, 677, -3380, 2195, 61, -2188, 1786, -499, -470, 1038, -1234, 1565, 392, -1965, 2460, -632, -1761, 3132, -1547, -1670, 3054, -2325, -984, 2802, -2357, -607, 1523, -1247, 586, -232, -437, 1774, -1726, 253, 2777, -2445, 404, 2374, -2446, 963, 1051, -2444]
832b444M136k005j709M314l241q58L538k764P73J050k096K852j858j189M511m057
848a047o66M853m525M08L638m684J825J944l897K667J63k225K482j436J81J745
864A426l412K695J320m918M227P57m881M250k51l106L571k050p03K910l448J106
880e07K041l387K012N41k091K725k045k73L635m130O56M001n123J296L317m331
896a663J659J320k871K355r42j025K364k353Q13J774l443K709M85l760M312n11
912A223l868M694j221k822L881j916p49J908k402J853J63k775L175j067j976L607
928A708k407m56L026l474J411K719m832K466K113m169K399Q07k526J918q66m3
944b06J252k783K141Q03l643L474Ql630M228j076k742M220k033j515L455k364
$$ y = [-2444, 1692, -313, -2022, 2292, -949, -1807, 1731, -1033, -260, 790, -1306, 1546, -312, -1501, 3010, -1047, -1713, 3140, -1385, -977, 2661, -2023, -198, 1746, -2151, 516, 679, -1546, 936, -500, -319, 1426, -1986, 709, 2029, -2889, 1338, 2095, -2786, 1464, 1213, -1893, 1678, -372, -1075, 1835, -1613, -507, 1534, -1853, 159, 700, -1391, 1334, -711, -984, 2651, -1479, -823, 3178, -1945, -649, 2668, -1663, -4, 1316, -1555, 800, -142, -1167, 1197, -1156, -343, 1431, -2012, 697, 1182, -2578, 1734, 1223, -2645, 2049, 828, -1994, 1887, -29, -778, 1130, -1272, 581, 744, -2031, 1144, 77, -1899, 1708, -699, -1155, 1871, -1603, -192, 2527, -2305, 161, 2274, -1895, 504, 1311, -1215, 703, -163, -206, 1046, -1737, 404, 1207, -2436, 1038, 1046, -2584, 1644, 568, -2174, 2046, 13, -1502, 1953, -411]
960d11j69J807k046J415n10j320L040k582j002L987l556k0L434l718J195K098
976A642l466K657N53l435L138j78k176K224j118K08O56k223K793o26l330M523
992A842j158l664M728j334k490L684j835n26K156k350J050R85k068J885q07j010
1008i12K714k788J89L023m220J149L180m380J606K046l283K092L87k090K551j371
1024a07p00K163j947P14O82k040K573j168k269M395k365k516M777k189k230L653
1040A426j623n48J495j420J207k62j317K551j899l80K599k928P64K268l839J942
1056C6J775m185K671J090l271K252K8j394J806j217K21J072k019J887Q6k254L016
1073A600j427j813L770k556j333L962k886q31L161k321p6J440j292J004p20k93
$$ y = [-411, -580, 1227, -819, 596, 86, -1234, 1806, -776, -1778, 2209, -1347, -1367, 2067, -1651, -456, 1642, -1824, 833, 1386, -2049, 1089, 911, -1265, 959, -159, 49, 705, -1518, 1275, 649, -2681, 1842, 684, -2980, 1748, 414, -2076, 1608, -227, -753, 1403, -947, 103, 1088, -980, 905, 98, -912, 1802, -986, -797, 2226, -1994, -845, 2335, -2045, -439, 1607, -1676, 416, 803, -1287, 1264, -107, -807, 1356, -591, 123, 805, -1235, 1338, 170, -2099, 2296, -69, -2585, 2192, 3, -2227, 1426, -197, -745, 750, -670, 537, 275, -1042, 1509, -390, -770, 1829, -1099, -335, 1933, -1906, 36, 1811, -2374, 297, 1387, -1884, 368, 396, -998, 808, -409, -188, 884, -1135, 752, 838, -1416, 1600, 173, -1640, 2130, -426, -1759, 2203, -683, -1514, 1647, -674, -750, 690, -602, 402, -318, -611]
1089f11K165k531M51K494l382J343J955l651K065J162l407K700J75k720K664p18
1105A54j169J698j293P18L03j589K427r48j837L422j930j606L854k522j013L244
1121A913k633j93K300k304O70P25j401J346q44N0J521k532J437J775l595K109
1137C44J450l711K614P37k888K042j40j487J866j162j42J052j425J001K09j591
1153a231K403j530j097L577k545r47L616k682o87K884k383K57J283j614R55j99
1169F0q97J646j482J95J628k451J449J032l226K781P02l530K881L73k726K293
1185G28l05j096J306j182M73O65j760J643j52j524K257j392p59K868k539j58K900
1202A973k895P3K586k323N07Q95j255J091r08k96J670k121O04J622k703J524Q36
$$ y = [-611, 1554, -977, -526, 1968, -1414, -71, 1884, -1767, 298, 1460, -1947, 753, 928, -1792, 872, 154, -1015, 683, -610, 108, 411, -1178, 1249, 301, -1536, 1886, -44, -1650, 2204, -318, -1331, 1913, -720, -913, 1387, -917, -247, 478, -923, 423, -421, -371, 1150, -1382, 55, 1830, -1765, 344, 1794, -1917, 697, 1434, -1454, 588, 448, -1039, 827, -335, -477, 575, -850, 151, 360, -1231, 1172, -358, -1455, 2122, -423, -1370, 2246, -436, -1123, 1761, -622, -365, 918, -696, 259, 60, -837, 809, -673, -478, 1150, -1301, 148, 1180, -2046, 735, 1437, -2093, 788, 1161, -1565, 728, 423, -673, 633, -549, -76, 589, -1171, 472, 320, -1204, 1053, -339, -1098, 1770, -769, -927, 1973, -922, -849, 1737, -586, -79, 816, -439, 652, -256, -552, 1118, -1003, -399, 1223, -1480, 44, 880]
1219H80k573K451J45k641K785m09j899K301p24p29R96j095J040j62j445K109r98
1236C2j399K787j854o42K357k154K40K234k771Q04J665k262J227L48j097J039
1252E54r00J25J309k188J174J083k727J873O39k323K066k30j803K371j031r80
1268i88J902j116j75J006j060R13l38r12J944j500p69K579k067k92K322k280K56
1285e75J578k034J149M91j590J493l29o94J371j269M02R12k025J613L94k458K183
1302F12J55k261K250n65j270J879j039k38J366j490O05N57j163J271m59r29J887
1319A168j492l08K099k286K47J908k235N62J267j864J013J31r40J402q88l08J338
1336H14j477P63Q97k045J632O8j876K109m10j816K253p34j071J593j141J8Q26
$$ y = [880, -1693, 758, 903, -1738, 1047, 638, -1261, 1040, 316, -413, 583, -512, 528, 366, -1079, 1030, 32, -1367, 1420, -434, -1076, 1281, -873, -633, 1601, -1170, -366, 1299, -963, 264, 612, -485, 554, -346, -221, 1088, -1100, 74, 1157, -1570, 303, 942, -1381, 685, 455, -1348, 1023, -8, -988, 914, -202, -377, 629, -431, 482, 144, -768, 1176, -324, -1093, 1486, -581, -873, 1449, -831, -575, 1003, -1031, 118, 609, -981, 512, 183, -511, 860, -409, -7, 905, -1120, 493, 887, -1571, 612, 767, -1494, 756, 191, -1079, 800, -239, -477, 889, -601, 4, 561, -602, 669, 210, -719, 1168, -324, -632, 1467, -819, -572, 1336, -899, -337, 930, -934, 79, 210, -730, 672, -216, -524, 814, -663, 100, 997, -1048, 584, 652, -1224, 885, 475, -1341, 912, 178, -893, 700, -441, -423, 403]
1353D03j097R30J47j262J607q03n71J762j657%J813k199P40J447k309R30R47j683
1371h55J164j58q30J060r03K65J042j658J136N66j918J753j17j590J926n88j194
1388h99J883j222l13J242j187L27O05j157J186m66p91J672j240l18J783j686K04
1405c77J516j877P82R04j859J145L01j273J258n29m32Q30j033P01M40j452J371
1422D16K33j890K041l18j557J902o61q95J503r88p1Q67j232P84J58j092J299n85
1440h6n40J443j382J17J483j818N28J211j745P99O85j373J137j44q17J102p73
1457a73j36P40j116Q72K63j461J498k50j345J980q00j193J996r16n19J286r16
1474a90K09M46j028J116l85r62J479q82m36J477j528L21J180j691R21Q40j775
$$ y = [403, -694, 236, 383, -879, 728, -75, -646, 1116, -541, -541, 1272, -927, -187, 1260, -1049, -119, 828, -855, 309, 151, -679, 381, -522, -257, 785, -873, 263, 829, -1089, 664, 547, -1043, 883, 295, -899, 984, -238, -551, 691, -496, -169, 436, -721, 465, -1, -792, 880, -360, -678, 1105, -581, -377, 1139, -738, 44, 948, -911, 234, 535, -738, 520, -9, -441, 389, -644, 57, 497, -955, 416, 649, -1241, 800, 482, -1075, 827, 166, -729, 774, -214, -285, 582, -650, 134, 292, -800, 499, -86, -626, 817, -565, -448, 1035, -783, -255, 956, -789, 10, 695, -678, 459, 315, -502, 600, -173, -309, 431, -685, 187, 450, -1011, 487, 237, -1108, 872, 72, -1121, 875, -41, -560, 726, -190, 19, 465, -563, 553, 168, -794, 685, -197, -633, 844, -684, -363, 817, -874, 47, 887, -888]
1491h88J120K91j137J107l12l81P29q21M42M06j317R90K22j357J540n30j071J822
1509H55r75p67J775j157j08J083j074L90K56o26R80o94l36J132j203K8J429j766
1527g78N28J106j742R39M50j338J201j35q43J104n61q8P00r11O42J99j296J400
1545E77j82j278J535o11r92J802r34o21J345j058O8Q76r66N15Q4n26R49p38j23
1564b78J173j434M39J039j819Q56Q41j684R97L58j142R35k98n94J140p59K22M98
1582D90j025P85J80j041J353o23r20J699r56p20J608j050k59J108j027K01N21
1599C24q51P58k38l19Q66r71L71Q08j293N75P27j553J095L03j451J119R1r91Q12
1618A82k27k11P73r27M50K02q23R20j26p76J185o29o02J435j025l31J273j189
$$ y = [-888, 232, 523, -614, 493, 181, -200, 529, -292, 150, 556, -761, 229, 451, -906, 634, 104, -967, 855, -120, -887, 888, -269, -377, 706, -368, 22, 278, -348, 632, -62, -398, 734, -469, -441, 988, -778, -250, 856, -886, 53, 503, -835, 366, 231, -612, 492, -69, -157, 543, -368, 274, 473, -823, 577, 395, -883, 652, 41, -951, 851, -83, -704, 641, -417, -349, 527, -439, 76, 160, -366, 583, -155, -278, 895, -539, -100, 939, -880, -24, 817, -867, 130, 488, -654, 281, -17, -611, 529, -230, -8, 490, -535, 250, 430, -611, 742, 119, -801, 898, -58, -778, 830, -220, -479, 629, -398, -197, 324, -527, 231, -7, -326, 540, -431, -60, 748, -545, 30, 757, -796, 299, 602, -849, 270, 361, -630, 182, -45, -256, 517, -410, 40, 242, -581, 339, 213, -563, 622, -7, -609, 826, -199, -530, 743, -446]
1636d46J44Q15q86L14J23m21Q03p14q0R50j147M53Q69j395P72N55j509J162J49
1655E11j132J000k02p83P43j99k19N02p30Q13k38q94J508n94q85J534q32l67J184
1674G20j042J16R02j105L41M73q48N20l4l02O10o54P8P55j253Q36N44j433R48
1693A72K95j124R98N0j045J163n27k86Q00n49J40J44n64O48k48p79J429q13m88
1712e84J315r18l35J210r89J84O73j074O11K05o29O71l97k11O40p89K88N19j171
1731g81Q96L30j249J123O2j210J209k13p31J126m09k90N34o22M38l1n65Q45n01
1750c9m66J065q42k76J348j214MJ033j041L93M73q88O93o2l64O73o78J13N78r98
1770d95N34L38j051R10P6j176J253j72q29J020m20l72P95m81L9K95o52P20k98
$$ y = [-446, -302, 513, -373, -59, 64, -357, 446, -268, -348, 602, -545, -92, 777, -618, 154, 709, -800, 362, 511, -621, 379, 177, -606, 137, -62, -281, 221, -509, 304, 66, -828, 680, 86, -799, 735, -97, -464, 720, -322, -206, 696, -409, -68, 405, -443, 77, 43, -259, 351, -303, -225, 530, -723, 113, 657, -776, 172, 467, -657, 341, 391, -654, 509, -18, -304, 496, -53, 87, 231, -333, 315, 67, -712, 717, -96, -584, 731, -187, -522, 688, -301, -117, 556, -518, 93, 298, -331, 340, -57, -268, 372, -417, -129, 390, -781, 115, 445, -804, 319, 381, -829, 380, 167, -564, 562, 153, -137, 397, -225, 213, 182, -383, 462, -39, -505, 560, -282, -558, 790, -424, -420, 613, -428, -35, 438, -450, 243, 181, -183, 490, -188, -75, 503, -495, 39, 377, -674, 236, 312, -864, 389, 217, -612, 408, -12, -384, 411, -70, -31, 264, -388, 332, 34]
1789C4m18Q98o73m51J321r44k13J012r60J05P42r46N78K54p70O87k62j87P28p37
1809b02J41N81j062P89K53j270R69Jq71J157l90n70Q50m95j78P71o78L02K29o62
1829c35P21l94l82R67o69m01J209j050Q2P32j019N14M43r76M99J48l72N73m56
1848a66L0N66p33M41L52j072R08L7j140J226l43p75J188n53m01R13p31J12L30
1867A89n88N28n1m51Q77n15l39J021r67J5Q87q62J79N24r35N49L03q84P15j69
1887B6m07O42n56J73N15q57O10K40j040R64K3q36R46l42m46R87q08j35O63o80
1907c18L66K02o40O24j91n96J040o80k34R50p97P0Q95j115M87M66r50O67L4p00
1927d20O84m27j51N26n05L52J78p72Q39k8q47Q47p4o57R44n14l83R57o31p7O32
$$ y = [34, -384, 514, -159, -610, 711, -233, -446, 566, -394, -289, 453, -493, 85, 339, -431, 256, -6, -193, 535, -202, -61, 520, -542, 247, 500, -770, 199, 200, -671, 486, 96, -474, 376, -119, -297, 474, -204, 98, 327, -335, 386, -8, -390, 577, -92, -493, 716, -334, -252, 480, -539, -25, 418, -558, -59, 89, -283, 290, -166, -136, 430, -303, 138, 490, -582, 326, 363, -777, 449, 106, -669, 519, -34, -435, 478, -253, -141, 189, -399, 129, 78, -373, 504, -11, -350, 671, -296, -281, 606, -256, -77, 447, -488, 61, 364, -520, 195, 26, -381, 261, -295, -122, 393, -464, 146, 386, -654, 310, 333, -503, 443, 101, -345, 642, -166, -301, 362, -318, 48, 250, -390, 234, 43, -553, 487, -193, -427, 523, -274, -204, 691, -424, 63, 529, -421, 246, 280, -420, 264, -163, -314, 212, -293, 59, 237, -535, 304, 276, -571, 276, 202, -455, 489, -25, -408, 549, -82, -159, 473]
1948D73p71M57Kn49N95l50k48R50q20r8Q50r01L13N89r53N23K19o51O31k4n50
1969c13O33l35j50N33o86M19Q7q22R26q2q62R98k45m26P94m62l37O52n36J67K79
1990B32n78N92j01m85P22n16j11P02p69O4P60r60M80M06q56N20n9l20O58n00p1
2011a90O57n97J19L45q01O66r9n97Q49m29m95R96n44m35R41o13M3N55n31J45J66
2032A51m90P06l38k70N95o83J33O94r36L15N54r42N89L17q81N99o1m30O90l68
2052e6k5M36o46M34K44p29O11j28n49P39m42k74P63n59j53P58o87J56M21o85M89
2073A18J10m67N41l83q9O59q79M02M59r83M17N38q97N81R3o90P44k86k84N73n37
2094b60J74M70p27M86j7n38P23j77n35R01o49l1P14p25N7M44p58N54J8m52M38
$$ y = [473, -298, 159, 161, -388, 207, -143, -391, 559, -261, -359, 491, -410, -97, 492, -461, 62, 281, -370, 261, 237, -313, 320, -15, -165, 368, -318, 101, 188, -634, 292, 210, -652, 346, 101, -325, 469, 7, -330, 322, -214, -47, 232, -346, 246, 145, -340, 382, -134, -245, 457, -312, -248, 512, -448, 32, 438, -418, 102, 43, -277, 381, -119, -190, 467, -130, -11, 334, -467, 199, 100, -497, 352, -77, -572, 424, -120, -555, 386, -227, -184, 371, -160, -15, 151, -339, 367, 29, -241, 354, -329, -196, 498, -438, -123, 431, -511, 78, 395, -486, 113, 52, -378, 312, -56, -81, 355, -291, 143, 387, -342, 269, 141, -408, 331, -111, -385, 378, -181, -334, 424, -263, -107, 314, -371, 118, 228, -239, 302, -81, -170, 489, -390, 12, 471, -512, -95, 443, -454, 127, 220, -470, 274, -12, -296, 277, -260, -86, 384, -343, 143, 126, -412, 311, 134, -401, 500, -149, -180, 534, -191, -134, 310, -448, 106, 124, -328, 110]
2115A10j74j25M94m18j32P04q30M44L32q47O08J73p13N56o8m80P11n00j0M45n95
2136c15L80J00n00O20j82l51N85l40l03P80o05j09O11o75K84L17p25N78j46l10
2156c06M77k68PN75p67K29M17q13N86J84p24N89l0m04M83j23l22M06k83n3M20
2177B80o31N20Ln89O40j37n14Q01m50j80O38n17K9M06n20L21K32m86L46k23j8
2198d9L40m80J47M45p69L12L56p29O36j4o86P18q7l94N90l23j35L18l33K13M7
2219A23m84N58r0l74O54n34j28O52n75L1M74n81J77L50m61L23l5l60M90l34O6
2240e8L98n75J89L53p40N63Q0o86N74M4m44O72l06l19N24m93J54K67l52K16O8
2261A29m04M90l14j34M71k74j80O00n15L8M62p43M05O9l07M93k61k70N29m06O9
$$ y = [110, -64, -189, 305, -113, -245, 459, -371, 73, 405, -442, 166, 339, -374, 182, 114, -366, 345, -155, -165, 280, -315, 65, 165, -335, 285, 103, -248, 337, -3, -306, 474, -131, -240, 371, -304, -20, 297, -428, 150, 4, -306, 171, -97, -90, 485, -282, -53, 364, -449, 137, 321, -403, 186, 156, -248, 235, 112, -210, 196, -87, -140, 280, -351, 169, 172, -417, 223, 86, -428, 373, -77, -257, 381, -136, -107, 299, -221, 100, 332, -154, 192, -31, -49, 291, -189, -42, 403, -366, -54, 302, -427, 209, 195, -491, 227, 140, -254, 336, 13, -122, 196, -137, 76, 123, -361, 197, 107, -267, 387, -147, -275, 377, -198, -167, 307, -274, -97, 253, -208, 115, 80, -280, 210, -124, -58, 340, -235, -46, 307, -433, 130, 210, -476, 98, 142, -302, 370, 64, -255, 269, -224, -70, 197, -155, 61, 129, -275, 215, -99, -233, 238, -36, -216, 384, -131, -93, 369, -374, 31, 100, -207, 286, 25, -245, 284, -122, -53]
2282e3K16m05K93K44o68N53m0m08N97k60l43M53j74j52L82l95K69J32m26K89j8
2303H6l69O35m35j42O03n88O0L97n86K06L59m68K84P6l62M59k96k0L61m01J59
2324A8K02m76N01j51m28M94o5m66N91j81k91M79m35J52K21l19L28j33k72L98r5
2345G2j84N08m63j35N98n79M4M31n64K38J65l81L83J6k42K39k73Q1K23m56K83
2366DJ67m42N20j39l66M44j7l78M72l59j5K72m15L32rl38K97K5k72M64l40n5M32
2389B84n27K28M61o95K13K63m91M12j01k93M29k77k6L71m19P7K35m09M02lm56
2410c22M72l9k85M22k92j12M51l19n9L01m35L06K2l20L90k64j10M15m04j3M82
2431B87m86K29J53m07K86Q2j84L06k16j72L52l94Q0K66l97K70M6l80M13q6l55
$$ y = [-53, 163, -242, 51, 295, -373, 180, 140, -268, 329, 69, -274, 179, 5, -147, 235, -160, 109, 241, -185, 104, 86, -283, 352, -83, -225, 378, -210, -150, 247, -339, -133, 226, -242, 42, 118, -244, 215, -81, -101, 260, -141, 18, 220, -256, 245, 94, -334, 160, 95, -371, 220, 39, -252, 227, -208, -56, 165, -154, 174, 41, -231, 167, 72, -112, 396, -67, -202, 396, -183, -139, 292, -272, -34, 131, -250, 133, 149, -93, 146, -127, -46, 177, -279, 4, 171, -271, 249, 110, -256, 188, 171, -207, 265, -94, -109, 163, -252, 80, 71, -267, 30, 55, -217, 247, -93, -148, 284, -243, -15, 446, -249, -36, 227, -264, 148, 47, -246, 183, -94, -120, 251, -168, -91, 144, -265, 137, 134, -322, 150, 111, -174, 248, -44, -156, 295, -24, -83, 218, -217, 89, 111, -209, 181, -83, -193, 222, -182, -195, 287, -199, 30, 183, -224, 62, 144, -40, 266, 50, -122, 230, -164, -84, 182, -215, 55, 101, -279, 134, 48, -307]
2452c07M30q7k89M99l69L8L04l57J18R5k49K58j6j71K14k67rL96l80Q5L06n68
2474c26L85J16k98K68j00k02L34k36n6M16m01J08J59l71L03q1l21M52j5n07N78
2495B05k71MJ21k37L9L41l69K46r4k13L48j79r4M12l09l6K30k68J16K21l60J46
2517aJ01l61M57j48j88K75k74J30J49j58K3R0l36L68j13k01L43j48k35L03j16
2538d0p8L37l45J67Q3k21J98k4j76L85l68L5K24k88R9J79l54J41J66l17L45k0
2560A28k97L18j06j49L45k90oK00l30K22J4k80N16l26j9K57l49m8L70k63M3K78
2582B28l24J26L4k21J96l8j8J87k68M1L10l55O7K15m40L31K1l42K49K7j42J91
2604G5l0j03J25k11P5J87k39L66j48j90L00k80o6L59k35j54M25l14R0N1k13J14
$$ y = [-307, 123, 36, -253, 246, -123, -85, 219, -138, -20, 75, -174, 84, 68, -103, 111, -156, -165, 231, -149, -64, 242, -326, 59, 175, -123, 145, 45, -157, 177, -59, -115, 301, -100, 8, 167, -204, 99, 18, -303, 149, 134, -373, 205, -66, -62, 59, -178, -139, 202, -167, 79, -15, -228, 120, -59, -153, 259, -50, -86, 144, -124, -8, 213, -147, -1, 100, -261, 196, 48, -140, 135, -139, -9, 140, -18, 5, 95, -241, 127, 14, -187, 156, 8, -227, 76, -40, -118, 219, -126, 41, 124, -97, 101, 77, -99, 286, -82, -47, 177, -111, -12, 167, -187, -46, 120, -197, 148, 128, -169, 149, 43, -106, 239, -51, -57, 143, -187, 35, 49, -231, 285, -41, -60, 197, -152, -200, 170, -93, -50, 228, -96, 30, 64, -157, 39, 1, -17, 170, -98, -57, 253, -102, -35, 180, -260, 71, 92, -250, -1, 26, -116, 75, 45, -58, 67, -144, -69, 118, -121, 245, 97, -93, 207, -73, -139, 220, -15, -169, 256, -58, 32, 83, -130, -16]
2626a6P0l5Q6k29o3L47j84P4J33l22K24j9k13L12p1l16L12k6j64J99k12J14J1
2649A2n6J52k6k58K66j48nJ77j53q5L51k45k2J58k03J64j04j05J79o8K5J89l78
2672a83J90J24l24K43j4r6J45n4j89K46n2j61K67j93L7J27j58K3m1p9K20j0k23
2695a55K74m6j21J76k74P7K24k97K37%k13J74p4m8K40k58j2J36j75J71O5k63K78
2718A16j33j60L35r3k78L48j17mK68k38J19j36j66R5J49j63K02j53K8L8j28K8
2740d3K6l9M1L8k95L13M6k09J42rj90K94k81J51Q8k33J92M5k40J52N9j72K54j53
2764b3kL5k6n0J65j76J14J10j94J80j94m4J57o7m4J60k22K4J02o5N6L2j07Q3j5
2789a1p3K12j74j66K57m6o9K34k02O4n4j46L11r3j40J33m2r0J16j8J0m8N2N1j41
$$ y = [-16, 54, 19, 105, -124, -187, 160, -24, 50, 183, -139, 85, 66, -147, 165, 94, -222, 90, 64, -100, 99, -113, 1, 12, -44, 108, 82, -176, 90, -58, -63, 114, -39, -124, 227, -18, -40, 118, -85, 79, -25, -130, 49, -19, 6, 195, -183, 7, 131, -193, 50, 36, -60, 85, 31, -158, 88, 36, -125, 142, -51, -14, 113, -45, -22, -63, -142, 78, 68, -155, 119, 73, -48, 128, -146, -69, 155, -142, 95, 95, -118, 56, -18, -66, 174, -84, -96, 40, -135, 36, 101, -162, 116, -17, -177, 158, 65, -213, 135, 18, 14, 282, 44, 163, 27, -139, -44, 105, -58, 144, -9, 19, 57, -71, -43, -17, -56, -15, 23, -272, 41, 87, -122, 20, 11, -179, 115, -166, -15, 73, -160, 32, 77, -163, -11, 48, -124, 130, -23, -25, 10, -16, -66, 99, -77, 37, 147, -47, 133, -61, -105, 52, -15, -59, 101, -121, -97, 5, -60, -4, 28, -79, 4, -11, -84, 128, -46, -212, 45, -1, -70, 164, -38, 26, -28, -174, 137, 44, -96, 37, -5, -95, 21, 3, 13, -35, 17, 68, -73]
2814g3n3K21j16O5R0j16p9P1r8LK24j96J64j16j32K43n6k51K12j0r1K00l11J88
2838a7P9k16J48Q1j89J61k8j15J42q4lR0q8L8j2j64J74o7Q3J17j38j5Q9p1L6N1
2864H2j23N0J5j00J59q3l7J34M7k39J74j08N6o5j41J42J31j29Q3j19p1K85j04
2887C9k38J30M1K9J32j48MP3j42N7J5k9P9n1K2J0k8L0R1j49J16k4m7p7J09j97
2913a53K63k05O7N4RM6m6n8J12m5j07K41k86R6K7k0KM6j59K27j7j23J20j50L2
2938b7J0L1j03O7j23P1R5j12K07j06O8k0Qj70K08k04J58m8p8J2J16j56J11oj19
2963a10J49l3m7J53r1j24J69j30J71p7n4k9M9O9p7R9j72J85j32J07l7j62J87n9
2987Do4P9L0j39P4j1Q4rP6j49O8J1m0j54O8L8k4L1l6nL0L2n5J05Q8j56K9n9q5
$$ y = [-73, -126, 95, -21, 44, 134, 18, -61, 10, -88, -85, 139, -57, 107, -9, -141, 102, 46, -205, 7, -3, -94, 106, -205, -17, 62, -154, -6, 75, -114, 47, 19, -96, 46, -38, -41, 49, -39, -1, -13, -177, -3, -70, 13, 130, -8, -23, 66, -5, 31, 82, -41, 9, 24, -76, 83, 0, -37, 97, 144, -95, 79, -29, 27, -38, -179, -37, 94, -35, 48, -71, -142, 143, 39, -199, -69, -28, 1, 133, -15, -11, 62, -80, -23, -8, -37, 42, -9, 13, 23, -5, 25, 116, -33, 83, 59, 12, -65, 44, -153, 110, -95, -28, 26, 35, 81, 35, -23, 89, 44, -63, 178, -108, -12, 15, -5, -3, 43, -116, 111, 94, -29, 91, -59, -27, -17, 14, -89, -22, -145, -74, 21, -91, 116, 10, 78, 58, 66, -104, 104, -100, 58, 10, -68, -56, 60, -96, 15, 9, -110, 39, 6, -41, 112, 21, -103, 66, -64, 107, 30, -24, -53, -4, 65, -12, 87, -85, 100, -32, 75, 38, -124, 63, 4, -60, 19, 49, -90, -16, -27, 57, 48, 124, -25, 43, 54, 14, -140, -72, -34, -58, -27, -63, -68, -38, -6, -61, 44, 132, -24, 5, -54, -139]
3016a39K20j40RP6n7J20m2J5n4N5o6j0M9j43K12n7j9l8n9J82o7n0rK3m6J9n7P2
3044al1P0j23N7Qo2K36k41J2K8P6k1j9N5m7l3Q7J9j25L9k2m3N3J48j68R5o5m9
3072f7J51n0P4j29J70q3m4KQ7q0m8J4L4l5P0J2j67R1m3Q9j45M2J69Rk49J49%r
3100A4n2O6o0N6K7j63J92j81J2J70j76N7O7ml2lOk7O4%j2J4l5M7n5J56j55k8J42
3129A07j27J10j12q9M4J16Mpp7J17n3j15J19j06L2L5l4Q3o6j29R4J53j10K3K6
3154C8m0l5L4j4l3R9K6j01R2j26N5q1QP5K5k1j01J56j13N1J04j22K7K2J27j30
3180B2K3j44J05n7J00j1o1Q3n8Q8j13Q0j25P2P3l4Mj08J04K4Rp6j2j2l8kJ31p5
3208hL1k0P3m8k3L4j7m1O7Pl1o9L4M5Jk1J2j20J78j11P3nr8L2N0MJ7Lk6O5k19
$$ y = [-139, 81, -59, -50, 26, -31, 89, 47, 62, 8, 63, -3, -13, 36, -107, 105, 48, 29, -9, -68, 114, 47, -3, -12, 11, -35, -16, -73, -1, -32, 38, -85, -28, -20, -82, 154, -87, -75, -47, 29, 8, -11, 44, -3, -36, 51, 70, -55, -16, -38, -81, -28, 120, -48, 47, -18, -67, 84, 34, 108, -21, 149, 66, 22, 24, 111, 31, -17, -3, 31, -4, 66, 78, -89, 2, -41, 48, -97, -55, 114, 123, -126, 23, 23, 14, -38, 28, -32, 24, 51, -112, 80, -101, -89, 81, -95, -38, 29, 25, -7, -10, -4, -31, 33, 33, 21, 35, 0, 47, -8, 148, -7, -35, 107, -20, 90, -22, -111, -67, 49, 53, 46, -31, 86, 33, -82, 37, -69, -37, -2, -36, 47, -19, -148, -54, 99, -11, 12, 38, -2, -37, -3, -17, -50, 49, 75, -26, 66, -60, -5, -86, -78, -3, 22, 1, -100, 56, -57, -6, 98, -24, 3, 25, 152, 22, 45, -99, 6, -51, 49, 38, -23, 60, 2, 90, -23, 57, -68, 4, 77, 43, 47, -61, 43, 67, 76, 0, -12, -24, -62, -64, 67, -8, 23, 3, 76, 28, 5, 39, 22, -19, 48, 55, 24, -45, -11, 34, 35, 14, 26, -94, 84, -27, 46, 41, -57, -25, 25, 29, 46, 49, 23, 88, -131]
3239a31J20m0kJ58l4j65P7R3k0jq2L0n3P3l7K4Mj1Rk10K11J1N4q3M1n1pN6q0K9
3269a7O8j31j3l3K14rj44O0R4j45j4M9k9K6MN7r4J42n5K1n3l0J5l6Q1J06j86O9
3297A7o6N6O8j79J71j05L3l3j4K9m3J00j68J55M1m8K4j22j4N9np3J63n5P9L9k6
3324H3j73J19m7J16q3J32k7j16K8J25j47k0m4L1O6m6P1p3Lr4M8J6M7qj2k9Mj4
3352d4j2j01J39J5O2k42K83j14q4J46K0l4O1p1o3O3j21N1j12J75J14j35P3%n6
3377A3P4p2K2R4j64j27J50M1mJ36j79J14j27J4pL1L0l5K1O5j28n2R5J5r2j07J77
3404bj9M9Lo1j2J29j01P8m5k7M7m3L1mj20J36p2lN1J9J7q9MO0k39K50np5J24n4
3434B7Q0j66K9J42j57J58M9j40J23j80J08j24K7J16r0O0k1r7PK04k21J7q8J19
$$ y = [-131, -11, -51, -53, 105, 71, -94, -17, 76, 56, 55, -27, 3, -50, 23, -14, 10, 14, 3, 12, -198, 13, 24, 78, -5, 36, -15, -22, 34, -46, -17, 51, -80, -93, -126, 88, 79, -65, -5, 89, -56, -70, -21, -50, -24, -20, 37, -57, 85, 30, 51, -2, -32, -17, -53, 28, 134, -52, 17, -49, 7, 75, -104, 67, -38, -5, -38, -52, -23, -66, 34, -134, 21, 62, 14, 38, -84, -98, -39, -44, -117, 46, -9, 70, 109, 83, -90, 29, -18, 98, 15, 147, 120, 4, 32, 157, 10, -10, -54, -23, 43, -3, 68, -5, -2, -96, -48, -32, 15, 7, -5, -34, -30, -44, -56, -157, -18, -3, 59, -183, 100, -14, -98, 48, 68, 34, 95, 24, -39, 24, -97, -46, -158, 17, 131, -4, 69, 69, 13, 87, 15, 37, 131, -33, -160, -10, 31, 27, 163, -16, 98, -29, -15, -22, 9, 39, 4, 25, 90, -38, -90, 5, 20, -72, -179, -2, -21, 28, 31, -30, -42, 87, -14, 64, 19, -8, 39, -4, 27, 23, -97, 39, -33, -36, 15, 34, 51, -38, -34, 26, -213, 37, 32, -43, 81, 27, 107, -59, -30, 112, -45, 113, 162, 22, 145, -35, 73, -51, -24, 92, 2, 62, 41, -56, -49, 155, -66, -49, -137, -18]
3458a8J30j51n8J17q0M7l2N9k3kN7J5jl2o3N5j18J06k6O1p5j6Q2lj4J4rp4NJ35
3488H8j55J60q1l3L9l0Q6m8j6r0J51m3m2J24o6j53M5L4l4J4j07L17j90M2P1j97
3514a14J31j71J54P1j24j5J36k6j35O4K6Q8n7r8J03r1m9J13N1r1Rl0J30n5j6m1
3540c7L1M3nk7j51J63N3p9L8j98J31P1J0j23Q2P0nr4rP1k5J2J7j28L7P8p6J05
3568E5QJ0j47N9j5J28j6k35J79j27R3N1j46J18l6k7j4M3q2J55N4k14J63j58J81
3593H0r1J30k10P5jJ18j5j63P4Q3o5Ooj2N2m5p2J08Q1j16J15j78O6mn2R7j35J05
3621B5k8j2p9J11r4P4M9ok2j1P5m9k3q1J70m7j36Q4k8L7j05N1p4K5J37R3j88p
3649e9J23n3P8k0m8n7jQ2j32R0J06j29qp2J56rOp8n1J66k13K2R6j9m7P0j26J16
$$ y = [-18, 112, -39, -97, 20, -60, -13, -45, 14, -9, -11, 46, 61, 60, 28, -35, 20, -98, 8, -18, 43, -32, -48, 34, 31, 17, 31, 22, -52, -47, 88, -67, 93, 12, -21, 18, -12, 74, 26, 10, -80, 71, 28, -14, 110, 44, -109, -64, -30, -64, -50, -157, 160, -30, 12, 83, -114, 17, -154, 0, 71, -53, -68, 68, 42, -93, -29, -3, 85, 28, -70, 33, -58, -107, 6, 57, -34, -25, -55, 75, 20, 4, -37, -6, 37, 32, 5, -146, 17, 70, -9, 29, -169, -38, 33, 43, -80, 2, 72, 67, -27, -36, 35, 10, 22, 39, -89, -52, 26, -50, 55, 63, 73, -74, -15, -30, 98, 82, -153, 26, -101, -8, 43, -103, 15, -21, -48, -62, -19, -101, 54, 108, -106, 57, -101, 80, -11, 119, -91, -16, -17, 101, 86, -77, -3, 80, 15, 21, 15, 3, 55, 10, -62, 46, 127, 11, 126, -52, 14, 10, -42, 55, -80, 25, -3, -15, -94, 17, -77, -3, 46, 40, 18, 7, 82, 33, 10, -71, 99, 52, -84, 0, -28, 9, -96, -45, -119, -94, 43, 136, -52, -59, 64, 11, 89, 69, 21, -36, -37, 45, -87, 3, 109, -20, -28, -100, 56, 47, 53, -25, -76, 90, -123, -101, -5, -24, -71, -1, -127, -11]
3677a1M1L2K5m1J7L1l1j52J69j04J33l2l4j01Q9n3m0J82j32L8j03P5K6j4l2j7
3703c9r4J22Q2om4n1J03p1p8P3lq1Q2M5l3N1j35mJ39j08oJ25j36M2r6J30l6N7
3731C0nj11J34j00J31q1R7j18K7j1Q5r8n8J73j13k3O0k1jL1m0K7q0P1rl5j3N5
3759DJ6l8P9P3j23j1L4P9k26J9Q8J4Q0o7q5RJ10J3l8l4O1m9Nko0O7N6p9r3P5J9
3790dn8J08j21L5oJ17o1j07J2M6M9j28N4J46k12J39k2MM1q3J08n7J19j59P4J4
3816D8p2lnP8l6j0j26K05r4j8j9J77r0j24J17J3p6J00p0P6r9N4M2q6k8R9p8L8
3844A3J3p8L3L8j6M3o0%oO6j44O6J18j56J00J1n8J48j74o6R2RkR5j76R3O0j16
3872e4M5p4J55l2r1J08p2Q6l4Pr0K4J0j35P1Q3RP2k05O3O0M7k1j23K1%K2N1l4
$$ y = [-11, 30, 62, 87, 46, 63, 94, 63, -89, 80, -24, 109, 77, 43, -58, 31, -22, -62, 120, -12, 26, -77, -2, 24, 10, -22, -39, -133, -11, 71, 65, 21, -30, 73, 2, -76, -3, -6, -87, -5, 40, 7, 58, -77, -81, 58, -50, -56, 69, -67, -25, -121, 9, -27, 30, 25, -86, 48, -52, 79, -2, 95, -23, 4, -7, 78, -20, -78, 95, -18, -41, 19, -2, -3, 28, -12, 15, -65, 6, -3, -38, -51, 4, 20, -18, 61, 134, 11, 0, 34, 113, -113, -94, -6, 8, 88, 21, -64, -55, 55, 68, 30, -4, 57, 8, 13, 11, -49, 18, 74, -5, -98, -23, -4, -62, 46, -75, -40, -46, 71, 10, -97, -85, -39, 10, -118, -64, 82, -130, 9, -13, -9, 32, -51, 57, 0, 119, -40, 34, 48, -24, -27, -32, 46, 10, 0, -126, 79, -15, -33, -52, 125, 35, -89, 28, 41, -35, 65, -5, 71, -28, 26, 68, -18, -46, 53, -25, 13, 26, -52, -19, 19, 3, 46, -14, -14, -20, 46, -98, -32, 86, -70, 30, 41, -17, 131, -43, -109, -17, -8, -10, 85, -91, 2, 62, -54, -9, -83, 72, 40, -51, 57, -15, 71, 37, 44, -46, -22, -12, -147, -76, 7, 16, 88, -117, -54, 6, 53, 32, -91, -70, -70, -48, 3, -31]
3901c1k2P1q2l6K12j08o5J24j40l1J73n5O8q3K0q7J49j15R7j12k1M7K3L2m4q7
3927a03K24j8o9Q8j45j01J96P1l48L54j42j11J07rm5J7L7l4rrJ03m2j41J13M7
3952C1n4K6o6N6o3P4K4P0m1RJ05j63j04RJ36O6j30m8J3J4k8M5j14J91j9l0K9j61
3980a23J15P8k9L8l6m4o2Q7j00O7m4m1Q3qq6J80j37N8J24j19J23j99J23o6M1j9
4006DM9J0j99J55%J0Nj32O8M9M0p4K0o2P7J21j86M3o4J01q5L4M9j09j6J04n8O3
4034A7M7q5m5J62j32J7Q7r3J85j79L4Q6m9j46K27j49K5l4k3J18l2K4p0l4L4K8
4060B0l1j7Q2m9J7m0LpR4j59Q9J04j10q5J08P0k9k5Q1n2j25R4L3j94M3J07j04
4087h2J1P2j29K19q8Jj32R8J38j10j7m4J47n7K8ro8P3j8l3Qm6K4j2p4J79q5k0
$$ y = [-31, -53, 18, -64, -100, 112, 4, -61, 63, -77, -108, 65, 10, 78, -5, 15, -72, 77, -38, 59, -53, -74, -27, -4, 28, -16, -103, 121, 103, 34, 122, -23, -124, 72, 143, -205, 149, 7, -104, 3, -6, -51, -34, 3, -31, -40, -49, 54, 12, -129, -16, 31, -23, 3, -63, -7, -70, 4, 28, 98, 57, 66, 171, 8, -96, -87, 49, 115, -15, -63, -50, -36, -64, -19, -133, 58, 39, 9, 38, -123, -8, 70, 41, 79, 43, -1, -63, 24, -76, -9, -53, -94, -11, -19, -105, 75, -62, -4, 120, 1, 124, -75, 48, -18, 23, 4, 53, 63, -136, 19, 19, 29, 34, -98, -30, 19, 59, -15, 5, -57, 20, 141, -45, -2, -66, 35, -50, -16, 33, -76, -92, 12, -46, 17, 64, -21, -66, 96, -36, -19, 68, -25, 160, -19, 15, 101, 52, -94, 133, -16, 9, -25, -48, 70, 38, 62, -8, -42, -8, 20, -11, -28, 54, 5, 22, -18, -15, -22, 72, -87, 2, 106, -4, -89, 19, 89, 60, 35, 116, 64, -61, 33, 66, -128, -85, 22, -82, -71, 1, -128, 91, 3, 4, -128, -30, 108, -2, -19, -63, 84, 27, 55, 46, -22, 51, 33, 0, 8, -38, -14, -26, -100, 79, -6, -26]
4115b6R6o0m0O3pM1r8L2p4L9o0P3j02J05P2q5O7O3j15k6N1j45J18L8j05J04K8
4142D7PM1o1K2M2j41m8J21l9j3P6o1P3m4p2J43rj44M6n6J70q2l7O4r3L0N9kM3
4171H2mJ1p7o7J03p8J49j24R5m6j58J49j8o9J66l5k7j11O7n0N4r6O2J6r9J75n9
4198A1j60Q3J23L3p6j0K0k8M6M4l9o5M7n7o9J71j4o5J3m2J1K4O3k06K25n6Qol8
4227iRk0k3N3r5J22N4m9O2j50N5LL7LJ3j39O2P0j11R5P5q6J9l2n1J46j47L1j9
4256b2M2o7Q8p8K51j16j53Q7j69J47j7R2ll3n9o4M4O3n5J1q2J71kj45O1O9o3j50
4284a52J08j32K36K3j10P3p9J19m4q7R6j38J57j08k5L7R5q0K3l1J25j32j59K35
4308E0k3Q2q9L7q0L0Rj0Rn8L4J49k30J9M6p4M1O1Jj9M7L8j15K5J9K0n2R1Nl8M2
$$ y = [-26, 70, 10, -30, 33, 26, 67, -31, 1, -73, -34, -94, -21, -123, -18, 54, -31, 36, 99, -16, -42, 9, -136, -18, 20, -85, 19, 47, 54, 95, 34, 56, 98, -43, -91, 30, -9, -22, 54, -7, 66, 22, -50, 93, 84, -60, -14, -70, 100, 18, -19, 45, -48, -18, 41, 39, 82, 78, 89, 12, -55, 48, -30, 119, -5, 90, 44, -114, 35, 17, -52, 114, 79, 52, -59, 8, -42, 12, -84, -22, -6, -105, 70, 11, -149, -66, 57, 90, 14, 4, 24, -4, 42, 86, 47, -18, 29, -28, -97, 74, 60, -5, 8, -34, -23, 1, 64, -142, 83, 27, 35, 29, -9, 0, -20, -43, 10, -85, 37, 91, 42, 104, -46, 9, 12, 49, 52, 65, -74, -12, 58, -53, 42, 117, 31, 50, 18, -33, 113, -34, -3, -22, 20, -47, 41, -37, 214, 98, -55, 32, -137, 10, -7, 85, 82, 49, -10, -74, -30, 33, -22, -11, -93, 78, 76, -69, -8, 61, -2, -152, -44, -176, 60, 83, -27, 46, -33, 86, 42, -45, 51, -87, 70, -38, -63, -26, 69, -11, 12, -19, 106, -26, -185, 50, 27, 109, 20, 57, -23, 7, 16, 6, 15, -43, -9, 140, -90, -71, -25, -99, -58, 3, 4, -15, 32, 70, -45, -20, -1, 19, -33, 58, 63, 25, 67]
4339F7k6l0J7pq4O4M7K9j14k1KQ9o7R6M4j82O5j3M0N0n3j35J25J0p8N8N0l2N0
4368F1r6Q6J8Jj00K5n2J14j35PJ36O3j24j7j3N9K0o0J56j01j45L08k18R3j55M4
4394b5m6J18J5j01M0r3R0P2j38J04j01O4J90j93m4k2J30Nn5n5J39m4n9J14j36
4419c1rP3p7J02k7j20J36p2J1K2l4r4J22Op9n3J48nk5K2M1Qj80J96p4L7q7K1j4
4448c6M4r0J10k4n6JJ85k70K36o2m9J02j82R5m2p2Q6K3l2J8p3L9J13j3j24J76
4474A03l9p6q4J41k8l7N0m8j0Q1n1K4q1K1k6k0O6l6O2K8o7L4L6l9j0J5LO6q5Q8
4504H1k9j11O0J9L2L9n0q8J13q4N2J27j23M7L5o2Mo0J7L8k2m8J61j38J5N2j39
4531f2J98j45j1J4M2j52J07p2J61n8j8P7k07K16j08N9p6P3j03O8R5P6j30r7O8
$$ y = [67, 41, 11, 28, 21, -63, 1, 48, 77, -37, -58, -56, 33, -34, 62, 106, -76, -11, -24, 16, 66, 13, -122, 3, 13, -65, -7, 43, 11, 61, -35, 51, 69, 70, -30, -5, -57, 57, -78, -71, 65, 128, 4, -13, -26, 33, 53, -7, 149, 48, -97, 211, -7, 86, -69, -25, -71, 47, 62, -39, 1, -92, -2, 70, -68, 36, -65, -1, 189, -4, -48, -70, 60, 65, 10, -45, 94, 50, -9, 105, -31, -40, 33, -44, 58, 31, -89, 47, -25, -14, 8, -26, -120, 2, 8, -71, -124, 24, 19, -6, 16, 57, 65, -115, 81, 7, 44, -43, -22, -36, 8, -82, 28, 4, -52, -51, 134, -136, 100, 38, -11, 91, -91, 4, -38, -110, -24, -1, -33, -15, -88, -49, 64, 51, -73, 103, 64, -12, -96, 45, 17, -20, 30, -18, -28, 53, 2, 26, -55, -34, -60, -80, -14, -50, 12, 40, -27, 7, 43, 4, -6, 9, 12, 78, -7, 81, 52, -59, 1, 20, 52, 91, 41, -47, 66, -18, 34, 161, 38, 85, 120, 58, 62, 2, 19, 57, 35, -13, 148, 10, 25, 77, -62, 136, -9, -20, -6, 36, -116, -9, -81, 80, 22, 4, 81, -126, 90, -18, 41, -35, 38, -65, 3, 98, 174, 44, -53, 15]
4556A5n8L7l4Q5j7o9O5q4J0R1j5n1P9k4n9jJ33P5k27m9J71n1k4J42j52jJ2q8J08
4585A9K1r9O3Kj21R8o6j0Q8O5m0L1r4M4L4k24J81J04j26J9k4L3k9Q3k8L3j16Q7
4613B8J30k56J22rj96K71j1m1j73J59qO2J8L8r1r0K42j13j33Q3j00P6K0j76N8
4638i0R0l3j9J06m5l9R0p9L4J00r9j6qQ5j37L9R9j09m6m2P3p8J58j07pN9l6r6
4666a53L21j71OQ7j76J38l2m1k3j18J21J35j57mN4l0J07j8n0M5r6J20ll0p1J09
4692G0m5J0L0j43R2K3j95K07n3o2J24j22RN3p6Q2o7nJ39o8N1j1j19j2J64j02K7
4719AJ52j33J5Ko0j06N9P5R8j16O2j1n7J4K2p4J36r3o2R4j05J8J39j78J24M8m4
4746B0r0J21j7J6j02l7l3N1O2J40o9j03J31k05J76m2Q9j32L9J1o3L1L4Qj50J84
$$ y = [15, -43, -6, -40, 45, 28, -41, 24, -60, -50, 41, 26, -25, 54, 30, -29, -30, 103, 178, -49, -98, 73, 22, -2, 140, -12, -13, -1, -89, 19, 40, -59, 4, 6, -115, -17, -83, -93, -5, 60, 20, 51, -43, 1, 35, -189, -8, 96, -30, -11, -35, -2, -31, 52, 24, 57, -59, 28, 158, -98, 24, 15, -181, 90, 79, 38, -135, 24, 16, 78, 96, 134, 43, -47, 195, 82, -51, 32, -68, 8, 28, -148, -90, 0, -33, -52, 54, 9, -30, 60, -19, 15, 115, 16, 0, -8, 77, -60, -21, 78, -31, -77, -119, -46, -124, 34, -73, -80, -21, -57, -153, 168, -3, 3, 90, -86, 52, 20, -21, -44, -162, -41, 94, -63, -67, -13, -43, 64, 46, -4, 41, -55, 65, 62, 32, -39, 70, 25, 35, 65, -78, 14, 37, -158, 49, -4, -66, 58, -64, -55, -2, -78, 4, -63, -68, 71, 3, 54, 43, -76, -88, 76, -26, 1, 153, 20, 35, 37, -23, -129, -70, 5, 103, -13, 49, 38, -19, -5, 17, -57, 79, -14, -76, 18, -87, -69, 70, -108, 16, 64, 20, -70, 51, 34, 50, -52, -89, -122, -71, -9, 131, 62, -41, 90, -115, 61, 19, 108, -24, 15, 26, -37, -6, 28, 36, -114, 70]
4772G0o7m3R5r7M8N5j04J03p5jO6o9J14j62K11p0o4j18L3P6O9n0J3o2K4rJ13k5
4800G4q6J7m6Q0n7J20r3q4J01p8R2Qn8Q5M9k99K02R4j89J75j48J67j0j80j8J2
4826g0j02K44K8j31K8L2j99K18l6o6J66j10oK6k9M8m6j0O8J8j27OK9q8L05j63
4852C3K8p3j42J40M0r4K04j77q1J48J0m4N7n4J4j3nJM8r3M2o0Q4J09j40J0J34
4879A26j73p5K10k42J94o1j7R9q2k2K1l0L5R5j04P1o5r7J17M5m1L2l6J0L4r9J27
4906G2j69P6M3M6o2Nj6j4L5K9pk8%M8n4p1J28M1j71P1j2k0M0J11j31J8Lj0J8j3
4936FJ18kk42K05j64J05k3K3n8J78o9K4m6j66J81l1j85K40j21r3K19k73J80r1
4960h5M0O9Q0q9N7j18m0J03Kk8P4j38N9L0j22J48J6p9J06m3l4Lq4j8K02j58r8
$$ y = [70, 3, -40, 55, -42, 6, 61, -43, 60, -15, -16, 50, -19, 95, -67, 144, 74, 10, -108, -75, 1, 70, 20, 33, -29, -5, -14, 99, 74, -12, 5, -41, 39, -18, 102, 9, -75, 26, -52, 40, 48, -10, 75, 124, -175, 27, 121, -68, 107, -41, 126, 116, -64, -82, -70, -172, 72, 100, -31, -3, 29, -170, 48, 12, -54, 112, 2, -4, 22, -7, 41, -5, -15, 53, 71, -56, -50, -21, -109, 196, 33, 61, -12, -154, -14, 26, -68, 136, -41, -122, 26, 36, -8, 49, -5, 9, -4, -9, -8, 40, -53, -11, -71, 13, 122, -18, -8, 126, -47, -122, 88, -154, 40, -21, -38, 61, -21, -43, -22, -52, -17, 78, -26, 45, -20, -117, 0, 45, 4, 36, 0, 10, 44, -55, 72, -97, -21, 22, 68, 6, 11, -5, -19, 16, 45, 38, 10, 10, 58, 4, -67, 61, 102, -69, 2, -10, -30, 10, 121, -10, 8, 11, 1, 19, 6, 124, 122, -120, 85, -79, 26, 3, 26, -32, 146, 77, 101, 55, -111, 70, 39, -146, 94, -27, -120, 99, -174, 6, -85, -45, 24, 104, 15, 72, -46, -86, 17, 19, -9, 65, -73, -14, 16, -106, 42, 58, -21, 85, 42, 8, 11, -73, -91, 111, -47, -145]
4987a45J21L6k9O7r9N7J2PM4j69J09Q9j64J59j4p4o5J11p6J10Kj68J8R4L1o5L1
5014C0l1j8m3M0M3L8p5L7m4Q8j25J02oj47J32K5j23P7m3P7L9j31N1P2j5p9M9l6
5042a6J4K5j19Q3K1q8O1m0J22Mk03J47M8j35QJ87k35K0J49L4N1k00O3O4j46L1
5068e0M1O6l3l1q0J21q1j2J45j38r4K98k12L7K7r4J03Jj08J22J1j32J41j78J5
5093a15J56p8PR3j01J39j19K9J1p6j2N9N2n9n1m1P3k6n6J16J41j62O4k06K22j9
5119D1n3q3P9j66R4J11rP0o0j21J03P2j06O1q9J10P0j54J12Lj88J91kj20K09j97
5145b2q2K18j60J1J98k25J03j3OO4j67o4J76j04J3K03k01P6rn6j04J02r8K48p7
5170C6j23J36j18K6J84k13J46m0q8J21j3p7J18q1m8J02m5o7J36k33K10l3k1P1
$$ y = [-145, -24, 12, -17, 50, -49, 8, 20, 27, 71, -98, 11, 100, -64, 95, 81, 7, -58, 53, -23, 87, 89, -79, -61, 33, 64, -1, 30, -1, -19, -62, -22, 21, 59, -16, 21, -23, 65, -60, 42, 36, -111, 21, 46, -77, 0, -43, 34, 73, -58, -7, 65, 50, -29, 20, -16, -2, 23, -96, -13, 8, -80, -19, -59, 63, 67, -136, 11, 59, -76, -68, 119, -116, -96, 53, 87, 138, -62, 1, 65, -81, -50, -9, 57, 24, -7, -87, 34, -47, -59, 86, -52, -146, 152, -60, -23, 4, -90, 13, 14, -94, 28, 39, -93, 48, -130, -115, 41, -37, -30, 63, -38, 101, -18, 11, 22, -54, -66, -7, 45, -14, -65, -106, -33, -59, -115, 1, 142, -20, 44, -162, 60, 41, -12, -95, -16, -182, -88, 23, 14, 84, 24, -97, 6, 78, -28, 33, -56, 54, 124, -30, 82, 85, -103, 88, 86, -34, 175, -22, -104, 114, -46, -35, 163, -62, 41, 28, 34, 98, -69, -133, 43, -61, -48, 155, -46, 30, 21, -35, -139, -37, -135, 113, 36, -87, 49, -69, -43, 141, -72, 74, 34, -54, 67, 54, -23, 95, 14, -34, 68, 23, -44, 92, -141, 69, 36, 15, 86]
5194H6k2j94Q0J61o2J0kq7O1k7K5n3J8K9K5L1j9j71J67J17k12J5L9M2p2J63k09
5221f1J28q0j35K54j50j3P1m0Q3K9o2j1J24k24R2j04L4J00j63J99m3r3Q2n5m0
5246g8N1J8q5J81n5r0Q2p7N8J02k76J56M0j55J48l2%K1j5r9P9%k1J79j34lO2j37
5274h0J45j00m4J03k8o4R8o5j3J01k6K6P3j98J69m8o4J02oo1N8q4M2nj58N7J07
5301C7M1l9J5k53K15p2m4J38j01J32k4j16J14K9r7J59r8p1M7M5Jrr3P2K2k15J75
5328A0m7n2J07r8N5L0m5K2k6J9O4J09k36Q6k3l6J18j59J66j0j64N8J67j59J44
5353A00j34l5Q6j4%Q0l6j67K07q0P9Rk22J27j5k9J04n4O0n6j01J16R1j58O0R2
5379A10o9m6R9j66J59k45P2R4j8P3l2J1M2j2j31R2m3l4M0M8r3J41n3j43P3j31
$$ y = [86, 64, -130, -50, 111, 49, 59, 57, -30, 31, 4, 29, -24, -6, 23, 48, 79, 60, -111, 56, 173, -39, -24, 15, 57, -15, 148, -61, 67, -13, -148, 106, -44, -57, 14, -26, 57, 86, 24, 13, 137, -87, 5, -99, -65, 35, -128, 71, 28, -65, 17, -38, -78, -27, -9, -94, 87, 32, -58, 24, -53, 5, 107, -169, -13, 27, -128, 20, -12, -12, 9, -6, -105, -26, -26, -47, 132, -2, -5, 57, -80, 65, -35, -79, 24, -4, -68, 30, -35, -48, 53, 27, 53, 126, -72, 97, 49, -15, 87, 81, 20, 78, -6, 36, 31, -127, -70, 37, 78, 39, 54, -199, 16, -56, -100, 38, -63, 69, 45, -71, 43, 72, -25, 134, 36, -35, 12, 57, 58, 49, -44, 28, 50, -165, 10, -37, -89, 18, -80, -25, 5, -40, -18, -44, -25, 39, 148, -88, -2, -25, -61, 57, -102, 64, 54, -110, -52, 115, -44, 100, -34, -69, 17, 3, 3, 83, 47, -120, 87, 7, 86, 95, -127, 0, -15, -44, 60, 6, 66, 10, -91, 25, 116, -42, 18, 110, 41, -5, 94, -72, 87, -158, -86, 8, -10, 63, 31, 42, 84, 72, -59, 33, -10, -44, -4, 44, -49, 92, 39, -104, -31, -162]
5405a62J59J51j81L8q0J7J36r8l0Q9j27J19J0j27J88j5j27J50j53P1K2j41K2J88
5429A19j78J27O1j88j1J63j64J39j32N9l8L9r5P3P8j14J07j36K55j32q5J00Nj31
5453g9K48k04L7Q1p0P5j41rJ08o3p9N8k6J00Pn7l8R4j59J29K12l03J08j1j64J26
5479b0m1P2J57j24j02J49j94J17L7o6q1k5l0K47j76J30k0k0n2l9L7KJ8j16K44
5504A04r7j56J28Mj22J75L6r2O1j3j15J44o2J28o1j26M5J9N3Nj51N8k9j02K04
5529C8k6k2M4n6pK12k31L6l0j10J36J75k07QQ2l5O6j36J80J60m08J20Q5j94M2
5554g8P4n3J37Lj93J38n1j0J13rq1lj4L2m4kk0O0p5M5N3o4J75j32O9r3j10K09
5582G6J2j76J95Ml6n2o3O9r7Q6J00O5k62L0Q0n5Omn1J54k03kJ63p2j1NN3m0J04
$$ y = [-162, -3, 148, -33, 5, -75, -58, 78, -20, -50, 39, -88, 31, 41, -86, 102, 87, -40, 110, -43, 28, 50, -91, -69, 119, -59, 68, 129, -59, -70, 93, -71, 68, -64, -5, -43, -4, -99, -26, 52, -62, 45, -91, 164, 32, -53, 47, 52, -79, 169, -35, 2, 83, 13, 88, -53, -62, 46, -17, -96, -38, -64, 36, 43, -14, -52, 42, -117, 12, 224, -79, 29, 18, -146, -20, -61, 11, 168, 44, -58, 91, -103, 14, 51, -15, -96, -121, -151, 96, -80, 50, 30, 10, -42, -81, -44, -42, -24, -140, 104, 7, -149, -21, -17, -139, 36, 72, -20, 41, 28, -87, 57, -5, 123, 62, -64, -19, 0, 53, 58, -93, -35, -64, -166, 38, 12, -10, 34, -22, -29, 183, -48, -12, -42, -152, -16, 159, -48, -40, 42, 7, 73, -63, 117, 277, -131, -11, 74, -120, -78, -4, -57, 80, 83, -110, 28, -23, -33, 80, 71, -10, -13, -27, 5, -39, -41, -61, -1, -76, -31, 22, -42, 133, 1, 70, -23, -133, 76, 88, -88, 107, 111, 75, 23, -40, 29, -68, 18, 118, 183, -79, -49, 31, -24, -18, -22, -73, 81, -122, -124, 39, -33, -44, -39, 14, -26, 78]
5611G8j89J43j11j0J11J6n7J47j07j2P9j12o0J67j57k6R7K7o1Q5n8O0j82J32m8
5636d8l4K29j37j63J73j96J85n2j06J43L9p3P4m4j78L18j32j71L34k11N1m0OJ8
5660a5O7n1Oq3j36K74j30N4O0j5n6P0L3m9m6j8J27n7m1J7r0k0K05j69N9J47k06
5687f3Q8k8J9Nj9k8mO4r8Q0j16L8J68j46J13j02J9J05j47o5K32j63M8P0j13k4
5713f7J30j24N6L2o7K2l9l3J55j92J79Rr3l4R4j9j00P4j00J68J2r9mQ5j55K64
5739A54j02Rr2O5k4Q9j57J11r4k6J42j20K0Q3q0L6o7o5J76j7k12K61k6q0K5Oj19
5766a04K53j71m4R1n1P7n4p4O0k5m9J35L8j5k21J92l6J0O2Oo7q4J94r0m8J62j93
5793d6L9M9k07J22J33k21K14j51J01N2l1j25J68j44P4J27j72q6Q0p7Q9Pm0J09
$$ y = [78, -111, 32, -79, -89, 22, 38, -19, 128, 21, 9, 88, -24, -84, 83, -74, -100, -3, 24, -37, 48, -10, 50, -132, 0, -48, -82, 147, 10, -153, 20, -176, 9, -43, -149, -6, 33, -40, 34, -10, -188, 130, -2, -173, 161, -50, 1, -39, -33, -15, 52, 1, 7, -76, -212, 62, -68, -14, 46, 31, -25, 45, 78, 29, -17, -35, 92, 35, -6, 11, -79, -99, 106, -63, -4, 143, -63, 25, -3, 16, 21, 2, -26, -30, 34, -64, 16, -100, -62, 106, -40, 73, -29, -10, 95, -52, -117, 115, -48, 0, 70, -43, -67, 63, -61, -5, 27, -40, -18, -57, -90, 65, -127, 52, 61, -32, -66, 28, 9, -91, -17, -117, 51, 63, -36, -40, 45, -110, 154, 52, 61, -31, 34, 10, 99, -58, 53, -41, -67, 75, -45, -25, 58, -22, 14, -53, -118, 58, 41, -171, 90, 64, -16, 9, 15, -104, 149, -22, -66, 25, -26, 51, -3, -77, -17, -42, -91, 44, 82, 67, -154, 38, 2, 12, 74, 80, 13, -71, 123, 33, -15, 147, -46, -7, 42, -165, -43, 90, -131, 83, -68, 33, 85, 54, -71, 97, -47, 27, 154, -18, -104, -24, -101, -12, -5, -45, 64]
5817F4p6l1N4l8r6J68L2n4J5j10J4J2J9P2j79J43J04j86J04O4j90J36J38j93j7
5842c1N7p7J40p8j9J09j69nO2J0qj08M1n4J32j05J70j73N9K85l11Q5N8j80K48
5867A38j23j18Q3j6P7k3L0j00R8J2rj2q5N6j0o7J04m7o0J22n5O3Kk19K04L5r4
5894a4M5j1P1j06o9J00O8j45N1O7j64J21J9rJ8o5pR7k6j04K11j65J14j6j20LK38
5921B02j58Q1j8r9L7Q6j17J21j38pP9j24J78r0j12J09n5P9p6RO7K1j08j3Q0m1
5947gQ5r0M7P1j80J00j31L0J71j12LQ3N0k09J45m6M1l0m7L6k1M3K0l9j15R9j2
5974a5r0J64k02N2L7O5m4J7nl4J17j73J24j2j32J56o6J49o9p9J16p2p7Q5J1o5
6000d2j0Q4q1J4N0KO8r0jj27J87JK3j12L7l9R6q5N4K1m7l6K3m0L5j4L5j39K05
$$ y = [64, -12, -43, 11, -27, -123, 45, 77, 23, 38, -72, -58, -46, -27, 45, -134, 9, 113, -73, 31, 95, -95, 41, 179, -14, -31, 26, -51, 89, 11, -8, 101, -68, -73, -11, -1, -9, -117, -76, -130, 2, -103, 67, -106, -47, 238, -73, 12, 70, -110, 138, 15, -103, -20, -36, 41, 18, 48, -52, 46, 58, 49, 37, -48, 8, -2, -69, 35, -12, -72, 50, -5, 58, 60, -159, 45, 80, -14, 31, 20, 91, -15, -84, 16, 84, -61, -10, 57, -107, 14, 33, 24, 42, -23, -30, 67, 41, -63, 148, -17, 97, 81, -39, -36, 202, 44, 125, 107, 8, 45, 131, 14, 135, -3, -10, 69, -55, 123, 33, -79, 30, -25, 54, -22, -13, 54, 75, -33, -46, 34, -7, 78, -12, 35, 106, -74, 26, -105, -75, 96, -16, -13, 70, 120, -89, 56, 10, 51, 21, -26, 10, -11, 32, 52, 13, -102, -3, -15, -105, 59, -143, -91, -54, 11, -33, -16, -21, -55, 62, -111, 13, 1, -131, 25, -41, 108, 39, -40, 76, 4, -73, 12, 23, -42, -52, 32, -49, -35, 15, 17, 85, -5, -6, -133, 54, 55, 78, -34, 3, -36, 60, -25, 29, 50, 3, -33, -10, -50, -15, -29, 6, -133, 72]
6029G2M3j31K9l5J8K7K2k2K3n3L1Q4k28J27on5M5R6j33J04m2m6L4q9O1J35j60
6056d9k9OjM3jP3mn8J8Q3j21L7N7q1QK1OL2j1j3M0r1J4%PQ0o3N8o5P7j17J35l3
6089E8l9j0m4M1K2j63J21P9j95J42M0r8R3j75R1lJ3J6j12M9O0J66j93N0Pq8J38
6116F6K9j74Q4j1J71k39O2M3m6j10J91J6m8P1j36Q4k0n9N6PQK8O9j19J4p2O3M4
6144G2J4q2l1Nq4J97k8l0r3J9L0p0k1J43j83J0J91r4LJ33j42K7Q5m2%j24N9KK6
6173hK2Rj3K3J2j99K51j55R5m3o0J74p0o4m7J4N9N9j11N1O4R0j93J05j18qJ16
6200E5r1K0K0nJ16j43L4K4j30M0J13J26j66q6L0J33j27pJ67r8r0Q5J7p0R2k4n6
6227b1l8J14q3J07o5n1K1M5l9l6J26j06J70j72P4j01m1N0l2Q4lp1J59k76P4N5
$$ y = [72, 115, -16, 13, -22, -4, 23, 45, 23, 46, -7, 24, 108, -120, 7, 1, -54, -9, 87, -46, 58, 16, -30, 4, -85, -24, 111, -49, -78, -72, -73, -30, -31, 42, 38, -20, -2, 81, -40, -3, 54, -27, -19, 2, 8, 40, 29, 16, 56, -35, -21, -21, -14, 66, 3, 61, -4, 73, -44, 91, 58, 19, 9, -35, 6, 28, -135, -14, 65, -130, 12, 52, -46, 47, -128, -37, -40, -27, -11, -123, -74, -14, 152, -41, 9, 16, -72, 66, 95, -79, 5, -6, 165, -74, -12, 31, -15, -125, 66, 82, 34, 105, -31, 53, 33, -26, 30, 37, 45, 73, 142, 23, 37, -35, 28, 72, 86, 4, -27, -22, -106, 91, 63, 33, -60, -41, -11, -81, -102, 41, -142, -132, 59, -35, -32, 101, -41, -14, 71, 29, 29, -95, -36, -34, -8, 14, 23, 10, 33, 45, -154, 97, -58, 37, -6, -66, 108, 38, -26, -73, -59, 0, 59, -52, -1, 63, 153, -40, 65, -53, -61, 55, -36, -16, 4, -1, 115, -28, 6, 30, -100, -60, 53, 179, 13, -73, -43, 90, -37, -44, 123, 25, -65, 20, 37, -33, 59, 35, -21, -59, 55, -28, 79, 14, -37, -16, 29, -10, -46, 80, -26, 144, -28, 46, -55, -96, -46, -78, 6, 3, -68, 91, -185, -111, -56]
6253e6J47j35oO1j19R8L3o4K5j2K5L6J7n1k0P0k6o4n2M7O8j7J3J7K7p9k2L1j12
6282a20K14n2m3K8m6O1j7L7j10JJ49k35J34K3p5J06j99K56L1j08j3R0r4mPO1L6
6309A18j30j56J76N8j21J06j99J81j15J38qj10PO4j23P5j4L4J6n3P4j07k2K4J37
6334E0m8l7J29j25K6K6q8J00j7m2J04n9j5k5j2O7Q2j38K7l3n2M2Q0j41J45m6K2
6361B2Ko5j0J5m2J10l4nk1l5J41p3J6l1J48j35K1k1r0j9J27k04K28j23J23j26
6387h1J30n3o0O8M2r3J08O0j80Q1M1j4l9j47J09J04j0m2k6J18n6j6p6L4m0k4K7
6414c5Q7Lp2P8j06NQ5r1J30j9k7q5K7nJ47j27J07jM9j49n0R6Q5j44n1l0N7M4O0
6443F8L9p4j0l5j3M6P1r4k3R4kk2M2l9m9J3O1j55J52mK0K2oj74N0o4N6L6r9J18
$$ y = [-56, 91, -44, -50, 11, -108, -10, 23, -41, -16, -28, -3, 33, 50, -1, -21, 49, 23, -41, -93, -46, 22, 5, 18, 35, 62, -17, -39, -8, -120, 94, 42, -1, 27, -19, 42, 25, 62, -48, -47, 102, -133, 1, 24, -51, 55, -144, 112, 143, 35, 22, 112, 18, 14, 21, 82, 118, -12, -168, 8, 66, -55, 51, -148, 33, -82, 56, 48, -62, -55, 9, -114, -39, -53, -19, -3, -56, 18, -89, -111, -87, 50, 2, -35, 94, -31, -5, 21, -67, 33, 16, -26, 78, 19, 4, -21, -33, 34, 116, -22, 5, -28, -80, -38, 42, -99, 46, 0, 22, 24, -41, -51, -36, -78, 32, -2, -7, -28, -63, 78, 5, 21, -10, 138, 3, 24, 3, -87, -106, 21, -183, 45, -78, 45, -81, 49, -4, -64, 4, 46, -47, 61, 121, -59, 22, 63, 49, 10, -137, -28, 76, 66, 24, -2, 116, 60, 44, -32, 2, -38, -62, -35, 52, 55, -17, 61, -45, -40, 45, -46, 84, 65, 38, -47, -20, -25, 122, -5, 102, 101, 150, 1, -49, 47, 132, -12, -63, -93, -36, 8, 68, 107, 33, 23, -12, -25, 21, 92, -2, -25, 69, 67, 45, 87, 48, -1, 12, 73, -82, 70, 66, 86, 108, 102, -72, -22, -86, -30, 6, -93, 25]
6473B5l9J7q7P8P4m0n9O0p1n4Q2J07p3q3K6j5j5O8m3O3n1pL5pL4m9R1KJj3L4j23
6505c2KrO3r0J25j23J19k3J9l0J8o7N1k1m2O3j07Q0qlJ0N1j48M0J06q1L9Nkl7
6535c2M3J00j37j01J02k8J4o8O9k8O8jK3o8M6K08j95M3j38J16n5J79j75M6l0M5
6561D6J4j19M7P3j20N1l0Q5Q4j61r6Q7L5r1J4M1l1M5koK3LOJ10r2K4Kmn9J7J7
6592A3km6Q7J4j07M5k1j7k9J23q4J10j64J13n2L5N7l5Q2j90L7q4J18J03p6q6K6
6619c0N1K8m6L0jj2j30J85K0j34R7r1pJ7p4J28q6J2M8K3j66J83j02J61m4n9l5
6646c4J26k4p5ko6J84j23P3j01%J4Q0o5m0J40j47Q0m1O9q0l4J3Q5n8k6J55k47
6673a44J27M0j9k1J2j9l0j6J14M8p9j26J95j19n6M2K6k2L1l5M5K8j05O3q7J18
$$ y = [25, -14, 3, -84, -6, 68, 28, -31, 29, -42, -96, -14, 93, 20, -63, -37, -52, -67, 1, -42, 21, -30, -37, -2, -9, 25, -24, 67, 69, 70, 57, 91, -32, -30, -39, 24, -66, 59, -64, 55, 32, 51, 21, 39, -28, 23, 2, -40, 23, -84, -4, -12, -15, -5, 46, -102, -62, 44, -37, 2, 7, 5, -32, 11, 111, -26, -127, -25, -53, -39, -107, -38, -66, 2, 1, 24, -44, 2, 210, 15, 58, -80, 36, -19, 160, -15, 31, 1, 46, 60, -59, -12, 61, -59, -8, -38, 47, 131, -30, -126, -39, -4, -95, -81, -40, -71, -26, -28, -34, -11, -8, -2, 108, 16, 40, 42, 38, -21, -4, 13, 11, -35, 52, 66, -41, 4, -17, -34, -63, 60, -24, 86, -78, 35, -17, 18, 75, 40, 122, -68, -31, -115, 3, 106, 30, -56, -30, 21, 49, 3, 33, 32, 20, -110, 75, 95, -39, 58, -33, -40, -23, -97, 31, -55, -43, 5, 28, -138, 45, -57, 104, 60, 1, -34, 92, 68, -7, -9, -75, 109, -14, 59, -42, -42, -28, 52, -13, -53, 87, -60, 20, -21, 48, -32, -66, -53, 32, -26, -52, 103, -144, -17, 23, 4, -17, -5, -24, -54, -70, 44, 92, 13, -113, 82, -37, -93, -51, -25, -47, -16, -51, -6, 22, -83, -20, -107, 11]
6699A1K9l6L3j8j5K5J24j30nm5k7O7j1j03J01j6ML1J7nl1lN3q5J3Q1k8L8j31O5
6729CN6M1p3n3Q6m0j0m1L2LK6p3M6M8j18O2K4n0P5LR6j48j5M9j16J03M9j13K4
6758b4o0Q5O8j21K1P2m3j12J30L2k6J9l6o6M7l1J00j35N7M4q8J64q5J7Kj2K6r2
6786d7J2k2J22m3k3k5r5N1J09n7M2P5j09O7q6J9O3j76L3O7M6m4J39j20Q9j42Q2
6813B7j7M5j22lN1K8L3k1q5J49j04P8M0j02ml6K2PM8J9j20J31n7N4n8n5J7K6r
6842a8N9l5lm1K8J61j00J0kqML4j19N1o7j8J39l8j03J09K3r2M5n9O9n2QJ18j34
6871c1P6L5J2r9no1L8J1n8J43%p9K8N6p5n9M0J46j1n2KK9k20K43m8j76R8qN0n3
6901b8J04r4M7m3m4J05k4r1J7O7M8M2j9j22R3j35N3Q9J7n6j42L8J02o3m4P8N2
$$ y = [11, 40, 4, 37, 19, 4, 29, 153, 23, 18, -27, -54, 13, 2, -101, 0, -16, -12, 19, 36, 31, 0, -3, 50, -35, -22, 59, 31, 69, -62, 3, 59, 100, 27, -26, 60, 20, 10, -31, 1, 4, 30, -43, 3, 51, -67, -5, 19, -31, 44, 47, 143, -5, -20, 29, -87, 16, 65, -48, -24, -84, 1, 69, -52, -31, 41, -2, -114, 16, 48, 22, 41, 5, -61, -14, -45, 55, -80, -23, 21, -67, 97, 12, 29, 31, 19, 45, -47, -35, -57, 65, 22, -1, -26, -121, -70, 39, -18, 24, 99, -10, 57, -29, -10, 53, -123, -90, -23, 23, -21, 118, -2, 87, -55, 27, 10, 55, -67, -70, -19, 9, 42, 21, -64, 85, -19, 59, 99, -3, -7, -43, -21, -14, 34, 53, -67, 64, 7, 61, 3, -52, -35, -9, -18, 41, 6, 3, -38, -10, 151, 51, 61, 59, 51, 55, 89, -30, 21, -46, -64, 75, 37, -66, 43, 66, -26, 19, -40, 29, -23, -15, 103, -31, 45, 80, 92, -7, -12, -73, -35, -24, -82, 61, 61, -18, 10, 66, -9, -68, -28, 118, 107, 55, 57, 86, -134, 109, 61, -115, -17, -25, 25, -28, 76, -18, 29, -14, -58, 47, 23, -68, -51, 16, 64, 106, 87, -35, 58, -77, -24, 65, 82, 26, -116, -78, 24, -39, -83, -5, 47]
6928D7j33P8P0r4M5N4k9j59R4j6j16Q1K2K8J54p0j00Om1J19m6N0l4J03q4k4o8
6955f3O6j21K05j44O9m3l0J22mJ8m0m1J8Lj7K3m7J9M2k3J7J4o9J8J47r6M1o2K0
6984D2l5Q5q4o5J09r2R0l0o2O3k3j28J48j17J52qj03M2n4j0N4K8m2J2Q2q5p5J49
7012D3j36J12j9K8l6j2L0n6K6R0j31P3k9o6R6n6n2N5K9q0J12p7K8J69j80n4K7
7039f6Q3q9N6J4lK5M9k5l3K3R1k29J03j3M8m3N4n3L6m0L2M8J3o9NJj37J02j05
7068a22L9R9M5j2q4J39o1m9L8M8o0Nj38J49j7j2j8P3j48M5R3n4j1j4k4P4K6K3
7096G2Jq0j29J07K9j8K0l6N1m1Q8j23J13N1j7m4j26J31j01L2J23p6np9No7J85
7123F6o2L7m3P4j17N3n1R2q1O8l3m9R4l9l7Pm1J28j0k15J36o3J11mN7j20Q3qo7
$$ y = [47, -86, -8, 62, -32, 13, 67, 38, -121, -27, -43, -159, -78, -56, -28, 126, 56, -44, -38, -79, 40, -6, 44, 10, 113, 29, 5, -63, 3, -118, 87, -57, 12, -31, -61, 61, 57, 75, 35, -6, 12, 15, -2, 21, -26, -7, 35, 12, 29, 43, -26, -8, 139, 43, 84, 22, 42, 7, 92, 8, -57, 52, -40, 50, 20, -42, 21, -2, -130, 18, -99, 53, 45, -58, -16, -70, -80, -26, 2, -40, -28, 54, -31, -106, 43, -93, 19, 0, 28, -8, -20, 10, -46, -20, 70, -61, 12, -17, -83, 13, -43, -95, -40, -11, -91, 21, -56, -28, 141, -39, -93, -66, 17, -72, -16, -2, -5, 20, 69, 44, 11, 34, 125, -104, -1, -14, 34, -9, 45, -8, 28, -12, 20, 68, 81, 12, 17, 18, -119, -17, -122, -83, 16, 61, 49, -35, 104, 43, -6, 32, 80, 20, 25, -113, 36, 19, 7, -11, 62, -86, -41, 52, -2, -13, -27, -51, 23, 49, 72, 73, -7, -136, -29, 0, -18, 2, -34, 17, -24, 64, -59, 54, 105, 88, 44, -82, 49, -52, -20, 103, 27, 22, -57, -52, -119, 66, 4, 41, -2, 72, -45, 8, -43, 49, -32, 36, 3, -46, 48, 9, -28, -21, -62, 66, 56, -159, -23, -86, 25, 21, 78, -42, 41, 33, -34]
7152c4J30j38k7J0j4J43r3l0J49j29N7OL8j05Q7k2l0J2n9j34K63j6n8l5J47k1
7178I7j77R0mL0r3R6q5J27n0j4l7J18n8j2j20L4M2j36Q4J23j28J68j55R4m2J22
7204A14Pk08K6O0R2%j18N9j57J38l1l3J62j27P7m3j0q1J61n7l3N6j12rJ76o3K5
7231G1j0r5M5Q4j39J26k07M1L1J07k4J8n2J1J09j07j4Nq3N3j06P1K25p1j46O3
7257Fj31J34j9m6J07o9p6K6J23q1P7lK1j62J19MP9P4k44Q1R0j10L2l4K9LNm4L5
7286B6k9k5l2R4o3R3oq2Q0l4p9kJ7r5J86r5m3J00J06j62L0k8P6Lk2R2j72R9K7
7315F0j49J46M4p4q3J2P6K8j9j3j06nR0k4pN0l6qo4Q2k7M0mJ3n5J9J2l9R3l9K7
7346D0n2Q7m4j7Oo0o3O2Oo9R5l4L2J06j32J24q9k9L6J6n9N6r8P5m9J6M5p5J9L8
$$ y = [-34, 96, -42, -69, -59, -73, 70, -23, -53, 96, -33, 24, 30, 68, -37, 50, 28, -2, 10, -49, -183, 80, 64, 6, -29, 118, 97, -80, 10, 6, 36, -57, 39, -46, 81, 31, 17, -20, 98, 40, 28, -92, -58, -16, -152, -68, 55, -73, 95, -60, 34, -8, 114, 121, -87, -61, -1, 91, 91, -27, 32, -125, 13, -18, -51, 111, -16, 61, 18, 8, -73, 88, 31, -2, 54, -58, -67, 109, 46, 71, 61, -34, 11, 95, -44, 82, -125, -84, -53, 54, 30, 48, -4, 7, 116, 9, -5, 0, -83, -30, -136, -65, 160, 89, -57, 6, -125, 9, -10, -56, 51, -18, -94, -68, 55, -26, 51, 48, 69, -93, 26, 30, 109, 183, -61, 20, 110, 0, 32, -2, 27, 30, 35, -9, 26, -3, -28, -60, 34, -29, 64, 58, -24, 56, 22, -57, -59, -42, -137, 49, -46, -89, 11, 117, -45, -15, -43, 33, 36, 14, 106, -66, 33, 60, -89, 57, 101, 27, -56, -44, 32, 60, 41, 28, -78, -83, 7, -17, -24, 26, -10, -18, -82, 0, -27, 13, 9, 22, -33, -14, -2, -41, 52, 13, 40, -12, 75, 31, 14, 20, -40, -103, -41, -35, -104, -9, -43, -11, 95, -37, 87, -2, -31, 5, 21, -38, 18, -80, -5, -54, -38, 7, -68, -49, -11]
7376a1K1J1K5r4M6L0r7N4k7m0Q8o8Q1l6O1j58M1R5K0k1o8M8ll2k3J06p8Q0j30
7405g9M7L7J01j31R8J7o6j16J01o1Q0k4O4r9J10l5o9m4rK14j68P8j71O8J46o7
7431B2K4m8j77J87km0M7J5q4k7J18l7m8J06m7O1j68J39q1J1R9l1R5p1J7m7r2K6
7459c3K0O8r7J1N5l0l0L3j19J92j51J52P1p4r1k4P8L8q0M0p7m6J66j27J28k24
7485a51K27o2MJ7p5J40q8p2l9R3L8l4l4J12M2k47J64j8J1ll2P4K8n8Q0n6j12M2
7513iJ3l5rO9O8j60N8RL9p0k5Q3l3o0M2q1J20l4K5m0L2n6Q3n5j5L2%jO7Mn1M1
7545E1j39O8J9J41j59m8Q8N3n9l8N2r0J39mm9OL2N4r5o3K8o9Q1l0O5l8J80j68
7573HL6l2l9J3l9L5RR4j43J07j27K48j76o0O3K6r7Q3n4O6NQq1Q2r2rQ6j9n9%Q5
$$ y = [-11, 10, 21, 46, -48, -2, 28, -69, -15, -42, -82, 6, -62, 19, -17, 44, -114, -73, 22, 42, 21, -47, 1, -2, -34, -57, 49, -29, 51, -79, -32, 5, 106, -25, 73, 90, 24, -92, 9, -52, 28, 4, 68, -31, 79, 44, -25, -69, -78, 136, -32, 46, -125, -57, 89, 22, 46, -2, -179, 8, 6, -34, 13, 28, -56, -83, 35, -2, -50, 56, 9, 70, -98, 41, -40, -29, 70, 39, 134, 63, 80, 33, -59, -33, -13, 55, -42, -31, 24, -6, -36, -3, -122, 70, -81, 71, 142, 68, -23, -47, 31, 69, -11, 29, -48, -94, 72, -55, 73, -151, 76, 14, 18, 35, -40, 100, 12, -60, -99, -6, 32, -2, -36, 76, 118, -129, 35, 17, 28, 25, -7, 67, 95, 37, 117, 61, -51, -9, 4, -31, -40, 29, 97, -63, -5, 4, 43, -27, -52, 31, -2, -62, -20, -101, 19, -15, 10, -30, 2, -54, 29, -26, -41, -9, -9, -10, 57, 61, 10, 51, -88, -20, -1, 140, -19, -67, 21, 74, 15, -23, 29, -61, 78, 74, 25, 31, 63, 117, 22, -41, -13, -82, -1, -31, 34, -4, 176, 8, 44, 12, -27, -14, -53, -18, -9, 85, -58, 49, -78, 170, -6, -66, -3, 23, -74, 9, -45, 21, 26, 34, -47, 35, -57, -66, 20, 1, -58, -58, 27]
7604B7K5q7M1k1K2o1K1M0n7Q0j0l7j4k9J08Pn3J20j23n1L5N6l2m1J03j16N0k4
7632b1oJ04j24OJ34m4r5oQ4r8M2O6k8Rj4Kj40K08J4r4M0p4N0J7N5p4k5jJ3J07
7662A07n1l1o4J06O1j15Qqn9M5r3P7l5J44q4Q8j48L7J09j11J5%k8J5L1j24J46
7689C8r8n5K2O3J6l2l6J34j17l8J74q3l8k3J46o6M8j84J70o4K1O4q3J44j05l5
7715a7j2m2J09Jl1k7J9m3N9j1OQp2J57j11K1L0N6j41l1J76p7j6J9m6pM5r5J7P0
7745A4p1J60l1j08P0J7o9R2j25R5QRJ8n9J6p6k4NN1RM3j37K05j35nK1j8j5J07
7774F7j56J66p3L9p6J05o7N7L1j59J9P4R5k47N0J17J01q8r4Q5j7k3N9j11oJ4J84
7801A46j73j1M5N6m7l7p6Q8PN7K4j00p4J78j84O3j13J05kO0p0Q9mNk2Q5r4q5p1
$$ y = [27, 52, -35, 6, -15, 7, -54, -33, 7, -50, 30, 20, -17, -31, -60, 48, 55, 2, 122, -1, -52, -17, 39, 7, -34, 69, -47, 3, -21, -27, 77, -47, -41, 93, 49, -46, -52, 32, -66, -24, 42, 14, 23, 9, 11, -129, 79, 93, -1, 39, -35, 15, 32, 87, 13, -12, -13, 0, 107, 56, 25, -39, 67, 128, 13, 21, 13, -46, -1, -94, -17, -52, 92, 8, 96, -52, -15, 94, -17, -2, -2, -30, -15, 16, -108, 38, -60, -115, -93, -30, -14, -46, -82, 52, -65, -103, 71, -12, -50, -73, 73, 7, 55, -129, 41, -23, -2, 62, -21, 123, 18, -17, -29, -71, 38, 39, 8, -19, 0, -43, 16, 5, 11, 19, -53, 104, -7, 14, 44, 100, -41, -72, 104, 27, 11, 30, -16, -23, 22, -73, -56, 14, -57, 103, 72, -36, 34, 51, -18, 74, -51, 44, 52, 61, 79, 20, 36, -40, -64, -59, -8, 1, 44, -93, 112, -23, -28, -7, -25, -40, 67, -89, 77, 4, 43, -33, 72, 5, 62, 93, -66, -47, 27, 122, -125, -75, 42, 143, 55, -39, 46, 29, 6, 65, -46, -52, -38, 146, -27, -38, 7, 63, 16, -21, -97, -9, -2, 55, 79, -21, -95, 83, -101, -38, -151, -46, -48, 12, -58, 31, 27, 32, 10, 95, 1, -84, -155]
7830a55Q7R3n6L3PJ1K4o1O2k4rl5m1R4j8N6k27O7P4oJ1J40j87l4j3k8K7R6O1j00
7860e1N2qk9MNj3J4M4q3j8J29j04j4Q6j7RK0k4L2M6j55k3J24j29Q2N3l9J3L3M2
7890H1j03l7m1J34q4NM4k5R7n8P4j77N4nJ8P4j89J02M1J13j44K9k1pR8j50J44
7917F7j52J48k06J21qo2J1J42J4q8Q8q8n7O7O5r2J2J17q4Q8j28L6Ll5O8oN5k52
7945a56J94q6L5ORK0J4m1M0n0k5MJ64j46j04Q9Q8k3L3l0PK7q2M1or8J26k1q0L0
7975b1k4Q0r0J27j8j45N2%J6PQ5j53n5J41R5p5OL6m1l1R1o3J4K3j11N8R5j36J40
8004A03n1j04N8n4K3J04r8rj0R5j33J1K2n3J17n5Q6r1K4j2%nJ55K8j94J3N9p1
8032d2J3lL3k6J57q6r7L6l4J42o6O1j27l1O4Q5o8l6k7R6j22k2J11J6m0o3J6ON9
$$ y = [-155, -68, 25, -31, 2, 9, 20, 44, -17, 45, 21, 12, -23, -64, 30, 12, 68, -159, -92, -18, -24, -13, 127, -60, -94, -107, -135, -108, -12, 49, -51, 1, -7, -36, -32, -27, -40, -26, 18, -65, -83, 46, -58, -72, 14, -3, 6, 26, 2, 34, 80, -75, -98, 26, -103, -21, 32, -7, 6, 39, 81, -22, -59, -100, 34, -50, -45, -1, -26, 71, 13, 87, -90, -36, -41, -23, 51, -138, -36, 5, 118, -26, 3, -18, -25, 73, -77, 67, -85, 63, -143, -22, -30, -92, -81, 61, 75, -13, 75, -13, -70, -3, 62, -30, -18, 99, 15, 103, -25, 11, 14, -21, 47, 41, 96, -156, 38, -48, -13, -7, 2, 22, 36, -5, 35, -15, -40, -36, 128, -18, -122, -33, 55, 32, 65, 35, 42, 69, -13, 28, 22, -76, 50, 29, -51, -21, -45, 35, -55, 72, 54, -91, -39, -39, -23, -16, 69, -84, -139, 2, 97, 22, 28, 64, 23, -8, 83, 20, 34, 57, -54, 4, 99, -37, 103, 52, -52, 6, -48, -25, 79, -19, -28, -38, 57, -76, -65, -43, -96, 21, -34, 52, -39, -15, -27, -27, -32, 123, 151, -43, -30, 29, -42, -29, -32, 1, -25, 132, 46, -51, -15, -49, 93, 27, 88, -39, -70, -6, 79, 11, -25, -52, 44, -78, -100, 11, 27, -13, -76, -60, -54, 5]
8061Ej0j9N6j06J08pk1N9l3j8k5m6P4N6j38R6P4j15L8l7JM4K9l8K0n6m3J35j62
8090g9J10p2k1O7j3o3M0n8Q0j01J0M6R2M1j54J74q6M8p1l6J8K9N8j26J03O8rL9
8118A34k07J50j17R1j4j04J87j85k8J25q5R6n5Kk5R6lq7N4n7O1J8l5l7n7J9l8
8145a01K4O0l6Q0Qj10q5J10L4k2R9%q9l2J30m5p9m4J6J74j68P3j1m1J58j4j6p
8173F6Ooq3M0N4j7k3n2N4q1nL3q3J13p2k1Q1O
$$ y = [5, -5, -24, 32, -74, 34, 27, 6, 65, 32, 14, -11, -57, 17, 73, -65, 31, 105, -10, 28, -9, -8, 36, 65, 27, 47, -9, -52, 83, -79, 31, -41, -62, 5, -8, -71, -31, -89, -9, -110, -100, -54, 38, 79, -75, 99, 13, 61, -10, -46, -28, 1, 59, -67, 36, 104, 95, 134, -73, 77, -40, 51, 37, -67, 120, -65, -93, 32, -53, 43, -12, -10, -35, 61, 58, -29, 25, -32, 29, 47, 12, -25, -82, -63, -101, -77, -17, -53, 27, 35, -75, -160, -50, -16, -38, 61, 61, -28, -60, 70, 25, -54, -98, -82, 92, -76, -3, -14, -55, 103, 89, 73, 66, 72, 66, -17, 23, 77, 60, 37, -15, 39, -42, -47, -14, -97, 16, -56, -77, 4, 10]
8191A0
$$ Imaginary data points
##PAGE= N=2
##DATA TABLE= (X++(I..I)), XYDATA
0@%%%%%%%%%%%%qJ6j6J6j6K4l2M0m8N6o4P2q8J04j20J39j63J87k12K42k76L15
34A68l58M04m54N07n66O33p05P82q70R66j070J183j305J439j584J745j924K121
52A112k336K574k845L149l489L880m333M865n501O270p227Q459j0110J2445j6016
67i103K2212l5867J18010p5401k02192K65087K2550k08513N0259J71231j19104
78h31j10095J38837P1125j63070O357J25356n7768o2672P3276O814m1225j2184
90b6080L4369L0235n2493j9179O7217l2659l2964O3580k0715n4813N2914K1117
102C0529n3844N061N5425m0301n7012R7957K6395j45648N4624J28946j36821m3002
114g7691J64443n3722j31805J06001Q2308j20921m0595J25505j0049j20172P3185
$$ y = [0, 0, 0, 0, 0, 0, 0, 0, 0, 0, 0, 0, 0, -8, 8, -8, 8, -8, 16, -16, 24, -24, 32, -32, 40, -48, 56, -64, 75, -88, 99, -113, 129, -147, 168, -190, 214, -240, 267, -299, 334, -371, 411, -459, 507, -563, 620, -685, 754, -830, 915, -1009, 1112, -1224, 1350, -1495, 1654, -1835, 2045, -2288, 2577, -2924, 3346, -3881, 4578, -5532, 6913, -9103, 13109, -22758, 95252, 19851, -182341, 82746, 105296, -103217, -52958, 118273, -831, -110926, 27911, 99036, -64034, -57677, 67679, 9911, -52761, 20515, 27329, -13896, -26080, 8289, 38524, -13969, -33148, 34069, 1410, -31554, 32026, 11311, -43502, 9412, 30529, -23315, -18254, 37171, -3130, -60142, 37815, 64210, -81438, -26814, 102132, -34689, -77691, 86752, 33030, -98775, 7226, 89534, -31387, -71982, 53523, 43474, -76698, -3513]
125c513Q0314j13347j7062R8225k2026n0915J7219K6916j208l8393J7640M8126
137D1976n4531k6791O9078p281m9582K1158K5427k3864j7688L8863M617n8699
149c7317L1694M4498o5038J3123N5640o7782m252P5521m1823m1707N4317O646
161B3520m9943J4981N1040m1122m7452P2239J3091p9682L8017M3664o3138M939
173a9846M7160k1558k1075O755J8778L180k8147J2456K1289l0361P90K6829r342
186F908j6783k555K1988M497l5136K0749K2865m7756J6695M0730m5234m191L6231
199A9008k2597o446K3781q722j8050R222K1522j8023j8418L6681j1556l8654M8882
212A6630Q293n6976K6535K9536l4637k30K1831m723j7289P18K8900r416l1039
$$ y = [-3513, 76801, -36546, -53608, 44617, 22591, -28324, -11105, 15811, 14603, -23790, -6150, 41976, -12555, -39346, 29732, 22451, -27131, -5973, 19454, -4410, -22098, 16765, 21382, -37317, -5623, 38875, -26163, -13040, 42600, -25182, -29434, 46087, 4264, -37443, 16874, 23520, -26423, -11442, 39598, -1524, -48976, 23263, 36354, -43328, -5311, 38353, -24785, -19846, 27314, 5756, -15319, -8564, 10214, 13394, -14753, -2297, 18992, -11369, -10579, 16250, 6908, -9875, -12430, 9558, 14055, -21081, -332, 22533, -25223, -8528, 32202, -13032, -17223, 19008, -3589, -10035, 13746, 5024, -13026, -3804, 17718, -305, -18723, 17958, 6402, -32252, 16630, 24923, -32053, -5518, 24018, -10619, -10849, 10982, 6259, -11030, -10312, 18588, 9172, -21867]
225b1867K5957J1036k5392R098Q653p097m089o913K1278K642l6395K0952K2094
238A9957l4732Q681K3218k3039m632J5245L145p717q343J3646j060j5043K1443
251A0769m082k4702K6007K82k3916K4327n92k5046J6735J0329j1309n202M136
264b264J1171j3028n786K6913j4965k0970K8461N33j7778Q362r9Q51j276p544
278g419J6894n432k2095K2427P182k0963P205O244n061o05q28J1016p028j5284
292a3747K2166N01k0349J6802q60j4772J5550j598q764P691n519M56N613m403
306a233L729o486j472J6110j2918n566J9516j4438o673K0091p950p959N313q02
320g38N749o460m432J4130j1323o955J9325p105r537P868j146L706k830n819J3413
$$ y = [-21867, 4090, 15126, -10266, -1168, 7485, 388, -3701, -10614, 10664, 13306, -23089, -2137, 19957, -14775, -6094, 17124, -5915, -10547, 4698, 7843, 126, -8217, 5429, 4369, -10674, 10769, 6687, -18015, 7992, 8274, -15642, 8685, 8093, -16953, -218, 10111, -1198, -6400, -2264, 8907, -4121, -9907, 17006, 2041, -18929, 9532, 10065, -7713, 649, 550, 1401, 125, -7419, 9475, 4043, -18052, 4375, 11557, -9406, -2201, 4043, -1018, -1623, -2451, 8565, 1537, -13747, 8419, 8920, -11429, 5373, 4513, -10259, 5291, 3693, -5071, 2620, -2899, -2443, 3170, -1233, 2496, -3990, -5462, 10648, -2270, -7836, 11680, -2758, -9431, 10660, 2710, -5249, 64, -738, 5011, -1449, -5881, 8249, -3074, -10029, 9296, 2191, -7346, 522, -624, 3082, 252, -5567, 7846]
335G846q156r890K0565n594j4379J2921j190m258M592m639L343j378n568J1403
349E618m542p518J0388o583k6J1197j3349J125J1666j2141K724Q273q938M85Q10
364h11J768M975j1945K751J1370j4084K583J1332j1876L93M846k114N771p956
378b997k123J3794j0763l149J4215r718m664Q201j771J121m095k091R561q053
392b532k132J2158j0701k287J0874q088K665M430j0380O803M136q380N428n39
406A455l349L687m086M965J050j2128R638N154j3244P311L035q455N801r24l88
421d78M974j0113M184R453j1587J497P262p291J334J527L10K351r554M832R303
436H004j3828L108R469j2444L586P067q036L850j50m128P230l058k328M058m527
$$ y = [7846, -310, -10200, 10365, 4771, -9608, 3313, 2123, -2135, 2457, -2182, 1161, -217, -5785, 5618, 1076, -6442, 3946, -2637, -2663, 8534, -4815, -3690, 7976, -4165, -1441, 6832, -2106, -1621, -811, 957, 5932, -6013, -3262, 8108, -5976, -3393, 7939, -3937, -3544, 1302, -812, 4959, -2997, -5120, 8674, -2089, -5238, 8977, -741, -5405, 2796, 1025, 2146, -1949, -4040, 5521, -2532, -4664, 7494, -3207, -5494, 5380, -2708, -43, 4387, -5993, 810, 4946, -3434, 1994, 1455, -1894, 1793, -2293, 2672, 3722, -8406, 1232, 6386, -6858, 453, 3488, -4967, 834, -90, -478, 4496, -5617, -1433, 8020, -3567, -2070, 5192, -2099, -765, 762, 1072, 3423, -6131, -1299, 8004, -5824, -2716, 6753, -5691, -2105, 4962, -3074, 776, 626, -3502, 3728, 670, -1658, 2400, -2127]
451b127L696O90o400Q350l318q509J2897k482r586R104k024l130N563m878K666
466E12K200p933P218K789q487L724J261p31J457n629N977J502j2451J0680N596
481G685j5709O681O789r756L921K426l279J878k744L208K225o638M730K67n076
496c392P944m394m921J0164o795l551J1267p517l607P748m162O97J841m138M624
511A808j654k526N880m024p21L338m517N547l32r586J0315P49j2156J0735K098
526D954j1500N984L583m184K38n09L345j697l754P838l604n524R171m209l007
541b875Q522q006r68R227q242k67O916o550J22L503j886J355l047J415M234o419
557b966L213L528p950N607J845p580Q069j888q028J0245j416q116P514k20m873
$$ y = [-2127, 1569, 2259, -4141, 4209, 891, -7618, 5279, 2797, -6789, 2315, 291, -2839, 2724, -2154, 512, 2712, -5221, 1997, 4786, -3701, 23, 1284, 553, 2010, -3619, 2358, 3860, -8591, 2089, 7685, -8024, -1343, 5446, -4310, -389, 2037, -1242, 636, -2108, 1100, 3325, -3313, 1417, 1684, -3392, 4552, 158, -4763, 5401, -1394, -4945, 6322, -1195, -4802, 2946, -1216, -519, 1322, -2816, 1808, 154, -2372, 3508, -516, -1237, 2101, -2416, 3131, 2799, -6787, 3528, 4277, -7879, 2856, 4954, -6546, -562, 3021, -1163, -925, -1434, 1911, 214, -3540, 4298, 694, -4830, 4341, 132, -2875, 5647, -2359, -3327, 5900, -2342, -2609, 4307, -2243, -2121, 1382, -504, 851, -2196, -781, 3453, -2966, 247, 3775, -4175, 1432, 3277, -4303, 3766, 1878, -6150, 4095, 2679, -5437, 2077, 1857, -3016]
572c016K528J255R00m385o9Q198o921k633J0349p678k835J0126o728j455O565
587D201o721J483M452n806J874J569k218J605j801K052M19n680O824J218q900
602e429P787Q37q537Q280k88o561O678k078l566N786k943j894K502j104J437k609
618a702M04N022p665J533R246j0251j37R908q658m29P391n803Q5K689k642K282
634A273j490j005K574l403K486J054n189N783q68o247Q963j951p721R096j409
649A946n836O481j426k948L114j663J117m92j959L402k883l57M893o335J361O022
665D437q457K893O509r287K340N950o200J263K422k308J013j490J842J047n204
680c230M390P83n990O191r41n876P640k333m647P365l081l454N802k376j252K285
$$ y = [-3016, -488, 767, 1667, -2718, -2787, 5411, -1510, -4143, 6206, -1472, -4307, 5819, -909, -2364, 4201, -2520, -1037, 3415, -2391, -517, 1052, -1166, 439, -1362, 690, 1109, -4571, 2253, 3471, -5429, 2358, 3195, -5342, 2938, 2650, -3911, 2767, 689, -2877, 2909, -34, -1928, 574, -530, 907, -1702, -1298, 3724, -3941, -2408, 6838, -3413, -3550, 6358, -2300, -2729, 4662, -1141, -1056, 1633, -1009, 1273, -217, -1222, 1352, -2051, 435, 1489, -3700, 2083, 1215, -5032, 3931, 1980, -5741, 3355, 1946, -3890, 2591, 1165, -1783, 1331, -332, 785, 293, -1666, 1736, -1147, -1504, 3389, -2946, -1585, 4437, -4020, -1127, 5382, -3905, -1565, 4385, -1815, -552, 1870, -438, 575, -915, 927, 1974, -3230, 1160, 1943, -4047, 2144, 1203, -4673, 2967, 634, -4013, 3352, 271, -3183, 2619, 243, -1009, 1276]
696A276j916J923j373r84L989m708J28N316o340J537M731p422L442L915p065L712
712A61K577n543L230J207k192J124j369K076k03l943N424j287n772P439j486n648
728d205O727k023l756N839l024j112L270l203J655J236k790K693j456q88L804
743B767m492J002M028o364K688L956p041L354K657n658L664Q12l543L067j026
758a29m68K165k727K092L2l226M921j918m105O745l115l979P002l237k992M855
774A916k413m39J782k329K406r06j789M225k866j156M352m024R08L095n314L048
790D96K013n763M337P32m937M003k79k303K754k026Q33J193l175L521m03l662
806b666N064j856l063N716l524k128N571l901j067M095l428N13J329j602K047
$$ y = [1276, -640, 1283, -90, -1074, 2915, -1793, -1665, 3651, -2689, -1152, 3579, -3843, -401, 3514, -3551, 161, 2738, -2805, 425, 1632, -560, 564, -805, 1271, 1068, -2875, 2549, 1262, -4510, 2929, 1443, -4205, 2522, 499, -3257, 2582, -442, -1554, 1716, -1487, 168, 1404, -1386, 1307, -149, -1037, 2767, -1725, -723, 3305, -3059, -371, 3585, -3456, -102, 2555, -3103, 561, 1373, -2170, 897, -129, -597, 1568, -1159, 933, 965, -2261, 2660, 742, -3363, 3382, 267, -3712, 3290, 53, -2939, 1916, -497, -936, 846, -1483, 923, 17, -1772, 2453, -413, -1569, 2783, -1241, -333, 2762, -2552, 496, 2509, -3254, 1083, 1815, -3122, 881, 602, -1701, 1053, -973, -140, 1053, -2122, 1399, 996, -2666, 2398, 542, -2521, 3195, -329, -2457, 3114, -787, -1854, 2241, -1187, -674, 655, -947, 1100]
821A100k114m84M201m132N0M448m828J100L231m342K591O78l767L974q74l226
837b394L975j639j555K737k087J041L91k653L904j179l220N290k445k660N304
852B810l128j173L912l637O68K430l248J521M17j853K522k304K66L087m653J634
868g29L720n401K068K809m507K635Q11k816K953j760j001L353k975p4K359k862
884a417J578L56k394L598k154j911N090l281j726N085l477n69L336k901P74J092
900A079k222K305j043j368K891k813O23K492m278K203K148m796L336J403m496
915b536L313L85k537K685j586k1J833k883J841R94l521K843p3k669L447k105j143
932a733L958l664K4M151m254N17L192l173J050O58j294J868j952K12K516l739
$$ y = [1100, -1014, -1498, 2703, -1429, -1379, 3069, -1759, -659, 2572, -1770, 821, 1499, -2268, 1706, 832, -2394, 1581, -58, -1613, 1124, -963, 78, 469, -2184, 1720, 541, -2679, 2611, 166, -2494, 2810, -318, -1491, 2421, -1216, -548, 1882, -1366, 155, 572, -1281, 1241, -1063, -797, 2290, -2363, -729, 2991, -2410, -342, 2467, -2040, 595, 1406, -1410, 1543, -217, -1218, 2135, -840, -914, 1445, -1417, 161, 517, -1877, 1721, -433, -2344, 2746, -535, -2261, 2824, -653, -1222, 2114, -787, -13, 1079, -1143, 1162, 119, -1249, 1642, -1171, -548, 1944, -2334, -131, 2017, -2779, 557, 1960, -2536, 777, 1162, -1375, 1310, -276, -297, 1536, -1347, 494, 1488, -2033, 810, 737, -1932, 1515, -590, -1733, 2225, -1439, -1415, 2736, -1518, -1001, 2191, -982, 68, 726, -568, 1300, -652, -440, 2076, -1663]
948a663J473K380m463K370J443m041L147M13l322L507p23k075K719j355j2J133
964I31k058K255l65k650L750j502k536M190k437j195L424l124N00K739l766J646
980a98J735l089J855M80j395J526j692J063J441l719K691J505m981L492J034m149
996b401K994J60k598K855j146p24J970j981Q66Q62j868K058q10j729L695k665
1012d62j067M066l374o71L641l069J13K226k755J566M07k085K287p20j001K012
1028A114j915J075R51l104L261K32m278M100P1m150L729k16k519K320q81k06R98
1045E82j771J706k6j932K822j439j249L345k899j27L564l924N05L086l521P63
1061e15J815k477J424K1j170J656j495L81J444k505J834P05l155L239j07l219
$$ y = [-1663, -190, 2190, -2273, 97, 1540, -2501, 646, 1059, -2263, 1244, 521, -1554, 1165, -190, -202, 931, -1127, 1128, 763, -1887, 1863, 361, -2175, 2015, -422, -1617, 1807, -1317, -817, 1922, -1844, -198, 1537, -1552, 303, 783, -612, 914, -778, 285, 1726, -1993, 698, 2203, -2778, 714, 1748, -2401, 593, 753, -1845, 1010, -136, -860, 1110, -871, -5, 857, -1011, 1047, 237, -1492, 2203, -462, -1529, 2537, -837, -1508, 2133, -936, -823, 1403, -1352, 214, 621, -1464, 823, 103, -898, 1114, -801, 274, 1225, -1879, 1382, 1614, -2664, 1436, 1507, -2643, 1086, 870, -1649, 671, -210, -416, 582, -1189, 517, 491, -1441, 1381, -58, -1307, 2038, -861, -988, 2576, -1348, -843, 2243, -1278, -515, 1300, -1177, 247, 268, -902, 754, -741, -360, 1084, -1421, 413, 1118, -2037, 1202, 1095, -2124]
1077b124L838q91k872L606j088j948K319j126j8N90j252J909j102j366L173k142
1093d94p83L367l015Q8K885l267J027K054l220J484J053k301J523l48n32J119
1109F40j610J161O50k779K696K74l237L485m11k889L492r77k013L041j601o80
1125g58J696j357L49K91r63J725j610l54K664k820J31L257l549N08K741l221J125
1142a45J480k416J486J96j344J613j063j10J035j731J328K43k423K975o32k606
1158b114L712j123k375L500j315j379K226j325L4Q90j460J212k92j032J933j548
1174d56l44K312k859P70K478l704J544K075l235J315J314k117J243q4n13J168
1190I07j626P28J016k175J549J21j972K528j008j833L355j661j626L274j679j053
$$ y = [-2124, 1714, 823, -2049, 1557, 469, -1479, 840, -286, -304, 286, -966, 943, -159, -1525, 1648, -494, -1277, 2090, -925, -837, 2048, -1219, -192, 1862, -1358, 126, 1179, -1122, 401, 53, -479, 640, -970, 191, 841, -1938, 758, 1032, -2205, 1280, 869, -2020, 1472, 495, -1518, 1523, -78, -758, 938, -419, -70, 221, -742, 983, -627, -981, 1683, -1137, -1006, 2251, -1298, -790, 1951, -1270, -145, 1335, -1081, 405, 601, -743, 870, -193, -303, 732, -999, 329, 572, -1851, 1124, 492, -2114, 1598, 475, -1900, 1600, 285, -1094, 1132, -193, -159, 731, -729, 483, 191, -841, 1092, -456, -800, 1512, -1347, -577, 1901, -1803, -259, 1816, -1419, -104, 1210, -907, 336, 252, -261, 907, -719, 9, 1025, -1150, 399, 520, -1452, 1076, 68, -1765, 1590, -71, -1697, 1577, -102, -1155]
1206a155K141j257K23M04r76J643j186n96K130j907j78K126k532Q87J550l008
1222a691J747J063k674J657P19j758J419m43j82P96j611J433M12k228K305k84
1238F80k141K481q82j437K576j691p04K490k068L9J449j299N49J40o83J366j369
1255e04n8K160k436L38K072k596Q59J385k465J507M48k038J970m06j151J507r48
1272c56J39P20j318J512k18j806K498o75j875K725j191j310K359j599k30J609
1288I84j780N36R05j469R30L9o74J418j540M95J473k337R56J580k625J207J095
1305A193k386J453J07j465J700q66l57J351j385N69P43j401J254k00j374K270
1321A206j081j234K650j637q38K223j622n4J019j349Q75Q6j117J472r27l95J643
$$ y = [-1155, 986, -271, -48, 356, -620, 1023, -163, -759, 1371, -536, -714, 1412, -1120, -233, 1317, -1691, 56, 1119, -1555, 102, 821, -937, 482, 39, -143, 653, -958, 475, 887, -1341, 964, 680, -1461, 1020, 138, -1299, 1277, -414, -1118, 1372, -696, -657, 792, -507, 42, 182, -501, 865, -504, -562, 1598, -838, -500, 1572, -1024, -165, 1220, -1245, 262, 710, -1328, 642, 236, -915, 592, -356, -217, 503, -815, 697, 479, -1327, 1171, 496, -1379, 1346, 155, -1155, 1204, -395, -625, 984, -796, -260, 645, -824, 106, 145, -529, 889, -651, -156, 1317, -1020, -64, 1516, -1109, 98, 1193, -1193, 260, 367, -1098, 602, -264, -621, 730, -655, -86, 657, -744, 510, 310, -1064, 1206, 125, -1109, 1541, -96, -934, 1289, -333, -387, 632, -717, 158, 244, -873, 599, -328, -723, 920]
1338I20j599M45J344k146J054J170k345J702L81k056J733k98j009J298j122K08
1354c20R79j474R86L06j399J590n04j256K157j213o68K176j759j92J807j698L77
1371a05P89j183Q32k62o81J438j305j49J615j920P69J155k012J138P52j938J650
1388E83o2j419J624o15n69J184j196M89N90j498J460l66j237J790p62r47J953
1405A002j302m24J750j538K16J281j671Q10M76j152J037m78l60J056j304M20J086
1422I05k056J150R92k183J338O36j705J402j66r60J367r00K7Q26j211P81K40j324
1440h41J368n78p16J565j144m93J797j460j63J516j390L45Q14j156Q38k4p02J025
1458F01p56j26J041j505P99P57j924J343M01j849J541K04j605J539l52o76J012
$$ y = [920, -679, -234, 1110, -1036, 18, 1188, -1157, 545, 926, -1130, 603, 305, -704, 594, -528, -320, 659, -815, 171, 477, -922, 668, 164, -1092, 1065, -148, -816, 1360, -399, -591, 1216, -482, -105, 684, -499, 333, 71, -610, 828, -477, -626, 989, -931, -162, 993, -1019, 119, 871, -1067, 583, 521, -898, 726, 111, -458, 726, -470, 19, 609, -889, 571, 205, -1032, 758, -4, -951, 1002, -300, -724, 1026, -512, -296, 985, -686, 124, 600, -552, 485, 7, -353, 703, -601, -181, 905, -1151, -1, 991, -1192, 146, 782, -923, 479, 313, -647, 720, -180, -153, 673, -538, 243, 483, -841, 527, -51, -767, 798, -346, -839, 958, -502, -665, 851, -539, -194, 620, -536, 302, 278, -424, 601, -155, -281, 760, -745, 54, 811, -1113, 230, 631, -1218, 323, 527, -1078, 461, 109, -567, 445]
1475D45p54L68M35j200J113N7j261J474o59o96J554j260j68J475j658L42J242
1492H49j472M99O10r70P53k13k77Q38j026M34Q16j620J010N70j801J439O2j566
1510a065J570j87j270J496n70n16R67p87M98K8o23J129n38q35J645j097m00J516
1528I61j312k0J313j532L75R33j448R27J14p66P05m09L7P62j185O87N65j544J147
1547C10L13j626J427qj332J483m55p92J206q77m4P14p56O56j43n62J059q28l43
1566e98J487j084k41J531j530K14J099j444M74M89r53P51q5m91O88o71K76N96
1584E08r09O29K33j258J401k15j308J551l02j075J391o75l59Q12p55J87M61q55
1602e38O45j27o60J262p82k65J329j391K40J150j476M78R66j337O63L39q12O26
$$ y = [445, -309, 59, 494, -706, 407, 464, -797, 677, 18, -678, 876, -384, -552, 923, -735, -393, 849, -623, -124, 486, -484, 269, 56, -221, 617, -409, 25, 841, -779, 231, 801, -1000, 439, 501, -1065, 505, 318, -952, 544, -26, -542, 425, -362, 136, 164, -459, 670, 132, -703, 942, -155, -555, 961, -351, -371, 942, -590, -215, 718, -730, 197, 311, -455, 250, -159, -122, 640, -545, 142, 707, -837, 310, 623, -1003, 424, 416, -916, 567, 112, -680, 526, -351, -395, 319, -437, 219, 76, -486, 573, -255, -598, 889, -195, -436, 1095, -435, -221, 878, -566, -92, 397, -556, 195, 110, -381, 307, -364, -88, 508, -401, 228, 461, -797, 604, 389, -919, 632, 330, -745, 646, -29, -388, 424, -331, -144, 317, -538, 107, -20, -680, 582, -200, -465, 864, -527, -287, 863, -613, -135, 831, -506, 157, 496, -316, 310]
1620C10l46q9M41q95N37M17j054Q66K26j286J476l64r61J467n90o90J266p92j29
1639a90M99o30L70M6o44R80n53l40J214j124l7J264j392L65R66j470O72N91j100
1658e13P20J73o20N38m82K30L33r56P49K33j164J200m4j206J268m57o99J337o66
1677b6l13J013r10K39M79p02M54j29m55R28r29p5J004j096K45R50j327N38P83
1696F71j321P91L21j002P48j14l06N34m47K63K54r65R26M9j096J137j76j053J475
1715F89p65n42J032o42p0P19p27N01L6n85P81m78k51Q58q30J23R06j296M20P62
1735F41j314P02M77j113Q34p5n69P71l58L1L33o92N54K49j069J076j60j028J264
1754E54m54p18J225p51l86R81o63ON03o48O79j82m90P49m99j65J036j121K33P63
$$ y = [310, -36, -125, 316, -579, -42, 375, -679, 187, 413, -873, 603, 239, -722, 745, 155, -535, 731, -61, -190, 309, -321, 49, 95, -549, 431, -122, -462, 752, -372, -409, 855, -537, -172, 794, -676, -4, 587, -513, 207, 380, -240, 298, -184, 46, 379, -577, 172, 405, -759, 441, 397, -809, 459, 2, -697, 640, -26, -339, 674, -236, 3, 482, -220, 234, 105, -350, 578, -351, -426, 578, -518, -273, 677, -650, -112, 671, -650, 141, 462, -540, 208, 94, -212, 322, -125, 138, 392, -573, 353, 402, -694, 443, 267, -786, 689, -76, -618, 414, -228, -298, 421, -306, 195, 231, -354, 427, -51, -302, 556, -274, -151, 755, -541, -121, 641, -673, 29, 506, -607, 227, 152, -417, 354, -4, 27, 360, -332, 222, 471, -598, 478, 318, -710, 554, 100, -618, 607, -144, -530, 451, -212, -206, 297, -351, 328, 146, -344, 405, -94, -259, 777, -344, -111, 652]
1774F52j226N89N27j250Q93R6r15R19l24k40N87n28J44M40q08P40m5p97J130l53
1794B31q08J261p21m39J178q41j93P79p45K08K52o40P03l40k71Q39p81J09Q98
1813F79j089L40P89j312O70L84j044P76l8o08P79l66k02M99o39M27K19q14R36
1832C86k54p07J188m82o34J102p48m0Q29r11J87L98o30M30o5m17P05m17k99R15
1852E36r16K18P86j107M90N32j135Q23J25p25P26k06m58O18l69l1M13p24M91o1
1872B6n54R71m01o25J230o49m13J104p95k13Q76r10K11M87o41M78j51k77O82p09
1892b73K5P14r23L05N64j039O19M60r81Q36J3p36Q60m08k26O20o88K68J70n70
1912c90P54j81p35J033m79n03J027p27j58R98r37K31N55p20L00J86n03M72j69
$$ y = [652, -574, 15, 542, -708, 185, 281, -634, 285, -39, -279, 308, -220, -76, 364, -444, 296, 251, -546, 584, 231, -577, 684, -37, -476, 702, -139, -332, 447, -298, -90, 162, -478, 225, -115, -386, 453, -328, -219, 679, -410, -70, 719, -593, 77, 461, -583, 193, 155, -453, 326, -40, -242, 257, -382, 45, 264, -550, 386, 132, -575, 613, 131, -503, 599, -149, -189, 640, -271, -84, 314, -316, 114, 49, -368, 337, -80, -379, 536, -380, -162, 624, -483, 7, 539, -596, 227, 352, -373, 353, 147, -311, 307, -62, -93, 320, -404, 87, 26, -528, 443, 42, -583, 647, -2, -415, 689, -106, -319, 557, -353, -142, 345, -296, 182, 31, -246, 436, -273, -248, 466, -457, -152, 412, -627, -8, 452, -529, 307, 320, -416, 444, 36, -190, 430, -258, 10, 180, -390, 364, 183, -552, 481, 2, -501, 526, -201, -359, 639, -298, -67, 488, -232, 68, 254, -249, 223, 54]
1931E4l55P40p68K52N15j069O23M44r62O50K05r32Q91j96m14O76n09J30M54o75
1951b46M35Q2p40Q35l68m80R26n90l37J042q18O5O42q83M37K49n96O41j23m26
1971b53O44l80j82N97p58M05M40j068O64K88r79Q40r8o47Q13m11j58N32m68K23
1991D4L70q32N80M1n56Q29m96l56R48q79N7P65q55J83N59q27M03J52o37P29j86
2012C6k83O47n58L2O41q72M09L79r93Q82k4q71R98m02m14O48m56J06M13n86M84
2033B16q9n06O29j97m45R49n81k83R53r05J73O45q74K68M20p70M35J42l78M90
2053B92m43rN79o98L22K92p39O31R7r06Q72m7n78O78n13j24O00m90M0L30l88L04
2075A02m3l85O76m50k93R47o48j50Q01p46J40M09p65N11K06o64O25l77j86O77
$$ y = [54, -301, 439, -329, -77, 438, -631, -8, 436, -526, 124, 329, -603, 288, 92, -322, 354, -155, -25, 429, -246, 189, 271, -469, 366, -2, -482, 444, -146, -483, 559, -259, -194, 448, -435, 2, 251, -345, 296, 173, -253, 391, 11, -171, 426, -332, 73, 513, -555, 109, 397, -582, 258, 160, -487, 326, -85, -243, 289, -179, 44, 414, -418, 162, 203, -353, 476, -20, -376, 572, -307, -250, 515, -340, -157, 402, -425, -22, 130, -507, 222, 36, -247, 400, -158, -126, 515, -357, 52, 431, -562, 320, 296, -575, 423, 21, -393, 255, -201, -95, 318, -268, 216, 127, -379, 250, 53, -392, 557, -24, -307, 646, -259, -86, 559, -315, -47, 373, -397, 38, 180, -198, 292, -151, -160, 419, -279, 43, 335, -404, 227, 324, -582, 290, 243, -335, 343, -170, -294, 306, -184, -144, 186, -202, 102, 59, -326, 350, -100, -393, 554, -94, -244, 557, -189, -49, 360, -405, 106, 312, -352, 273, -104, -290, 387]
2095C87n03J1N86r14M58M05r24P37m6o35N74p5l27O29m44j37M83n14K66N7k86
2116b12M18k49k46Q65o50j85Q85q64R2O59p80L10M00p58M74m3l52M49k41j52N26
2137C46o72K42L45o75O18M5n60O30p5p03P74k32k66N46m83JL36n38N02r1n49O90
2159B31l38j44O67o85L7N66p06L10M99p77L93J81m95L93k6l23N19n88K14M11o83
2180c44M69Q3n50O14k64l77O57l52l81Q26m50j82O23n42J79J81m19M23k52j77
2200b35O12m94r6O06o90J61N05o94K77K35o23O51L4n63N97j09k81M13l58Q7K96
2221C31o47M97k6n52O55k29l79P47n37j03N37n16J96K67n29L39J59l86M03k28
2241al11O62n82J72N17p23K04M50o77L83P7n14N51k01j75M19l01N2J62m69M36
$$ y = [387, -116, -105, 481, -433, 25, 430, -494, 243, 197, -438, 136, 61, -266, 363, -81, -218, 265, -249, 17, 74, -212, 206, -43, -289, 576, -74, -259, 626, -238, -146, 513, -267, 43, 443, -315, 159, 116, -236, 213, -28, -180, 346, -326, -84, 261, -414, 204, 249, -311, 319, 244, -459, 315, 83, -183, 363, -120, -119, 217, -321, 181, 90, -459, 231, -107, -251, 416, -269, -232, 334, -372, -62, 437, -340, 53, 234, -261, 132, 106, -217, 302, -286, -72, 339, -344, 125, 208, -342, 272, 8, -369, 288, -64, -445, 381, -69, -251, 372, -170, 9, 190, -229, 194, -58, -235, 377, -117, -213, 393, -297, -136, 369, -325, -48, 187, -436, 215, 249, -314, 283, 174, -107, 306, -52, 35, 331, -316, 181, 155, -397, 258, 29, -350, 397, -140, -243, 294, -222, -26, 241, -288, 51, 210, -176, 227, -1, -312, 350, -232, -60, 457, -266, -62, 388, -289, 94, 171, -343, 208, 7, -168, 251, -50, 2, 164, -305, 131]
2262A31K7m43O00k80l23N76k36l02N92n00p5N12o40L28J36l67M11K1l82L50k17
2283h1q0M16m66L03K73p61L43M20q40O40l3m67M45k11N7L37n52K89R7l95M66m2
2305A58l76N19k90j76L98k41j82N36m56o0L58l67J89Lk54M83m20NM41n80K51L88
2327C27n39L44R1n45M67Lm76N70k25l09N56l43J6P7j14P9J49m24N12r8k14L64
2349B68l02j02N58n61n3M00k36j7K15l92K84q2k41M78l36j1L37m60K32K69n87
2370c39L44K49m83M51n7l45M11j37j94K92l73J02K24k94K01q2l02N36l52n0M43
2391B45l66m7M25l54oL25m38L01J04m45L55j07j17L91l66KL12l76J32K86n84M55
2413A27k0l72M79j03j97K31k34L2J46k08J75J35l86L71j46k04L92l92J02M22n25
$$ y = [131, 158, -285, 315, 35, -288, 288, 52, -250, 342, -158, -233, 279, -361, -33, 103, -264, 147, 168, -214, 136, -81, -161, 255, -211, 92, 365, -396, -53, 367, -473, 167, 134, -333, 112, -99, -42, 295, -257, 32, 129, -266, 200, 158, -218, 301, 11, -165, 233, -8, -190, 346, -110, -170, 188, -179, 10, 13, -241, 242, -178, -173, 268, -312, -61, 327, -212, 132, 223, -322, 145, 148, -328, 242, 17, -292, 264, -79, -63, 14, -100, -21, 128, -296, 216, 118, -96, 268, -34, -136, 422, -139, -192, 208, -28, -45, 170, -222, 62, -20, -261, 217, -119, -130, 207, -253, -21, 248, -339, 5, 254, -229, 222, 165, -180, 231, 94, -100, 192, -181, -79, 145, -149, 52, -30, -332, 204, -148, -198, 245, -121, -168, 257, -97, -103, 222, -216, 85, 189, -256, 99, -8, -125, 266, -100, -98, 214, -162, -30, 256, -328, 127, 107, -265, 214, 111, -86, 145, -89, -57, 89, -119, 56, 191, -195, 176, 30, -174, 218, -174, -72, 350, -175]
2434a75J15K30k93R3K82m89M05j18j13J71k59J26K51m81R0L38m27L05Q6l72M41
2455B06k64j56M10j52k10L19k92J70J83l01K48M8m17M42k00j51M29l14N3J09k89
2476a29J87J69m47K85N5k40L91l03K4K07l06J56kk69K52Q3l40L05l7l73M59j23
2498Dk24L96j75j15K21k72K76O4l10K83j19j42K99k17j72L38m01K90K22l43J01
2519DJ08m11M58p5q0J49j72l0J86m24L43K01l80L10m0k91K19P8k87L05k98J7K54
2542A44j88K3J36k68L60k80n9L72k95j39L92k99R6K26k99N2J80l50J77J38l00
2563a81L00k03n9J43j42J30J05k02K37m9k70L35n5l30L64o6j94L21k37QJ68k70
2585a47J69P9k26K27k9j88L05k48J2L08l62p1L08k35J41J56l08K16N3j79K09l27
$$ y = [-175, -60, 170, -123, -30, 252, -237, 168, 50, -63, 108, -151, -25, 226, -255, -165, 173, -254, 51, 137, -235, 206, -58, -214, 196, 44, -166, 153, -139, 31, 214, -87, 161, 209, -208, 234, 34, -117, 312, -2, 51, 160, -129, 58, 227, -220, 65, 120, -120, 271, -32, -8, 199, -107, 49, 47, -222, 30, 113, -227, 78, 41, -332, 127, 4, -220, 176, 1, -114, 107, -165, 111, 175, -135, 148, 29, -113, 186, -31, -203, 135, -266, 24, 246, -97, 4, 112, -299, 159, 84, 4, 153, -19, -49, 137, -287, 56, 257, -123, 187, 147, -144, 75, 153, -134, 171, -127, -110, 144, -44, -21, 115, -153, 207, -73, -132, 240, -55, -194, 198, -101, -5, 221, -78, -26, 154, -196, -19, 119, -181, 119, -84, -143, 0, -142, -12, 93, -109, 128, 79, -191, 144, 89, -241, 123, 57, -137, 184, -53, -45, 123, -147, 22, 101, -125, 102, 73, -115, 190, -58, -46, 262, -100, -171, 137, -98, 43, 199, -109, 107, 160, -19, 190, -137]
2607a37O2J81j83J46K4k57J20J85l89L44j30r4L23j07k00K87l13J58Ln8J29K4
2629A18j62J35o8j13L69l38PK57l48J55J54l10K94m9k12K24r4j36K45k46J73K
2651E7k02K28o3j39K37q6j32K58j79o6K05j18n8Q5m0L1P1j82K20q6j81K13j29
2674e6j62L61j94L4J92k22P3J38l26J77k1lJ42j15M5kr8J51M1k43K14j4l53L01
2698F0k7j68L36k21j4K23k37K8Q7p0P8k6j15J49j32j35L75k29j1K20k34Q2J27
2721A46k73K85j3l28K48J12k60J89j95J10J0o6O1kn9J87j54k43M23j14j58J81
2743H7k07K5R5m4k0J38j48j2K3Q5J37k40N2J62k43K6J37k39L52j34j92K23j2j26
2767g5L5R5j37J15o9M8J1K5M0p5l0R4J6j36K89j95j66K54k15O7Mj31Q0Q1q5J90
$$ y = [-137, -75, 106, -77, 69, 93, -164, -44, 141, -248, 96, -34, -128, 195, 88, -112, 175, -138, 20, 23, -35, 94, 118, -44, 91, 23, -90, 279, -59, -52, 205, -143, 12, 166, -144, 150, 101, -111, 113, 19, -117, 128, -118, 55, 57, -145, 83, 20, -119, 118, 32, -100, 158, -21, -87, 118, 0, -58, 27, -13, 18, 89, -93, 127, 41, -140, 73, -56, -218, 143, -51, -17, 175, -47, 26, 164, -162, 15, -6, -9, 133, 18, 63, 61, -37, 114, 155, -88, 126, 112, -241, 60, 33, -135, 201, -20, -34, 189, -48, -20, 67, -3, 75, 49, -66, 83, -49, -184, 191, -38, -49, 171, -63, 19, 146, -127, 158, 145, -183, 65, 177, -83, 106, -89, 21, 31, -35, 26, 24, -35, 152, -2, -245, 178, 64, -94, 87, -120, -95, 0, -44, -64, 74, -74, -86, -63, 22, 159, -81, -29, 133, -110, -84, 53, -186, 166, 32, -160, 63, 51, -75, -40, 55, -82, 33, -36, 12, 23, 48, 88, 13, -17, 77, 93, -43, 246, 51, -115, 139, -76, -9, -5, -136, -56, 25, -60, 130]
2793A30k37K8P4q9J12N5j97K01J14k58J57L1j63J51j01m8J34j19n4L9l9Q9N2j28
2817f6K34j59o8J58m8k07K41j45RJ78j07L5j06j8M8o6KJ26j47RK39k48J05pn6
2842f4K04l5j84J71n2r0M2l5o6J51k8l3Q9pp0%m4J71m2k15K15j61O8J21j67n3
2868a14K66k64J24k1o1M1RPQ8p2j06J31j80L10k11j07J26R4j9J5k4o7Kk2O9N6
2894G0j55J14P0r1lk2l8Q7r5n8J24j3l7J88j68JJ39j81J94j85p9J71n1J0J00k08
2920a16J11K8j19J94n5j10J28K2j70J28l5n7J37j37O7R3o4L7q1q1RJ06k3m5O7
2945C4o6Po3J8J01o2O4j40L4J06L5m9M3j65RR6p9J46N0j97K23o5j70J88K3j06
2971A5L7k9l5J23j26O3m7j9J06p4On3mr5K20j42K16ok96N6P8P9k9r1K6O9m1nJ8
$$ y = [130, -107, -79, -5, -94, 18, 73, -124, 77, 191, -67, 90, 121, -42, 109, 8, -40, 94, -25, -79, -40, -79, 10, 62, -66, 168, 9, -59, 99, 51, -156, 85, -60, -51, 127, 20, 55, -51, -69, -21, -87, -85, 41, -106, -97, 142, -106, -1, -8, -64, 140, 105, -79, 92, 40, -50, -8, -43, -109, 42, 14, -19, 70, 63, -7, -7, -51, 120, 78, -137, 78, -83, -15, 106, -61, -114, 152, -112, 12, -9, -70, -29, -20, -13, 75, 3, -103, 28, -152, 158, -53, -160, -34, 60, 41, 56, 32, -35, -33, -55, 14, 70, -85, 29, 99, 8, 5, -17, -55, 32, -63, -121, 3, -10, -47, 141, -27, -26, 113, -68, 126, -59, -138, 33, -18, -8, 92, -116, -5, 23, -96, 98, 43, -67, 61, 83, -87, 41, 6, -51, 86, -51, 16, 109, 45, 82, 1, -80, -71, 35, 12, -33, 34, -32, -25, -88, -70, 31, -31, 33, -107, -73, 33, 68, 19, 62, -103, -94, 2, -77, 69, 119, -78, 145, 80, -90, 98, 121, 15, 52, 23, -12, 111, -15, 48, 1, -18, 88, 14, 20, -33, -37, -132, 88, -54, 162, 156, -140, -84, -6, 73, 44, -47, -21, 48, 7, 2, 20]
3000B0j84K22J8j65nJ80p5L2mj36K21j11k9O7o1N2oqm6M1Ll1R5j91K68j57P4j
3028H3j17kn6n7K95j37k4K0m2kJ2P9j01J03p3N0O9j32m9O1kJ20k15J79q1k8J88
3055A41o1n8J05j04j64J82j0N9l8j29L4R1j28K42j74JK68k20J3o5Q3j34J88k10
3079h8J42J7r1R9j96J89k2n6L5O0j69K8Q5r1J22k7j5p6Q4j9k0m8R9M9k8j4o5j08
3107a24J46O0j61R6k8L7l1j6R4j7Rj51K17j48O1O4o7l5r3L9O1M1oj42O4N8j9N
3135A4k2kN8l4m0L9k4m2%J04j31n0P8M9q7K4k8J76j17k1j1j0R0k4J60j5j38n9
3163f3J01r4J39n7j6o4k4N8O9j8j06O0N7j34K28q9j00J66m4n3k2k1M2Q0j22L3
3189Fk5J64j42N6o9J81j71J23j21J9o4J06j2n8P1j92N7J25m5K5LJM4r2j61J44
$$ y = [20, -164, 58, 76, -89, -94, 86, 11, 43, 39, -97, 124, 13, -16, 51, -10, 42, 36, 28, -18, 23, 26, -5, 90, -101, 167, 10, 84, 83, -34, -36, -92, -149, 146, 9, -15, 5, -37, -39, -27, 52, -49, 54, -19, 31, 100, -32, -81, -20, -22, 98, -117, 62, -19, -47, 141, 80, 22, 127, 23, -141, 41, 31, 90, 52, -77, -43, 48, -80, 162, -12, -11, 257, 37, 50, -15, 68, -66, 122, -88, 54, 71, -20, 79, -117, 72, 50, -6, 29, 89, -80, -52, 33, -58, 64, 37, 22, -54, 30, 11, -9, -57, 42, 91, 63, 49, -16, -124, 22, 82, -79, 17, -11, 26, -5, -21, 73, 56, 65, -86, 131, -17, 44, 108, 41, 6, -87, -48, 13, 54, 48, -94, -30, 28, 9, 14, -8, -10, 48, 14, -26, 13, -11, -53, -53, 51, -80, -130, -52, -3, -90, -66, -94, 82, -35, -56, -67, -77, 13, -11, 149, 134, -4, -63, 38, -56, 83, 26, 10, -54, -78, -20, 49, 31, -75, -15, 42, -92, 136, 47, -53, 113, 69, 16, -6, -27, 15, 95, -27, 6, -19, 145, 3, 59, -10, 171, 0, 123, 2, 21, -43, 63, 51, -7, 64, -128, -71, 54, 9, 34, 37, 38, 82, -10, -171, -27]
3215b7k0P4j6K1oj06n8K13m8m5P4r1%qN6p3O0r3N5m2R2N8n0K3%N7o4ol3j7o3N4
3247b9N1l3o9J05n5R0j45J17jmM2q1j6N7n1n6M2O7l6J22j23OM2k5M2l9k2j32M2
3276i2J11j9M1l0nm8P9r8O2K6N6r9o6N7O1j11j9Q2m0O0q9M5N3n8J88j65N9m1J4
3305A4J8j4OK1qj10O0K6Q3j49j5N3j5M9qo1L4KkL7L1qM8j38K5M0p0K5K6N0o0%
3337a0Q5o0No2J72k14J0P4M3j0j8n0%M7m8m9O6L3j1J0L2J2r7J0j0L7L9P2j29J03
3367H2j05oJ51j88J10k3j08R7M4o9q9K12j18R1j53J26l9NM3r9j3N9j3M4M3j84
3393a00J79k0Lp4L5k1L7j2jN4j25MJ85q2j32R9n6L6J35j78L0j1q7R9Q4k7j60J29
3421B3%m0L6Q5q9J8%l6J5Ok9N7N0q3K4n2l2R5p8o0J37p2N5L2j27L0P4p5M9Q8k14
$$ y = [-27, -47, 27, 11, 32, 26, -80, -138, 75, 27, -18, 56, -35, -35, -43, 13, -60, 0, -93, -38, -80, 12, 70, 20, 43, 43, 100, 36, 30, -3, -20, -83, -29, 22, -11, -80, 25, -30, 60, -85, 32, 31, 27, 69, -12, -28, 29, -22, -78, -36, 31, -5, 117, -6, 0, 42, 17, 59, 20, -2, -134, -92, 19, 0, 41, 11, 6, -42, 37, -61, 1, 27, 83, -16, -82, -25, 36, -75, -94, -12, -52, 8, -81, -36, 17, -41, 147, -18, 41, 0, 14, 32, 18, 24, 45, 37, -73, -13, 13, 96, -53, -68, -15, -30, 19, 11, -50, -16, -14, -16, 21, 52, 44, 92, -46, -21, 19, -51, -26, 0, 50, -10, -10, 75, 15, 20, -42, 130, -84, -74, 0, 43, 33, 15, -35, -35, 12, -36, -85, -19, 14, 3, 13, 45, 57, -40, -30, -40, -3, 36, 108, -21, 82, -23, -29, 122, -66, 44, 21, -87, 10, 54, -15, -104, 108, -10, 81, -72, 54, 15, 20, 63, -36, -49, 10, -3, 41, 84, -100, 79, 59, 62, -12, 23, 2, 39, 27, 26, 80, -45, -41, 144, 62, -70, 29, -27, 9, 144, -34, -4, -15, -102, -3, 81, 54, -106, 23, 23, -17, 19, 104, 15, 33, 33, -3, 12, 18, -11, 46, 96, 13, 37, -15, -47, 48, -30, -90, 47, -25, 30, 62, -65, -35, 39, -36, 13, 101, -113]
3452a13J65j19R1Q7j30l9J07K3j02P1K8p2j13O6P7o1m7J32J6j62J7R4o7N9q4R4
3478A8Q7j16R9j38j5Q7k4j3K0l7l2L5m2M9M5o5O6o9n6O2l8K9m8K5P8M3M3j13p6
3507i6J00m9R9j50pJ78k0q9n6J95p5p5M7M1j15K1L1kL5p6J3J21j36J57k0j32J05
3534D5Mq2mQ6m7l6O2P1p1o0p5J23l3K4o8P1j3N7j98K78j69L9k0k5J47j76o7J37
3562@Nl9K6r9J08k6J25j45m6J90j0jj53Q0Kj5K7R1j57Rp4R8J9O6j67J32K7k8N0
3591I5p8L8j5q0lL3l5Q7j81K34j12j1RM1JJl7n0J22j41N7P5j75N6O6o2O0n7O8
3620FK9p5L5O8j07N8m4K2j22J10n5m6O7J03j32J2M7j1%J44j20LRJ9m1J74j4j13
3648B6M3j08J08J4q9OJ45j36p9N6Pp1LJ27j3r6M5l2L7M9o2J0J70k46O0L0R7r5
$$ y = [-113, 52, -67, 24, 111, -19, -58, 49, 72, -30, 41, 69, -3, -116, -50, 27, -34, -81, 51, 67, -95, -78, 16, -51, 8, -76, 18, 105, -11, 88, -50, -65, 22, -2, -15, 5, -32, -64, -29, -71, -22, 23, -42, 24, -45, -101, -39, -77, -48, -96, -71, 7, 50, 93, -20, -96, 4, -45, 54, -96, -103, 75, 55, -34, -90, 105, 30, -45, 2, 43, -72, -51, -20, -22, 13, -63, -50, 71, -65, 92, 72, -60, 45, 49, -33, -37, 49, 2, -34, 28, 99, 28, -32, -107, 16, -17, 7, -61, 10, -3, 54, -144, 134, -35, 4, -16, -41, 106, -70, -137, 0, 5, -34, -8, -107, 1, -25, 100, -45, -91, 99, 89, 88, -65, 15, 17, 2, 29, 120, -37, -28, -102, -4, 15, 81, -86, 46, 73, 45, 95, 17, 55, 40, -40, -43, -10, -45, 42, -139, 95, -17, -28, -19, 22, 23, 24, -13, -63, 59, -82, -25, 50, -125, -69, -3, -65, -5, -62, 6, 35, -40, -5, 63, -44, 14, -30, -8, -130, -20, -75, -121, -54, 49, -83, -71, -24, -35, -35, 109, -11, -8, 1, 20, -21, 153, 139, 26, 69, -39, 69, 83, -6, 0, 145, 9, -70, -14, -7, -78, -75, 52, 39, -57, -12, -44, -7, 42, -20, -10, 160, -86, -26, 4, 101, 6]
3676FO2n1l0jo0J87k9j29N7N5r4O5J3j24R4j5L1j44J22j0k3k1OJ8k5O5r8R2Q9
3705A08k26K08j5p4J4j19L0L9l1l0J70j12JM6l6R0Kj73N8kO0l0m2n9J43m4Q1M3
3733A00r4L4ok1j5O0j31J04P5n5n0l3L7K2pL6J5j56J48j3l8m3%O8p3m6Q5K2n6
3762c1p9J13k09J51L6q5P4M7k3L1Lo0M9j88J28M0qq3j5R8j7j3J29j32L1N1M2o5
3790A5P2j59J18p7P6k04J10m4P6J2l7P1J6n1jk3j55R0P2q6O4J03j19L3K9nL6p9
3818d7Q4k3OO2j95Q0R0q3j03J28n2L2J12j40J7P1o9J41j20m0l1J02ORK7k38R2
3845h2L6J46j44J33n7j33J55J3j14m4K6M2O7r9J61j03l9Q7l8P1n6J9j38J24j21
3870h8N9O7m5K3p7J03l4M0j37J29j94J13K2K1M3oj25O6l1N3J9M2o8L7o0N1o4L3
$$ y = [6, 68, 17, -13, -14, -74, 113, 84, -45, 12, 67, -27, 38, 51, -73, 21, 6, 37, -107, 15, 5, -18, -39, -33, -15, -40, 25, -73, 19, 108, -118, 90, 75, 1, 15, -104, -74, -35, -66, -96, 74, -38, -37, 9, -27, 63, 65, -108, -50, -52, 8, -22, -64, -123, 20, -24, 57, 100, 6, 40, 34, 13, -2, 58, -73, 31, 106, 51, 1, -32, 5, 27, 20, 56, 71, -85, 63, 50, 12, -31, -31, 37, -36, -82, 3, 25, -31, -110, 3, -206, -55, -19, -104, -30, 17, -6, 25, 28, -32, 17, -171, -43, -3, -11, -94, -109, -11, -28, -41, 88, -44, -13, 38, 80, 15, 87, -72, 46, -31, 45, -159, -49, -93, -17, -5, -42, 29, 45, -6, -7, -30, -185, -95, -23, -109, -45, 58, -61, -28, 1, -4, 32, -47, 37, 14, 20, 82, -113, -33, 57, -26, -129, -1, -53, -21, 91, -49, -32, 39, -30, 111, -9, -49, -80, 22, 28, 37, 64, -174, -82, -46, 100, -44, 89, 32, -101, 54, 67, -47, -91, -65, -23, 44, -55, 106, 3, -36, 51, 13, 84, 28, 47, -91, 33, -88, -29, 38, -7, 16, -61, 42, 8, 48, -89, 40, -154, -41, -19, 2, 45, 39, -86, -20, -51, 2, 21, 63, -5, 32, -28, 23, -41, -8]
3898hq6P4J12q0J1oj64J69o9N0j3l9P8M6r2oN2r5L5K3K24j88j65Q8J03q1J3O6
3926E2%q0kj29N7J26k6K8K2o8J06q1k8K0j37J53Jj07J18j58J08l7M3r8J68j41
3952i0J20p3j1J19J1N1q8n9J4k4Jj18N7K1O6O5q4J38j76K1l3O1o2M7j04K10m5
3979C5J2j04j8J22O3j48rMo0K21j34J1J26q8r3J32Onm1K5k7n5o3M9QN9l1k4K8
4008AL7l8N6N7j41m1R4j40J13L9M4j73L6l3J82j15lk3QR0o6l7NJ49q9j4K4j57
4036a35K04r7kN5j3km8N2R1k4m9J32q5k16J33k2p1Q0j48J64J04j28o7J88j71R9
4062B4m1L2O7j74J06m8J39p9m0Pl0J5J2J28j50k0j37J53j5J05p4K0N7m4J01M1
4088A55l17J25Q7K6j01n4L2P5M3jK1k03J18k0j67J76J13j24J02q5j50J63mL3M7
$$ y = [-8, -94, -20, 92, 12, 23, 17, -147, 22, -47, 3, -10, -49, 29, 75, -17, -23, 29, -66, -31, -8, 216, 28, -137, -49, 54, -27, -14, 52, 52, -28, -30, -159, -102, 24, -2, 26, 48, -20, 86, 5, -23, -3, -140, 13, 14, -93, 25, -133, -25, -62, -19, -117, 51, -90, 30, -43, -54, 65, 76, 127, 39, -20, -6, -30, -29, -147, -90, -69, -3, 62, -22, 116, -60, -39, -72, -11, -73, -26, -130, 80, 35, 47, -57, -75, 47, 110, -38, -47, -43, -103, 118, -16, -5, 121, 33, -60, 72, 78, 73, 32, 57, 30, -25, -88, -39, -31, 28, -3, -27, 1, 38, 0, 56, 113, -28, -69, 25, -115, -2, 37, 81, -92, -56, -89, 93, -22, -25, -48, -40, 50, -16, -53, -48, 101, 12, -2, 22, -135, 69, -28, -30, 25, 12, 10, -38, 14, 105, 81, 32, 164, 79, -137, -4, -26, -97, -17, -165, -1, 103, -25, -92, 96, -75, 24, -17, 15, 82, -92, 14, -34, 105, 26, -14, -7, -37, -22, -10, 118, -32, -52, -189, -36, -51, 54, -20, 0, 57, 13, 114, 155, -162, -37, 50, 76, -25, -79, -47, 28, 71, 70, 91, -112, 6, -14, -181, -5, 108, -16, 86, 1, -149, 14, 10, 43, 90]
4113I0k1k42K77q9K8k9j17J45j24M2M5j35J21O6k2k9M8p4J03M7j25N3j25N5Jj06
4139a17J97J70k49M6q9k1M8N8P2r6J67j56j16L7N7j9Om0P7j7J9l4J9J26k77O6
4165f6J04o2nL8q0J00j26J09R4q2o4R2n9K5k5p9K2L3o3J86J5o2o5n2J48p8L0M2
4193G0J9q2PL1j55Q4k1K5O7j04O1Q6o8K3o7J6Ll9Q6N9n7m3Kl6l5J43o3O4j49Q2
$$ y = [90, 69, -173, 104, 15, 43, 14, -103, 42, -82, -40, 5, -130, -9, 57, 35, 6, 54, -20, 83, 130, 5, 58, -67, -12, -11, -117, 80, 250, 1, 47, -42, -63, -15, 43, 115, 19, 186, 30, -86, -49, 8, -11, -5, -45, 32, 15, 34, 0, 19, 145, -132, -66, 38, -24, -29, 9, -71, 29, -97, 12, 106, 24, -40, 52, -7, 18, -7, -86, -64, -31, -94, 92, 107, 45, -20, -72, 76, -2, 28, 70, 89, 7, 14, 45, -110, -26, -47, -22, 45, -59, 2, 88, 20, 43, -24, -8, -5, -44, 42, 101, 44, 1, 3, -33, -68, 75, 12, 76, -73, 9]
$$ [...]
8191C
##END NTUPLES=NMR FID
##END=
