##TITLE=1H_DE-80H_X3
 200.13MHz, d2o
 8 sc
 
 19ns.26.2.2025
##JCAMPDX= 6.0         $$ Bruker NMR JCAMP-DX V2.0
##DATA TYPE= NMR FID
##DATA CLASS= NTUPLES
##ORIGIN= UXNMR, Bruker Analytische Messtechnik GmbH
##OWNER= pz
$$ XWIN-NMR		Version 3.5
$$ Thu May 15 14:18:46 2025 Russian Standard Time (UT+4h)  Yarkov@DPX200
##.OBSERVE FREQUENCY= 200.1313
##.OBSERVE NUCLEUS= ^1H
##.DELAY= (6, 6)
##.ACQUISITION MODE= SIMULTANEOUS
##.ACQUISITION SCHEME= undefined
##.AVERAGES= 8
##.DIGITISER RES= 18
##SPECTROMETER/DATA SYSTEM= spect
##.PULSE SEQUENCE= zg30
##.SOLVENT NAME= CDCl3
##.SHIFT REFERENCE= (INTERNAL, CDCl3, 0, 14.3821)
##AUDIT TRAIL= $$ (NUMBER, WHEN, WHO, WHERE, WHAT)
$$ ##TITLE= Audit trail, XWIN-NMR		Version 3.5
$$ ##JCAMPDX= 5.01
$$ ##ORIGIN= Bruker BioSpin GmbH
$$ ##OWNER= Yarkov
$$ C:/Bruker/XWIN-NMR/data/yarkov2/nmr/H-C/1/audita.txt
$$ ##AUDIT TRAIL=  $$ (NUMBER, WHEN, WHO, WHERE, WHAT)
(   1,<2025-05-15 14:17:40.59 +0400>,<Yarkov>,<DPX200>,
      <created by zg, POWCHK disabled, PULCHK disabled
       configuration hash MD5:
       00 E9 B6 7A A2 85 ED C7 34 08 36 98 17 FE 4E 26
       data hash MD5: 16K
       99 90 77 7C B7 7C 0B 37 27 22 2E A2 77 E8 4C 28>)
$$ ##END=
$$ 
$$ hash MD5
$$ A1 83 BA D4 41 E2 C8 12 BD 46 88 BB 60 22 C7 20
##$RELAX= 
##$RELAX= 
##$RELAX= 
##$RELAX= 
##$RELAX= 
##$RELAX= 
$$ Bruker specific parameters
$$ --------------------------
##$DU= <C:/Bruker/XWIN-NMR>
##$EXPNO= 1
##$NAME= <H-C>
##$PROCNO= 1
##$TYPE= <nmr>
##$USER= <yarkov2>
##$AMP= (0..31)
100 100 100 100 100 100 100 100 100 100 100 100 100 100 100 100 100 100 
100 100 100 100 100 100 100 100 100 100 100 100 100 100 
##$AQSEQ= 0
##$AQ_mod= 1
##$AUNM= <au_zg>
##$AUTOPOS= <>
##$BF1= 200.13
##$BF2= 200.13
##$BF3= 200.13
##$BF4= 200.13
##$BF5= 200.13
##$BF6= 200.13
##$BF7= 200.13
##$BF8= 200.13
##$BYTORDA= 1
##$CFDGTYP= 0
##$CFRGTYP= 5
##$CHEMSTR= <none>
##$CNST= (0..31)
1 1 145 1 1 1 1 1 1 1 1 1 1 1 1 1 1 1 1 1 1 1 1 1 1 1 1 1 1 1 1 1 
##$CPDPRG= <>
##$CPDPRG1= <>
##$CPDPRG2= <>
##$CPDPRG3= <>
##$CPDPRG4= <mlev>
##$CPDPRG5= <mlev>
##$CPDPRG6= <mlev>
##$CPDPRG7= <mlev>
##$CPDPRG8= <mlev>
##$CPDPRGB= <>
##$CPDPRGT= <>
##$D= (0..31)
0 0.7 0 0 0 0 0 0 0 0 0 0.03 0 0 0 0 0 0 0 0 0 0 0 0 0 0 0 0 0 0 0 0 
##$DATE= 1747304260
##$DBL= (0..7)
120 120 120 120 120 120 120 120 
##$DBP= (0..7)
150 150 150 150 150 150 150 150 
##$DBP07= 0
##$DBPNAM0= <>
##$DBPNAM1= <>
##$DBPNAM2= <>
##$DBPNAM3= <>
##$DBPNAM4= <>
##$DBPNAM5= <>
##$DBPNAM6= <>
##$DBPNAM7= <>
##$DBPOAL= (0..7)
0.5 0.5 0.5 0.5 0.5 0.5 0.5 0.5 
##$DBPOFFS= (0..7)
0 0 0 0 0 0 0 0 
##$DE= 6
##$DECBNUC= <off>
##$DECIM= 32
##$DECNUC= <off>
##$DECSTAT= 4
##$DIGMOD= 1
##$DIGTYP= 9
##$DL= (0..7)
0 120 120 120 120 120 120 120 
##$DP= (0..7)
150 150 150 150 150 150 150 150 
##$DP07= 0
##$DPNAME0= <>
##$DPNAME1= <>
##$DPNAME2= <>
##$DPNAME3= <>
##$DPNAME4= <>
##$DPNAME5= <>
##$DPNAME6= <>
##$DPNAME7= <>
##$DPOAL= (0..7)
0.5 0.5 0.5 0.5 0.5 0.5 0.5 0.5 
##$DPOFFS= (0..7)
0 0 0 0 0 0 0 0 
##$DQDMODE= 0
##$DR= 18
##$DS= 0
$$ [...]
##$SUBNAM2= <"">
##$SUBNAM3= <"">
##$SUBNAM4= <"">
##$SUBNAM5= <"">
##$SUBNAM6= <"">
##$SUBNAM7= <"">
##$SUBNAM8= <"">
##$SUBNAM9= <"">
##$SW= 18.0517328524113
##$SWIBOX= (0..15)
0 0 2 0 0 0 0 0 0 0 0 0 0 0 0 0 
##$SW_h= 3612.71676300578
##$TD= 16384
##$TD0= 1
##$TE= 0
##$TE2= 300
##$TE3= 300
##$TEG= 300
##$TL= (0..7)
0 120 120 120 120 120 120 120 
##$TP= (0..7)
150 150 150 150 150 150 150 150 
##$TP07= 0
##$TPNAME0= <>
##$TPNAME1= <>
##$TPNAME2= <>
##$TPNAME3= <>
##$TPNAME4= <>
##$TPNAME5= <>
##$TPNAME6= <>
##$TPNAME7= <>
##$TPOAL= (0..7)
0.5 0.5 0.5 0.5 0.5 0.5 0.5 0.5 
##$TPOFFS= (0..7)
0 0 0 0 0 0 0 0 
##$TUNHIN= 0
##$TUNHOUT= 0
##$TUNXOUT= 0
##$USERA1= <user>
##$USERA2= <user>
##$USERA3= <user>
##$USERA4= <user>
##$USERA5= <user>
##$V9= 5
##$VALIST= <valist>
##$VCLIST= <CCCCCCCCCCCCCCC>
##$VD= 0
##$VDLIST= <DDDDDDDDDDDDDDD>
##$VPLIST= <PPPPPPPPPPPPPPP>
##$VTLIST= <TTTTTTTTTTTTTTT>
##$WBST= 1024
##$WBSW= 4
##$XGAIN= (0..3)
0 0 0 0 
##$XL= 0
##$YL= 0
##$YMAX_a= 126649
##$YMIN_a= -94842
##$ZGOPTNS= <>
##$ZL1= 120
##$ZL2= 120
##$ZL3= 120
##$ZL4= 120
##$ABSF1= 10
##$ABSF2= 0
##$ABSG= 5
##$ABSL= 3
##$ALPHA= 0
##$AQORDER= 0
##$ASSFAC= 0
##$ASSFACI= 0
##$ASSFACX= 0
##$ASSWID= 0
##$AUNMP= <proc_1d>
##$AZFE= 0.1
##$AZFW= 0.1
##$BCFW= 1
##$BC_mod= 2
##$BYTORDP= 1
##$COROFFS= 0
##$CY= 83.5205535888672
##$DATMOD= 1
##$DC= 2
##$DFILT= <>
##$DTYPP= 0
##$F1P= 10.8118882576601
##$F2P= -7.23987719738617
##$FCOR= 0.5
##$FTSIZE= 0
##$FT_mod= 4
##$GAMMA= 1
##$GB= 0.15
##$INTBC= 1
##$INTSCL= 1
##$ISEN= 128
##$LB= 0.25
##$LEV0= 0
##$LPBIN= 0
##$MAXI= 10000
##$MC2= 0
##$MEAN= 0
##$ME_mod= 0
##$MI= 1.114404
##$NCOEF= 0
##$NC_proc= 0
##$NLEV= 6
##$NOISF1= 3.799351
##$NOISF2= 2.8
##$NSP= 1
##$NTH_PI= 0
##$NZP= 0
##$OFFSET= 14.38212
##$PC= 1
##$PHC0= -1345.591
##$PHC1= 7.133752
##$PH_mod= 1
##$PKNL= yes
##$PPARMOD= 0
##$PSCAL= 0
##$PSIGN= 0
##$REVERSE= no
##$SF= 200.129724274929
##$SI= 16384
##$SIGF1= 3
##$SIGF2= 2
##$SINO= 400
##$SIOLD= 16384
##$SREGLST= <1H.CDCl3>
##$SSB= 0
##$STSI= 0
##$STSR= 0
##$SW_p= 3205.1282051282
##$SYMM= 0
##$S_DEV= 0
##$TDeff= 0
##$TDoff= 0
##$TI= <>
##$TILT= no
##$TM1= 0
##$TM2= 0
##$TOPLEV= 0
##$USERP1= <user>
##$USERP2= <user>
##$USERP3= <user>
##$USERP4= <user>
##$USERP5= <user>
##$WDW= 1
##$XDIM= 8192
##$YMAX_p= 0
##$YMIN_p= 0
$$ End of Bruker specific parameters
$$ ---------------------------------
##NTUPLES= NMR FID
##VAR_NAME=  TIME,          FID/REAL,        FID/IMAG
##SYMBOL=    X,             R,               I
##VAR_TYPE=  INDEPENDENT,   DEPENDENT,       DEPENDENT
##VAR_FORM=  AFFN,          ASDF,            ASDF
##VAR_DIM=   8192,          8192,            8192
##UNITS=     SECONDS,       ARBITRARY UNITS, ARBITRARY UNITS
##FACTOR=    0.0002768,     1,               1
##FIRST=     0,             0,               0
##LAST=      2.2672688,     0,               0
##MIN=       0,             -94842,          0
##MAX=       2.2672688,     126649,          0
$$ Real data points
##PAGE= N=1
##DATA TABLE= (X++(R..R)), XYDATA
$$ [...]
$$ plain form
1321 -86 602 -889 47 73 -1032 323 17 -645 746 -140 -171 986 -114 368 890 -472 501 367 -641
1340 -641 576 -71 -502 526 -529 -399 545 -594 -27 531 -668 477 325 -608 651 -222 -582 408
1358 408 -616 -432 483 -834 -170 316 -594 505 432 -361 953 101 17 884 -220 -146 533 -825 -29
1377 -29 370 -674 315 85 -497 675 -24 -274 781 -245 87 707 -566 234 401 -702 347 -142
1395 -142 -735 468 -550 -588 431 -588 -63 442 -569 393 450 -403 663 121 -340 621 -132 -387 466
1414 466 -654 -123 452 -455 384 471 -498 555 43 -454 632 -190 -142 574 -269 178 723 -311 383
1433 383 327 -473 375 -322 -751 53 -754 -694 126 -712 156 547 -312 545 455 -274 461 45 -374 367 -383
1454 -383 -265 533 -475 332 482 -404 517 160 -429 427 -332 -517 371 -345 -61 511 -249 239 476 -373
$$ packed form
1321h6O88j491R36K6j105J355l06o62J391q86l1J157j100M82N22j362R73j34j008
1340f41J217o47m31J028j055J30R44j139N67N58j199J145j52r33J259q73l60R90
1358D08j024J84R15j317O64M86r10J099p3p93J314q52q4Q67j104P4O79j358P96
1377b9L99j044R89k30n82J172o99k50J055j026L32O20j273Q00J67j103J049m89
1395a42n93J203j018l8J019j019N25N05j011R62N7q53J066n42m61R61p53k55Q53
1414D66j120N31N75r07Q39Q7r69J053n12m97J086q22M8P16q43M47N45j034O94
1433C83n6q00Q48o97m29Q04q07O0Q20q38Q68L91q59Q57r0p29P35m16m19P41p50
1454c83J18P98j008Q07J50q86R21l57n89Q56p59j85Q88p16K84N72p60M88K37q49
$$ plain form
1474 -373 449 -129 -525 364 -368 -400 182 -473 13 576 -182 511 570 -423 436 -29 -566 325 -437 -693 206
1495 206 -660 -205 364 -526 347 459 -108 638 288 -184 668 -314 -222 335 -487 -108 229 -647 93 134 -415
1516 -415 530 279 -32 693 -87 -65 500 -408 -141 105 -654 33 53 -554 361 -266 -314 459 -302 -151 492
1537 492 -301 206 398 -324 455 282 -107 701 80 -232 317 -340 -301 25 -690 -208 -104 -576 311 150
1557 150 -198 610 29 31 702 -104 27 240 -599 -180 46 -649 256 -28 -383 404 -104 -70 651 -172 168
1578 168 517 -265 136 26 -523 150 -114 -499 320 -223 -129 416 -348 111 306 -342 209 195 -223 368 -31
1599 -31 -154 421 -79 -35 365 -277 -81 17 -615 75 -89 -544 316 105 -86 655 -69 14 464 -127 86
1620 86 99 -509 -17 -157 -569 144 -194 -256 455 63 17 510 -212 385 289 -244 107 -56 -453 188 -318 -440
$$ packed form
1474c73Q22n78l96Q89p32l2N82o55M86N63p58O93N9r93Q59m65n37Q91p62k56Q99
1495B06q66M55N69q90Q73J12n67P46l50m72Q52r82R2N57q22L79L37q76P40M1n49
1516d15R45k51l11P25p80K2N65r08K67K46p59O87K0o07R15o27m8P73p61J51O43
1537D92p93N07J92p22P79j73l89Q08o21l12N49o57L9L26p15M82J04m72Q87j61
1557A50l48Q08n81KO71q06J31K13q39M19K26o95R05k84l55P87n08L4P21q23L40
1578A68L49p82M01j10n49O73k64l85Q19n43R4N45p64M59J95o48N51j4m18N91l99
1599c1j23N75n00M4M00o42J96R8o32O90j64m55Q60k11j91P41p24Q3M50n91K13
1620H6J3o08M92j40m12P13l38o2P11l92m6M93p22N97r6n33L51j63l97O41n06j22
$$ plain form
1642 -440 84 -487 -102 192 -377 192 400 -187 423 393 -35 628 36 -17 240 -446 -216 -35 -612 -2 -2
1663 -2 -489 208 147 -87 449 -44 -43 442 -304 -7 189 -307 74 20 -398 179 -55 -238 357 -168 -126 344
1685 344 -199 244 351 -301 176 77 -321 285 -20 -217 269 -206 -84 231 -219 73 140 -393 205 224 -294
1706 -294 257 -70 -217 159 -189 -115 321 -333 94 160 -308 26 86 -213 311 60 -69 395 -145 -3 227
1727 227 -309 -86 -34 -434 47 -95 -338 97 -69 -73 362 -54 172 485 -216 189 51 -337 73 -289 -524
1748 -524 112 -278 -240 334 -39 235 450 -50 221 206 -199 124 -77 -483 -22 -245 -133 289 -147 151 260
1769 260 -97 184 133 -200 111 -227 -380 149 -139 -125 209 -113 81 234 -89 164 129 -377 147 -239 -198
1790 -198 247 -144 -18 391 -31 146 208 -150 195 -49 -345 -12 -323 -518 89 -339 47 271 35 367
$$ packed form
1642d40N24n71L85K94n69N69K08n87O10l0m28O63n92n3K57o86K30J81n77O10%
1663bm87O97o1k34N36m93JM85p46K97J96m96L81n4m18N77k34j83N95n25M2M70
1685C44n43M43J07o52M77r9l98O06l05j97M86m75J22L15m50K92O7n33N98J9n18
1706b94N51l27j47L76l48P4M36o54M27O6m68L34O0k99N24k51j29M64n40J42K30
1727B27n36K23N2m00M81j42k43M35j66mM35m16K26L13p01M05j38l88M10l62k35
1748e24O36l90L8N74l73K74K15n00K71j5m05L23k01m06M61k23J12M22m36K98J09
1769B60l57K81n1l33L11l38j53N29k88J4L34l22J94J53l23K53l5n06N24l86M1
1790a98M45l91J26M09m22J77O2l58L45k44k96L33l11j95O07m28L86K24k36L32
$$ plain form
1810 367 465 -67 374 242 -332 190 -244 -376 -32 -306 -221 131 -246 165 349 -74 358 245 -72 264 -141
1831 -141 -169 68 -279 -66 130 -290 57 173 -238 229 192 -125 122 -102 -121 143 -235 -46 132 -151 172
1852 172 170 -88 299 73 -199 108 -180 -277 45 -288 -55 211 -156 157 192 -115 292 114 -106 239 -184
1873 -184 -217 49 -273 -67 185 -206 282 299 18 432 20 -202 288 -250 -239 96 -406 -190 2 -310 198
1894 198 205 -16 283 181 21 212 -264 -101 198 -222 22 164 -277 173 27 -61 214 -17 -22 260 -163 -217
1916 -217 33 -230 -84 165 26 283 195 -101 285 -122 -340 174 -381 11 231 -235 166 165 -149 130 144
1937 144 -34 297 0 -195 110 -380 -47 73 -100 184 209 -211 197 -15 -319 131 -303 -117 208 -208
1957 -208 67 222 -146 55 163 -192 208 -26 -214 78 -282 -151 283 -143 200 417 76 323 41 -229
$$ packed form
1810C67R8n32M41j32n74N22m34j32L44k74Q5L52l77M11J84m23M32j13l17L36m05
1831a41k8K37l47K13J96m20L47J16m11M67l7l17K47k24j9K64l78J89J78k83L23
1852A72kk58L87k26k72L07k88r7L22l33K33K66l67L13L5l07M07j78k20L45m23
1873a84l3K66l22K06K52l91M88J7k81M14m12k22M90n38J1L35n02K16J92l12N08
1894A98Pk21K99j02j60J91m76J63K99m20K44J42m41M50j46q8K75k31nK82m23n4
1916b17K50k63J46K49j39K57q8k96L86m07k18N14n55L92K20m66M01jl14K79J4
1937A44j78L31k97j95L05m90L33J20j73K84K5m20M08k12l04M50m34J86L25m16
1957b08K75J55l68K01J08l55M00k34j88K92l60J31M34m26L43K17l41K47k82k70
$$ plain form
1977 -229 -16 -120 -425 195 -186 -95 301 -177 164 213 -25 276 78 -184 174 -146 -290 100 -145 44 303
1998 303 -99 15 235 -288 2 -56 -251 222 -68 -10 268 17 113 361 -144 256 189 -282 101 -213 -386
2019 -386 63 -253 -47 268 -43 84 237 -120 86 82 -368 210 70 -89 222 -165 -220 34 -296 -183 58
2040 58 -206 53 60 -230 19 123 41 342 113 -13 177 -278 -145 -173 -392 44 84 57 379 216 99 334
2062 334 -77 -44 213 -191 -149 84 -459 -98 -191 -289 137 153 123 373 102 -84 148 -208 106 197 -208 190
2084 190 -68 -356 55 -259 -276 181 -211 6 171 -177 83 205 -121 182 185 -64 364 -3 -69 4 -309 -229
2106 -229 26 -304 108 144 -182 130 60 -148 346 68 177 319 1 -12 99 -457 -131 80 -356 170 -63
2127 -63 -266 104 -67 -92 252 97 205 311 -130 114 65 -287 46 -139 -269 125 -100 -204 93 -158 186
$$ packed form
1977b29K13j04l05O20l81R1L96m78L41M9k38L01j98k62L58l20j44L90k45J89K59
1998C03m02J14K20n23K90n8j95M73k90N8K78k51R6K48n05M00o7m71L83l14j73
2019c86M49l16K06L15l11J27J53l57K06mm50N78j40j59L11l87n5K54l30J13K41
2040E8k64K59Pk90K49J04q2L01k29j26J90m55J33k8k19M36M0k7L22j63j17K35
2062C34m11L3K57m04M2K33n43L61r3r8M26J6l0K50k71j86K32l56L14R1m05L98
2084A90k58k88M11l14j7M57l92K17J65l48K60J22l26L03Lk49M28l67o6P3l13Q0
2106b29K55l30M12L6l26L12p0k08M94k78J09J42l18j3J11n56L26K11m36N26k33
2127f3k03L70j71k5L44j55J08J06m41K44m9l52L33j85j30L94k25j04K97k51L44
$$ plain form
2148 186 399 95 426 421 -71 171 -91 -311 -22 -244 -164 154 -279 62 152 -236 113 151 -30 266 -38 -222
2170 -222 88 -151 -222 44 -221 69 239 -40 46 51 -334 76 -96 -134 259 -80 -13 186 -283 114 215 -148
2192 -148 272 -41 -307 140 -285 -322 89 -189 55 356 -78 183 205 -336 41 12 -117 220 -112 -96 214
2213 214 -245 -108 59 -212 243 161 -239 24 -76 -188 146 -109 14 282 -147 -80 -21 -323 -23 84 -259
2234 -259 224 137 -13 367 -145 -42 219 -307 -49 175 -234 23 50 -420 18 -68 -30 331 114 45 317 -113
2256 -113 -107 52 -294 55 -42 -324 54 -107 -159 78 -211 -63 207 -81 147 140 -118 91 -10 -188 223 71
2278 71 -16 67 -325 -246 108 -222 -28 201 -261 143 -34 -167 73 -36 -106 226 6 75 230 -158 81 43
2300 43 -399 0 -86 -173 99 -155 -192 172 -115 172 242 16 248 209 -103 62 -101 -234 106 -198 -98 163
$$ packed form
2148A86K13l04L31nm92K42k62k20K89k22Q0L18m33L41R0l88L49L8j81K96l04j84
2170b22L10k39p1K66k65K90J70k79Q6Nl85M10j72l8L93l39O7J99m69L97J01l63
2192a48M20l13k66M47m25l7M11k78K44L01m34K61K2n41L77k9j29L37l32J6L10
2213B14m59J37J67k71M55q2m00K63j00j12L34k55J23K68m29O7N9l02L00J07l43
2234b59M83q7j50L80n12J03K61n26K58K24m09K57K7m70M38q6L8L61k17o9K72m30
2256a13OJ59l46L49r7k82L78j61n2K37k89J48K70k88K28pk58K09j01j78M11j52
2278G1q7Q3l92P9L54l30J94K29m62M04j77j33K40j09p0L32k20O9J55l88K39l8
2300D3m42L99q6q7K72k54l7L64k87K87P0k26K32l9l12J65j63j33L40l04J00K61
$$ plain form
2322 163 -121 34 173 -130 144 283 -4 164 32 -240 -57 -255 -213 19 -243 -48 110 -258 95 86 -203
2343 -203 216 -46 -189 143 -26 -132 78 -118 6 152 -75 221 84 -127 135 -172 -368 290 -148 -40
2363 -40 177 -248 103 180 -172 243 209 -72 246 -60 -253 -39 -230 -268 71 -226 13 178 22 235 152 -14
2385 -14 180 -99 -151 88 -263 -184 -45 -272 127 196 -52 260 78 -143 124 -144 -273 -24 -336 -114 172
2406 172 -87 214 188 -111 198 50 -136 140 -195 -107 39 -279 -40 204 -74 -23 161 0 275 6 -85
2427 -85 185 -285 -165 224 -140 38 82 -245 115 110 -13 178 -15 -50 100 -169 -135 15 -126 22 -7 -249
2449 -249 -72 61 -99 163 -48 -17 179 -146 -78 204 -232 -8 56 -133 191 1 -195 244 -44 -124 223
2470 223 -167 -32 168 -168 139 86 -218 67 -40 -73 163 -178 -214 151 -114 68 193 -128 86 65 -206
$$ packed form
2322A63k84J55J39l03K74J39k87J68j32k72J83j98M2K32k62J95J58l68L53rk89
2343b03M19k62j43L32j69j06K10j96J24J46k27K96j37k11K62l07j96O58m38J08
2363d0K17m25L51P7l52M15l4k81L18l06j93K14j91l8L39k97K39J65j56K13q3j66
2385a4J94k79n2K39l51P9J39k27L99O9k48L12j82k21K67k68j29K49l12K22K86
2406A72k59L01k6k99L09j48j86K76l35Q8J46l18K39K44k78N1J84j61K75k69r1
2427h5K70m70J20L89l64J78M4l27L60nj23J91j93l5J50k69L4J50j41J48k9k42
2449b49J77J33j60K62k11L1J96l25O8K82m36K24O4j89L24j90j96M39k88q0L47
2470B23l90J35K00l36L07n3l04K85j07l3K36l41l6L65k65J82J25l21K14k1k71
$$ plain form
2491 -206 182 -41 -155 218 -16 19 283 -100 -26 169 -192 70 38 -284 27 -22 -164 89 -90 75 193
2512 193 -154 31 212 -217 137 -34 -209 60 -39 -94 270 -4 35 221 -72 28 147 -118 76 -52 -187
2533 -187 170 -39 -155 189 11 -110 203 -80 17 138 -259 166 -36 -21 112 -92 -164 219 -116 47 176
2554 176 -215 90 -5 -66 59 28 -161 262 21 -83 236 -272 -75 129 -167 118 191 -138 181 -11 -58 201
2576 201 -193 -103 115 -94 -48 99 -216 64 51 -111 142 -18 -163 155 -142 11 173 -76 15 123 -210
2597 -210 70 -90 -210 105 -229 -118 114 -203 -110 142 -94 115 163 -29 62 41 -158 47 -54 -154 42
2618 42 -224 -41 103 -60 18 42 -192 163 -40 -205 114 -41 -26 114 -97 55 166 -171 86 226 -149
2639 -149 119 -81 -208 6 -178 -79 244 -74 77 85 -212 85 116 -91 256 155 -42 28 -217 -161 -14 -221
$$ packed form
2491b06L88k23j14L73k34L5K64l83P4J95l61K62l2l22L11m9j42K53j79J65J18
2512A93l47J85J81m29L54j71j75K69r9n5L64k74L9J86k93J00J19k65J94j28j35
2533a87L57k09j16L44j78j21L13k83R7J21l97M25k02J5J33k04p2L83l35J63J29
2554A76l91L05r5o1J25l1j89M23k41j04L19n08J97K04k96K85P3l29L19j92m7K59
2576B01l94R0K18k09M6J47l15K80j3j62K53j60j45L18k97J53J62k49R1J08l33
2597b10K80j60j20L15l34J11K32l17R3K52k36K09M8j92R1k1j99K05j01j00J96
2618D2k66J83J44j63P8K4k34L55k03j65L19j55J5J40k11J52J11l37K57J40l75
2639a49K68k00j27K14j84R9L23l18J51Qk97K97L1k07L47j01j97P0k45N6J47k07
$$ plain form
2661 -221 -10 108 -71 79 57 -98 278 313 -52 195 -80 -12 38 -304 -3 -35 -156 232 165 0 291 68
2683 68 -12 172 -162 -70 132 -270 -125 -36 -209 137 -66 22 254 -8 -52 113 -113 -234 72 -170 74 183
2705 183 -80 121 50 52 170 -99 -33 36 -175 -165 -25 -286 -26 27 -11 272 111 24 293 -38 -38 96 -320 -118
2729 -118 -25 -191 115 43 -145 117 -21 -184 215 -79 -43 175 -65 -48 83 -91 105 73 -154 153 -44 -158
2751 -158 110 -215 -33 190 10 9 117 -172 115 -4 -106 176 -45 -34 166 -78 -108 90 -249 -52 -17 -138
2773 -138 96 -3 -107 264 -70 54 227 -36 178 89 -224 -66 -37 -177 79 3 -106 131 79 -5 174 61
2795 61 -31 151 -214 155 -1 -208 44 -190 -302 18 -200 -104 164 -189 78 71 -276 138 48 -169 200 21
2817 21 -48 106 -258 -253 -18 -134 87 136 -229 56 10 -126 129 0 2 250 -57 47 69 -177 -11 66 -196
$$ packed form
2661b21K11J18j79J50k2j55L76L5l65K47k75O8N0l42L01l2j21L88o7j65K91k23
2683F8q0J84l34R2K02m02J45Q9j73L46k03Q8K32k62m4J65k26j21L06k42K44J09
2705A83k63K01p1KJ18k69O6O9k11J0J40k61K60N3l8K83j61q7K69l31%J34m16K02
2729a18R3j66L06p2j88K62j38j63L99k94L6K18k40J7J31j74J96l2k27L07j97j14
2751a58K68l25J82K23j80jJ08k89K87j19j02K82k21J1K00k44l0J98l39J97L5j21
2773a38K34r9j04L71l34J24J73k63K14q9l13J58K9j40K56p6j09K37n2q4J79j13
2795F1r2J82l65L69j56k07K52k34j12L20k18R6K68l53K67pl47M14r0k17L69j79
2817B1o9J54l64NK35j16K21M9l65K85m6j36K55j29KK48l07J04K2k46J66P7k62
$$ plain form
2840 -196 130 53 -276 60 -193 -119 180 -76 1 175 -49 36 88 -194 78 15 -175 159 -58 -115 65 -231
2862 -231 7 67 -181 -54 6 -50 131 29 -17 140 16 -6 216 -124 69 109 -179 -57 -32 -216 125 7
2884 7 -90 239 -4 -19 43 -164 30 95 -177 190 -24 -222 162 18 55 117 -79 66 115 -93 -45 127 -154
2907 -154 119 -36 -74 227 -25 1 274 -243 126 240 -231 78 58 -13 -62 70 -21 193 -57 -81 91 -152
2929 -152 52 133 -153 46 -11 -82 48 -78 -117 57 -140 -29 274 -10 7 14 -309 75 79 -57 215 -18 19
2952 19 78 -85 -62 57 -308 -43 19 -163 23 -11 -129 75 -79 -92 314 -38 -58 99 -64 -38 13 -154 130
2975 130 204 -38 270 13 -135 49 -144 -17 51 -281 61 56 -50 93 -46 -90 148 -49 -104 321 -144 10
2997 10 127 -109 107 110 -52 116 76 -63 -4 -103 -125 142 -117 -25 162 -150 177 249 -25 157 124 -38 167
$$ packed form
2840a96L26p7l29L36k53P4K99k56P7J74k24Q5N2k82K72o3j90L34k17n7J80k96
2862b31K38O0k48J27O0n6J81j02m6J57j24k2K22l40J93M0k88J22K5j84L41j18
2884Gr7L29k43j5O2k07J94O5k72L67k14j98L84j44L7O2j96J45M9k08M8J72k81
2907a54K73j55l8L01k52K6K73n17L69J14m71L09k0p1m9J32r1K14k50k4J72k43
2929a52K04Q1k86J99n7p1J30j26l9J74j97J11L03k84J7Pl23L84Mj36K72k33L7
2952A9N9j63K3J19l65K65O2j82J86l4j18K04j54j3M06l52k0J57j63K6N1j67K84
2975A30P4k42L08k57j48J84j93J27O8l32L42nj06J43j39m4K38j97n5M25m65J54
2997A0J17k36K16Lj62J68m0j39N9r9k2K67k59R2J87l12L27P2k74J82l3j62K05
$$ plain form
3020 167 -142 -39 89 -174 4 62 -46 126 159 -137 166 -61 -87 163 -96 -8 108 -52 68 -30 -116 115
3042 115 -15 -141 42 -52 -103 113 -97 -39 67 -125 60 198 -133 159 -71 -159 37 -120 -16 248 1
3063 1 -22 152 -172 238 56 -249 141 0 -213 116 10 -148 173 -27 -4 227 -54 -5 24 -196 60 -38
3085 -38 10 114 -31 -11 148 -74 68 147 -167 46 -11 -188 36 -88 -132 190 21 42 230 -34 40 75 -166
3108 -166 64 61 -115 -13 -56 -75 117 -108 -82 88 -93 15 77 -130 49 22 -108 172 48 -16 225 -78 98
3131 98 150 -145 27 142 -128 98 64 -83 177 8 -126 162 -36 -32 111 -141 46 37 -9 212 -5 -120 249
3154 249 -49 -12 243 -224 67 94 -78 15 1 -233 220 38 -80 229 -20 -44 117 -170 37 186 -133 121
3176 121 14 -72 107 25 -202 76 -148 -33 114 -216 -27 11 -256 63 81 -170 66 3 -66 201 -84 -80 124
$$ packed form
3020A67l09J03J28k63J78N8j08J72L3k96L03k27k6K50k59Q8J16j60J20r8q6K31
3042A15j30j26J83r4n1K16k10N8J06j92J85J38l31K92k30q8J96j57J04K64k47
3063Ak3J74l24M10j82l05L90j41k13L29j06j58L21k00K3K31k81M9K9k20K56r8
3085c8M8J04j45K0J59k22J42P9l14K13n7j77K24j24m4L22j69K1J88k64P4L5k41
3108a66K30lj76J02m3j9J92k25K6J70j81J08O2k07J79k7j30K80j24o4K41l03J76
3131I8N2k95J72J15k70K26l4j47K60j69j34K88j98MJ43k52J87rm6K21k17j15L69
3154B49k98L7K55m67K91K7j72R3j4k34M53j82j18L09k49k4J61k87K07J49l19K54
3176A21j07q6J79q2k27K78k24J15J47l30J89L8k67L19J8k51K36o3o9K67k85MK04
$$ plain form
3199 124 -88 -115 -52 -47 -20 60 -98 163 -36 -92 161 -182 93 173 -130 29 46 -120 171 -55 -196 160 -5
3222 -5 14 98 17 14 -35 -158 51 117 -70 121 139 49 120 -203 -67 247 -111 -71 111 -160 61 68 -59 136 -108
3247 -108 -161 144 -76 -90 111 -131 -52 130 -201 116 23 -124 184 45 11 222 -141 -35 231 -95 7 4
3269 4 -172 20 31 -165 -16 25 -137 14 -84 -6 187 -42 30 129 -109 177 62 -75 206 54 -66 138 -193
3292 -193 -71 9 -271 48 3 -68 151 87 -195 180 -65 47 133 -204 54 12 -89 124 30 -127 -25 -69 -112
3315 -112 90 -102 -3 224 -211 154 11 -69 1 49 -136 36 -177 8 131 -182 -65 87 -14 94 76 -138
3337 -138 23 59 -85 62 -13 -172 161 4 142 -39 -107 69 80 -123 101 25 -92 190 -89 -191 67 -57
3359 -57 -37 40 -165 44 -24 -194 75 -28 -67 102 -118 -93 169 -122 13 219 -146 146 92 -217 177 -53
$$ packed form
3199A24k12k7O3NK7Q0j58K61j99n6K53l43K75Q0l03J59J7j66K91k26j41L56j65
3222eJ9Q4q1lm9j23K09O6j87J91J8r0P1l23J36L14l58M0J82k71K21Pj27J95k44
3247a08n3L05k20j4K01k42P9J82l31L17r3j47L08j39l4K11l63J06K66l26J02l
3269Dj76J92J1j96J49M1j62J51r8P8J93k29P2R9k38K86j15j37K81j52j20K04l31
3292a93J22Q0k80L19m5p1K19o4k82L75k45J12Q6l37K58m2j01K13r4j57J02m4m3
3315a12K02j92R9K27m35L65j43q0P0M8j85J72k13J85J23l13J17J52j01J08j8k14
3337a38J61L6j44J47p5j59L33j57J38j81o8J76J1k03K24p6j17K82k79j02K58j24
3359e7K0P7k05K09o8j70K69j03l9J69k20K5K62k91J35K06l65K92n4l09L94k30
$$ plain form
3381 -53 -186 129 -93 -40 146 -219 58 53 -72 91 91 -189 165 52 1 89 63 -22 165 -92 5 48 -210 130
3405 130 -17 -222 31 -76 -128 132 -33 -14 50 -173 35 9 -177 38 67 -116 148 120 -102 233 -47 139
3427 139 181 -145 31 141 -233 -80 -20 -151 119 44 -94 170 24 -39 191 -115 5 178 -201 82 21 -121
3449 -121 137 3 55 72 -110 -21 61 -103 149 109 -207 238 0 -115 213 6 -41 147 -148 45 -22 -175
3471 -175 -56 -58 -189 149 5 -22 126 -151 -18 123 -24 71 135 -52 62 18 -239 11 -24 -104 124 -41 -6
3494 -6 85 -15 71 93 -85 150 -105 -95 -10 -110 -94 78 -131 16 179 -68 103 206 -26 107 127 -31 -27 -41
3518 -41 -191 19 -108 -75 70 -170 53 37 -91 88 128 -149 87 -50 65 184 -207 -26 105 -73 81
3539 81 140 -125 -21 -82 -186 -9 -8 -44 18 -126 84 161 -182 33 32 -144 200 -134 -56 81 -87 43 177 -182
$$ packed form
3381e3j33L15k22N3J86l65K77nj25J63%k80L54j13n1Q8k6q5J87k57R7M3k58L40
3405A30j47k05K53j07n2K60j65J9O4k23K08k6j86K15K9j83K64k8k22L35k80J86
3427A39M2l26J76J10l74J53O0j31K70p5j38K64j46o3K30l06J20J73l79K83o1j42
3449a21K58j34N2J7j82Q9Q2j64K52m0l16M45k38j15L28k07m7J88k95J93o7j53
3471a75J19kj31L38j44k7J48k77J33J41j47R5O4j87J14m4k57K50l5q0K28j65L5
3494fR1j00Q6K2j78K35k55J0Q5j00J6J72k09J47J63k47J71J03k32J33K0j58Mj4
3518d1j50K10j27L3J45k40K23j6j28J79M0k77K36j37J15J19l91J81J31j78J54
3539H1N9k65J04o1j04J77Jl6O2j44K10P7l43K15jj76L44l34P8J37j68J30J34l59
$$ plain form
3563 -182 5 66 -90 139 105 -174 31 -1 -67 143 -95 51 122 -39 58 128 -85 208 -8 -121 77 -176
3585 -176 -100 147 -69 7 119 -56 178 105 -39 148 -32 -102 176 33 141 -18 -51 -1 80 -196 140 59 -63
3608 -63 119 105 -41 153 -43 36 120 -81 -10 111 4 55 -16 -81 77 -89 -120 130 -101 15 233 -103 8
3631 8 188 -100 -60 -75 -166 -6 -132 -2 91 -130 -5 88 -62 76 103 -47 133 1 -63 180 -109 -168 99
3654 99 -186 -64 51 -163 89 162 -106 190 21 -29 164 -21 37 51 -80 -92 60 -181 13 9 -115 73 -105
3677 -105 -90 176 -5 -105 150 -128 70 123 -128 33 101 -52 -16 -36 -151 82 -127 -110 132 -26 -1 52 -127
3700 -127 149 133 -118 133 -35 -24 94 -13 -32 -17 -97 -17 142 6 7 -37 -58 79 59 -131 117 -59 -34 171
3724 171 -181 -50 27 -10 159 76 -148 -11 -60 -14 184 -77 -18 86 -135 36 33 -174 31 -60 -147 149 -15
$$ packed form
3563a82J87O1j56K29l4k79K05l2o6K10k38J46P1j61R7P0k13K93k16j13J98k53
3585a76P6K47k16P6J12j75K34p3j44J87j80p0K78j43J08j59l3N0Q1k76L36q1j22
3608f3J82j4j46J94j96P9Q4k01P1J21j07N1p1o5J58j66l1K50k31J16K18l36J11
3631HJ80k88M0j5r1J60j26J30R3k21J25R3j50J38K7j50J80j32o4K43k89n9K67
3654I9k85J22J15k14K52P3k68K96j69n0J93j85N8J4j31j2J52k41J94mj24J88j78
3677a05J5K66j81j00K55k78J98N3k51J61O8j53L6k0j15K33k09J7K42j58K5N3j79
3700a27K76j6k51K51j68J1J18j07j9J5q0Q0J59j36Jm4k1J37k0j90K48j76K5K05
3724A71l52J31P7l7J69q3k24J37m9M6J98k61N9J04k21J71lk07K05r1q7K96j64
$$ plain form
3747 -15 0 52 -92 23 -3 -179 -40 17 -72 78 -4 -65 166 -7 -101 80 -153 22 98 -89 22 2 -134 216
3771 216 -54 -71 146 -93 139 241 -52 32 99 -106 -25 28 -77 96 -151 -142 107 -182 -5 110 -138 -15
3793 -15 101 -99 43 -36 -91 206 -34 -93 251 -57 42 150 -40 10 46 -181 26 -57 -114 61 -160 -27 123
3816 123 2 -14 148 -106 82 15 -13 133 -111 -86 101 -76 -145 -9 -190 57 224 -6 110 130 57 105 -24
3839 -24 -128 137 -119 -141 78 -84 42 -1 -202 12 83 -104 167 -102 -113 162 -71 -35 113 -10 75 95 51
3862 51 73 61 -214 36 -14 -148 47 -151 -98 97 -266 11 84 -112 209 41 -70 5 -45 -162 97 -131 11
3885 11 113 -103 37 17 -27 248 -23 -90 144 -62 -29 -88 -36 10 -83 -124 25 44 -41 213 -24 -51 28 -12 -149
3910 -149 79 -152 -48 -21 -13 59 38 -77 19 -130 -37 143 -74 -14 74 -130 -68 36 -112 44 -74 -34 122 -15
$$ packed form
3747a5J5N2j44J15k6j76J39N7q9J50q2o1K31j73r4J81k33J75P6j87J11k0j36L50
3771B16k70j7K17k39K32J02k93Q4O7k05Q1N3j05J73k47RK49k89J77J15k48J23
3793a5J16k00J42p9n5K97k40n9L44l08R9J08j90N0L6k27K07q3n7J75k21J33J50
3816A23j21j6J62k54J88o7k8J46k44K5J87j77o9J36j81K47J67k30J16K0p3M8j29
3839b4j04K65k56k2K19j62J26m3k01K14P1j87K71k69j1K75k33L6J48j23Q5K0m4
3862E1K2j2k75K50n0j34J95j98N3J95l63K77P3j96L21j68j11P5n0j17K59k28J42
3885A1J02k16J40k0m4K75k71o7K34k06L3n9N2M6r3m1J49J9q5K54k37k7P9m0j37
3910a49K28k31J04K7QP2k1j15R6j49R3J80k17O0Q8k04O2J04j48J56j18M0J56j37
$$ plain form
3934 -15 -101 80 21 18 157 -159 62 52 -45 38 43 -104 233 48 -14 10 -44 23 69 -138 -97 27 -102 31 -22 -128
3960 -128 121 74 12 110 -27 -45 23 -5 34 107 -61 101 133 -12 210 -8 19 174 -156 -23 51 -263 71 107
3984 107 -57 -12 -132 -133 75 -140 -124 39 -59 3 75 -45 19 102 -35 145 95 -68 163 54 -48 92 -118
4007 -118 8 54 -164 71 39 -79 -43 -72 -77 -15 58 -132 81 -108 20 61 -79 105 -42 78 160 73 -35 61
4031 61 -130 -162 120 -142 -9 -17 -117 2 -30 -104 145 91 -5 87 -28 82 4 -214 118 42 -71 23 27 -26 118
4056 118 56 -5 97 -142 116 119 -140 -13 71 -127 222 -128 -57 115 -123 45 130 -31 -74 115 -77 55 -33
4079 -33 -226 80 -42 -79 55 -80 1 59 -28 116 52 -134 42 -111 -44 92 -43 -58 26 -158 2 131 16
4102 16 65 -12 -170 5 -6 -37 298 45 -101 85 -53 64 107 -92 104 -17 -170 50 77 -126 70 18 -4
$$ packed form
3934a5q6J81n9lJ39l16K21j0r7Q3Nj47L37j85o2K4n4O7M6k07M1J24j29J33n3j06
3960a28K49m7o2R8j37j8O8k8L9P3j68J62L2j45K22k18K7J55l30J33P4l14L34L6
3984A07j64M5j20jK08k15J6J63r8O2P2j20O4Q3j37J80n0j63K31j09j02J40k10
4007a18J26M6k18K35l2j18L6k9nO2P3j90K13j89J28M1j40J84j47J20Q2q7j08R6
4031F1j91l2K82k62J33qj00J19l2p4K49n4r6R2j15J10p8k18L32p6j13R4Mn3J44
4056A18o2o1J02k39K58Lk59J27Q4j98L49l50P1J72k38J68Q5j61m3J89j92J32q8
4079c3j93L06j22l7J34j35Q1N8q7J44o4j86J76j53O7J36j35j5Q4j84J60J29j15
4102A6M9p7j58J75j1l1L35k53j46J86j38J17M3j99J96j21j53K20K7k03J96n2k2
$$ plain form
4125 -4 89 -87 168 69 -127 107 30 -118 200 -32 -111 147 -218 -16 135 -32 87 189 -125 149 103 -91
4147 -91 121 -30 -33 -30 -87 -19 152 -21 54 257 -15 90 126 -9 236 21 -37 43 39 -59 79 -146 72 -4 -144
4172 -144 8 -71 -92 112 -47 -87 151 -21 -18 -9 -43 12 -14 -127 141 -107 -150 116 -53 39 111 -57 29 21 -157
4197 -157 46 114 20 65 35 26 76 -93 -68 50 -78 77 78 -101 72 126 -18 169 97 -5 115 -33 -106 53
4221 53 8 76 -46 19 73 37 -71 13 24 -58 102 -11 -29 96 -159 56 -39 -38 228 27 33 -64 -44 -28 11 -94
4247 -94 -99 109 -57 60 22 -1 -6 106 -128 46 63 -47 127 -124 -94 73 -125 46 -74 -25 15 18 -96 61
4271 61 21 2 33 30 -27 -36 -31 6 124 -53 36 -12 -27 63 -39 -4 190 25 16 118 -77 -1 74 -165 -13 -74 -71 44
4299 44 -79 -48 94 -148 85 39 -77 37 4 -3 1 -114 -94 104 -63 -98 3 -134 9 57 -120 -5 -42 -42 92
$$ packed form
4125dR3j76K55r9j96K34p7j48L18k32p9K58l65K02J51j67J19J02l14K74m6j94
4147i1K12j51lLn7O8J71j73P5K03k72J05L6j35K45k15n8Q0mr8J38k25K18p6j40
4172a44J52p9k1K04j59m0K38j72LRl4N5k6j13K68k48m3K66j69R2P2j68Q6qj78
4197a57K03O8r4M5l0rN0j69K5J18j28J55Jj79J73N4j44J87p2j02J20j48p3J59
4221E3m5O8j22O5N4l6j08Q4J1q2J60j13j8J25k55K15r5JK66k01Or7K0J6L9j05
4247i4nK08j66J17l8k3nJ12k34J74J7j10J74k51L0J67j98J71j20M9M0Lj14J57
4271F1m0j9L1ln7rNL7J18j77Q9m8j5R0j02L5J94j65rJ02j95P6P5k39J52o1LJ15
4299D4j23L1J42k42K33m6j16J14l3pMj15K0J98j67l5J01j37J43M8j77J15l7%J34
$$ plain form
4324 92 -9 -52 118 -124 -73 -8 4 34 40 -147 85 -47 -126 192 -29 -13 169 -66 51 159 -49 18 57 -96
4348 -96 9 62 -45 113 -100 -59 69 -2 -62 -28 -35 72 -22 -101 68 -98 63 20 -122 -14 -4 -94 -91 95 -92
4373 -92 108 131 -74 154 134 18 68 30 68 87 -29 -36 -52 -142 106 54 12 144 -71 -143 -6 -46 -61 -21 -1 44
4399 44 63 -29 24 2 -14 15 -2 -26 137 20 0 90 -104 115 -40 -64 41 -51 47 26 -21 -70 16 26 -13 -60 54
4426 54 150 -50 -55 25 -63 -120 -103 -54 -180 10 -24 22 100 -37 18 34 28 19 -48 -99 82 -110 139 59 -45 44 10 -126
4454 -126 -53 -86 -54 129 -84 65 39 -79 40 19 -43 52 -46 -46 122 -39 -76 53 -43 -63 87 -29 -30 35 -105
4479 -105 71 89 -38 193 13 -16 -83 17 76 77 -61 -34 110 -69 -20 44 -26 50 37 -33 146 -79 -141 29 -71
4504 -71 11 94 -99 111 57 -36 97 -116 38 58 -61 12 63 3 34 18 -55 47 -74 103 100 -12 88 -35 -80
$$ packed form
4324I2j01m3J70k42N1O5J2L0Oj87K32j32p9L18k21J6J82k35J17J08k08O7L9j53
4348i6J05N3j07J58k13M1J28p1o0L4pJ07r4p9J69j66J61m3j42J08J0r0LJ86j87
4373i2K00K3k05K28k0j16N0l8L8J9j16pj6r0K48n2m2J32k15p2J37m0j5M0K0M5
4399D4J9r2N3k2j6K9j7k4J63j17k0R0j94K19j55k4J05r2R8k1m7m9Q6J0l9m7J14
4426E4R6k00nQ0q8n7J7M9j26J90l4M6P8j37N5J6oro7n1J81j92K49q0j04Q9l4j36
4454a26P3l3L2J83k13J49k6j18J19k1o2R5r8%J68j61l7J29r6k0J50j16jO5j40
4479a05J76J8j27K31j80k9o7J00N9Jj38K7J44j79M9O4p0P6j3p0J79k25o2J70j00
4504g1Q2Q3j93K10n4r3J33k13J54K0j19P3N1o0L1j6p3J02j21J77lj12J00j23m5
$$ plain form
4529 -80 -60 -58 -140 -44 19 -48 -22 -52 8 54 -18 20 134 -58 66 -26 -11 88 27 -64 14 -110 41 71 -26 -101 -48 -158
4557 -158 35 -27 -49 75 119 36 118 -11 36 28 -78 19 -41 -88 44 85 -98 117 32 -46 -19 30 31 48 -29 -43 126
4584 126 -36 -3 -23 -62 17 31 -152 30 101 21 26 -35 6 96 -7 -37 112 -47 40 -13 -57 73 8 28 -30 -37 -8
4611 -8 145 -13 6 66 -33 95 63 -76 137 18 -97 -48 -130 -78 94 52 87 -71 67 197 21 -61 26 10 -85
4636 -85 -59 -165 13 -67 -81 -124 10 49 173 72 -67 92 -57 -81 13 -134 -120 -93 -46 26 109 -18 79 26 -24
4661 -24 69 -49 0 67 -38 38 -42 8 -6 -75 -4 73 -28 -8 71 -77 -15 31 -16 16 46 29 -94 -28 83 32 -90
4688 -90 -63 87 -59 -1 87 -32 -40 52 -111 -5 -144 -16 13 39 21 -19 -32 -44 31 -51 65 83 3 -84 -50 -118 75
4715 75 9 -7 -118 46 7 96 -37 11 -8 -43 61 -46 -51 59 -41 -19 57 14 51 34 1 152 -26 -100 61 -100
$$ packed form
4529h0K0Kq2R6O3o7K6l0O0M6p2L8J14j92J24r2J5R9o1r1P8j24J51L0r7p5N3j10
4557a58J93o2k2J24M4q3Q2j29M7qj06R7o0m7J32M1j83K15q5p8K7M9JJ7p7j4J69
4584A26j62L3k0l9P9J4j83J82P1q0No1M1R0j03l0J49j59Q7n3m4J30o5K0n8pK9
4611hJ53j58J9O0r9J28l2j39K13j19j15M9q2N2J72m2L5j58J38J30j76q2Q7j6r5
4636h5K6j06J78q0j4m3J34L9J24j01j39J59j49k4R4j47J4K7M7P2Q3j27R7n3n0
4661b4R3j18M9O7j05P6q0N0j4o9P1P7j01K0P9j48O2M6m7L2L0j7j23O6J11n1j22
4688i0K7J50j46N8Q8j19qR2j63J06j39J28K9K6j8m0j3j2P5q2J16J8q0q7L4o8J93
4715G5o6j6j11J64l9Q9j33M8j9l5J04j07nJ10j00K2P6m3L7j7l3J51j78p4J61j61
$$ plain form
4741 -100 -31 78 -79 50 65 29 -3 -11 -31 -20 95 -10 40 -10 -12 -45 -260 -43 106 -86 108 -100 -11 88 -37
4766 -37 7 86 -47 47 6 -34 59 75 -50 -41 -74 -55 20 23 53 67 -47 -22 85 -71 78 26 -61 36 -36 -123 28 43
4794 43 84 -34 56 -41 -41 -82 -19 32 -90 31 -46 -46 78 66 -31 83 -36 -2 53 -123 9 -2 112 6 29 -135
4820 -135 -39 106 -11 28 10 15 -61 -76 47 85 -63 91 12 54 9 -38 11 -18 -11 44 23 17 15 -49 -3 6 -70 36 3
4849 3 28 -102 -89 32 -39 -24 -58 -29 173 -41 35 -138 58 10 -118 106 106 42 13 -52 -36 56 -54 -13 18 10 -27
4876 -27 187 60 137 33 11 102 29 24 -9 -112 -97 57 25 -35 38 -120 -59 58 -85 -34 6 -13 -11 -29 37 60 -26
4903 -26 71 50 -75 21 -59 20 34 -42 2 68 -27 22 43 84 -46 12 11 -24 -41 -27 -6 -79 2 -46 -40 -68 129 -110 -49
4932 -49 -92 -73 -39 18 -15 40 30 8 -74 -158 4 -103 50 -1 -54 -68 43 -9 29 92 -16 63 145 -35 -23 130 -77
$$ packed form
4741a00O9J09j57J29J5l6l2qk0J1J15j05N0n0kl3k15K17J49j92J94k08Q9R9j25
4766c7M4P9j33R4m1m0R3J6j25Rl3J9P5LL0J4j14K5J07j56J49n2q7R7p2q7J51J5
4794D3M1j18R0r7%m1O3N1j22J21p7%J24j2r7J14j19L4N5j76J32j1J14j06K3j64
4820a35R6J45j17L9j8Np6j5J23L8j48J54p9M2m5m7M9k9PN5k1oko4M6Rp6J06l3
4849CK5j30J3J21p1J5l4K9K02k14P6j73J96m8j28K24%o4k9o5J6R2j10M1L1ql7
4876b7K14j27P7j04k2R1p3nl3j03J5J54l2o0P3j58O1J17j43N1M0j9Kj8O6K3q6
4903b6R7k1j25R6q0P9J4p6M4O6r5M9K1M1j30N8jl5j7J4K1p3Q1m8Ok8J97k39O1
4932d9m3J9L4N7l3N5j0k2q2q4J62j07J53n1n3j4J11n2L8O3j08P9Q2j80J2J53k07
$$ plain form
4959 -77 -51 15 22 14 52 -96 41 5 59 24 -61 13 2 -43 46 -33 -41 75 -96 -84 19 -20 -84 46 29 5 52 -118
4987 -118 16 -20 10 -130 -30 -23 36 39 -13 -18 7 19 -13 83 133 64 13 50 90 -27 -133 -2 22 -35 54 -63 -41 16
5015 16 97 24 -80 -68 -21 -69 11 1 -38 84 -26 71 43 52 34 25 -13 -24 -16 -33 14 -95 16 109 15 35 70 19 -86
5044 -86 -4 -57 34 -42 -2 -37 -41 165 131 -14 -7 140 -6 1 -122 -91 -107 77 -24 -71 -19 100 29 7 -38 84 -6
5071 -6 52 -72 22 90 -52 7 122 -3 12 96 -31 64 42 2 13 -98 -118 50 17 9 -66 -29 48 -38 -37 -57 -4 25
5099 25 -2 -25 37 70 -26 -21 -16 -48 145 7 3 203 75 -104 30 17 -18 -2 21 27 88 -55 18 37 -46 109 21 151
5127 151 -52 -58 68 -66 -44 44 -51 -139 -59 -71 -74 -9 2 -17 74 -202 5 3 8 84 -29 -79 -122 -41 -94 -26 -8 -9 -51
5156 -51 -39 -140 -37 49 122 19 23 19 -34 24 91 -72 -89 44 -84 3 -83 -31 -2 -8 85 103 -60 -70 -6 19 -23 -22 66
$$ packed form
4959g7K6O6PqL8j48J37l6N4l5q5P4j1m5Q9p9qJ16j71J2J03l9o4J30j7k4M7j70
4987a18J34l6L0j40J00PN9Ln2nK5J2l2R6N0o9n1L7M0j17j06J31K4n7Q9j17K2N7
5015A6Q1p3j04J2M7m8Q0j0l9J22j10R7k8Rj8rl8j1Qj7M7j09J11R3r4K0L5n1j05
5044h6Q2n3R1p6M0l5mK06l4j45PJ47j46Pj23L1j6J84j01m7N2J19p1k2m5J22r0
5071fN8j24R4O8j42N9J15j25J5Q4j27R5k2m0J1j11k0J68l3qp5L7P7q6Jk0N3K9
5099B5k7k3O2L3r6NNl2J93j38mK00j28j79J34j3l5J6K3OO1j43P3J9q3J55q8J30
5127A51k03oJ26j34K2Q8r5q8Q0j2lO5J1j9R1k76K07kNP6j13n0m3Q1n3O8J8jm2
5156e1J2j01J03Q6P3j03Mmn3N8O7j63j7J33j28Q7q6N2K9oR3J8j63j0O4K5m2JQ8
$$ plain form
5185 66 -80 2 -68 -38 -63 -42 75 100 -31 -64 -81 26 80 -56 5 -55 44 59 -56 -75 -106 -89 -28 -18 -52 73 20
5212 20 21 20 78 27 93 -42 10 77 -25 89 58 35 -2 -51 -85 55 144 -1 100 107 62 -4 11 -15 11 91 33 -53 63
5241 63 18 -17 -96 -52 -1 -145 12 -35 76 -8 -21 -25 -65 32 46 -5 23 95 -191 7 76 -162 -47 28 91 -4 4 -53
5269 -53 32 -43 49 1 33 5 88 -52 -113 -96 -64 68 53 29 84 -108 20 69 -35 -104 -61 67 -76 12 -182 -21
5295 -21 -14 -51 18 17 3 -57 -51 20 8 40 -65 9 -11 17 -82 -79 51 56 8 103 -66 44 14 -73 -46 -45 -66 135 -13 16
5325 16 80 30 151 -21 2 17 28 -19 84 24 10 93 11 46 -4 16 17 69 -97 134 86 59 70 51 -4 18 30 -44
5353 -44 122 -64 82 83 -36 111 74 13 107 25 24 4 70 18 31 94 -88 73 17 -87 -29 110 71 -90 40 -38
5379 -38 66 -66 16 13 76 -68 -16 -1 -25 -84 114 -65 7 124 0 -57 -7 9 -68 -7 2 131 7 -25 30 81 -41
$$ packed form
5185F6j46Q2p0L0k5K1J17K5j31l3j7J07N4j36O1o0R9J5j15j9l1J7O1J0l4J25n3
5212B0JjN8n1O6j35N2O7j02J14l1k3l7m9l4J40Q9j45J01Pm5o6J5k6K6Q0n8q6J16
5241F3m5l5p9M4N1j44J57m7J11q4j3mm0R7J4n1K8P2k86J98O9k38J15P5O3r5Qn7
5269e3Q5p5R2m8L2k8Q3j40o1J7L2J32j5k4N5j92J28M9j04o9M3J28j43Q8j94J61
5295b1Pl7O9jj4o0OP1j2L2j05P4k0K8r9LJ30Nm8R5j69J10l0q7K7Jk1K01j48K9
5325A6O4n0J21j72K3J5J1m7J03o0j4Q3q2L5n0K0JN2j66K31m8k7J1j9n5K2J2p4
5353d4J66j86J46Jj19J47l7o1R4q2jk0O6n2J3O3j82J61n6j04N8J39l9j61J30p8
5379c8J04j32Q2lO3j44N2J5k4n9J98j79P2J17j24n7N0J6p7O1RJ29j24l2N5N1j22
$$ plain form
5406 -41 23 -136 28 -18 -1 82 46 -15 82 54 -14 -32 -24 45 -28 -22 20 -25 -28 -41 -68 25 -20 -24 -17 51 46 8 38 -56 99 21
5438 21 -63 110 49 51 56 -67 0 182 -87 76 96 -28 153 85 -72 43 -67 22 103 -20 -74 164 -53 44 55
5463 55 -90 26 -68 -158 11 -28 -19 72 -20 -22 71 80 34 -55 -74 82 -12 30 36 8 45 38 -71 54 63 -57 26 -13 -51 -19
5493 -19 52 -105 65 34 -25 18 -75 -13 27 -10 77 7 -65 20 57 -43 71 41 6 11 -30 48 44 -128 -19 102 2
5520 2 -44 5 -9 78 -21 25 107 -29 11 45 -7 -90 -5 16 100 -25 -109 -36 31 -47 40 -79 41 22 -10 -45 134 122
5548 122 -63 22 -135 84 -12 44 144 -34 19 58 -58 -100 77 -93 5 -21 -65 -141 -15 -76 3 -67 157 43
5572 43 -25 180 79 -41 46 -25 -25 -79 -96 -74 57 -59 92 161 -88 -2 4 -104 14 -34 35 105 40 -52 -11 -80 -13
5599 -13 49 -26 -28 96 22 69 12 -30 -39 -23 46 -14 -12 3 55 17 -65 12 36 49 -39 38 29 -8 -27 8 -15 7 11 -113 13
$$ packed form
5406d1O4j59J64m6J7Q3l6o1R7k8o8j8QO9p3OM2m5lj3k7R3m5mPO8nl8L0r4J55p8
5438B1q4J73o1KNj23O7J82k69J63K0j24J81o8j57J15j10Q9Q1j23n4K38k17R7J1
5463E5j45J16r4r0J69l9RR1r2kR3Rm6q9j9J56r4M2Ok8L7pj09J25Rj20Q3l9l8L2
5493a9P1j57J70l1n9M3r3O2M0l7Q7p0p2Q5L7j00J14l0l5Nm1P8mj72J09J21j00
5520Bm6M9j4Q7r9M6Q2j36M0L4n2q3Q5K1Q4j25q4P3O7p8Q7j19J20j9l2l5J79j2
5548A22j85Q5j57K19r6N6J00j78N3L9j16m2J77j70R8k6m4p6J26o1P9p0K24j14
5572D3o8K05j01j20Q7p1%n4j7K2J31j16J51O9k49Q6Oj08J18m8O9P0o5r2M1o9O7
5599a3O2p5kJ24p4M7n7m2rJ6O9o0KJ5N2l8q2P7K4J3q8P7rl7j9L5k3K2Mj24J26
$$ plain form
5630 13 47 -18 -23 -87 9 68 -73 51 116 -104 86 7 2 101 88 11 93 28 -16 -4 -98 29 -31 -39 19 -61 -88 28 -53
5659 -53 12 118 -31 -19 24 -75 47 -27 22 -54 -20 -57 97 -14 93 54 -53 -3 -17 -57 -7 -5 37 -5 -102 -70 17
5686 17 -37 -57 -10 12 -82 -75 -92 -62 -10 -50 66 65 -12 30 -100 -74 110 -10 57 74 79 123 88 -63 45 -56 59 50
5714 50 16 -15 -43 -114 -68 -59 4 86 -101 99 -30 -69 -36 43 -208 -52 87 -27 -52 -43 31 81 -36 23 25 38 -33 -23
5742 -23 45 5 -40 -6 35 39 -35 80 56 -6 126 8 -62 48 -7 -53 -73 30 170 59 6 -6 -64 -18 20 -73 34
5769 34 -81 -45 40 116 15 117 -10 -40 56 35 76 83 11 16 95 -125 -43 29 -49 -31 -66 -35 88 66 17 5 -30 -32 22
5798 22 -46 61 -78 -43 41 32 -30 99 -2 -28 116 -68 -5 41 -49 55 -76 58 134 42 -62 79 37 67 22
5823 22 -30 -51 79 -87 -30 71 -42 -64 5 -45 5 16 22 62 -16 139 -3 -47 124 -89 -26 -3 -90 -54 -69 -141 68
$$ packed form
5630A3L4o5no4R6N9j41J24O5k20J90p9nR9j3p7Q2o5m4J2r4J27o0qN8q0k7J16q1
5659e3O5J06j49J2M3r9J22p4M9p6L4l7J54j11J07l9j07N0j4m0N0KM2m2r7L2Q7
5686A7n4k0M7K2r4Pj7L0N2m0J16jp7M2j30K6J84j20O7J7NM4l5j51J08j01J15r
5714E0l4l1k8p1M6RO3Q2j87K00j29l9L3P9k51J56J39j14k5RP4N0j17N9KJ3p1J0
5742b3O8m0m5L4M1Mp4J15k4o2J32j18p0J10n5m6k0J03J40j11n3j2n8M6L8r3J07
5769C4j15L6Q5P6j01J02j27l0R6k1M1Pp2NP9k20Q2P2p8J8l5L1J23k2m9j2l5kN4
5798B2o8J07j39L5Q4ro2J29j01k6J44j84O3M6r0J04j31J34P6r2j04J41m2L0m5
5823B2n2k1J30j66N7J01j13k2O9n0N0J1OM0p8J55j42m4J71k13O3K3q7L6j5p2K09
$$ plain form
5850 68 18 -91 -74 -12 -12 52 20 -160 120 -29 53 -21 7 -40 78 -59 138 -80 -69 7 48 17 91 120 19 53
5876 53 -101 -129 -16 -29 -75 -35 49 -3 -67 -57 116 13 -132 41 -93 18 -48 -62 29 18 -141 -5 -22 -20 -27 -131
5902 -131 -16 -87 79 -45 17 11 108 18 -36 80 72 -11 76 -156 -39 17 -57 127 32 -77 20 35 28 24 10 -12 87 8
5930 8 88 11 36 -52 85 8 63 29 10 36 -15 15 -50 -111 22 15 -25 13 144 -54 -21 46 -80 -94 -51 -49 74 -98
5958 -98 27 20 49 63 102 -17 110 -4 -29 29 -75 70 21 -4 12 -58 -11 23 -65 -33 10 48 -50 -61 -167 65 14
5985 14 -6 -34 16 -41 -87 -12 -46 18 37 -20 -94 58 20 8 -37 47 47 -153 -36 -140 -9 -72 -10 -82 -46 -102 18 180
6013 180 -99 -21 60 -88 -66 0 -13 49 -1 52 -66 -89 79 37 20 74 -73 83 -108 -103 -57 88 -4 -51 107 10
6039 10 47 -77 36 73 41 -56 53 23 37 -9 33 18 3 -101 -92 82 -70 22 -9 -25 57 -10 67 -20 -95 47 17
$$ packed form
5850F8n0j09J7O2%O4l2j80K80j49Q2p4K8m7J18j37J97k18J1P6M1l1P4K9j01L4
5876E3j54k8J13j3m6M0Q4n2o4J0J73j03j45J73j34J11o6j4R1j1j59J36j7Kpj04
5902a31J15p1J66j24O2oR7r0n4J16qq3Q7k32J17N6p4J84r5j09R7J5pmj4k2R9p9
5930HQ0p7K5q8J37p7N5l4j9K6n1L0o5o1J33pm0L8J31j98L3O7j26j4M3KJ23j72
5958i8J25pK9J4L9j19J27j14k5N8j04J45m9k5J6p0M7L4q8L2M3L8r8j1j06K32n1
5985A4k0k8N0n7m6P5l4O4J9n7p4J52l8j2m5Q4%k00J17j04J31o3O2p2L6n6J20J62
6013A80k79P8Q1j48K2O6j3O2n0N3j18k3J68m2j7N4j47J56j91NM6J45r2m7J58r7
6039A0L7j24J13L7l2r7J09l0J4m6M2j5j5j04RJ74j52R2l1j6Q2o7P7q7p5J42l0
$$ plain form
6066 17 21 -18 130 -44 100 -21 -80 132 -51 -34 39 0 -49 -55 -85 136 4 26 -45 73 84 10 -56 -54 40 -181 62
6093 62 0 -72 -96 -131 26 -9 41 -39 57 1 9 -117 -72 105 -21 -21 41 -21 -46 72 -15 -140 29 56 -72 95 60
6120 60 -5 91 83 20 87 -20 50 -46 18 27 -24 15 49 5 -35 7 -20 48 74 -19 15 -57 51 -9 10 -20 -55 70 60 50
6150 50 67 31 93 -79 26 -40 99 109 -20 88 26 -56 96 11 7 45 6 -86 123 63 41 -2 -41 97 158 19
6176 19 4 13 -111 120 -60 -151 -22 50 67 23 -12 -46 -43 -107 57 49 -93 43 14 140 -33 18 86 -51 -117 -122 -41
6203 -41 -47 33 -88 67 94 27 -43 -9 58 26 -12 -30 110 -59 -28 23 -55 10 10 32 -141 170 -50 -15 -11 -83 53 -57
6231 -57 -83 -28 -2 -118 -5 -55 27 -104 -142 52 12 -123 64 16 -71 15 53 -87 71 -56 90 -4 -59 77 95
6256 95 -41 33 48 33 53 -17 35 29 -35 38 -44 -68 38 -6 65 1 -47 129 26 -61 5 3 -26 -17 -47 -98 31 100 -135
$$ packed form
6066A7Ml9J48j74J44j21n9K12j83J7P3l9m9ol0K21j32K2p1J18J1p4o6KR4k21K43
6093F2o2p2k4l5J57l5N0q0R6n6Qj26M5J77j26%O2o2k5J18q7j25J69K7j28J67l5
6120F0o5R6qo3O7j07P0r6O4Rn1L9L4m4m0M2k7O8K6r3L4p2J08o0J9l0l5J25j0j0
6150E0J7l6O2j72J05o6J39J0j29J08o2q2J52q5mL8l9r2K09o0k2m3l9J38O1j39
6176A9j5Rj24K31j80r1J29P2J7m4l5l4Lo4J64qj42J36k9J26j73N1O8j37o6nQ1
6203d1oQ0j21J55K7o7p0L4O7l2l8j8J40j69L1N1p8O5%K2j73L11k20L5Mp2J36j10
6231e7k6N5K6j16J13n0Q2j31l8J94m0j35J87m8q7Q6L8j40J58j27J46r4n5J36J8
6256I5j36P4J5j5K0p0N2oo4P3q2k4J06m4P1o4m8J76j03q7O6kk9Rl0n1J29O9k35
$$ plain form
6285 -135 -21 -110 -62 -26 -68 137 97 -32 76 103 -111 28 -18 86 64 21 4 69 -80 9 -12 -44 -31 -10 -79 -77
6311 -77 20 -13 83 22 -67 33 -82 -86 7 -76 39 -37 -35 33 69 30 -6 -20 -58 -39 -8 -81 32 -27 79 -26 -17 16 28
6340 28 21 14 26 12 -26 -2 29 31 91 -13 4 65 91 -15 -2 65 -66 -47 85 38 32 -48 -46 6 36 -44 71 -72 69
6369 69 -145 19 80 54 -45 132 -9 -146 -19 86 91 103 -1 47 -67 -90 46 2 -1 28 102 -89 -33 52 -74
6394 -74 62 -41 -32 55 0 16 17 -128 26 -35 -70 110 -86 117 76 11 34 73 -91 -26 -60 -60 49 30 27 -45 18 17
6422 17 71 1 -1 -8 -16 74 11 -67 13 -103 -87 12 -109 74 -105 6 14 -22 -86 39 -27 -121 -50 -11 -27 96 10 54 62
6451 62 -75 -114 -58 -14 32 86 -52 51 30 51 44 -70 -11 14 -27 41 12 -28 -15 -56 17 58 6 44 101 -30 -70 -20
6479 -20 -14 -1 -154 -27 -11 -7 -75 63 39 -21 19 -25 -56 56 -12 -190 -36 -16 -58 -6 -153 3 55 55 66 -15 -36 151
$$ packed form
6285a35J14q9M8L6m2K05m0j29J08K7k14J39m6J04k2m3j7O5j49Q9k1l2J3K1o9K
6311g7R7l3R6o1q9J00j15mR3q3J15p6KO8L6l9l6j4l8J9L1p3J13n9J06j05RL3J2
6340B8ppJ2j4l8K4L1KO0j04J7O1K6j06J3O7j31J9J32m7oq0KN2L0q0J15j43J41
6369F9k14J64O1k6r9J77j41j37J27J05NJ2j04M8j14k3J36m4lK9P4j91N6Q5j26
6394g4J36j03RQ7n5J6Jj45J54o1l5J80j96K03m1o5K3L9j64O5l4%J09j9lp2O3j
6422A7N4p0kpqR0o3p8Q0j16J6R9j21J83j79J11Ql6o4J25o6r4P1L9j6J23q6M4Q
6451F2j37l9N6M4M6N4j38J03k1K1pj14N9K5m1O8k9m0J3m1P3M1n2L8N7j31m0N0
6479b0OJ3j53J27J6Mo8J38k4o0M0m4l1J12o8j78J54K0m2N2j47J56N2%J1q1k1J87
$$ plain form
6507 151 37 -64 12 93 9 1 -68 82 49 40 13 -32 -43 -51 59 169 55 31 -47 -31 -22 -22 -19 -49 -52 0 34 103 -83 52
6537 52 76 29 94 58 -61 91 4 -62 130 -28 -9 80 23 26 59 -36 128 6 92 -31 37 -27 -5 -15 -64 34 40 100
6565 100 -25 39 9 -29 16 63 20 169 -19 24 -21 15 -39 46 36 -91 45 97 22 -77 111 95 8 -19 162 34
6591 34 -4 33 18 -41 2 47 -43 -49 -13 103 -38 21 -10 59 -59 3 44 3 -77 -66 47 -84 -6 -4 15 -29 -139 -28
6619 -28 87 49 90 12 -6 -143 -29 23 -11 63 25 33 -26 -52 168 6 -89 78 -18 59 4 73 -8 -55 0 -15 -34 25
6647 25 64 55 20 -18 33 -49 -97 92 -74 -40 29 -5 -53 12 145 73 23 -49 124 -39 61 -63 40 -36 45 42 64
6674 64 45 70 83 17 76 77 14 52 84 -59 -1 25 -45 -15 -70 -34 62 92 37 -90 29 -81 -8 -62 -88 -134 -3 -125
6702 -125 44 -101 46 -11 -34 -21 -58 73 107 37 -8 94 -37 18 21 -49 135 101 38 -52 128 10 39 82 -32
$$ packed form
6507A51j14j01P6Q1q4qo9J50l3rk7m5j1qJ10J10j14k4p8J6R%Ll0lN2L4O9j86J35
6537E2K4m7O5l6j19J52q7o6J92j58J9Q9n7LL3r5J64j22Q6j23O8o4K2j0m9R8OO0
6565A00j25O4l0l8M5M7m3J49j88M3m5L6n4Q5j0j27J36N2p5r9J88j6q7k7J81j28
6591C4l8L7j5n9M3M5r0oL6J16j41N9l1O9j18O2M1m1q0J1J13j31P8KJ9m4j10J11
6619b8J15l8M1p8j8j37J14N2l4P4l8Qn9k6K20j62r5J67r6P7n5O9q1m7N5j5j9N9
6647B5L9rl5l8N1q2m8J89j66L4O9l4m8O5J33p2n0p2J73j63J00j24J03p6Q1lK2
6674F4j9K5J3o6N9Jo3L8L2j43N8K6p0L0n5L6R6L0n5j27J19j10P3n4k6m6J31j22
6702a25J69j45J47n7k3J3l7J31L4p0m5J02j31N5Lp0J84l4o3r0J80j18K9M3j14
$$ plain form
6727 -32 43 32 22 -47 -3 22 126 5 36 -19 78 -109 -2 68 -105 21 -126 105 -73 -42 71 -36 -47 -32 22
6752 22 4 -33 103 -27 -71 61 97 -36 13 -17 18 13 -8 71 0 123 -82 32 17 110 -65 -1 7 -42 -17 64 -76
6779 -76 -14 135 -23 41 42 55 16 -87 79 94 60 51 -97 -103 73 59 -9 102 -30 -21 51 -16 76 58 19 72 -35 -15
6807 -15 -24 81 88 87 -39 -86 -31 -23 7 -6 -3 -16 -37 89 -70 58 65 -41 -39 4 -21 -4 47 23 56 49 16 42 -48 40 1
6838 1 2 44 -50 -8 -44 91 100 50 69 44 -42 24 -8 -83 13 2 -59 9 -58 -22 -23 -28 -117 31 -15 -38 -100 -72 17 21 -37 49
6870 49 -40 6 151 50 164 2 -134 57 31 35 -78 -48 -44 -4 -16 22 -53 -26 80 -17 14 -34 112 43 -40 -42 4
6897 4 -46 -55 21 47 -26 101 31 9 -56 -10 -5 -56 -115 -17 79 -55 -56 21 -2 40 -19 26 59 5 121 60 71 -16 53 -48
6927 -48 -65 12 -20 156 66 42 -12 -89 118 -55 -48 -12 -1 34 -13 -23 -69 30 88 -8 80 4 49 71 48 -25 109 -18
$$ packed form
6727c2P5j1j0o9M4K5J04j21L1n5R7j87J07P0j73J26j47K31j78L1J13j07j1J5N4
6752B2j8l7J36j30m4J32L6j33M9l0L5nk1P9p1J23k05J14j5R3j75O4Qm9K5Q1j40
6779g6O2J49j58O4JJ3l9j03J66J5l4rj48oJ76j4o8J11j32RP2o7R2j8l9N3j07K0
6807a5rJ05Pjj26m7N5QL0j3Lj3k1J26j59J28Pj06KM3k5J7N1k4L3pl3K6r0Q8l9
6838AJM2r4M2l6J35Rn0J9k5q6O6l2p5R6j1o1O8o7L6jnq9J48m6k3o2K8Q9Mn8Q6
6870D9q9M6J45j01J14j62j36J91k6Mj13L0MM0j2L8p5K7J06r7L1m8J46o9q3kM6
6897Dn0rP6K6p3J27p0k2o5M6Nn1n9R8R6j34jP7k3M2n9M5L3n4J16o1J1q7O9j01
6927d8j7P7l2J76r0k4n4p7K07j73PL6J1L5m7j0m6R9N8r6Q8p6M5K2k3p3J34j27
$$ plain form
6955 -18 -12 -32 -49 -31 -19 -42 53 -11 -3 -21 -71 83 -91 -23 -118 -25 -39 -52 -30 -81 -33 19 73 21 -53 -14 -58 56 31 4
6985 4 -12 -60 -25 -25 -47 -187 -14 0 75 -64 49 53 -43 -22 28 60 101 14 -33 -19 57 8 -37 89 -47 4 68 -6 -13
7014 -13 53 -18 64 -83 103 56 29 62 16 43 -65 55 19 -8 25 -11 32 7 -72 -39 -144 -95 81 60 -97 30
7040 30 -72 52 108 -12 -17 -77 86 -15 -13 102 6 -82 27 75 -53 -77 -49 51 49 -10 -34 18 68 -61 -6 -80 -80
7067 -80 -60 -2 -16 -41 -47 72 -28 -179 85 34 71 32 68 -25 -37 -68 -67 12 -106 -4 26 -28 54 -109 33 7 131
7094 131 -52 -7 -69 -33 -99 -74 99 -51 -76 98 30 19 -11 -32 45 31 -57 16 -6 -40 -77 -71 -6 0 88 -34 -53 39
7122 39 -84 -6 -61 56 -104 50 5 24 -9 -69 -39 -74 -62 -50 17 13 -34 -20 54 -7 42 -7 53 33 -31 -57 -35 -47 -54
7151 -54 1 18 121 -58 -6 -15 115 -47 -52 50 -22 64 15 44 54 3 -49 -58 20 -15 52 18 37 22 -119 -41 -11 -32 17
$$ packed form
6955a8Ok0j7J8J2k3R5o4Qj8n0J54j74O8r5R3j4j3K2n1M8N2N4n2p4L9m4J14k5k7
6985Dj6m8L5%k2j40J73J4P5j39J13Mr6K1N0L2M1q7m7J4P6m9m5J26j36N1O4p4p
7014a3O6p1Q2j47J86m7k7L3m6K7j08J20l6k7L3l6M3k5p9L3j05M9J76k1j57J27
7040C0j02J24N6j20no0J63j01KJ15r6q8J09M8j28k4K8J00kn9k4N2N0j29N5p4%
7067h0K0N8j4k5oJ19j00j51K64n1L7l9L6r3j2l1JP9j18J02L0n4Q2j63J42k6J24
7094A31j83M5o2L6o6K5J73j50k5J74o8j1l0k1P7j4q8P3k2l4l7OO5OQ8j22j9R2
7122C9j23P8n5J17j60J54m5J9l3o0L0l5J2J2O7mm7J4P4o1M9m9O0k0o4k6K2j2p
7151e4N5J7J03j79N2rJ30j62nJ02p2Q6m9K9J0n1n2rP8l5O7l4J9j5j41P8L0k1M9
$$ plain form
7180 17 126 5 7 -132 78 83 122 -32 -15 111 -41 -15 48 -70 -118 51 -70 30 -66 -32 -88 97 -38 2 30
7205 30 -21 64 -84 54 -42 -2 10 19 57 39 -62 66 45 -35 -41 -19 -49 42 18 -17 66 95 -34 6 122 -43 -51 -21
7233 -21 149 84 76 13 63 -61 200 27 -60 25 30 -30 -34 96 83 -96 -15 -9 41 -54 34 68 19 179 20 53 120 -60
7261 -60 37 184 -65 -48 96 -156 -125 39 -87 64 -73 -15 94 -3 -16 -25 -72 -7 -74 -45 66 -32 60 -56 -63 -49
7287 -49 -1 5 85 11 -60 51 -37 -12 -62 -18 -36 47 -106 -5 80 -48 4 30 -34 9 109 -57 -100 33 15 95 -95
7314 -95 26 26 -14 -81 -41 -107 -1 -54 -45 43 57 36 34 -64 -41 85 -43 0 -51 110 -69 -13 47 34 -36 26 10 57 14
7343 14 44 -11 -13 -30 73 94 16 108 -33 39 28 112 79 27 85 -37 -84 -9 -36 98 5 -50 -28 81 -26 27 25 36
7371 36 0 -117 -34 -21 -11 18 -89 33 101 54 3 -8 -38 -92 86 66 131 -33 16 14 -22 -42 56 76 52 49 -40 52 19
$$ packed form
7180A7J09j21Kj39K10NL9j54J7J26j52K6O3j18m8J69j21J00r6L4n6J85j35M0K8
7205C0n1Q5j48J38r6M0J2RL8j8j01J28k1q0oK2l0R1k4l5Q3K9j29M0J16j65qL0
7233b1J70o5qo3N0j24K61j73q7Q5No0mJ30j3j79Q1ON0r5Q8L4m9J60j59L3O7j80
7261f0R7J47k49J7J44k52L1J64j26J51j37N8J09r7j3rm7O5o7K9J11r8R2j16pJ4
7287d9M8OQ0p4p1J11q8K5n0M4j8Q3j53J01Q5j28N2K6o4M3J00j66m3J33j8Q0j90
7314i5J21%m0o7M0o6J06n3RQ8J4k1kr8K3J26j28M3n1J61j79N6O0j3p0O2j6M7m3
7343A4L0n5kj7J03K1p8R2j41P2j1Q4l3n2N8j22m7P5k7J34r3n5K2J09j07N3kJ1
7371C6l6j17Q3J3J0K9j07J22O8m7n1j1l0n4J78k0O5j64M9kl6k0R8K0k4lq9R2l3
$$ plain form
7400 19 -56 -85 -14 149 70 -5 -46 50 -14 -13 8 34 149 77 13 -80 47 14 -38 -87 -159 79 69 -2 37 31 -30 3 -23
7429 -23 47 -47 -41 -33 -61 -8 27 -73 -93 -53 -5 -63 183 -42 16 -21 -30 12 29 59 -17 74 71 -34 -54 -34 26 -8 -72 35
7459 35 -13 -60 -11 -64 56 56 -39 -46 -2 38 92 -49 77 -96 124 -66 27 61 22 11 -88 13 18 -61 -38 -47 -86 21
7487 21 -31 71 -31 6 74 52 -198 28 74 -21 -40 -61 16 37 56 49 1 22 -65 90 22 -48 -12 56 -2 -23 72 -59
7515 -59 78 -125 15 -51 34 -41 -1 26 -87 36 -40 -97 26 25 107 18 42 -3 -16 -67 93 -31 -4 22 72 73 70 -57
7543 -57 -138 113 -68 -77 -4 -14 -67 73 14 -4 74 -20 -22 32 -30 -31 21 24 -65 47 63 -18 77 10 -41 -75 63 3 -8 50
7573 50 32 -128 -69 49 56 -31 -5 35 -86 -46 -30 -37 59 22 54 54 28 -107 -90 -52 -39 -64 39 33 80 -8 47 -65 -13
7602 -13 86 13 -42 -59 2 -35 -103 63 64 -48 44 -70 -22 -13 -109 -50 -96 -10 -3 -41 2 -19 33 -100 -143 21 -73 -34 80
$$ packed form
7400A9p5k9P1J63p9p5m1R6o4JK1K6J15p2o4r3J27l3n2m9p2K38j0p1L9oo1L3k6
7429b3P0r4OQk8N3L5j00k0M0M8n8K46k25N8l7rM2J7L0p6R1lj05k0K0O0l4o4J07
7459C5m8m7M9n3J20%r5pM4M0N4j41J26j73K20j90R3L4l9j1r9J01Np9K3rl9J07
7487B1n2J02j02L7O8k2k50K26M6r5j9k1P7K1J9pm8K1q7J55o8p0L6O8n8k1R5j31
7515e9J37k03J40o6Q5p5M0K7j13J23p6n7J23jQ2q9K4m5j3n1J60j24K7K6N0Jlj27
7543e7q1K51j81rP3j0n3J40n9j8P8r4kN4o2jN2Lq9J12J6q1R5o7n1l4J38o0j1N8
7573E0j8j60N9J18Pq7K6M0j21M0J6pR6l7L2%k6j35J7L8J3k5J03oM7q8N5j12N2
7602a3R9p3n5j7O1l7o8J66Jj12R2j14M8Rr6N9m6Q6Pl8M3k1N2j33m3J64r4L9J14
$$ plain form
7631 80 35 2 -6 -53 88 -4 43 116 57 65 -1 16 -43 -62 13 53 -38 -37 115 17 -78 -11 -52 -32 -13 12 28 -79 -90 -49
7661 -49 68 -23 -90 -6 -17 -21 -48 48 96 -102 -21 -13 28 35 71 38 -39 -43 -16 57 62 -53 55 -49 83 57 -70 75 -37
7690 -37 17 131 66 -14 114 -24 -50 68 79 7 -57 31 1 -9 -46 -21 -42 62 -121 6 -68 50 -69 -109 115
7715 115 50 -37 126 -76 -127 -24 84 -77 -40 120 78 -33 -81 6 39 -3 59 89 34 119 109 111 54 -19 95 -15
7741 -15 27 56 -19 85 -84 4 11 70 99 24 17 -32 17 -42 -67 -138 -56 -113 -20 46 38 -15 -5 -16 -33 -91 -55 9 29 -63 -60
7772 -60 27 65 22 -123 -78 35 2 8 85 88 88 -15 63 -3 53 128 9 -91 -44 69 -32 -146 -51 -78 -38 -71 -49 17
7800 17 102 118 36 77 -73 -61 -63 81 -30 73 -56 -63 -46 40 43 34 -54 -99 2 -21 -5 77 70 -14 -23 -4 28 73 81 57 -27
7831 -27 96 69 24 -123 37 19 -28 20 61 -11 126 101 18 44 -93 18 -7 -13 24 78 -60 27 -70 -17 -24 105 -66
$$ packed form
7631H0m5l3qm7J41r2M7P3n9Qo6J7n9j9P5M0r1JJ52r8r5O7m1K0J9K5J6j07j1M1
7661d9J17r1o7Q4j1mk7R6M8j98Q1QM1PL6l3p7mK7P3Nj15J08j04J32k6j27J45j12
7690c7N4J14o5q0J28j38k6J18J1p2o4Q8l0j0l7K5k1J04j83J27p4J18j19m0K24
7715A15o5q7J63k02n1J03J08j61L7J60m2j11m8Q7L3m2O2L0n5Q5j0Kn7p3J14j10
7741a5M2K9p5J04j69Q8PN9K9p5pm9M9n9k5p1Q2n7R3O6qn3J0j1j7n8L6O4K0r2L
7772f0Q7L8m3j45M5J13l3OP7L%j03P8o6N6P5j19j00M7J13j01j14R5k7M0l3K2O6
7800A7Q5J6q2M1j50J2kJ44j11J03j29pJ7Q6Lrq8m5J01k3J6Q2pq4rJ9L2M5Qk4q4
7831b7J23k7m5j47J60j8m7M8M1p2J37k5q3K6j37J11k5oL7N4j38Q7r7N3pJ29j71
$$ plain form
7858 -66 118 19 26 -24 5 5 23 70 154 -7 13 16 -18 -60 -75 79 -4 4 48 -21 107 50 -13 -45 31 21 -150 17 26 40
7888 40 -30 103 -139 7 37 42 52 44 -46 49 -16 -35 50 4 -1 93 -32 58 -11 58 -43 -21 69 40 -9 -49 -6 3 81 -121
7918 -121 -80 -31 69 122 41 -13 67 42 37 -48 -90 -57 -44 -54 -37 -50 26 -76 17 69 9 -113 -40 -99 -15 129 84 -35
7946 -35 32 45 -150 -13 82 -38 -12 59 85 2 123 -32 -10 -1 22 -51 21 -25 44 -67 28 -75 64 82 26 -51 -9
7973 -9 -50 8 -78 -35 20 -65 7 -118 28 -17 52 119 25 62 -63 4 13 56 57 -64 54 98 133 64 7 22 -7 -42 -71
8002 -71 55 -72 44 -35 32 64 -30 -26 19 14 80 26 7 45 34 -55 5 -19 10 -126 76 -107 -34 -50 -6 34 9 -34
8030 -34 11 -70 -16 43 55 -20 -127 -37 -71 -91 -117 -91 -6 69 -20 -4 -53 36 -78 81 -79 -38 58 53 43 -11 10 -44 86
8059 86 -33 53 -19 52 68 8 -15 -64 -89 2 -76 72 7 17 -67 -32 32 115 71 77 108 82 12 15 21 -69 -82 99 -100 9
$$ packed form
7858f6J84r9Pn0K9%J8M7Q4j61K0Ll4m2j5J54q3QM4o9J28n7o3l2P6j0j71J67RJ4
7888D0p0J33k42J46L0NJ0qr0R5o5j9Q5m6nR4j25R0o9O9j01K2R0k9m9m0M3RP8k02
7918a21M1M9J00N3q1n4Q0k5nq5m2L3J3j0J7j3P6j02R3N2o0j22P3n9Q4J44m5j19
7946c5O7J3j95J37R5j20K6P1K6q3J21j55K2RK3p3P2m6O9j11R5j03J39J8n6p7M2
7973im1N8q6M3N5q5P2j25J46m5O9O7r4L7j25O7RM3Jj21J18M4L5o9n7J5k9l5k9
8002g1J26j27J16p9O7L2r4MM5nO6n4j9L8j1q9O0k4K9j36K02j83P3j6M4M0k5m3
8030c4M5q1N4N9J2p5j07R0l4k0k6K6Q5P5q9J6m9Q9j14J59j60M1R6nj0n4K1n4J30
8059H6j19Q6p2P1J6o0k3m9k5R1p8J48o5J0q4L5O4Q3m4OL1k6p0LOr0j3J81j99J09
$$ plain form
8089 9 -106 115 3 -70 64 -2 16 32 -47 22 22 -68 -27 42 -10 -106 60 -71 30 -52 81 -20 -56 9 16 -23 -47
8116 -47 47 -113 1 9 42 38 25 55 -15 -23 109 64 -8 -37 63 134 -24 -46 -40 18 19 -38 138 -1 24 -94 7 -20
8144 -20 30 113 84 11 -7 146 81 -29 -7 -71 -44 11 -135 -5 73 -43 4 -26 51 30 73 47 0 76 -17 50 -15 24
8172 24 88 -101 40 -65 58 20 6 92 1 -56 69 -2 10 -73 -77 -57 7 33 -79
$$ packed form
8089Ij15K21j12p3J34o6J8J6p9O9%r0M1O9n2r6J66j31J01q2J33j01l6O5Pl9k4
8116d7R4j60J14QL3mj3L0p0qJ32m5p2k9J00P1j58k2ON8Jn7J76j39K5j18J01k7
8144b0N0Q3k9p3j8J53o5j10K2o4K7N5j46J30P8j16M7l0P7k1M3k6m7P6r3O7o5L9
8172B4O4j89J41j05J23l8j4Q6r1n7J25p1J2q3mK0O4K6j12
8191g9
$$ Imaginary data points
##PAGE= N=2
##DATA TABLE= (X++(I..I)), XYDATA
$$ plain form
0 0 0 0 0 0 0 0 0 0 0 0 0 0 0 0 -8 8 -8 8 -8 14 -16 16 -24 24 -32 32 -40 48 -51 59 -68 79 -89 99 -113 129
36 129 -144 161 -178 199 -223 247 -273 303 -336 370 -408 451 -497 547 -604 665 -731 808 -891
55 -891 988 -1098 1222 -1368 1540 -1748 2002 -2321 2742 -3315 4155 -5508 8049 -14546 70541
70 70541 126649 62614 49521 -28267 -51313 -71282 -94842 -72911 -55359 -60325 -16148 -7331 7678
83 7678 44577 39018 43448 57739 17335 5745 -8045 -40294 -25688 -21685 -27110 7816 1261
96 1261 -10675 -2216 -28361 -27717 -8095 -19130 8421 30473 20260 38394 33422 19757 38570
109 38570 20100 8335 18709 -14562 -29878 -33047 -61071 -45223 -27411 -25266 15697 30527
121 30527 28964 48220 28917 19509 32081 9149 10341 16129 -12969 -13809 -26138 -51999 -33408
$$ packed form
0@%%%%%%%%%%%%%%qJ6j6J6j6K2l0L2m0M8n6O4p2Q8r9J10j27J47j68J88k12K42
36A29k73L05l39L77m22M70n20N76o39P06p78Q59r48J044j151J269j396J539j699
55h91J879k086K320k590K908l288L750m323N063o057P470r663J3557k2595Q5087
70G0541N6108o4035j3093p7788k3046j9969k3560K1931J7552m966M4177Q817J5009
83G678L6899n559M430J4291m0404j1590j3790l2249J4606M003n425L4926o555
96A261j1936Q459k6145O44J9622j1035K7551K2052j0213J8134m972j3665J8813
109C8570j8470j1765J0374l3271j5316l169k8024J5848J7812K145M0963J4830
121C0527j563J9256j9303r408J2572k2932J192N788k9098q40j2329k5861J8591
$$ plain form
134 -33408 -31587 -30305 1756 1165 6677 23018 3675 11164 22745 4975 17587 16700 -4490 926
148 926 -19021 -34178 -15578 -21440 -9212 18903 12623 23957 28775 5240 13571 11870 -1638
161 -1638 14241 5696 -4437 5400 -15414 -18300 -4246 -15518 -1589 8301 -6221 4986 -3119
174 -3119 -22330 -8385 -12790 -11330 11754 5544 11735 21048 -1177 2383 5316 -9016 5858 4257
188 4257 -6905 5031 -9544 -17412 -2577 -11017 -709 15755 4185 13911 14090 -6053 1927
201 1927 -3401 -10884 7118 839 -61 12372 -4074 -4280 2222 -10085 3606 8597 -2843 9068
215 9068 713 -12954 -2590 -10764 -7746 8870 -264 5980 11353 -6563 -1474 -2863 -13501 1915
229 1915 88 -4370 9268 -1453 -4169 4689 -7211 1107 10423 -534 8802 6185 -7989 722
$$ packed form
134c3408J821J282L2061n91N512J6341j9343P489J1581j7770J2612q87k1190N416
148I26j9947j5157J8600n862J2228K8115o280J1334M818k3535Q331j701j3508
161a638J5879q545j0133R837k0814k886J4054j1272J3929R890j4522J1207q105
174c119j9211J3945m405J460K3084o210O191R313k2225L560K933j4332J4874j601
188D257j1162J1936j4575p868J4835q440J0308J6464j1570R726J79k0143P980
201A927n328p483J8002o279r00J2433j6446k06O502j2307J3691M991j1440J1911
215I068q355j3667J0364q174L018J6616r134O244N373j7916N089j389j0638J5416
229A915j827m458J3638j0721k716Q858j1900Q318R316j0957R336k617j4174Q711
$$ plain form
243 722 -6245 -8714 8783 2670 4748 13411 -1876 -462 -151 -13332 -1506 -606 -8033 5688 -274
258 -274 -4966 5359 -4437 -1049 9256 -1282 4916 6059 -8544 -1885 -5892 -12222 3636 1772
272 1772 2580 14013 2388 1684 5027 -8834 -2524 785 -7879 2348 -643 -7096 4063 -2866
286 -2866 -3059 9160 1407 4524 9168 -3811 100 -1742 -12001 -624 -1244 -3710 8382 1282
300 1282 -1024 5846 -5286 -1489 4538 -4109 4080 3848 -5701 2912 -1938 -6433 4310 -1949 -604
315 -604 7347 -3120 203 3362 -6736 1286 2410 -2732 7527 2167 -2813 4258 -5861 -6167 1209
330 1209 -6356 42 3773 -4545 3248 2016 -3836 6103 1817 -385 7312 -1829 -1952 2222 -7661
345 -7661 -2466 522 -5903 3829 3093 -2009 6202 -286 -2728 4225 -3702 -516 4679 -4409 989
$$ packed form
243G22o967k469J7497o113K078Q663j5287J414L11j3181J1826R00p427J3721n962
258b74m692J0325r796L388J0305j0538O198J143j4603O659m007o330J5858j864
272A772Q08J1433j1625p04L343j3861O310L309q664J0227k991o453J1159o929
286b866j93J2219p753L117M644j2979L911j842j0259J1377o20k466J2092p100
300A282k306O870j1132L797O027q647Q189k32r549Q613m850m495J0743o259J345
315f04P951j0467L323L159j0098Q022J124n142J0259n360m980P071j0119l06P376
330A209p565O398L731q318P793j232n852R939m286k202P697r141j23M174r883
345g661N195K988o425R732p36n102Q211o488k442O953p927L186N195r088N398
$$ plain form
360 989 2343 -4416 4219 2543 -1093 7217 -241 -2844 2286 -7445 -5336 -1140 -8431 -470 1904
375 1904 -2804 6789 4319 567 8100 763 -402 4344 -5313 -3335 -1287 -9149 -1666 -219 -3929
390 -3929 6113 3847 1402 8258 1056 703 4456 -4670 -1716 -2 -7486 -801 -1183 -5451 2642
405 2642 -1033 -2372 5265 -709 1091 5909 -1581 2723 3983 -2812 3551 1211 -3860 2607 -2801
420 -2801 -4342 2161 -4324 -1973 2491 -4249 1444 2831 -2921 4031 1103 -3359 3271 -1759 -1839 4303
436 4303 -2044 746 3702 -4264 323 -117 -6443 58 -2624 -4687 3507 -169 1507 8138 2211
451 2211 5482 7592 -444 2881 -128 -8100 -3897 -8495 -10208 -1862 -4338 -736 6916 2416 6588
466 6588 8503 1618 6021 3293 -3049 1897 -2995 -5767 8 -5106 -2802 2490 -2786 1921 3572
$$ packed form
360I89J354o759Q635j676l636Q310p458k603N130r731K109M196p291P961K374
375A904m708R593k470l752P533p337j165M746r657J978K048p862P483J447l710
390c929J0042k266k445O856p202l53L753r126K954J714p484O685l82m268Q093
405B642l675j339P637n974J800M818p490M304J260o795O363k340n071O467n408
420b801j541O503o485K351M464o740N693J387n752O952k928m462O630n030q0O142
436D303o347K790K956p966M587m40o326O501k682k063Q194l676J676O631n927
451B211L271K110q036L325l009p972M203m598j713Q346k476L602P652m500M172
466F588J915o885M403k728o342M946m892k772N775n114K304N292n276M707J651
$$ plain form
481 3572 -3061 1351 -1183 -5616 752 -2432 -2258 4275 -1311 71 3137 -3645 545 1734 -3316
496 -3316 2981 1094 -1983 4666 266 387 6180 712 2910 5382 -1645 1057 -582 -6662 -1126
511 -1126 -3066 -4474 2921 -856 -797 3316 -3177 -715 1779 -3643 1259 871 -3986 1038 -1899 -3626
527 -3626 2782 -873 874 5599 -159 2042 2725 -3881 227 -723 -3858 2651 -187 -1434 3733 -1950
543 -1950 -1105 2912 -2126 1840 3398 -2267 1769 -578 -4300 1745 -580 24 6088 1295 2360 4291
559 4291 -2983 -576 -656 -5792 -568 -1775 -4294 1344 -2192 -2147 3212 -875 2311 5015 -1356 685
575 685 -1511 -7945 -3776 -5119 -5460 2270 734 2545 7870 3291 5497 7385 1634 4564 2942 -2692
591 -2692 401 -3953 -6857 -1974 -4987 -2577 3354 -187 3042 3787 -2069 996 -422 -3997 1598
$$ packed form
481C572o633M412k534m433O368l184J74O533n586J382L066o782M190J189n050
496c316O297j887l077O649m400J21N793n468K198K472p027K702j639o080N536
511a126j940j408P395l777N9M113o493K462K494n422M902l88m857N024k937j727
527c626O408l655J747M725n758K201O83o606M108r50l135O509k838j247N167n683
543a950Q45M017n038L966J558n665M036k347l722O045k325O04O064m793J065J931
559D291p274K407q0n136N224j207k519N638l536M5N359m087L186K704o371K041
575F85k196o434M169j343l41P730j536J811N325m579K206J888n751K930j622n634
591b692L093m354k904M883l013K410N931l541L229P45n856L065j418l575N595
$$ plain form
606 1598 -871 -2393 1905 -2910 -2123 1499 -2717 1156 3132 -1435 2406 379 -3727 670 -2319
621 -2319 -2324 3522 2 1868 4640 -1187 1076 1290 -3049 1965 686 -2046 1946 -2449 -3792 375
637 375 -3137 70 4158 691 4632 4351 -582 2793 -125 -3110 1112 -2665 -3105 141 -4701 -2807
653 -2807 -433 -3734 1764 3411 843 5144 1852 -1574 1320 -3461 -3210 815 -3123 -270 1704
668 1704 -2595 1487 1336 -1069 4133 2163 860 4456 -685 -1145 1038 -3755 -427 1490 -1765 2886
684 2886 1400 -2376 1048 -2492 -3449 979 -2339 -675 2007 -2630 301 1325 -1849 3277 2801 604
700 604 4360 203 -1712 441 -4404 -3256 -214 -3539 548 1633 -1710 2351 813 -818 3747
715 3747 1078 859 3686 -1622 -1235 -318 -4639 -886 -65 -2154 2505 720 -1346 2399 -1199 -1061
$$ packed form
606A598k469j522M298m815P87L622m216L873J976m567L841k027m106M397k989
621b319nN846l520J866K772n827K263K14m339N014j279k732L992m395j343M167
637C75l512L207M088l467L941k81m933L375k918k985M222l777m40L246m842J894
653b807K374l301N498J647k568M301l292l426K894m781K51M025l938K853J974
668A704m299M082j51k405N202j970j303L596n141m60K183m793L328J917l255M651
684B886j486l776L424l540r57M428l318J664K682m637K931J024l174N126m76k197
700F04L756m157j915K153m845J148L042l325M087J085l343M061j538j631M565
715C747k669k19K827n308L87R17m321L753Q21k089M659j785k066L745l598J38
$$ plain form
731 -1061 2514 -1310 1157 2564 -1782 1044 102 -3142 1276 -360 -1162 2954 -742 -836 1505 -2987
747 -2987 -142 1767 -1009 2903 2007 -1265 2014 -1228 -2563 1130 -2213 -887 1712 -2238 92
762 92 666 -2800 1169 401 -1167 3149 438 -706 1957 -2266 -1234 1079 -2050 1042 1828 -1717
778 -1717 1362 -311 -2457 1714 -515 58 3468 -229 1107 2372 -1853 927 925 -1978 1669 -74
794 -74 -1903 1333 -2066 -2133 1093 -1991 320 2261 -1497 1045 73 -3087 703 -862 -1606 2320 -563
811 -563 -341 1887 -1829 -25 1080 -1989 1322 937 -1600 1702 -461 -1552 1758 -954 289 3011
827 3011 -495 1416 1856 -2010 947 167 -1510 2291 161 -751 1930 -1710 -1024 958 -2471 51
843 51 574 -2334 721 -521 -2280 1323 -1018 -881 2306 -708 371 1615 -2127 106 -36 -2493
$$ packed form
731a061L575l824K467J407m346K826r42l244M418j636q02M116l696r4K341m492
747b987K845J909k776L912q96l272L279l242j335L693l343J326K599l950K330
762I2N74l466L969p68j568M316k711j144K663m223J032K313l129L092P86l545
778a717L079j673k146M171k229N73L410l697J336J265m225K780kk903L647j743
794g4j829L236l399o7L226l084K311J941l758K542r72l160L790j565p44L926k883
811e63K22K228l716J804J105l069L311l85k537L302k163j091L310k712J243K722
827C011l506J911M40l866K957p80j677L801k130r12K681l640O86J982l429K522
843E1N23k908L055j242j759L603k341J37L187l014J079J244l742K233j42k457
$$ plain form
859 -2493 1178 214 -1198 2079 -632 -759 2217 -763 904 2451 -820 1552 987 -1708 1359 -358
875 -358 -1457 1855 -670 -240 2169 -1327 233 1307 -1738 967 616 -1618 1114 -1182 -2409 154
891 154 -2416 -1512 1044 -1618 456 1385 -1290 1419 847 -1021 2082 54 -832 1652 -1324 -746 924
908 924 -1889 452 1238 -985 1954 1109 -796 1865 -449 -752 1862 -863 290 1551 -1580 528
924 528 688 -1569 1353 77 -1448 1131 -1405 -1781 650 -2257 -626 870 -1557 1185 1261 -876
940 -876 1657 197 -1202 1342 -1010 -971 1024 -1812 -535 630 -1649 1219 1451 -325 2422 815
956 815 -374 1885 -858 -652 1061 -1672 -155 727 -1645 893 548 -1169 1561 56 -649 1718
972 1718 -870 -682 784 -2095 -291 475 -1745 992 149 -1169 1374 -391 -818 1484 -1191 -325
$$ packed form
859b493L671r64j412L277k711j27K976k980J667J547l271K372n65k695L067j717
875c58j099L312k525M30K409l496J560J074l045K705l51k234K732k296j227K563
891A54k570R04K556k662K074R29k675K709n72j868L103k028q86K484k976N78J670
908I24k813K341P86k223K939q45j905K661k314l03K614k725J153J261l131K108
924E28J60k257K922j276j525K579k536l76K431k907J631J496k427K742P6k137
940h76K533j460j399K544k352L9J995k836J277J165k279K868K32j776K747j607
956H15j189K259k743K06J713k733J517Q82k372K538l45j717K730j505p05K367
972A718k588J88J466k879J804P66k220K737q43j318K543j765m27K302k675Q66
$$ plain form
988 -325 960 -1431 499 879 -1174 1485 530 -662 1956 8 -367 1356 -1340 -532 564 -1908
1004 -1908 243 441 -1501 1039 165 -725 1878 -44 14 1742 -928 -6 803 -1570 257 -125 -1878
1021 -1878 503 -601 -1270 1182 -788 -467 1336 -866 530 1386 -710 1305 709 -946 1419 -217
1037 -217 -745 1138 -1104 -786 539 -1588 6 448 -1429 833 380 -789 1635 184 -239 1668
1053 1668 -602 -12 1087 -1210 180 409 -1613 508 -296 -1342 1068 -414 -526 1228 -634 306
1069 306 1297 -884 708 691 -1187 750 -180 -1359 875 -930 -858 849 -1145 155 1200 -808 934
1086 934 876 -869 1245 122 -821 1062 -833 -718 778 -1221 -173 605 -1385 492 302 -862 1360
1103 1360 66 -391 1407 -470 -85 1115 -1038 115 478 -1505 403 -70 -1197 888 -299 -755
$$ packed form
988c25J285k391J930L80k053K659r55j192K618j948l75J723k696Q08J096k472
1004a908K151J98j942K540q74q90K603j922N8J728k670R22Q09k373J827l82j753
1021a878K381j104o69K452j970L21J803k202J396Q56k096K015n96j655K365j636
1037b17n28J883k242L18J325k127J594M42j877K262m53j169K424j451m23J907
1053A668k270N90J099k297J390K29k022K121q04j046K410j482j12J754j862R40
1069C06R91k181J592j7j878J937r30j179K234j805P2J707j994J300J045k008J742
1086I34n8j745K114j123r43J883j895J15J496j999J048P78j990J877j90j164K222
1103A360j294m57J798j877L85J200k153J153L63j983J908m73j127K085j187m56
$$ plain form
1119 -755 1090 -460 175 1437 -569 624 899 -843 928 173 -1007 649 -829 -912 592 -1167
1135 -1167 -360 717 -1181 309 760 -782 1191 568 -382 1371 -166 -216 1158 -799 -109 489 -1415
1152 -1415 157 231 -1182 815 -109 -966 1034 -449 -213 1066 -728 278 928 -986 627 445 -822
1169 -822 893 -218 -907 675 -854 -509 779 -1026 31 668 -781 906 483 -749 1054 -225
1185 -225 -639 954 -629 -405 717 -1196 -100 422 -924 632 317 -731 953 -244 -446 1070
1201 1070 -623 -232 630 -1009 150 348 -971 726 89 -621 1049 -213 -268 928 -592 -133 643
1218 643 -883 445 552 -880 788 -50 -688 846 -484 -395 821 -712 -188 366 -1002 338 369
1235 369 -990 876 95 -564 1054 -358 -282 752 -933 -209 415 -1035 343 124 -879 813 -117
$$ packed form
1119g55J845j550O35J262k006J193K75j742J771p55j180J656j478q3J504j759
1135a167Q07J077j898J490M51j542J973o23r50J753j537n0J374j957O90N98j904
1152a415J572P4j413J997r24q57K000j483K36J279j794J006O50j914J613j82j267
1169h22J715j111o89J582j529L45J288j805J057O37j449J687m23j232J803j279
1185b25m14J593j583K24J122j913J096N22j346J556l15j048J684j197k02J516
1201A070j693L91Q62j639J159J98j319J697o37p10J670j262n5J196j520M59P76
1218F43j526J328J07j432J668q38o38J534j330Q9J216j533N24N54j368J340L1
1235C69j359J866p81o59J618j412P6J034j685P24O24j450J378k19j003J692r30
$$ plain form
1252 -117 -277 1120 -276 62 1000 -606 342 527 -778 553 164 -804 777 -94 -456 890 -512
1269 -512 -131 708 -911 288 393 -851 395 -214 -837 778 -231 -397 871 -550 39 698 -827
1286 -827 209 161 -826 410 -247 -682 684 -452 -391 646 -571 185 812 -340 788 661 -516 946
1304 946 162 -286 794 -291 -468 594 -756 -147 233 -1069 144 -24 -969 552 -109 -452 993
1321 993 -264 -9 975 -286 356 619 -853 153 -156 -1102 271 -524 -927 587 -476 -53 822 -278
1339 -278 637 816 -88 884 619 -272 725 -296 -541 418 -808 -399 187 -1053 85 327 -642 664
1357 664 373 -82 1003 31 -122 724 -619 -268 137 -1203 -198 -262 -1144 212 -52 -461 853 71
1375 71 116 1089 -138 436 786 -513 454 231 -706 345 -380 -867 239 -422 -374 585 -353 329 783 -297
$$ packed form
1252a17j60J397j396L38R38j606R48J85j305J331l89r68J581q71l62J346j402
1269e12L81Q39j619J199J05j244J246o09o23J615j009j66J268j421N89O59j525
1286h27J036m8r87J236o57m35J366j136O1J037j217P56O27j152J128j27j177J462
1304I46p84m48J080j085j77J062j350O09L80j302J213j68r45J521o61l43J445
1321I93j257K55R84j261O42K63j472J006l09r46J373p95m03J514j063M23Q75j100
1339b78R15J79r04R72k65q91R97j021k45R59j226M09N86j240J138K42r69J306
1357F64k91m55J085r72j53Q46j343L51M05j340J005o4q82J356k64m09J314p82
1375G1M5R73j227N74L50j299R67k23r37J051p25m87J106o61M8R59r38O82M54j080
$$ plain form
1395 -297 847 598 -164 826 -108 -595 293 -860 -655 59 -1053 -253 146 -650 548 256 -232 780
1413 780 16 -209 701 -235 -117 419 -851 -32 90 -800 225 -154 -775 342 -216 -330 692 -75 251
1432 251 875 -22 689 802 -236 562 57 -688 215 -582 -740 169 -792 -326 491 -490 328 492 -387 507
1452 507 75 -636 451 -394 -484 418 -427 47 499 -319 462 438 -397 497 -6 -398 418 -440 -346 264 -498
1473 -498 141 576 -314 456 466 -391 505 -182 -448 436 -384 -171 346 -468 31 433 -248 542 250 -358
1493 -358 460 -32 -371 305 -451 -347 295 -674 89 283 -563 411 176 -352 625 48 -70 594 -392 -195
1513 -195 248 -557 187 254 -458 268 153 -213 580 -58 -189 581 -261 94 314 -492 52 89 -532 214 8
1534 8 -365 419 -356 -371 251 -587 -141 349 -564 230 304 -173 679 226 13 798 13 -201 291 -637 -262
$$ packed form
1395b97J144k49p62R90r34m87Q88j153K05P14j112Q00L99p96J198k92m88J012
1413G80p64k25R10r36J18N36j270Q19J22q90J025l79o21J117n58j14J022p67L26
1432B51O24q97P11J13j038P98n05p45R03p97j58R09r61M66Q17r81Q18J64q79Q94
1452E07m32p11J087q45r0R02q45M74M52q18P81k4q35Q94n03l92Q16q58R4O10p62
1473d98O39M35q90P70J0q57Q96o87k66Q84q20K13N17q14M99M02o81P90k92o08
1493c58Q18m92l39O76p56J04O42r69P63J94q46R74k35n28R77n77j18O64r86J97
1513a95M43q05P44O7p12P26j15l66P93o38j31P70q42L55K20q06N44L7o21P46k06
1534Hl73P84p75j5O22q38M46M90r13P94P4m77Q52m53k13P85p85k14M92r28L75
$$ plain form
1555 -262 5 -820 -32 -36 -415 644 102 -3 613 21 60 543 -349 52 204 -671 9 -104 -508 343 -142
1576 -142 -126 428 -36 -82 467 -305 293 311 -368 244 9 -498 177 -195 -500 305 -312 -88 370 -336 120
1597 120 288 -257 299 208 -251 393 -133 -197 405 -290 -118 204 -467 -22 51 -518 129 -146 -272 422 51
1618 51 56 593 -136 220 410 -379 30 -4 -613 0 -285 -519 163 -174 22 529 39 418 676 -260 283
1639 283 187 -375 216 -182 -463 97 -402 -258 164 -444 94 289 -249 351 271 -215 425 -71 -82 420 62
1660 62 -24 249 -484 -175 -2 -457 111 -17 -323 318 -24 0 591 -85 57 245 -259 -7 85 -385 53
1681 53 -34 -298 303 22 -93 297 26 123 265 -224 8 143 -252 147 -5 -335 268 -92 -249 352 -268
1702 -268 -132 301 -223 147 117 -250 265 66 -251 346 11 -75 208 -372 -84 175 -352 62 -17 -279 232
$$ packed form
1555b62K67q25P88ml79J059n42j05O16n92L9M83q92M01J52q75O80j13m04Q51m85
1576a42J6N54m64m6N49p72N98J8o79O12k35n07O75l72l05Q05o17K24M58p06M56
1597A20J68n45N56r1m59O44n26o4O02o95J72L22o71M45P3n69O47k75j26O94l71
1618E1NN37p29L56J90p89M09l4o09O13k85k34O82l37J96N07m90L79K58r36N43
1639B83r6n62N91l98k81N60m99J44M22o08N38J95n38O00q0m86O40m96j1N02l58
1660F2q6K73p33L09J73m55N68j28l06O41l42K4N91o76J42J88n04K52R2m70M38
1681E3q7k64O01k81j15L90k71R7J42m89K32J35l95L99j52l30O03l60j57O01o20
1702b68J36M33n24L70l0l67N15j99l17N97l35q6K83n80K88K59n27M14p9k62N11
$$ plain form
1723 232 -39 -211 488 53 84 299 -69 98 249 -378 -104 -131 -508 158 -151 -192 418 -73 79 520 35
1744 35 165 193 -302 65 -131 -427 130 -203 -386 212 -99 -119 360 -99 135 282 -235 154 147 -331 211 -256
1766 -256 -291 249 -212 -32 331 -122 221 141 -232 234 91 -256 224 -132 -143 168 -134 9 350 -204 135
1787 135 216 -209 176 35 -234 124 -167 -305 237 -95 70 471 -66 238 248 -249 173 -221 -518 -67 -339
1808 -339 -227 110 -91 81 524 -17 407 378 58 389 -59 -371 -51 -480 -365 -89 -287 19 242 -153
1828 -153 407 289 -28 171 19 -141 113 -195 -166 243 -327 -13 270 -94 165 141 -195 204 -116 -182 69
1849 69 -202 -29 183 -230 116 254 -28 243 68 -234 273 -150 -141 195 -274 -184 140 -204 122 218 -140 199
1871 199 218 -173 202 -82 -196 71 -327 -148 27 -339 41 260 -123 337 250 -14 258 -13 -172 73 -293
$$ packed form
1723B32k71j72O99m35L1K15l68J67J51o27K74k7l77O66l09m1O10m91J52M41m85
1744C5J30K8m95L67j96k96N57l33j83N98l11k0M79m59K34J47n17L89pm78N42m67
1766b56l5N40m61J80L63m53L43q0l73M66j43l47M80l56j1L11l02J43L41n54L39
1787A35Q1m25L85j41k69L58k91j38N42l32J65M01n37L04J0m97M22l94k97M51k72
1808c39J12L37k01J72M43n41M24k9l20L31m48l12L20m29J15K76j98L06K23l95
1828a53N60j18l17J99j52j60K54l08K9M09n70L14K83l64K59k4l36L99l20o6K51
1849F9k71J73K12m13L46J38k82K71j75l02N07m23RL36m69R0L24l44L26R6l58L39
1871A99J9l91L75k84j14K67l98J79J75l66L80K19l83M60q7k64K72k71j59K45l66
$$ plain form
1892 -293 -221 49 -299 24 65 -121 297 119 51 286 86 98 79 -115 -41 -9 -323 123 112 -152 126 8 -192
1915 -192 223 -234 -105 79 -204 23 217 -214 15 116 -184 357 -13 -68 203 -157 -209 168 -245 -33 93
1936 93 -205 136 137 -137 195 -170 -159 223 -211 -68 289 -307 3 6 -179 71 100 -78 253 -32 -213 188
1958 188 -201 -129 189 -242 20 210 -196 -14 -13 -297 145 -102 -68 377 -98 87 239 -86 84 234 -270
1979 -270 111 68 -275 -14 -267 -244 206 -181 118 291 -225 100 216 -67 393 126 -7 278 -38 -161 116
2000 116 -275 -54 62 -260 180 120 -64 188 16 -133 404 45 -30 369 -120 -49 47 -346 63 112 -197 225
2022 225 -127 -288 203 -243 -64 146 -105 119 371 -118 174 30 -241 2 -109 -236 60 -140 -279 51
2042 51 -209 44 272 19 416 238 -17 138 -143 -272 -11 -237 -186 66 -214 18 107 -222 121 108 22 405
$$ packed form
1892b93P2K70l48L23M1j86M18j78o8K35k00J2j9j94P4L2l14M46j1k64K78j18k00
1915a92M15m57J29J84k83K27J94m31K29J01l00N41l70n5K71l60n2L77m13K12J26
1936I3k98L41Jk74L32l65J1L82m34J43L57n96L10Lj85K50K9j78L31k85j81M01
1958A88l89P2L18m31K62J90m06J82Jk84M42k47L4M45m75J85J52l25J70J50n04
1979b70L81m3l43K61k53K3M50l87K99J73n16L25J16k83M60k67j33K85l16j23K77
2000A16l91K21J16l22M40o0j84K52j72j49N37l59p5L99m89P1R6l93M09M9l09M22
2022B25l52j61M91m46J79K10k51K24K52m89K92j44k71K43j11j27K96k00j39L30
2042E1k60K53K28k53L97j78k55J55k81j29K61k26N1K52k80K32Q9l29L43j3q6L83
$$ plain form
2064 405 87 43 288 -300 -78 53 -298 13 -64 -335 -104 -105 -344 79 14 38 463 75 278 252 -103 86
2086 86 182 -264 130 -154 -208 10 -173 -233 71 -218 78 351 -107 265 138 -176 162 -8 -147 297 -68
2107 -68 -96 154 -309 -63 -55 -298 -31 73 -170 180 -59 -170 185 -32 150 463 14 41 220 -287 -149 -242
2129 -242 -391 80 -72 -97 307 14 162 292 -21 331 298 -49 132 -120 -418 -115 -150 -307 218 -45 46
2150 46 221 -185 36 66 -186 82 152 -59 215 -23 -215 38 -174 -51 208 -121 14 49 -342 69 32 -135
2172 -135 295 -42 -26 398 -236 -186 133 -290 -16 107 -65 224 184 -193 154 -205 -136 189 -245 -36 105
2193 105 -152 80 87 -11 270 126 -125 192 -88 -57 14 -294 -37 101 4 326 242 -102 164 -92 -57 166 -100
2216 -100 -64 151 -390 -65 112 -197 131 230 -65 336 72 -232 220 -401 -134 128 -223 47 208 -147 229
$$ packed form
2064D05l18m4K45n88K22J31l51L11p7k71K31jk39M23o5K4M25l88K03k6l55J89
2086H6R6m46L94k84n4K18j83o0L04k89K96K73m58L72j27l14L38j70j39M44l65
2107f8k8K50m63K46Qk43K67J04k43L50k39j11L55k17J82L13m49K7J79n07J38r3
2129b42j49M71j52k5M04k93J48J30l13L52l3l47J81k52k98L03l5j57N25k63R1
2150D6J75m06K21L0k52K68P0k11K74k38j92K53k12J23K59l29J35L5l91M11l7j67
2172a35M30l37J6M24o34N0L19m23K74J23j72K89m0l77L47l59O9L25m34K09J41
2193A05k57K32Pr8K81j44k51L17k80L1P1l08K57J38r7L22q4l44K66k56L5K23k66
2216a00L6K15n41L25J77l09L28R9k95M01k64l04M52o21K67K62l51K70J61l55L76
$$ plain form
2237 229 65 -212 313 1 -60 275 -213 -42 162 -205 59 -52 -156 219 40 -262 -29 -87 -177 222 16
2258 16 18 315 -116 247 51 -325 90 -2 -237 128 -167 -214 100 -188 -63 200 -158 146 179 -183 123 -34
2280 -34 -94 240 14 -84 267 -149 33 127 -257 -91 -77 -192 50 43 -139 245 -44 -51 216 -104 -31 300 -195
2303 -195 -22 -29 -265 103 -92 -216 76 -146 -22 101 -103 46 271 -122 290 18 -213 62 -204 -368 7
2324 7 -234 -46 285 46 280 306 -114 252 218 -207 208 -124 -271 82 -199 -196 129 -140 188 262 -98 16
2346 16 -19 -253 132 -78 -177 182 -131 77 276 -194 80 247 -21 144 -2 -244 -60 -162 -264 75 -90
2367 -90 -25 319 24 197 211 -112 137 -96 -146 77 -175 -128 68 -269 -99 172 -90 143 173 -138 280 1
2389 1 -213 117 -151 -135 179 -48 -45 118 -210 193 158 -201 239 -12 -87 273 -209 -94 41 -344 -72 73
$$ packed form
2237B29j64k77N25l12o1L35m88J71K04l67K64j11j04L75j79l02K33n8r0L99k06
2258A6KK97m31L63j96l76M15r2k35L65k95m7L14k88J25K63l58L04L3l62L06j57
2280c4o0L34k26r8L51m16J82R4l84J66J4j15K42pj82L84k89pK67l20P3L31m95
2303a95J73pk36L68j95j24K92k22J24J23k04J49K25l93M12k72k31K75k66j64L75
2324Gk41J88L31k39K34K6m20L66l4m25M15l32j47L53k81LL25k69L28P4l60J14
2346A6l5k34L85k10r9L59l13K08J99m70K74J67k68J65j46k42J84j02j02L39j65
2367i0O5L44k95J73J4l23K49k33n0K23k52M7J96l37J70K71k62K33L0l11M18k79
2389Ak14L30k68J6L14k27LJ63l28M03l5l59M40k51p5L60m82J15J35l85K72J45
$$ plain form
2411 73 -249 275 134 -136 226 57 64 262 -111 -79 -88 -310 -18 74 -279 245 137 -31 294 -49 -178 104
2433 104 -186 -103 109 -162 34 139 -103 150 104 -1 125 -142 -70 133 -273 -84 73 -278 97 130 -59
2454 -59 128 7 -110 180 -217 -20 162 -188 -14 131 -196 145 60 -73 152 -48 -78 152 -71 -16 194
2475 194 -222 66 123 -85 18 91 -211 212 -109 -126 108 -6 9 89 -239 -13 57 -199 45 -29 -192 -28
2497 -28 -9 -69 355 -66 39 192 -215 56 31 -172 114 154 -227 159 -93 -53 281 -121 48 102 -193 -25
2519 -25 51 -261 131 -161 -137 196 -50 81 195 -122 54 271 -91 54 217 -111 129 -32 -101 131 1
2540 1 -47 31 -78 181 197 -227 59 -19 -186 205 36 -114 288 -41 -7 67 -256 7 105 -69 131 127 -214 104
2564 104 83 -114 122 -136 -6 221 -209 -22 -30 -233 153 -12 -203 85 -11 -42 220 -51 13 215 -123 87
$$ packed form
2411G3l22N24j41k70L62j69PJ98l73L2rk22K92R2l53N24j08j68L25l43j29K82
2433A04k90Q3K12k71J96J05k42K53m6j05J26k67P2K03m06J89J57l51L75L3j89
2454e9J87j21j17K90l97J97J82l50J74J45l27L41q5j33K25k00l0K30k23N5K10
2475A94m16K88N7k08J03P3l02M23l21j7K34j14J5Q0l28K26P0k56K44p4j63J64
2497b8J9o0M24m21J05J53m07K71k5k03K86M0l81L86k52M0L34m02J69N4k95J68
2519b5P6l12L92k92K4L33k46J31J14l17J76K17l62J45J63l28K40j61o9K32j30
2540Am8P8j09K59J6m24K86p8j67L91j69j50M02l29L4P4l23K63R8j74K00ml41L18
2564A04k1j97K36k58J30K27m30J87qk03L86j65j91K88r6l1K62k71O4K02l38K10
$$ plain form
2586 87 -107 -285 102 -85 -204 61 -157 18 221 -97 -9 106 -101 59 109 -137 113 -69 -285 -29 -143
2607 -143 -84 110 -85 -49 214 -116 72 83 -144 229 24 -2 134 -61 -14 106 -226 -63 96 -117 190 68
2629 68 -103 178 -67 -195 151 -23 -152 217 -132 188 52 -58 196 137 -83 175 -242 -182 -43 -209 -128
2650 -128 118 -48 131 278 85 183 25 -145 98 -165 -265 9 -326 -57 -41 -163 156 121 27 278 40
2671 40 -53 157 -59 -123 145 -166 -41 72 -84 145 -64 -214 148 59 -111 102 -4 -8 215 -111 84 206
2693 206 -242 93 99 -157 -61 -182 -76 101 -112 -28 168 -131 64 54 -241 131 158 -92 242 182 -65 129
2715 129 -153 -93 118 -241 51 30 -216 71 -32 -123 302 88 110 279 -29 134 -3 -205 -89 -133 -360 16
2737 16 3 -131 212 -29 -206 99 -102 116 226 -172 51 -27 -189 -21 -11 -94 237 47 -107 110 -65 -76
$$ packed form
2586H7j94j78L87j87j19K65k18J75K03l18Q8J15k07J60N0k46K50j82k16K56j14
2607a43N9J94j95L6K63l30J88J1k27L73k05k6J36j95M7J20l32J63J59k13L07j22
2629F8j71K81k45j28L46j74j29L69l49L20j36j10K54n9k20K58m17O0J39j66Q1
2650a28K46j66J79J47j93R8j58j70K43k63j00K74l35K69J6j22L19l5r4K51k38
2671D0r3K10k16o4K68l11J25J13j56K29k09j50L62q9j70K13j06mK23l26J95J22
2693B06m48L35Ok56R6j21J06J77k13Q4J96k99J95j0k95L72K7k50L34o0k47J94
2715A29k82O0K11l59K92k1k46K87j03r1M25k14K2J69l08J63j37k02J16m4k27L76
2737A6j3j34L43k41j77L05k01K18J10l98K23p8j62J68J0q3L31j90j54K17j75j1
$$ plain form
2759 -76 -57 -292 77 32 -133 93 89 38 125 -84 25 70 -157 48 32 -191 -8 5 -26 194 56 -30 182 -166
2783 -166 10 21 -217 11 41 -169 131 -74 -150 10 -100 -108 306 -53 52 120 -194 70 75 -101 108 33 -115
2806 -115 200 -102 -179 -61 -180 -48 201 -138 110 143 -178 67 70 -188 258 -31 12 272 -146 -128 103 -154
2828 -154 10 60 -121 181 -49 -156 62 -12 -92 107 -67 162 81 -22 105 75 -30 180 103 -122 15 -114
2850 -114 -129 -51 -208 -24 53 -23 92 174 -67 177 -67 -47 166 -42 118 168 -81 -7 54 -205 142 -6 -136
2873 -136 87 15 -28 -6 -159 51 76 -189 117 107 -82 107 153 -153 114 -49 71 197 -142 -45 128 -250
2895 -250 150 93 -139 233 68 -185 103 -170 -164 76 -56 75 194 -43 122 25 -244 152 30 -79 265
2916 265 31 -51 152 -188 56 122 -234 147 56 -122 80 10 -7 206 -65 -67 162 57 101 24 -111 -56 44
$$ packed form
2759g6J9k35L69m5j65K26mn1Q7k09J09M5k27K05j6k23J83J3l1K20j38q6K12l48
2783a66J76J1k38K28L0k10L00k05p6J60j10qM14l59J05O8l14K64Nj76K09p5j48
2806a15L15l02p7J18j19J32K49l39K48L3l21K45Lk58M46k89M3K60m18J8K31k57
2828a54J64N0j81L02k30j07K18p4q0J99j74K29q1j03J27l0j05K10p7k25J37j29
2850a14j5P8j57J84P7p6J15Q2k41K44k44K0K13k08J60N0k49P4O1k59L47j48j30
2873a36K23p2m3K2j53K10K5k65L06j0j89J89M6l06K67j63J20J26l39R7J73l78
2895b50M00n7k32L72j65k53K88k73OK40j32J31J19k37J65r7k69L96j22j09L44
2916B65k34q2K03l40K44O6l56L81r1j78K02p0j7K13k71kK29j05M4p7j35N5J00
$$ plain form
2939 44 -233 -15 -71 -109 170 -196 -76 83 -72 121 96 -87 133 -44 -92 84 -2 -106 84 -96 -106 129
2961 129 -145 32 12 40 61 5 -92 75 -179 -43 230 -123 34 105 -33 141 42 -144 60 -74 -100 96 -171
2984 -171 -58 112 -198 -65 30 -214 72 62 -198 137 53 -37 120 -65 72 198 -164 55 126 -108 47 84
3006 84 -147 93 78 33 185 -46 -145 150 -178 73 174 -158 30 -105 -202 69 -112 -110 192 -122 -66 159 -256
3029 -256 -37 -14 -106 126 -47 -115 273 -39 -49 125 38 70 173 -126 -60 -80 -171 131 -8 -66 175 -95 -106 211
3053 211 -62 57 -10 -235 21 77 -131 222 -12 -106 227 -14 29 73 -174 -129 79 -219 53 107 -119 237
3075 237 -39 -58 149 -130 -13 69 -194 -124 60 -168 118 -2 -77 279 54 -79 85 -136 -100 125 -117 123
3097 123 201 -149 126 50 -225 175 -90 -39 183 -112 -85 164 -63 146 59 -45 128 59 -70 139 -55 -60 72
$$ packed form
2939D4k77K18n6l8K79l66J20J59j55J93k5j83K20j77m8J76q6j04J90j80j0K35
2961A29k74J77k0K8K1n6r7J67k54J36K73l53J57P1j38J74r9j86K04j34k6J96k67
2984a71J13J70l10J33R5k44K86j0k60L35q4r0J57j85J37J26l62K19P1k34J55L7
3006H4k31K40j5m5J52k31r9K95l28K51J01l32J88j35r7K71j81KL02l14N6K25m15
3029b56K19K3r2K32j73o8L88l12j0J74q7L2J03k99O6k0r1L02j39n8K41k70j1L17
3053B11k73J19o7k25K56N6k08L53k34r4L33k41M3M4k47M5K08k98K72N4k26L56
3075B37k76j9K07k79J17Q2k63P0J84k28K86j20p5L56k25j33J64k21L6K25k42K40
3097A23P8l50K75p6k75M00k65N1K22k95K7K49k27K09q7j04J73o9j29K09j94nJ32
$$ plain form
3120 72 -139 38 54 -154 176 151 -156 228 -56 -119 106 -116 14 90 -164 75 99 -104 158 -2 -121 121
3142 121 13 -84 -9 -146 -67 69 -203 13 226 -102 150 87 -120 191 41 -128 111 -111 -29 227 -201 47
3164 47 182 -79 35 95 -99 58 -84 -67 173 -143 59 269 -159 -79 77 -161 125 -76 -51 164 -182 -50
3186 -50 140 -142 -26 57 -177 -14 95 -237 -63 -115 -154 91 -73 -75 192 -191 32 79 -172 20 54 -289 91
3209 91 41 -120 206 -80 -78 133 -62 -14 105 -91 102 33 -85 95 -35 -93 164 -10 -145 215 15 -63 147
3232 147 -166 106 53 -197 -11 -58 -5 118 -12 26 146 -178 158 27 -205 63 -76 -88 36 28 -171 120
3254 120 -65 48 169 -146 -83 45 -243 119 110 -78 218 34 11 263 -64 -65 70 -155 93 -1 -122 112
3276 112 -126 -95 138 -94 -92 165 -133 12 108 -60 66 36 -29 149 63 -146 193 -151 -90 26 -86 61 38
$$ packed form
3120G2k11J77J6k08L30k5l07L84k84o3K25k22J30P6k54K39K4k03K62j60j19K42
3142A21j08r7P5j37P9J36k72K16K13l28K52o3k07L11j50j69K39k22Q2K56m28K48
3164D7J35k61J14O0j94J57j42J7K40l16K02K10m28Q0J56k38K86k01K5K15l46J32
3186e0J90k82J16Q3k34J63J09l32J74n2l9K45j64kK67l83K23M7k51J92L4l43L80
3209I1n0j61L26k86KK11j95M8J19j96J93o9j18J80j30n8K57j74j35L60k00p8K10
3232A47l13K72n3k50J86m7N3J23j30L8J20l24L36j31k32K68j39j2J24qj99K91
3254A20j85J13J21l15O3J28k88L62rj88K96j84k3K52l27jJ35k25K48r4j21K34
3276A12k38L1K33k32KK57k98J45R6j68J26l0o5J78q6k09L39l44O1J16j12J47k3
$$ plain form
3299 38 -227 33 151 -168 59 -92 -32 227 28 10 128 -203 -42 107 -258 43 49 -83 163 -60 51 132
3321 132 -17 64 99 -219 9 104 -162 81 25 -31 129 -58 -55 234 -195 -57 142 -40 13 16 -88 160 -93
3344 -93 -143 218 79 39 168 -123 41 161 -172 52 5 -154 119 61 -112 208 6 -4 123 -171 18 -53
3366 -53 -182 8 93 -178 80 -37 -168 177 -35 25 157 -56 79 177 -85 65 -8 -93 210 -79 -89 66
3388 66 -257 -90 71 -105 -74 64 -33 199 84 -109 206 82 -92 185 9 81 123 -122 158 100 -181 220
3410 220 -40 -85 65 -37 -72 91 -133 -67 72 -178 28 126 -91 62 -2 -104 119 -38 13 229 8 65
3432 65 34 -67 117 38 -66 121 -28 -175 215 -68 -39 242 -41 28 26 -166 9 -75 -86 16 1 -102 16
3455 16 47 -38 57 -60 144 52 -129 145 15 -36 120 39 -59 179 -84 38 147 -57 35 -62 -146 107 64 -200
$$ packed form
3299C8k65K60J18l19K27j51O0K59j99j8J18l31J61J49l65L01Oj32K46k23J11Q1
3321A32j49Q1L5l18K28R5k66K43n6n6J60j87LK89m29J38J99j82N3Lj04K48k53
3344i3n0L61j39m0J29k91J64J20l33K24m7j59K73n8j73L20k02j0J27k94J89p1
3366e3j29J90Q5k71K58j17j31L45k12O0J32k13J35R8k62J50p3q5L03k89j0J55
3388F6l23J67J61j76L1J38r7K32j15j93L15j24j74K77j76P2M2k45K80n8k81M01
3410B20k60m5J50j02l5J63k24O6J39k50K06R8k17J53o4j02K23j57N1K16k21N7
3432F5l1j01J84p9j04J87j49j47L90k83K9K81k83O9kj92J75q4j1J02j5j03J18
3455A6L1q5R5j17K04r2j81K74j30n1J56q1r8K38k63J22J09k04R2r7q4K53m3k64
$$ plain form
3479 -200 26 -144 -92 73 -118 39 72 -172 55 93 -155 149 2 -200 135 50 -95 162 -67 33 126 -225
3501 -225 38 -4 -155 52 -12 -132 163 4 -32 213 -39 27 48 -93 153 60 -165 76 -40 -154 190 -47
3523 -47 -31 97 -227 -7 64 -218 40 114 -149 163 -15 -53 10 -42 -27 150 -82 -36 173 -58 182 -8 -10 52
3547 52 7 -103 110 6 -11 132 -250 26 112 -100 66 52 21 76 75 -126 16 -52 6 104 -142 129 175 -118
3571 -118 191 26 -141 199 -39 -37 123 -158 110 112 -82 41 85 -106 80 7 -92 160 -123 -54 194 -106 121
3594 121 108 -160 125 24 -50 188 68 -70 178 -71 38 55 -117 -47 11 -119 27 112 -43 153 43 -96
3616 -96 164 -9 63 93 -124 65 -25 -64 177 28 -30 150 44 -54 133 -54 -62 87 -110 -5 118 -40 -26
3639 -26 -53 -36 91 18 -16 93 -89 -64 136 -60 98 176 -124 139 131 -75 52 -103 22 -48 -153 -112 41 -207
$$ packed form
3479b00K26j70N2J65j91J57L3k44K27L8k48L04j47k02L35q5j45K57k29J00R3l51
3501b25K63m2j51K07o4j20K95j59l6K45k52O6K1j41K46r3k25K41j16j14L44k37
3523d7J6J28l24K20P1k82K58P4k63L12j78l8O3n2J5J77k32M6K09k31K40j90kO2
3547E2m5j10K13j04j7J43l82K76Q6k12J66j4l1N5jk01J42o8N8R8k46K71M6k93
3571a18L09j65j67L40k38KJ60k81K68Kj94J23M4j91J86p3r9K52k83O9K48l00K27
3594A21j3k68K85j01p4K38j20j38K48k49J09J7j72P0N8j30J46Q5j55J96j10j39
3616i6K60j73P2L0k17J89r0l9K41j49n8J80j06r8J87j87qJ49j97J05J23j58J4
3639b6k7J7J27p3l4J09j82K5K00j96J58P8l00K63qk06J27j55J25p0j05M1J53k48
$$ plain form
3663 -207 149 -36 -89 118 -19 -105 95 16 33 198 -51 -59 -60 -197 104 -2 -208 86 -6 -56 167 -12 -23 281
3687 281 35 224 200 3 131 -8 -24 179 -126 -181 -32 -134 -62 135 -158 72 61 37 222 25 -75 275
3709 275 -113 -3 32 -72 -63 37 -141 -31 -38 -61 98 -67 31 91 -61 42 71 -19 -32 -30 -107 2 7 -171 88
3734 88 27 -25 128 -197 -68 144 -12 13 34 -151 160 -4 -71 22 96 -107 122 -70 -33 93 -51 103 25
3757 25 -123 -1 55 -119 212 46 -73 100 -35 -4 95 -163 -21 50 -144 32 65 -45 82 -26 -48 -23 -49
3780 -49 123 241 -20 110 158 -134 151 -19 -186 -11 -132 35 122 -8 29 41 -26 104 21 -114 80 28 -87
3803 -87 79 -93 -68 72 -92 114 47 -86 57 -43 -95 65 16 -100 121 -12 -84 173 -125 39 127 -68
3825 -68 10 48 -12 145 3 -64 46 15 8 26 -94 115 171 -89 96 51 -143 129 -100 -104 -71 -43 -159 97 -54
$$ packed form
3663b07L56j85n3K07j37q6K00p9J7J65k49qjj37L01j06k06K94r2n0K23j79j1L04
3687B81k46J89k4j97J28j39j6K03l05n5J49j02P2J97k93K30j1k4J85j97j00L50
3709B75l88J10L5j04RJ00j78J10pk3J59j65R8O0j52J03K9r0j3Kp7J09Nj78K59
3734H8o1n2J53l25J29K12j56K5K1j85L11j64o7R3P4k03K29j92L7J26j44J54p8
3757B5j48J22N6j74L31j66j19J73j35L1R9k58J42P1j94J76L3j10J27j08k2K5k6
3780d9J72J18k61J30M8k92K85j70j67J75j21J67Q7j30L7J2o7J30q3j35J94n2j15
3803h7J66j72K5J40j64K06o7j33J43j00n2J60m9j16K21j33p2K57k98J64Q8j95
3825f8P8L8o0J57j42o7J10l1pJ8j20K09N6k60J85m5j94K72k29mL3K8j16K56j51
$$ plain form
3850 -54 -79 212 -93 12 8 -66 50 -79 -55 87 -27 6 231 -13 141 -4 98 193 5 -79 89 58 -84
3873 -84 38 -16 157 -18 -187 115 62 -89 41 22 -160 110 -73 -62 34 -165 -23 65 -111 114 -14 -79 163
3896 163 -33 50 161 -41 -67 28 -238 -100 10 -114 -57 108 -169 73 34 -23 98 -62 4 -45 -1 67 30 -45
3920 -45 50 71 -52 155 -66 -37 214 -97 -25 83 -148 116 -4 -108 107 69 -109 64 -73 -121 107 -42
3942 -42 51 117 -87 1 67 -96 152 -82 -36 24 -9 48 43 -134 27 33 -225 -10 -56 -86 129 0 -6 175 -23 36
3968 36 103 -172 52 -18 -64 -40 -65 -22 169 94 36 217 -22 205 135 -41 125 50 -124 94 175 -68 -22 -79 -117
3993 -117 113 -31 -36 143 -102 153 46 -152 -94 77 37 61 9 24 33 -99 -113 46 -33 31 97 -88 102 -14
4017 -14 -71 29 -55 -89 137 -119 19 4 -106 40 20 -180 121 -79 4 183 -29 -27 112 -25 -10 82 -137 4
$$ packed form
3850e4k5K91l05J05mp4J16j29K4J42j14L3K25k44J54j45J02R5j88q4J68l1j42
3873h4J22n4J73j75j69L02n3j51J30j9j82K70j83J1R6j99J42Q8j76K25j28o5K42
3896A63j96Q3J11k02k6R5k66J38J10j24N7J65k77K42l9n7J21j60O6m9M4O8l7p5
3920d5R5K1j23K07k21K9K51l11P2J08k31K64j20j04K15l8j78J73j37m8K28j49
3942d2R3O6k04Q8O6j63K48k34M6O0l3N7nj77J61Ok58K15m6l0K15j29oJ81j98N9
3968C6O7k75K24p0m6K4k5M3J91p5n8J81k39K27p0j76J66p5j74K18Q1k43M6n7l8
3993a17K30j44nJ79k45K55j07j98N8J71m0K4n2J5Rj32j4J59p9O4O6j85J90j16
4017a4n7J00q4l4K26k56J38j5j10J46k0k00L01k00Q3J79k12KJ39j37J5R2k19J41
$$ plain form
4041 4 -8 -26 209 80 -37 46 96 -16 -23 -156 5 47 -45 5 30 -38 116 -57 43 68 -109 42 85 -48 147
4066 147 -33 -43 14 73 5 47 24 35 214 -55 68 36 -131 6 5 -51 46 -3 -132 75 -35 42 162 -81 -47
4091 -47 63 -109 -11 115 -81 57 -22 -64 121 -7 53 150 -16 15 -47 -51 2 51 -67 38 -63 -77 131 32 -8
4116 -8 181 41 31 119 -32 -15 -14 -152 9 -191 -127 -45 -31 43 46 -2 10 153 -104 47 19 -97 -9 -233 -158 87
4142 87 52 -39 21 8 40 -2 9 88 -82 -119 30 -62 -92 126 -20 9 123 26 38 132 16 43 -93 -125 106 -5
4168 -5 -58 60 -10 40 98 -12 83 58 -163 145 -36 -154 109 -119 -85 79 -42 100 185 -89 105 -17 -103 20
4192 20 -36 -108 98 -110 -105 83 -21 95 44 -35 64 -10 -137 227 -27 -86 -6 -7 -87 -48 -157 -2 -55 -101 48 2
4218 2 -13 149 24 18 174 -99 65 46 -99 67 47 -47 95 55 0 66 -126 2 93 -68 31 119 -46 60 105
$$ packed form
4041Dj2j8K35j29j17Q3N0j12pj33J61M2r2N0K5o8J54j73J00K5j77J51M3j33J95
4066A47j80j0N7N9o8M2k3J1J79k69J23l2j67J37jn6R7m9j29K07j10P7J20k43L4
4091d7J10j72R8J26j96J38p9m2J85j28O0R7j66L1o2mN3M9j18J05j01j4K08r9m0
4116hJ89j40j0Q8j51J7Jj38J61k00O4Q2J4P4Lm8J2J43k57J51k8j16Q8k24P5K45
4142H7l5r1O0j3L2m2J1P9j70l7J49r2l0K18j46K9J14r7J2R4j16K7j36l2K31j11
4168en3J18p0N0N8j10R5k5k21L08j81j18K63k28L4J64j21J42Q5k74J94j22q6J23
4192B0n6p2K06k08NJ88j04J16n1p9R9p4j27L64k54n9Q0jq0L9j09J55n3m6J49m6
4218Bj5J62j25oJ56k73J64j9j45J66k0r4J42m0n5O6j92J28R1j61R9Q8j65J06M5
$$ plain form
4243 105 -122 104 0 -132 -32 63 -79 113 -64 88 68 -104 -6 57 -67 55 91 -56 117 -54 -26 17
4265 17 -48 50 175 -14 -11 153 -114 7 81 -9 42 -32 -64 16 -60 20 63 -74 -1 -16 -67 49 -115 -53 -7 -117
4291 -117 -66 56 -74 91 79 -94 32 -44 -54 62 -27 -107 102 -209 -147 -8 -75 73 -14 -81 70 44 -85 -39
4315 -39 -9 105 31 -141 -16 175 -37 72 37 -169 139 54 -109 -3 28 25 34 -183 -4 37 -68 67 1 -101
4339 -101 141 -14 -30 113 -25 61 49 -140 -49 -30 -36 -64 -2 13 96 66 -70 23 -54 -9 -1 -110 87 6 -19 77 -35
4366 -35 -52 132 -5 -5 37 -76 -41 -12 -160 -20 39 -99 -2 33 -27 69 -115 6 70 -25 12 10 -55 -28 -28 -97 86
4393 86 -94 -17 84 -25 81 -25 41 70 48 -55 58 22 -189 38 16 -32 120 -31 -26 90 17 127 26 -68
4417 -68 -11 38 -160 20 -127 -44 -80 -31 -25 -30 -33 19 73 -71 30 57 -17 121 65 14 36 -22 -58 40 -9 -11 -34 -35 105
$$ packed form
4243A05k27K26j04j32J00R5j42J92j77J52k0j72R8O3j24J22L6j47J73j71K8M3
4265A7o5R8J25j89LJ64k67J21P4r0N1p4l2Q0p6Q0M3j37P3j5n1J16j64O2M6j10
4291a17N1J22j30J65j2j73J26p6j0J16q9q0K09l11O2J39o7J48q7o7J51k6j29M6
4315c9L0J14p4j72J25J91k12J09l5k06L08q5j63J06L1lRk17J79M1j05J35o6j02
4339a01K42j55j6J43j38Q6j2j89R1J9ok8O2J5Q3l0j36R3p7M5Qj09J97q1k5R6j12
4366c5j7J84j37%M2j13L5K9j48J40N9j38R7L5o0R6j84J21O4r5L7ko5K7%o9J83
4393H6j80P7J01j09J06j06O6K9k2j03J13l6k11K27k2m8J52j51NJ16p3J10j01r4
4417f8N7M9j98J80j47Q3l6M9OnlN2N4j44J01K7p4J38n6n1K2n8l6R8m9kk3jJ40
$$ plain form
4446 105 -17 -98 36 -119 -91 165 -7 3 79 -45 31 -2 -139 54 -18 -106 16 33 -20 76 -45 85 71 -129
4470 -129 118 -62 -41 90 -46 25 91 -51 -63 111 -129 -52 29 -88 79 94 -143 26 -69 -117 46 -28 -58 -13
4494 -13 -85 39 6 -57 39 -8 -42 107 -16 34 76 56 -31 91 -56 24 16 9 26 -57 -4 28 -95 -40 -44 -137 9 -91
4522 -91 -34 90 32 -29 134 67 -141 143 -106 -24 33 -116 -60 -18 -101 55 -35 -98 141 56 -54 112 -127 -75 -104
4547 -104 -98 61 78 -58 10 5 -46 26 -46 19 117 -102 -110 58 -69 21 77 -75 13 12 -23 -25 -23 -74 -39 -76 37 -20 19
4576 19 48 69 -210 5 22 3 38 15 20 -40 -34 137 154 -10 151 71 -35 -17 28 4 54 28 3 61 -7 25 92 98 63
4605 63 -61 -49 -59 -34 2 9 40 57 15 -151 100 75 -45 12 -124 -3 15 -50 18 2 -87 38 41 -58 -42 -1 77 -34
4633 -34 59 -90 55 28 -36 99 3 -42 -21 -49 -22 -128 -4 28 -31 47 38 13 55 22 -64 -39 21 -13 -4 44 34 -11 120
$$ packed form
4446A05j22q1J34j55K8K56j72J0P6j24P6l3j37J93p2q8J22J7n3R6j21J30j4k00
4470a29K47j80K1J31j36P1O6j42j2J74k40P7Q1j17J67J5k37J69r5m8J63p4l0M5
4494a3p2J24l3o3R6m7l4J49j23N0M2k0q7J22j47Q0qpJ7q3N3L2j23N5mr3J46j00
4522i1N7J24n8o1J63o7k08K84k49Q2N7j49N6M2q3J56r0o3K39q5j10J66k39N2k9
4547a04OJ59J7j36O8nn1P2p2O5R8k19qJ68j27R0N6j52Q8jl5kKn1L5l7J13n7L9
4576A9K9K1k79K15J7j9L5k3No0OJ71J7j64J61q0j06J8M5k4N0k6k5N8o8L2O7Ol5
4605F3j24J2j0K5L6PL1J7m2j66K51k5j20N7j36J21J8o5O8j6q9J25Lr9J6M1P8j11
4633c4R3j49J45k7o4J35r6m5K1k8K7j06J24L2n9P8rk5M2l3q6K5O0l4RM8j0m5J31
$$ plain form
4662 120 -51 36 -78 47 18 -99 28 -114 -82 151 112 -138 -21 27 -54 43 -57 104 -6 -16 133 37 -60
4685 -60 51 2 -138 20 -48 9 11 -40 5 -42 0 8 -82 -47 -28 -65 13 84 46 62 59 -29 12 13 -92 97 -20 -110 -22
4714 -22 18 19 85 -13 -50 -42 45 -54 28 -18 70 -58 -17 65 16 -17 46 -25 -35 30 -102 34 -58 4 77 -4 -100 70 -55
4743 -55 -29 4 -101 161 -121 10 21 -3 -70 28 60 23 59 57 -76 6 -88 51 -59 -61 -27 73 19 5 -16 -24 15 38
4771 38 47 120 -71 8 -12 -37 1 -78 28 68 18 -1 44 -3 -73 -11 -74 -94 51 7 44 61 19 -2 4 1 63 -95 24
4800 24 49 -116 183 -91 -78 105 9 -70 29 24 -85 151 -39 -2 134 -13 97 -6 -66 20 38 -33 -3 -72 -72 -6
4826 -6 -109 1 -17 10 79 13 -38 106 31 -16 8 -83 -77 -93 114 72 -29 28 -123 -24 5 90 -73 -11 124 -10 -57
4853 -57 -25 51 8 140 -92 -6 -112 -13 -2 -8 53 12 -85 51 174 -60 -7 -16 -103 38 -6 -1 134 -66 1 53 -33
$$ packed form
4662A20j71Q7j14J25k9j17J27j42L2K33l9k50J17M8q1R7j00J61j10j0J49r6r7
4685f0J11m9j40J58o8N7Kn1M5m7M2Qr0L5J9l7P8P1l8J6lq8M1Jj05J89j17r0Q8
4714b2M0JO6r8l7QQ7r9Q2m6Q8j28M1Q2m9l3O3p1j0O5j32J36r2O2P3q1r6J70j25
4743e5K6L3j05K62k82J31J1k4o7R8L2l7L6kj33Q2r4J39j10kL4J00n4j4k1qL9K3
4771C8RP3j91P9k0k5L8p9J06M0n0j9M5m7p0O2o3k0J45m4L7J7m2k1OlO2j58J19
4800B4K5j65K99k74J3J83r6p9R9nj09K36j90L7J36j47J10j03o0Q6J8p1L0o9%O6
4826fj03J10j8K7O9o6n1J44p5m7K4r1Oj6K07m2j01N7j51R9K9Q5j63O2J35j34m7
4853e7L2P6m3J32k32Q6j06R9J1oO1m1r7J36J23k34N3rq7J41m4NJ35k00O7N2q6
$$ plain form
4880 -33 49 4 37 -2 67 -61 45 31 -50 43 98 15 14 -35 59 72 -44 -11 11 -8 45 -36 -11 181 -36 3 50 4
4908 4 -13 -12 -126 47 -10 -33 57 -16 26 13 -99 171 -72 -98 20 -1 1 2 45 5 -96 -28 -127 -21 -83 75 44 -43
4936 -43 40 43 -37 87 35 28 104 -91 76 -36 89 71 22 -116 31 -91 -99 5 54 108 -41 17 -53 152 117 -28
4962 -28 38 8 -45 -3 -110 34 2 -9 -21 -16 46 78 0 100 58 36 60 -121 -51 63 -44 -45 36 3 25 -13 14 6 -54
4991 -54 115 -8 75 -10 26 85 -73 26 66 63 -81 5 -24 33 99 -43 -41 -34 -38 -97 -77 -73 20 78 72 36 4 -31 50 138 101
5022 101 -59 60 7 -10 66 26 95 39 -21 89 54 -14 -26 -78 -38 30 5 -142 -103 -29 9 79 -112 37 52 26 73
5049 73 89 -15 -10 38 -112 -15 -25 73 33 -3 14 56 -18 -26 -90 -125 29 -35 109 7 -23 64 16 -17 81 -39 -63 -55 -142
5078 -142 16 -35 -8 -13 -68 59 -13 38 27 58 -18 37 22 41 -5 -103 -2 116 19 -45 149 26 -15 106 -55 55
$$ packed form
4880c3Q2m5L3l9O9j28J06j4q1R3N5q3jm9R4J3j16L3K2j9N3q1K5J92k17L9M7m6
4908Dj7Jj14J73n7k3R0p3M2j3j12K70k43k6J18k1KJM3m0j01O8r9J06o2J58l1q7
4936d3Q3Lq0J24n2pP6j95J67j12J25j8m9j38J47j22qJ04M9N4j49N8p0K05l5j45
4962b8O6l0n3M2j07J44l2j1j2NO2L2p8J00m2k2K4j81P0J14j07jQ1l3K2l8K7qo0
4991e4J69j23Q3q5L6N9j58R9M0lj44Q6k9N7O6j42KPmn9K0MR3N8ol6l2l5Q1Q8l7
5022A01j60J19n3j7P6m0O9n6o0J10l5o8j2n2M0O8k5j47L9P4L8P0j91J49J5k6M7
5049G3J6j04NM8j50R7j0R8m0l6J7M2p4qo4l5J54o4J44j02l0Q7m8l3R8j20k4Qq7
5078a42J58n1K7nn5J27p2N1j1L1p6N5j5J9m6r8J01J18r7o4J94j23m1J21j61J10
$$ plain form
5104 55 14 -23 28 126 102 32 67 25 59 69 24 40 16 40 -55 -35 82 -21 -65 12 -31 -86 -2 -57 45 -9 115 0
5132 0 183 -68 76 -14 -52 54 26 33 79 -118 -56 91 71 -41 122 10 -19 112 -37 51 -9 88 -36 -37 -8 -52
5158 -52 -95 54 -26 19 62 40 -4 -11 15 -70 127 50 134 -15 -69 37 115 -85 -7 -6 18 17 65 22 52 -36 56 98 74
5187 74 104 36 12 -79 14 3 71 -35 -78 93 -90 3 -82 -107 12 34 -102 46 95 71 33 -68 -117 -17 100 63
5213 63 -24 -33 3 32 -126 5 129 97 40 27 2 24 -48 -38 53 7 -9 20 3 -49 -47 87 87 -16 60 -93 -17 60 86
5242 86 95 21 51 -33 -69 -65 23 -26 -91 145 0 -68 -135 42 -10 92 4 13 67 -18 40 26 -123 -3 113 -90 57
5269 57 -84 -20 35 58 -16 92 90 -22 -9 -38 20 123 24 -42 32 -12 -49 119 -76 158 -73 -21 66 -104 -85 39
5295 39 7 -11 -20 -146 -59 -39 206 -79 56 56 -26 -36 88 -55 -49 145 -83 38 51 4 -87 122 -8 -50 23 -82
$$ packed form
5104E5m1l7N1R8k4p0L5m2L4J0m5J6k4K4r5K0J17j03m4P7m3n5Q4n5J02n4J24j15
5132@J83k51J44r0l8J06k8PM6j97O2J47k0j12J63j12k9J31j49Q8o0R7j24jK9m4
5158e2m3J49q0M5M3k2m4pK6q5J97p7Q4j49n4J06P8k00P8JK4jM8m3L0q8R2M2k4
5187G4L0o8k4r1R3j1O8j06m3J71j83R3q5k5J19K2j36J48M9k4l8j01m9J00J17l7
5213F3q7rL6K9j58J31J24l2n7j3k5K2p2J0R1m6j6K9j7n2KJ34%j03P6j53P6P7K6
5242H6Rp4L0q4l6MQ8m9o5K36j45o8o7J77n2J02q8RN4q5N8j4j49J20J16k03J47
5269E7j41O4N5K3p4J08kj12J3k9N8J03r9o6P4m4l7J68j95K34k31N2Q7j70J9J24
5295C9l2j8rj26Q7K0K45k85J35%q2j0J24j43OJ94k28J21J3m7r1K09j30m2P3j05
$$ plain form
5321 -82 -10 -47 87 -14 24 36 25 80 20 -52 12 -66 -14 -46 -11 14 -60 -22 56 -31 109 11 -97 57 57 15 62 25
5349 25 74 7 14 -17 -47 109 -39 -19 -46 -31 18 -32 -52 -54 24 87 -62 9 -36 8 27 -14 -76 57 -28 65 -24 -18 -49 -5
5379 -5 -9 74 -140 20 -17 41 -18 32 -18 24 97 -20 82 59 -98 -64 34 -73 -17 -47 48 43 -88 32 -38 -1 8 41
5407 41 65 38 -85 9 4 -25 -120 109 60 -46 42 -31 37 -24 -75 34 -94 -58 59 2 49 -3 -36 10 -53 -113 11
5434 11 -47 90 108 34 -119 87 -167 57 -19 -69 -29 -135 20 68 -30 25 -60 -90 92 56 -25 70 -211 22 113
5459 113 -66 48 12 -9 -100 -74 -204 -107 -2 -85 82 26 -94 143 -4 -74 71 -1 -2 44 -71 -14 93 39 120
5484 120 -118 -11 222 1 -139 60 85 107 13 -14 26 85 -99 -23 -71 -8 -31 22 70 70 49 35 -85 23 -49 -91
5510 -91 125 73 -118 27 58 -47 42 -20 36 95 39 -124 -110 -52 -94 65 -51 34 15 10 126 9 81 -7 43 -82
$$ packed form
5321h2P2l7J34j01L8J2j1N5o0p2O4p8N2l2L5K5p4L8P8q7J40r8j08J54%m2M7l7
5349B5M9o7Pl1l0J56j48K0k7J5M9n0k0kP8O3j49P1m5M4J9m1o2J33q5R3q9Ol1M4
5379emQ3k14J60l7N8n9N0n0M2P3j17J02k3j57L4R8j07N6l0R5nj31J20p0L7RL3
5407D1K4k7j23R4nk9r5K29m9j06Q8p3O8o1n1J09j28L6J17n7M7n2l3M6o3o0J24
5434A1n8J37J8p4j53K06k54K24p6n0M0j06J55M8r8N5q5l0J82l6q1R5k81K33R1
5459A13j79J14l6k1r1K6j30R7J05q3J67n6j20K37j47p0J45p2jM6j15N7J07n4Q1
5484A20k38J07K33k21j40J99K5K2r4k7M0N9j84P6m8O3k3N3M8%k1j4j20J08p2m2
5510i1K16n2j91J45L1j05Q9o2N6N9n6j63J4N8m2J59j16Q5j9nJ16j17P2q8N0j25
$$ plain form
5536 -82 -4 -78 -83 124 38 -172 96 -7 7 -68 -20 117 -39 -83 -36 -25 18 23 -36 -80 125 30 76 165 -39 52 137
5563 137 24 58 -14 -40 31 111 26 45 45 -79 -13 -102 39 8 -8 -75 71 -10 42 -113 4 69 109 -102 -4 -87 86
5590 86 -22 -55 83 -21 -6 88 17 -71 54 107 61 -65 -80 -27 28 -37 -56 -46 23 5 -43 -41 17 -99 -24 98 -51
5617 -51 -30 -15 -44 20 58 -6 51 -21 70 186 -15 -19 10 -31 27 -144 71 34 -59 134 53 -11 74 22 9 64 43 64
5645 64 6 -38 -93 72 -16 103 10 23 79 47 -79 -50 7 -50 -54 34 70 5 -154 -111 0 -123 -20 -15 52 38 54 -118
5673 -118 -24 -80 -99 55 -14 -1 76 -169 -15 -84 -40 -88 -3 28 34 101 -7 97 85 60 21 -56 -34 136 35 11 -27
5700 -27 -15 74 -29 -12 -42 18 -27 -48 -229 44 23 -75 65 -92 -30 54 54 10 -21 -45 -80 11 -107 -13 -14 -6 5 -39 46
5729 46 -26 -5 -162 2 -55 147 57 -1 67 -27 -7 14 -29 -76 -6 24 -48 -24 -93 7 -40 -67 -74 -62 -36 17 -99 -23
$$ packed form
5536h2P8p4nK07q6k10K68j03J4p5M8J37j56m4M7J1M3Nn9m4K05r5M6Q9k04R1Q5
5563A37j13L4p2k6P1Q0q5J9%j24O6q9J41l1j6o7J46q1N2j55J17O5M0k11R8q3J73
5590H6j08l3J38j04J5R4p1q8J25N3m6j26j5N3N5o5j9J0O9j8m8KN8j16P5J22j49
5617e1K1J5k9O4L8o4N7p2R1J16k01mK9m1N8j71K15l7r3J93q1o4Q5n2j3N5k1K1
5645F4n8m4n5J65q8J19r3J3N6l2j26K9N7n7mQ8L6o5j59M3J11j23J03NO7j4J6j72
5673a18R4n6j9J54o9J3P7k45J54o9M4m8Q5L1OO7j08J04j2k5l9p7K2J70j01k4l8
5700b7J2Q9j03J7l0O0m5k1j81K73k1r8J40j57O2Q4%m4l1k4l5R1j18R4jQJ1m4Q5
5729D6p2K1j57J64n7K02r0n8O8r4K0K1m3m7P0L0p2K4o9J00m7k7pJ2K6N3j16P6
$$ plain form
5757 -23 47 41 -20 60 -66 79 16 3 33 -8 -29 18 -43 53 -28 -96 -119 104 -31 -39 -43 -58 -17 24 97 149 -46 13 -73
5786 -73 -14 11 -2 -129 40 -43 -15 42 -68 5 81 -84 11 12 -74 59 64 1 61 69 6 93 9 95 37 -59 12 0 16
5815 16 -71 -55 8 61 -10 -80 46 30 49 1 5 8 -4 -2 -26 -115 -34 -28 11 -20 -18 39 -67 46 -95 55 -2 20 -28 -57
5845 -57 -89 100 34 -39 26 -22 98 80 -15 119 71 -12 105 -85 77 28 -77 -67 159 -29 98 -78 55 -3
5869 -3 36 15 139 25 -36 -18 -86 41 150 -49 34 122 39 -64 49 16 -2 94 -124 -32 37 52 99 -27 19 -76
5895 -76 -55 -37 13 -20 -23 16 -19 -34 -18 136 162 -75 85 11 -44 75 -70 95 137 50 -91 92 -15 -42 -26 -48
5921 -48 -73 111 -13 -6 -14 3 -22 -39 -30 116 -5 17 49 39 58 71 32 45 135 75 144 67 9 64 -61 -20 36 -34 7
5950 7 33 -168 -27 30 -184 23 -99 -16 65 -82 33 20 -49 14 41 -35 -33 123 50 -27 86 -82 66 -17 82 36
$$ packed form
5757b3P0oo1Q0j26J45o3j3L0m1k1M7o1R6q1o8k3K23j35qmj5M1M1P3N2j95N9q6
5786g3N9K5j3j27J69q3K8N7j10P3P6j65R5Jq6J33No3O0Qo3Q7q4Q6n8r6P1j2J6
5815A6q7J6O3N3p1p0J26j6J9m8MLj2Kk4q9Q1OL9l1KN7j06J13j41J50n7K2m8k9
5845e7l2J89o6p3O5m8J20j8r5J34m8q3J17j90J62m9j05J0K26j88J27j76J33n8
5869cL9k1J24j14o1J8o8J27J09j99Q3Q8q3j03J13l3j8R6k18R2O9J5M7j26M6r5
5895g6K1J8N0l3lL9l5j5J6J54K6k37J60p4n5J19j45J65M2q7j41J83j07k7J6k2
5921d8k5J84j24PqJ7k5j7RJ46j21K2L2j0J9J3l9J3R0o0O9p7n8N5j25M1N6p0M1
5950GK6k01J41N7k14K07j22Q3Q1j47J15j3o9O3K7p6KJ56p3p7J13j68J48q3R9m6
$$ plain form
5976 36 58 -12 -25 -16 44 92 -82 91 -28 6 -79 -140 14 -81 -68 124 44 -112 85 -36 -74 27 -121 24 76
6001 76 32 -88 92 -92 29 -101 -18 39 77 61 18 44 55 5 3 17 122 -40 -41 46 49 23 -1 -48 70 -8 -38 46
6029 46 71 -78 -7 66 38 5 -80 -77 -24 -40 169 -76 -24 -26 -55 109 28 47 14 25 35 12 -3 -53 -125 -9 2 10 18 -6
6059 -6 -40 -29 -95 42 -38 13 19 23 -66 -47 -32 43 -83 35 29 22 54 39 -85 -61 -33 22 156 -22 -23 -27 -22 -46 27 -49 115
6090 115 -68 -13 -8 69 32 -77 -124 44 57 -52 104 18 -16 64 38 -62 83 -56 2 60 -58 20 -65 -45 79
6115 79 -18 -43 36 -52 -27 52 -84 -56 -73 -9 48 24 -18 -5 -105 -4 -67 23 26 74 -44 135 75 -37 81 -47 -28
6142 -28 93 -64 -89 19 -21 5 69 -7 41 24 5 24 54 49 110 72 9 -60 -134 23 42 17 8 6 -44 19 -26 -91 -27 40
6172 40 61 5 -39 -7 -3 123 -5 -140 -44 -52 -17 -23 81 -78 -45 8 -52 -14 48 12 107 -3 55 23 -27 -16 75 -55
$$ packed form
5976C6K2p0j3RO0M8j74J73j19L4q5o1J54r5J3J92q0j56J97j21l8J01j48J45N2
6001G6m4j20J80j84J21j30Q3N7L8j6m3K6J1n0kJ4J05j62jQ7Lk6k4m7J18p8l0Q4
6029D6K5j49P1P3k8l3q5LN3j6K09k45N2kk9J64q1J9l3J1J0k3j5n0p2J16J1QQk4
6059fl4J1o6J37q0N1OMq9J9J5P5j26J18opL2j5j24K4K8N5J34j78jmNk4P3p6J64
6090A15j83N5NP7l7j09m7J68J3j09J56q6l4Q0k6j00J45j39N8N8j18P8q5K0J24
6115G9r7k5P9q8K5P9j36K8j7O4N7k4m2J3j00J01o3R0LM8j18J79o0j12J18j28J9
6142b8J21j57k5J08m0K6O4p6M8j7j9J9L0nO1l8o3o9p4J57J9k5rkn0O3m5o5O4O7
6172D0K1n6m4L2MJ26j28j35R6qL5oJ04j59L3N3o0L8O2l6R5j10N8l2n0J1R1j30
$$ [...]
8191G3
##END NTUPLES=NMR FID
##END=
