##TITLE=1H_DE-80H_X3
 200.13MHz, d2o
 8 sc
 
 19ns.26.2.2025
##JCAMPDX= 6.0         $$ Bruker NMR JCAMP-DX V2.0
##DATA TYPE= NMR FID
##DATA CLASS= NTUPLES
##ORIGIN= UXNMR, Bruker Analytische Messtechnik GmbH
##OWNER= pz
$$ XWIN-NMR		Version 3.5
$$ Mon May 12 16:56:27 2025 Russian Standard Time (UT+4h)  Yarkov@DPX200
##.OBSERVE FREQUENCY= 200.1313
##.OBSERVE NUCLEUS= ^1H
##.DELAY= (6, 6)
##.ACQUISITION MODE= SIMULTANEOUS
##.ACQUISITION SCHEME= undefined
##.AVERAGES= 8
##.DIGITISER RES= 18
##SPECTROMETER/DATA SYSTEM= spect
##.PULSE SEQUENCE= zg30
##.SOLVENT NAME= CDCl3
##.SHIFT REFERENCE= (INTERNAL, CDCl3, 0, 14.3821)
##AUDIT TRAIL= $$ (NUMBER, WHEN, WHO, WHERE, WHAT)
$$ ##TITLE= Audit trail, XWIN-NMR		Version 3.5
$$ ##JCAMPDX= 5.01
$$ ##ORIGIN= Bruker BioSpin GmbH
$$ ##OWNER= Yarkov
$$ C:/Bruker/XWIN-NMR/data/yarkov2/nmr/H-C/1/audita.txt
$$ ##AUDIT TRAIL=  $$ (NUMBER, WHEN, WHO, WHERE, WHAT)
(   1,<2025-05-12 16:55:07.40 +0400>,<Yarkov>,<DPX200>,
      <created by zg, POWCHK disabled, PULCHK disabled
       configuration hash MD5:
       00 E9 B6 7A A2 85 ED C7 34 08 36 98 17 FE 4E 26
       data hash MD5: 16K
       C3 8F 92 A4 01 92 14 25 76 16 12 D9 1B 90 01 E3>)
$$ ##END=
$$ 
$$ hash MD5
$$ D1 FE E5 B3 88 E2 1D 55 EF AD 48 67 37 F3 08 16
##$RELAX= 
##$RELAX= 
##$RELAX= 
##$RELAX= 
##$RELAX= 
##$RELAX= 
$$ Bruker specific parameters
$$ --------------------------
##$DU= <C:/Bruker/XWIN-NMR>
##$EXPNO= 1
##$NAME= <H-C>
##$PROCNO= 1
##$TYPE= <nmr>
##$USER= <yarkov2>
##$AMP= (0..31)
100 100 100 100 100 100 100 100 100 100 100 100 100 100 100 100 100 100 
100 100 100 100 100 100 100 100 100 100 100 100 100 100 
##$AQSEQ= 0
##$AQ_mod= 1
##$AUNM= <au_zg>
##$AUTOPOS= <>
##$BF1= 200.13
##$BF2= 200.13
##$BF3= 200.13
##$BF4= 200.13
##$BF5= 200.13
##$BF6= 200.13
##$BF7= 200.13
##$BF8= 200.13
##$BYTORDA= 1
##$CFDGTYP= 0
##$CFRGTYP= 5
##$CHEMSTR= <none>
##$CNST= (0..31)
1 1 145 1 1 1 1 1 1 1 1 1 1 1 1 1 1 1 1 1 1 1 1 1 1 1 1 1 1 1 1 1 
##$CPDPRG= <>
##$CPDPRG1= <>
##$CPDPRG2= <>
##$CPDPRG3= <>
##$CPDPRG4= <mlev>
##$CPDPRG5= <mlev>
##$CPDPRG6= <mlev>
##$CPDPRG7= <mlev>
##$CPDPRG8= <mlev>
##$CPDPRGB= <>
##$CPDPRGT= <>
##$D= (0..31)
0 0.7 0 0 0 0 0 0 0 0 0 0.03 0 0 0 0 0 0 0 0 0 0 0 0 0 0 0 0 0 0 0 0 
##$DATE= 1747054506
##$DBL= (0..7)
120 120 120 120 120 120 120 120 
##$DBP= (0..7)
150 150 150 150 150 150 150 150 
##$DBP07= 0
##$DBPNAM0= <>
##$DBPNAM1= <>
##$DBPNAM2= <>
##$DBPNAM3= <>
##$DBPNAM4= <>
##$DBPNAM5= <>
##$DBPNAM6= <>
##$DBPNAM7= <>
##$DBPOAL= (0..7)
0.5 0.5 0.5 0.5 0.5 0.5 0.5 0.5 
##$DBPOFFS= (0..7)
0 0 0 0 0 0 0 0 
##$DE= 6
##$DECBNUC= <off>
##$DECIM= 32
##$DECNUC= <off>
##$DECSTAT= 4
##$DIGMOD= 1
##$DIGTYP= 9
##$DL= (0..7)
0 120 120 120 120 120 120 120 
##$DP= (0..7)
150 150 150 150 150 150 150 150 
##$DP07= 0
##$DPNAME0= <>
##$DPNAME1= <>
##$DPNAME2= <>
##$DPNAME3= <>
##$DPNAME4= <>
##$DPNAME5= <>
##$DPNAME6= <>
##$DPNAME7= <>
##$DPOAL= (0..7)
0.5 0.5 0.5 0.5 0.5 0.5 0.5 0.5 
##$DPOFFS= (0..7)
0 0 0 0 0 0 0 0 
##$DQDMODE= 0
##$DR= 18
##$DS= 0
$$ [...]
##$SUBNAM2= <"">
##$SUBNAM3= <"">
##$SUBNAM4= <"">
##$SUBNAM5= <"">
##$SUBNAM6= <"">
##$SUBNAM7= <"">
##$SUBNAM8= <"">
##$SUBNAM9= <"">
##$SW= 18.0517328524113
##$SWIBOX= (0..15)
0 0 2 0 0 0 0 0 0 0 0 0 0 0 0 0 
##$SW_h= 3612.71676300578
##$TD= 16384
##$TD0= 1
##$TE= 0
##$TE2= 300
##$TE3= 300
##$TEG= 300
##$TL= (0..7)
0 120 120 120 120 120 120 120 
##$TP= (0..7)
150 150 150 150 150 150 150 150 
##$TP07= 0
##$TPNAME0= <>
##$TPNAME1= <>
##$TPNAME2= <>
##$TPNAME3= <>
##$TPNAME4= <>
##$TPNAME5= <>
##$TPNAME6= <>
##$TPNAME7= <>
##$TPOAL= (0..7)
0.5 0.5 0.5 0.5 0.5 0.5 0.5 0.5 
##$TPOFFS= (0..7)
0 0 0 0 0 0 0 0 
##$TUNHIN= 0
##$TUNHOUT= 0
##$TUNXOUT= 0
##$USERA1= <user>
##$USERA2= <user>
##$USERA3= <user>
##$USERA4= <user>
##$USERA5= <user>
##$V9= 5
##$VALIST= <valist>
##$VCLIST= <CCCCCCCCCCCCCCC>
##$VD= 0
##$VDLIST= <DDDDDDDDDDDDDDD>
##$VPLIST= <PPPPPPPPPPPPPPP>
##$VTLIST= <TTTTTTTTTTTTTTT>
##$WBST= 1024
##$WBSW= 4
##$XGAIN= (0..3)
0 0 0 0 
##$XL= 0
##$YL= 0
##$YMAX_a= 861252
##$YMIN_a= -988934
##$ZGOPTNS= <>
##$ZL1= 120
##$ZL2= 120
##$ZL3= 120
##$ZL4= 120
##$ABSF1= 10
##$ABSF2= 0
##$ABSG= 5
##$ABSL= 3
##$ALPHA= 0
##$AQORDER= 0
##$ASSFAC= 0
##$ASSFACI= 0
##$ASSFACX= 0
##$ASSWID= 0
##$AUNMP= <proc_1d>
##$AZFE= 0.1
##$AZFW= 0.1
##$BCFW= 1
##$BC_mod= 2
##$BYTORDP= 1
##$COROFFS= 0
##$CY= 83.5205535888672
##$DATMOD= 1
##$DC= 2
##$DFILT= <>
##$DTYPP= 0
##$F1P= 10.8118882576601
##$F2P= -7.23987719738617
##$FCOR= 0.5
##$FTSIZE= 0
##$FT_mod= 4
##$GAMMA= 1
##$GB= 0.15
##$INTBC= 1
##$INTSCL= 1
##$ISEN= 128
##$LB= 0.25
##$LEV0= 0
##$LPBIN= 0
##$MAXI= 10000
##$MC2= 0
##$MEAN= 0
##$ME_mod= 0
##$MI= 1.114404
##$NCOEF= 0
##$NC_proc= 0
##$NLEV= 6
##$NOISF1= 3.799351
##$NOISF2= 2.8
##$NSP= 1
##$NTH_PI= 0
##$NZP= 0
##$OFFSET= 14.38212
##$PC= 1
##$PHC0= -1339.786
##$PHC1= 1.533751
##$PH_mod= 1
##$PKNL= yes
##$PPARMOD= 0
##$PSCAL= 0
##$PSIGN= 0
##$REVERSE= no
##$SF= 200.129724274929
##$SI= 16384
##$SIGF1= 3
##$SIGF2= 2
##$SINO= 400
##$SIOLD= 16384
##$SREGLST= <1H.CDCl3>
##$SSB= 0
##$STSI= 0
##$STSR= 0
##$SW_p= 3205.1282051282
##$SYMM= 0
##$S_DEV= 0
##$TDeff= 0
##$TDoff= 0
##$TI= <>
##$TILT= no
##$TM1= 0
##$TM2= 0
##$TOPLEV= 0
##$USERP1= <user>
##$USERP2= <user>
##$USERP3= <user>
##$USERP4= <user>
##$USERP5= <user>
##$WDW= 1
##$XDIM= 8192
##$YMAX_p= 0
##$YMIN_p= 0
$$ End of Bruker specific parameters
$$ ---------------------------------
##NTUPLES= NMR FID
##VAR_NAME=  TIME,          FID/REAL,        FID/IMAG
##SYMBOL=    X,             R,               I
##VAR_TYPE=  INDEPENDENT,   DEPENDENT,       DEPENDENT
##VAR_FORM=  AFFN,          ASDF,            ASDF
##VAR_DIM=   8192,          8192,            8192
##UNITS=     SECONDS,       ARBITRARY UNITS, ARBITRARY UNITS
##FACTOR=    0.0002768,     1,               1
##FIRST=     0,             0,               0
##LAST=      2.2672688,     0,               0
##MIN=       0,             -988934,         0
##MAX=       2.2672688,     861252,          0
$$ Real data points
##PAGE= N=1
##DATA TABLE= (X++(R..R)), XYDATA
0@%%%%%%%%%%%%%qJ6j6J6j8K6l2L6m4N5o8Q1r6J12j32J55j78K06k40K77l14L55
$$ 0 0 0 0 0 0 0 0 0 0 0 0 0 0 -8 8 -8 8 -10 16 -16 20 -24 31 -37 44 -52 60 -72 83 -95 111 -129 148 -166 189
35A89m05M61n22N85o54P34q21R14j015J128j252J387j534J693j865K056k266K492
$$ 189 -216 245 -277 308 -346 388 -433 481 -534 594 -658 729 -805 888 -977 1079 -1187 1305
53A305k741L016l319L658m033M448m916N448o052O736p509Q363r233R866r217
$$ 1305 -1436 1580 -1739 1919 -2114 2334 -2582 2866 -3186 3550 -3959 4404 -4829 5037 -4180
68d180J808P7725P85899j036333o18944J366699j32216j133441O05946P66385
$$ -4180 -2372 75353 861252 -175081 -794025 572674 440458 -692983 -87037 679348
78F79348q19761k68659O97612j52890m48169M17741J19232m44180J04856L51035
$$ 679348 -140413 -409072 288540 135650 -312519 105222 224454 -219726 -114870 236165
88B36165j98155k31831J95162J55421k68246q5486L80564n3239m42445L01538
$$ 236165 38010 -193821 1341 156762 -111484 -196970 183594 130355 -312090 -10552
98a0552L84970n16457j85711O22477j01268n54531L83607K99260n57967J19570
$$ -10552 374418 -142039 -327750 294727 193459 -361072 22535 321795 -236172 -116602
108a16602N31936n18194k50630O97820j97315n83187N53364K09710o89759K23750
$$ -116602 415334 -102860 -353490 344330 147015 -436172 117192 326902 -362857 -139107
118a39107N92114n38174l33342O55236J3255n75447K42425L35873l41984m4772
$$ -139107 453007 -85167 -418509 236727 249982 -325465 -83040 252833 -89151 -133923
128a33923K92538j19426j45336J37923M3936q2545m1891M0763O0519m9483k4936
$$ -133923 158615 39189 -106147 31776 75712 -6833 -48724 -7961 52558 3075 -21861
139b1861P5039n9251o7416J49138j042k36975R4517K50567k19602j42149L25923
$$ -21861 53178 -6073 -73489 75649 74607 -162368 -67851 182716 -36886 -179035 146888
150A46888p1269k99421L07813J11750m27711J43415L48711l29960j15441L81282
$$ 146888 75619 -223802 84011 195761 -231950 -88535 260176 -69784 -185225 196057
160A96057j37228k74885L38876O9385m31621J56344L58100l32410j49279L73856
$$ 196057 58829 -216056 122820 192205 -239416 -83072 275028 -57382 -206661 167195
170A67195q6735k62903K34383Q8802k59226K7087J94914p4946j29036Q4355Q8950
$$ 167195 80460 -182443 51940 140742 -118484 -91397 103517 28571 -100465 -16110 72840
181G2840p4463m6189O6914N413p0328K8768R4126p9095j13356J64668Q5976k19239
$$ 72840 -1623 -47812 19102 24515 -45813 -17045 77081 -2014 -115370 49298 135274 -83965
193h3965L2536J83673j82883n7108K52712j09912k14908K27286J00567k59336
$$ -83965 -51429 132244 -50639 -107747 144965 35053 -179855 47431 147998 -111338
203a11338M0946K09052j73418r7321K36863o5975k01637K07824Q7434k34763N0451
$$ -111338 -70392 138660 -34758 -132079 104784 38809 -162828 44996 132430 -102333 -51882
214e1882J57184j23107l5644J20794n8738q8508J04761N8839j05990j9811P7240
$$ -51882 105302 -17805 -53449 67345 8607 -79901 24860 83699 -22291 -42102 35138
225C5138k1971l3673L1043j1717k4194J3142K6490J1998n8762q260R6190l7726
$$ 35138 13167 -20506 10537 -1180 -25374 -12232 14258 26256 -32506 -40766 55424 17698
237A7698q9036Q4243K6618r0702N4880O4279j06548j5597J32986l8082j24972
$$ 17698 -71338 12905 39523 -51179 3701 67980 -38568 -54165 78821 40739 -84233
248h4233R0884N9623j23874M5062R7235j32806j5819J50715o3970j03680R1745
$$ -84233 6651 66274 -57600 -12538 84697 -48109 -63928 86787 22817 -80863 10882
259A0882L0127q1945K9577N9237p1563k4283R9187j7835q9441M9301M0333m7312
$$ 10882 41009 -40936 -11359 47878 -23685 -47968 51219 33384 -56057 -6756 33577 -13735
271a3735P725J8195k1648L162J8590Q574k4719k7760M0492K2026m5988j233K8706
$$ -13735 -6010 12185 -9463 -6301 12289 20863 -3856 -31616 8876 30902 -15086 -16319 12387
284A2387j2862l732K4248j2887m2914K9771N2469o0812l2228P6481j7231m8976
$$ 12387 -475 -4207 20041 7154 -35760 -5989 46480 -14332 -46560 29921 12690 -36286
296c6286O2059n272o9027M7210M8155n8969k5428N4244M873l9204K7335J1674
$$ -36286 25773 20501 -48526 -1316 46839 -12130 -37558 16686 21559 -17645 9690 21364
308B1364n3465L0108M7344o1111j5613N1655j3003j7832J8012o428j6020J0300
$$ 21364 -32101 -1993 45351 -15760 -31373 20282 7279 -10553 7459 1031 -14989 -4689
320d689K2868j4300l3062K2883K7857j9861r367M228L726P940n502N44m545j5913
$$ -4689 18179 3879 -29183 -6300 21557 1696 -7671 -3443 283 8223 2721 3265 -1280 -17193
334a7193K9347J2245m3109P720K7629j9405R69J1818k1608n860K9687P285l7892
$$ -17193 12154 24399 -18710 -10990 16639 -2766 -1797 10021 -11587 -17447 12240 19525 -18367
347a8367k197M1878j4824k2370K9140j5048j9816M0106k365l4466J2088J5309
$$ -18367 -20564 21314 6490 -15880 13260 -1788 -21604 18502 16137 -18329 -6241 9068
359I068l205l529n041l300O89J4162J305k4438O422J7392q518L562n870j3759
$$ 9068 5863 2334 -2707 -6007 -5318 8844 10149 -14289 -7867 9525 1007 4569 -1301 -15060
373a5060K2121L639j7065P438n194j543K1216j0231j9839R424J2903j750j0925
$$ -15060 7061 10700 -6365 1073 -4121 -5664 15552 5321 -14518 -5094 7809 6059 -4866
386d866Q64L008m985J6451L58l0532J4657K0945j8765L336K195j5489J7827R601
$$ -4866 -4002 -994 -5979 10472 10830 -19702 -5045 15900 -2865 471 2666 -12823 5004 14605
400A4605j9610k043P385K360R28k709n023n288J3799R068k4314J501J8576j3110
$$ 14605 -5005 -7048 337 2697 3625 916 -4107 -9395 4404 13472 -10842 -9341 9235 -3875
414c875O644P809k7975J1430K6215k0440p939J0959n026J889R813o405j6007P693
$$ -3875 2769 10578 -17397 -5967 20248 -192 -8131 2828 -2198 -309 9504 3099 -12908 -5215
428e215J9714j4177j0451J5185j0330J308K0490k3563r555K8099n677j0297O792
$$ -5215 14499 322 -10129 5056 -5274 -3966 16524 -7039 -16594 11505 5828 -4469 2323
441B323p334K960J1461n872p582m48M660K772J620j748j6070Q863K4498k5603
$$ 2323 -5011 -2051 9410 3538 -4044 -4492 168 2940 4560 2812 -13258 -4395 20103 -5500
455e500j2616L1875j2632j3187K6843j5397j9305L0600M988k5504L244J2462q123
$$ -5500 -18116 13759 1127 -12060 14783 -614 -19919 10681 15669 -9835 -6591 5871 -2252
468b252J707J5790j9527j8223L4281L120l0123J7130M278k0739K0391M230k2904
$$ -2252 -545 15245 -4282 -22505 11776 14896 -15227 1903 6181 -14558 5833 10063 -12841
481a2841J2506R262j2698K100K910l896N625O076j1609j0192J7277M680j3692
$$ -12841 -335 8927 -3771 -1671 1239 -2657 2968 9044 -2565 -12757 4520 9200 -4492
494d492J0011p858j7607L3107M782l7516J5624J4319k2728J5178J3798k8009m04
$$ -4492 5519 -2339 -19946 13161 17943 -19573 -3949 10370 -12358 2820 16618 -11391 -11795
507a1795K5671r357j6989J8695K811k2972J8681J0664l5919J6905K9883l8134
$$ -11795 13876 4519 -12470 6225 9036 -13936 4745 15409 -20510 -3605 26278 -11856
519a1856m128L1467j8705m634K2276j8330j3588K4455O481j8862J018Q167j1260
$$ -11856 -15984 15483 -3222 -7856 14420 -3910 -17498 6957 13438 -5424 -4406 3761 -7499
532g499Q744J7180k5120p321K4764j0776l907J4954j9720L31K2643j9117n591
$$ -7499 1245 18425 -6695 -14016 10748 -28 -3935 11019 -8701 -8370 14273 -4844 -10435
545a0435K2209j2336j0372J9324m999j8663K1360J4550l5617j27L6043k2910j1318
$$ -10435 11774 -562 -10934 8390 3391 -15272 6088 20638 -14979 -15106 20937 -1973 -13291
558a3291L7955k7113k9520M9304K912m1112J8982J4911k5697P257K1794j9525
$$ -13291 24664 -2449 -31969 17335 20247 -20865 -1883 13028 -12669 -5412 16382 -3143
570c143j2113K5616k342k2570J7640O061j8343J5309P91k1599J7484P496j5895
$$ -3143 -15256 10360 8018 -14552 3088 9149 -9194 6115 6906 -14693 2791 10287 -5608
583e608R858m429j3873K1493M786k4173O465J6210j5306m871K2152j0727j9164
$$ -5608 4250 -179 -14052 7441 12227 -11946 -5481 10729 -4577 -9448 12704 1977 -17187
596a7187K9696K95l5554K4591J7225l2685J4946J5169l6245J0788L4099k5616
$$ -17187 12509 12804 -22750 1841 19066 -13619 1327 16496 -19749 -8961 25138 -478
608d78j7457K5421k987j9029K1281Q759l2788Q939K7300k5671l467K6771j9350
$$ -478 -17935 7486 4499 -14530 6751 15510 -17278 -8339 18961 -6710 -10177 16594 -2756
621b756p739K1980j3536p109J9951n930j2145N528P32J49P903l808j4248O718
$$ -2756 -10495 11485 -2051 -9160 10791 4861 -7284 -1756 -1024 -875 7028 3220 -11028 -4310
635d310J2855j1456K516R893k2624N419K8236k3575j0138K7417j5772j1875K8309
$$ -4310 8545 -2911 -395 9498 -13126 -7707 20529 -3046 -13184 14233 -1539 -13414 14895
648A4895r110k3349K2455R377k8290N759K6890k1538j3629L0759j2192k2850L5046
$$ 14895 5785 -17564 4891 14268 -14022 -8263 18627 -2911 -16540 14219 2027 -20823 14223
661A4223N68l5860J8591J6099j9412N692R339j5385k427J5421J248j1633k19L658
$$ 14223 14791 -21069 -2478 13621 -5791 -99 9240 -6145 -8572 6849 8097 -3536 -3755 -97
675i7k277O510j959r254J0496k023j1136J6895j756j6959J7825J554k1539J3990
$$ -97 -2374 4136 2177 -7077 3419 1396 -9740 7155 5399 -11560 6265 7819 -13720 270
689B70J2007j6294J103R979j2903k833K2760o576k5629J8586J2321k5958J2973
$$ 270 12277 -4017 -2914 7065 -5838 -8671 14089 7513 -18116 470 12791 -13167 -194
702a94J7277l1078L086K8428j8500j0970K0466m055j3233J0823N570j4134L305
$$ -194 17083 -13995 -10909 17519 -981 -11951 8515 4460 -8773 2050 7620 -6514 -3209
715c209J4884j3479q916J6761l246p336R334o645m095R833l845l5K679r211N877
$$ -3209 11675 -1804 -10720 6041 2795 -4541 4793 -1852 -5947 3886 41 6 2685 -6526 -649
730f49R053j1218k431J0347j864p982N898M604j2891M447J5803j8158p036K3036
$$ -649 8404 -2814 -5245 5102 3238 -4744 1154 5758 -7133 -2686 13117 -5041 -12077 10959
744A0959r939j1120K0075q849j5980K0876M945k0559M307J5945j1241q982J7991
$$ 10959 1020 -10100 9975 1126 -14854 6022 10967 -9592 -5285 10660 -581 -9563 8428
757H428k136j9159J5720R152k1242M747J3056j0215m59M199n053J827K892m58
$$ 8428 6292 -12867 2853 12005 -9237 -4490 8566 -1649 -2108 2091 -2962 -1135 1757 1299
771A299k153l419M786L733m981q61J633R39j420m69O350p018p567J7722j648j9890
$$ 1299 -854 -4273 513 4246 -735 -1596 37 976 -444 -913 5437 -1581 -9148 8574 6926 -12964
787a2964J4055R045j7991M500J1466j1850k850J3338k738j3295R447R879j6065
$$ -12964 1091 10136 -7855 -3355 8111 -3739 -6589 6749 4011 -9284 163 10042 -6023
800f023J879J4921j6405k981K1208j0418j3641J4065L452r109M11M879k062m716
$$ -6023 -4144 10777 -5628 -8609 12599 2181 -11460 2605 6057 -3052 -2641 2238 176 -4540
814d540O125K962q631K267N632l941L37n32q60L880l200L00K862p457N220P307
$$ -4540 1585 4547 -4084 -1817 3815 -126 211 -321 -1181 2699 -501 -201 2661 -4796 424 7731
830G731j3033j07J1627o824n082Q729J89r642M289J1817j1095q787J7359k019
$$ 7731 -5302 -5409 6218 -606 -5688 3041 3230 -6412 -2123 9694 -1401 -10188 7171 5152
844E152j4386J3287J814j4061J0170O452j3037J07R439l093p315N776M237j0307
$$ 5152 -9234 4053 5867 -8194 1976 8428 -4609 -4502 4937 1844 -5471 305 4542 -5765
858e765L162J0866j0961m194J1414k576m512K080m2K304j386j202M309m703j675
$$ -5765 -2603 8263 -2698 -6892 4522 1946 -2566 -486 -528 1776 390 -812 3497 -1206 -2881
873b881P423l764m616M226J211k321r2L135k675n257R805J298j5494Q710J1292
$$ -2881 4542 778 -3838 388 1599 -722 -814 2321 -354 -5611 4194 5492 -10002 -1292 10000
888A0000j5392P51J3090r538n229J1068m87j0214L160R281p166m424J0426n213
$$ 10000 -5392 -4641 8449 -1089 -6318 4750 4263 -5951 -2791 6490 -676 -5100 5326 113
902A13o448J2712l508j1424R884L881p752P33L721k53l351Q31M807m861m010O888
$$ 113 -6335 6377 2869 -8555 1329 5210 -2542 -1809 1912 1659 -1692 -861 3946 -915 -4925 1963
918A963N98m206n34K025L191m061j740N891n109j392R240p257m043J1778l897
$$ 1963 2561 -1645 -2179 -154 3037 -1024 -2764 3127 -1982 -3374 5866 -1391 -5434 6344 2447
933B447p928Q379J493r014K405R231o938r148J2579L880j4550N774O936j1513
$$ 2447 -5481 2898 4391 -4623 -2218 7013 75 -9073 3506 7386 -7164 -1390 5546 -5967
947e967M080P493r211L5P049l004k492L606J090m932J96O611m375m403P594n83
$$ -5967 -1887 5606 -3605 -3570 3479 475 -2017 1589 2679 -2253 -2057 4554 179 -4224 3370 2787
963B787m628J207k30L116n92o366M735J643o145O030K677q151J813M997k903j578
$$ 2787 -1841 -634 -864 2252 1660 -4706 29 1672 -4473 1557 4234 -3917 -2104 2893 -10 -1588
979a588L024p49m994N882N041j1439J975J1626j1354m090J3285n943o727R405
$$ -1588 1436 687 -4307 1575 6616 -4823 -2848 8778 -2576 -6666 6619 676 -6051 3354
993C354q75o961M215M617n013k752N645k368m224Q426j187r149P455L288p216
$$ 3354 2479 -4482 -267 4350 -663 -3415 2230 -138 -4362 4064 2877 -6272 1183 4471 -2745
1008b745K207J170j761K059j938O78K617l936P97M307l201l124K451L333l105
$$ -2745 -538 632 -1129 930 -1008 -330 2287 -1649 -852 3455 254 -2870 -419 2914 -191
1023a91k721O010k353m471Q215l297p971J0361l04j0647Q028M123r145K231P327
$$ -191 -2912 3098 745 -3726 4489 1192 -6779 3582 3278 -7369 659 4782 -4363 -2132 5195
1038E195n634n379Q358K446r923L450O815q417K586O993r490l8P889n347j892
$$ 5195 -439 -5818 2540 4986 -4937 -1487 5328 -3089 -503 6490 -3000 -3038 4851 -496 -2388
1053b388L717j833q35J361J372j072k564J343J445n04j67j887K983J726o420M046
$$ -2388 1329 -504 -1339 22 1394 322 -2242 -899 546 42 -125 -2012 971 2697 -3723 323
1069C23N349q749J427O100p533J155P417n851l405N378o73l692M675K085r642
$$ 323 5672 -3077 -1650 4450 -3083 -1928 5489 -362 -3767 1611 938 -2754 1921 4006 -5636
1084e636O44J1809o306n729J0416m674p411J0385M91p343L698Q75l602J779L276
$$ -5636 -4992 6817 511 -5218 5198 524 -6887 3498 3989 -3354 344 1219 -2383 -604 2672
1099B672j299k640J471p46k596N439Q31o095K586J89k283O458j522n878L900j038
$$ 2672 1373 -1267 204 -542 -3138 2301 3132 -2963 -377 -188 -2471 3987 2465 -3413 487 -551
1115e51j650N771j889m889K791J676k326O16L387l394m307O850j64p003Q376J672
$$ -551 -2201 3570 1681 -3208 -417 1259 -1067 -451 2936 -458 -4765 2085 1921 -5082 3294 4966
1131D966j1430N694O347q310J644N437o053j927O281N25n602J510L472n247J207
$$ 4966 -6464 -770 5577 -2733 -1089 4348 -1705 -3632 2649 3174 -2428 -918 2554 -2693 -1486
1146a486N685o464j085O866m165j450M640l135n81K780k220M71Q71j104J026L
$$ -1486 4199 -2265 -3350 3516 -649 -2099 2541 -594 -1175 1605 -615 -144 727 -377 649 652
1162F52q26l03J073P94l454J108L848n205R04N546p189Q1Q326o248l455P479k093
$$ 652 -174 -477 596 1390 -2064 -956 2892 -2313 -1409 4137 -3052 -2971 5355 -893 -4348 3131 1038
1179A038m556M760K066n628j5O708l776n322P335o11o439O533K64o641M786K296
$$ 1038 -3518 1242 3308 -2320 -2335 4373 597 -4725 2610 1999 -4440 2093 2357 -4284 502 2798
1195B798m504J215J280j438K04Q18Q41j562k56J613j576O16R76k041J926q03l290
$$ 2798 -1706 -491 789 -649 -445 373 1214 -348 -604 1009 -567 49 1025 -1016 910 107 -3183
1212c183N114j0m589M259j056m654N701J684n325O63K847j743j314M330l32o717
$$ -3183 1931 1921 -2668 1591 535 -4119 1582 3266 -2059 -1396 1451 -292 -1606 2724 2392 -4325
1228d325L940M467p141K132N612p265m07N943l470j178L631j569k757J494K872
$$ -4325 -385 4082 -3059 -927 4685 -2580 -2987 2956 -514 -1692 1939 370 -2387 -893 1979
1243A979j321j623K412j996j850M843q62l100K079j387J59K626k638K88J778l466
$$ 1979 658 -965 1447 -549 -2399 2444 1582 -1518 561 -826 -667 1959 -679 -391 1387 -2079
1259b079J520K497k725j95J885o66j531J006K776k888j492M301l025j899O249
$$ -2079 -559 1938 -787 -982 903 237 -1294 -288 2488 -400 -1892 2409 -616 -2515 3734
1274C734l198m425N875n55l916L253Q79l570L04L394p69l652K922J687m143K314
$$ 3734 536 -3889 1986 1431 -2485 768 1647 -1923 -1619 1775 1006 -2646 276 1963 -2180 134
1290A34K080m253J931K203l489J337J110j671R47k02o05P68p53N50K94j286P18
$$ 134 2214 -2039 -108 2095 -1394 -57 1053 -618 329 127 -478 290 -463 87 381 -905 -187
1307a87J38O67K1k411K438R70l675K857J245m636K882K109m186J030K474k129
$$ -187 -49 618 639 -1772 666 1636 -2039 818 2063 -2573 309 2418 -1768 -738 1736 -393
1323c93q55J692L46k581J178L285m056p52M906k989j790M242k160j850L260r58
$$ -393 -1248 444 790 -1791 -613 2672 -1384 -2136 2770 -219 -2009 2233 73 -1777 1483 525
1339E25j233Q32q8L5m39M47L27j544J410M74k148J656j1j117J888j454o33K894
$$ 525 -708 124 36 71 -368 79 406 -1138 272 746 -1402 254 243 -874 1014 -440 -1073 1821
1357A821j920p14K501k174m24K334j055j227N08J055p04j264K100n08k507L362
$$ 1821 -99 -813 1688 -486 -910 1424 369 -858 -350 705 1 -1263 837 329 -2178 1184
1373A184p4l733L431P60l367K282P69k373J219J023r53q81P36J160j947K90J876
$$ 1184 1110 -2623 808 1568 -1799 483 1252 -1121 98 1121 168 -713 23 1183 -764 -474 1402
1390A402k560L33K512k688K00J821j910Q16P22j688J282L20q61O95m63M0M39m13
$$ 1402 -1158 -825 1687 -1001 -801 1020 -890 -74 648 -1040 242 562 -299 396 -67 -27 412 -1
1408aN47r53M9J490j877K43J815k683P94K476l141K75K553k102q5J286n61o21
$$ -1 546 -407 -358 1132 -745 -502 1313 -1370 -576 1900 -1241 -966 1587 -515 -600 686 125 -496
1426d96N63J099j477p73K679j570j649L234j500k011L230p71k242K055N9j010
$$ -496 67 1166 -311 -1084 1595 25 -1624 1610 110 -1901 1329 558 -1684 371 430 -580
1442e80M72J4K11k55K77O47j464P22R14j700J168J30j672J752k83j288J703j007
$$ -580 -108 -94 117 -138 139 786 -678 44 958 -742 426 556 -1116 636 353 -935 768 -239
1460b39r20K239j161j128J761j72r25L51Q10m36j065J881J96l014K278J270l607
$$ -239 -1159 1080 -81 -1209 552 380 -545 -194 616 180 -885 996 1192 -1822 456 1726 -1881
1477a881J953J550l212J217J834k147j83J301Kr38j15J589j432l30K181j492j000
$$ -1881 72 1622 -1590 -373 1461 -686 -869 432 434 -504 -619 970 -462 -792 1389 -103 -1103
1494a103K173j222j99J404j730L49R90j235Q44K68j459J014J67p48M28L49j3r13
$$ -1103 1070 -152 -351 1053 -677 -328 662 -573 271 539 -920 94 261 -487 -59 290 277 -636
1512f36J52J727j672P4K134k845k88L306j830j233K268j504r94J926K12j353n05
$$ -636 -484 1243 -429 -355 1779 -1066 -1354 1952 122 -1111 1157 -347 -1341 585 797 -556 -1061
1529a061J681n14j388K343k49k625K297M84k245K019K0j682J197p0k92O60o81
$$ -1061 620 106 -1282 1061 812 -1813 484 968 -1277 742 762 -920 277 207 -85 575 -106
1546a06j49Q8n4P39m37k23j52o59J526K30j709J497k46j783K528r9k360J883K9
$$ -106 -255 -167 -221 518 81 -142 -294 -953 573 803 -906 591 345 -1438 1090 991 -1369 514 543
1565E43j641J469N13j339l52J128J64j630J548R87l109J011K480k536M05J888
$$ 543 -1098 371 884 -455 -807 321 485 -1145 403 1390 -1719 -708 1772 -764 -359 1529
1581A529k274j95J905o10l15J82l90l10J25J179o12j125J275n48o24J578q43m09
$$ 1529 -745 -940 965 355 40 222 -168 -478 -353 826 214 -911 364 -184 -808 770 -73 -482
1599d82J059j308N95J331j823N20J024j582M05R79n40l98K9M39q27J94J645j719
$$ -482 577 -731 -136 1195 -628 -108 916 -666 -261 718 178 -220 -191 248 -579 -385 1260 -459
1617d59r17K682j555j472L288j138j907K333k02j750R56J207p86j087R99K45j431
$$ -459 -1376 1306 -249 -1721 1567 429 -1478 855 653 -1097 -141 1066 280 -807 192 437 -994
1634i94J696K86k344J047R38j507J259L04j394N35P0j80J080p29k60M38o30K81
$$ -994 702 988 -1356 -309 629 -878 381 685 -709 -174 -104 -284 796 67 -193 245 -385 -104
1652a04O10K2m80j021J010M35j215J556k57k607K076J113k185J293P88k075K88
$$ -104 506 528 48 -973 37 472 -743 813 556 -2051 25 1138 -1047 246 1034 -1041 -753
1669g53J650k59j207N52P84j615M72K206k146q73K124j365l32J925j119q49O93
$$ -753 897 638 -569 -17 767 -848 -376 1830 -316 -1189 935 -430 -762 1163 44 -805 -112
1686a12j20L65Q2k10j17o87R38P65r37K4j57l45J136n49j31Q13j811M11J848j507
$$ -112 -232 133 215 5 -112 -799 139 904 -33 -9 -166 -511 625 76 -55 758 -1053 -642 1206 -301
1706c01l41J377j418k46J551l2q27j66R63p77n36K122o75k345K130L7j499J896
$$ -301 -642 735 -683 -929 622 590 -237 -403 560 -217 -753 1369 694 -1651 479 516 -983 913
1724I13j10k062P82Q61n61M9K93K9j084M65J363j093j27J004j122O7Q85o63N95
$$ 913 803 -1259 -477 384 -177 -128 165 194 -890 -425 938 -155 -282 722 -400 -333 552 -111 484
1743D84l38r32J139j77o99J303p96q43R05J27k54k2K91J06j121J099O59j872J016
$$ 484 146 -786 353 176 -523 780 -16 -859 46 173 -81 -103 188 294 -827 272 931 -941 75
1762G5J203k303O35J665j785N9J125q09m87O39N96q67m20J277q45p65J902n69
$$ 75 1278 -1025 -390 1275 -510 -451 674 -135 -622 17 613 -254 -674 603 -242 -1007 895 326
1780C26j104J328m47n94R95l14k41J63o10P66n7l82M97n30k14M92n2J93k69m70
$$ 326 -778 550 103 -491 504 190 -51 112 -498 268 211 -171 326 -204 -418 74 22 215 -54 -524
1800e24R56o07k84J523j367n83J889r65o40J347l86j056P23O02o26o59R88O5j550
$$ -524 432 -175 -459 1064 -303 -886 1003 38 -602 745 359 -697 26 628 2 -657 331 396 -1154
1819a154J519N73j992J029Q02j635Q01P78q44r2K49J97j12l05N80l22o97R72j60
$$ -1154 365 938 -1054 -25 777 -858 -57 721 -123 -215 34 231 119 -186 394 72 -625 347 187
1838A87m85N36n69J57M98q03Q69q8j040J093K12j185R59J93j049L69M80j14m25
$$ 187 -298 238 -331 -174 324 -479 390 302 -738 355 567 -618 341 534 -515 -146 334 220 -205
1857b05K20N58j247L02J389j569k19J732j290m19J474p03n86P84k3k15k04M69
$$ -205 15 573 -674 -372 1017 -552 -771 961 -329 -748 726 23 -563 221 198 -17 -221 248
1875B48O0q38Q65J38j161R66K12j034N97m8k99M89m29rN71o31K41N11p26J33L00
$$ 248 308 -530 335 473 -688 278 490 -544 53 5 -294 195 -234 -243 328 -303 -62 449 -277 -144 156
1896A56j54l8o0M13k92n97J099l66j098J539l55j102J204O5j031O78L98o74j03
$$ 156 2 -36 -96 317 25 -572 527 161 -937 602 247 -855 349 414 -617 61 459 -215 -318
1915c18N24K09q13M41P60j373L39J047j151R0P42p29J25J87k62L36k74r6M65m10
$$ -318 206 415 -398 43 803 -570 -231 816 -335 -245 497 -232 -107 80 -182 154 -120 -216 249 -161
1935a61J49K72m59K93N7k23K71l38J10N43r43N70M05j336O28P99j022N0O81m27
$$ -161 -12 260 -199 94 151 -72 199 -139 -29 514 -429 141 546 -790 -162 637 -385 -335 346 -81
1955h1j71J93L63n52j07Q81n47o32J375o47o87J200m20p74R05k33k44J62m3K78
$$ -81 -252 -59 304 -248 -355 526 -21 -653 722 75 -612 588 168 -606 299 66 -178 -16 -59 219
1975B19m34J06M92p11K23M50o29M21Km28N65j75l16O16k95l64O45o92L6O57m60
$$ 219 -215 -109 383 -328 -105 345 -284 137 139 -289 276 101 -215 401 106 -258 387 -305 -269 388 -72
1996g2j56J22J26L8l94M63K01j062R67M54j349Q56L07j062O42L66o37J59K43j91
$$ -72 -228 -106 20 58 -336 127 328 -734 233 687 -662 194 501 -561 81 447 -190 -31 212 21
2016B1k31M3N86n13k68Q23p03j87R91p20j20P44o79K73J63n61M95p2l45N19k90
$$ 21 -210 -167 419 -94 -362 461 -242 -429 562 -158 -278 466 -213 60 223 -338 157 85 -260 259 -31
2037c1j80K58j33J33j22j48M98n94O2Q57r38L3J009r40lP72o23p8L50j09k03N4
$$ -31 -211 47 -86 47 -75 -223 275 -319 -257 600 -338 -305 704 -236 -239 533 -90 -168 182 73 -130 -76
2059g6K58k8p34R09Mr60R03lr00Q46J6n94N45j92oJ46j55J01q1k16M15k91LK91
$$ -76 182 154 -580 329 333 -627 276 273 -627 219 235 -359 186 -6 -12 134 -21 80 -1 -217 198 -93 -90 201
2083B01m07K28K27n82O13k55n38R67k86n78O74j50l08L92l1j31k09J53J88l49
$$ 201 -206 22 249 -333 280 25 -513 454 168 -410 264 114 -194 198 167 36 -173 -20 168 -181
2103a81K87L90j166L36Q82q96K16N80q68J62N94k93k7o2J04j02k14O60k00m78
$$ -181 106 496 -670 -334 548 -348 -132 448 -420 -258 336 43 16 -46 58 -44 -258 402 202 -276
2123b76M93l50j07O88m12l39L46m44L76N46o49N1O4m18O05J45k53Ml17K74j7n0
$$ -276 217 -133 -240 448 36 -303 43 -401 -25 521 -128 -77 -13 -431 174 319 66 70 -247 27 10 -40
2145d0M78o81l28R39l66k86P53m72n22N96P7k52J59o2j34k14M48K94p28L35K57
$$ -40 438 -243 -571 368 2 -284 469 -3 -525 71 148 -104 55 -7 -141 -355 93 387 -341 -6 251
2166B51o59O27J99o94M30o8l82M18q5k50K91k32J44J64k48K62k13l5J68j88J14
$$ 251 -408 219 418 -276 154 86 -296 122 37 -213 78 -154 -10 154 -94 168 -45 -80 88 -100 14
2187A4K28n90N37J04o61M92J70p19M25K08l46J74m7n2q1NL78l80k4N22n47L2N75
$$ 14 242 -348 189 293 -368 124 294 -425 0 208 -138 36 -11 -63 -144 -139 239 -141 -165 357 -190 -158 417
2210D17o05n6M64l02p2L15k04KL0K5nk63K05K46m57K89N5k68M41k52j69N33n15
$$ 417 -188 -244 220 -82 -154 161 -43 -41 -11 14 9 -254 -49 197 -260 29 84 -184 257 5 -164 369 -146
2233a46pN45m73J2K86l46Q6J16Nj45q6L9M0j27N45k57o51O85K7k94M48p3n95L37
$$ -146 -153 392 -81 -69 217 -129 -43 73 78 -67 -153 -114 -74 -201 344 87 -564 121 148 -146 302 229 -366 -29
2257b9JK2J41j08m5k79K10L18l30Q9J47m86J36L63k82K20j26k64L32P3r9J31j01
$$ -29 -28 -6 135 27 -18 -297 -87 231 -99 -10 137 -349 -213 150 -132 88 -38 -302 30 103 4 135 34
2280C4j71K13p2P%n0O3j23J65K00n08K45J72m63L49J94m12K3L02k44P1J27j57
$$ 34 -137 76 4 11 11 -39 24 -99 66 266 -242 3 175 -288 61 255 -157 -134 168 -76 -5 122 -35
2303c5j1j60M51l38j57L78j97k07N14j96k17L63k80l1K86j48j1N6j65K34j45Q3
$$ -35 -46 -206 245 -93 -250 128 -69 -276 238 42 -175 188 -92 -123 163 15 4 60 -105 129 -16 67
2325F7j0j32Q2n5k01L93j99j08L16l03QM08l91l2K93j62m9K27l5j07l4K03m6k57
$$ 67 57 -75 7 -48 -249 144 -55 -163 153 -150 -142 266 -125 -157 136 -26 -75 152 117 10 -24 179 133 -124
2349a24K67o2l10K04J77l27J12J54k74J80o3N6M9n9P7k2N1L1p9n3J68j87M5J26
$$ -124 143 81 -229 -25 152 -175 -63 91 -183 -3 -66 -10 39 -20 57 35 86 117 38 -15 153 -34 11 137
2373A37l43K15Ok11K76l2k36L29j96m9l5J07J06q4n2K20k34j04K58r0j64M02l50
$$ 137 -206 9 15 -196 80 48 -188 141 -55 -104 -139 -32 74 -10 -62 158 -76 -180 78 -12 -176 226 -124
2396a24JK79l40Q3J31p4M1J8l5M3r2J22%k08L17j25j53J39o8o0J92q4J2P0q5R7
$$ -124 -123 156 -184 -101 30 -44 -3 15 -20 23 -69 53 53 -155 162 37 -116 23 -45 -105 87 3 15 85 0 97
2422I7j14L6K4k24J86O3j29O2R1k45K82j68j02L60l05k29M65j18j10J44k3q2Q2
$$ 97 -17 19 43 -181 5 68 -61 1 92 -153 129 -39 -141 219 -86 -315 150 32 -78 66 43 -39 43
2445D3K8j6n9l6J82j47p9K68l15M3K60l33J07J63j19J01Pj97J04k1N5K6j08N9
$$ 43 71 55 -4 -40 142 -5 -84 184 -131 -88 172 -161 -54 109 -10 91 98 -99 5 -16 39 65 -43 16
2469A6rp6J38o7p6J57j63L1J01n4j4m7K5j8J7r3Q3rJ61j52r4J93j29J0J99k22
$$ 16 7 -69 69 2 -74 83 -80 -49 52 -2 -16 -63 -38 -56 -39 -132 -49 -58 103 -49 -143 50 -79 -69 130 -92
2495i2k8K84m3l27M20j83p5K4M6J37k30R2O8j34N4Q8k09J29j57RJ12k3l5K18j23
$$ -92 -120 164 121 -206 214 31 -44 -20 26 163 -67 25 93 -41 13 101 -108 21 -136 -127 -15 -38 -73 145 22
2520B2J5R7j06QJ8j44J24Nj72J97o8Nq0OJ15Q4j37J08p1n7J02M9j98M7j2j6K4
$$ 22 37 134 28 36 54 -90 34 39 -133 64 -4 1 -79 -73 42 126 -11 97 26 -31 71 120 -78 -31 -43 -59 -35
2547c5L1J48j49p1J82k06R3J68j85N3O8j36J3J7J65j82R0q5J74k79N7pNM2N5j41
$$ -35 -4 144 -5 -76 106 -100 -7 161 -24 29 97 -39 -26 -9 156 -26 64 -21 153 -126 -69 -76 -71 -29 26 -115
2573a15J02j6j6Q3l0o8J06j47N7O6j2N4j4p2l3O0om3N6jl5Nmj0j17K34l7j28Q6
$$ -115 -13 -29 -45 38 8 -60 46 -101 -44 22 10 64 50 -22 -55 5 -1 -44 12 11 -24 -19 -23 -33 -150 84 47 -81 5
2602Erl7J00m0N1p7m3O1o9M0J02j75J45p8M3J15j11q0R3Q9j69KR1l7Mq7J1J41
$$ 5 -4 -41 59 19 70 -7 -50 11 -58 -18 84 -91 54 -24 19 134 23 -57 36 125 -44 -42 49 12 16 -71 -60 81
2630H1q1M1n0On8K8M9J12j71m0J30q1m1J05l9p1QJ60q1K2k2n8R2O1o4QP3q7p5
$$ 81 0 41 -9 -3 -61 -33 16 128 -43 -83 47 -34 -75 30 -9 -80 -72 88 7 29 7 -51 41 102 38 46 119 32 -43
2659d3J69j28j25K19r3q9J50LR7k26m6J15j22R0O6l0J50j15j6k9L8o0J15o1o4
$$ -43 126 -2 -127 92 -1 -90 60 63 160 -66 -112 3 -119 -29 37 7 157 42 26 -3 35 -25 90 29 -35
2684c5oP6L4m7K4m4j19J29j00L8OJ71k06jJ71j16P9o6N5j14J72k39J79p3M0pN2
$$ -35 -41 35 69 22 46 2 -117 12 -88 -50 -44 127 -79 -80 91 -25 54 -12 43 -71 101 -138 41 -32 8 1 53
2711E3l1k5n7L8L1pQ5r6q5J35j54P3P9j14J16P1q5j2K6o4R3p1L5j03O7l4n0n7
$$ 53 22 -3 -60 -22 9 2 87 -9 -94 41 -113 -40 39 -75 41 112 27 15 41 -23 70 -1 34 -69 -2 -36 -86 -143
2739a43K44j20p3L9O2oJ00p3k5M8j22J40p4R1j59Q2J0J9J2p9R8j45P3l7J9J37
$$ -143 101 -19 -92 -53 9 3 103 30 5 53 -69 71 -3 88 -71 11 21 40 52 -27 71 -74 -1 -38 -19 118
2765A18j32j24K26j91J77p2N0n7o2J2Q3j23O4R6k18J22J38j23J06r7j01R2J3k6
$$ 118 -14 -138 88 -103 74 2 52 -5 -67 -55 28 -95 -31 65 -153 -31 107 -16 90 -7 -108 -16 -3 -29
2789b9J48j37k2Q9k6O3j27l4NR3p7j3J10p6M6l6n6P5o4J95j22q1j3J13m2l2P7
$$ -29 119 -18 -40 49 23 86 -41 -75 -70 23 -54 -67 43 -33 13 -23 -79 -4 -68 127 5 -76 -89 24 -18 -50 27
2816B7q8l2QnJ07o8O2J3m3R%q0J34m6n8L0Nn7j02L02j54J15j20n5J6L1K7r8J07
$$ 27 -61 -93 -85 -90 17 -51 11 24 -19 -10 -10 -90 44 -2 -60 -30 -25 -82 -184 118 -36 79 -41 -96 -80 -49 -22 -120 -13
2845a3l3l3R2j33J40j04Q0JJ1L4K8%j29J41r6m5J79j88JR9j29J65N8j56K5N4j12
$$ -13 -46 -79 13 -120 20 -84 -4 -3 8 42 70 70 -59 82 -14 -59 120 -68 -67 32 -97 68 126 -30 -5 49 -63
2872f3Q8M0J2p3j62K11o2N8M1j39l5Q6l2NL2k3J0R9j14O4m3l5k8j4J87o6j15M4
$$ -63 25 65 77 4 -158 53 -9 49 90 -49 -84 2 -30 -25 7 -16 -6 93 -21 43 0 -35 -63 -77 110 44 -71 -27
2900b7L4k5J07j80N2N3N5j46R9r7l7J71m7n7P3k6O1J2p8J35j39NJ12j91Q3O1p9
$$ -27 7 -18 89 -91 -39 14 69 -77 22 -75 -112 59 12 -45 28 2 63 75 -3 132 -7 -2 110 -81 2 63 -16
2927a6J54n3k24K41j13m7J19r3M6O6l5M2k21J50J76k93P3J57k15J78J5j35O2k2
$$ -16 138 85 -139 102 -11 -58 61 -32 14 80 45 87 -134 16 192 -101 -28 129 -86 92 107 -28 34 12
2951A2L7Q8k28O0M1O0o4n8n1J14m8QR2j68R2O6k01M6K05n9o5M7J3j1M4j68J10
$$ 12 49 137 -91 -31 10 70 6 -52 -103 11 -37 -29 63 -105 -13 53 -148 -102 103 44 -21 26 39 28 72 -96 14
2978A4M4r5l9QK06n3j66J69j43r5J30k0J6M2j37J91p2o7J68j99R6R9j06k5O7j75
$$ 14 58 -37 -76 -68 138 85 -81 88 -55 -150 -20 -40 -24 18 -119 72 0 -67 101 -98 -2 97 -9 -34 33 -142
3004a42K30K4j41J15j40j38K84n6j41J12m2j8L4JK7m3P3Lq1J17J4j77J82r0j09
$$ -142 88 112 -29 86 -54 -192 92 36 -105 7 -35 -53 -19 -18 9 -34 39 42 -39 78 92 -85 97 7 -102
3029a02J62K4j06J18j23o7M5l0K1qL8Nk2r9K33j73K7K42k76P9Q1j79J72j19M1
$$ -102 60 84 -22 96 -27 -94 -49 -79 -58 -66 -28 -23 -45 -144 89 -84 -57 185 -91 -12 69 -110 62 -57 -16
3054a6M1l7N4n4J2n8J17p0J66r5nQj87J42L8j12N3J59j27n8J85j40O0j88R4Q7
$$ -16 25 -12 42 -12 0 -58 59 -11 155 60 55 63 -124 18 56 -56 -3 156 29 -29 156 16 76 -112 -18 69
3080F9j33R4O1j98P3kj33L21q1j46K20j12o5K8N3l3q6N7LJ6r6J52q2NQ4p8J99
$$ 69 -64 30 91 -107 -34 -36 -169 152 71 -75 145 33 -32 -4 49 16 -70 -13 -10 6 -90 62 -20 -15 69 -9 190
3107A90k29J1JJ63k68J62K2%m2j42J22L9p0K01k32j1J95j73R8or4J18M9k00Q5
$$ 190 -39 -28 -27 136 -132 30 52 52 10 -132 -10 29 -41 160 -72 -83 112 -61 37 31 -63 55 104 -96 -11
3132a1J76k85J71M5j12J07j31n7P3l0J83r8l9J1o5l8J46Jl8J44k09rJ15np3L2
$$ -11 165 -120 51 96 -16 91 -40 -97 -24 -54 129 31 -8 3 -62 -100 46 47 9 153 -56 -65 50 45 -28 4
3158Dj5oj4R0L6j40nOj39L58j12q9J24j20p5J59p6JK6Q3n4Jp9J6l6P1Po8J04L3
$$ 4 -11 -17 -31 59 95 -45 -50 -44 -183 175 63 -26 98 -22 -97 62 -14 -13 13 96 42 43 -36 -20 -56 15 22 -46 58 91
3188I1j28Q9N0j64M9l3JM4J69k63J53j50J43N9k41J74q1n8J44k21K37l3r2K25
$$ 91 -37 52 102 -62 -13 -46 -45 -1 168 -95 58 -92 51 110 -131 43 -38 -96 48 -173 64 31 -61 164
3212A64j34j30L1J26p0j01K20j70L0lJ20q0k9R5j18r5L19j77J2K6q6lJ09j28J04
$$ 164 30 -100 -69 57 -13 -114 106 -64 -34 -37 83 3 -26 69 -49 -144 175 -2 10 36 -50 -53 56 -72 32
3237C2m5M2Nj76J15P5j25M3R8j47M9j3n0Q5q3mK26r6q9J40j25LP3j70J54o5K9
$$ 32 -13 29 34 -142 -27 48 -77 -34 64 -83 -34 -47 -97 -12 -95 -99 127 31 -58 82 -43 -40 33 -137 17 -48 -19
3264a9O6r0R4M0k50K22Pn7J10j57K9J75j28j09L1j30J65R2j11L3j20KJ91j11n6
$$ -19 47 -43 51 91 -159 63 70 13 123 -34 -5 170 42 -67 -36 -166 -1 91 -20 13 -107 -105 86 -25 -81
3289h1J59k04J37J63k33J83n7j93N6K0l9K17j42k3l0k4K46j34j66K13k07Q8P4
$$ -81 78 -126 11 174 -59 124 67 -126 -70 -50 -89 128 -14 -37 -67 -91 155 21 -145 68 -139 -51 23
3312B3j22K4O1p1J52O3j14m0p4J01j7M7P7n6k48K56j16J18pp2l8J93j37l4J59
$$ 23 -99 -75 -14 -85 67 130 16 -24 -98 3 -14 33 110 54 -194 62 -54 64 57 -15 -53 140 3 -31 128
3337A28r2L2n4r4J36j94J01J01L3j2o3j39Q0n3N1J60j26q0K17j40j20J84j03q7
$$ 128 36 68 14 -80 56 -138 -37 64 97 85 22 -117 -37 -90 -39 121 -5 -85 132 -8 -128 56 -47 -134
3361a34J64m8M8r5M7N5q6J32q3K1LL9j71K03j05p3R7J08k15J05j58J21N3j08L15
$$ -134 30 -18 30 -65 -18 37 -49 83 0 21 24 63 -108 95 -10 -83 14 122 -93 12 -146 -25 28 -80 235
3386B35k96jJ86k19J69P1k03J13Q0j81J17l8j48J80p9q0J17n2m6J5KJ36J4j21
$$ 235 -61 -62 124 -95 74 145 -58 55 135 -46 71 33 -115 65 -14 -94 23 -29 -75 -60 -58 78 92 -29
3410b9J17j18OJ31k07M4J3J7oJ5k3N1l3J9l7J8J20k6q9P4O5j37Q3j7l4J41k28
$$ -29 88 -30 -24 107 -100 -56 -43 -26 -32 -17 -40 11 -22 -3 -40 -22 98 72 -17 57 122 -15 68 51 17 158 -70
3437g0J0J91j79N3ok5J33j37r8J52rj00J51r3K5o4p5K56l1j54J75q1K9O5n5j28
$$ -70 -60 131 -48 5 -1 -26 107 -30 -128 24 15 -85 66 -27 -2 -66 -141 115 84 -70 105 24 53 118 63 -65
3463f5J20j48J73j87R9J69j74P0O2k72J19J01j11P8Nl8j3r8J15L4j38O7K7lM1
$$ -65 55 -93 80 -107 -8 161 -13 57 119 -153 -34 67 -44 34 39 1 -12 -110 5 39 -99 -32 -5 -8 33
3488C3m5LN0j14Q7m3p6J32J60k33J04R1j45N7l0k8M0lo1J4q4J43Q6k95K04j47
$$ 33 -12 -9 41 -73 14 -29 -105 27 187 -46 58 149 4 61 31 3 43 40 -21 -7 -91 52 138 -157 47 -100
3514a00k1J51r8jJ15K6j10Q3j00K5L2L8j1j65J87j7p8l9O5m6R9k4j55J93p1k2
$$ -100 -121 30 -68 -69 46 72 -38 45 -55 -30 2 40 29 -136 51 34 -44 -83 -18 -64 35 11 -144 49 -22 -44
3540d4J71j36j32J44o5O5J33r4R8j34N2m4l1O4q0n8J52%j54K43r2k17J88l5m7
$$ -44 127 -9 -141 3 -62 3 136 42 140 6 58 14 -17 47 -33 -91 61 61 -93 150 58 -159 29 -6 -53
3565e3J0M3J3j13P5P6j51O8K06l54M7K56k54K03j04n8O3P6j46J39l5k3O8m0P6
$$ -53 -43 0 13 -100 -25 51 -100 -32 174 -180 -133 123 -131 72 -32 -90 -27 49 -97 42 7 -16 52 12 88
3590H8j18k2J34j70j8K86j11j50K02j00j37K02k29Q5Q9q6N6m4R7q6J6j1N9q5K11
$$ 88 -30 -52 82 -88 -106 180 69 -81 121 21 -116 86 -143 -58 31 -55 1 -43 54 -32 -16 -27 32 -53 158
3615A58k06q8J86j60J00J55l22J97K03k84N0K6n4R9q5J9P5r2J26J0j78N2Kj23
$$ 158 -48 -136 50 -110 -10 145 -177 20 223 -61 -11 15 -39 60 -25 -6 69 -23 103 113 -65 -13 -11 -134
3639a34K66j84k0J76j24m8J43j04o8J67j89Q0k5lK23k31J28J11l27K31Q1k90J54
$$ -134 132 -52 -72 104 -20 -68 75 -29 -97 70 -119 -39 -64 -67 156 -75 53 164 -163 68 149 -141 13
3662A3%l0R0j29nJ17K1o7j22J00J12j74n5L44k68LK31k79R1K37k39NL9q0qM1J8
$$ 13 13 -17 73 -56 -61 56 77 10 -112 -12 100 -74 -129 215 -53 -50 181 -98 -7 230 -9 -4 35 -45 -53 -12 6
3689FQ7r0J0p2M6J41k08l3K32m0j50J24k22K25P1j40K0K4o9lQ4k5j4R1r4L9j08
$$ 6 93 3 13 -59 -13 128 -80 -113 119 79 -71 53 -169 56 127 -13 7 31 -38 -41 43 18 4 95 1 40 -68
3716f8M6P0j65L23l11J33qj3M8p6p8J21k1kJ18K2j21Q2j04qQ4j48J85q2o6Jl4
$$ -68 -22 48 -117 206 -105 28 20 7 55 -21 -99 22 1 -1 117 139 18 100 -4 -12 72 -76 109 27 -39 -38 -72
3743g2N6J46o7jN9r7RM1j21J00j96J99j7l9Q1n6k56K26J07k03J38j65R7P2p4J43
$$ -72 -16 130 63 62 121 24 33 74 -47 53 -143 56 39 0 81 25 -231 -5 102 -101 37 -128 -31 41 -33 110
3769A10o4j21J57L2r0m7J8q2Q1p7J42j2j76J18q9O5K0J19k49L5P8Q9J3j17J22
$$ 110 46 -75 82 114 24 -23 -5 -87 -6 -83 59 47 -129 -11 -100 -35 -15 104 -145 -110 -32 57 70 -47 75
3794G5q3O7K9l1r1J22j71MJ41j77K4K42j69n6J16j30N1N0J5L3j69K66q7j37R1
$$ 75 -8 59 88 57 -34 88 -83 -79 62 -115 -91 151 -18 -74 42 -88 -37 13 28 61 -108 158 71 -66 25
3819B5O8j96J54o9k9J97k21m9J80j19k1Q8j64J87J02j16K8n5m6J08r3R1r3p0J63
$$ 25 93 -103 51 -18 -47 150 -71 -120 60 -59 -80 8 -156 31 133 17 45 -10 -56 52 -41 50 -43 -113 50
3844E0j8q4J43m7l6P3j87N1N3M3Oj15n5J65m0J25N6k35l8K29j19K0M7j67J51r
$$ 50 32 -52 91 44 8 81 -106 -55 -2 41 47 -68 -123 42 2 127 183 -52 -90 139 20 40 87 -80 71 62
3870F2o6L2k0l7jmj20K47j90J78n0j7J61j79J05l7j87J19jm1Q5oj27J03m2J05
$$ 62 -4 28 8 -29 -30 -34 -154 93 -97 81 31 14 175 -4 101 64 -123 -4 -5 -46 39 33 -94 9 -33 72
3896G2p7j73K38j65j06K19n5J8J68j21p7R6j62R5OO5RN7j77N9o2J08l9j01K15
$$ 72 -5 -178 60 -105 -211 8 -47 -29 139 18 -59 37 -125 -30 -24 41 50 107 -70 -11 -73 35 -4 -105 110
3921A10r1j36J45K1rj0m5J46j25J19j04jo1J3P8m2Rm2p%NL9J6n5n2K54l15K29
$$ 110 19 -117 28 49 40 30 -15 131 6 125 21 20 -41 -28 50 8 17 -25 -32 -32 -27 12 28 -27 -79 175 -140 89
3949H9j21k3J24O3j89M0P7q8Q5j54K27m2j30J54j43MJ21j24q7J53j02J6K02q6
$$ 89 -32 -55 69 132 -57 -17 60 -28 57 -97 130 88 -42 112 -31 -27 94 -30 -117 36 -66 -50 152 66
3973F6L4j01K2o3%Q6n5l5K11j92k5J15p8QR3k03k6K81j82M5N2m1N9j42K53j16
$$ 66 100 -1 21 -42 -42 44 -11 -46 165 -27 -52 63 -15 -7 86 -117 -143 138 -44 1 53 12 71 -71 182 66
3999F6j06J1P8m8Q5j11j5P9q5O3l3LJ28l5j54R0P3l9P2k27J56J8j01J17q6N7M4
$$ 66 -40 -29 49 1 86 -25 -40 39 -46 17 -16 -13 115 80 -74 16 89 50 122 -105 51 69 -32 85 -1 56 100
4026A00j11j59J14k5J2K29q8j37J01j3K5o9rJ05j46J38J1j56J16M9j34qK54k25
$$ 100 -11 -170 -56 -81 -69 160 72 -65 36 23 48 -21 -30 75 -71 67 78 -78 38 87 -47 -55 199 -26
4050b6J8O1k17J75p2RO4p8P8K0j01J9J43j03K1j7RN8q3Jj9p0J54Nj56J12Q8j11
$$ -26 -8 53 -164 11 -61 -52 12 -66 12 32 -69 -50 93 -10 11 -6 3 61 -22 -21 -40 -110 44 49 -107 5 93 -18
4078a8L2l4J07p9j1KnQ1O7j72oJ24j43J19K0j43K0R4q3J3J37k04L6J5J7Q6j70
$$ -18 14 -20 87 8 -3 -1 -6 75 142 -30 -36 88 -55 64 84 -59 -39 55 -28 -15 122 -82 -46 -31 -14 72 -98
4105i8J48Mj20J37p4K7L7j15J69r9j7j6m7o1P5J23k70K21m7L6M0j26J82j26jJ07
$$ -98 50 54 -66 71 -3 24 61 -54 115 16 -1 -17 -64 -125 -50 73 -197 24 -23 13 53 -73 109 -17 -18 89
4131H9n4rQ2j59M0L5k2M9o3M3j5N4n5P9j57LK8k2nJ38q0K8k2%J40j60oO9J4KJ
$$ 89 35 26 108 -51 -11 24 2 51 -12 31 16 70 15 94 -63 -60 -32 -54 -59 79 -1 27 5 5 145 -15 -21 48 62 64 65
4162F5p0O2l4p5J9P3k6M4Km4L4q4NJ08m0J23j61l4J00j31K2M3j69J72N3j52J04
$$ 65 -5 57 23 -52 -33 40 14 58 60 16 50 -34 -29 79 39 162 1 -33 67 -64 -42 1 -168 4 57 -95 9
4189IK6j42J72o3j42K53j11jM3j13J73p3j00N6j5M6J3kq0j1L2P0J1K7j05o6J12
$$ 9 35 -107 65 2 -140 113 2 1 44 -69 104 31 -69 -13 -28 18 31 29 -51 -62 -30 40 51 78 -27 -93 19
4216A9N2Mq2n9Q2K3j01L9P4m6j7R5j73J28K3p1o5L7j11P9J04k1QO9p3Lm0K9n6
$$ 19 71 75 -7 -66 16 39 -62 -23 51 5 -12 83 -90 38 61 -10 -75 -38 -149 -70 34 13 21 90 17 20 -20 9 -47
4245d7J28O4j69K4L8l7j29J58j18J29J1p1J03l3j51J58l2r1J52p0N4K0k45J02
$$ -47 81 145 -24 0 38 1 -128 30 -88 41 52 -19 84 51 -100 58 26 -65 87 17 71 91 -154 -52
4269e2P8K1O3j94J19o3R5k6j07O5m8J43j82M7O0J10mj66O4n7N2J03j1r4k3m3p3
$$ -52 26 47 110 -84 35 -28 67 41 -66 -1 -49 94 -88 -41 19 129 125 -41 23 -34 18 121 110 16 -7 -50 -123
4296a23J89m2k9ON2j07J42l8q3j08J45K7r4j5J33j62M2J06j67K29j17o1J05j54
$$ -123 66 24 -5 1 53 -54 88 50 -33 -141 4 31 -63 -78 55 -107 -65 41 -126 103 -14 -75 30 -124
4320a24J67L0L0j26RP7p3j5j0o6J03j03K05q8m0N1j97L06j05ojR8j22J7m8J30
$$ -124 43 73 103 -23 -14 63 -10 -25 -35 -101 2 -101 104 16 -24 27 -170 136 31 25 24 122 0 17 -31 99
4346I9r1K0L1o5j33J83M0r9J2l5Q0n4N6m9J48j30P3k4j47R2k5O2N9k19J38Q3j12
$$ 99 8 28 59 -6 -139 44 84 -15 -3 -38 42 -12 44 -5 143 13 86 62 -85 7 -18 44 103 -116 22 105 -7
4373grj7L1l3M3j24M1J07r5K6Q0q3J10n7J3j2J0Q7p2p4Qo5O2K64k49J28q2L9k8
$$ -7 -16 -33 -2 -35 8 -116 -75 32 -63 -37 43 -40 70 13 26 14 24 111 39 -35 -27 -92 -30 234 -15 113 31 70 42
4402D2o4l1K7JJ9Oj29J53p9M4O0l0r0J05r6J13P0j58Q7j07K9j6L9l6p2J20n2j1
$$ 42 -22 -53 -26 -25 -6 0 -129 24 -55 -11 49 19 -71 34 -62 51 121 -37 50 -57 -28 -44 -5 -41 -113 7 -45 -56
4430e6J01l6r3O6l9l7J8J74j15J8K4o1r1J85K6k2n5L2M6m1m6rK8m3J37j07p6R1
$$ -56 45 9 -84 -18 -57 -94 -76 98 -17 1 25 -36 -127 58 84 62 7 39 85 44 -2 -11 17 -26 111 4 -72 19
4458A9m6M4P3l8o9n1J97j98J36n1O6j21K8q4J02p6R6jp4J10j72J16p3K4J12n9
$$ 19 -27 17 90 52 -17 -68 129 -69 67 16 82 -39 -11 -95 7 -69 27 26 -48 62 -110 6 -67 -43 69 10
4484A0l5J4L6Om5m9Q2j8L3l9P7L9K5j41NM7ol1q9R2J4n8n5O6R4k41J55q2J13q4
$$ 10 -25 -11 25 31 -14 -63 19 1 34 -5 72 111 136 -5 0 47 41 10 -79 13 27 -31 -86 -20 74 -167 -12 -94 19 -65
4514f5Q0M5J2j47O5p9p2Q5PP4lj6p6Q2O3j07L5O8Oo3J4j0N9p6P9l2l9l0l0J89
$$ -65 15 60 72 -75 -10 -89 -161 -76 -69 5 2 -14 -90 -8 55 -52 -17 51 57 -6 8 -2 57 -19 60 28 -11 -41 -71 118
4544A18o0m3r1J20qJ7O2j54K1K3pk8j3LR7j83J22L3l0K7Qj16j6J28K5O7n8p3p
$$ 118 58 15 -76 44 36 53 115 -39 -18 5 -2 -30 -43 -40 57 -126 -4 29 -1 26 34 -82 -98 30 55 122 64 -9 -16
4573a6JN2n6Q7M4k7j29JJ35j56O1J4J4O2n2Oo3n2n2J17n7P6l3J19k60R8J7Q0Q
$$ -16 -15 37 -19 68 112 85 -44 -43 92 -64 -3 11 25 87 35 41 -22 -74 -126 -9 -66 10 -23 96 -164 -66 -49 31 39
4602C9k5J71k47J7J49j75j00K33r6mj4r1J31m6nJ11j05M2O3L3p0r9M1N9N2k9j31
$$ 39 14 185 -62 -45 104 -71 -171 62 -34 -38 -52 -143 -12 -58 -63 48 -57 -15 48 81 11 -88 -47 12 64 35 -96
4629i6M9J68j27M5r8kN7r0J39L0l7j17J49J2q5j06R8o3J13j40J01K6r3L8P7o9
$$ -96 -47 121 -6 39 -59 -61 -4 -94 45 75 38 -79 70 82 -3 -109 -11 -74 39 -101 0 26 -67 -29 48 -21
4655b1Ln8Q5J0J3J15j48mo9J56l9q4Q1k5n7M8o5J24o6k4j18K49k54K11K2j29J54
$$ -21 -18 -76 9 19 32 147 -1 -5 -74 82 43 -41 40 15 -42 6 -59 65 -1 -25 -143 106 -148 63 85 -44 110
4682A10j30n6R8n1L5L6j43L8O7m3j4J19M9n9k4m7n0R6j11J15j72P1o6O8O7j8q2
$$ 110 -20 -76 22 -29 6 42 -101 -63 4 -39 -53 66 115 56 32 -15 -65 31 -80 35 -137 -66 -132 -64 3 -15 -97
4709i7J90j21J4J13m7l7n6j3J04p2M3j90J94K5o5o1J37q2p8R6Mj6j7L6Q5p9R1
$$ -97 93 -28 -14 99 52 15 -41 -54 50 -22 21 -169 25 50 -15 -76 61 -21 -99 -3 1 -15 -32 4 89 10 101
4736A01o1n9p7N0k6J35m5J42j70j5J12m0Mp0J45r0J4n5Q7j59O5J1j5L4nL0j9P9
$$ 101 40 -19 -96 -46 -72 63 18 160 -10 -25 87 47 51 -19 126 36 50 -5 82 -77 -12 -1 -16 18 13 43 24 103
4764A03j08k3J05j01R5LO9q8rk3p7P7L6j11K4M8R3m2j00L1kN9pj96K87j33mn0
$$ 103 -5 -28 77 -24 71 74 143 55 46 23 -54 23 59 -52 -28 20 113 71 -29 2 0 59 52 -144 143 10 6 -44
4792d4N6Q4j16PJ2l4qJ39k11J75j94J26N4M8j32N9j12KJ55j16M4L7k5rM5j30O6
$$ -44 12 96 -20 -13 -1 -35 -43 96 -115 60 -134 -8 46 94 -38 21 -91 -89 66 -50 -6 31 6 -3 42 -88 -22
4819b2J34j05P4mk17J10K9MNm0Q4j4pq0M8K2l0N5m8m2R4j08p6J03o5J10N3r5J10
$$ -22 112 7 81 77 -140 -30 -1 3 8 -32 52 38 31 -49 -1 21 -9 46 -2 -44 50 -58 -134 -31 -96 14 67 -28 82
4848H2k91K55Q9j70K6K0q3J53p0n9R1l2j7p2J1M2M4M3m0q8N4l3N8J5l9Q0m7R2
$$ 82 -209 46 135 -35 -9 11 -72 81 11 -48 43 11 -6 -78 -67 -25 19 62 22 -66 -12 -45 13 28 -11 69 22 114
4876A14o2Lq0K5n0J82j60M5P0n8j5o5K8J8J23j33M0q5M2M6O1l6N7j44M2Nj05J02
$$ 114 52 55 -25 0 -50 132 -28 17 87 29 14 -51 -23 -5 118 -15 25 -60 -18 28 89 53 110 -34 8 13 -92 10
4904A0K9j28K9P8m0J18k58J13J09k0r1N3o6J0M3%Q5q7J09l8o9j0m1J00J5m6L1
$$ 10 39 -89 -60 18 -22 96 -162 -49 60 40 -51 2 -64 -54 -11 -11 74 -13 96 58 -11 -21 -62 38 53 7 38
4931C8n9O3j30J0N7L4n1QlJ8J11n2q1O1K6j2q0L1P6j0p3L7j2lQJ31j97L6m8J1
$$ 38 -21 42 -88 -78 -21 13 -38 -30 -33 -15 96 44 -37 24 50 38 -42 -11 65 55 -18 19 7 4 12 143 -54 -18 -66 -55
4961e5R5K1j90J32Qm7p6K3J74j55J94k09p9K32jp4O0n9q2J00m0JL7O3j25n1Q3
$$ -55 40 61 -129 3 11 -36 -112 -89 85 -70 124 -85 -164 68 67 -7 53 -6 -88 12 -28 -27 10 73 -52 -103 -20
4988b0j9M4J22j02OM7j12j%L7L0p6K6K7K3L8l7p3K0L0M8j23J13qj13R6Rj6k5N5
$$ -20 -39 5 127 25 31 78 -34 -35 -35 2 32 -44 -18 9 32 70 33 -40 -20 10 58 -65 48 40 -73 23 32 16 -9 46
5018D6Rr2J33j29%j0j4P7q2J52j92R2J8Q6rn0m6m7L3PQ8jL6j54L7M0q1R2q1p5
$$ 46 55 -37 96 -33 -33 -43 -57 20 -62 90 -102 -10 8 94 85 35 -11 -58 -25 -18 70 69 105 -49 -12 28 -53 39 -42 -117
5048a17M2J13J2j00R4L0o2O1k14R7k1P3o5l6O3M3l4q9J27p4L9J7K6N1p7J03j2
$$ -117 -75 38 50 -50 44 74 12 73 -141 -44 -65 8 -57 -93 -30 13 -21 -110 17 -57 -18 -1 25 76 -1 102 90
5075I0q8P0l8j28J26L0N7k4j14L1oj85J50N1m4K5p4J53M3k49J24L8o0mL6QPL0
$$ 90 2 72 34 -94 32 62 119 95 -19 12 6 -179 -29 22 -22 3 -71 82 125 -124 0 38 -22 -26 10 18 25 55
5103E5j7n2L7k0OJ0r4O0O5K6p3O0j39R2l7Ql3L6P0m9L3r6P4J8j6p6oR5P6k29J34
$$ 55 38 -14 23 3 9 19 -75 -15 50 76 3 63 -76 16 -21 -13 -46 -10 60 11 44 -52 22 40 24 -52 -58 37 113 -116 18
5134A8p6Q1M4r7n6J32L2m6%j45R5O8ol7J4Qj32J61k4L4q3K4PM5k2k6m4k7MJ03
$$ 18 -58 23 67 -30 -86 46 78 32 32 -113 -18 50 44 7 21 29 -103 58 34 68 -15 9 16 61 39 13 -31 -58 -54 49
5164D9kj9m8N6j6nO3m2nL5p3J4j61J44P2rK3J2j33N1N3q6L5l9l3J27Kn5m0O1K0
$$ 49 47 28 -20 36 20 15 78 36 31 66 -7 7 -154 -10 62 53 76 88 -45 6 59 -27 8 -31 -64 63 65 10 -30 31 51
5195E1n4n4P4j13K11j81M6q3P5j7R0J3j1r3R8m1j05J22q2J14J4l5mp5O7o2O5L7
$$ 51 -3 -57 17 -96 115 -66 -20 -103 -28 -45 45 58 47 -46 52 11 -94 28 -54 60 74 39 35 -40 27 -35 30 67
5223F7j72J29n3j9R9p7l2O8k7L5n6N4LJ3j8m5Po5J51pj24J85j35N7j3j6r0J47
$$ 67 -105 24 -29 -48 51 -26 -58 10 -17 18 -38 16 19 32 14 -31 -24 -89 62 55 -69 116 -19 38 25 9 -81 66
5251F6l3o9J50l3j40J2L9M7p1j18K43j23O5J3j10P2P2k19J42j08J32n9J8m1m6
$$ 66 33 -36 114 81 -59 -47 -8 39 -32 -150 93 -30 35 48 -62 10 82 -137 5 -103 29 -30 -12 -53 -99
5276i9J18j15J30j66J09K5j31K27j36k3O5J9K1%J1l7l1o8J01J5r5M4PM4P1l1o4
$$ -99 19 -96 34 -132 -23 2 -129 98 -38 -61 4 23 44 44 55 18 -13 -81 20 35 -60 -16 -9 35 106 75 11
5303A1k0J5N1L7j14j06J34m7J75j62n8J22j52Q4p7R6J1j5J04m2n8o4k1R6J3N3
$$ 11 -9 6 57 94 -20 -126 8 -39 136 -26 -84 38 -114 -30 -107 -11 0 -15 89 47 -11 -75 -96 0 13 66
5329F6n6N6n3PJ4o5j0M3l1N0J20j87l5j1J05K2j0r6P4j5L9Lj07J72l0m1M5j92
$$ 66 10 66 13 20 34 -31 -41 2 -29 21 141 -46 -81 -92 13 35 25 -71 3 -12 27 30 -77 95 65 24 69 -123
5357a23J70l6N1j4m5M5j9j31O8R0j33P5K0n0N8m5lK7l3q5J28l1O9L1M1j55J18
$$ -123 47 11 62 48 3 48 29 -102 -34 56 -77 -2 18 -32 26 -19 -22 5 -28 -113 15 -16 53 84 125 -30 88
5384H8p1K3j09N5R8m4l4j41N8J09nm2j09K22j82QK14j61N0j32R4O8j46J46qk7
$$ 88 17 40 -69 -14 84 40 6 -135 -77 32 27 -15 -124 98 -84 -76 138 -23 27 -105 -11 57 -89 57 49 22
5410B2Q0m6n2J01j42P2P8k01M4M5n7K6N6r3J10l3M1l3l5R8n0j55J23J0KJ25k68
$$ 22 102 56 4 105 -37 35 113 -88 -44 1 -56 -30 26 -67 43 10 51 18 -17 81 31 -124 -1 9 11 136 -132
5437a32M3J30j74J48j52J52pJ0J6Q8k07P4J21r5r6J28O6q9N9j92K17j41J22l5
$$ -132 -89 41 -133 15 -137 15 8 18 34 122 -85 -11 110 15 -81 47 113 24 83 -109 108 -33 89 54
5461E4r8%J13j35N4Ll9o3Q6j0J66k15J41l0k29K84k00J74j34N7L8l6n0R0Q3n8
$$ 54 -44 -44 69 -66 -12 -9 -48 -111 -25 -35 131 -84 57 27 -202 82 -118 56 -78 -21 17 -19 -69 21 104 46
5487D6l8n3j33L25j88r2J60j12P7J25j36l1M0k8m3mR4J6M7k4n2L6pqj13K18j29
$$ 46 8 -45 -178 147 -41 -133 27 -85 -8 117 -19 -50 -10 -38 -81 -85 9 25 72 48 -4 32 25 17 -96 122 -7
5514go9J51m6p4R4j3j2j2p2J01j07n7J72q2mP7J9j5L4j04o3L0j76K27O4p2J11
$$ -7 -76 75 29 -45 49 36 24 12 -60 41 -66 -123 49 -33 -37 40 59 44 78 -26 -89 -59 -235 -8 56 -16 95
5541I5o7m9R6j34L1j8R2l3j4N2Nj04O5K7q5n2J11j01R2R9j69L3K7Q5j75LR3m8
$$ 95 28 -21 75 -59 -28 -46 46 13 -1 51 56 -48 17 44 -41 -93 18 -83 9 108 -61 -28 -1 84 -91 -88 5 -43
5569d3J5R5j36N6N2n2N5L7k00J30j2K4Q0j34N2M4j9j55J72j27J4k8J44L7n0j36
$$ -43 -28 67 -69 -13 39 -13 42 79 -121 9 -3 21 101 -33 19 63 44 -111 61 -66 -52 -80 64 101 51 -85
5595h5K28j43j58J41N9p3k9Q3o2j0j5J21r9j2L2p2N1J04j35P5O8l7ol4M9R6l56
$$ -85 143 0 -158 -17 42 -31 -60 23 -39 -49 -64 57 -42 -54 -22 -94 -43 61 -74 1 69 32 26 -8 41 137 -219
5622b19J51M9o3R0n8R2qJ3n7K9j45O5J49j59J87q4r3J62k5mj01j45J31J02o2O6
$$ -219 -68 -19 -82 8 -50 42 34 47 -10 19 -126 -61 88 -71 116 32 -61 101 76 72 -29 -174 -43 59 -3 63
5648F3k19R1J36r1j15J89l3P4M1k83J96n4q9P1M5j51K00j47J14m6Q3j7o4J9n7
$$ 63 -156 -65 71 -20 -135 54 21 95 136 -147 49 -5 -94 -23 22 -129 71 -76 38 -8 75 58 -6 13 -44
5673d4L7j35Q8QM0M2n4Q5j5p0n8J81q2r3J17j05M6Qj9n1m1P4R8r1nM5j1K4O3j53
$$ -44 -7 -142 -54 -46 -6 36 -18 67 52 -18 -76 105 23 -70 47 -58 -12 -4 -23 -74 -115 -41 57 -34 -39 6 -5 19 82 -71
5703g1K4k6R2n7L3Pk9J4k1M2k9J01k10J59l0MQ3j08l7R8qq7J29o4p0O1J4lJ8q4
$$ -71 -47 -73 19 -38 -5 2 -27 -13 -34 8 -21 80 -130 29 -1 3 86 -22 -59 39 31 -56 73 9 -61 0 14 11 29 -55
5733e5J07m2j3l4O0pK5oR1p6l4N7k6j05K9J02o8m0O5r1J02j09R8K9qK3j54k6K18
$$ -55 52 10 -3 -37 23 16 41 35 126 50 16 73 47 -58 -29 73 5 -35 30 -61 41 -68 30 59 51 74 -80 -106 112
5762A12j22PJ14j53j16J25k8M9J1l1J57j37L7%k2Lo0L7P9j51J5L1j0R2m5k2J29
$$ 112 -10 -3 111 -42 -158 -33 -61 -12 -1 -32 125 -12 25 25 3 6 -54 -17 62 -89 -74 -43 -53 39 -6 -28 101
5789A01j30K0PLK2Q6m8O4o2j43ON8m1K5OP6N8j45j7P7r8L1m6M9O2j22P6J28k02
$$ 101 -29 -9 -2 1 23 109 61 125 63 -80 -74 -16 -57 -32 -26 50 108 -37 -54 23 -75 -44 -90 -41 21 -101 -25 103 -99
5818i9K43n2j79J05L0j66J30o3nK8M6QM7q0N1p8o2J80p5j1R8j52J46j02j94L04
$$ -99 144 92 -87 18 48 -118 12 -51 -56 -28 18 26 73 -7 44 -34 -96 84 9 -2 96 -56 90 -12 -206 98
5844I8o1m9L4Qj64J66j1q3J08j95J28l9k4J89q8R2q0j5l4R0m0ONj47P2n5p0K15
$$ 98 37 -12 22 30 -134 32 21 -62 46 -149 -21 -60 -84 105 17 109 29 14 -20 70 30 36 41 -106 -34 -89 -159 56
5872E6j3o8lO8o5P6p2M3q0L5K0k8RO9n7n9J94j53J51j84J39j27R7j06J32j34J
$$ 56 43 -25 -28 40 -25 51 -21 22 -58 -23 -3 -31 -22 47 -10 -69 125 -28 123 -61 78 -49 48 -58 74 -60 -59
5899e9J69j69Q6j2o1Q2k2q7KO6J76p8k17J70j45R8N1j20m1K64l07J88N4l0q1J04
$$ -59 110 -59 27 15 -46 36 14 -73 -71 -5 171 93 -124 46 -99 -1 50 -70 -111 153 -154 34 88 58 -23 81
5925H1M8j03l3N%J2p7Q0J13j38O1j89J17N5q7L7L4m9J00j61P6N5l6n8L3NP8K9
$$ 81 129 26 -7 -2 -2 10 -67 13 126 -12 49 -140 -23 32 -55 -18 16 -33 67 -94 -18 37 1 -57 -24 -19 59 88
5953H8p8OR9j56j3rR7n5j12J3R7r4K34j69O4P3kNq4OMn1MK2j16J00O9l1o8J14
$$ 88 10 16 115 -41 -54 -63 34 -21 -133 -120 -23 -117 117 -52 12 85 83 88 4 10 14 -37 -33 -11 -127 -27 42 11 -57 57
5983E7m1l8K4m0K21j89j16K08j87J84J1j33K9K3o6J44L6k0K8j93O8J55k73OM3
$$ 57 16 -22 2 -38 183 -6 -122 86 -101 83 94 -39 -10 13 -53 91 127 107 135 -58 10 165 -108 -102 -59
6008e9j9J59k71K36k6k3N6o6JJ48j25j76J95j03jN8l2j7J02j77K02l5j00Q2j30
$$ -59 -78 81 -190 46 20 -3 53 -13 -12 136 11 -165 30 -73 -74 -16 -48 -65 37 -140 62 27 -73 9 -121
6033a21K08r5J1p4L6jk5Q1l4J21k02P4K12j14n9J8j31K41j77j14J90r1j1J17j20
$$ -121 87 -8 3 -71 -35 -36 -61 20 -14 107 -95 -21 191 77 18 36 -95 146 -31 -145 45 -46 -57 60 -60
6058f0K4J04j09l1J81k05P0M0p5oq3J10R2o7R3n1r3J52j8j06N6l0L9k9j18J02
$$ -60 -36 68 -41 -72 109 -96 -26 14 -61 -67 -150 -40 52 -15 78 27 -66 86 68 -38 18 -12 27 -2 -120 -18
6084a8k8n0J41P8j84Q7MQ7l4j65R3k0j15O4J1n0J48j29J03M8j76QJ64q3J4Lj09
$$ -18 -46 -96 45 123 -61 26 30 117 83 -82 11 -9 -124 -60 -49 -99 49 -80 23 71 -105 -97 67 -16 -2 1 -108
6111a08J62l4j87J96m1N9k2q1J16k4q7Q4L2m5K3n6J4K4o2J18j38j18J54J16l45
$$ -108 54 20 -167 29 -12 47 25 -56 60 36 -51 33 65 20 43 -13 1 25 -37 81 -57 -175 -21 95 -250
6136b50K58jJ9l6q6J58L4j30J12l3j37R2P5j76J27j5J9M6j20M4j37J64n3m1K3
$$ -250 8 7 26 -10 -96 62 96 -34 78 45 -92 0 75 -101 26 11 30 76 -44 0 -137 27 -26 -67 -44
6161d4J27j36N5j15N7j2O4l4Lq1J10L7k9L6P3j15J8l7O9J4r5J6P3j47P4K1J8p3
$$ -44 83 -53 2 -113 -56 -68 -4 -38 -35 -116 -6 31 2 38 111 -4 14 -23 46 60 -35 -19 54 -93 -19 2 20 -53
6189e3Q2r0J05o5J11o1j78J33J29l2jo3l9J9o5J4J28j10J04L4o2l3%j3J0N9k0
$$ -53 29 -61 44 -21 90 29 -149 -16 113 81 80 17 -22 -3 -68 -54 74 -36 68 102 40 7 7 -6 4 63 43
6216D3q7P9k5O3p7O6q6J86k3k43M0K12j44MR9j71P2L9j22N4N3o6Q2m9ojn6J01
$$ 43 -44 35 10 73 -4 62 -24 162 139 -104 -64 148 4 8 107 -64 8 47 -75 -21 32 -34 48 -1 -7 -8 -64 37
6244C7Q2j58L7J05k13J67j04k5J65j00n8R8j00K6J04j20K07r3m9J52l01Q7qL5
$$ 37 119 -39 -2 103 -110 57 -47 -72 93 -7 -65 33 -67 -41 63 -57 150 57 8 160 -141 -54 -62 -27
6268b7K2L7l4j1m1n9K96j02k4pj28M7n1L8J03j31J65p6m5j2Q8r7P1J21j03L8o8
$$ -27 -5 32 -2 -13 -54 -113 183 81 57 50 -78 -31 -82 -44 59 -72 93 17 -28 -40 48 -49 22 143 40 78 10
6295A0KK8nl7Ko3K1J49j04Jm7o6J69m2j49K42j72nO0j27P7N4P7ql9l9j20J11O9
$$ 10 12 40 35 -2 0 -63 -42 107 3 4 -43 -109 60 18 -131 111 -61 -66 -6 -133 -56 -2 75 67 28 -11 -131 -20 49
6324D9m6%L1j5j77K20qO1%j04Mj1j13J89l5j7r4L7jJ42j09lL8m3R9j9r1M5n1J1
$$ 49 3 3 34 19 -158 62 54 115 115 11 15 4 -109 80 45 28 -66 -29 -30 112 3 0 38 -5 94 75 -16 29 -22 -11
6354a1k9l9Q2RPj05M9m3K16j68N0J5o1m6J10n7lK3o2J13j38O5n7J76j19lj6N2
$$ -11 -40 -79 3 12 19 -86 -37 -80 136 -32 18 33 -28 -74 36 -21 -24 -1 -63 50 -88 -23 -80 96 -23 -26 -42 10
6382A0j1o3KO8lJ75k57K37j86j3M4l5J9K6kLL2j28mR6L5k6l4r5J34j42M4K18j27
$$ 10 -1 -64 -62 6 3 178 -79 158 -28 -41 3 -32 -13 13 11 14 46 -82 -86 10 45 19 -15 -110 24 -118 -74 144 17
6411A7o2R0j26O7M1j6q6Q1K2R2o8j1o8m8LK6MK9m0l3O7j02J13P6p0n1pP9N9j59
$$ 17 -45 45 -81 -14 27 11 -75 6 28 120 52 41 -27 -75 -72 -46 -42 -13 -53 -86 -19 -121 -8 68 -2 -53 -60 19 78 -81
6441h1J46K8j21M2J54k02M9N4j58J69K2j27L0M1p5J23j76K1J37p6J3l4J0O3M1
$$ -81 65 93 -28 14 168 -34 15 69 -89 80 102 -25 5 46 -29 94 -82 -61 76 0 13 -21 -11 52 93
6466I3l4j37L0K1K8j33J23j8N7Jj28p2J46q2J47N3r9n8L0p5K33r6M7ro4j48J16
$$ 93 59 -78 -48 -27 1 -132 -9 -27 30 31 -97 -169 -23 -105 42 95 -4 -62 -32 -107 126 30 77 68 4 -144 -28
6493b8o2J55P0j93J56o4j51J39k4j9L5K0j36J02o4J5J27o4O4j23LN8j11J29k05
$$ -28 -90 65 135 -58 98 34 -117 22 -2 -21 14 34 -102 0 -64 -49 78 14 78 -45 -42 16 -95 34 -171
6518a71J38Nn7L4J34k9o0K7j5O4k0j28r6K28n7J21j39r7J70L2j33J22r3J01JK
$$ -171 -33 -28 -85 -51 83 54 -6 21 6 70 50 -78 -174 54 -3 118 -21 -118 52 84 -49 73 -20 81 82 84
6544H4j13Jk3P6q0J34qj55M2J21j90J80J18j69K2j31J25N2j04K9m7K5j0J8L0O
$$ 84 -29 -28 -51 25 -55 79 71 -84 -42 79 -111 69 187 18 40 -91 34 86 -18 11 -36 -11 -21 -3 27 33
6570C3l8n5J27j27KJ37j86J03O1j15K01p5p1J58k48J78o7j35j9J68p7J70n6q7
$$ 33 -5 -60 67 -60 -58 79 -107 -4 57 -58 143 68 -3 155 -93 85 18 -117 -136 32 -45 125 69 -18
6594a8R1r7N8j4q0O3j7j75K46j31J01M0q1m7Q0j10O3J9o4NR8Jo3j1J7P2j6N9m8
$$ -18 73 -24 34 20 -60 3 -14 -189 57 -74 27 67 -14 -61 19 -91 -28 -9 -73 -68 30 31 -32 -43 -26 46 30 89 41
6623D1J1n8l8L3m3j13J84J17k94J72L8k2Rl3J2N5j09j2O0k0n3P2lM3Mk09K58k15
$$ 41 52 -6 -44 -11 -54 -167 17 134 -160 12 50 28 37 4 16 71 -38 -50 10 -10 -63 9 6 49 53 -156 102 -113
6651a13K55J7k60J04L4j55Q3l9R3M2Q5j56j26J58j16M7O6j7k5J03j09O1j22J67
$$ -113 142 159 -101 3 37 -118 -35 -74 19 61 146 -10 -136 22 -94 -47 19 2 -23 80 -29 32 -90 77
6675G7q5r3J41j38J08P1l4l5j43J57QQ6j26J01k26K01n3o2J35q8q5J59j87Q5J03
$$ 77 -8 -101 40 -98 10 81 47 12 -131 26 34 120 -6 95 -131 70 17 -45 90 2 -83 76 -111 -26 77
6700G7j54J11pl8j2K4n9Q8q2J32nj56J00o0J11m7K4k25L01j57n8J00l4p6P7N0
$$ 77 -77 34 27 -11 -23 1 -58 30 -52 80 75 -81 19 -41 70 23 47 -178 123 -34 -92 8 -26 -102 -25 25
6726B5O4j27n2J85p9l4Q7j91K57l9j29J62q4Lo9k1J26j18NN1j5oM7p8LMr1J22
$$ 25 89 -38 -90 95 16 -18 69 -122 135 96 -33 129 45 48 -21 -42 84 -34 -29 22 7 1 48 -30 -27 -23 -114 8
6754HK7m5l0l1J00k1l6o6L4J32k23J37R2j13O5J0o4Pr7J39K3j16J10j42J34Q6
$$ 8 35 -10 -40 -71 29 8 -28 -94 -60 72 -151 -14 78 -35 30 40 -24 -17 -114 25 48 -68 42 -100 34 120
6780A20j07L9J1o9J55k05RJ69q0o4J97q5k22J54k8r8K19k38N0J0Q2O1m1o8N3l0
$$ 120 13 52 63 -6 149 -56 -47 122 42 -22 175 90 -132 22 -6 -104 115 -123 -73 -63 19 80 39 -29 24 -6
6806fj14J25J4K8m4j4J11r7KM7r0M5j0j08J66j13K0P8j4rL5j5n5O8r4P7nN6Q7
$$ -6 -120 5 19 47 3 -11 100 3 5 52 -38 7 -3 -111 55 -58 -38 40 26 17 52 37 -18 50 -44 33 28 84 171
6835A71j78o6J72o5j30J06j02jJ30Lj43N1N5l0qL5m7J12P2J5k22l0Q6L7r5M8N2
$$ 171 -7 -73 99 34 -96 10 -92 -93 37 40 -103 -52 3 -27 -35 0 -47 65 137 152 -70 -100 -14 23 -72 -24 28
6862B8N0j11M5l4P6P1j96M2J32j49m7J37p5N6K8j24Q5j00O4Q6q3k7k0q1J10R8
$$ 28 78 -33 12 -22 54 125 -71 -29 103 -46 -93 44 -31 25 53 -71 14 -86 -22 64 -19 -46 -66 -147 -37 61
6888F1Mm3j22J21Ql9J10Jk9n3Jl7q5R6jM7k3p2K3J07j12o5J22pp5MJ9L8n2k6Q2
$$ 61 65 22 -100 21 29 -10 100 101 72 19 20 -17 -102 -6 -7 40 17 -55 -32 75 -37 -102 20 13 -62 -58 -39 -1 -53 -79 3
6919CJ2m9K9N0j00n7J68j11R8j86J01L5P7j5l5o2l0J36j22J57j4o7j33K40k24
$$ 3 15 -34 -5 45 -55 -112 56 -55 43 -143 -42 -7 70 55 20 -42 -72 64 -58 99 85 18 -115 125 -99
6944i9J31lj38P3M8p0J58j62J7R1j51J53J9p9N1q3k8P2O0J1r5r3P2J25r3O6K9
$$ -99 32 29 -109 -36 12 -58 100 -62 -45 46 -105 48 67 -12 39 -44 -72 0 60 71 -24 -117 -45 80 -13 53 82
6971H2Pn2l0j5Q8lj15R8j46J61J6p6k0qPJ21p9l5J8KM7j35N4j4m6O3R0l9m5J00
$$ 82 89 37 7 -8 80 77 -38 60 -86 75 91 15 -5 -13 -6 115 36 1 19 21 68 -67 -13 -27 -73 -10 80 41 -4 96
7001I6r5M7Mn3k0o3J33p5m2P7p6Q6q4J17q6JJ1J03M4r2j20J54p4J54j82j7M2N5
$$ 96 1 48 52 -1 -21 -84 49 -26 -68 9 -67 19 -65 52 -34 -33 -22 81 125 33 -87 67 -7 147 -35 -52 -10 45
7029D5j0p4J13p1o6J5N9o0J68j04j4j07K72j74L5l4m0J36k1j72L1J76j6r2j6j08
$$ 45 35 -39 74 3 -63 -48 11 -49 119 15 1 -106 166 -8 27 -7 -47 89 68 -104 -73 103 87 -5 -21 -129
7055a29J30q5N4M7m7J25p8k3J24j5Lq4R0o0p2mr1J19l2J8L6k2m6J4K5n5L9O7q
$$ -129 1 -84 -30 17 -30 95 17 -6 118 103 106 22 112 52 -20 -24 -115 4 -28 -10 26 4 -42 -28 -3 -58 -19 48 40
7084D0Mr3R4M5n3j45J99l4k7pm3J6J5k1M0J8r6N4J0j28J05Q8j32J5J51j46n0J71
$$ 40 44 -49 45 90 37 -108 91 57 30 23 -20 -4 11 -10 30 48 -48 6 16 -112 -7 81 -51 -36 115 -31 -81 90
7112I0q8L0p3M1o0R1qq2J26Pj01j2N2o2J74j62k4M8j5M1p3M8j64K38q1Lj8k2Q5
$$ 90 2 32 -41 0 -60 31 23 -59 67 74 -27 -39 13 -49 125 -37 -61 -13 -28 13 -60 -12 -176 62 -19 -16 -34 -56 29
7141B9n7j9J5P0k5j4k6K9N0n6R0j47R4o6q3R7N1j8%p6L3J37j25j01L0J27r0Q6
$$ 29 -28 -47 -32 38 13 -1 -27 2 52 -4 86 -61 33 -33 -116 -19 32 14 14 -62 -29 108 -17 -118 -88 39 -51 35
7169C5r5J09%j13nR5m1J22j36P6k8n8QN6l3nJ50k33J40j2j60P4J7j6N0n2Q9n7
$$ 35 -60 49 49 -64 -69 26 -15 107 -29 47 19 -39 -31 25 -8 -13 137 -96 44 32 -128 -54 -37 -53 -3 -55 34 -23
7197b3l2L6K6l9R4m4o1Q9j4%q1L8J7k2j3K5mP1r6k3J18m1P0j68Q1j1J5J0l8m7
$$ -23 -55 -19 7 -32 62 18 -43 46 32 32 -49 -11 6 -16 -29 -4 -8 63 -33 -56 62 21 91 -77 4 -7 8 18 -20 -67
7227f7J6R0jr8l6N4J45j85Q8J0l0J40q6r8J42j20P7j74J16l0l1O4k8K2N7m2J2
$$ -67 -51 39 38 -60 -96 -42 103 -82 6 16 -14 126 40 -58 84 -36 41 -133 -17 -47 -78 -14 -42 -20 37 -5 7
7254Gr8K6N9N2J7jj11N3N1l7Or9K5R5o6o4J92j76M9j4N2l9ML4k4L1j4l1l5O0J9
$$ 7 -91 -65 -6 46 63 62 -49 4 55 18 24 -75 -50 45 -21 -85 107 -69 -20 -34 18 -21 -17 17 -7 24 10 -21 -56 4 23
7285B3j04P8K2n5J01oO6j82O0N8J5q3L3M9j35j3J34j2K9n3k5Q7l2r5J49j57O7
$$ 23 -81 -3 19 -36 65 59 125 -57 3 61 76 -7 26 75 -60 -73 61 49 78 25 0 87 55 -40 109 -48 19
7312A9Np7J13q9m4J37k8M5M0o3m0l5R7j08Q2LPJ8j32N9k4J8M1j7J5j39P2P2m5
$$ 19 24 -53 60 -29 -73 64 36 81 121 58 18 -17 80 -28 54 57 64 82 -50 9 -15 3 44 27 42 -97 -25 47 2
7341BM0k0l9J0O8r7J07m5p0j6L3p2J68mk6r7q1N3Q3l5knM2m6N9J50j86J21r9k9
$$ 2 42 22 -17 -7 61 -36 71 26 -44 -60 -27 -99 69 65 39 -58 -139 -86 -3 -38 -40 -45 -3 -49 10 160 -26 95 -4 -33
7371c3N4LJq2Q4m9j17J22o1L7N2l0o5J9P2o6l1O0n7Q4j01R1l9rJ34q0J43k00n6
$$ -33 21 24 25 -57 27 -22 -139 -17 -78 -41 11 -19 -84 -65 7 -59 -90 -30 -87 -3 -104 -13 -52 -61 73 -7 136 -64 -120
7400a20J04K4l6K5j6Q5J3j21L6KLJ8N8j28P7j40J50k9l6J18j61K2O7R3j9Pj49
$$ -120 -16 8 -28 -3 -19 66 79 -42 -6 -4 -1 17 75 -53 24 -116 34 5 -31 87 -74 -52 15 108 89 96 -53
7427e3J05K9j48J15n1j51J03M9qN5m3N7K5r3N3j18J63m7j6n0N1N5p3nJ09q1m5
$$ -53 52 81 -67 48 -3 -154 -51 -2 -10 45 2 59 84 -9 44 -74 89 42 26 -24 27 82 9 4 113 32 -13
7454a3Nn0N7j9J4k8O4k3N0m1o4KJ34p4q4J01p7K2M9m4j3J17q4Q6j5o0J34k98K18
$$ -13 -8 -58 -1 -20 -6 -34 30 7 57 16 -48 -46 88 14 -70 31 -46 -24 25 -19 -32 85 1 87 72 12 146 -152 66
7483F6q5J5M6j9j9R1n7l3J8L1Kj18J08q5l3J69j45L7J00j05P1q9Q7m2m9Q7j29
$$ 66 -19 -4 42 23 4 95 38 5 23 54 56 -62 46 -39 -72 97 -48 -11 89 -16 55 -34 53 11 -38 49 -80
7510h0O1P6o4J6k9qo8K1Q8K8j1j29R1orRJ5K2n1Q6J2q7N0j7K1l9pN5P8j68J05
$$ -80 -19 57 -7 9 -20 -28 -96 -75 13 41 30 -99 -8 -14 -23 -14 1 23 -28 58 70 -17 33 16 37 -2 -9 46 124 -44 61
7541F1K2k3N7j56j9J34r7l2J99k44J60j8p2qn9J26p3j3P6j33J18kj2M3P7nj1J4
$$ 61 83 60 117 -39 -58 76 -21 -53 146 -98 62 44 -28 -36 -95 31 -42 -55 21 -112 6 4 -8 35 112 107 96 110
7569A10o7m6Q3%j31M2L1J0n4l0M5p6J25r4L4O2l3l9J17N8j46l0N2nM5j81J39J02
$$ 110 43 -3 80 80 -51 -9 22 32 -22 -52 -7 -83 42 -52 -18 44 11 -28 89 147 1 -29 23 18 63 -118 21 123
7597A23j53j4L3k03K13nP3j29m0J97p1k6M1q6j6L4rQ7l3O8o7M5n6K9r1Q6q8M1
$$ 123 -30 -44 -11 -214 -1 -6 67 -62 -102 95 24 -2 39 -47 -63 -29 -38 49 16 84 17 62 6 35 -56 30 -58 -17
7625a7l5K7J3n5J62n7o1o0J65j33J02Pl0q8K9jn1P6L2j48J62j36J07NJ6k5j3p6
$$ -17 -52 -25 -12 -67 95 38 -23 -83 82 -51 51 58 28 -60 -31 -32 -83 -7 25 -123 39 -97 10 15 31 6 -7 -83
7653h3J94j33L5Jj23J56Kj20J6M2ql9l3J74j45L1q8kJ94j17N5l5j08K63k17J77
$$ -83 111 -22 13 14 -109 47 49 -71 -55 -13 -21 -60 -93 81 -64 -33 -121 -123 71 -46 9 -26 -134 129 -88 89
7679H9j15m8M4N4m7P3p8J4N1n1L1k2K2o3J11o5R8o2q7N2J5m8J38l6oj64M2J58
$$ 89 -26 -74 -30 24 -23 50 -28 -14 37 -14 17 -5 17 -46 65 0 98 36 -51 1 16 -32 106 70 64 -100 -58 100
7707A00k11J13qk9Qp0J17n4J9nr7Q0j9O9%J1q6N0qK0p4J28K9n2m4l1K3O4K4n6
$$ 100 -111 2 -6 -35 -27 -97 20 -34 -15 -20 -117 -37 -56 13 13 24 -62 -12 -20 0 -74 54 83 31 -13 -44 -21 43 67 11
7737A1J26m7q9n8k0J38rk7J04m9n8k8j3k2R7p8O5qq5Q6k9N8j09m9P3O7q9N2j6
$$ 11 137 90 1 -57 -77 61 52 25 129 80 22 -6 -19 -41 56 -22 43 35 -50 36 7 65 -44 -93 -20 47 -42 10 -6
7766fN6n2N2j17L3K6J11j17j16J34J28k00J16J1o9M9o3J49j69O5q4J07j04k4J21
$$ -6 50 -2 50 -67 -34 -8 103 -14 -130 4 132 -68 48 59 -10 39 -24 125 -44 21 -63 44 -60 -84 37
7791C7l7K7r3J22r0p1L7J36l4r7L9L8ll5lJ55j81Q0%r8K22j55j8jQ9k5k1j4R7
$$ 37 0 27 -66 56 -34 -105 -68 68 34 -63 -24 14 11 -24 -27 128 -53 27 27 -71 151 -4 -22 -23 66 41 20 6 103
7820A03rq1R4p9j00R5k0n9J42k06J87l2n6J04Lj51K06j64l5K6K4m9%m2O5Q1j86
$$ 103 94 13 107 28 -72 23 3 -56 86 -120 67 35 -21 83 86 -65 141 -23 -58 -32 -8 -57 -57 -99 -34 47 -139
7847a39J27nqJ15k08J92Nj15N5Ol8rM1O9q0p2J67k5k06J86N1p0k1p8K5J16j43
$$ -139 -12 -17 -25 90 -118 74 79 -36 19 25 -13 -22 19 88 8 -64 103 78 -128 58 109 39 18 -60 -35 81 -62
7874f2O1M1j1o2O8m6J37j90P2r3J54j18n9q1J38N6kk8l9Q9j5Lr0K02j57j9J9j8
$$ -62 -1 40 29 -33 35 -11 126 -64 8 -85 69 -49 -108 -189 -51 5 3 -25 -64 25 10 13 -77 125 -32 -51 -32 -50
7902e0J43p8pM3o1R3m5J3p2N7n8P8m0O7m1j39L2J08nl9l3on8J00n2J38j16Q7o3
$$ -50 93 15 8 51 -10 83 38 51 -21 36 -22 56 16 83 42 -97 -65 43 38 -1 -34 -40 -98 2 -50 88 -28 59 -4
7931dj38J86j3j2p5p0R7K4J9n1R6m7l9n3P3k9P2j48J62r2M8P1p1N1l1N4j46OJ3
$$ -4 -142 44 31 19 -56 -126 -29 -5 14 -37 59 12 -27 -80 -7 -36 36 -112 50 -42 6 77 6 57 26 80 -66 -60 -47
7960d7J14jm4M4l3qR4j15n1J32j57M9j7k7J52j92J80j02J0J5K1l7Ml0J00m4R1
$$ -47 67 66 22 66 33 25 119 4 -47 85 -72 -23 -40 -67 85 -107 73 -29 -19 -4 17 -20 -16 -46 54 10 101
7987A01l3j43PMJ10p5Q4Rj18k8N0o8J09n8L6m4J95k02mP8M1rq1M3K3N0m3N2L4
$$ 101 68 -75 -68 -64 46 -29 55 64 -54 -82 -32 -100 9 -49 -13 -57 138 -64 -68 10 51 42 -39 4 27 77 34 86 120
8016A20q9np9L3RRM1r0P3r9J15j18J15j16K6R1l8p1M5K8OM8P1j37J8r0J91q7p0
$$ 120 31 26 -53 -20 -11 -2 39 -51 22 -77 38 -80 35 -81 -55 36 -2 -73 -28 0 6 54 125 -12 6 -84 107 20 -50
8045e0N4O2q5m8l9M5J40j30J04j6P8j01N5n5P8r3m9N2P2L1p4j1j20J45l8j9Q0
$$ -50 4 66 -19 -67 -106 -61 79 -51 53 37 115 14 69 14 92 -1 -50 2 74 105 31 20 -100 45 7 -12 68
8072F8p6LK5L7j8j31K2L2P7Kj25J6K02j37m6J52j23k8O7l8L5Q3j59pP1n9M9k6
$$ 68 -8 -5 20 57 39 -92 -70 -38 39 41 -84 -68 134 -3 -49 103 -20 -48 19 -19 16 99 -60 -67 4 -55 -6 -32
8100c2J38j03Mk8o0J17mN0j58M6Q2%n9l9N7Q0r7K7O3n1j01K1L2N3k8k4L9J6J6
$$ -32 106 3 7 -21 -81 36 32 82 -76 -30 52 52 -7 -46 11 91 -6 21 84 33 -68 -47 -15 38 10 -14 25 41 57
8129E7qm5q0K0o5J00j17K74p5o8M0q0O0k0Q6m6q3o7K39j83O6Q8l2l6o0K3N2L3
$$ 57 49 4 -76 -56 -121 -21 -138 136 61 -7 33 -47 13 -7 79 33 -50 -117 122 -61 5 93 61 25 -35 -12 40 73
8157G3n1J0l9pO6Q8j12J2o7l7N6j01K2J21j3j2k1J6O4pj12L5kj26K47j60J51k7
$$ 73 22 32 -7 -14 52 140 28 40 -27 -64 -8 -109 -87 34 21 9 -12 4 68 61 -51 -16 -18 -144 103 -57 94 67
8185F7o0K6l1l4J76k41
$$ 67 7 33 2 -32 144 -97
8191i7
$$ Imaginary data points
##PAGE= N=2
##DATA TABLE= (X++(I..I)), XYDATA
0@%%%%%%qJ6j6J6k4L2m0N6p2Q8j09J33j60J92k32K80l36M00m67N44o34P36q48
$$ 0 0 0 0 0 0 0 -8 8 -8 8 -16 16 -24 32 -40 48 -61 72 -88 104 -128 152 -184 216 -251 293 -341 395 -453
29d53R75j119J276j450J642j855K095k357K641k952L297l675M083m528N016n553
$$ -453 522 -597 679 -771 871 -984 1111 -1246 1395 -1557 1740 -1935 2148 -2380 2636 -2917
45b917O142o780P474q239R078r999J1015j2138J3387j4786J6359j8140K0177k2535
$$ -2917 3225 -3555 3919 -4320 4758 -5241 5774 -6364 7023 -7763 8596 -9544 10633 -11902
59a1902K5303k8604L2617l7616M4050n2682O4917q3696J16383j88738O11457l22613
$$ -11902 13401 -15203 17414 -20202 23848 -28834 36083 -47613 68770 -119968 491489 168876
71A68876j157810J388474K16981j193184K88969R49994p60481l95820P88847j549
$$ 168876 -988934 399540 616521 -576663 -287694 662300 -98181 -494001 294846 293297
81B93297o85402L46681L32688m23017o9447L69120j36577j85954K09658J30346
$$ 293297 -392105 -45424 287264 -135753 -205200 163920 27343 -158611 51047 181393
91A81393k89164r0622L82711L8936m99838J31951M76679l32232k93765N23641
$$ 181393 -107771 -198393 184318 223254 -276584 -144633 332046 -186 -293951 229690
101B29690l394n75139L03904M41062n67415j37314O27727k58635m22018N80650
$$ 229690 226296 -348843 -44939 396123 -171292 -308606 319121 60486 -361532 219118
111B19118j814o34598M49831L95775p28384j5329P23162l35785m84051N63767
$$ 219118 217304 -417294 32537 428312 -300072 -315401 407761 71976 -412075 151692
121A51692J54574n87844J75293M39531l86931k04584L92335j366k37916Q9301
$$ 151692 306266 -281578 -106285 333246 -53685 -258269 134066 132700 -105216 -15915
131a5915P5267n8225L838J5513j6625n3066M904J07952l9095j28908J07526R6480
$$ -15915 59352 1127 4965 20478 3853 -49213 -44309 63643 24548 -104360 3166 99646
143I9646j66490q0J92355j57468j56116L17413J5073l77280K11340K83079l65287
$$ 99646 -66844 -66924 125431 -32037 -188153 129260 144333 -232947 -21607 261472 -103815
154a03815l0053L55973k46382j90726L97773n2685l84982K69299K37474l87703
$$ -103815 -133868 222105 -24277 -215003 182770 130085 -254897 14402 251876 -135827
164a35827n017L64942k45636k17463L84625j6624l66965K05643K32849k50333
$$ -135827 -140844 224098 -21538 -239001 145624 129000 -237965 -32322 200527 -49806
174d9806o7990J92716l8199j12973Q5530O2439j07206l3780J24141K8745j13936
$$ -49806 -117796 74920 36721 -76252 9278 71717 -35489 -69269 54872 83617 -30319
185c0319k0900J03829j0730j14438P1458Q7042j63620J1654K12022j56529j53151
$$ -30319 -51219 52610 41880 -72558 -1100 85942 -77678 -66024 145998 -10531 -163682
196a63682K60920P826k60682J31006J48718k14023J3103K35403j53976j74965
$$ -163682 97238 105064 -155618 -24612 124106 -89917 -76814 158589 4613 -170352
206a70352K49968M8987k52409R9424J41862j97058K1384J92576j37139j02728
$$ -170352 79616 128603 -123806 -24382 117480 -79578 -58194 134382 -2757 -105485
216a05485J64781P185j31155M3355O9370o9836j1394P5912l8933n5993O8164K7189
$$ -105485 59296 66481 -64674 -21319 48051 -21785 -33179 42733 3800 -52193 15971 43160
228D3160n7673k2580K3094L8602j6879l8850M8513k715o1807P9474L2148j28854
$$ 43160 -14513 -37093 -13999 24603 7724 -31126 17387 14672 -47135 32339 64487 -64367
240f4367K2141J18477o9203o7324R5548K396r6944P4484O6399j44724N40J53296
$$ -64367 -42226 76251 7048 -60276 35272 37668 -59276 15208 81607 -63117 -62577 90719
252I0719q7497r0125J28120j0963r7186Q9768L4099j15649J7359J03734m9191
$$ 90719 3222 -86903 41217 30254 -66932 22836 56935 -58714 -41355 62379 13188
263A3188p2714P0258K5506o5501L8026L5646p3828M621O2528k2380l5424N144
$$ 13188 -59526 10732 36238 -29263 8763 44409 -29419 -24798 37730 15350 -20074 -14930
275a4930K2467J0639k3803O67J2340k5723J3174L1871l7676k5799M3902K2353
$$ -14930 7537 18176 -5627 -4960 7380 -18343 -5169 26702 -10974 -36773 7129 29482
287B9482l9639r543M0465k1336k5094O1439k0304p4671O9570M5942q1265J151
$$ 29482 -10157 -19700 20765 -571 -25665 35774 15470 -59201 10369 56311 -24954 -23803
299b3803N4676l2535j8221M2336j2512n0453L6916M7025n6665j7026N4806k4247
$$ -23803 30873 -1662 -19883 22453 9941 -40512 -3596 43429 -13236 -30262 24544 297
311B97j8434M4159k7184l4132M4616J7656l3050j3110K1179J3773j8090r69R333
$$ 297 -18137 26022 -1162 -35294 9322 26978 -6072 -19182 1997 15770 -2320 -3289 6044
324F044j8837O915K3606j3679j6248K455J8910J0754k9892l713K4862j5216L732
$$ 6044 -12793 -5878 17728 4049 -12199 -9744 9166 19920 -9972 -13685 11177 -4039 -307
337c07J8674l3494l466M0655r273k9553Q786J6455j1035m049K0733j9230k2481
$$ -307 18367 -15127 -18593 22062 12789 -16764 -7978 8477 -2558 -6607 14126 -5104 -27585
350b7585M6530N393m8677J7448K1657j9869R267M021k0122O849J8047k238j8070
$$ -27585 18945 24338 -24339 -6891 14766 -5103 4164 8185 -11937 -5088 12959 10721 -7349
363g349k848J5670k548k530K575j7553R094K1168j6444n126L427o607J9918L80
$$ -7349 -10197 5473 2925 395 2970 -14583 -5489 15679 -765 -5891 -2464 -9071 10847 11227
377A1227k6464J0682J2663o569M082l912r588N151J3161q52k2540L456K2349j3455
$$ 11227 -15237 -4555 8108 1539 5621 1709 -7879 -2728 10433 9581 -12959 -9503 12846 -609
391f09k927J0197k0452Q775K3841k2751q329J4936l225N313K546j4942k47J4198
$$ -609 -3536 6661 -13791 -5016 18825 -3926 -12255 2681 -544 4769 7315 -7627 -7874 6324
405F324N510j3463p669J1678k760J717J0987k3651l088L0511j3747j2188J6124
$$ 6324 11834 -1629 -9298 2380 -380 1337 12324 -11327 -14415 16096 2349 -9839 6285
418F285j2868n56K2391j3551j6235J4489J1466q919p878O895l721j380J8442j4404
$$ 6285 -6583 -7139 15252 1701 -14534 -45 11421 2502 -5376 1519 -2202 -3582 14860 456
432D56j9780K6111J924j6292J3909q888j1953K3367K40j6694K966L966M873K000
$$ 456 -19324 6787 8711 -7581 6328 -2560 -14513 8854 9094 -7600 -4634 -668 4205 6205
446F205q902m835P822J1409j0466j1140J5658o292q888K7879j4719l1056L3700
$$ 6205 -2697 -7532 290 11699 1233 -9907 5751 -541 -9429 18450 3731 -27325 6375
459F375J0567k9443J1445P456j7867J1339J4407j9394q574K4355p7k4510J4540
$$ 6375 16942 -12501 -1056 6400 -11467 -128 14279 -5115 -13689 10666 10589 -13921 619
472F19J0470k3018J6942J1965l5409Q638K6528j6627k074M064j4824J0076J5755
$$ 619 11089 -11929 5013 16978 -18431 -9793 16735 108 -1966 2098 -12726 -2650 13105
485A3105j1465r959N539M300j763O277k591j5480J4656J0698k5039J0498J5886
$$ 13105 1640 -8319 -2780 1520 -243 6034 3443 -12037 2619 13317 -11722 -1224 14662
498A4662k6893J0467J8489l2126M827L1689k0158j6661J8367m20r599J7063P69
$$ 14662 -12231 -1764 16725 -15401 -10574 21115 957 -15704 2663 2243 -7356 9707 10476
511A0476l0918J2640L1391k7114q023K8134k4634p051L9490k0077k6817K9104
$$ 10476 -20442 -7802 23589 -3525 -11548 16586 -8048 -15099 24391 4314 -22503 6601
523F601K358j8439J2491K892j6063P589J3909j6584n852K3110p739j5525J7158
$$ 6601 8959 -9480 3011 5903 -10160 -2571 11338 -5246 -11098 12012 4273 -11252 5906
536E906o743q577K5234j1488j9826K0387k950p024J9897j5075k1077K5553J1041
$$ 5906 -837 -9414 15820 4332 -15494 4893 1943 -5081 14816 -259 -21336 4217 15258
549A5258k3036L004J4831k0488j321L4574k0715k8306M2068r73m1675L2230J6205
$$ 15258 -7778 -4774 10057 -10431 -11752 22822 2107 -26199 15869 14896 -26779 5451 21656
562B1656l9831J5830K3273l3799k852L3493q989k3343J4111O005j6652J5687R886
$$ 21656 -18175 -2345 20928 -12871 -15723 17770 8781 -14562 -451 5554 -11098 4589 14475
575A4475k8878O641K0445j6836L400Q491j7638J1025J0405k0961P063J2709j6083
$$ 14475 -14403 -7762 12683 -4153 -753 7738 -9900 1125 11530 -9431 -2368 10341 -5742
588e742L655J3311j8119p954K7932l05k9820J4208J5116k6670J4237K1995l7397
$$ -5742 -2087 11224 -6895 -14849 13083 12778 -17042 -2834 12282 -14388 -151 21844 -15553
601a5553K873L4910k7416r442L2693j5699j8966K6754o83k7301J7136K2131k9152
$$ -15553 -12680 22230 -5186 -14628 18065 2366 -16600 10154 9471 -17830 -694 21437 -7715
614g715q613K8530j3190r614K8017j7036k2628K9537K994j7131J1601l655j1224
$$ -7715 -16328 12202 -988 -10602 17415 379 -22249 7288 10282 -6849 4752 1097 -10127
627a0127J3662M194j0160J338L738n974K140P683j1175p47J7724j6238j1070K7458
$$ -10127 3535 7729 -2431 -1093 2645 -3329 -1189 6494 -4681 -5428 12296 -3942 -15012 12446
641A2446q879j6646K4917j0154k1878L1160N383l1117J0154J6786j9459J840K4325
$$ 12446 3567 -13079 11838 1684 -20194 10966 16349 -14768 -4614 12172 -7287 -5447 18878
654A8878k0341k1855L4189N069l4103J9223J3679l2207J3608K2907k6784k897
$$ 18878 -1463 -23318 10871 15940 -18163 1060 14739 -17468 -3860 19047 -7737 -10634
666a0634K1651r724r760J0853L442p629R36L195o406L835P204q139O62L46j0125
$$ -10634 11017 1293 -8467 2386 5828 -1801 -865 2330 -4076 -241 6963 -1176 -514 -168 -10293
681a0293J6307P093k4861O365J3417j5625P952J2398k0458k002J9478o784j1828
$$ -10293 6014 13107 -11754 -5389 8028 -7597 355 12753 -7705 -9707 9771 2987 -8841
694h841J4651K311k0407J1986J5463k6816L559K8752k5266j3092K9882q425j5557
$$ -8841 5810 8121 -12286 -300 15163 -11653 -8094 20658 -4608 -17700 12182 3757 -11800
707a1800K0127l190j9213J2442J4064j3947o552J3663m263q738J4938k440j4813
$$ -11800 8327 5137 -14076 -1634 12430 -1517 -8069 5594 1331 -7407 7531 5091 -9722
720i722J1949L580r979M994j507j480Q099p976l788R920m854k439Q621m785q899
$$ -9722 2227 5807 -4172 822 -685 -2165 5934 -2042 -5830 4090 -764 -3203 5418 633 -8266
735h266Q389R666j2000n698J5862o796j0748J9264n648j8484K1481K946k3207
$$ -8266 123 9789 -2211 -7909 7953 1157 -9591 9673 4025 -14459 7022 9968 -13239
748a3239J2332J1323j7317J960J4838j1445j1280J9548N542k3319N563J7232j5860
$$ -13239 -907 10416 -6901 -4941 9897 -1548 -12828 6720 12262 -11057 -5494 11738 -4122
761d122n96J4614j2307m652J2437k917m211J133k32K045j580o63J576l074J962
$$ -4122 -4718 9896 -2411 -7063 5374 2457 -1754 -621 -853 1192 -388 -1051 525 -2549 -587
776e87L684l319k757J328P387k566j1890J0564O780j6695P752J1821j9450Q19
$$ -587 3097 -222 -2979 -1651 5736 3170 -8720 1844 8624 -8071 -319 11502 -7948 -7129
790g129J8747j0198j1002J1406K629j0339N026Q723j4014j761J9942j0891j3695
$$ -7129 11618 1420 -9582 1824 4453 -5886 -860 7863 -6151 -7912 12030 1139 -12556
803a2556J9597j127j5662J2326M764j2592K444Q830l044q406L119P476n619k416
$$ -12556 7041 5914 -9748 2578 7342 -5250 -2806 6024 2980 -5426 -2307 5169 -450 -2866
817b866M746m137J110M223l751j75j027P07N678o283k048R139o587k555J1265
$$ -2866 1880 -2257 -1147 3076 -675 -850 -1877 -1170 4508 -1775 -3823 5316 -1271 -3826 7439
832G439p130q139J1123L328j1452p07J1686l894j0239J2321J612j6552J1386R580
$$ 7439 309 -7830 3293 6621 -4831 -5538 6148 2254 -7985 4336 5948 -10604 782 10362
846A0362j7657K716J2220r493j803Q906m012p156O956O019j0868k992J3092m559
$$ 10362 -7295 -4579 7641 -1852 -3655 5251 1239 -5917 1039 7058 -3810 -6802 6290 1731
860A731p943R683j509o658N872J057k570j518n49O285j461o314N525P35m380L839
$$ 1731 -6212 3471 1962 -4696 1176 2233 -337 -1855 -2404 3881 2420 -3894 1631 2366 -2014 1825
876A825m19m434J561M503j325o974N045O289j1496K333J1789j3672l265J7435
$$ 1825 1406 -3028 -1467 3036 1711 -5263 -218 6071 -5425 -3092 8697 -4975 -8240 9195
890I195o506j1404J0646M373q849M93P108n423n174J0814j262j1878R826M150
$$ 9195 2689 -8715 1931 6304 -2545 -2052 5056 -367 -5541 5273 4011 -7867 1959 6109
904F109j2096N880N178r780J252O930k277m835P33O823j263o670M312K491l838
$$ 6109 -5987 -107 5071 -4709 -3457 3473 1196 -3639 -2906 3917 2654 -4016 296 2787 -1051
919a051R59J066l0j657q39O186l470o583Q376r72p260Q776j586r428R252N200
$$ -1051 -92 974 944 -713 -1552 4634 1164 -5419 2957 1985 -5275 3501 1915 -7513 1739 6939
935F939j0799r41R690k423r422P893O049j3243L386J1871j1715k543J1479o203
$$ 6939 -3860 -4801 4889 2466 -6956 937 6986 -6257 -2871 9000 -2715 -5258 6221 18
949A8l889O741l276k920N405J402n616j726P506o61o677M304J042m998L631J591
$$ 18 -3871 2870 -406 -3326 2079 3481 -2135 -3861 3645 2984 -3693 611 1653 -3345 286 1877
965A877j102j03m187L943L895q488J689O741o389n10N300k865j358M043n78n979
$$ 1877 775 672 -3515 428 4323 -4165 -2476 4265 -2124 -2634 2666 -199 -1557 2486 1908 -4071
981d071K571P614p428l098J1254o985p101J4462k755j2722Q359L993p515K025
$$ -4071 -1500 6114 -1314 -4412 6842 -143 -7244 7218 4463 -8259 100 4093 -3422 -1397
995a397M225m088k065N968o65p200O050L411q857L945N474p547K181M800m270
$$ -1397 2828 -1260 -3325 2643 1978 -5222 828 4239 -4618 -673 4801 -2746 -565 4235 -35
1010c5l66jq8L289l883k146N488p46l336J190J925k006k117M807p03o722O959
$$ -35 -401 -402 -490 2799 -1084 -3230 2258 1512 -1824 -634 1291 -715 -2832 1975 1272 -5450 1509
1027A509K793r045O233L268j0848N965P459j0858j344R627k619o431N397L590
$$ 1509 4302 -4743 1490 4758 -6090 -125 7334 -3524 -4868 4759 2140 -4291 1106 4696
1041D696q660J261Q607p961k937J0033n343l877Q375l817l885O071j359l743J623
$$ 4696 -3964 -2703 5904 -2057 -4994 5039 -304 -4181 4194 377 -3508 2563 1204 -2539 -916
1056i16K020M79k690j45K141k63K85j553m49K400l662J703O482q062k381R789
$$ -916 1104 1583 -1107 -1252 889 626 911 -642 -1091 1309 -2353 -650 5832 -2230 -4611 5178
1072E178m481l745O959m229m368O774M39n386K762M036o686k287J0241l346q303
$$ 5178 697 -3048 3911 -318 -4686 2088 2527 -2859 -97 3939 -2747 -5034 5207 1861 -6442
1087f442R537k36j0621R295N374r249P75K936l613K358L577k588l832J809K804
$$ -6442 3095 2859 -7762 1533 6907 -2342 -1567 1369 -2244 114 3691 1103 -2729 -920 1884
1102A884k439K018J017o219J825L860m092L015J451n739L272J506l801M566P82
$$ 1884 -555 1463 2480 -3739 -1914 1946 -2146 869 2320 -3419 -147 1359 -2442 2124 2906
1117B906o039J668K909j446O63K399k937m993N979L283p896L079M669r783L079
$$ 2906 -3133 -1465 1444 -2 661 3060 123 -4870 1109 4392 -3504 -425 4244 -5539 -2460
1132b460R653q979k533Q156l712l994N493P31m627J162M387m359j536O898l826
$$ -2460 7193 -1786 -4319 3837 125 -3869 1624 2355 -2272 -1110 3277 -1082 -2618 4280 454
1147D54m563O544j936l582N902j953l803L823m66p54J184k019L94J666o68l41
$$ 454 -4109 2435 499 -3083 2819 866 -2937 886 420 -334 850 -1169 -775 891 223 -118
1163a18%R22j305O2L291m239j964P300m225l912Q003l078n653P759m29o938M209
$$ -118 -118 804 -501 -439 2852 -1387 -3351 3949 -276 -4188 3815 737 -4916 2843 2414 -4524 -315
1180c15M132n025j752N796j191n508N896J700q135M148M596p300J698M359m694
$$ -315 3817 -1208 -2960 2836 1645 -3863 2033 3733 -4402 -254 4342 -2958 -1260 3099 -1595
1195a595N29K798k475o04J337J104j139j308J504j18J93J568k529J27J658k645
$$ -1595 -1066 1732 -743 -1347 -10 1094 -45 -1353 151 33 226 1794 -735 -608 1050 -1595
1211a595L001J259n893L263K648n482K990L027n489L84L432j798j817L647J250
$$ -1595 1406 2665 -3228 35 2683 -2799 191 3218 -2271 -1887 1545 -253 -2070 1577 2827
1226B827o140J128O418n117j045O558o049l068Q113j691m294L424p77k327J876
$$ 2827 -3313 -2185 4233 -884 -1929 4629 -1420 -4488 3625 1934 -2360 1064 287 -2040 -164
1241a64K174j798k318K565K62k876L266P64l725K038K05j800L067j039j449K038
$$ -164 2010 212 -2106 459 721 -2155 1111 1875 -1850 188 393 -1407 1660 621 -828 1210
1257A210k663J97M018k466k050J872P8j096P23J943k301k177M456l90m428M971
$$ 1210 -1453 -1256 2762 296 -1754 118 196 -900 -177 1766 -535 -2712 1744 1354 -3074 1897
1273A897m9n452N057J333n648K932K788l933o26K880P1l050J458K352m107P38
$$ 1897 1848 -3604 1453 2786 -2862 70 2858 -1075 -1701 1179 1250 -1800 -342 2010 -2097 -1359
1289a359M330m049n95L523k797L99K310k400Q7J203o12O49r10m23J452j032J15
$$ -1359 2971 -1078 -1673 1850 -947 -548 1762 -638 -551 652 40 689 -221 -644 808 -224 -109
1306a09Q0k93P57j240M95J712l432J466L321m481L82L963l455j54L128k367j416
$$ -109 -29 -322 435 -805 -310 1402 -2030 -564 2757 -1724 -1342 2621 -834 -988 2140 -227 -1643
1323a643K326Q45k555j82L240k040k448M579j425l794M761m84l587K809L39j635
$$ -1643 683 1528 -1027 -1209 2031 -9 -2457 2122 697 -3097 1664 1180 -2407 402 741 -894
1339h94J420j0q62J88M80P58j639J48J329j588P84P42k113J472K43j713K225q85
$$ -894 526 516 -346 -158 322 1080 -559 -411 918 -670 114 856 -1257 215 458 -1255 970 85
1357H5j848L146q94k144K429j36j367R27L44m76r85J599O92l124J613J907l728
$$ 85 -1763 1383 489 -1655 774 638 -729 198 542 66 -919 680 1372 -1752 -139 1768 -1960
1374a960J809K226m125J451K449k899J86J617o43o65P02P77j379l01K448j727
$$ -1960 -151 2075 -2050 -599 1850 -1049 -863 754 111 -554 148 925 -454 -755 1693 -34
1390c4j424K915j490j057K453j839n05K081j537J20Q17j214Q07N23r41M32k20
$$ -34 -1458 1457 -33 -1090 1363 -476 -981 1100 -437 -317 500 -714 93 616 -325 107 -113
1407a13M42Nq30J223q57o15K418k185r98L327k184j130K959j737j148K396o57
$$ -113 329 334 -496 727 -130 -745 1673 -512 -1510 1817 -367 -1497 1462 -275 -1423 973 316
1424C16j120N25R33m70j108J843l14k365K952L47l538K393R85k824J600Q06k038
$$ 316 -804 -279 654 184 -924 919 605 -1760 1192 1539 -1999 394 1379 -1445 155 961 -1077
1441a077Q63N10l07j80l60J003o24k50J134j333N16J384j997P95P86j738J529
$$ -1077 -214 296 -11 -191 -551 452 -172 -422 712 -621 -105 1279 -718 77 863 -875 654
1458F54J19k137J871R3j810J705L5j458P22Q03l95j246J047J346k664R45K296
$$ 654 773 -1364 507 600 -1210 495 530 -928 -206 597 202 -1044 3 1349 -1315 -370 1926
1475A926l356P42L126l352j91K789j808q95J598k51j018K29J343q77j314K116
$$ 1926 -1430 -688 2438 -914 -1105 1684 -124 -1019 579 328 -690 -461 882 5 -1309 807
1491H07m45j694J995l37j205J810q67q27J543r96K28R84j750L58Q58p05K85J86
$$ 807 362 -1332 663 326 -879 931 64 -763 780 -216 12 996 -754 -396 462 -243 42 228
1509B28m66m13K83J531j270j196K543j223j621L447j151k314K701m15j952J835
$$ 228 -238 -651 -368 1163 -107 -1303 1240 17 -1604 1843 692 -1622 1079 664 -1288 547
1525E47O53j685l08J180Jj434J543P23k978J284K000k372P99J063k161Q92J081
$$ 547 1200 -485 -793 387 388 -1046 497 1220 -1758 -474 1526 -846 -47 1016 -1145 -253 828
1542H28q99K97k38l97P45k90K34j50n36N22n37M60P84j637O21Q52k001J550J222
$$ 828 -71 226 -12 -409 336 46 280 130 -406 116 -421 39 823 -814 -193 659 -1342 208 1430
1561A430k511Q42J066j712J008J177j541n92J092N12j381N00J395k552j0L256
$$ 1430 -1081 -239 827 -885 123 1300 -241 -833 259 771 -610 -110 1285 -1267 -1277 1979
1577A979k138j233K527j519r56K339o90q07P00j26k33N4Q66j45j364P98L95j238
$$ 1979 -159 -1392 1135 -384 -1340 999 309 -498 202 76 -157 -103 763 618 -746 52 447 -791
1595g91J580k21j470J033l96j75J501j459m37J662j114j93J289o70o04M43M85
$$ -791 789 568 -902 131 -265 -440 1061 -398 -835 827 -287 -480 809 139 -465 -22 463
1612D63o08m80J711q22j691K299m78k069K701O8k985K080P93j991Q84J028q17
$$ 463 -145 -625 1086 264 -1427 872 394 -1675 1026 1094 -1891 189 982 -1009 -125 903 86
1629H6p63Q46N92j398P46J199k085R8J689j460M08J083j777J56O67l31R37n51
$$ 86 -677 169 761 -637 109 1308 -777 -679 1010 -450 -42 1041 -736 -580 87 -244 693 142
1647A42q82N00J21J50N21j95m46o23P54Q40j311N73Q21k345J003K079k457K64
$$ 142 -740 -240 -119 31 552 357 -89 -712 42 882 -429 144 965 -1380 -377 1702 -755 -491
1665d91J612k084kK055m82j354K76J079j093k4K260j704j627K320k22j372J953
$$ -491 1121 -963 -965 1090 608 -746 -470 609 -484 -508 1752 48 -1579 741 519 -853 1100
1682A100r16j426J345K65l34M5k48M1l35L86P31q01j29L15m07R65k09p34R51r95
$$ 1100 184 -1242 103 368 34 79 -169 -128 -463 -77 654 -147 -276 39 -368 597 388 -346 605 -390
1702c90m08K119q63j369J584r84o65J814j15j296k39J043m1r11J482J0k382J593
$$ -390 -798 1321 458 -911 673 -311 -976 838 723 -573 -812 231 190 -721 761 771 -1611 -18
1720a8J333k125J107R16k284O23J342q81j2J86l6p91J67J473p93j033J245n93
$$ -18 1315 -810 297 1213 -1071 -448 894 13 1 187 151 -640 -473 1000 207 -826 419 -174
1738a74l73J307p06j55K95p53Q65M15j270Q89l7j048P58L62n38J06L3J54p23M29
$$ -174 -547 760 54 -101 194 -559 306 721 -549 340 303 -745 13 375 -163 -57 -24 130 -593 -164
1758a64J129j430m0J613j717k34K261j396r40J712n73p47O32M59o41m80J054j72
$$ -164 965 -465 -505 1108 -609 -843 1418 22 -918 794 221 -526 106 565 -76 -556 498 326
1776C26j318J550P9j702J083K87r00J009q2p07M22j30K18L71o85J07K90o55P38
$$ 326 -992 558 637 -1065 18 305 -595 414 332 -375 47 -83 135 506 -179 -72 218 -437 301
1795C01j22j94j5l41O38j80o71J237n38j228J815j50j450J503k4j279M78Q27l60
$$ 301 179 -15 -30 -371 267 87 -584 653 115 -1113 702 552 -898 605 581 -698 -220 607 247
1814B47p96N32O13j348P42J138j897J46J507j342L8J233j052j68N75j00Q0l01
$$ 247 -549 -17 596 -752 -10 1128 -769 -623 884 -458 -420 813 -239 -407 168 68 148 -153
1832a53L73K26r39P44K44r38P06j60m14O95n46J29M16j104M84Q65j255N51O49
$$ -153 220 446 -493 251 495 -443 263 103 -311 384 -162 -33 383 -721 -237 628 -627 -76 573
1851E73r99K28P24l27m25M6P30q40k35J439r17r59J810p05j125J610k64j034O06
$$ 573 -426 -198 526 199 -226 -180 550 -290 -525 914 -3 -962 848 143 -982 628 364 -670 -64
1870f4K45l35kL55N1p62M17Q17j101L38P00j007L09L50o06M37j25k54M40m73p5
$$ -64 181 -154 -156 199 250 -512 -95 722 -379 -41 659 -348 -39 311 -295 142 17 -237 203 -270 -345
1891c45Q90q40N5N24n02K36j4J09k9n78P94L12j343J018M74j515Q35O36j291M12
$$ -345 545 -295 -240 284 -218 18 4 113 84 -494 300 612 -731 287 761 -754 81 717 -574 -162
1911a62O51o86l00N33J80o08L2J139j106k08J316q25n24J140n64l12P18m19jJ31
$$ -162 489 -197 -497 36 216 -392 -360 779 -327 -535 781 -44 -568 572 8 -304 414 -5 -6 125
1931A25j99K53k54k29P20o09R5L54m52L48k42j78P22o08o3R13j011R7Q73j011
$$ 125 -74 179 -75 -304 416 -193 -98 256 -196 152 -90 -268 454 -154 -217 696 -315 -218 655 -356
1951c56k6Q60o32j44L79K08l30l51O69j00j006J090N7j145J193L15j326R63J7
$$ -356 -382 478 -154 -298 81 289 -41 -392 277 177 -829 261 318 -827 366 681 -645 318 335
1970C35m82J82k2P2k28lM08l60j98O48m48j78N30n32K05L17n32O22j11o45P28
$$ 335 -147 35 13 85 -143 -146 262 -98 -296 352 -96 -274 256 -276 -71 246 -286 336 225 -420 308
1991C08j29m82O67k64n41O90q0j71k37L30K44q56M53P43j150J69J027j179J96
$$ 308 179 -303 364 100 -441 249 169 -2 -239 91 335 -521 -68 675 -475 -306 721 -458 -262
2010b62R25p05j45L95j20M2j31M37l86m98P91l9q69R08k99n08O94k95j68M30l98
$$ -262 663 -42 -187 208 88 130 -1 436 50 -448 343 304 -565 343 44 -464 230 -65 -233 197 -201
2031b01J56J63m09M18P5m55M58j54k8O4l13M53l64k38P77l86n06Q64l69n79J084
$$ -201 -45 118 -291 127 202 -253 205 51 23 87 -226 227 -137 -375 402 16 -490 374 5 -574 510
2052E10m22m98O71j64k41J39L5J19l92L50M02r78M36L79q80N02L87q14M09K32
$$ 510 88 -410 261 97 -144 -5 30 149 -243 107 509 -469 -33 346 -534 -32 355 -459 -50 182
2072A82l67L52j34o5N8j86L72k5l36L98k92o3N11o95L81K15q37O75L23q35L72
$$ 182 -185 167 33 -32 26 -160 212 187 -149 249 -43 -106 405 -290 91 306 -531 144 467 -368 4
2093DK79o85N31P5l13n3Q1L33l29J66L88p47j18J037o76k65Q43q33j62O94k48
$$ 4 283 -402 129 204 -109 -162 -81 252 -77 89 477 -270 -388 649 -27 -292 551 -282 -444 250 2
2114Bj32j0o9O6J71O8N6n45M26K10m01N00j53o47M69%j25O50o18j77M35l73K09
$$ 2 -130 -140 -209 -143 28 96 152 -393 33 243 -158 342 189 -458 11 11 -114 536 -82 -259 176 -197 12
2137A2M26n33r4l2J75K30k07K80j54n48P22R7o76O65l27o01P39J27n52K78Q0k82
$$ 12 438 -95 -189 -221 -46 184 -23 257 103 -445 277 374 -302 363 36 -565 174 301 -251 27 107 -175
2159a75O6J52L58o11j28O50n45K16M82p27J23L97n12L14J64m16K38j58p6L71j77
$$ -175 -109 43 401 -210 -338 312 -233 -17 465 -262 -139 258 -254 60 224 -192 46 -112 -188 183 6
2180Fo7O9j81K76j40p5K88k90M3N24o86J74M80q27L55L59m91J5K34q7j1p3K90
$$ 6 -61 8 -173 103 -37 -112 176 -114 -71 453 -233 -59 421 -406 -51 308 -183 -168 66 -21 -32 -105 185
2203A85k93l19P55k29m86O96m00r5N89k91l30M57j96j58K13K0j10j52O5L30m19
$$ 185 -108 -427 328 99 -387 309 -91 -186 403 112 -218 239 43 -115 98 118 8 -144 -79 251 -168
2224a68P9K71l46J88P6m62N32j46k75M79k05j65L40k29j02L18o5k7k22L3K41k82
$$ -168 -89 182 -164 24 100 -362 170 24 -251 228 23 -142 198 -31 -133 185 120 93 -129 -96 145 -137
2246a37K63J01o78M54M17o88M45l1n53M30Q6r1J39qk99P7J21K50k47k44L99l59
$$ -137 126 227 -451 3 420 -268 177 146 -407 23 109 18 157 149 -150 -73 48 298 51 -193 206 -153
2268a53r5M59k51j43K05j51J74K37l32O9n6q0K54L8j68rk11K25Ln9L63m45j20
$$ -153 -248 211 -40 -183 22 -129 45 282 -50 19 -37 -117 137 175 7 -2 -213 12 15 -44 319 -126 -246
2291b46M99l34q2O09o59q0N47k80Q9J3n2l6j55M40j92k21K99m5m02M37j9k30K36
$$ -246 253 -81 -163 446 -213 -293 254 -26 63 76 24 -12 -167 273 81 -140 159 114 -288 149 130 -100 136
2314A36k01k9K79k03j6J19k29J40ol9R3j19oJ92k01K28q7k88L44K1m40M90k31
$$ 136 -65 -94 185 -18 -34 85 -144 -4 -10 -49 44 -75 -81 111 -90 138 51 -237 107 128 -312 178 -53
2337e3j16K62j35r4K26r3L9L6j11J53k10Q0K82m98K60J54l57J38K52l65P8J40
$$ -53 -169 93 -42 -136 90 -3 36 72 -39 114 -96 -16 266 -232 28 182 -175 -37 215 -150 -72 68
2359F8j48Q0q2J05j12NR8P2j94K16n5j62L22k27o7J47j03k3J76k24Q7P9k02R3
$$ 68 -80 0 -82 23 -89 -84 14 86 -108 108 53 -109 213 -14 -81 66 -37 -60 116 -108 -21 58 -144 -51
2383e1J16q9K6j17J31K2r9K99k69j03L71k73o0L71k94j30J69Lm6rJ24q3j0q4K39
$$ -51 65 -24 2 -115 16 38 -61 238 -31 -134 237 -36 -96 275 -19 -149 20 23 -23 -32 92 9 -1 -85 154
2408A54k06P3Q9k88K76p0k05K88Jj89J69q6J7J38k22J17Mk51J88m2j09J33j06
$$ 154 -52 21 110 -178 98 28 -177 111 112 -77 92 6 23 161 -61 56 60 -191 -3 -45 -154 -21 -127
2431a27J57Q7k87J98J09k07R5O1j78J33J35l38K65O0j31p4k3J94k25L3J59l9k39
$$ -127 30 117 -170 28 137 -70 25 86 -92 41 176 -162 103 163 32 -42 -65 129 -96 -63 96 57 -182
2454a82L86k29NR9l1l4k5l8pmJ4M6j18K24mk22K10q2j54K31j72J3R4n1n9M7k3
$$ -182 204 -25 -20 79 48 14 -11 -49 -56 -60 -46 0 -118 106 102 -120 90 8 -146 85 -87 -74 20 -31 -90 -43 -66
2481f6P3R8j23J5M1n4L4J1J06j39j4N8P5k68J50R3k65K56j5n8R9j18nNjR9j1j10
$$ -66 7 105 -18 -3 38 -16 18 29 135 -4 -18 40 115 -153 -3 90 -175 81 66 8 107 -11 -16 -11 -12 87 76 -34
2509c4K64k60J9J03p5L4O3k53J88M8n8r0L3m1J14N0r9L7jm1J25j18K3j22N8J85
$$ -34 230 -30 -11 92 17 51 114 -139 49 97 39 -51 -18 -59 55 105 6 43 42 1 126 8 31 -91 -33 152
2535A52k30O7J20k86K36O5k50K8J74r5RL9qQ4p4O6j54j12K68L8j56Q9k7j1l3j05
$$ 152 -78 -11 109 -177 59 124 -126 -98 76 -19 -10 29 21 105 31 97 -57 -169 99 137 -19 70 43 32 -1 -106
2561a06m8K49j65Q9R4r1%No9P7k5j11L20k95Q5m0o9J85j14j38K41j74L5J46j09
$$ -106 -154 95 -70 19 113 22 22 27 -42 35 10 -101 219 -76 9 -31 -100 85 -29 -167 74 -100 -65 81 -28
2586b8jJ0R8o1J6n9Q8j09M4N5j34K4J16j18J14K3rj6Kn8lM3p9rl1J19Lj16N1J1
$$ -28 -29 -19 79 18 34 -25 63 -46 -2 53 -81 -57 59 -59 55 78 69 53 55 -3 -6 37 -42 -51 -82 37 40 -76 -25 -14
2616a4o0L6RJ03qk08J78j08N8p3Q1L0p7M9L9M0j52J29q6P0J20j50n0J78k40L9
$$ -14 -74 -38 -29 74 66 -142 36 -72 -14 -87 -6 24 -53 -4 35 75 -77 52 -34 36 156 6 -44 134 -106 -67
2642f7N8j15R1J27j19M2j53J11J18k60J78N1j08J90j23q6K00j11j71J84n3l1N6
$$ -67 -9 -124 -33 94 -25 17 -136 -25 93 -167 11 62 -46 144 21 -65 135 24 -147 37 -16 -47 9
2665Ik0J1NJ37j62k0l2N3k5J48k7j46J51l3j63R8J10o9J1Q7j11N5l3o0J2k3J31
$$ 9 -11 0 5 142 -20 -40 -72 -19 -44 104 77 -69 82 49 -114 -16 94 25 36 123 12 67 34 -26 -14 -37 94
2692I4o1l5l7k8Q5O5j38J07m0N8j03J09r7Q7j52K44p4l0j21R7k3j05L9N5k3J01
$$ 94 33 -2 -39 -67 18 83 -55 52 12 70 -33 76 -21 66 -86 158 84 54 -67 30 7 -98 -59 -4 -27 74
2718G4n5N8j2j14Q4l0m0J27k7M2j1j14Jn2R2L6k5J0M2j23M5n0l9M4K9j30J34l1
$$ 74 19 77 65 -49 35 5 -35 92 65 107 96 -18 -17 -69 23 59 34 44 86 -37 8 -42 -81 -37 -8 -138 -4 -35
2746c5J06j57O7J40j2j18p8J7RO7J1r9J46j10J09q0O0m1Ql0k0N9O4n5LM9j21K00
$$ -35 71 -86 -19 121 109 -9 -87 -70 -61 6 17 -82 64 -46 63 -17 43 2 10 -20 -40 19 83 28 31 80 -41 159
2774A59j2j09l0M3j24j1J29j17O0M4r8Q0N9j18n2J60j27J16o5j5L5m5R9p1n7J39
$$ 159 147 38 8 51 -73 -84 45 -72 -12 32 -66 14 73 -45 -97 63 -64 52 -13 -28 7 -38 61 -10 -67 72
2800G2k7m5M8k0j15J00J5j6N3j23J39j03k4k0N8O5J6k16K00n9j5m8J05q6M9N9
$$ 72 45 0 48 28 -87 13 28 12 65 -58 81 -22 -46 -66 -8 57 73 -143 57 -2 -17 -65 40 -46 3 62
2826F2j21J72j27R9r0P8j22N1p1N7o0J00Q7q5m4M5l1m6J33n9p1M5n0J39l0k0N3
$$ 62 -59 113 -14 85 -5 73 -49 2 -69 -12 -72 28 115 30 -14 31 0 -46 87 28 -43 2 -48 91 61 41 94
2853I4q5L5Oj00Q2k4r2J29q5j5Q2L3m8N4k03J82J1j10Q7l7Ol6k5K4N1q8J62k5
$$ 94 9 44 50 -50 32 8 -84 45 -40 -55 27 60 12 66 -137 45 56 -54 33 -4 2 -34 -59 -35 16 -72 90 65
2881F5j50K32m4j91J26K0p6k1J28q4l7j7J6JN0j4l7j1O6r5O7P3r1K9k1l9P5P7
$$ 65 -85 147 103 -88 38 58 -18 -39 89 5 -32 -49 -33 -32 18 4 -33 -44 22 -73 -6 67 -24 5 -16 -55 20 97
2909I7j51J53j75L5oj8K4n7R6P2j15M9O4n8K0R9k57J22mJ6L7q0Nr9J89l3m8N0
$$ 97 -54 99 -76 -41 -47 -65 -41 -98 -2 70 -45 4 68 10 30 129 -128 -6 -10 6 43 -37 -32 -131 58 25 -23 27
2937B7P0q7m9R9p7m7Q1J7m4J5Ok7J43n7j17N1oj11N8m0Q5JKM5q3J54M5j77Q7o3
$$ 27 97 10 -39 60 -17 -64 17 34 -10 5 11 -16 127 70 -47 4 -2 -113 -55 -95 -10 -9 -7 38 -45 109 154 -23 64 1
2967AjO0Rj06QJ6J40M5j22K1j51L9K02k49J15J33k65J63o1k15K51j23O0j3K3o8
$$ 1 0 60 69 -37 -29 -13 127 172 50 71 -80 -41 161 -88 27 160 -105 58 -3 -218 33 -90 -30 -43 -20 -88
2993h8Q9l4R9p9m3J77j97j9J51p5O1m8j57J39R3r3J2R5j47O0j8l7J24q8J06p6
$$ -88 1 -33 66 -13 -56 121 -76 -95 56 -19 42 -6 -163 -24 69 -24 -12 83 -64 -4 -22 -59 65 -23 83 7
3019Gq6J60o7k7R7j64P2O4j88J07J19j17o6J19j2P7K0r2m3l8J75j39j30J88K6
$$ 7 -79 81 14 -13 84 -80 -8 56 -132 -25 94 -23 -89 30 18 95 115 23 -20 -58 117 -22 -152 36 62
3044F2l2O3q1l6J27j9j62K00J6j28P7j20R0n4o1J07k02J89K5j73R5N5p1J13j62
$$ 62 30 93 12 -24 103 84 -78 122 138 10 87 -33 57 3 -58 49 -153 36 61 -112 -17 38 -33 80 -82
3069h2p4K53j02l2J52k20R6l7J03K4r5mM1%nM3l8n3J13j65J53p0%J02j62O1Rl2
$$ -82 -156 97 -5 -37 115 -105 -9 -46 57 81 -14 -18 23 23 18 61 23 -30 83 -82 71 1 1 103 -59 2 11 -21
3097b1K8J07j44J9P2r2L5j5P1J42k68J9P3j09N2J72k90K60l0j37J9o0K06j18n0
$$ -21 7 114 -30 -11 61 -31 4 -11 60 202 -66 -47 26 -83 -31 141 -149 111 81 -56 -37 -97 109 -9 -59
3122e9K22j00j39K6J38k10K96k22MK77k78k3P3r0Q8j4k8P6j44J26J41k17J21j28
$$ -59 163 63 -76 -50 88 -122 174 -48 -44 233 -45 -68 5 -85 3 -11 -39 37 -107 19 160 -57 64 -64
3146f4PJ75p3j38J27Oj0J0K6j60J72j05m9Q7ql3l6l2R3n8K00r9j89J88j6j63J92
$$ -64 -57 118 45 -93 34 40 30 40 66 -94 78 -27 -76 11 3 -30 -66 -98 -5 -63 137 38 -151 37 21 -142 50
3173E0J1q6Q5l5o4J47l02J59Ko3J55m9J1P0k34J28K58l03P3N5j08K8P5k73K07
$$ 50 61 -25 60 25 -39 108 -194 -35 -33 -96 59 10 21 91 -143 -15 243 -60 13 68 -40 -12 63 -210 -3
3198cl7M1l4m0O2M6q7M4J6q3L04k61N5J98l66J78R5j86p4N9n5J77rK3Kn0m4jO
$$ -3 -40 1 -33 -73 -11 35 -52 -8 8 -75 229 -32 23 221 -145 33 128 -58 -132 -73 -128 49 40 63 65 15 -29 -30 -24
3227b4N9Qm0J07j92KJ34p1N4j6j05R2k8m1O6m0N1P7j39M2KRP9j2k56L30j51j01
$$ -24 35 43 3 110 -82 -80 54 -17 37 21 -84 8 -20 -61 5 -35 16 93 -46 -4 -2 7 86 74 -182 148 -3 -104
3255a04K12rj87J65k4m7k9L0q4M7J89j24j02K16N1l63K11j2j19J78o0k27J88J1
$$ -104 108 99 -88 77 53 6 -23 7 -77 -30 159 35 -67 149 200 -163 48 36 -83 95 35 -192 -4 7
3279Gp8R2o4N0%k2P9k7j8m4n2J32N4j48J31q9j77J77Ol6J14j13j04O7N9N0J6j1
$$ 7 -71 21 -43 7 7 -15 64 37 19 -25 -77 55 109 -39 92 3 -174 3 9 -27 87 -26 -130 -63 -4 46 62 51
3307E1l8m1K7J51k28J8J83k72J66L2m2o2l8J03K4K8n1%p7J56q1q8J27Kk33K17
$$ 51 13 -28 -1 150 -78 -60 123 -149 17 49 7 -55 -93 10 34 62 11 11 -66 90 9 -79 48 50 -183 34
3333C4K4j87K02j36j5Q6n6J75p1o8m4Q5L9N5p8n8J03l22J72Q9j41K26p9n6J40
$$ 34 58 -129 73 -63 -78 8 -48 127 56 -12 -56 29 68 123 45 -13 90 -232 -60 29 -112 114 35 -21 119
3358A19r6r6N1m5P2M7j24R3j00Q5k2q9N0K34j53m1J07j70J17P8j62N5j2m2J67
$$ 119 23 -73 -22 -67 5 52 -72 21 -79 6 -16 -105 -55 179 26 -15 92 -78 39 117 -45 10 -2 -44 123
3383A23j06l9p3L0R8j57J63n8Q9n2J40k49J36O2j15j5J52k79K22mk39K12O7q1
$$ 123 17 -22 -95 -65 33 -124 39 -19 70 18 158 -91 45 107 -8 -23 129 -150 72 68 -171 41 108 27
3407B7Q4k25J29j36J20L2o9K9Q2j1r7J40j69M9J00j26N6q0M3J25j83O3J26j68
$$ 27 111 -114 15 -121 -1 31 -38 -9 73 62 -35 105 -64 -15 85 -41 15 -65 -22 103 -80 -17 109 -59
3431e9J97j28j65J94l4K3M4j61J9J11p6J9J65k71J06k2j2K0o7KJ22q7J6K16k48
$$ -59 138 10 -155 39 5 28 72 -89 -70 41 -35 -16 149 -122 -16 -38 -50 -30 -97 -95 27 -60 -44 172 -76
3456g6J63q9j50J41Nl1K2N3q8m3M7J49j83J35k6n9J9Q1j80lJ38k6nL2o4M8m3n6
$$ -76 87 -2 -152 -11 -6 -37 -15 38 -50 -93 -46 103 -80 55 29 -30 -11 70 -110 -113 25 -1 -6 26 -38 10 -33 -89
3484h9P5P3n9N4p9J25j96J05J67k15L3J53l42R4K35j95L5J18j29PM3l2P7k0N5
$$ -89 -14 59 0 54 -25 100 -96 9 176 -39 -6 147 -195 -101 134 -61 -26 92 -37 -30 13 -19 58 38 93
3509I3o7N4l5j02p9J83l4j68K44p2q7P6j05R7kp3J17m5j2J18j79P2J18l02K68
$$ 93 26 80 45 -57 -136 47 13 -155 89 17 -70 6 -99 -2 -4 -77 40 -5 -17 101 -78 -6 112 -190 78
3534G8l7j78K12q5r1K57n4p3L9j32P1m5l4J10j07m2Q3M0j3J27k37N9J54j89J61
$$ 78 41 -137 75 -10 -101 156 102 29 68 -64 7 -38 -72 38 -69 -111 -28 12 -1 126 -111 -52 102 -87 74
3559G4L2j43J76o3j41N8N6k15R3O2J13k01O3J64q1p0R9l2j31J39j01J67l3r2m4
$$ 74 106 -37 139 76 -65 -7 49 -166 -73 -11 102 -99 -36 128 47 -23 76 44 -87 52 -49 118 85 -7 -51
3584e1J81j89J27j7j60J11r0K5J20k64L17j09j27J62k5m5J29r9l7N9j11l0K05
$$ -51 130 -59 68 51 -109 2 -88 -63 57 -207 110 1 -126 36 11 -34 95 -4 -41 18 -93 -123 82
3607H2jl6m3K2j13o7J78M7j35J15N8o6L8p9q4Q6J2j43J30m6J08o6rQ8q6L7K6%
$$ 82 81 45 2 24 -89 -156 22 69 -66 49 107 41 79 0 -84 2 14 -129 1 -45 63 -3 -12 76 -10 27 53 53
3635E3n6Ok4K7L2j52P2L0j07J94K9r4J32j32o5m1J04K0m5J1N9j42J4J74l03J68
$$ 53 -3 3 -21 6 38 -114 -42 -12 -119 75 104 10 142 10 -55 -96 8 28 -17 -6 53 -89 -75 99 -204 -36
3661c6M0lK3K12k60J05n1l2J1m6N6J03k35K29j43P3M6j00K9J43l20J28J39j03
$$ -36 4 1 24 236 -24 81 30 -2 9 -37 19 122 -113 116 -27 46 92 -8 21 164 -156 -28 111 8
3685HpJ50k51J39Rp0Q5l9n2N6o8J38j1j98K05r8j14K89j86n4J24j11P4Jpnj03
$$ 8 1 151 -100 39 48 -22 63 24 -28 28 -40 98 87 -111 94 -4 -118 171 -15 -69 55 -56 18 19 12 7 -96
3712i6M8J40j73J15l5j32J03J21j35k2O3p2J19j42L9J08j33QJ46K7Mo3o3L0j4
$$ -96 -48 92 -81 34 -1 -133 -30 91 -44 -66 -3 -75 44 -98 -59 49 -84 -76 70 97 101 38 -25 5 -9
3737iP2N8k64J83R1k91K89n1j12k0JO3p8J56n4r8q1J36r5L4K43k29j9J44j75J49
$$ -9 63 121 -143 40 131 -160 129 78 -34 -54 -53 10 -68 88 34 -64 -145 -9 -104 -70 173 -56 -75 69 -106 43
3763D3r2N5j9J24p9p6N3l3J44j63J31rj53Q1R5k08R9Nj25K01j01JR1k15J06J87
$$ 43 -49 6 -13 111 32 -44 9 -24 120 -43 88 79 -74 7 102 -106 -7 -2 -127 74 -27 -26 65 -150 -44 143
$$ [...]
8191a0
##END NTUPLES=NMR FID
##END=
