##TITLE=1H_DE-80H_X3
 200.13MHz, d2o
 8 sc
 
 19ns.26.2.2025
##JCAMPDX= 6.0         $$ Bruker NMR JCAMP-DX V2.0
##DATA TYPE= NMR FID
##DATA CLASS= NTUPLES
##ORIGIN= UXNMR, Bruker Analytische Messtechnik GmbH
##OWNER= pz
$$ XWIN-NMR		Version 3.5
$$ Fri Apr 25 11:04:10 2025 Russian Standard Time (UT+4h)  Yarkov@DPX200
##.OBSERVE FREQUENCY= 200.1313
##.OBSERVE NUCLEUS= ^1H
##.DELAY= (6, 6)
##.ACQUISITION MODE= SIMULTANEOUS
##.ACQUISITION SCHEME= undefined
##.AVERAGES= 8
##.DIGITISER RES= 18
##SPECTROMETER/DATA SYSTEM= spect
##.PULSE SEQUENCE= zg30
##.SOLVENT NAME= DMSO
##.SHIFT REFERENCE= (INTERNAL, DMSO, 0, 14.3821)
##AUDIT TRAIL= $$ (NUMBER, WHEN, WHO, WHERE, WHAT)
$$ ##TITLE= Audit trail, XWIN-NMR		Version 3.5
$$ ##JCAMPDX= 5.01
$$ ##ORIGIN= Bruker BioSpin GmbH
$$ ##OWNER= Yarkov
$$ C:/Bruker/XWIN-NMR/data/yarkov2/nmr/H-C/1/audita.txt
$$ ##AUDIT TRAIL=  $$ (NUMBER, WHEN, WHO, WHERE, WHAT)
(   1,<2025-04-25 11:02:51.34 +0400>,<Yarkov>,<DPX200>,
      <created by zg, POWCHK disabled, PULCHK disabled
       configuration hash MD5:
       00 E9 B6 7A A2 85 ED C7 34 08 36 98 17 FE 4E 26
       data hash MD5: 16K
       94 7A 93 DF CB 7A 64 65 24 6E EC B7 C4 03 43 B8>)
$$ ##END=
$$ 
$$ hash MD5
$$ 38 1B 84 B5 7C 84 FE 8C D5 C5 57 A7 4D 8C 13 C8
##$RELAX= 
##$RELAX= 
##$RELAX= 
##$RELAX= 
##$RELAX= 
##$RELAX= 
$$ Bruker specific parameters
$$ --------------------------
##$DU= <C:/Bruker/XWIN-NMR>
##$EXPNO= 1
##$NAME= <H-C>
##$PROCNO= 1
##$TYPE= <nmr>
##$USER= <yarkov2>
##$AMP= (0..31)
100 100 100 100 100 100 100 100 100 100 100 100 100 100 100 100 100 100 
100 100 100 100 100 100 100 100 100 100 100 100 100 100 
##$AQSEQ= 0
##$AQ_mod= 1
##$AUNM= <au_zg>
##$AUTOPOS= <>
##$BF1= 200.13
##$BF2= 200.13
##$BF3= 200.13
##$BF4= 200.13
##$BF5= 200.13
##$BF6= 200.13
##$BF7= 200.13
##$BF8= 200.13
##$BYTORDA= 1
##$CFDGTYP= 0
##$CFRGTYP= 5
##$CHEMSTR= <none>
##$CNST= (0..31)
1 1 145 1 1 1 1 1 1 1 1 1 1 1 1 1 1 1 1 1 1 1 1 1 1 1 1 1 1 1 1 1 
##$CPDPRG= <>
##$CPDPRG1= <>
##$CPDPRG2= <>
##$CPDPRG3= <>
##$CPDPRG4= <mlev>
##$CPDPRG5= <mlev>
##$CPDPRG6= <mlev>
##$CPDPRG7= <mlev>
##$CPDPRG8= <mlev>
##$CPDPRGB= <>
##$CPDPRGT= <>
##$D= (0..31)
0 0.7 0 0 0 0 0 0 0 0 0 0.03 0 0 0 0 0 0 0 0 0 0 0 0 0 0 0 0 0 0 0 0 
##$DATE= 1745564570
##$DBL= (0..7)
120 120 120 120 120 120 120 120 
##$DBP= (0..7)
150 150 150 150 150 150 150 150 
##$DBP07= 0
##$DBPNAM0= <>
##$DBPNAM1= <>
##$DBPNAM2= <>
##$DBPNAM3= <>
##$DBPNAM4= <>
##$DBPNAM5= <>
##$DBPNAM6= <>
##$DBPNAM7= <>
##$DBPOAL= (0..7)
0.5 0.5 0.5 0.5 0.5 0.5 0.5 0.5 
##$DBPOFFS= (0..7)
0 0 0 0 0 0 0 0 
##$DE= 6
##$DECBNUC= <off>
##$DECIM= 32
##$DECNUC= <off>
##$DECSTAT= 4
##$DIGMOD= 1
##$DIGTYP= 9
##$DL= (0..7)
0 120 120 120 120 120 120 120 
##$DP= (0..7)
150 150 150 150 150 150 150 150 
##$DP07= 0
##$DPNAME0= <>
##$DPNAME1= <>
##$DPNAME2= <>
##$DPNAME3= <>
##$DPNAME4= <>
##$DPNAME5= <>
##$DPNAME6= <>
##$DPNAME7= <>
##$DPOAL= (0..7)
0.5 0.5 0.5 0.5 0.5 0.5 0.5 0.5 
##$DPOFFS= (0..7)
0 0 0 0 0 0 0 0 
##$DQDMODE= 0
##$DR= 18
##$DS= 0
$$ [...]
##$SUBNAM2= <"">
##$SUBNAM3= <"">
##$SUBNAM4= <"">
##$SUBNAM5= <"">
##$SUBNAM6= <"">
##$SUBNAM7= <"">
##$SUBNAM8= <"">
##$SUBNAM9= <"">
##$SW= 18.0517328524113
##$SWIBOX= (0..15)
0 0 2 0 0 0 0 0 0 0 0 0 0 0 0 0 
##$SW_h= 3612.71676300578
##$TD= 16384
##$TD0= 1
##$TE= 0
##$TE2= 300
##$TE3= 300
##$TEG= 300
##$TL= (0..7)
0 120 120 120 120 120 120 120 
##$TP= (0..7)
150 150 150 150 150 150 150 150 
##$TP07= 0
##$TPNAME0= <>
##$TPNAME1= <>
##$TPNAME2= <>
##$TPNAME3= <>
##$TPNAME4= <>
##$TPNAME5= <>
##$TPNAME6= <>
##$TPNAME7= <>
##$TPOAL= (0..7)
0.5 0.5 0.5 0.5 0.5 0.5 0.5 0.5 
##$TPOFFS= (0..7)
0 0 0 0 0 0 0 0 
##$TUNHIN= 0
##$TUNHOUT= 0
##$TUNXOUT= 0
##$USERA1= <user>
##$USERA2= <user>
##$USERA3= <user>
##$USERA4= <user>
##$USERA5= <user>
##$V9= 5
##$VALIST= <valist>
##$VCLIST= <CCCCCCCCCCCCCCC>
##$VD= 0
##$VDLIST= <DDDDDDDDDDDDDDD>
##$VPLIST= <PPPPPPPPPPPPPPP>
##$VTLIST= <TTTTTTTTTTTTTTT>
##$WBST= 1024
##$WBSW= 4
##$XGAIN= (0..3)
0 0 0 0 
##$XL= 0
##$YL= 0
##$YMAX_a= 40635
##$YMIN_a= -99700
##$ZGOPTNS= <>
##$ZL1= 120
##$ZL2= 120
##$ZL3= 120
##$ZL4= 120
##$ABSF1= 10
##$ABSF2= 0
##$ABSG= 5
##$ABSL= 3
##$ALPHA= 0
##$AQORDER= 0
##$ASSFAC= 0
##$ASSFACI= 0
##$ASSFACX= 0
##$ASSWID= 0
##$AUNMP= <proc_1d>
##$AZFE= 0.1
##$AZFW= 0.1
##$BCFW= 1
##$BC_mod= 2
##$BYTORDP= 1
##$COROFFS= 0
##$CY= 83.5205535888672
##$DATMOD= 1
##$DC= 2
##$DFILT= <>
##$DTYPP= 0
##$F1P= 10.8118882576601
##$F2P= -7.23987719738617
##$FCOR= 0.5
##$FTSIZE= 0
##$FT_mod= 4
##$GAMMA= 1
##$GB= 0.15
##$INTBC= 1
##$INTSCL= 1
##$ISEN= 128
##$LB= 0.25
##$LEV0= 0
##$LPBIN= 0
##$MAXI= 10000
##$MC2= 0
##$MEAN= 0
##$ME_mod= 0
##$MI= 1.114404
##$NCOEF= 0
##$NC_proc= 0
##$NLEV= 6
##$NOISF1= 3.799351
##$NOISF2= 2.8
##$NSP= 1
##$NTH_PI= 0
##$NZP= 0
##$OFFSET= 14.38212
##$PC= 1
##$PHC0= -843.2792
##$PHC1= 19.93371
##$PH_mod= 1
##$PKNL= yes
##$PPARMOD= 0
##$PSCAL= 0
##$PSIGN= 0
##$REVERSE= no
##$SF= 200.129724274929
##$SI= 16384
##$SIGF1= 3
##$SIGF2= 2
##$SINO= 400
##$SIOLD= 16384
##$SREGLST= <1H.CDCl3>
##$SSB= 0
##$STSI= 0
##$STSR= 0
##$SW_p= 3205.1282051282
##$SYMM= 0
##$S_DEV= 0
##$TDeff= 0
##$TDoff= 0
##$TI= <>
##$TILT= no
##$TM1= 0
##$TM2= 0
##$TOPLEV= 0
##$USERP1= <user>
##$USERP2= <user>
##$USERP3= <user>
##$USERP4= <user>
##$USERP5= <user>
##$WDW= 1
##$XDIM= 8192
##$YMAX_p= 0
##$YMIN_p= 0
$$ End of Bruker specific parameters
$$ ---------------------------------
##NTUPLES= NMR FID
##VAR_NAME=  TIME,          FID/REAL,        FID/IMAG
##SYMBOL=    X,             R,               I
##VAR_TYPE=  INDEPENDENT,   DEPENDENT,       DEPENDENT
##VAR_FORM=  AFFN,          ASDF,            ASDF
##VAR_DIM=   8192,          8192,            8192
##UNITS=     SECONDS,       ARBITRARY UNITS, ARBITRARY UNITS
##FACTOR=    0.0002768,     1,               1
##FIRST=     0,             0,               0
##LAST=      2.2672688,     0,               0
##MIN=       0,             -99700,          0
##MAX=       2.2672688,     40635,           0
$$ Real data points
##PAGE= N=1
##DATA TABLE= (X++(R..R)), XYDATA
$$ [...]
1819b28N5J56J59j11k94k6L97R7Pk16JJ5m1n6%K7J93r0l22L16K3R6k11n9L33j13
1845A08l1k49k09J80K98O6r5m61N13m3j69K08j67K15j02k75K15K1L3p6j44J75
1867A1J29j30o5rJ21Pl72L03K24k19r9M8M9J14N9k11k11K12K2J81l24J79l7N1
1891C3k1j90K96lj70l4J92Q7l37J60ql3J60j0k18J55K29j91K5k44m2K61j55L3
1915b5k84M41J70m62K40m9j0j68R0Q0R1J37p2k76K79j1k09j15L8R7J20m76J17
1938b57J10J89j29N9oJ2M7L6O2k92M41N7m29n1M8J76l1j18j20m8O9J26j63N7L86
1963B31l6m5k44J19j20K43l29O6K43m2j91p2L16j85K37l97M55k91J79m07M8K77
1985E5Mo6K02J0l10M82n51J09o1L01M5m34K70j5K40l26j95K39N4N8k41k28N04
$$ plain form
1819 -228 -173 -17 142 31 -263 -289 108 205 212 -4 -3 12 -29 -85 -85 -58 135 45 -277 39 62 158 -53 -112 221 108
1845 108 77 -172 -381 -201 97 163 68 -393 120 77 -92 116 -51 164 62 -213 2 23 56 -20 -164 11
1867 11 140 10 -55 -64 57 64 -308 -5 219 0 -99 -51 -2 112 171 -40 -251 -39 -17 164 -160 19 -18 33
1891 33 12 -178 118 115 -55 -89 103 190 -147 13 5 -28 132 122 -96 59 288 97 122 -122 -164 97 -58 -25
1915 -25 -309 132 302 -160 80 31 21 -147 -57 23 114 251 179 -97 182 171 -38 -153 -115 -18 102 -374 -257
1938 -257 -147 42 -87 -28 -34 -22 25 61 123 -169 272 329 -100 -151 -103 73 42 -76 -196 -244 -175 -49 -212 -155 231
1963 231 195 150 -94 25 -95 148 -181 -115 128 86 -105 -177 139 -46 191 -206 249 -42 137 -270 -222 55
1985 55 59 -7 195 205 -105 377 -174 -65 -126 175 220 -214 56 41 281 -45 -240 -1 53 111 -130 -358 146
2008A46m92N39j95k27L60l20k7J06j05L42m2l34r0K87N03n79J71kj57r6K35J67
2030A90j12MJ62l25JK75j1j98j97J77O3k4j67K78R1r1j81p2%L7L7J39j99K43J03
2055B23l80r7K38J23k01J24P2k43Q9k62K69j3J23k90J19j10M13l02J69j10k5J17
2077D6j18J16p4k2J36r5j31J66O6k01P9k8L39m4l76K86m6K61j04k93Rj2k7K18
2101A51m5j88j20M59k41J63n8k50K69k61N1J77o8k78J2L2L3L49k66j22L1r8J15
2124a53j46N19p9J57l72Q3k80L49j59n2j15K72J5l0J6q3R6q5l0J03%L6j67M26
2148C21k43j97J54J08j32M5o8q8m3j89M19k18J45j7m5l4R8n0N8l28L77K5j3p8
2172GK86n8m20M02r4n8j89N8o1L81l94J66j44K80j47N6M8r5j21J27P3n3j61Q8
$$ plain form
2008 146 -346 193 -2 -229 131 -189 -216 -110 -215 127 85 -249 -339 -52 451 -128 43 41 -116 -212 23 190
2030 190 78 82 244 -81 -80 195 184 -14 -211 -34 29 5 -162 116 207 116 -65 -137 -137 -100 -63 76 -123 120 223
2055 223 -157 -254 -16 107 -94 30 102 -141 -52 -314 -45 -58 65 -225 -106 -216 197 -105 64 -46 -71 46
2077 46 -72 44 -30 -52 84 -11 -142 24 90 -111 -32 -60 279 235 -141 145 99 360 256 -37 -28 -40 -67 151
2101 151 106 -82 -202 257 16 179 121 -129 140 -121 -70 107 39 -239 -227 -195 -162 187 -79 -201 -170 -268 -153
2124 -153 -299 220 141 298 -74 9 -271 78 -81 -133 -248 24 39 9 25 -58 38 -47 -77 26 26 62 -105 321
2148 321 78 -119 35 143 11 56 -12 -100 -143 -332 87 -131 14 -3 -48 -82 16 -34 24 -304 73 98 85 7
2172 7 293 235 -185 217 123 65 -124 -66 -127 254 -140 26 -118 162 15 71 119 24 -97 30 103 50 -111 -23
2196b3K50j93j3J39p5p0L01m11K27j17j37L63l95J26J86l14J39Q5l0m0q2K54p0
2219A00j62J22J13k10K16L7k73J77L5p3Nk34K07j2P2j37k68L15j39PJ83p6N2j03
2243d6l1K92m1k92J94K7j16JL1l34M43k20J15Q9j45K23o2N2O4j29L0K5k92LK27
2268A08L0j33j08J86P7r4J00k89K29l07M04j08j98M86n34J04Q3j89L25P6j29l11
2290a92J31jj1q2L47k87J71k26K22j24J69l0n40O09j81q7K24j84j0J78r1J08p9
2313C4j73L2J36k20J96j56O7Kj92J40J13ql2N2p6k60N73j28R9J4k33L29l04j30
2337a25J44O4j17O2m0j43R2n0J03n8L05l78O8J20p9m9Rl2k03K78n1K10j9l19L34
2362A26r3j29m9J75k81L16k75p2M60j45J23j89Rk10J30K32j44J15l4o8L7R5k73
$$ plain form
2196 -23 227 34 21 160 85 15 316 -95 132 15 -122 241 -154 -28 158 -156 -17 68 38 -2 -84 170 100
2219 100 -62 60 173 -37 179 216 -57 120 155 82 87 -147 60 48 120 -17 -285 30 -109 -102 81 5 57 -46
2243 -46 -77 215 174 -118 76 103 -13 -12 19 -315 128 -92 23 112 -33 190 128 180 244 115 145 170 -122 -119 108
2268 108 138 5 -103 83 160 66 166 -123 106 -201 203 95 -103 383 -151 -47 36 -153 172 248 119 -192
2290 -192 -61 -62 -73 -155 192 -95 76 -150 72 -52 117 87 -453 156 -25 -112 112 -72 -82 96 5 113 34
2313 34 -139 -107 29 -191 5 -151 -84 -82 -274 -134 -21 -29 -61 -9 -85 -345 228 100 199 213 -20 309 5 -125
2337 -125 19 83 -34 28 -12 -155 -63 -113 -10 -68 237 -141 -73 47 -32 -81 -72 -104 -307 -29 -80 130 111 -208 126
2362 126 33 -96 -145 30 -251 65 -210 -282 178 33 156 -33 -24 -234 -104 128 -16 99 65 -3 34 129 -144
2385a44L11m66L62j97L54k50k00L84j18l8j21J05K16l87K10m56J99J62J19n6k2
2406c3j01L3j46J64J72j0l95J59P8K88l54J26J79j66K03L6j72j22K12o1K2m5J05
2429A72k43J76q3o2lj05l5J49J89o7L1K50l22j19k3K62j50j26K15m42N19J7l90
2452a90L41k76K16k96oM06j02k53R1O3J3l00L36q9N7M0l43P1o3L31L6r3K93l27
2476d4J83k73J11J1k4m1On0k3J52QK2J85m39O07m54K5l6J8kJ51J47k63l41K92
2501g2K04k08K45j93n9J90o1j95L71k32r6L6J38K21k24J0L1q5j32K75m08K91Q5
2524A32j56k08Q6L10l80K49J48O7k50K38k29j09K4PR3k35K2J79j6j70L13j40k00
2547b25J10K38p8k53J47N4L6n5j6J43k40o8J29R4j43rN0J82j27n2k86M20j13j23
$$ plain form
2385 -144 167 -299 63 -134 220 -30 -230 154 36 -2 -123 -18 198 -189 21 -435 -236 -74 45 -11 -33
2406 -33 -134 -101 -247 -83 89 79 -316 -157 -79 209 -145 -19 160 -6 197 233 61 -61 151 90 112 67 172
2429 172 -71 105 22 -40 -43 -148 -183 -34 155 88 119 369 47 -72 -95 167 17 -109 106 -336 183 200 -190
2452 -190 151 -125 91 -205 -211 195 93 -160 -69 -6 7 -293 43 -46 11 51 -292 -221 -284 47 83 -10 283 -44
2476 -44 139 -134 -23 -12 -36 -77 -71 -121 -144 8 16 38 223 -216 391 -63 -38 -74 -56 -58 93 240 -23 -364 -72
2501 -72 132 -76 169 -24 -83 107 46 -149 222 -10 -106 -70 68 289 65 75 106 21 -111 164 -244 47 132
2524 132 -24 -232 -146 164 -216 33 181 248 -2 236 7 -102 -78 -71 22 -213 -191 -12 -28 -198 115 -25 -225
2547 -225 -115 123 45 -208 -61 -7 29 -26 -42 101 -139 -207 -78 16 -127 -136 -86 96 -31 -83 -369 51 -62 -185
2571a85L0Q0k45J65k7O23m08j5k32K14r7K25n6k52L60l46K54q0K06l24K64k60
2593a06K42kJ00m01J75k76M74l42K60J54k02R0m5R5l94P8K5J00Rk16J82j6O0j63
2617a19p0J41K87j73k3k05J39J21Lj76K05k60Q7K03k62J81l2l48M26j86M6j9J06
2640G2k30L3L24k25K14r0o0o2J71o1l09K56J4l14M33r5k49K62j45J80N8k00L57
2663C34m05L8J34r9oJ44k4j82J21j02J46o5J12K13j92j65L5j26j81Q6P0J21p9
2686g2J62Ok48K22j27J12j64J07J40j35m7J69mO3k67o8N1J89k96J63K94j7k43
2709a0r0M08k07J07l56L52j72l1k73L37q0J57J01l49K7j07m2L14j98J88j68LJ16
2732B7R8j30M6J18k10j17L14k59kJ79k3K09k04k8j59J2N4K55k06R3k25m0L86o2
$$ plain form
2571 -185 -155 -75 -320 -155 -182 441 33 18 -214 0 -97 128 72 -180 180 -166 88 8 214 -110 154 -106
2593 -106 136 134 234 -167 8 -268 206 -136 124 278 76 166 121 216 -178 -100 -75 25 34 -182 0 -16 44 -119
2617 -119 -189 -48 239 66 43 -162 -23 98 101 -75 130 -130 -43 160 -102 79 47 -301 125 -61 -15 -34 72
2640 72 -158 -125 199 -26 188 98 38 -24 147 86 -223 33 47 -267 166 71 -178 84 -61 119 177 -23 334
2663 334 -71 -33 101 2 -4 140 116 -66 55 -47 99 34 146 359 167 2 37 -89 -270 -184 -114 7 -72
2686 -72 90 96 -152 70 -57 55 -109 -2 138 3 -44 125 121 184 -83 -151 -100 89 -207 -44 250 233 -10
2709 -10 -100 308 101 208 -148 204 32 1 -272 65 -15 142 243 -106 -79 -186 -228 86 -112 76 -92 -89 27
2732 27 125 -5 41 159 -51 -168 146 -113 -115 64 41 250 46 18 -141 -129 -75 180 -26 67 -158 -198 188 126
2756A26M8J46l69q1m3J87m0L4k11K43j86MJ46O8J28k76K63o0P2l09j26M54l07
2779h9K74l21R6J7k55M36j53K32j66m23N30k87J21J08j34O0j19r9K2j37M06j78
2801e9K9J90K6l77K53r0k3l07r4M62p4J11m13M13Q4Qk33l20N17k16J18K57n30
2824b68K5K74N5k38Q6J31q1j50J35M5J30q7l5j01o9K72j12k8Qj41M1J31J5k13
2848a75K88q6p5k61O26l17K1L4j5K32l33j28J87J25l02j8N37j03n2k86J14k03
2870a90K57k91J48Q9M8k6k57K26k10J79J97r8m4j60M2R5R2j71k93K08J9MN2J4
2894g0K7R8N6k51K91k14J54M9l09L28o6j11K9M7q6j63J73k4J09P1m39K68J44j72
2918f1j07L40j98P9k65L44j78K21k40J74j70L16k35j56M63k74j3K24j20j96L41
$$ plain form
2756 126 174 320 -49 -130 -173 14 -26 8 -203 40 -146 -142 4 72 200 -76 187 127 199 -110 -236 218 -89
2779 -89 185 -136 -40 -23 -278 158 5 237 71 -352 178 -109 12 120 -14 46 -73 -172 -150 -287 119 -59
2801 -59 -30 160 186 -191 62 -28 -51 -358 -452 10 -64 47 -366 47 131 139 -94 -414 103 -113 5 262 -268
2824 -268 -243 31 86 -152 -66 65 -16 -166 -31 14 144 57 22 -79 -148 124 12 -16 -8 -149 -108 23 38 -175
2848 -175 113 27 -48 -309 317 0 21 55 40 272 -61 -189 -2 123 -179 -197 340 237 185 -101 13 -190
2870 -190 67 -224 -76 13 61 35 -222 4 -206 -27 170 72 28 -132 -90 5 97 -74 -367 -159 -140 -136 -84 -70
2894 -70 -43 55 111 -140 151 -63 91 140 -169 159 93 -18 11 58 -28 -191 -18 -42 67 138 -301 -33 111 -61
2918 -61 -168 172 -26 53 -212 132 -46 175 -65 109 -61 255 20 -136 327 53 40 264 144 -52 289
2939B89m18J63j50J92o3n5o6J09j43J87j8J05o2r2R8L4j78lJ11n2J55k17k43K61
2963e6J08j2j36J83l18K98k48K00j19K07j03K35j02k02m0K04J39j93j49J34j01
2984g1K04k34oL23l83kK45Q2n3j69L20K6n87O4J59K45k68P7J0O3J90j85k04k0
3008a74K48K28m88M57j83J2m6N4J36r0M3k18K25j48K6J00j91q2j9L2M5mJ91J79
3032C33l14k7K03m48L21j52J80j68jo7K13k52J99j83R3J73m76J94P5J43p4J20
3054H5j35L34m67L19Ok65K77Q8m06K08j89L05J81k66Q2o9M8J01k61j93M00K42
3076D25l99q3P3n4M1N4o5L68n32lK67K4k41P3J9N0J26k23j46J04L56k00p3K1R3
3101G5k30K90o5j4K26j60J4j91L3n6j55K03j0k52K62j16J0k0J45p6J48j8o1Q8
$$ plain form
2939 289 -129 34 -116 76 13 -42 -108 1 -142 45 27 132 70 -22 76 110 -68 -71 40 -12 143 -74 -317 -56
2963 -56 52 40 -96 87 -231 67 -181 19 -100 107 4 239 137 -65 -105 99 238 45 -104 30 -71
2984 -71 133 -101 -107 216 -167 -169 76 158 105 -64 256 282 -305 -241 -82 163 -105 -28 -18 45 235 50 -154 -174
3008 -174 74 302 -186 271 88 100 54 108 244 154 197 -21 204 56 82 182 -9 -91 -110 -78 -33 -37 154 333
3032 333 19 -8 195 -253 68 -84 96 -72 -73 -140 73 -179 20 -163 -70 103 -373 -179 -104 39 -35 85
3054 85 -50 284 -183 136 142 -123 154 242 -164 44 -145 160 341 75 157 88 136 237 -24 -217 183 425
3076 425 26 -57 16 -38 3 57 -8 360 -172 -175 92 116 -125 -52 -33 17 143 -80 -226 -122 234 34 -39 -18 75
3101 75 -155 135 70 56 282 122 136 -55 -22 -78 -233 -30 -40 -292 -30 -146 -136 -156 -11 -87 61 43 -18 70
3125G0N8k63J76n0k50R1J49K62l27j6R9j04J43J36m66M92k74r3L28k09K06l3r3
3148C2j6j71K44k37K04K6k28L28m27J16P7J68k7k66K52q3J31l0L0m6j87L1L9K
3172c8J59J01j50J15m0k40j51L99l51K81J52m26L56L8k61K23J1j75J08j02J66
3193A75k15l2K4M0K05k59J54m4j93J79m3M2J29j58k4j8J1j78R3m3k5N3L07l62
3217a82J65K75j29j91o1P4R5J2r2M8j05J62j88M56l78Q7p8n0K27k68O1R3Rk72
3241b30L91k98K62N3j64J20j73L11m1Om06L6P2K14J1m6k65J62K2J68j26j5l79
3264c15O32j86j51J59j45j31k0M72m85L15j32m1J8nJ48j83j12P2J41R9o9q3oJ87
3288A79k84k4J74p8K80j29k36J3M03k61j58P2J90m6O5m69L86J4k53k2J57N5j17
$$ plain form
3125 70 128 -135 41 -9 -259 -168 -19 243 -84 -100 -1 -105 38 174 -292 200 -74 -167 161 -48 158 125 32
3148 32 16 -155 89 -148 56 82 -146 182 -245 -129 -52 116 89 -177 75 -8 123 93 123 77 -110 -79 -40 -38
3172 -38 121 222 72 187 147 -93 -244 155 -196 85 237 -189 167 205 -56 167 178 3 111 9 175
3193 175 -40 -72 -48 -8 197 -62 92 48 -145 34 -9 33 162 4 -20 -38 -27 -205 -112 -155 -180 -127 180 -182
3217 -182 -17 258 129 -62 -123 -49 46 58 -34 14 -91 71 -117 339 -39 48 -30 -80 147 -121 -60 33 42 -230
3241 -230 161 -137 125 178 14 134 -39 272 231 237 -169 -133 -61 153 164 118 -147 15 37 205 79 64 -315
3264 -315 317 131 -20 139 -6 -137 -157 315 -170 145 13 -28 -10 -15 133 -50 -162 -90 51 150 81 -2 -8 179
3288 179 -105 -129 45 -33 247 118 -118 -105 298 37 -121 -49 141 95 160 -309 77 91 -162 -184 -27 28 -89
3311h9L27J30j93l37J73j04J44j92J99N7k63J41J20j2l9l5l37K83J8J41k02K48
3333A78j00J06q4j60M4M7l51L62J24p3K1p3J13q7j78J87j42J10k35K98J02J5j65
3356E9jm8j13J10r7L42k39J92J5l82K84q2j77q5J87J49k71j11K07L52k50K0k52
3379a91K68K09j33j08j19J55k39L17J95l95K1J24k35J41j9K92k99N9j0J32j08
3400E7m8k3O8q3K11p18O07q6M5p7p2K5L08k0l08K13j62J42l6l12L21k90L13p7
3424bJ75R2l27k73L35L1P7j74K80m64K90K1k31K29K1k36K65J53n04N0k5K93j72
3447i6M8J14j91M3J11j08R7j56j76L60K6j96J17J22J24ll13K20j53j93j5J75L1
3470a2L2k59J11MP5j27K84j38j53j01K10M45m57M1k79M01l0m8m1L4o1J88P6k83
$$ plain form
3311 -89 238 368 175 -162 11 -93 51 -141 58 115 -148 -7 113 101 62 27 -310 -27 -9 132 -70 178
3333 178 78 184 100 -60 -16 31 -320 42 166 93 114 41 154 67 -111 76 -66 44 -191 107 209 224 59
3356 59 58 10 -103 7 -90 252 13 205 220 -162 122 40 -137 -222 -35 114 -157 -268 -61 291 41 61 -191
3379 -191 77 286 153 45 -74 81 -158 159 354 -41 -20 104 -131 10 -9 283 -16 43 33 165 57
3400 57 9 -14 54 -29 182 -536 71 -15 30 -47 -119 -94 214 194 -114 99 -63 79 43 -269 52 -238 75 -2
3424 -2 173 265 -62 -335 0 31 108 -66 214 -250 40 61 -170 59 80 -156 109 262 -242 -192 -217 76 -96
3447 -96 -48 66 -125 -82 29 -79 18 -138 -314 46 72 -124 -7 115 239 236 -77 143 -10 -203 -218 -43 -12
3470 -12 20 -239 -128 -124 -49 -176 108 -30 -183 -284 -74 371 -86 -45 -324 77 47 -1 -42 -8 -69 119 195 -88
3494h8J21m23N22m24L23M8k34q5L30j27j72R9K23k32o0K59m5j47JK0j38R3Jj6
3518a51J84j41q4Q8K90k67J38l7K69j69k31J50J03j84J98k5k15K2P6k79N00l29
3540i4O3L9k19J36K03Nj42M0J9jl62L13j12rk3J21LM9p3K11J1j43J62k28K1J38
3566A28j02k86M23k55K71m13L28r1Qpn5kJ21j6k04L22n6j43j11K37l64K18j06
3589a55Q4n5K65k34j1K03J09l07K25q6n3j86Q0K15k08K16J14k33Q2m02J95K25
3611H3k03o3J39p0j82K42L6N4j18K71k1j40k31J30Ro8J12K8K22k92j5K14n3j37
3635e3L9M7N9j05J75k49J39M2j99K30j93O8P5M3J48k76j18J32L0K2k36J51J51
3658A22L4k20R8J99k4j33j81L6p2j04J41n8K67p7J53p6k7J4k59K78k57l4J73Q5
$$ plain form
3494 -88 33 -390 132 -292 31 79 -155 -240 90 -37 -209 -110 113 -119 -179 80 35 -112 -111 -91 -229 -136 -135 -151
3518 -151 33 -108 -192 -104 186 -81 57 20 289 120 -111 39 142 -42 156 131 -84 -62 14 -265 235 -94
3540 -94 -31 8 -211 -75 128 133 -9 31 50 49 -313 0 -112 -121 -144 -23 -20 29 -44 167 178 35 197 -31 -10 128
3566 128 26 -260 163 -92 179 -234 94 3 11 4 -51 -53 68 52 -152 170 114 -29 -140 97 -267 -49 -155
3589 -155 -71 -126 139 -95 -106 97 206 -101 124 38 -15 -201 -121 94 -114 102 216 -17 65 -337 -142 83
3611 83 -120 -183 -44 -114 -296 -54 -18 36 -82 189 168 28 -203 -73 -64 -132 -20 8 230 -62 -77 137 84 -53
3635 -53 -14 33 92 -13 162 -87 52 94 -105 125 -68 0 75 118 266 -10 -128 4 34 56 -180 -29 122
3658 122 156 -64 34 233 209 76 -105 -69 -141 -245 -104 -162 105 28 181 105 78 92 -167 111 -146 -180 -7 78
3682G8j4q3K17k96J39j07j16L63k10o7N1K96l97J29K35n32K85P1K04j62l5o6J08
3705I1l68N75p2n9l50p6J30J69l48N97j53j74J42l77L13l54L89J49j48L7k27J99
3727H5j05Q1J5j48p4M0nJ30j91N4K20j36k22K00J04j38J46L01m38J18l5N7Q9p4
3751G4k46K76mk4k26J55j96j20N84j30l00o6K68j03j0L12l13J01k83Q6J04rj35
3774b05J4K02j82J74k82L07J6P8J24l09j72L46m21L06rm0J64k09n2L74j20N5j41
3797A8k43K76j64j18L31N7mLk49J18j52J07M40k37P3k26k59L99j00J00q3l9q0
3820c2K85m16J52M1N5j48l2M91m91j49N29J45l90M7j29j37L83j33j67L89l23r9
3842a29K7N8k1k58M33k87n9K9K6J86k9M0j21M4J1r7J76L5J33m14J57K15j37p9
$$ plain form
3682 78 64 -19 198 -98 41 -66 -182 181 -29 -96 -45 251 -146 -17 218 -314 -29 42 246 84 49 -17 91
3705 91 -277 298 226 167 -183 -259 -129 40 -308 289 136 -38 104 -273 40 -314 75 224 76 113 -114 85
3727 85 -20 61 76 -72 -146 -106 -111 19 -172 -118 102 -34 -256 -56 48 -90 56 357 -81 37 2 59 148 74
3751 74 -172 104 100 76 -150 5 -191 -311 273 143 -157 -223 45 -58 -68 244 -69 32 -251 -165 -61 -70 -205
3774 -205 -191 11 -171 3 -279 28 44 122 246 -63 -235 111 -310 -4 -13 -53 111 -98 -150 224 104 159 18
3797 18 -225 51 -113 -231 100 157 153 156 -93 25 -127 -20 420 183 256 30 -229 170 70 170 87 48 -32
3820 -32 253 -163 -11 30 85 -63 -95 396 -95 -244 285 430 40 87 -42 -179 204 71 -96 293 -30 -129
3842 -129 -102 -44 -65 -323 110 -177 -236 -207 -181 5 -24 16 -105 -61 -50 -147 29 64 197 -217 -60 155 18 -61
3866f1j05L0J10l9J73n3K39j85n2J20j05K33k49K70l82K16j76l5P3j52J1j6J85
3889E0j53J93J12k55J09k99K22k6L2Jr3Q7j13J68j60J43M2J4k48J22K18k44J22
3912D4j05j11j11J76j19K17P1j72j26N8R7J9nr0K1J52J85j37j62l1Q8J22lj31
3936e3M4o3J22j61K15L7j33J57j72P6J02j52m01M17lJ54j90k44j60M20j51J7j3
3959a35K82k52O8j16M39m13K79K1m98K59J11k51O5K25J85j95Lk93O4P3K12j13
3981B0k7J72o9k90L21l43o3m2L10l5n0k6K60k05N37l78j88K6jK5k03K57j3K27
4005B22m5k62j21L10l20K37r7K44r7n7N4q5j22k01M10Q2k60J12K05j0l02K50j33
4028A4l21K47J09P0J41n61K43n7J40j37J2K27o22N92j37J08k02K81Pn2p4M7J7
$$ plain form
3866 -61 -166 -136 -26 -65 108 55 294 109 57 177 72 305 56 326 -56 160 -16 -51 22 -130 -119 -135 50
3889 50 -103 90 202 -53 56 -243 -21 -47 -15 -14 -107 -20 -133 35 -125 18 60 74 -174 -52 166 -78 44
3912 44 -61 -172 -283 -107 -226 -9 62 -110 -236 -178 -81 -62 -67 -157 -136 16 201 64 -98 -129 -41 81 78 -53
3936 -53 -9 -72 50 -111 104 141 8 165 -7 69 171 19 -382 35 32 186 -4 -248 -408 12 -139 -122 -135
3959 -135 147 -105 -37 -153 286 -127 152 173 -325 -66 45 -206 -141 84 269 74 77 -216 -152 -79 133 20
3981 20 -7 165 96 -194 127 -216 -279 -321 -11 -46 -96 -122 138 -67 470 92 -96 -70 -71 -46 -249 8 -5 222
4005 222 177 -85 -206 104 -216 21 -76 168 71 14 68 -17 -139 -340 70 152 -108 4 209 199 -103 147 14
4028 14 -307 -60 49 119 260 -301 -58 -115 25 -112 -100 127 -495 97 -40 68 -134 147 154 102 28 75 92
4051I2j61M2J31l3o9K2L7q4j12L10o1m3k8j49j21L41rk73j47L28Q4p1j67k8RJ98
4077C8K3k50L57k53L30k55m4l2J4J04k05L78l50J23J14j19kk10J98k4K55j13o
4100G1L9R2k18j11J46k49L24j39N3J37j41k52N5J45j10J45p3J49m6J11l70L85
4122A43r3J41j49R3j27j20L79j02ok95K16N6J10k53M3L3r3K41l04M04m90J10J24
4145F1o2L95m14m7M6j7M7J00p9L8k66J57j17j5J40J87j92m6J32K63m48MR8O1j3
4170A3J32J5m56L42Q1o5J33j55K2l07L83m6J13j2n27M63K2j38J2p2J4L2j18K03
4194H4k88J88ok49L13J57j71J66Q4r3n2k74J10k24N54l72P5J35k18J98k08J22
4216C1j28k3K66k56Mj71M11QR8r4k95R2Jj7L62j03j92M6l6m5L53k61j89K9K41
$$ plain form
4051 92 -69 -27 104 71 2 24 61 -23 -135 175 114 71 43 -106 -227 114 105 -168 -315 13 97 26 -141 -169 -160 38
4077 38 61 -189 168 -85 245 -10 -54 -86 -72 32 -173 205 -145 -22 92 -27 -29 -239 -41 -65 190 77 71
4100 71 110 202 -16 -127 19 -230 94 -45 8 145 4 -248 -193 -48 -158 -13 -86 63 17 128 -242 143
4122 143 50 191 42 135 8 -112 267 165 159 -136 80 136 246 -7 36 69 -24 217 -87 317 -173 -63 61
4145 61 -1 394 -20 -67 -21 -38 9 109 30 68 -198 -41 -158 -173 -33 154 -38 -84 48 311 -137 -133 -35 26 13
4170 13 145 160 -296 46 127 62 195 40 62 -245 138 92 205 193 -334 129 151 13 25 -47 -33 -1 -119 84
4194 84 -204 -16 -22 -271 42 199 28 194 278 185 133 -141 -31 -255 299 -73 2 137 -81 117 -91 31
4216 31 -97 -120 146 -110 -106 -277 134 142 240 146 -149 -57 -56 -73 289 186 -6 40 4 -41 312 51 -138 -109 132
4241A32l45K13k2m8L4k3J42k36K04l36K75k04q2M60O1k70j2p1J14J22n65N28k0
4264E1l60M60l20K31j45L0J9j74K94j46J37k31M1l1nO8M8R2j38L05k40O5l12M48
4288A87j51J40j05j61j9J31K5R0n2j83%p4L13j24j42j94M40K17k03l83N68j00
4310B20k69k16J72j01M3K43j56j9j71K23o8O5p2j65L98n8j35OK0q9J00J15J72
4333B58j49n55M15K53k24N1l19M9J22q2J44M4J37l48M11J62n16J36K54j83M8k81
4355a73K00r2n8J4Jl5J02n7L62o62L41Qj5l1r6L29j33j49J66jJ03K9k19K88m47
4380b25L03R3j29q2K62j28m7N8k28J75L8P8j44J3p1N2K41k25L3j40k0O7j69L90
4404A95m32K14r8l0J64j47J64j96J11K47M7n34L90j6k16K40j86J5J2K51n84M14
$$ plain form
4241 132 -213 0 -22 -70 -36 -59 83 -153 51 -285 -10 -214 -296 164 225 -45 -57 -128 -14 108 -457 71 51
4264 51 -309 151 -169 62 -83 -53 -34 -208 86 -60 77 -154 -113 -144 -149 -81 -33 59 -79 226 -14 51 -261 187
4288 187 36 176 71 -90 -109 22 47 137 85 -98 -98 -172 141 17 -125 -319 121 338 135 -248 320 220
4310 220 -49 -265 -93 -194 -151 92 -64 -83 -254 -31 -99 -34 -106 -271 127 69 -66 -60 -40 -129 -29 86 258
4333 258 109 -446 -31 222 -2 49 -270 -221 -99 -181 -37 7 144 -204 207 369 -147 -11 243 60 108 -173
4355 -173 27 -65 -123 -109 -108 -143 -41 -98 264 -398 -57 -49 -64 -95 -191 138 5 -144 22 21 124 153 -66 222 -225
4380 -225 78 171 42 -40 222 94 47 105 -123 52 90 168 24 37 -34 18 259 34 67 -73 -93 -26 -195 195
4404 195 -237 -23 -121 -151 13 -134 30 -166 -55 192 239 -295 95 79 -137 103 -83 -68 -56 195 -389 25
4426B5Np6n5J6o3L83l4l04J23K22k94J70p3j29M2J4M4n8r7J36J21R1m32J86J80
4451A43o3n5n8J83k82J28j9J05l4k6%j16k1R7N4M6l7o8J73K50k74k69k75L36L5
4476d7J73r6k09J52j58M53j61%l3r1K41m08J44K82j14j2l44J11J31k58J55n7L55
4499B09l04N4q4O4J24j84j34L66j87J57k55j98L96m0K16l19L92n54M98l61m4J71
4521a7l8K02j76K14k64j64K27J14L5k67J43L3P4j98j49N54l22J16k67K36J12j21
4543G7r4J73k92L75l60L65p43L94j5L25k47j78J68l4K50l08M9J47P1k3j52N9k1
4566a4p8J42M8K79k70l03K44J0j65L31J1m07J48J40j42P4K7j67J66M3j29k86L62
4589F4J6k05K07k16L5k62K97J92l07J01l8K31r0ON3j95L8K78l6l17J89j24J5k31
$$ plain form
4426 25 30 -46 -101 -85 -148 235 201 -103 20 242 -52 118 45 -84 -42 -28 16 -42 -139 -3 118 209 -223 -37 143
4451 143 80 25 -33 150 -132 -4 -23 82 48 22 22 -94 -115 -18 36 82 45 -23 150 400 126 -143 -418 -82 -47
4476 -47 126 30 -179 -27 -185 268 107 107 74 -17 224 -184 -40 242 128 116 -228 -117 14 -244 -89 -146 209
4499 209 -95 -41 -125 -61 63 -121 -255 111 -76 81 -174 -372 24 -16 200 -119 273 -281 217 -144 -188 -17
4521 -17 -55 147 -29 185 -79 -243 -16 98 133 -134 9 42 116 -82 -231 323 1 117 -150 86 198 77
4543 77 -17 156 -136 239 -121 244 -499 -105 -120 205 -42 -220 -52 -86 164 -144 -95 52 123 100 -52 7 -14
4566 -14 -92 50 98 377 107 -196 48 58 -107 224 235 -172 -24 116 -26 48 75 -92 74 117 -12 -298 64
4589 64 80 -125 82 -134 -99 -361 -64 128 -179 -78 -116 115 25 31 84 -111 -73 205 169 -148 41 -83 -68 -299
4613b99M37k22L7P8j24J8J27k8J50j41l24L74j34R5J40k49O4o2M89m29J16o6l12
4636b65J02P5J19l53O7R9K61r1j40K12J2m3j06O2q8M1J69n8J04k18%nj90J86J10
4661F2j26K73j40m8L8j36J66r9j8j74K76L50o12J22K84R6n46K14K73m95K41j08
4683a07L7J24L2pJ33j63m47K79J34J41l48L5L43o7l36L56k87K36O6N0J9k61k24
4706b62n5J15P7J31k17Q4J97l8L8k11K3J07L6J16j22Q4l1j32L41k40k5J81k49
4729e2K16j13Q4n9j68p3L6L20j66j07j18J62p0L06j38M5j95p7K88L8m36L14K2
4752E9n5r4k5QQ1M7k62O9J11J43P3k51K03k92J95R0j57k3L01k59L4Q2q3r6J06
4777EO8j04P9P3M0Q6M2k14k6k1o7J01l55L88K98n37P4N5j13L3j84J97L2J24K52
$$ plain form
4613 -299 138 -84 -47 31 -93 -75 52 24 174 33 -291 83 -51 44 184 -65 -1 -63 426 -3 113 47 -265
4636 -265 -163 -88 31 -322 -255 -156 105 14 -126 86 98 55 -51 11 -77 -36 133 75 179 -39 -39 -44 -234 -48 62
4661 62 -64 209 69 21 59 -77 89 -10 -28 -202 74 424 -188 -66 218 314 -232 -18 255 -240 1 -107
4683 -107 -70 54 86 79 212 49 -398 -119 15 156 -192 -157 186 119 -217 139 -148 88 154 204 223 -38 -262
4706 -262 -317 -202 -125 6 -211 -127 70 32 70 -141 -118 -11 25 141 19 103 72 -60 281 41 16 197 -52
4729 -52 164 51 135 76 -92 -165 -129 191 25 -82 -200 -38 -108 198 60 105 -90 -167 121 159 -277 37 59
4752 59 4 -90 -115 -107 -26 21 -241 -172 -61 82 155 -96 107 -185 10 100 -57 -80 221 -38 -4 78 -5 -101 5
4777 5 73 -31 48 121 161 247 289 75 49 28 -39 62 -293 95 393 -144 -70 -15 -128 -95 -279 -82 -50 74 326
4802C26k74j04j7J0K51k23P6J9O7m22K0K99j57K60L8k61K62k09J90k43o1L48l66
4825a71J92N3j00J21o3j33L07l76J56J37oj82L41n0j60j13j44K70j83P3J83j31
4847B1j05J12n7oj50n0N02k81N08l88J12lK6l17j62L49j66K47j14n2N7l63J06
4870a74J18r2J97k0k10m9K12l02N90m85L52J98k26j67p1J10j55L58J63l47J91
4891A91n55J21oJ34L00l91P0N0K53N7l18J16p2J56P2l09M3j77L88k72m3k8P6M93
4915C49n51P30m94oo8n8J13R8j24k00k5J77K11k3m68M87J39j97j90N9n5K58k33
4938g1l0K19m18N15o4j72J01j79J70J48l80K76J05l21o8J72%j68J83J26j48L18
4960C14k37n9m7n7L61j11j41lm7M4K3l98L89r6K6K84n09N3L78k60j10J92K7M42
$$ plain form
4802 326 52 -52 -69 -59 192 -31 45 64 131 -291 -271 28 -129 131 169 -92 170 -39 151 -92 -153 195 -171
4825 -171 21 74 -26 95 32 -101 206 -170 -14 123 117 -65 276 226 66 -47 -191 79 -104 -31 152 21
4847 21 -84 28 -29 -35 -185 -235 267 -14 494 106 218 215 241 -76 -238 111 -55 192 78 26 83 -280 -174
4870 -174 -56 -148 49 29 -181 -230 -18 -320 270 -215 137 335 109 -58 -129 -19 -174 184 347 0 191
4891 191 -364 -243 -249 -115 185 -206 -136 -86 167 224 -94 22 -50 106 178 -131 -88 -265 123 -149 -192 -220 -144 349
4915 349 -202 528 34 28 -40 -98 15 113 -11 -211 -236 -59 152 129 -339 148 287 90 -100 -41 -96 162 -71
4938 -71 -101 118 -300 215 151 -21 80 -99 71 219 -161 115 220 -101 -169 3 3 -165 18 144 -4 314
4960 314 77 18 -29 -86 275 164 23 20 -27 17 40 -358 31 -65 -39 245 -264 -211 167 -93 -203 -11 16 458
4984D58o17K52R1k8k5j75k81L35l30N8N06l40m1%K92j32J41j64K3Q1k9k76J73
5007b8r3n4p0L66j37j11J58m15K97J89Q2k6k35p8L61o2j41k49L41l0q1J06K3J22
5031B35j39k15K68J2n8k41J60J45j78J85j37rO2l54M22k26k6J35k99m0L12r1K90
5054B13j89p0j31M13L6j71j72K66l95J02J28J36l21l21K77N4K09J1J05j02q4j35
5076a41L44j44k3qj07K58l59Q9P4j50K07l4qK14m75P3L43k23J34k4q5n7j97L87
5100H8l2k23M31l90k6m7M49R8l25k38M47l16J42j25P7K46k91J58o6k12K40j25
5122d0K34j69k6n3M9J45k16j50k4N00j14j41O9j03J52j53K83m93L16p8J49q0q8
5145c1o2P8k20M70k21PJ94o2ql24J53J63k64J32J06p7O0P4k82L1L2J48q6J82m12
$$ plain form
4984 458 -159 93 184 156 131 -44 -325 10 -320 -262 244 -96 -137 -137 155 23 164 0 23 104 75 -201 -28
5007 -28 -121 -175 -245 121 -16 -127 31 -384 -87 102 184 158 -77 -155 206 144 3 -246 95 65 -16 90 113 235
5031 235 96 -119 149 161 103 -138 22 167 -11 174 37 28 90 -264 158 -68 -94 41 -258 -298 14 -77 213
5054 213 24 -46 -177 236 272 101 -71 195 -200 -98 30 166 -155 -476 -199 -145 64 75 180 78 -6 -141
5076 -141 203 59 36 28 -79 179 -180 -91 -17 -167 40 6 -2 212 -263 -190 153 -70 64 40 -45 -102 -299 88
5100 88 56 -167 264 -126 -152 -199 250 348 23 -215 232 -84 58 -67 10 256 -35 123 57 -155 85 -40
5122 -40 194 25 -1 -54 -5 140 -76 -226 -250 250 136 -5 64 -39 113 -40 243 -250 66 -12 137 57 -31
5145 -31 -93 -15 -235 235 14 21 215 153 145 -179 -26 137 -127 5 111 34 94 168 -114 -83 -51 97 11 193 -219
5170b19Q9P2K18l00J71j6J61o7l63j68J20K77P1j09Q1m5K50L7l22J84r1L0K3n7
5194B7l05k1K10J08n4J03k7J04j27P4k88M9j2J46r0r0J52J24l58M58m05J48J56
5217H2j43L03k94r3J11K77l86k2J41q0J92k20K6J07L1nlj17J46j12j3j1N9n8K21
5242A39j91J54j26j37n1K57p1J02l45K09J21j9K69l36j09p0K50Q0j11j51J97j59
5264i8K18q9l4j9Q3j06J87l7k62J30l44K44K53k49K98r1k74J88rr1L3J76q8J73
5288A92j17o0k4n4J4Nm1N7o4J19j48j83J91k08O7L33j78M57p19Q9J89J43K5lq7
5313eJ7j68M35l75J15k86K65J54k01J49o3j55m4j41K41J52p9o2l4j99K79l56P51
5336C90n35J66k00K36q7l3M7M1k8q9r4J96O6k53J3k18N26j98P1j62Mo9L48j20
$$ plain form
5170 -219 -130 -58 160 -140 31 15 176 109 -254 -422 -302 -25 46 -63 18 -27 223 260 -62 122 31 61 84 27
5194 27 -278 -299 -89 19 -35 68 41 145 18 92 -196 -147 -159 -13 -103 -193 -41 83 -275 183 -222 -74 82
5217 82 -61 242 -52 -145 -34 243 -143 -165 -24 -104 88 -132 -106 1 32 27 24 -93 53 -59 -72 -83 -24 -82 139
5242 139 -52 102 -24 -161 -212 45 -26 76 -269 -60 61 42 311 -25 -134 -204 46 126 15 -136 61 -98
5264 -98 120 31 -3 -22 61 -45 142 105 -157 -27 -371 -127 126 -123 175 84 -190 -2 -11 -102 -69 107 19 192
5288 192 75 15 -9 -63 -49 -44 -85 -28 -92 27 -121 -304 -113 -321 -254 79 -99 358 -361 -272 -83 60 85 82 -5
5313 -5 12 -156 279 -96 19 -267 -2 152 -49 100 37 -118 -162 -303 -62 90 11 -51 -85 -284 -5 -361 390
5336 390 -145 21 -179 57 -30 -63 -16 25 -3 -92 -186 10 76 -177 -164 -382 144 -54 17 -145 -141 -210 138 18
5360A8J88p9m1j81mj93L13L6j38l6K94k20K99l37k76K83P1K46j86J81k44K82k03
5383G3n8J0J12j04j25L15k13m3L4jj76J01q3K69j24K24k59M4Q4Lj19p9P0M1K43
5408B39m74J62K56j76N9J3k39K54K54n97J30o8L37L7k55L04Q5k25l39J28J44p4
5430d5K72j31j94J25K7l9M6o5n5o5L13J4m04N2K35j37k8R3r0m6K18j50J32k2m6
5455A0J53j24Kj3OM8l15N39j66p0nl46K30q1K40J54k81K69l65j26j83J38L54l40
5479b72L97r9J9M2N5j24j49j46M69j32r8R9k87K15J83n4j29K35j97j43J32r0k77
5502c51M11J47k96q6K31ql1p3m4K27k86K44j11K38j55k00L47k14L06l13l66M58
5524G5rM4k65K18k6J76k69R4M2j2m5K8Q3j86L09k01j51P8K24k99J67K7j02J15
$$ plain form
5360 18 206 127 86 -95 -99 -292 21 57 -81 -117 177 -43 256 -81 -357 -74 -3 243 57 238 -6 276 73
5383 73 15 25 137 33 -92 223 10 -33 1 0 -176 -75 -158 111 -13 211 -48 -4 80 83 -36 -115 -45 -4 239
5408 239 -235 -73 183 7 66 79 -160 94 348 -249 -119 -187 150 187 -68 236 321 96 -243 -115 29 -45
5430 -45 227 96 -98 27 54 15 61 -4 -59 -124 189 203 -201 -149 86 -51 -79 14 -76 -122 96 -54 78 56 10
5455 10 163 39 41 28 34 82 -233 306 140 70 65 -281 -51 -132 108 262 -19 250 -115 -241 -424 -286 68 -272
5479 -272 125 26 45 87 142 18 -131 -277 192 60 -38 61 -226 -11 172 118 -11 224 27 -116 16 -74 -351
5502 -351 60 207 -89 -175 56 48 17 -56 -100 127 -159 85 -26 212 57 -143 204 -10 296 -17 -383 75
5524 75 66 110 -155 63 37 213 -56 38 80 68 23 51 134 -52 257 56 -95 -17 207 -92 75 102 0 115
5548A15KO6j99k15J05k5j61N43l08K2J89l67L58J85j85k07P3l1K1J19k64K61j79
5571h2L0o4J31l38K24K10k42Q0j43L9K67j83K73q7j81L7M2j53j32K73L0K29j63
5594I7Mj38J55p4j70K3K5k9j78K96L0K30n44M43j25K6K86l25k08N4L03m18L41
5617A04J20k48j13R5J81m72N03l18L16r5J4q9j26R7l4l4J30lj42N9R7n0k9j74
5641b11K07r4K51j07j36QO3m5L07J16j67K6k56K05L1k70R4J31l08k5K67J67l45
5664i1j48J84J04j57oJ40l12J82k50N64p1k54N2p1P3K23k03j70K94J7k64K95j56
5687b5q0O9M1Q8j74K61Nk37j96J15J61Lj96L30l54K13k81J81K77m21K27j22M9
5710f6O9p1pl1J5n7R1R3o3J8m5J39j77K7o1J18J6j71K6K70j07k79K87l6j51R8
$$ plain form
5548 115 117 183 -16 -231 -126 -151 -312 231 -77 -55 134 -233 125 310 125 -82 -9 -40 -19 100 -164 97 -82
5571 -82 -52 -116 15 -323 -99 111 -131 -51 -194 -155 112 -71 202 115 -66 -29 13 -140 -272 1 31 260 97
5594 97 101 -37 118 44 -126 -103 -78 -107 -285 11 41 271 -273 170 45 71 357 32 -176 -122 181 -237 104
5617 104 224 -24 -137 -42 139 -333 170 -148 168 73 87 -2 -128 -31 -65 -99 31 28 -114 -55 42 -8 -37 -211
5641 -211 -4 -98 153 46 -90 -82 -19 -64 243 359 192 218 -38 167 198 -72 22 153 -155 -180 87 254 -91
5664 -91 -239 -55 49 -108 -114 26 -286 -104 -354 210 139 -115 -63 -134 -61 162 -41 -211 83 100 -164 131 -25
5687 -25 -105 -36 5 93 -81 180 185 -52 -248 -133 28 31 -165 165 -189 24 -257 -76 201 -220 7 -115 -66
5710 -66 3 -68 -75 -106 -91 -148 -57 36 -27 -9 -54 85 -92 -65 -126 -8 8 -163 -137 133 26 -253 34 -2 -153 -55
5736e5j77L96J72j67j41L4j12J68j50O7J37l41L61j77K03k39L7J37r6J36j18J53
5758B28n11L61l66L22m0J82m7q0j04K56q0j28NL5p7j0L47k35K2j46J13J39%k68
5782h2K39r7l21K01K16j87p8L08l71J10j37K00J24j28Kk17K62k62j18M61j35j5
5804b5K8%j8m2M32m01L0J2j72J23q2J41L9o3J2J72j57rj77j16K01m0Q0R6j93K08
5830G9k0m8m3P7l35J34K07L5j52P7j00j88L8L24J25m89N5K13J6l80L37j4M6KK25
5855B21l23K40j11J67j41j0k79K83O7k41j74L72j64o6Q7K1l8P9r2M45j85k41N8
5878b5k20OK13K01k91K8N9j65L54j9k4k53j48J22M4J97M5n6p2j53j50M85l03L47
5902B22n3k36J81On4j38nJ42j24O3O9q2o2rL7O6J42k99Q9J11l36K69oj4k4K14
$$ plain form
5736 -55 -232 164 336 169 28 62 -50 118 -32 35 172 -169 192 15 218 -21 16 153 57 193 75 228
5758 228 -283 78 -288 34 -6 176 129 49 -55 201 121 -7 -2 33 -44 -54 293 58 80 -66 47 186 186 -82
5782 -82 157 60 -261 -60 156 -31 -109 199 -172 -62 -199 1 125 -3 -1 -218 44 -218 -336 125 -10 -25
5804 -25 3 3 -15 -57 375 -26 4 16 -156 -33 -115 26 65 2 14 186 29 20 -157 -273 -72 -112 -32 64 -129 79
5830 79 59 11 -32 45 -290 -156 51 86 -66 11 -89 -277 -239 85 210 -279 -224 -11 5 -375 -38 -52 -6 -4 221
5855 221 -102 138 27 194 53 43 -236 47 114 -127 -301 71 -93 -159 -72 -51 -89 -10 -102 343 158 -83 -25
5878 -25 -245 -239 -26 175 -116 -88 -29 -194 160 141 117 -136 -284 -162 -118 79 124 68 -4 -157 -307 178 -125 222
5902 222 169 -67 114 120 66 -72 -77 65 -59 4 73 -9 -71 -80 -43 23 165 -134 -45 66 -270 -1 -7 -21 -45 169
5928A69k10P8M7k19K88j29J2p5K43j29m04M16k80J56n6M64k63j71O0N8k48J6Q
5951a69K03J5j12K9o7M3L6J88l63J66N3K3j86r4l9L35k56J7J05j16J66Q8l66K15
5975h6J46l06J87J29K5j39J15o7j9m2j7L9L1J48o9l9J9j11RO8j32J2L8J72m67
6000c56L63K03Kj63K8J2q8j48R8L19l65L11m63N30p6m25J23M6l8K05O4o5k14J40
6024D3M2j95J65p8j04J82J07R7j93j05L18l85q6K19k97J74J41k3K9J92l17J51
6046G7kj32K80k35j99R4n8J92J70kl14K95k52J67L2O1j35O7j57J9l3k06J57L8
6070g6L87l62j30J39Q7p5o3KJ88N6p4J13l35L09k15J35K1k08q9L80Q2j08j42p8
6094e6J08j35J56m8k90M82m7l81L54j67pK15k47O2J02m2K1J08m9k17J63j42k37
$$ plain form
5928 169 -41 37 84 -135 153 24 36 -39 204 75 -329 87 -193 -37 -93 371 108 -63 -3 55 -193 -177 -169
5951 -169 34 49 -63 -34 -101 -58 -22 166 -197 -31 22 45 -141 -235 -274 61 -195 -178 -73 -189 -23 65 -301 -86
5975 -86 60 -246 -59 70 95 -44 71 4 -15 -57 -74 -35 -4 144 75 36 55 -56 -47 21 -111 -99 -61 111 -356
6000 -356 7 210 212 49 77 89 1 -147 -49 270 -95 216 -247 283 207 -218 -95 -49 -87 118 182 117 -97 43
6024 43 85 -110 55 -23 -127 55 162 259 66 -39 279 -106 -192 27 -270 -96 45 22 51 243 -74 77
6046 77 75 -57 223 -12 -211 -117 -175 17 187 185 -129 166 -86 81 113 174 39 106 -51 -32 -65 -271 -114 -76
6070 -76 311 -51 -181 -42 45 -30 -93 -91 97 153 79 192 -143 166 -49 86 107 -101 -190 190 272 164 22 -56
6094 -56 52 -83 73 25 -265 217 170 -211 143 -24 -31 184 -63 -1 101 59 80 188 139 -78 85 -57 -294
6117b94N31k49r9j60K59pK09k07j92L62m33J35L28l9j16Pj70K55o9j28J25J02
6139A50j99J17m75M70j70J54Mj9q2J43L0k3M6J65l87j08LK79q2j32J8k06L06k07
6163b05M10l78K22J26%j20J72k14o2r3J84k0L8jL1p4L09l44J83J0k47j37K0O3
6187a27J66k76J30J21j64J04RJ25l22P7J22j28J28P2j96q5L04k76K46j63O5K48
6209A80k81K88k51k5q6N6q9J54P4j55j2M7J47O6j89j48NK28J75k34M4J06k21j6
6233a37J86l6j04kJ3J71j71L01k92J63j83j82K42J8k08J96K3k55J70L32q8l24
6255a67J76O4j39j08J26J21o4n8j03Kj03J02J82k23J95P3k51K44J02k97J30l3
6277b9O4O4j3M7k01J15M2J37j89m62L50N6K0q6l64L04P0p9J35j19M70j94ml82
$$ plain form
6117 -294 237 -12 -111 -271 -12 -19 190 -17 -209 153 -280 -145 183 144 28 35 -135 120 51 -77 48 150
6139 150 -49 68 -407 63 -107 47 51 32 -50 93 123 100 146 311 -76 -184 -181 98 16 -116 -98 -304 2 -205
6163 -205 205 -173 49 175 175 55 227 13 -49 -142 42 22 60 59 90 16 325 -19 164 174 -73 -210 -190 -127
6187 -127 39 -237 -107 14 -150 -46 -37 88 -234 -157 -35 -163 -35 37 -159 -244 60 -216 30 -133 -68 180
6209 180 -101 187 -64 -89 -175 -119 -208 -54 20 -135 -147 -100 47 113 -76 -224 -219 9 184 -50 -6 100 -121 -137
6233 -137 49 13 -91 -93 -80 91 -80 221 -71 92 -91 -273 -31 -13 -221 -25 -2 -257 -87 245 157 -167
6255 -167 9 73 -66 -174 -48 73 9 -49 -152 -150 -253 -151 31 -192 3 76 -175 69 171 -126 4 -29
6277 -29 35 99 86 133 -68 47 89 226 37 -425 -75 -19 1 -85 -449 -145 -75 -154 -19 -138 332 138 134 -248
6301b48J04O9k14J08J13K17j77m6M8J13j76r5J77J52j73M1j49R3j6J39j27K72
6323B25k58l9J70l34J79N8K14k34M7o6K30L03m97L7n8R2L23p04L65p6k52J41o2
6346a96j33L95j43n4N4M6J42K1j74mr1L85k57J97j65J62k79J11k00K29j62K60
6368A44k57K19j7k52J04K49l88K37k0L0j03l2K40m8k92L0J04q1K23k93Q1j25M35
6391A88q0Mj66L5k89M05j27J93k23m6k6n3J96J91j38j0j86M29k36k64K67j80l7
6414a53n7K36j37k51L35J51k25J02q8J27k08J22L20p8j79o9J17k4q5j76J95L14
6436B89k26J1n8r3qO9j12K08N3J16k53m7P8k21L30k59PJ02k66L25k05L93j77k89
6460b33K61O6j89L3j94P8K96k07J61q8n5j8K60j94m2k4L0j96N93k79r3N6J06k08
$$ plain form
6301 -248 -144 -75 -289 -181 -68 149 -28 -74 -26 87 -89 -184 -7 145 -28 13 -136 -43 -59 80 -47 225
6323 225 -33 -72 98 -236 -57 1 215 -19 28 -38 192 495 -2 35 -23 69 392 -312 53 -23 -275 -134 -196
6346 -196 -329 66 -77 -131 -77 -31 111 132 -42 -46 -137 248 -9 188 23 185 -94 17 -183 46 -116 144
6368 144 -113 106 89 -163 -59 190 -198 39 19 49 -54 -86 154 106 -186 -156 -52 -133 90 -203 -122 -247 188
6391 188 108 112 -54 -19 -308 97 -30 163 -60 -106 -132 -185 11 202 64 54 -132 297 61 -203 64 -116 -153
6414 -153 -210 26 -111 -362 -27 124 -101 1 -87 40 -168 -46 274 196 17 -52 65 41 -44 -220 -25 289
6436 289 63 74 16 -77 -85 -16 -128 80 133 249 -4 -51 27 -194 136 -123 -116 -14 -280 45 -160 233 56 -233
6460 -233 28 94 -95 -62 -256 -178 118 -89 72 -16 -71 -89 171 -23 -65 -89 -59 -255 338 59 -34 22 128 -80
6484h0l11L05K82j37k51L01kJ97j50m5j89K70l27K35k80L0M55k82q4l37L23l4
6506a11kQ6R9N6N3j52o6O3kj8L37l85J58R1j26K19jk07J82j63M5j33l4L07k78
6531A8J97l31K49j12k5J4J29K5J34l65J32P0n9r4M4j72K94k14j8K18R0k26j31
6554a33L61j77k78J57J36J4N7n00K48K87m16J50O4j53K47r5k36L76r6K80k05k8
6576F0j39L1n6J76k7K3m8lR6j25p4l9J35K10k56J1r4p2L08Jr4k68J91j19r9L21
6602E0l05J76k2M10k57M9j29P4l1m70O31j41M3o4L8l2n9r2K89K4j69j35j26J41
6626a07K50l59K30k99K83q7K14r8M8k78J61K01k66K05j72J76k26P6j05K13M0j58
6648e8K17K8l36r3L82j91J28mj91J34K33k84m0J1J09j6o0o4K10j2n0J8l0P3m65
$$ plain form
6484 -80 -391 -86 196 59 -192 109 107 304 154 109 -80 190 -137 98 -182 -152 303 21 -63 -400 -77 -111
6506 -111 -113 -27 72 128 181 29 -37 26 24 6 343 -42 116 207 81 300 299 92 274 111 156 23 -11 296 18
6531 18 215 -116 133 21 -4 10 139 164 298 -67 65 135 76 -18 26 -146 148 -66 -84 134 224 -2 -133
6554 -133 228 51 -227 -70 66 80 137 -363 -115 172 -244 -94 -30 -183 64 -31 -267 109 13 293 88 60
6576 60 -79 -48 -104 72 45 68 20 17 113 -12 -86 -125 10 220 -36 -25 -119 -191 117 118 24 -244 -53 -172 -271 50
6602 50 -255 -79 -101 309 52 101 -28 46 15 -455 176 35 78 14 52 20 -39 -131 158 182 13 -122 -248 -107
6626 -107 143 -216 14 -285 -2 -89 125 27 75 -203 -42 159 -107 98 -74 102 -124 -48 -153 60 100 -58
6648 -58 159 187 -149 -242 140 -51 77 73 -118 16 249 -35 -75 -64 45 29 -31 -95 115 103 53 71 41 114 -351
6673c51M36r1J64l67K38K28l97K68l35K63j10O1j84M01m01OJ97k9k4r0k9K29j75
6696i2M5OL6N0J65k48o4L8o5K7l1j19N20j61n2kQ7q4j9J31p3j52P1n0J30j46o
6723e8k1J48j2J13q7j88R0K67j71J23j81l6K1J6J15Q4r7o2K41l67k20l8M59j61
6747b2K38p6K97n52K40k19q6L2P8J41p7j92K36k6o5k02L56j29n0O3r3J18N3j32
6771f9K62q3k95K92n1n4p2K11j80j40J54j5l6J06L10J17k83q5r3J37l06R0L9k1
6795f5R5j34J80K15l20J90Jk08k9j11O1J79j91P1K63k26M8m05J83k5J89J21q7
6818ej67K39k51J78o5L63k25J69j61J37l72J81l9K5p7p9N3J46J31k63k25N0K35
6841b2J01j19QK23m39K52J04R2m4k35k2J85R9Mk24K0J3J08k71J89RJ29K4K11k77
$$ plain form
6673 -351 85 -6 158 -209 29 257 -140 128 -207 56 -54 7 -177 224 -177 -171 26 -3 -27 -117 -146 83 -92
6696 -92 -47 -41 -5 45 210 -38 -102 -64 -129 -102 -133 -252 268 107 55 53 140 56 37 168 95 -57 14 -36 94 -52 -58
6723 -58 -79 69 57 170 83 -105 -15 252 81 204 23 -13 8 24 139 223 126 64 305 -62 -282 -320 139 -22
6747 -22 216 140 437 -115 125 -94 -180 -148 -70 71 -6 -198 38 12 -53 -255 101 -28 -78 -15 -108 10 63 -69
6771 -69 193 110 -185 107 56 2 -70 141 -39 -179 -25 -40 -76 30 340 457 174 89 -4 133 -173 -83 -44 -65
6795 -65 30 -104 76 291 -29 161 162 -46 -75 -186 -125 54 -137 -66 197 -29 19 -386 -203 -228 -39 82 -5
6818 -5 -172 67 -184 -6 -71 292 67 236 75 212 -160 21 -18 7 -70 -149 -96 50 181 -82 -307 -257 -22
6841 -22 79 -40 -32 191 -248 4 108 200 156 -79 -101 84 183 187 -37 -17 -4 104 -167 22 31 160 184 395 118
6866A18O6jJ49j63j88L6j10K15k01K80Qk41J93n5k85L54j36o6M1J8j00J82p9P6
6890A11m0l02J97l5J55n5j82L72j62j11Q4K2l00J43O0o1j59J6K77k01J90k32J86
6913b7k2J54j21OL03j16k92o3J35J57J46l11K59l39N9L5j24K07mj42N1j0K37l16
6937a38R6j67K12j68K12J40j39K94r3k01J27j73K02M5m06J52l40K15K21N9m68
6958c18L85k29J82j9P6k91K07J25j56NP6j19J17qQ1N5l22K99j83L49q8k00o9Q2
6982C7r6q1K34n2J41k55%J48k79K26J51j25j34j85J45J48j49J46M24l30o1p9J68
7005A42j92J41l04K67Q2J11N7j24l03M3M0K27k7k45j12L57M0k74J25k44K09J5
7027C1P4j3k65M94l95P6J39j12J52m46J46J0Q9J37j05M6L5J08k42j87K1L66k81
$$ plain form
6866 118 184 183 332 169 -19 17 -93 122 -79 201 209 -32 161 106 -179 175 39 -27 14 32 -68 114 35 111
6890 111 71 -231 -34 -69 86 31 -151 221 59 -52 32 54 -246 -103 -43 -104 -263 -247 30 -171 19 -213 -27
6913 -27 -49 105 -16 -10 293 177 -115 -178 -43 114 260 -51 208 -131 -72 -37 -161 46 42 -100 -49 -59 178 -138
6937 -138 -42 -209 3 -165 47 187 48 342 249 48 175 2 204 249 -157 -5 -345 -130 91 150 -318
6958 -318 67 -162 20 1 77 -214 -7 118 -38 -33 43 -76 41 33 114 169 -153 146 -37 312 224 24 -45 37
6982 37 -59 -140 94 42 183 -72 -72 76 -203 23 174 49 -85 -270 -125 23 -126 20 444 114 53 -26 142
7005 142 -50 91 -213 54 136 247 304 180 -123 -80 -40 187 160 -85 -197 160 200 -74 51 -193 16 31
7027 31 105 92 -173 321 -74 2 141 29 181 -265 -119 -109 -20 117 12 58 93 201 -41 -228 -207 159 -122
7050a22J43nJ18j45J05j97m1K34k60L60k71k13J99R7J18q1j02P1J05k33P9K01
7072A60m20K92n56M87J78k55J59K62l37p9pL22j40l4j65R5p7J50r0Oo9J82j77
7095a13p4K49M6j06q8J62k03O7J77k51P6J47K66n56M62m49J96k3J95j31p0J39
7117A18j23o8J30j55l3M06k42%o7q6J71o6k31N35m46L24j02k01K27j75K19k24
7139h9PP3k39J21q1J88r6R3K1L08n69K95J7N5J70l32j59J83o0j00K01QO3P5l59
7164b06Q1pm2K56P6R6k43n6J0J20j09J8O4K09l6m20L42l36j9J74J89m3L3q8l0
7189C3R7l29j2j78N01J64l38J93k96K3J80m49L51R7k75K40K8K97j95j97J13j19
7211g1r5rL84j79j95J86RQ6o5K14n4l60J29oJ30k24n5K01J57k11K75nl72R0lK25
$$ plain form
7050 -122 21 16 134 -11 94 -103 -144 90 -170 190 -81 -294 -95 2 120 39 -63 8 113 -120 -41 160
7072 160 -260 32 -524 -37 141 -114 45 307 -30 -109 -116 206 66 32 -133 -38 -115 35 -55 -49 -118 64 -113
7095 -113 -187 62 108 2 -86 76 -127 -60 117 -134 -58 89 355 -201 261 -188 8 -15 180 49 -21 118
7117 118 -5 -73 57 -98 -131 275 33 33 -34 -120 51 -15 -246 289 -157 167 65 -136 91 -84 135 -89
7139 -89 -82 -9 -248 -127 -208 -20 -116 -23 -2 306 -263 32 49 104 274 -58 -217 -34 -94 -194 7 15 78 153 -206
7164 -206 -125 -132 -174 82 158 254 11 -45 -35 85 -24 -6 58 267 231 -189 153 -183 -202 -28 161 118 151 63 33
7189 33 130 -199 -211 -389 112 276 -62 131 -165 -142 38 -411 -60 37 -238 2 30 327 132 -65 48 -71
7211 -71 -166 -175 209 30 -165 21 30 116 51 265 211 -149 -20 -26 104 -120 -175 26 183 -28 247 242 -130 -40 -43 182
7237A82k12O1lJ71J4m91N16k73j41L83j72J10k54K57r6J40l05J87J3j77K07j74
7259e7o5P1K47R3l60r8J64K0n5K32q1R3k42p2P8o3J65m8J69n8j84J47J12k59J11
7284F0l09M79m31k5K53m9J90j40J47k00m5R3k35Q1K11O8Kl58J45l31N30N0l8l37
7308a89L58j4m02K54K12m91M67J4j8k32O3k16K08J7Q5q8J91l25Q2Jj5p5J0K57
7332A54k68K43N6l22M51o87L38k0P4l8%q5J77J16j49J08j93L6rR1J43l71J11n8
7356a02KK5QP7j00k5m5o7K3J36k10L37j54K58J8j64R0l20J73K6j45J70l33M10
7380H8n6j01K96k38L4l8j92K32p8Q6l65M35p4L22n27J01K13k28j10J30m9J88K1
7403I0l60K88j86J72j35R8p3P2J07J12m90L64j36K39l34K26q1j00J21o3J97l62
$$ plain form
7237 182 -30 31 28 199 213 -278 238 -35 -176 207 35 145 -109 148 52 192 -113 74 87 -90 117 -57
7259 -57 -122 -51 196 289 -71 -169 -5 15 -40 192 111 204 -38 -110 -32 -95 70 22 191 133 -51 96 208 -51 60
7284 60 -249 230 -201 -226 27 -22 168 28 175 -25 -70 23 -212 -131 80 148 150 -208 -63 -394 136 186 148 -189
7308 -189 169 155 -247 7 219 -272 195 209 191 -41 22 -194 14 31 116 28 219 -106 -24 -23 -38 -113 -103 154
7332 154 -114 129 185 -137 314 -373 -35 -55 19 -19 -19 -104 73 189 40 148 -45 -9 -18 73 216 -155 -44 -102
7356 -102 -100 -75 -67 10 -90 -115 -160 -227 -204 -68 -278 59 -95 163 181 17 107 -213 -40 -14 -159 11 -322 88
7380 88 32 -69 227 -11 23 -15 -207 25 -53 33 -332 103 29 351 -176 -75 138 -90 -200 -70 -119 69 90
7403 90 -270 18 -168 4 -131 -33 -106 -34 73 185 -305 59 -77 162 -172 54 -27 -127 -6 -69 128 -234
7425b34L14q9n3K72j46j76q0O3j8M18l49J28J05m25K26L0LM1O8o2K09j74Rk3k8
7450B9J72l25R4j28j4Q9J83k35M9M9j1R1QJ39l29j04L65J16K3j23l18J63K46q9
7474A40L1k29j02k06R0O5L24J24l28p7j4M02m63K01N7J23Q4n71L34j12K72j54
7496ij03qo4N15l46l5nj13K92k86L1K86j02m19K58R1L8j15J12o0L1%j41M39j85
7521A02j36jr1L23n4J6J15m42K01q3K91O5l65o2K29l40L46j13L2j52J76lk00M88
7545C42m61k3J13p2j28K74k55L20j94M5j31J36j78L50O1j62J29l93K95K07l01
7566b6K69l07j09M04k69j57J63Rk8p1K59N4m84K83k2j54J54k55K29K31o3j17k02
7589b09QM74l16O1O7m5p0M7J25l14P0j17L10M3k92J78n31M17M6J16k88L73j44
$$ plain form
7425 -234 80 -9 -62 210 64 -112 -192 -129 -147 271 -78 50 155 -270 -44 -14 -11 30 98 36 245 71 80 57 29
7450 29 201 -124 -30 -158 -172 -83 100 -135 -86 -37 -48 43 51 190 -139 -243 122 238 261 138 -180 -17 229 140
7474 140 171 -58 -160 -366 -276 -211 113 237 -91 -168 -182 220 -243 -42 15 138 222 -349 -15 -127 145 -9
7496 -9 -112 -120 -184 331 -15 -50 -55 -168 124 -162 -131 155 53 -366 -108 -17 21 -94 18 -42 -11 -11 -152 287 102
7521 102 -34 -35 -126 197 143 159 274 -168 33 -50 241 306 -59 -121 108 -232 114 1 33 -119 57 54 -146 342
7545 342 -119 -142 -29 -101 -229 45 -210 110 -84 -39 -170 -34 -212 138 199 37 166 -227 68 275 -26
7566 -26 243 -64 -173 231 -38 -195 -32 -23 -51 -122 137 191 -293 -10 -32 -186 -32 -287 -58 173 110 -7 -209
7589 -209 -201 273 -43 18 85 40 -30 17 142 -172 -102 -219 91 134 -158 20 -511 -94 -48 68 -220 153 9
7612IK00l02J5L43k51J71j94J53l64L29j56J79n14L49ON9mp5N8r7m9O6K57k21
7636c3K12j86j05j36K87j18J43k9k5m4K11l54K80n4p5M5j10n0L15k03pj3J39%
7660I0Lj67J79l3k28J43P7N4k61L40j50O2q2J05l34K20j40L25l9k06O4J92q2k63
7684a31K49n7J35m65M12m8m55M46K6k47J94j01J53n9j45j3q4P1o6K5J73j12J34
7707C5Q8m80M48n8j08L4l3J6n2J79N8o7r9J61q1j00J47j83M26j71n4o5O8j17J4
7732Fk4j20J42J16j72K95k75L6j97J26J21J00j69j43J87q2N6L1J15l97J28R7j8
7755d1l1N2J71j32J70k88R4J20J2j71R0k75L91j68P9J64m28J0J43L2r5q2K18J48
7779A83J16k33oL2j59J42r7q1q1R2R2m5j92M83j04k4p9K46l70P6L25k60j30P6
$$ plain form
7612 9 209 -93 -78 265 14 185 -9 144 -220 109 -47 132 -382 -33 -27 32 28 -47 11 -86 -135 -69 188 -33
7636 -33 179 -7 -112 -248 39 -79 64 35 10 -34 177 -177 103 49 -26 19 -91 -141 174 -29 -36 -49 90 90
7660 90 93 -74 105 72 -156 -13 64 118 -143 197 47 109 27 132 -202 18 -122 203 164 -42 22 214 132 -131
7684 -131 118 61 196 -269 143 95 -360 86 112 -135 59 -42 111 52 -93 -106 -190 -119 -185 -160 13 -99 35
7707 35 123 -357 91 33 -75 -41 -74 -58 -110 69 127 60 -39 122 41 -59 88 -95 331 160 106 41 109 -8 6
7732 6 -18 -138 4 120 -52 243 -32 4 -193 -67 54 154 -15 -158 29 -53 3 34 149 -248 -120 -23 -41
7755 -41 -72 -20 151 19 189 -99 -5 115 127 -44 46 -229 162 -6 73 237 -191 -181 -38 -6 -101 -183 35 183
7779 183 299 66 60 92 -67 75 -22 -103 -184 -92 0 -45 -237 246 142 118 39 285 -85 -9 316 56 -74 2
7803Bj99L36l66n6J20k9L11j2j05O6Q8j4J26l69R5J96j32l30L07j92J58j34L49
7826B16l72L8L3m4J29j08k48J51m6J88n8J90j65N03m27Q5N1p7N9pK19m34K63k11
7850g2j35R1K14j53L3kL5q1P8o2k2j3M0N4l6K73m35K22j29J6K4K87m8k41k10K88
7876A6n9K17k07l0n4Q2K6k15K82k37N2o8M59k4n06K18l4q9M20l48J51k77K99K23
7900B97J49n23j19L34Pnl11J87J76l18Q1l6R9k46L62Q6R0k63n9L41l49k38J6K64
7924B2j35M0o2K68j50o4K15k65K1J88k2j83j85N95l29k6k28K80j4rO6K16l75N6
7948h0J62J09l51J04L73m33J39l5j92M25j42j01J39J80k20j14n9P6L3r1J98m8
7970G2rL1j08K64l95L46K6k68o9K18JPn16O70m22j04L93m17P02n30K25r5l62L51
$$ plain form
7803 2 -197 139 -227 -283 -163 -192 119 107 2 68 156 142 268 -101 -6 190 58 -272 35 -157 1 -133 216
7826 216 -156 -118 -85 -129 0 -108 -356 -205 -251 -63 -121 69 -96 407 -20 65 116 39 98 91 310 -124 139 -72
7850 -72 -207 -116 98 -55 -22 -24 11 -70 8 -54 -76 -89 -49 5 -31 242 -193 29 -100 -84 -60 227 179 -62 -272 16
7876 16 -43 174 -33 -63 -117 -35 -9 -224 58 -179 -127 -195 264 240 -266 -48 -82 -171 249 -99 52 -225 74 297
7900 297 446 -77 -196 138 145 140 -171 16 192 -126 -45 -81 18 -228 134 220 310 47 -12 329 -20 -258 -242 22
7924 22 -113 -73 -135 133 -17 -81 134 -131 -110 78 56 -127 -312 283 -46 -72 -300 -20 -34 -43 23 239 -136 -80
7948 -80 82 191 -160 -56 317 -116 23 -12 -204 221 79 -22 117 297 77 -37 -96 -20 13 -78 120 72
7970 72 63 94 -14 250 -145 201 227 -41 -110 108 109 116 -400 270 -152 -256 137 -280 422 -108 117 22 -340 11
7994A1r5J38O6M0L9k66j02J6R4J91J40j82k9m3K78k28j69L39q9k40L60m71L82
8017A80k42k8J48j98K92l52J96l0J60k87K40n5K24k42k25M55k39M6J8j08K6J51
8039A30j53L9j17K28M9J0j21j49R4r7K12k44M9L0k08K54j0k19J52m1j3j18L95
8062A52j36nO8J04J50L2n51L60j96J50l78J40L21k11J70k94j42L75O0l33L92l81
8084a53L89l35j5J08J88r5j03j25j96J94L99l6k41o9J91j85l0M27k46p4K53j81
8106F5m7Q5J52k74J37j39mL6j68J67J51J22k09Kl1oj28k12K58Jj49j5N14l42q2
8131a16L25k80M8N4r2J68R5k95K18l12J94K43l12J12l4j83L83k76lR6o9O6j37
8154a07P1k5K9J47J2j43l8L54l99R6J98j11R9j23J04k15j15J73j66K34L80o51
$$ plain form
7994 11 -84 54 120 160 199 -67 -169 -153 -59 132 272 90 61 18 296 68 -101 238 149 -91 269 -202 180
8017 180 -62 -90 58 -140 152 -200 -4 -34 126 -161 79 24 248 6 -219 236 -3 43 61 -47 -21 130
8039 130 -23 16 -101 127 176 186 65 -84 10 -87 125 -119 -70 -40 -248 6 -4 -223 -71 -112 -125 -243 152
8062 152 16 11 79 183 333 365 -186 174 -22 128 -250 -110 211 0 170 -124 -266 109 169 -164 228 -153
8084 -153 236 -99 -114 -6 182 87 -16 -141 -337 -143 256 220 -21 -90 101 -84 -114 313 67 -7 246 65
8106 65 18 103 255 -19 118 -21 -25 11 -157 10 161 283 74 76 45 39 -89 -301 -43 -42 -191 -206 308 -34 -116
8131 -116 209 -71 -23 31 -61 107 202 -93 125 -187 7 250 -62 50 16 -167 216 -60 -63 33 -36 30 -107
8154 -107 -36 -61 -32 115 127 -16 -54 300 -99 -3 195 84 183 60 164 -51 -166 7 -159 75 455 -196
8176a96O5J31k06M80l62j51J97j45J68j57L4M5M2M2K41
$$ plain form
8176 -196 -131 0 -206 274 -88 -239 -42 -187 -19 -176 -142 -97 -55 -13 228
8191B28
$$ Imaginary data points
##PAGE= N=2
##DATA TABLE= (X++(I..I)), XYDATA
0@%%%%%%%%%%%%%%%qJ6j6J6j6K4l2L2m0M8n3O1p2Q4r3J05j21J39j59J81k04K30
37A22k58K87l20L57l97M40m87N40n97O59p28Q02q84R74j073J183j304J440j592
56h36J765j964K192k460K781l172L658m282N123o321Q178j1484J9209p6728l5359
71i9700N9893o468J446N143L2259N631j1439j1050K0448J6163l991k1791J151
84a2305J5902M776k1282j3369Q425J6435o809j8317m04K1153R472j1436j0698
97a8457J2924K0320j454j7497j237J7549J0622j3440j4489Q198J8665m27j6254
110E023m503J7804J3495j0929j4258O479J7240k05j8577r332J1950R547j2445
123A1289j7742R96J5820K210j6370p344J4083J5180m985j3645L842J7970N376
$$ plain form
0 0 0 0 0 0 0 0 0 0 0 0 0 0 0 0 0 -8 8 -8 8 -8 16 -16 16 -24 24 -29 32 -40 44 -49 56 -65 74 -85 96 -108 122
37 122 -136 151 -169 188 -209 231 -256 284 -313 346 -382 420 -464 510 -563 620 -684 756 -836
56 -836 929 -1035 1157 -1303 1478 -1694 1964 -2318 2805 -3516 4662 -6822 12387 -64341 -99700
71 -99700 -39807 -46275 -44829 -39686 -7427 -1796 -13235 -24285 -3837 12326 8335 -13456 -12305
84 -12305 3597 8373 -12909 -26278 -17853 -1418 -8227 -26544 -26948 -5795 3677 -7759 -18457
97 -18457 -5533 14787 13333 -4164 -5401 12148 22770 9330 -5159 3039 21704 21277 5023
110 5023 520 18324 31819 20890 6632 13111 30351 30146 11569 2237 14187 23734 11289
123 11289 -6453 -5457 10363 12573 -3797 -11141 2942 18122 13137 -508 3334 21304 26680
136B6680j4124r997Q908J1419p908j9044l657J1818K747j5086j2693O789J3459
149f89l307j4582p76J4850R094r482j0360Q057J5132j463j3682m264J2569Q406
163I503j0422j2882M338J3379l24j4024n794J1420R343p815j2257L326J3752J778
177C321j2619n810J0493J0679n442j1668K139J3927L925j1011o470R335J1064
190A1863m345j2031l02J2030L647j0669q552O258R976l173j2083j469J0812N480
204G442q202q875O146J1199j273j0813k241J0259O846p794r108M414J0350k36
218H114j0332l888Q806O990o825r871K873R961J023j0468m746Q074P050n290r281
233g810J524R921K765q879n004P774P831l463q990N49R331K847q214n719M920
$$ plain form
136 26680 12556 2559 11467 22886 14978 -4066 -7723 4095 6842 -8244 -20937 -14148 -689
149 -689 -3996 -18578 -19354 -4504 4590 -4892 -15252 -7195 7937 6474 -7208 -11472 1097 9503
163 9503 -919 -13801 -9463 3916 3592 -10432 -16226 -4806 4537 -3278 -15535 -12209 1543 3321
177 3321 -9298 -15108 -4615 6064 622 -11046 -8907 5020 8945 -2066 -8536 799 11863
190 11863 7518 -4513 -4815 7215 10862 193 -8359 -2101 7875 4702 -7381 -8850 1962 7442
204 7442 -760 -9635 -3489 7710 6437 -4376 -6617 3642 10488 2694 -6414 -2000 8350 8114
218 8114 -2218 -6106 2700 9690 2865 -7006 -4133 5828 6851 -3617 -8363 -289 6761 1471 -7810
233 -7810 -6286 3635 6400 -2479 -7483 291 8122 4659 -4331 -3782 5549 8396 182 -5537 -617
248f17P558k974q911r62P982L657o716o222M431Q409j416p900j474P939M355n683
264A456p009L753P618r05q039k966O950M857m938o681K504P760J62p038l264O626
280H46N466m190o751J268P110J157o818l770N325N155k734o872L16P099K203n839
296a029m375M556N681j906o619r0O533K287m852m634L349N871j570o151o61N640
312B030K767m322m896K892N555r21n652j548N189L440l703m830J949N505j37n190
328a872k087M660L525l163m763R57N183M81n103k334L938L682k315m370L39M914
344A672J642m168k686L598L726j762m751p5M157J313l887l201K671M139j503m387
360c502J75L923K015k530l294K555L566j09l854j024L515K327k856l320J161L632
$$ plain form
248 -617 6941 3967 -4944 -5906 2076 5733 -983 -7205 -2774 5635 4219 -3681 -5155 2784 7139 1456
264 1456 -5553 -1800 5818 4913 -3126 -6092 858 5715 777 -5904 -3400 4360 4522 -2516 -5780 846
280 846 6312 2122 -4629 -3361 3749 4906 -1912 -5682 -357 4798 2064 -4808 -4492 2607 4810 -1029
296 -1029 -5404 -848 4833 2927 -3692 -3782 2751 5038 186 -4448 -1099 4772 3202 -2949 -3610 2030
312 2030 4797 475 -4421 -1529 4026 3105 -2547 -4095 1094 4534 831 -3999 -2050 3455 3318 -1872
328 -1872 -3959 701 4226 1063 -3700 -2743 2440 2921 -2182 -4516 -578 3104 789 -3581 -3242 1672
344 1672 3314 -854 -3540 58 3784 2022 -2729 -2804 1353 2666 -1221 -4422 -1751 2388 885 -3502
360 -3502 -3327 596 2611 81 -3213 -658 2908 2799 -1055 -2079 1436 3763 907 -2413 -1252 2380
376B380l33l677j302L054K693k773k678J276L076N55l561j142L124J989j803l299
392b421N38L437O49l133j636K409K612j402k783L28K827R88k718j782J283K675
408A871j118l157l07K459R11k291j910J530K295m05j850k82K919J808j664j943
424a134J419K820n91k514o05J815J399j905k330M02J953J61k239j101K377J626
440A553j332j774N73K765M53k103m02K002J516j045j631J14K183M00k206r39J269
457A396J153j065k107r4J743R3j813j419P46J836p01j206M8J464R13p63j363J239
475A00J484k32j228n22J479N30j278j667O55R01j80k073n64J203N56q34j449N76
493b543J461J25j077j56J039R74k81r83P23J255J09o21n89J294P54o61j092J11
$$ plain form
376 2380 2047 -1630 -2932 122 2815 42 -2636 -1360 1716 2271 -1290 -2432 692 2681 878 -2421
392 -2421 -1883 1554 2203 -930 -2566 -157 2455 1053 -1730 -1402 1425 2413 -305 -2087 -804 1871
408 1871 753 -2404 -2711 -252 659 -1632 -3542 -2012 283 -122 -1972 -2254 665 2473 809 -1134
424 -1134 285 3105 2514 0 -605 1210 2609 704 -1626 -1224 729 890 -1349 -2450 -73 1553
440 1553 221 -1553 -980 1785 2238 135 -267 1735 3251 2206 575 689 2872 3272 1066 127 1396
457 1396 2549 1484 -623 -717 1026 1119 -694 -2113 -1367 469 -232 -1438 -1390 74 987 224 -1139 100
475 100 1584 1352 124 -398 1081 1611 333 -1334 -679 222 42 -2031 -2595 -1392 -836 -1670 -3119 -2543
493 -2543 -1082 -957 -2034 -2190 -1151 -177 -458 -1441 -718 537 646 25 -564 730 1484 823 -269 -158
511a58R37l09j056q65L08J026m96j431k5J009N13l52l45J189J180J33n69m1J309
530A957Q75q21p56K22M93m81j134q44O29J5r01q10M40Q40n1n84K4R47M66M1l29
551B38Q6R04Jr28R5K02M19m42j168O99K35q2k1o89N51R9j0m44l41O44r1p18k69
574a030M51K02l43r2K9N73R22n31k3N88O72K04n19k94O39n4m57q84J1J94n66m56
596g64k56J17L95k72R2O0Q95M58k81L66L44J13j19l68p5K08l06m14n40M6n7K48
618a10o71q5M62j43n5K00k3M08k45m3J3K29Om67l25L00K92l37k15J20K59M36k82
641b76r4L85j10J56n40L77j44n3Km93j3j35O5Q1K97K52k6L6K38J79K02J00l6M
665D54J21j24K1j92R0j65j4J28l37Q0p2J35r5J4J20L28j92PK35j02n0r0j94N44
$$ plain form
511 -158 779 470 -586 -1451 -1143 -117 -613 -2044 -2069 -1060 -547 -899 -1244 -55 1125 1258 689 648 1957
530 1957 2832 2011 1255 1477 1970 1489 355 -489 140 155 -746 -1556 -1116 -276 -327 -911 -887 60 526 567 238
551 238 324 1228 1229 301 396 598 1017 575 -593 106 341 259 238 -451 100 199 189 -255 -596 48 -43 -761 -1030
574 -1030 -579 -377 -720 -812 -783 -210 712 181 158 746 1418 1622 1103 809 1448 1394 937 53 64 258 -308 -764
596 -764 -1020 -903 -508 -780 -688 -628 267 725 444 810 1154 1267 1148 780 705 913 607 193 -347 -301 -358 -110
618 -110 -781 -866 -404 -547 -602 -402 -425 -17 -262 -305 -292 -63 -57 -524 -849 -549 -257 -594 -809 -689 -430 6 -276
641 -276 -370 15 -95 61 -479 -102 -246 -299 -297 -790 -803 -938 -873 -792 -495 -243 -269 -233 5 184 386 486 450 454
665 454 575 451 472 280 370 205 191 319 -18 62 -10 125 30 44 164 492 300 307 542 440 390 300 106 650
689F50j67k91r1O5O8Pj90MJ11k31l0J74Lk8K75n54L00k19K75n06L32k32J29L70
713B24m79K77p1N1J6j77J00k21K52R1k25J03j06L03l60R9J01l6p0O4K44r3l13
736b26L75m38K92l0k40L90mj77q5L94k12o6pL16k31Q7M1K36m74M22l06l2R0m1
760G4j02k01K53r5J49M6k64J67J27k35P5Lo0K14k12k88J67K9Q3r2N5J21k60J10
784a36J68k07j59j62L57J83m70M39l03l49K64L94k9m37J90P3Jk8J22ok0L5j26
807b06K44j03pL02j63Q3m04M17j74NM6k5j9K35p3m4N2O6k64j41K07J97J52k58
831A25J06j2K09j97J64k74j11o8L00J5k49L42j27J87J01l97K48O8m02Q0K34k9
853C13l7k36J54JK33j79J8j00l32J42k49L92j48R2K34m00n1K22j02j17K95l79
$$ plain form
689 650 483 192 101 166 234 241 51 55 166 -65 -95 79 82 54 329 -225 75 -144 131 -375 -43 -275 -146 224
713 224 -255 22 -49 2 18 -159 -59 -280 -28 63 -162 -59 -165 138 -222 -123 -22 -58 -128 -64 180 87 -226
736 -226 149 -289 3 -27 -267 123 119 -58 -143 251 39 -27 -34 282 51 138 179 415 -59 363 57 25 115 74
760 74 -28 -229 24 -71 78 124 -140 27 154 -81 -6 -3 -63 151 -61 -349 -182 -153 -70 -162 -107 14 -246 -136
784 -136 32 -175 -334 -496 -139 44 -426 13 -290 -639 -375 19 -10 -447 -257 -184 -183 -211 -89 -95 -115 -80 -206
807 -206 38 -65 -72 230 67 150 -254 163 -11 -6 40 15 -4 231 158 114 166 232 -32 -173 34 231 383 125
831 125 231 219 428 231 395 121 10 -58 242 257 8 350 223 410 511 114 362 430 28 108 342 313
853 313 276 40 194 195 428 249 267 167 -165 -23 -272 120 -28 64 298 -102 -153 69 -33 -150 145 -234
875b34J39M91l87j34M4j81L8o7N0L20l05K24m99J36L06j31Q6l63L78r2k8K6k55
898d38L41k18mJ78mk51j9J48j29J56l9o3L52j20Q9m16K28K40O4j98J81j82P6J13
922H5k22j65j6K60K10j03J56k32K32k37J82j7L2K88o14J54M04m07J19J05N0R1
944C55l72O8K3K25K25j86n25L95P5N8j15j40l6M3o0K55j66k29K13k04J93n4J59
967B00k67j90K32j73L68j93K11J34j65J71l06J40J11j33jk99L89l6O6j17j23j06
989h7K70j18l11K61j09J50q9k13K6J00K13j87L1J8l33J8K35J02j98R2j15L70l08
1012a82n5j22J28K70n63K33j42K50P1r9J2J31p1N3M6r5n1J02J80j31j77K72l09
1035b49J39Q3K4J83m5j36q0K76P2k76K49o7J28O3m7m15mK37j83K2J53mO8l7n7
$$ plain form
875 -234 -95 396 9 -125 -81 -262 -224 -291 -241 79 -226 -2 -501 -365 -59 -190 -104 -467 -89 -181 -209 -183 -438
898 -438 -97 -315 -319 -141 -145 -396 -415 -267 -396 -240 -279 -342 10 -110 -21 -437 -209 31 95 -103 78 -104 -28 85
922 85 -137 -302 -318 -58 152 49 205 -27 205 -32 150 133 165 453 -161 -7 397 -10 109 214 264 355
944 355 -17 51 74 299 524 338 -187 208 283 341 226 86 50 93 33 288 122 -107 106 -98 95 41 200
967 200 -67 -257 -25 -198 170 -23 188 322 157 328 22 162 273 140 139 -160 229 193 259 142 19 -87
989 -87 183 65 -246 15 -94 56 -33 -246 -220 -120 93 -94 -63 -45 -378 -360 -125 -23 -221 -129 -244 126 -182
1012 -182 -237 -359 -231 39 -524 -291 -433 -183 -112 -211 -199 -68 -139 -86 -40 -135 -186 -84 96 -35 -212 60 -249
1035 -249 -110 -27 -3 180 135 -1 -81 195 267 -9 240 173 301 364 317 -98 -102 135 -48 -26 127 123 191 154 97
1060I7k7M05o6m76L3J27J89o3J07n2J7K7j69k23N96m76j0O0m7N1j00o2K37l15
1084a40O7K52m23K12J66o8r9j47M65l36k1k66J44l0jL5J65j66mL61j26j30m2K69
1108A37k79R6M1q5L9l31L83j42Q9K36n35J27J8O2k6J18J3K46r4R2j99K20n0J35
1132C11m52J89M0J43k00j00M51k87N5k5j94K90k24K40k15m0L35o2k27m9J22J18
1154B19j65k4j20J98r8L48l39o7j55J28R1O6k28J30J46m3j00j75M40m74M19j19
1176G8l89K74j54J1M1L30L3n73L91j29J27j0l9j38K05j04n9J08j49J32O5p7J55
1199A29j53m0j97j0J88K9J3J28Q4r3j90o9M6O7K35m24J50K53j84K6O4q3j1L32
1223B90n6k72J60o4q7o0j6R5j72K39O5J69j74l14J33R0j68J39J15j78k5k23L47
$$ plain form
1060 97 70 475 409 -67 -34 93 282 219 326 274 291 318 149 -74 522 46 36 96 49 100 0 -62 175 -140
1084 -140 -73 179 -244 -32 134 66 -33 -180 285 -51 -72 -338 -194 -224 -225 -190 -25 -191 -195 166 40 -90 -132 137
1108 137 -142 -46 -5 -90 -51 -382 1 -141 -52 184 -351 -224 -206 -144 -170 -52 -39 207 113 205 6 226 176 311
1132 311 -141 48 88 231 31 -69 382 95 150 125 -69 221 -3 237 22 -18 317 255 28 -21 101 219
1154 219 54 30 -90 108 10 358 19 -48 -203 -75 16 82 -146 -16 130 87 -13 -188 252 -222 197 78
1176 78 -311 -37 -191 -180 -139 191 224 -349 42 -87 40 30 -9 -147 58 -46 -105 3 -146 -14 51 -26 129
1199 129 -24 -64 -261 -271 -83 -54 -41 87 171 78 -112 -181 -135 -68 167 -257 -107 146 -38 -12 52 -31 -42 290
1223 290 234 -38 122 58 -29 -89 -105 -10 -182 57 122 291 117 -197 -64 26 -142 -3 112 -66 -91 -314 33
1246C3k03R3K65l51J26J32n0j03k09L89j89o3K37j28P1J75k06m6K04k44J44K14
1268B91o22K17J17K5k96K8L46J13m92K91kk37L12LK6k55M15k60N4j99Q1J4N5k3
1292BPJ56l72O1J49J2Q1L02m27J45o4j42R6p2L11l5p4k01O7K11j61j53J30J19
1316A48k01J03j27M4L5K1l5k44L46l02qK36j52o9M60l15R9j1n1J48m10q4J90K28
1340D9l78N01m86K34J84j8jk34J64k53L98j86j4O9l4L63l98k53K18J54j27L95
1362C47n05J56J06n4j44J66q9j12k4R7K16k38L25o73M78O7L7p0j99J96j40j00
1384a57L36j11k7q7J29m7j07K7OM45k47l36J33K2J70Q6j08j62M8J66k05mN6Lr5
1409f6j38K43j97O0K88k9j43q5L46j35O8j43j72O1J90j57r6j15l2J34l85N35k77
$$ plain form
1246 33 -170 -77 188 -163 -37 95 45 -58 -267 122 -67 -130 107 -21 50 225 19 -27 177 -67 77 291
1268 291 -331 -114 3 28 -268 -240 106 219 -273 18 16 -221 91 94 120 -135 280 20 74 -125 -44 -30 25 2
1292 2 9 165 -207 -146 3 15 96 398 -29 116 52 -90 6 -66 245 210 136 -65 2 213 52 -101 29 148
1316 148 -53 50 -77 -33 2 23 -12 -256 90 -212 -220 16 -136 -205 255 -60 39 28 -23 125 -285 -369 -179 49
1340 49 -329 172 -314 -80 104 86 85 -149 15 -238 160 -26 -40 29 -5 358 -40 -293 -75 79 -48 347
1362 347 -158 -2 104 50 -94 72 -17 -129 -153 -56 160 -78 247 -426 52 119 156 86 -113 83 -57 -157
1384 -157 179 68 41 -46 83 36 -71 -44 -38 407 160 -176 -43 -21 149 235 127 -35 13 179 -26 -30 26 29 -66
1409 -66 -204 39 -158 -98 190 161 18 -67 279 144 212 69 -103 -42 148 -9 -105 -220 -252 -118 -503 32 -245
1432b45J78N2k26R5rl1L82l53Q7k5P6K83l87j1K9L57m82P0K00q7J72k13q2L36
1456A66M0k45j11K17j45qJ97j38J18kj76R7J47l5k98L15j11K65L6k91k4n5J49
1479A08k9P0l24P2K01J3k54L42o1l71L04m4K22l51M0J32q8J28j55L07j76k69J92
1502IJ90l5qk85R6K03o7k63K72k58NJ66q4M2Q0m4J71m10J99J29j67K56N4l22k3
1527i4J85j17Q8p1p4P5M7k26p0K08j34J07L61n07K47j06P8K95l64K27o8k32O8
1550g7J48P0m4k74J14j27L17p6j47J36J2N3N6N3J30m63N2K11j43O7J90l60J74
1573G2N4j69L5K6j47K72j75J17n7l1j5L0p8J62r6p2J57O5k98L79j98l5k34q3O0
1598b59J71q6J67O3k10J50P3J0K5J43j07q9j0O2J53l75j17K57j52J38n0N15l98
$$ plain form
1432 -245 -67 -15 -241 -146 -155 -186 196 -157 -70 -95 -19 264 -123 -134 -105 252 -230 -160 40 -47 125 -88 -170 166
1456 166 206 -39 -150 67 -78 -86 111 -27 91 89 -87 10 157 122 -176 139 28 293 329 38 14 -41 108
1479 108 79 149 -175 -103 98 111 -143 199 138 -233 71 27 249 -102 -62 70 -18 110 -45 262 86 -183 9
1502 9 199 164 156 -129 -33 170 103 -160 112 -146 -141 25 -59 -17 63 19 190 -220 -21 108 -59 197 251 -71 -94
1527 -94 91 -26 62 -9 -83 -8 39 -187 -257 -49 -183 -76 285 -222 25 -81 -3 292 -72 155 87 -145 -77
1550 -77 71 141 97 -177 -63 -190 127 51 -96 40 52 105 161 214 344 -119 -67 144 1 68 258 -102 72
1573 72 126 -43 -8 18 -129 143 -32 85 28 -3 -18 12 -66 96 0 -72 85 150 -148 231 33 -2 -236 -319 -259
1598 -259 -88 -174 -7 56 -154 -4 69 79 104 247 140 51 41 103 256 -119 -236 21 -131 7 -43 472 74
1621G4j77J56j88K81j61Q7k71J65NK84k99Q9k7J19nk1L8jo1J4k73K74P1k62k4
1646a13K14o0M1J30k89M2j4K54m55K53R9J3l05n1K90J04j88p4j51K18o3K89j3
1669A71l45K13k49K16k11j05L21Q5k21n7L41L8q8j26N5k7K07j19k99K12n8n2J2
1692h6K38k40K01j50OL64j31j10j43j12M03j27l27J4N21l88j23o9J39M47l29r7
1714i9o7mK25l06m4M05P9k10oJ47j29K95k27k90L19N2l22K33j47N6nK19k76m1
1738a43L35l5j73Q0j58J64N1k87L2JJ98j2l84M67m0k0o4r8K33J5l45j43rN24l26
1763a37j76K10J58r4j0L18k57K20k34ok00K09J57k34m8J52k00J23N0P3p5PJ57
1786A63j55L2J23k45O1j93J35J65n6q3r3R9J74k91k11K62O1J78J8k48J20J29k25
$$ plain form
1621 74 -103 53 -135 146 -15 72 -199 -34 -29 255 -44 45 18 137 132 111 149 148 87 101 -172 102 173 -89 -113
1646 -113 101 41 82 212 -77 -35 -49 205 -250 3 102 115 -190 -241 49 153 -35 -109 -260 -42 -105 184 171
1669 171 -174 39 -210 6 -205 -310 11 96 -125 -182 159 197 109 -17 38 11 218 99 -200 12 -46 -98 -86
1692 -86 152 -88 113 -37 -31 333 202 92 -51 -163 240 113 -214 -200 321 -67 -190 -259 -120 327 -2 -99
1714 -99 -166 -170 55 -251 -295 110 189 -21 -27 120 -9 286 59 -231 88 140 -182 51 -96 -40 -45 174 -102 -143
1738 -143 192 157 -16 64 -94 70 121 -166 -134 -133 65 53 -331 136 96 76 12 -86 147 162 -183 -326 -335 189 -137
1763 -137 -313 -103 55 -39 -49 269 12 232 -2 -8 -208 1 158 -76 -124 28 -172 -49 1 74 -1 6 163
1786 163 8 40 163 -82 -21 -214 -79 86 30 -53 -146 -47 127 -164 -375 -113 -52 126 144 -104 16 145 -80
1809h0j42K25k40L04j1j18K49N0q7m03J52J51K96k71j16J88l7j41j7L3O5j27K63
1832A86n04J46L82k59j1J68j50O3L5r7j40L34o3p8j71R0J16N2j06j23M54j19j67
1855C8r4M7j96J57J68j11n4J11O0p2k95N24l76r7J55J15L2j98nJ42L56k59j53
1878eL4l07L27k54j42K29J81m3j86R0J46o7k82K51L66k34j23P7J38k08NK10q1
1901A22k79J51k51L34j44k55L50j68M5P8N8j7j65J93J03m39K99k18L37oJ74m07
1923a05k15L66J42Pj73o2J90J05l37R9L3o9J47k00K07n3Ql09O8j0Q2K01m25K45
1947e8K67k78r1j24K4M94j72l06L28R8q2Ql86K88k9m6op4J11L88j94j16k4K73
1971B93n23l2K15m7J51r0j33Q4J30l7j53j5O1L34Q2l40k03O18M2r5n43O7K48j64
$$ plain form
1809 -80 -222 3 -237 67 56 -62 187 237 150 -253 -101 50 346 75 -41 147 110 -31 -48 -15 50 -77 186
1832 186 -318 -172 210 -49 -60 108 -42 21 56 -41 -181 153 90 12 -159 -69 47 99 -7 -130 324 205 38
1855 38 -56 -9 -205 -48 120 9 -45 66 126 54 -241 283 -93 -190 -35 80 112 -86 -91 51 407 148 -5
1878 -5 29 -278 49 -205 -347 -118 63 20 -166 -76 70 3 -279 -28 338 104 -19 58 196 -12 -7 203 122
1901 122 -157 -6 -257 77 -67 -322 28 -140 -95 -17 41 24 -141 52 155 -284 15 -203 134 128 302 -105
1923 -105 -320 46 188 195 22 -40 150 255 -82 17 50 -19 128 -72 135 82 90 -219 -151 -161 -79 122 -303 -58
1947 -58 209 -69 -160 -284 -260 234 62 -244 84 182 100 108 -278 10 -19 -65 -71 -145 -34 354 160 44 20 293
1971 293 -230 -262 -47 -94 57 -33 -166 -82 48 11 -142 -157 -96 238 320 -20 -223 395 437 342 -201 -134 114 -50
1995e0L2J1o7N7q4N5P9k12K30K8q2j98O1K4J59o1OK31k62j17L90k18K03m52l7
2020b74L85O6l43j17K20K55j82j50K87j8L61n91r2M37j64L52n76K74r1K45l61
2041g7l3nK47l70rM88m43L07o6J10j25K25k16l19K32j26K99j06R6j7k51J79j42
2064a22RL21j85k0J52j96j13J66qm6J72o1j3O3l80M14j27l7L8N5l1L3l72K92J17
2089A21k52J31k11N58j71J13k61q0J7k2j43L8j34J60j14K94n5j2M70o45K55R3
2111A50J04l07l8K63j67M7J22J3l05O9J01R1j15j70K02J6k71K55j19K40j09k12
2133a40L12k66L4j62J97O2K4j93n7K35k27L07l41J91Kr0L34n38L81o9Oj51K01
2156E2K52k21o5j13L33j91J06j00o5K72k40q7k0OKl1K88p0k79K13r7j4J00J98
$$ plain form
1995 -50 -18 -7 -74 -17 -101 -46 33 -179 51 79 -3 -201 -140 -116 43 -18 -12 219 -43 -160 230 12 215 -237 -274
2020 -274 111 177 -166 -283 -63 192 10 -140 147 129 490 -101 -193 244 80 432 -144 130 39 284 -77
2041 -77 -110 -115 132 -238 -247 241 -202 105 39 149 24 249 33 -286 -54 -180 119 13 109 92 -159 20 -122
2064 -122 -113 208 23 3 155 -41 -154 12 4 -42 130 69 56 119 -261 153 26 -11 27 82 51 84 -288 4 121
2089 121 -131 0 -211 347 176 289 28 -52 -35 -57 -200 -162 -296 -136 -250 44 -11 -23 447 -198 57 150
2111 150 254 -53 -91 172 5 52 174 187 -118 -49 52 143 28 -142 60 76 -195 60 -59 181 72 -140
2133 -140 172 -94 -60 -222 -25 37 61 -132 -189 46 -181 126 -215 -24 -22 -112 222 -316 65 -4 2 -149 52
2156 52 304 83 18 -95 238 47 153 53 -12 260 20 -67 -87 -81 -79 -110 178 108 -171 42 -55 -69 31 229
2180B29l54L94m74K61J53r3r1j68l2N1j32J02m8N07l48N4J01j42J29j78j61N8
2202a82L77J15k00J56l76L14k06j77N0R0L92n37rL01p8p0n8R2L4J88l53%L82j54
2226I1QJ19J06k44j51PR0J02m09Q9L49kl72L53j91J41r4j8K25p7j5J56j99k12
2250a48q8K86N3J33l1j8l01P1o1j43R8K98n8j80J14J09J30m60L35M0O4m43P7L36
2274B13k60K48k32p8N4K69k95p3K83j64J26j97K35k99K80k49J56K80k08%j2j63
2296h6K60j17r8K61m91K70J42j84M5k29L84j92kr9P4K9J58j06M7L00l97J06P4
2319A49k1j13J34j13l21Q5P06n53l32M14m9J18k21K21N0j00J93k30l7L10j51P6
2341B15j82k09L46P6m21K83Kk66K62q9j65J47j87J05j6J80R0k60K02j15J76m53
$$ plain form
2180 229 -125 269 -205 56 209 116 25 -143 -175 -124 -256 -154 -202 305 -43 11 112 -30 99 -79 -240 -182
2202 -182 195 310 110 266 -110 204 -2 -179 -129 -39 353 -184 -193 108 30 -40 -98 -6 28 216 -137 -137 245 91
2226 91 99 218 324 80 -71 -64 26 128 -281 -192 157 155 -217 136 -55 86 -8 -26 199 122 107 263 64 -148
2250 -148 -236 50 103 236 205 187 -114 -43 -104 -247 -149 149 91 -89 25 134 264 -196 139 179 243 -200 -123 213
2274 213 -47 201 -31 -109 -55 214 -81 -154 129 -35 91 -106 129 -170 110 -139 17 297 89 89 77 -86
2296 -86 174 57 -41 220 -271 -1 141 -43 2 -227 157 -35 -37 -136 -62 -33 125 19 66 366 -31 75 149
2319 149 128 15 149 36 -285 -200 506 -47 -379 35 -14 104 -117 104 154 54 247 17 -20 290 139 215
2341 215 33 -176 170 246 -175 108 110 -156 106 17 -148 -1 -188 -83 -99 81 171 -89 113 -2 174 -279
2363b79J71J76J7Jj71K33K7M4j50R3J7l09J23NJ74l45n8J94k0r8J09M2m1l3M9
2388b9j3j5Qnm7Q6k2J01k46L74n03K09O9j41M45k80J0J15q8k76J78q1K94J0Pk62
2414a02O6p6K36m10L40j72K70l14K41j59K81j03k44J05Q5L4r9l4J42k54j93O58
2436B98j02l32m6o8K66j82K54p3J64k42K2M10l65k44M78l58J18K29k57R0l1L7
2458F6k04M52n03K19O4j9j06j69O0P6M3j81J37j29K67n6N8m33M92k49P3K29j99
2481a2J38m27M50q7J3j06Q3j44J04k12k20K46J22J91k05o8L01j5j44n6m9J24J47
2504A74k31K61j89j13J6R3j20J45o7J0o9j7K22j14j78M90k80K25N8l7j06l32P4
2527h5J59j1L5j31Q2j16J10r0k5J5J57k65L60q4j7k30Q2K53K1j63j00Q0N6J11
$$ plain form
2363 -279 -108 68 85 86 -85 148 175 219 69 162 179 -130 -7 -2 172 -173 -231 -37 -57 -155 -46 -4 -45 -78 -29
2388 -29 -42 -57 -49 -54 -101 -15 -37 64 -182 192 -311 -102 -33 -174 271 -9 1 116 28 -248 -70 -151 143 153 160 -102
2414 -102 -36 -112 124 -286 54 -118 152 -162 79 -80 201 98 -146 -41 44 78 -21 -55 87 -167 -360 298
2436 298 196 -136 -182 -250 16 -166 88 15 179 -63 -41 369 4 -240 238 -120 -2 227 -30 60 29 66
2458 66 -138 314 -189 30 94 75 -31 -200 -140 -64 -21 -202 -65 -194 73 17 75 -358 134 -115 -42 187 -12
2481 -12 126 -301 149 62 75 -31 52 -92 12 -200 -420 -174 -52 139 -66 -134 167 152 8 -48 -97 27 174
2504 174 -57 204 15 -98 -82 11 -109 36 -31 -21 -90 -107 115 1 -177 313 33 258 316 279 173 -159 -85
2527 -85 74 63 98 -33 49 -67 43 -47 -72 -57 100 -165 195 111 94 -136 -54 199 220 57 -43 37 93 204
2551B04k27O4r2J80k01K80l36p6K94k46J13K89k21N5J90n1k97Q4Nk23L23l39L50
2574A22j02J08l24K22l94N93k56Kl5R5L9q7j22j77M43k51J11K26k34k12L83j28
2596B2j15J67j28L8J0Qk01N5O4nq0l0M28j23j84j39m3L74M2l2n3j69K57k02K72
2621B33k58j20L14j58J8k8L18l46K7j09Q1K4O6j34q4L40k64K85k91K66K9j89j81
2644a61j05K51J9K25l03J82j89J42j01O8J0N6k5Q8r9J52k46K16j87nj34L78j18
2667A14j2q6M4K51k40r9j54k7J63J68k25K16Lk11j48K73k06Q4J33K76k12k57J92
2690D0J7J02m39L66K31l77p6J26O6m9k20K25J45l32J72qJ24J69k54j6J7j28K38
2713A39N0l50J19J06j1j56J42j51O4J11L03m14j18J04K64k24lj54K21j14J4p2
$$ plain form
2551 204 -23 41 -51 129 -72 208 -128 -204 90 -156 -43 246 25 80 270 219 -78 6 11 -212 111 -228 122
2574 122 20 128 -196 26 -368 225 -31 -29 -64 31 70 -17 -139 -316 127 -124 -13 213 -21 -233 150 22
2596 22 -93 74 -54 -16 -6 2 -199 -144 -80 -85 -165 -195 233 110 -74 -213 -256 118 160 128 75 -94 163 -39 233
2621 233 -25 -145 169 11 29 1 319 -27 0 -109 -28 -4 62 -72 -156 184 -80 205 -86 180 209 20 -161
2644 -161 -266 -15 4 229 -74 108 -81 61 -40 28 38 94 69 157 58 210 -36 180 -7 -12 -146 232 114
2667 114 102 16 60 311 71 -28 -182 -209 -46 122 -103 113 116 -95 -243 30 -176 -92 41 317 105 -152 40
2690 40 57 159 -280 86 317 -60 -136 -10 56 7 -213 12 157 -175 -3 -11 113 282 28 12 29 -99 139
2713 139 189 -161 -42 64 53 -103 39 -112 -48 63 366 -48 -166 -62 202 -22 -25 -179 42 -72 -58 -130
2735a30k0r8K5K91n9J67j53j96K98k08K83N1l06P6o6q9j12J05j55J50K7K07j44
2758e6J1P6L66o56M93k71m6J07rJ31n29K60J90k26N9K32j18J06m22K35P0J30k39
2781a06j2N2L5l3j5O0P7p8j45L18K5j93K28j85Q3O8ml57q3J16J99j64L40J34l04
2806E6j75N0r4J97J17j48k59oM16l38K64l64J18R9K23j02K36j30l13K09oj67l6
2829a53J43j45J76q4J78j10K16m53N47k54k0j14J22%l8m1k2J57p7j1M9rj06K2
2853b7K8n4j2J12n9oLK1K6j85L02J17p2j47j65qM74n82L96jP1j07m45L37L61o20
2879b42K94j36M7K05k18N7k70K1N9M05l71K75k65O7J54J02p9j83J29j17K15p4
2901G5Q0j66K07j78j84O1R7on0j71J17J59j91l7qM59m31K93k64J17J38j27Q4J37
$$ plain form
2735 -130 -150 -248 -223 68 9 176 23 -173 125 -83 200 251 -55 21 -45 -134 -246 -141 -296 -146 -119 88 -56
2758 -56 -45 31 397 -259 234 -37 -83 24 15 146 -383 -123 67 -159 -100 132 14 120 -302 -67 3 133 -106
2781 -106 -118 -66 -31 -64 -79 -19 58 -20 -165 153 178 -15 213 28 111 179 175 -182 -265 -149 50 -114 226 360 56
2806 56 -119 -69 -163 34 151 3 -256 -262 154 -184 80 -284 -166 -67 156 54 290 160 -153 56 50 -117 -153
2829 -153 -10 -155 21 -63 115 5 221 -232 315 61 41 -73 49 49 11 -30 -52 105 28 17 66 57 -49 -27
2853 -27 1 -53 -65 47 -12 -18 -15 6 32 -153 149 266 194 47 -118 -126 348 -234 162 161 232 125 -320 17 378 -242
2879 -242 52 -84 -37 168 -50 7 -263 -242 -183 222 -149 126 -139 -72 82 184 105 -78 51 -66 149 75
2901 75 155 -11 196 18 -166 -105 -8 -14 -64 -235 -118 41 -150 -187 -195 264 -167 126 -138 -21 117 -10 74 211
2925B11l37J72o7k84N55k05r3K60k4k77N8J47l3j72L8K82q1j36J7k8L4l6OJ42
2949A49j23j26J69l02L33n6k43N27l77K0K4j55J14M8J11l8k82K46J82k45L5R5
2971A06j45j90K81j45j5j80J55K29j52O0k15K94l7R6J04m02K1K77k9j76J59q2
2993A4J71k25j01j13r8O37k54K3R8r9j58K23k47j7M80k36k35J21J05q9k78M40
3015A62M0k59K6j14K00k2K59m22K93l74QM56k74K48k32k2r2J78J02j23j3q1K11
3038A55K8k72K15l84M7L48l13L30k2o6k31J94k59J00J72r0K81k79Jj91n6N59o21
3061c54N13j49Nk3k9j22k5J82j72R9j38K42j27j2J23n3M8K94m56K18k36K34J74
3084B36j65j15k1J1j25K66K83k89J96j70j12n6j6K58j66O1j03q5J37J90j24k19
$$ plain form
2925 211 -126 46 -21 -305 250 45 -48 212 188 -89 -31 116 83 -89 -51 231 150 14 31 3 37 1 7 149
2949 149 26 -100 69 -233 100 44 -199 328 -49 -29 -5 -160 -46 2 113 75 -207 39 221 -24 11 106
2971 106 -39 -229 52 -93 -108 -288 -133 96 -56 4 -211 83 46 142 246 -156 -135 142 113 -63 96 14
2993 14 185 -40 -141 -254 -352 285 31 54 152 53 -105 118 -129 -146 334 98 -137 -16 89 0 -278 162
3015 162 202 -57 -31 -145 55 33 292 -130 163 -211 -203 253 -21 227 -5 -27 -119 59 161 38 25 -56 155
3038 155 183 -89 126 -258 -211 137 -176 154 132 66 -165 29 -230 -130 42 -48 233 -46 -45 -236 -292 267 -354
3061 -354 159 10 15 -8 -37 -159 -184 -2 -174 -75 -213 29 -98 -110 13 -40 8 302 -154 64 -172 62 236
3084 236 71 -44 -65 -54 -179 87 370 81 277 107 -5 -61 -77 181 15 76 -27 -112 25 215 91 -128
3106a28k31K89K62lJ91k12L8l3j34o8j36K9L86m53J31J83o4j62RM82m74J28K8
3129E8Q7k12K40j64q1l06L85J45p7q6l2j64K74p8p2M1K14k54p3J16oJ16o9J6J51
3154A69j3k61Q7o0J0Q7K9j35J42J17L7j84k11K28k6m4K64l28Rk08K42Q3K4o9J13
3179A02k42K2m8K62J7k27LK2r1J97J68j77q8J38j13kJ90j27J54k14N3K76l51J71
3203I5k2j76J10KK39p2P9l52m7K38j92L6r2q8K55QK42j90j52L27j98J32k8j2k18
3228g6kQ8q2k3K25n9P4j09mJ02k14R0l71K51p7J34K36j71J11M1l25j02L53j50
3252f0O7M3L04j68m9l2R4j85j36L57m49K16N7n8K65l30J02n4Q6l8J58k73K67l55
3276a71K28l23J46p2J68j46J87N6j96O4j14J64J01O5j18k80J15J93k2J65l16L75
$$ plain form
3106 -128 -359 -70 192 189 380 168 206 173 39 -29 -165 -136 250 -203 -72 111 47 -115 -106 376 -98 30 58
3129 58 145 -67 173 9 -72 -378 7 152 75 -11 -43 -207 67 -11 -83 -42 172 -82 -155 -39 -45 71 2 18 169
3154 169 156 -105 -18 -78 -68 19 48 -87 55 172 209 25 -186 42 16 -28 236 -92 -83 -291 -49 34 58 -11 102
3179 102 -140 -118 -166 96 113 -114 -111 -89 -180 17 185 8 -80 58 -55 -57 133 6 160 -54 -1 275 -76 95
3203 95 73 -103 7 9 248 176 255 -97 -144 94 -98 -62 -154 -242 13 21 263 73 -79 248 50 182 154 142 -76
3228 -76 -78 10 -72 -95 130 71 145 36 32 134 -80 10 -361 -110 -187 -53 183 12 123 164 -161 -263 90 -60
3252 -60 7 50 354 186 137 105 199 14 -122 235 -214 2 59 1 266 -64 38 -16 70 32 190 -83 184 -171
3276 -171 57 -266 -120 -192 -24 -170 17 73 -123 -59 -173 -9 92 157 39 -241 -126 67 45 210 -106 269
3298B69l29J01R5m06L00J32j98j17N23k74K3l44K59K44q8k61J93l03L28jm72K79
3320d7K62k91J1J53k78L21R4l19K03k25K8k9K16r6O1j77L04k91j38L76j15J38
3342A61j66J75j39j35J32l7K2j91N8K82j28r3K09j36j6J04J11Q7m19K26j45J37
3364I9k81K79l42K28J60l0l5j28L09L8l58R3N0o2R8n22L92Qj6N7k4k8J99k93J96
3389H7P1j11Q9p5o4M0r9j10J70J50j25J77Rj25%j42K24K7k83L7J5k19M69k46j38
3414a72J70J1J63N4l13M86o82J61r3P3L42k63R5J3Pk24K36m2j23n2M76k00p3j46
3438i6K84j78J33m8j8j53J63l48K82k0P1n8J76k76M6Q2R0L3k5k82L30m00L18n1
3462E5j91J58j29K65k33k4LJ83k45J42k97L34J26k40j33K80k24J54Q5P2k94K78
$$ plain form
3298 269 -60 41 136 -270 30 162 -36 -153 370 96 119 -225 34 278 190 -71 122 -181 147 146 -326 -47
3320 -47 215 -76 -65 88 -190 131 225 -94 109 -116 -88 -117 99 3 64 -113 191 -100 -238 138 23 161
3342 161 -5 170 31 -104 28 -9 13 -178 -120 162 34 -59 150 14 -2 102 213 300 -119 107 -38 99
3364 99 -182 97 -245 -17 143 113 78 -50 259 297 -61 32 82 20 118 -404 -12 -4 -20 37 13 -15 184 -109 87
3389 87 158 47 136 61 -3 37 -62 -172 -2 148 23 200 209 84 84 -58 166 193 -90 -53 -38 -257 212 -34 -172
3414 -172 -2 9 172 226 -87 399 -283 -122 -215 -142 200 -63 32 45 52 -172 64 22 -101 -153 323 123 50 -96
3438 -96 188 10 143 95 77 -76 87 -261 21 1 72 14 190 -86 -40 42 132 165 140 -142 188 -212 106 55
3462 55 -136 22 -107 158 -75 -99 -96 87 -158 -16 -313 21 147 -93 -226 54 -170 -16 69 141 -153 125
3484A25m6k40J84P6m18K32J43k89K60rq6K88j16K34l03j08K38Q0j02k58J5M1j04
3507a63J56pL1R2J80q8p9j39L9k58J14K25N6l76n8L41j37JR1K38k89K65l13M5
3531c3k5J57K08l12j87rK25o7k19M22j72O7L69l00l39K93l86M86q2n8J3K7l0l5
3555A3p6j17O8K19k69j87L89k94O2L09k72J36J19j80K24k18J07j34n6J35J31O6
3577A75m04L28k18Q4J80j14P7o8N3k76M02j21l52K54j66J07J05R8p5q8J75n47
3599c91L84J35%j32K3k45M0L03l09K14k35K7J85j42R7k8K90l17J87p7J49M9l11
3622a04J77j6rm2K4j74R1J33J86l03k37J27J16K74l50K06K51k48J72m68K45K33
3644B84l49l11J64J78m5k0Q5j30K98j8p5L8l8j33n7L4nJ25LN8r8Q4k25Q8rp6J40
$$ plain form
3484 125 79 -161 23 99 -319 -87 56 -233 27 18 -68 220 104 338 35 -73 165 245 143 -115 -100 -59 -163
3507 -163 -7 -14 17 109 289 201 122 -17 22 -236 -122 103 159 -217 -275 66 -71 -70 21 259 -30 235 -78 -33
3531 -33 -58 99 307 -5 -192 -201 24 -43 -262 160 -12 55 424 124 -215 78 -308 178 96 38 51 78 48 13
3555 13 -63 -180 -112 107 -162 -349 40 -254 -192 117 -155 -19 100 -80 144 -74 33 -101 -157 -22 109 175
3577 175 -229 99 -119 -35 145 31 108 40 93 -183 219 98 -254 0 -166 -59 46 144 69 -19 156 -391
3599 -391 -7 128 128 -4 19 -226 -186 117 -192 22 -213 -186 -1 -143 -46 -74 216 -101 86 9 158 207 -104
3622 -104 73 57 48 6 30 -144 -53 80 266 -37 -274 -147 -31 243 -107 99 350 102 274 -194 51 284
3644 284 -65 -376 -212 -34 -79 -99 -14 -144 154 136 61 99 61 -72 -129 -95 -100 25 28 86 -12 72 -153 -65 -74 -150 -10
3671a0J27J57m77J79k16N68l08k54K89q4J95k55j27L65k8k86mQJ30K69j98qo1
3694b9j48K99L5m2o9k53J76l05M52o4J93k83p4l4K32j39j52K74j55L7Q3J51j48
3717C7j27n6J11O8j65K4K93mk57J1j02j5NM39l51q2J17j28K01R4j48q2R3L90l71
3742eR9K55l54PJ39k03NK12j34q5O1j54J13j24Q0J23K4m02K47J52k15K92q6K19
3766B66m56J91j43L18n13M23j73m5J21m7M2k00L72r9j15K00j28p5K3N0K76m48
3788a60R3O7J27j55j07K58Or5K96k71kJ42m7l27J21o6K55m67L67k88K17l12M65
3811A17N0k32L1pr1K02q1J9J8Lk35K60L3l49J88J19J13k94K49k04K62J4n44N15
3835A56p3p6K2N5j73M7K17l0j10J2m7L3j83K05qP0l77L41K47p5j51Q4k05J70m45
$$ plain form
3671 -10 117 274 -203 -24 -240 328 20 -234 55 -29 166 -89 -216 149 121 -165 -169 -161 -31 238 40 32 -29
3694 -29 -177 122 157 115 46 -207 -31 -336 116 52 245 -38 -112 -146 86 -53 -205 69 -86 -49 34 185 37
3717 37 -90 -146 -35 33 -132 -108 185 181 -76 -65 -167 -182 -177 262 -89 -171 -54 -182 19 113 -35 -117 -24 366 -5
3742 -5 94 349 -5 2 141 -62 -57 155 21 -64 -3 -157 -44 -168 -88 35 59 -343 -96 56 -159 133 47 266
3766 266 -190 1 -142 176 -337 86 -87 -132 -11 -58 -16 -216 156 57 -58 142 14 -61 -38 12 288 -160
3788 -160 -67 0 127 -28 -135 123 129 34 330 59 57 199 152 -175 -54 -120 135 -332 35 -253 -36 -348 117
3811 117 167 -65 -34 -41 -132 70 -11 8 26 29 -206 54 87 -262 -74 45 158 -136 113 -91 171 185 -359 156
3835 156 83 7 29 84 -89 -42 175 145 35 47 0 33 -150 55 47 117 -260 81 328 253 102 186 -19 151 -294
3860b94K88j30J91j00J10j62L04j18j76L19j85K65m30j15J85J05j78K60o1k45
3880a67PR7J16J37j23j3q2K63m31K95j79J02J50j61J23k6k70K23q8q8j1J71k42
3903a97J05j26L25k84J5K83j31l8O4j64M30l11j13J85j88K05j74k9K57k47k9O3
3925i9p1J36R5Kk08P1J64qj86O1J06J36l83n3L46l74J45k2J66K5k31N9M9j3n8
3950a45L7K86l90L46j78O5j31K0m3O2j34J2J24k19Q9K96q3m40M12R5K49n68L32
3973I4M4j44J73l0j29j6O5O8K16m64J68o9J26k3p3k87N06K72m85k25J77KP5j23
3997h2J79Q6j21k11K08L2O4o2j61J57K33k25J53jk02J38l03J18j47M78l16J04
4019A19j97q5J14J35pk11j46K53%j5J89l62J54K86l49K4K33q2q0O4r0k34K08L9
$$ plain form
3860 -294 -6 -136 55 -45 65 -97 207 89 -87 232 47 312 -118 -233 -48 57 -121 139 78 -167
3880 -167 -160 -63 53 190 67 54 -28 235 -196 99 -80 22 172 11 134 108 -162 61 -27 -115 -126 45 -197
3903 -197 -92 -218 107 -177 -162 121 -10 -48 16 -148 282 -29 -142 43 -145 60 -114 -143 114 -133 -162 -99
3925 -99 -170 -34 61 63 -145 -74 90 82 -104 -43 63 199 -184 -237 109 -265 -120 -142 24 49 -182 -123 -74 -87 -145
3950 -145 -108 178 -212 134 -44 21 -110 -90 -133 -71 -205 -193 -69 -288 -199 97 14 -426 -14 81 330 -238 94
3973 94 138 -6 167 137 8 -8 57 125 341 -123 45 -24 102 79 6 -281 225 497 12 -213 -36 -34 41 -82
3997 -82 97 183 62 -149 59 91 155 93 -68 89 322 97 250 249 47 185 -118 0 -147 331 15 119
4019 119 -78 -163 -49 86 79 -132 -278 -25 -25 -40 149 -213 -59 227 -122 -98 135 53 -27 37 -53 -287 -79 -40
4043d0J17l39M74l45p1J53k18J09j01lJ99N6J8J08k94k3J90K16k03n4M0R4k06
4066a23J23k09L76J31n03L06j93l5P5N3N4j82J0K16kj65K30l67K54K3P4j18j2
4089A6O3n5k28L16o9J8j52KJ84J40m52J2K80j66k12J93M62l04j04R9q7J97n45
4112c92K44L19j99n6J53n7r4R3k60L62l38L83lj64Qj03K34n0k63L55m8k34J11
4135AJ9J36k05k5Q3L10m23J00J88l02R9L42n10L30l18M10l85K5K34j72q0J72n8
4158b9j75O6K21k59K5m03L85K67k11J49K21k58J53k19J07k61J63m7K00k00J06
4179Ao9q8J88k75J4L37k1J8j14QJ88k94J83j93J94p2k70L99j17M2l9n1K37j88
4203A8j60L19k2n8m13K26K01k85K32n6l3J57j11M2j0K92m05j48L15m7p6J33m7
$$ plain form
4043 -40 77 -262 212 -133 -204 -51 -269 -160 -261 -264 -65 -9 9 117 -177 -200 -10 206 3 -51 -11 83 -123
4066 -123 0 -209 167 298 -205 101 -92 -127 -52 1 55 -127 -117 99 97 -68 162 -205 49 72 146 28 16
4089 16 79 24 -204 112 43 61 -91 -89 95 235 -217 -205 75 -91 -303 -110 352 48 -56 43 -44 153 -392
4112 -392 -148 171 -28 -84 69 12 -82 11 -249 113 -225 158 155 -9 -1 -104 130 80 -183 172 124 -110 1
4135 1 20 156 -49 -74 9 319 -104 -4 184 -118 -19 323 -187 143 -175 235 -150 -125 109 -63 -143 29 -29
4158 -29 -204 -138 83 -176 -151 -554 -169 98 -113 36 257 -1 152 -67 40 -221 -58 -105 95 -105 1
4179 1 -68 -156 32 -243 -229 108 87 105 -9 -1 187 -107 76 -117 77 5 -265 134 17 59 20 -31 206 18
4203 18 -142 177 155 97 -316 -90 111 -174 58 2 -31 126 15 57 47 339 -66 -214 101 54 -22 111 64
4226F4k29J73o5j39J00J49k40o7K34K58k11O1j06J86o0k57J85j87J66o0n5O1R9
4249F0J17j05O4r0o9j38J01J85p8J5k69N30l83J62l64K44p4J75P9m5l16J52j6
4272f3m6K17k62N58k76k51J00j39K86j71L38j62o6k34K30L8OK9l84N3K13j79K22
4295E7K41j69R8k09n6K1K08l56J65K7L8j34K11q9m0%k08N29m08K25l05k5J72j43
4319a50M44o15M38n6j51O4k61M80k33K10j76p2O4p0K93m20K43m5j70K46q7J33
4341A09k24J8L12O0l80J43k6O0q4J6Q3j92J8k93K73J94l7k41K66n0M9rj25J08
4365D8J12k79o0K47K65k83p1j20P0K49n6m13M25n8k15L46j33n9j68Q9m9K64j34
4388A7l38L7J19P6K57p8O8m43K17PJ78j28k5K54j00n5j27j83K49n7k7j9r0r3O4
$$ plain form
4226 64 -165 8 -57 -196 -96 53 -187 -254 -20 238 27 88 -18 168 108 -149 36 -151 15 -45 -100 -39 60
4249 60 177 72 136 46 -23 -161 -60 125 47 62 -207 323 -60 102 -262 -18 -92 83 162 117 -199 -47 -63
4272 -63 -109 108 -154 404 128 -123 -23 -162 124 -47 291 129 63 -171 59 97 103 132 -252 -199 14 -165 57
4295 57 298 129 227 18 -38 -17 191 -165 0 27 65 -69 142 53 13 13 -195 334 -74 151 -154 -179 -7 -150
4319 -150 294 -321 117 61 -90 -26 -287 193 -40 170 -6 -78 -14 -84 209 -211 32 -13 -183 63 -24 109
4341 109 -115 -97 215 275 -105 38 12 72 -12 4 87 -105 -87 -380 -107 87 50 -191 75 25 74 65 -60 48
4365 48 160 -119 -179 68 333 50 -21 -141 -71 178 122 -291 134 76 -139 207 74 15 -153 -64 -113 151 17
4388 17 -321 -284 -165 -89 168 90 158 -285 -68 -61 117 -11 -36 218 118 63 -64 -247 2 -55 -82 -101 -191 -284 -220
4413b20K90j00K22K5m23R3m0K18j39J27j72J52m1MK17m03Q8P3m7N3o2J52k9l3
4437ENm5K6p8M9K77j49j47J83j52m5N1j50K24j06kq7R4n0kN11k55j45J69l84K35
4463C2J6j32n2K58m4k5j93N50n22J15O7O4j38R5L2j29k75K63L7j23J94J72l22
4486f0Q1k4l45L32J29o2P5j8p5N1j21k49K43J08j84m5j60J31P1J6L37k10k19J30
4510f8K60j14J85j69j34m8J13J15o8J58k43K18l48K63j97K20M4j79M1k13O5K74
4532A75k73O4q6q5L47n8Q0k9j19j90J17j13R0p3J8j12J52K10j47k7K11O5m59K17
4556b5r6J65n0M8%o6p3K04l43K99J29k82J13o7n9j38J11p1K18R6l03j4J84R7n2
4581B5J75m16K09M4l9N4k06M6K76k3k12J47j7L11k00K7j89K82k02j41j94M93o20
$$ plain form
4413 -220 70 -30 192 217 -206 -113 -153 65 -74 53 -119 33 -8 -4 213 -190 -102 -29 -76 -23 -85 67 38 5
4437 5 10 -35 -9 -87 -38 239 90 -57 126 -26 -71 -20 -170 54 -52 -54 -141 -47 -97 -99 412 157 12 181 -203 32
4463 32 48 -84 -136 122 78 53 -140 410 -112 3 70 134 -4 91 123 -6 -281 -18 19 -104 90 262 -60
4486 -60 21 -3 -348 -16 113 51 126 108 33 84 -37 -286 -43 65 -119 -164 -324 -193 -122 -106 231 21 -198 -68
4510 -68 192 78 263 94 -40 -88 25 140 72 230 -13 205 -143 120 -77 143 187 8 49 -164 -99 175
4532 175 -98 -34 -120 -205 142 84 164 135 16 -174 -57 -170 -80 -153 -135 -247 -95 115 -32 -59 152 217 -242 -25
4556 -25 -121 44 -6 42 42 -24 -97 107 -236 63 192 -90 23 -44 -103 -241 -130 -201 17 113 -190 -204 -20 77 25
4581 25 200 -216 -7 37 -2 52 -154 -108 168 145 -67 80 63 374 174 201 12 294 92 -49 -243 250 -370
4604c70L22J58r6k83L72j25M4o7J84m68M25J71k91j29J88J48k65M38n39J47m3
4625g9o3J0k4J17J50j16k37L5R5p2J62l1j37kK76mK22k53j08n8J49K9n2j87K42
4650F4j41K56j73K09j3j50j32P2L4J02k32P9J0J42k65m1O3K13k65J93k54K45J2
4673B8k29o4J63K66o1j06J83j64N6Jl6k76M44l17j30J26O9L3K15j35l68K71J41
4696A10j83j14L36k04p3QK59m9k02J29m8p9q1J52j09K05r9J17j7R8j32j13j11
4719b00J04O9o7L44j07j38Q9j78k3J31J29j0m2%J30j2k43L2n2K75j71J88p62K27
4743b87J43j5J56O8L6k41o9J92K6N9l45K39K2j28j32K89j58J02j43J09K4q7J73
4766C3j14j7Q0J11m36N55j38l64L64P7k75Nj56L21J37k41J71nk00o3M37M3k51
$$ plain form
4604 -370 -48 110 14 -269 103 -22 22 -45 139 -329 96 267 -24 -153 35 183 -82 356 -183 -36 -79
4625 -79 -142 -132 -156 -39 111 -5 -242 -207 -112 -184 -22 -53 -190 -192 84 80 302 49 -59 -117 32 61 9 -178 64
4650 64 -77 179 6 215 202 52 -80 -8 26 128 -104 -25 -15 127 -138 -179 -116 97 -168 25 -229 16 28
4673 28 -201 -265 -102 164 103 -3 180 16 72 73 37 -239 205 -112 -242 -116 -47 -14 201 66 -302 -31 110
4696 110 -73 -187 149 -55 -128 -120 139 90 -112 17 -31 -110 -191 -39 -148 57 -42 75 58 156 24 -89 -200
4719 -200 -96 -27 -94 250 143 5 94 -84 -107 24 153 143 101 101 231 219 -24 8 -44 231 60 248 -514 -287
4743 -287 -144 -159 -3 65 101 -140 -209 -17 9 68 -277 -38 -16 -144 -276 13 -145 -43 -186 -77 -53 -140 33
4766 33 -81 -98 -18 93 -343 212 74 -290 74 151 -124 -119 -275 46 183 -58 113 108 -92 -155 282 325 74
4789G4m7j13q4MN10k32Q8l33K18j86j62M07j71J12j39K51k4p7l2p0K7J80j30l7
4813C4m4J24k67K51n4O1k24K8M0J86k00L9L25j14k89J26o8P8K18j68l76J9L68
4836I3q3l13J59K33n6K87k35J37k42p2K43J24n06J9K59P6J33p6k28L28l16O6K2
4859E2n6l9J29j27J39O6k88K54j97O5l1N3M5j64L14k53J34k66J33k35L43n9l23
4882c11J12M03l39L59k71K29r0J63j72pj56O8J45k04J31%n7j5N3l1J03l49J22
4905a14K23J71j8l56J2L16m32p8J39K51j94L7j2O8P3j38q6J94n0K41k27k51L40
4928A09j61n8o5K60j18L0l3J10p3o0J14J0k7j25P0L12n2k01j74K14J76k39j2p6
4952f9O3k14L79q3k7L8k42m1M1j39J38J70N2J6k10k7L54k94J21r0j54L39j41K10
$$ plain form
4789 74 27 -86 -170 -166 344 112 200 -133 85 -101 -263 144 -27 85 -54 197 173 96 64 -6 21 201 71 34
4813 34 -10 114 -153 98 44 105 -119 -91 -51 135 -65 -26 299 185 -104 22 -46 32 250 82 -294 -275 93
4836 93 10 -303 -144 89 33 320 85 222 -20 -92 151 275 -231 -212 47 123 256 180 -48 280 -36 30 52
4859 52 -4 -43 86 -41 98 164 -124 130 -67 -2 -33 20 65 -99 215 -38 96 -170 -37 -272 71 12 -311
4882 -311 -199 204 -135 224 -47 182 92 255 83 76 -80 -12 133 -71 60 60 3 -12 41 10 113 -236 -114
4905 -114 109 280 262 -94 -82 234 -198 -276 -137 114 -80 -43 -55 13 86 -52 -138 56 6 247 20 -231 109
4928 109 -52 -110 -175 85 -33 -3 -36 74 1 -59 55 65 38 -87 -17 295 243 42 -132 82 258 19 7 -69
4952 -69 -6 -220 159 76 49 87 -155 -196 -155 -294 -156 14 66 82 -128 -155 199 -95 26 -64 -218 121 -20 190
4976A90j27j3q9N1j22J51q6L85l81N1l5J7K33m5j94L0O4n7k02K57J3Rk21K91n1
5001A19o3j2j09N0m2O1q5m1o6J87R7k71J98l4J58j53NK00k19J8K95n12R3J64R9
5026A37j03j80N3j0K80j08k98J74K8J29J71j71q8J85k53l1K37j70j65K04n7LJ44
5049A11rl2j1J36l5m43L13P1k31K65q3j8r5J55q6j06j25J79K5j94L19j60K9j93
5073b18L59O4k54J86k26J25n4j6j15k5J07L2o1K1l3j39L55L9n3J6j06J84l33J27
5097a8RK08j36j79k4K36o1j5l9J13J08j92m11K58K50J7l09J94p0K4K24j44L1n2
5121B2k93L79j87K31j78j50J03L23l37qM8Q7K9j28o6J26q5j05J39J81j41j06J32
5144A6j91L20j84kJ5L2Q5p6m3o3J19J04j18k6q7J23j35Q7k26K38j2M3j13O8R7
$$ plain form
4976 190 63 50 -39 12 -110 41 -45 340 -41 10 -25 -8 225 180 -14 16 80 23 -179 78 91 100 -121 170 119
5001 119 56 44 -65 -15 -57 4 -81 -122 -188 -1 96 -175 23 -11 147 -6 -1 199 -20 -2 293 -219 -126 38 137
5026 137 34 -146 -93 -103 177 69 -229 -55 -27 102 273 102 14 199 -54 -85 152 -18 -183 21 -36 -33 111
5049 111 102 70 59 195 160 -283 30 101 -130 135 52 34 -61 94 8 -98 -223 -44 -19 -213 106 -54 -25 -218
5073 -218 141 205 -49 137 -89 36 -18 -34 -149 -174 -67 -35 -96 -75 -108 -247 108 147 94 110 4 188 -145 -18
5097 -18 -9 199 63 -116 -140 96 35 20 -19 94 202 10 -401 -143 107 124 -185 9 -61 -37 187 43 74 22
5121 22 -271 108 -79 152 -26 -176 -73 250 -87 -95 -47 40 69 -59 -125 1 -84 -189 -50 131 -10 -116 16
5144 16 -175 145 -39 -41 -26 6 91 15 -28 -91 28 132 14 -12 -99 24 -111 -24 -250 -12 -24 19 -94 -26 71
5169G1P9j76j68K00q2M68n20j4K39n4N7o2j00j46J76P1j5O5O8l28K42R2k51n7
5193a45l0L83m30N37m47N0P2J25j62j45k8M63k36j32r3J03J26o5j03L51k9k31
5215f6P5O6l6j15K99j71j0l34M44j06J28m02M48l7j44j22J14LM2m0o2J2k9O9L8
5240F4l6j18J6K49k47q2J70l06O13l44L0L4m8L40k55J06j08j06J27k39K59j5l47
5263b43L07J5k23O9o5K75j82P1k5o5N2P5J61n5j88PL39k73l4j12o5L40k1l64K8
5288a76m8K97J3o9J13j90J24J89j83j94J34j39l4J37j92K78n2mJ12Kj42P4r7J13
5312F6l80K22K44j49k03L86J3j78l7N4lL03Qm23nL00M4o47K11R7j56M46m78J26
5336a39J63j20M5K91k44Q1P6Mj79J21m79L04J62l80J75oK33Q8n3Ll6l8j07J76
$$ plain form
5169 71 150 -26 -194 6 -76 392 -128 -142 97 43 100 38 -62 -208 -32 39 24 89 157 -171 71 163 -88 -145
5193 -145 -175 208 -222 315 -132 -82 -10 115 -47 -192 -220 243 7 -125 -218 -115 11 -54 -157 194 165 -66
5215 -66 9 75 39 -76 223 52 42 -292 152 46 174 -228 220 183 39 -83 31 34 76 36 -26 -14 -43 26 64
5240 64 28 -90 -74 175 -72 -154 16 -290 323 -21 9 43 -5 335 80 186 78 -28 99 -140 119 104 -243
5263 -243 64 79 -144 -75 -140 135 -47 24 -1 -66 -14 61 222 167 -21 -14 325 52 18 -94 -159 181 160 -204 -176
5288 -176 -224 73 86 17 130 -60 64 253 70 -124 10 -129 -163 -26 -218 60 8 4 116 118 -24 50 -47 66
5312 66 -314 -92 152 3 -200 186 199 21 -16 38 35 338 346 -77 -82 218 262 -385 -174 -77 -233 213 -265 -139
5336 -139 24 -96 -51 240 -4 77 153 157 -22 99 -380 -76 86 -294 -119 -125 108 196 143 146 110 72 -35 141
5360A41k47K55r7R1l49N2K11k97J74j62K50k07n2R4j59O9J65j10L68j53j1k7J09
5383A08l9q7l3m1J62k67N7L0j05k6K29J64j08k77K15JJk01M27m71N1M68m99J39
5407a02J40j45mJ39l6K64l61J74m37K60L03k24j85L28J22j93q9L7r7K80j47k63
5429b36L85k10O0m0K0j7N2J30j77J64J86k32j28no0K61K0k09J30r0K2R6K04j96
5453A30j52k20J86J05l1q7o4j06K77K14j10j74K57j16k5m9j9J27j05j95J21K37
5475B01m62R7R8r9P5O1J11l99K03n4K62m67P09l76j59M67O8k44J26m22J03M83
5497C82k39k39J38M7l19L77j22K0j53K60J00p0l54RJ93L2p5P8O5j03L6M6p8M9
5521H0J34j73L1l8K95l03mJ34l17J38k91J50k7J43J08k06J66q8O0Q9j40q8J52
$$ plain form
5360 141 -106 149 52 143 -206 -154 57 -240 -66 -228 22 -185 -237 -143 -302 -233 -68 -178 190 37 26 -1 108
5383 108 69 -18 -51 -92 70 -197 -140 -110 -215 -241 -12 152 44 -233 -18 -17 -16 -217 210 -261 -210 258 -241 -102
5407 -102 38 -107 -111 28 -8 256 -105 69 -368 -108 195 -29 -214 114 236 43 -46 -9 -106 174 27 -236
5429 -236 149 -61 -1 -41 -21 -38 14 144 -33 131 317 85 -43 -48 -108 153 173 -36 94 4 26 122 326 130
5453 130 -22 -242 -56 49 18 -69 -133 -239 38 252 142 -32 225 109 84 35 16 143 38 -157 -36 201
5475 201 -261 -164 -66 -165 -90 -29 82 -317 -114 -168 94 -373 336 -40 -199 268 336 92 218 -204 -101 382
5497 382 143 -96 42 89 -230 147 25 45 -108 152 252 182 -172 -163 30 62 -13 65 130 27 63 109 31 80
5521 80 214 41 72 34 329 26 22 156 -161 -23 -314 -164 -191 -48 60 -146 20 -68 -8 81 -59 -147 5
5544EN6l27J58O6Q7J51l63K84o2m7J2n1o6J9K8k76L46J23l33r5M71K2m58J19K03
5569G2n4N0M4n5j44P1k83M51l03p2K44j98J82J37k60K57r2J56j21J8M5P6k95j94
5593b68J74j78J65J20l8J54Q7l70J60N3j10m9L03M5n25M62l8k09J16j78J44J17
5615A37k56J17J04q1O1p0j53M2RM6r1N8O9Pj56oJ51J76j32RM1k24O8R8n6J52k63
5642a43Q8M4J76j52Kn8l3j6j28K28r6j18J79J25j09l41N96k1m07J43j23J13j28
5665a79L9J40k71L74m95L78J47j60l51N02k57l7J22l40O34j06ql56N16m03N8J39
5687H6R2m06K91k26K32N1j67k2m04O41Pk11M2O5l7l69J58j38K29K03L1m00M60
5710B08l48o3L28k58L67k22j67K67N2r2J50o24K48L11nr5j23j10R7j21R2K03K68
$$ plain form
5544 5 61 -266 -108 -42 45 196 -167 117 55 8 20 -31 -97 -78 -50 -326 20 143 -190 -285 186 208 -250 -131 72
5569 72 18 68 112 57 -87 -16 -299 152 -151 -223 21 -177 5 142 -118 139 47 203 82 100 145 221 -74 -268
5593 -268 -94 -272 -107 13 -25 129 216 -154 6 59 -51 -100 203 248 -277 185 147 -62 54 -124 20 137
5615 137 -119 -2 102 21 82 12 -141 -99 -90 -44 -135 -77 -8 -1 -157 -163 -12 164 32 41 82 -142 -74 24 -32 120 -143
5642 -143 -55 -11 165 13 15 -43 -76 -92 -220 8 -88 -206 -27 98 -11 -352 244 223 -184 -41 -164 -51 -179
5665 -179 -140 0 -271 103 -392 -14 133 -27 -378 124 -133 -170 -48 -388 246 140 132 -224 292 -111 -53 86
5687 86 178 -228 63 -163 69 120 -47 -69 -473 168 175 -36 6 71 34 -335 -177 -315 -86 117 148 -252 208
5710 208 -140 -203 125 -133 234 12 -155 112 164 72 222 -402 -154 157 152 57 -66 -176 -79 -200 -108 95 363
5733C63l62J52m03J13M2J42l0p8pJ5l4k56L59n1K6K26j93k24J65j32L46n3m43
5756c17L95P0k63J1K39j56j60L68l04K55R1rj68k31L00j09j29J83k07L84j7Ml57
5779a27M38m22k46K67L13pk96rj34K81mj54L93l25J1j4l5P2P0pj75L19l32J80
5803E7p6J70m4k07J64j06r0M9j91M28K5k09j05L68k90J59K1k8j20M8j50K02K25
5826C00k26j26J41j02j12n3J66L41l62j4L3J39j5j89L0P3K9q3j15K74l0m67L12
5849e6N4j36K76r3m3j21p5K15j52K33k57qJ3N6J89j3j99J2p4J33R7m1K42k35m5
5874b8Q1k68J73O0j45P8K43l53R7J33q8N3nj18Lm4L27l14J94J9k20K45k31J84
5898G6j05L60l47M6J03r1%n5L8K2j46J00O5j5P2j60k32J07K98k12J11J4o1j42
$$ plain form
5733 363 1 153 -250 -137 -95 47 17 -61 -68 -53 -87 -343 16 -35 -9 217 24 -200 -35 -167 179 126 -317
5756 -317 78 148 -115 -104 135 -21 -181 187 -117 138 229 220 52 -179 121 12 -117 66 -141 243 226 230 -127
5779 -127 311 -111 -357 -90 223 216 -80 -89 -223 58 54 -100 293 -32 -21 -35 -70 2 72 65 -110 209 -123 57
5803 57 -19 151 107 -100 64 -42 -132 -83 -274 154 179 -30 -135 233 -57 102 123 95 -25 23 -127 75 300
5826 300 74 -52 89 -13 -125 -178 -12 329 -33 -47 -14 125 110 -79 -49 24 53 -30 -145 129 99 -368 -56
5849 -56 -2 -138 138 45 2 -119 -194 21 -131 102 -155 -163 -150 -94 95 82 -117 -105 -179 -46 51 10 252 17 -28
5874 -28 53 -215 -42 18 -127 -49 194 -159 -62 71 -17 36 31 -87 -84 -128 199 -115 79 98 -122 123 -108 76
5898 76 -29 331 -16 30 133 42 42 -13 25 47 -99 1 66 51 123 -37 -269 -162 136 -76 35 49 -12 -154
5922a54K99j51j3j0J09J34j32k43J11k29j12L56n5L29m01J27J70Kk86J81j21J43
5944E4K47m21J73p6J0N2J26j32mL04j38l35J31J18j28K41k39J53j78j96M16K50
5966D28n32K27m4j54Ln6J59m8J36N7k66J02m8Q9JR1l8o5j19J40J6k2J49l03K68
5991A71k03Q1L7j23L7r4N1k7L26l98L13ok37O7N7j83K00j54R8j37J26J71l39o
6015a72R4J8P8J31l44jJ02L68j83k39j64L90j07O2K1k76J67J65k10K7M47k18J55
6038C11m17m2Q7k59L22K24R5n31K58r9k04J27o2J81j9M0Q3k85L60k72K15j04O7
6061G6K01j74N7j97p3J22k13K19L7k97L49J07l02R4J1L00k41k34K96l73M21j34
6083E2O0j94J22j61P5K44l92L97k47J25j68J24PK98m60j41J93P6k27J67J85j03
$$ plain form
5922 -154 145 -6 -19 -29 80 214 82 -161 -50 -279 -391 -35 -90 239 -162 -35 135 137 -149 32 -89 54
5944 54 301 -120 53 -23 -13 39 165 33 29 333 195 -140 -9 109 -19 222 -17 136 -42 -238 178 428
5966 428 -104 123 79 -75 -72 -128 31 -17 119 176 -90 12 -36 53 54 145 107 42 -77 63 79 57 206 -97 171
5991 171 -32 49 86 -37 0 -94 -43 -70 256 -142 171 165 -72 -5 52 -131 69 -85 13 -124 2 173 -166 -172
6015 -172 -78 -60 18 149 -195 -196 -94 274 91 -148 -312 78 -29 33 54 -222 -55 110 -100 -73 374 156 311
6038 311 -106 -148 -61 -320 2 226 321 -210 48 -51 -255 -128 -190 -9 -28 12 95 -190 170 -102 113 9 76
6061 76 277 103 160 -37 -110 12 -201 18 55 -242 107 214 -88 6 17 317 76 -158 138 -235 186 52
6083 52 112 -82 40 -121 -46 198 -194 203 -44 81 -87 37 44 342 -118 -259 -66 10 -217 -50 135 32
6105C2j33J72j77K5J98p3K21O5l90J32k9j77J59r0J06q0J83n5J70l16J17j10N3
6128Cm7j03l1J80k31L58l5j41k8j85L47j96J45l7k64J82j60L28j95j7p1K36L4
6151G2k32k4L59j27m6k44K25k0Jj07N3Q1M9l79N02mk44J66l04L3K48o6k2q7K54
6176A37m07L74j09J9m4P5j46J86k81K75j15M0J0J0J59l54j05J44K51m1j0j33j4
6199g9p2R0n2j31K96J04j03k75K29O9m2JM0r6O7k53Q9J68m8L6j21J83r7j6K1o7
6225e9JJ41m2o4j87Q5j07M46k97J41j9j78Jp5K72k90N12k54K12k21m8J99L4pj15
6250H1N9m7j94O3K25l31J54J71n2Q1m88M16m95K49L84j91P5l10N3K01k13K15k67
6273a61OL61O2n07M52l73P7j9K3K01n0l36K31J27n2M7l04o8L50J8J58j57k34K23
$$ plain form
6105 32 -101 71 -106 -81 117 44 265 330 -60 72 43 -134 25 -65 41 -39 144 89 259 -57 60 -50 3
6128 3 -44 -147 -178 2 -229 129 94 -47 -75 -260 87 -109 36 -1 -265 -83 -243 85 -110 -127 -198 38 72
6151 72 -160 -184 175 48 2 -242 -17 -37 -36 -143 -90 -9 40 -339 163 159 -85 81 -223 -190 58 -8 -30 -117 137
6176 137 -270 104 -5 14 -30 45 -101 85 -196 79 -36 4 14 24 183 -171 -276 -132 119 78 68 -65 -79
6199 -79 -151 -61 -113 -244 52 156 53 -222 7 76 34 35 75 -21 46 -207 -118 50 2 38 -83 100 3 -13 8 -59
6225 -59 -58 83 41 -23 -210 -125 -232 214 -83 58 39 -139 -138 -213 59 -231 281 27 239 18 -30 169 203 196 81
6250 81 140 93 -101 -38 187 -144 10 181 129 210 -278 138 -357 -108 276 85 160 -150 -97 104 -109 106 -161
6273 -161 -155 206 268 -239 213 -160 -83 -102 -79 122 72 -264 -33 94 42 89 -215 -283 67 85 243 86 -148 75
6297G5k8MJ32j56P3k7q6r6J97l74K72j3Q9p7K8J0k31Q9J89l27K56j7M2p5p4Q8
6323c7j00J61O4l3l54L97l14K61J84r0J75l34J30j00j33j39M13l13L10j72J95
6344A71k74Q0k14J85K43j38P9l47M28k66M8j59K82j85K13j33n4M8k85O1K22J18
6366A23N3p0m0l86M69j94P9L3K0m10J71Q7J26k24J90J7l19M96j98j67j66L9N20
$$ plain form
6297 75 47 51 183 27 100 73 -13 -109 88 -286 -14 -27 62 -15 13 23 -208 -119 70 -257 -1 -18 24 -51 -125 -37
6323 -37 -137 24 88 55 -299 98 -216 45 229 139 314 -20 110 10 -123 -262 151 -162 148 -24 171
6344 171 -103 -23 -237 -52 191 53 132 -215 213 -53 -5 -164 118 -67 146 13 -41 7 -278 -217 5 123
6366 123 176 106 66 -320 149 -45 34 67 87 -323 -152 -65 61 -163 27 44 -275 221 23 -144 -310 -271 249
$$ [...]
8191e5
##END NTUPLES=NMR FID
##END=
