##TITLE=1H_DE-80H_X3
 200.13MHz, d2o
 8 sc
 
 19ns.26.2.2025
##JCAMPDX= 6.0         $$ Bruker NMR JCAMP-DX V2.0
##DATA TYPE= NMR FID
##DATA CLASS= NTUPLES
##ORIGIN= UXNMR, Bruker Analytische Messtechnik GmbH
##OWNER= pz
$$ XWIN-NMR		Version 3.5
$$ Mon Apr 21 13:57:23 2025 Russian Standard Time (UT+4h)  Yarkov@DPX200
##.OBSERVE FREQUENCY= 200.1313
##.OBSERVE NUCLEUS= ^1H
##.DELAY= (6, 6)
##.ACQUISITION MODE= SIMULTANEOUS
##.ACQUISITION SCHEME= undefined
##.AVERAGES= 8
##.DIGITISER RES= 18
##SPECTROMETER/DATA SYSTEM= spect
##.PULSE SEQUENCE= zg30
##.SOLVENT NAME= CDCl3
##.SHIFT REFERENCE= (INTERNAL, CDCl3, 0, 14.3821)
##AUDIT TRAIL= $$ (NUMBER, WHEN, WHO, WHERE, WHAT)
$$ ##TITLE= Audit trail, XWIN-NMR		Version 3.5
$$ ##JCAMPDX= 5.01
$$ ##ORIGIN= Bruker BioSpin GmbH
$$ ##OWNER= Yarkov
$$ C:/Bruker/XWIN-NMR/data/yarkov2/nmr/H-C/1/audita.txt
$$ ##AUDIT TRAIL=  $$ (NUMBER, WHEN, WHO, WHERE, WHAT)
(   1,<2025-04-21 13:56:04.00 +0400>,<Yarkov>,<DPX200>,
      <created by zg, POWCHK disabled, PULCHK disabled
       configuration hash MD5:
       00 E9 B6 7A A2 85 ED C7 34 08 36 98 17 FE 4E 26
       data hash MD5: 16K
       6C EE 8F 95 DD B8 2E AF 6A EF 76 05 AD B8 59 06>)
$$ ##END=
$$ 
$$ hash MD5
$$ 33 63 50 92 78 03 66 BD 10 1E 96 5D C7 E0 9C C4
##$RELAX= 
##$RELAX= 
##$RELAX= 
##$RELAX= 
##$RELAX= 
##$RELAX= 
$$ Bruker specific parameters
$$ --------------------------
##$DU= <C:/Bruker/XWIN-NMR>
##$EXPNO= 1
##$NAME= <H-C>
##$PROCNO= 1
##$TYPE= <nmr>
##$USER= <yarkov2>
##$AMP= (0..31)
100 100 100 100 100 100 100 100 100 100 100 100 100 100 100 100 100 100 
100 100 100 100 100 100 100 100 100 100 100 100 100 100 
##$AQSEQ= 0
##$AQ_mod= 1
##$AUNM= <au_zg>
##$AUTOPOS= <>
##$BF1= 200.13
##$BF2= 200.13
##$BF3= 200.13
##$BF4= 200.13
##$BF5= 200.13
##$BF6= 200.13
##$BF7= 200.13
##$BF8= 200.13
##$BYTORDA= 1
##$CFDGTYP= 0
##$CFRGTYP= 5
##$CHEMSTR= <none>
##$CNST= (0..31)
1 1 145 1 1 1 1 1 1 1 1 1 1 1 1 1 1 1 1 1 1 1 1 1 1 1 1 1 1 1 1 1 
##$CPDPRG= <>
##$CPDPRG1= <>
##$CPDPRG2= <>
##$CPDPRG3= <>
##$CPDPRG4= <mlev>
##$CPDPRG5= <mlev>
##$CPDPRG6= <mlev>
##$CPDPRG7= <mlev>
##$CPDPRG8= <mlev>
##$CPDPRGB= <>
##$CPDPRGT= <>
##$D= (0..31)
0 0.7 0 0 0 0 0 0 0 0 0 0.03 0 0 0 0 0 0 0 0 0 0 0 0 0 0 0 0 0 0 0 0 
##$DATE= 1745229363
##$DBL= (0..7)
120 120 120 120 120 120 120 120 
##$DBP= (0..7)
150 150 150 150 150 150 150 150 
##$DBP07= 0
##$DBPNAM0= <>
##$DBPNAM1= <>
##$DBPNAM2= <>
##$DBPNAM3= <>
##$DBPNAM4= <>
##$DBPNAM5= <>
##$DBPNAM6= <>
##$DBPNAM7= <>
##$DBPOAL= (0..7)
0.5 0.5 0.5 0.5 0.5 0.5 0.5 0.5 
##$DBPOFFS= (0..7)
0 0 0 0 0 0 0 0 
##$DE= 6
##$DECBNUC= <off>
##$DECIM= 32
##$DECNUC= <off>
##$DECSTAT= 4
##$DIGMOD= 1
##$DIGTYP= 9
##$DL= (0..7)
0 120 120 120 120 120 120 120 
##$DP= (0..7)
150 150 150 150 150 150 150 150 
##$DP07= 0
##$DPNAME0= <>
##$DPNAME1= <>
##$DPNAME2= <>
##$DPNAME3= <>
##$DPNAME4= <>
##$DPNAME5= <>
##$DPNAME6= <>
##$DPNAME7= <>
##$DPOAL= (0..7)
0.5 0.5 0.5 0.5 0.5 0.5 0.5 0.5 
##$DPOFFS= (0..7)
0 0 0 0 0 0 0 0 
##$DQDMODE= 0
##$DR= 18
##$DS= 0
$$ [...]
##$SUBNAM2= <"">
##$SUBNAM3= <"">
##$SUBNAM4= <"">
##$SUBNAM5= <"">
##$SUBNAM6= <"">
##$SUBNAM7= <"">
##$SUBNAM8= <"">
##$SUBNAM9= <"">
##$SW= 18.0517328524113
##$SWIBOX= (0..15)
0 0 2 0 0 0 0 0 0 0 0 0 0 0 0 0 
##$SW_h= 3612.71676300578
##$TD= 16384
##$TD0= 1
##$TE= 0
##$TE2= 300
##$TE3= 300
##$TEG= 300
##$TL= (0..7)
0 120 120 120 120 120 120 120 
##$TP= (0..7)
150 150 150 150 150 150 150 150 
##$TP07= 0
##$TPNAME0= <>
##$TPNAME1= <>
##$TPNAME2= <>
##$TPNAME3= <>
##$TPNAME4= <>
##$TPNAME5= <>
##$TPNAME6= <>
##$TPNAME7= <>
##$TPOAL= (0..7)
0.5 0.5 0.5 0.5 0.5 0.5 0.5 0.5 
##$TPOFFS= (0..7)
0 0 0 0 0 0 0 0 
##$TUNHIN= 0
##$TUNHOUT= 0
##$TUNXOUT= 0
##$USERA1= <user>
##$USERA2= <user>
##$USERA3= <user>
##$USERA4= <user>
##$USERA5= <user>
##$V9= 5
##$VALIST= <valist>
##$VCLIST= <CCCCCCCCCCCCCCC>
##$VD= 0
##$VDLIST= <DDDDDDDDDDDDDDD>
##$VPLIST= <PPPPPPPPPPPPPPP>
##$VTLIST= <TTTTTTTTTTTTTTT>
##$WBST= 1024
##$WBSW= 4
##$XGAIN= (0..3)
0 0 0 0 
##$XL= 0
##$YL= 0
##$YMAX_a= 91069
##$YMIN_a= -126311
##$ZGOPTNS= <>
##$ZL1= 120
##$ZL2= 120
##$ZL3= 120
##$ZL4= 120
##$ABSF1= 10
##$ABSF2= 0
##$ABSG= 5
##$ABSL= 3
##$ALPHA= 0
##$AQORDER= 0
##$ASSFAC= 0
##$ASSFACI= 0
##$ASSFACX= 0
##$ASSWID= 0
##$AUNMP= <proc_1d>
##$AZFE= 0.1
##$AZFW= 0.1
##$BCFW= 1
##$BC_mod= 2
##$BYTORDP= 1
##$COROFFS= 0
##$CY= 83.5205535888672
##$DATMOD= 1
##$DC= 2
##$DFILT= <>
##$DTYPP= 0
##$F1P= 10.8118882576601
##$F2P= -7.23987719738617
##$FCOR= 0.5
##$FTSIZE= 0
##$FT_mod= 4
##$GAMMA= 1
##$GB= 0.15
##$INTBC= 1
##$INTSCL= 1
##$ISEN= 128
##$LB= 0.25
##$LEV0= 0
##$LPBIN= 0
##$MAXI= 10000
##$MC2= 0
##$MEAN= 0
##$ME_mod= 0
##$MI= 1.114404
##$NCOEF= 0
##$NC_proc= 0
##$NLEV= 6
##$NOISF1= 3.799351
##$NOISF2= 2.8
##$NSP= 1
##$NTH_PI= 0
##$NZP= 0
##$OFFSET= 14.38212
##$PC= 1
##$PHC0= -838.1483
##$PHC1= 20.53372
##$PH_mod= 1
##$PKNL= yes
##$PPARMOD= 0
##$PSCAL= 0
##$PSIGN= 0
##$REVERSE= no
##$SF= 200.129724274929
##$SI= 16384
##$SIGF1= 3
##$SIGF2= 2
##$SINO= 400
##$SIOLD= 16384
##$SREGLST= <1H.CDCl3>
##$SSB= 0
##$STSI= 0
##$STSR= 0
##$SW_p= 3205.1282051282
##$SYMM= 0
##$S_DEV= 0
##$TDeff= 0
##$TDoff= 0
##$TI= <>
##$TILT= no
##$TM1= 0
##$TM2= 0
##$TOPLEV= 0
##$USERP1= <user>
##$USERP2= <user>
##$USERP3= <user>
##$USERP4= <user>
##$USERP5= <user>
##$WDW= 1
##$XDIM= 8192
##$YMAX_p= 0
##$YMIN_p= 0
$$ End of Bruker specific parameters
$$ ---------------------------------
##NTUPLES= NMR FID
##VAR_NAME=  TIME,          FID/REAL,        FID/IMAG
##SYMBOL=    X,             R,               I
##VAR_TYPE=  INDEPENDENT,   DEPENDENT,       DEPENDENT
##VAR_FORM=  AFFN,          ASDF,            ASDF
##VAR_DIM=   8192,          8192,            8192
##UNITS=     SECONDS,       ARBITRARY UNITS, ARBITRARY UNITS
##FACTOR=    0.0002768,     1,               1
##FIRST=     0,             0,               0
##LAST=      2.2672688,     0,               0
##MIN=       0,             -126311,         0
##MAX=       2.2672688,     91069,           0
$$ Real data points
##PAGE= N=1
##DATA TABLE= (X++(R..R)), XYDATA
$$ [...]
1880G83j256K67O78j063P54M67j025P14l01o28J540q90k87Q07j129K96R87j432
1898g18O75J60r48J255j34p71J054p70k77J037n88K2P94j269P13L18j043R74m76
1917Hn81R55n64j88J114j473K31J073j153R61K11j519J235j41k65J236r26n22
1935c08J012r52K90Q82j680P67l1p25J222o62n98J066o71K50R50j109K33M14q99
1954e49J009k01p41R43l73m66J189r42l71Q45j100N99O54j243P81l3q59J551o02
1973I1k50Q16r63J53Q13q96N13J31j006R24J59j063Q23n59l70R77n04J28M91j276
1993h68Q39M18r28J015k80q41J347p20l31R76j128K98M67q22R36k43r54R38k93
2012a74j90R32p94k06Q70q55M76P30j274N82J13o31J079o24l25P20o21r5P99q70
$$ y = [783, -473, -206, 472, -591, 163, 630, -395, 319, 18, -610, 930, 40, -247, 560, -569, -273, 714, -718, -43, 117, -831, 424, 290, -481, 573, -197, -474, 563, -25, -3, 791, -478, 235, 553, -490, 484, 8, -573, 382, -182, -370, 744, -729, -498, 575, -578, 383, 594, -925, 310, 169, -96, 1140, 214, -308, 704, -248, 42, 924, -756, 11, -20, -745, 477, -185, -783, 283, -388, -138, 812, -297, -64, 350, -549, 460, 259, -482, 461, 88, -378, 811, -131, -502, 343, -757, -158, 496, -747, 34, 1, -858, 693, 91, -159, 657, -306, -153, 660, -236, 277, 408, -598, 326, 485, -578, 245, -314, -684, 293, -211, -83, 408, -868, -29, 389, -539, 476, 196, -645, 702, -18, -349, 627, -501, -203, 264, -558, 378, 135, -819, 119, -174, -364, 568, -226, -432, 438, -417, 59, 789, -485, 97, 210, -421, 658, 34, -291, 429, -192, -287, 512, -358]
2032c58K66M92j193P88K59r10Q96n77k70J212o53m8M63r57N55N50r14P80k04p38
2052e61O69k24k27O64q23NJ045p90K58M42j141P88K31n29P90m80n05R67p06K89
2072A62M72j112L59M03p03O76j46q99J149n42k15Q18n04%N03r17O71N30j135P75
2092C45m96k87J064o29m22J138j103K55N70r83O45m0p39Q80j65o06J010o89N9
2111a93P51p64L22K51r52P59K82p53O97k42o96J133q23K7O65r85L25N34p92N10
2131E6L64r71Q31K6n24P60p38r9R04j058P72M8r21O50j62m59R77n45k75R27q58
2152b95o5J074j064L26M66q77O65k8o95P86n03j92Q92o44j46O76q82N31K40p30
2172d65P74m2r46R83k37k71R26q84O8N59q70O05j68m33O77j64p46J019o76o5O23
$$ y = [-358, -92, 400, -793, -5, 254, -656, 240, -337, -607, 605, -48, -96, 367, -590, -35, 515, -399, 381, 177, -561, 108, -116, -343, 321, -502, -497, 548, -242, 16, 458, -683, 105, 336, -193, 597, 117, -388, 579, -127, 162, 634, -478, -119, 284, -419, 257, 111, -788, 361, -181, -396, 422, -82, -82, 421, -496, 175, 705, -430, 345, -151, -438, 626, -3, -425, 713, -390, -135, 435, -548, 97, 57, -682, 198, 33, -573, 437, -252, -193, 558, -206, 116, 367, -585, 174, 456, -297, 400, 158, -538, 595, -228, -201, 464, -521, -196, 338, -454, 56, 420, -551, 280, 306, -218, 542, -196, -295, 609, -449, 323, 371, -550, 100, -62, -521, 456, -89, -364, 563, -295, -360, 714, -350, -24, 442, -435, 230, 202, -493, 293, -210, -402, 490, -154, -300, 376, -506, 25, 265, -465, 309, 267, -679, 304, 67, -204, 722, -162, -94, 465, -405, 200, 32, -401, 276, 112, -634, 385, -291, -356, 267]
2193B67n70K15N71r02L93K99p97R48j31q71J218r26J09O17r72P1Q39q26M37L48
2213C37r53J084l88l82P82l86m5M30q05N43J16q00P57J56r30O11j77m57P98n07
2233b16r6M45o43O32J74q06N45Q2m94O23k79l18P12n74n2O68p27L83J16p44N97
2254B8J32o29Q15n13j86N74o59N90K06n92M13K22p65P72l44m38P24p41j8O34p96
2275e71M77O74p44K63R0o35N50J13o18Q49l07j85L72n09M10J25n18L48m1o03Q65
2296D05j74o70P51m89j80Q19o83NM04n53P62j43n47P76l97k06O09m67j97N38o45
2317b82K33L94n66L42J14p10O84p4l01L29n63J26P74o93L07K05p86N29Q8m02O33
2338C81l56k38O03m40j09M68p32L57M56o48M65j93k94N88l46k15O45n35KN76o79
$$ y = [267, -303, -88, 483, -419, -26, 273, -524, 424, 293, -578, 640, -286, -177, 440, -532, -461, 378, -448, -11, 337, -616, 468, 80, -302, 480, 94, 49, 479, -326, 217, 333, -467, 290, 446, -484, 127, -50, -507, 291, -216, -312, 133, -510, 122, 296, -510, 35, 117, -377, 246, -33, -351, 361, -213, -265, 403, -324, 59, 175, -569, 28, 160, -469, 346, -167, -353, 221, -438, 152, 358, -234, 179, 401, -364, 408, 64, -374, 350, -391, -409, 225, -571, -94, 580, -164, 99, 189, -446, 104, 217, -401, 448, 141, -44, 328, -181, 229, 354, -164, 184, 143, -460, 405, 231, -439, 312, -177, -357, 462, -221, -216, 188, -365, 397, 254, -293, 483, 86, -120, 489, 22, -175, 363, -282, -49, 345, -221, 121, 235, -475, 209, 135, -166, 163, -400, -274, 500, -193, 114, 319, -467, 62, 150, -252, 381, 25, -213, 390, -50, -159, 309, -423, -66, 390, -258, 207, 14, -280, 308, -38, -253, 392, -143, -141, 435, -244]
2359b44M44K71p69L20r8l18P71m68l22P03o08K52N48q23M79J00n82P54j9n92N07
2380C06j16m79O56o24M0O71j030O40M19q62O03m30k83Q60k08k98K15k76J78L00
2400B82m35L82j15m47M92j88m51Q10n61Q6L12m99O62n9o94M27J85l64P28n27j35
2421a09M36l34J13J16n58L80L0m79O06J8o32P55m91r5P09m41J2P7l05K97J89l56
2443f2L17k57k46M86j43k77O01n32k71P33l69J75j6m72N85j93l01K83j48m5J25
2464b7K3J06J05n00K12K75k52L16l66k54P05m09k58L82l34J07K89j40J36L0l55
2485b09O55m37Q8J41k73j13L52l02J80J92o26M53O5m42N11l37j70L80l41m1K08
2506f6m13L29L9j15K94K29m40K29j38j60N17l32k22M12l49M1M95n34M12l55j10
$$ y = [-244, 200, 471, -298, 22, -76, -394, 377, -91, -413, 290, -318, -66, 482, -341, 138, 238, -344, 410, 391, -201, 306, 190, -289, 367, -257, -217, 454, -576, 64, 483, -379, 224, -206, -489, 371, 163, -135, 80, -196, -18, 282, -153, 229, 114, -333, 159, -29, -480, 330, -231, -145, 167, -332, 330, 271, -423, 4, 189, -175, 553, 26, -109, 327, -7, 106, 222, -336, 44, 74, -405, 201, 219, -413, 342, -149, -244, 465, 24, 36, 113, -192, 105, 294, -62, 255, -2, -248, 238, 95, -182, 419, -113, -384, 349, -20, 155, 139, -333, 252, 59, -242, 41, -107, -152, -27, -4, 102, 207, -293, -81, 194, -58, 258, -108, -362, 343, -66, -324, 58, -276, -169, 120, -20, 116, 146, -209, 446, 9, 97, 238, -35, -148, 204, -98, 82, 274, -352, 101, 166, -276, 235, -102, -272, 108, -233, -274, -66, -479, -150, -111, -226, 68, 297, -143, 86, -52, -212, 305, -27, -249, 163, -186, -145, 350, -184, 228, -127, -237]
2527b37N28p3l18K32j87r9L28m14L83Mm15J64O7M8M10n40J75K30o00K24L43n23
2549b70K33K0k61M61n9k02J65J57l34M70n44J73K68m36L37M2n19N66m4l89L74
2570B08l44j38M12r1J7P4m12J86L43k63J33n2k11J95k46K38J23l65OJ02j83K66
2592bJ5m12M55j85m6M66m42R3L21m29R5L14k16K9L15o35K73J9k60K27r8p0K71
2615I8k95L70j56l84M25q2R3J89j35l73K55QN6K32n12K08J14k63L96j64m39N37
2637A78m66L40Q6j26r0L45m07J77J70k75K63k44j43L16j1j20o0k38K83J92k60
2658i0J33Q0m02L78K2m12M03j41j5J56o2o2O4k41K31M0k62L00j48J15%l13L27
2681A01j47p7K81j86K96j65k7j42K24r6k37K50j49L2J65l91J91J32l59M94o2k06
$$ y = [-237, 291, 218, -100, 132, -55, -154, 174, -240, 143, 147, -268, -104, -37, 11, 421, -119, 56, 286, -314, -90, 253, -270, -37, -17, -278, 183, 124, -78, 87, 244, -90, 380, -164, 9, 277, -159, 178, 220, -299, 267, 223, -166, 208, -136, -274, 138, 47, 64, 138, -274, -88, 255, -8, 125, 73, -138, 57, -189, 49, 172, -193, -187, -85, -268, -2, 13, -399, 56, -129, -175, 291, -151, -58, 263, -166, -71, 243, 27, 56, 371, -264, 9, 28, -232, -5, -103, -173, 98, -197, 173, 17, -367, 58, -24, 69, 258, 123, -250, 5, 13, 69, 301, -211, -3, 111, -152, 244, 80, -359, 178, -288, 52, 138, 12, -78, 267, -140, 37, 207, -68, 195, -49, -192, 124, 113, -7, -67, -305, -22, 170, -90, 43, 123, -279, 99, 121, -291, 112, -29, -44, 112, 50, -12, 52, -189, 42, 82, -180, 120, -28, 87, 87, -226, 101, -46, -123, 158, -28, 268, 103, 76, -66, 158, 62, -175, 75, -74, -42, 123, -268, -77, 55, -304, 190, 128, -78]
2703g8L34j74L6j94M9j41M35m37J42K9o1J92j14O0J24k48l5J5p7r3L37j67J65
2726I9J36k30J76l07j2K50j82j43L59k72J25K44l20K20o2k75K69k56r6M72k04
2747in0J36l95J97K5OK64l56J19R1j16n9J15M1J11J45l36J04J14l47J95O7k0Q1
2771A23j10jL1k17L9K00r3j07L48k81O0N3K4N5l03n8M02l12K98j95j89J19J50
2794C6l2J9J97l63L25j83RJ77k83M24q1l96J96Rj32J50k06nL52k83J33q1R4J2
2818H8K4j36l5J73N0q2k47J47J91j42P0J68l18L9J67j64R7J3j61K34j26n2J53
2841A51k64O2J08Lr1N8j78J35j52o6L89j66J84Pj82m9J68k95kM10m15J23r6l0
2865a88K02N6k16J96j22j6L7j86L11j23R1l4N8j08J89Q9l60L73j25k25J30j24
$$ y = [-78, 256, 82, 118, -76, -27, -168, 267, -170, -28, 1, -60, 132, 18, 78, 202, -46, -81, -66, -143, -236, 101, -66, 99, 235, 5, 181, -126, -138, 112, -70, -213, 146, -126, -1, 243, -77, 143, 81, -194, 75, -181, -277, 195, -9, -59, 77, -318, -121, -96, -90, 174, -182, -63, 28, -88, -147, -32, 9, 120, 265, -71, 33, 147, -200, -5, 62, 42, 123, 13, 12, 43, -174, -135, 65, -28, -135, 213, -68, -8, 45, 69, 124, -179, -237, 165, -147, 151, -44, -233, -114, 36, 4, 23, 220, -143, 182, -1, 8, 185, -98, 326, 245, -151, 45, 54, -78, 72, -134, -139, 213, -70, 63, -18, 76, 88, 112, -24, -59, 114, 164, 82, -165, -18, 173, 31, 101, 269, -49, -10, 157, -7, 90, 103, -58, 176, 50, -2, 151, -113, -51, 57, 60, -31, 27, -151, -16, -168, -234, 155, -11, 173, 180, -2, -51, 117, -178, -180, 230, -185, -62, -158, -188, 14, 70, -146, 50, -72, -88, -51, -237, 74, -49, 42, 8, 66, -42, 147, 236, -124, 249, 124, -101, 29, -95]
2887i5J29J14k35R8k22J41J20J51m28K68l6j47J74Pp0l1%q9J34lN8p8J7K25k01
2912AJ2O1k27K08J20j66nJ43l06J74J38j27j67J29ln0J7j18K55J71k16r5Q1NN3
2937H8p2o6P0j20K05j25K38j75j58N2K33kp6Q8j54Q5l64K51j6P0Pj8k74Q1J90
2962C8p4J69m1r9pj00Q8P1k11J25O1q5K20K1k99K9On7J07K04l41M4O5j23K8J20
2988d1J5K6j19K39J7j19j71J0o4J80J73j10j4j72R4P6j59J15J42j58N2MK1n7J8
3013bj30o4j5K40m06K05J52m4j05L4K62k18K59k67J14Pj96J72o3J24j18J37r8
3036b0m8k7K38N4j2k2k51J92R2l5j98m3J04K07l00R4M1j19l5O3O8l0N1l04J40
3061a00m9qJ78p7J01j55J98m4K4k37L74k18Q6J08m29K56j81J32Q0Q2M7l44j7L01
$$ y = [-95, 34, 148, -87, 11, -211, -70, 50, 201, -227, 41, 5, -142, 32, 39, -31, -62, -62, -151, -17, -20, 38, -40, -23, 202, 1, 13, 74, -153, 55, 175, 9, 4, 147, -159, 15, 153, 26, -141, -12, -15, -65, -48, -166, 89, 260, 44, -51, 30, 35, 88, 16, -50, 20, -100, 105, -20, 218, 43, -115, -63, 170, 168, 92, 180, 26, 111, -253, -2, -18, 52, 59, 41, -233, -152, 38, -36, 133, 92, -7, -14, -114, -26, 45, -166, -41, 20, -65, 155, 176, -123, -94, -88, -145, -38, 166, -175, -131, -66, -189, -161, -41, -26, 0, -119, 120, 137, 18, -153, -143, -207, -27, 146, 36, 22, -150, -56, 20, -139, -24, 118, -40, 12, 16, 37, -20, -2, -132, -196, -211, 29, -377, -172, -20, -64, -169, -135, 127, -91, 168, -99, 15, 22, -174, -2, -65, 59, -59, 78, -20, -68, -95, 143, 197, 185, 163, -88, 104, 196, 161, -37, -80, 24, 231, -69, 25, 66, -53, -88, -25, 43, 13, 64, -240, -100, -149, -157, 21, -56, 45, -110, 88, 44, 68, -169, 205, -13, 73, 181, -248, 8, -173, -41, 39, 121, 168, -176, -193, 108]
3085A08k89K86J8J8j22L0lp2Q9p3L8j3Qo6k1O2j3k7j76O1N5j07J85k6j4J29j8
3112D7J08n7j95K21j59m4o9K99J37l12k04J08j6J73o4mL8L20l74j12K03o7J13
3135I0l1p2K58l7k21J11j12Q9k52K56m2j90JK21j1j29j3p0P7L4j01K98k82L05
3159A77m9k31j65K79K5Q1j57L3j63M0Q8L8K2K02l67K64K5Pk65L4O3n0K10P4k33
3184a8k88L17K02l05J0Q1K40r3j71L07k85o1j09J77j44K22O1m0P1k42p8J54p5
3207f7J79k71j02L23j01j87K97j45J52qj70K54k12N7K50m06J43J91k64K50k12
3228d9n2K4J09j1J41m6k25j7K78k31J42q9p1K95l36K07J04m8j8k38K43J48l46
3251h6j25J43K17k90N8p3K51Nk24J01k03J48J29l8k40R9J13j04K25k34M78k17
$$ y = [108, -181, 105, 123, 141, 19, 49, 46, -26, 63, -10, 28, 15, 23, -43, -64, -2, -15, -42, -218, -157, -102, -209, -24, -50, -64, 65, 47, 155, 98, -97, 124, -35, -79, -148, 151, 288, -24, -228, -120, -136, 37, -27, -31, 7, 327, -47, -159, 44, -23, 90, 59, -13, 245, 208, -13, 98, -14, 75, -177, 79, 37, -153, -152, 69, 58, -71, -84, -154, -77, -43, -144, 154, -128, 177, 128, -103, -268, 11, 36, 117, -40, -7, -170, -130, -42, -4, 18, 220, -147, 117, 142, 149, -116, -82, -19, -69, 141, 215, -18, -306, 11, 213, -92, -82, -1, 239, 146, -25, 282, -3, -64, -173, 4, -140, 82, 143, 103, 174, -68, -146, 8, -67, 112, -159, -261, 62, -39, -226, 71, -74, 78, 70, -100, 154, -58, -1, 249, -157, -14, 177, -87, 163, -49, -101, -77, 32, 21, 162, 116, -109, -126, 152, -79, 63, -26, -97, 198, -138, 69, 173, 125, 107, -131, 112, 260, -86, -211, -68, 149, -141, -83, -156, 95, 100, -124, -23, -226, -78, 51, 13, -227, -128, -15, -119, 106, -128, 350, 133]
3273A33k94J84j39R6L4R8j67J58j07J35j56j23J89J26k13O2J81m04K06rp1J94
3295A13oj53Q9Nl6j05Jp4J59n0K44k02j88K81k13K9M12m89J40J31j00K03k75o4
3319a48O0O0N0J28J0l56J94k08N4J22j1J97m8J1j15j8N6J46l16J04J28j64R0O9
3343I5l63J54J32qO3Nj78K27j48k4J26k46J62N6p6J35J3l96M72m06O1M67m47J20
3367dp2l5lL17m85L29N1j30K00k04r6K01l1J5J25k97L20n8k38Q6n5r8L79j84p2
3392c9J26K9Ql2l13K98q6j20J88j28p0K73j38k40K96j52K22Or5j8n6j71N45l77
3416d4j76K91q7k8J91j10n6O7j31J18k86J08K50j82l1L96m11J07K05m39K54J1
3438A7l3R9Q9m00J78N4MKJ51m5q8Q5j17m4r6OJ3mK84k14q6L51k89J80N7j60J05
$$ y = [133, -161, 23, -116, -20, 14, 112, -55, 103, -4, 131, -25, -148, 41, 167, -46, 16, 197, -207, -1, -10, -81, 113, 107, -46, 43, 48, 12, -93, -92, -166, -7, -57, 187, -15, -203, 78, -135, -106, 306, -183, -43, 88, -12, 191, -84, -148, -88, -28, 22, 150, 160, -196, -2, -210, -156, -34, -45, 152, 104, 115, 0, -18, 38, 184, -132, -28, 100, -64, 26, 95, -268, -114, 18, 10, 73, 78, -100, 127, -21, -45, 81, -165, -3, 53, -23, 112, 125, -271, 201, -205, -144, 323, -124, -4, -76, -111, -114, 203, -282, 47, 98, -32, 168, -36, -132, 69, 38, 53, 178, -119, 201, 143, -95, -9, -64, -162, 217, 33, -39, 87, 116, 124, 92, -221, 77, -9, -129, 59, -69, -139, 134, -4, -244, 52, -100, 122, 128, 33, 15, -41, -212, 333, -44, -220, 71, -16, -44, 147, 37, -19, 48, -83, 35, -251, -143, 107, -75, -106, 290, -121, -14, 191, -248, 6, 17, -16, 83, 172, -228, -50, 4, 8, 10, 161, 116, 28, 113, -4, -48, -144, -138, -125, -129, 155, -59, -145, 206, -83, 97, 154, -6, 99]
3465I9Mk51K65j46J59k52Q7P4j09j91J12K12k30N27m11J3L18l00M8J58k47j11
3487a72L06j77L0M59p23L72j42j13J80Rj02M23n42J42J70l13J91P6m03N22j22
3508G1j50K07J15l49L30l84R2L41j60k70J83K9J16j20k27J89k72J67K82k54M0
3529b4Kj65K92j47K01j95M9k34L01k94J51J37l91L24j08k76L95o3J06K54j67k78
3551a30K87l46j4M18j92j31L34m47L40K18l86K68k46j24K35k05p2M56n18K56j32
3572a31J28l1r9m0L01j77n9L41j35j23J57k78J52J40j7j18j64M2K18l51K81M3
3594H0k11Q0K24k37O0K56m98L90Qn00M66r7j11J53j92J26J19q3J53k85o6R8l5
3617a02j18J21K2j28N01o25L71Rm10N21ml78K39Q9j12P3j93J20J70o4j69K36n01
$$ y = [99, 103, -148, 117, -29, 130, -122, -35, 39, -70, -261, -149, 63, -167, 360, -51, -38, 280, -20, 28, 186, -61, -172, 134, -43, -13, 446, -277, 95, -47, -160, 20, 29, -73, 350, -192, -50, 120, -193, -2, 74, -329, 193, 71, -79, 128, 243, -106, 224, -160, -68, 273, 113, -157, 26, 55, 171, 51, -176, 13, -259, -92, 190, -64, -24, -22, -187, 105, -42, 159, -36, 13, -221, 80, -214, -63, 74, -317, 7, -101, -377, 18, -45, 61, 315, 148, -130, 157, -189, -203, 215, 23, -108, 226, -221, 119, 337, -49, 219, -27, -151, 84, -121, -193, 263, -255, 1, -131, -3, -34, -133, -173, 128, -49, -108, 233, 98, -25, 132, -146, 6, 146, 129, 11, -153, -111, 107, -244, 37, 80, -131, -51, 173, -64, -4, 252, -246, 144, 152, -348, 118, 21, -90, 63, -129, -3, 116, 33, 186, -99, -165, -67, -102, -220, -99, -77, -205, 296, -329, 42, 51, -359, 162, 158, -220, 19, 108, -4, 69, -124, -4, 166, 102, -67, 169, -332]
3640c32M67j08o9K78m11J04J35k1J39q0l12K66K18k94lJ97l25K47Ol13M97j05
3662A81k67J16j67N1K48l22J10Nj67M31j14k94L91k03K8L74n39L06Lk24J98j84
3684c9k23M37j28j22L44l80k8K31k67O2K47l50K92r3k14M41j82k87O81o90K45
3705b3J46l66J23J93k02K13j01j86N23k08j8J7k26L3K23j35J18K9q9L5j11j24
3727a36L79l00RQ4K3K0J46j79kp9j33L06j32j70L18l25R6K34m44K36L12n10K83
3750C6J32m20N08n21M83o5l84J92k2P8j22P1q9K02R4l06L36q3j04J8k91J70K47
3773A60l30J68L68n46K69j92M6L02m01K44K20l29j85L84k83L33k07k11R2L4k40
3794c04M50m6l70M30m20K97K38l67K11L51o96M01m9k88M73l20j01L25m97K34L18
$$ y = [-332, 135, 27, -42, 236, -175, -71, 64, 43, 182, 102, -210, 56, 274, -20, -23, 174, -151, 96, 102, -211, 286, 181, -86, 30, -137, -86, 162, -160, -50, -45, -212, 219, 105, -189, 202, -1, 27, 401, -138, 168, 171, -53, 145, -39, -262, 175, 47, -75, 269, -111, -139, 92, -175, -113, 134, -216, 76, -17, -231, 210, 28, -259, 422, -268, -23, 123, -243, -120, 73, -129, 84, -17, -203, 320, 112, 94, 111, -115, -82, 141, 6, 124, 153, 64, 99, -12, -136, 243, -57, -48, 36, 59, 79, 225, 46, 44, -35, -168, 138, 6, -164, 154, -171, -75, 159, -285, -49, 263, -247, 36, 168, -252, 256, -265, 218, 153, -231, -39, -61, 17, -105, -34, -123, 79, 173, -133, 203, 120, 16, 34, -257, -87, 160, -170, -2, 366, -180, 89, -103, -57, 245, -156, 88, 308, -21, -206, 178, -105, 228, 21, -190, -98, -64, -304, 146, 100, -270, 160, -260, 37, 275, -92, 119, 470, -226, 175, 126, -162, 311, -9, -110, 215, -282, -48, 270]
3815B70k39o3K78m12J75J28l06J56M3l5J87l26L5L62m84L46j65j23M18j44l52
3836b51O46m21pJ69l35M7K23k58L80l23N2L67l48N5J86j36j55L79o37M80J17m65
3858b35O0K44l24L02j89J37L23k25j95K30k62K30O1m24L31k2k08M01l45L9lJ28
3880E4j26K6k45L10J70m58M72l19k25L65q4j86M30l33L6K28k16N1J8n7J20l0j35
3903a34J20r1j96L64q8J68j19r0M9J6l49L70J59k72K32k54J34J61l84R9M71m87
3925a21k5J8j20M64j97j4L41o19L41K9j73PJ42j19K06Mm17K74j0m0K89k48k38
3948b26L92k33J55J46j96M4J53k60j8O7n8J54r4m4K25m01K82n8n0J15Q7l14M05
3971B73k50n07P13m50J38M78l68O0J61m22L68k32k07M53j61l51M63j85R7J73n46
$$ y = [270, 31, -32, 246, -166, 9, 137, -169, -13, 30, -5, 182, -144, -109, 253, -231, 115, -50, -173, 245, 101, -251, 395, -26, -33, 136, -199, -152, 71, -187, 193, -130, -78, 289, -59, -4, 182, 46, -109, 270, -367, 113, 230, -235, -175, 69, -255, 47, -142, -5, 318, 93, -102, 128, -134, 96, 157, -267, 64, 42, -166, 235, -110, -71, -74, 54, -72, -46, -291, 19, 189, -269, 203, -116, -341, 24, -60, -246, 184, -149, -113, 115, -101, -50, -32, -89, 31, 1, -134, -14, -105, -301, 63, -25, 143, 24, -66, -17, -1, -350, 20, 179, -93, 139, -115, 19, 180, -204, -105, 366, -121, -146, -128, -248, 216, 19, 5, 346, -273, 68, 97, -76, -69, 73, -46, 160, 164, -253, 21, 11, -29, 260, 12, -226, 166, -67, 88, 234, 38, 82, 235, -25, -43, 24, -34, 120, 26, -18, 207, -194, 88, 30, -20, 95, 182, -132, 273, 23, -484, 229, -221, -83, 395, 27, 87, 248, -174, 194, -38, -245, 208, 47, -304, 159, -26, 71, 244, -302]
3992c02K56K96l29L27k90j58N86l42j50M83m71J66J02l01K66l4k24J91j63J66
4012G5R7k05Q2n6K1kj62J4l5L25l27K94j80J3J1j56L6L86k63j18K98m62M80j86
4036b0j43N05k92k00L18q4q5K96l61j00K43l08K00K20k71J75j53j45L44n1k74
4057a86K36r9j72J41k27K75J43j36K4m2r0K88q6j94L04j79M6J06m39L11L9k48
4079a85L42k63k53P33l82r5J96l23L69m7o2K8q9k42M50j56j87O34n48j51K98n7
4101A0O4p5j08K50O3p45O47j88J27K19m08R8J94m44K58J5k54K55mn4J08k1j29
4124a22J30k59K47J92l14K52r0k07L95k93p5L51q9l00K49j60j6L50m67L39m8j98
4146a33K99p0k06M66l29l29L61j21N2J9p1O6Q8n53Q08n51J70J84o4p0K40k79j27
$$ y = [-302, -46, 250, -79, 248, -42, -200, 386, 44, -106, 377, -94, 72, 174, -127, 139, 105, -119, 72, -91, 75, 172, -33, 49, -7, 14, 12, -150, -136, -171, 154, -173, 121, -59, -46, -35, -191, -155, 231, -32, -150, 148, -314, 166, -20, -163, 342, 50, -150, 168, 84, -1, 295, -66, -166, 77, -231, -31, 189, -82, 93, -60, -205, 139, 88, -186, 50, -49, -221, -80, -307, -32, 111, -25, -1, -43, -133, 155, 69, -125, 179, 0, 46, 152, -287, 24, 63, -185, 157, -106, -359, 374, -8, -103, 93, -230, 139, 92, 30, 58, -31, -273, 177, 21, -166, 468, -80, -231, 67, 10, 74, -1, -109, 141, 204, -541, 106, -82, 45, 264, -144, -46, 148, -296, -38, -23, -277, -22, -26, -80, 28, 7, -122, 8, -251, -4, 188, -126, 126, 36, -171, 224, -69, -144, 207, 118, -182, 67, -93, -109, 241, -226, 113, 65, -133, 166, 96, -110, 356, 27, -302, 59, -62, -10, 9, -62, 4, 92, -461, 347, -204, -34, 150, 86, 16, 256, -23, -150]
4169a50K33j71J13Q0j34l4R0j78J73m7l2L48n11Q6J70m9K32j30m15L05K0k22L70
4192A47l70j97M62k00K77q3l98N61k02j69L39k13r2M05l47Q9J38l16K15P8l17
4213a93L47j74j58K20m6j20Q6k09J68K47n47L89n2k14L47R8l15M76o07J81K69
4234A93m45L67R3m69O18k53l84M63l51j27N92l62N4K42l58J88J79k60J43k20j21
4255b18N26l24j09K14l36J75M33n28J04L02m77J91L1j86L16j43j79M24k73j06
4275a63L24m05L63j2k20J87R5k31M91l30j93J54k87J64L83l80L7K46k60J12J77
4296B52l68L22l27MK99l80l3L67m10M44q2m8r1k3p7K46k14j05L34k35K95r5k41
4319a66M10O6l80M28k07p9P5m28M18p3j15O2M3l24J79L17m34M29l68j41M48k98
$$ y = [-150, 83, -88, 25, 105, -29, -63, 27, -151, 22, -25, -57, 291, -220, -134, 36, -13, 219, 89, -326, -21, -1, -223, 147, -223, -420, 42, -158, 119, 36, -362, 199, -3, -172, 167, -46, -138, 267, -80, 9, 147, -169, 46, 124, -193, 154, -20, -178, 42, -4, -124, -38, -247, -79, 168, -379, 10, -42, -256, 91, 189, -126, 350, -257, -76, 193, -252, 115, 208, -261, 357, 104, -280, 183, -168, -295, 297, -65, -11, 231, -127, 61, 240, -20, 123, -97, -218, 308, -16, -125, 89, -247, -72, 361, -167, -63, 239, -238, -47, -16, -202, 114, -29, -208, 216, -57, -163, 161, -244, 119, 107, -113, 74, 169, -62, 429, 99, -94, 60, -227, -63, 320, -60, -23, 223, -37, 75, 252, -116, 206, -121, -117, 182, -198, -231, 136, -274, 170, 88, 40, -51, -74, -151, 95, -119, -224, 110, -125, 170, 75, -166, 244, 310, -70, 358, 151, 72, 147, -281, 137, 64, -51, 11, 54, -270, -91, 226, -208, 221, -147, -288, 160, -138]
4341a38J75M0k21M1K49l63J67J61k65Q2J35o3Q4j18N7J17l32L58M6l00R6J52n03
4364c43M93m14L33L2m1l2N0l67J21K85l90M76p1j90K99k47k93N02k96o1J93j00
4386f1Q7J64k28J34K9n76O44k32j70N02l79J7Q2Q4j30Q1k20L49j87l1K50l35k9
4409a55L21o8j37K51l53K08n6j87K75p7k61N30l19q1K64k60J7J86m17M33j2m24
4431c22O53n9l11J80j02k7M0k58J69L3N4j61M1j87K96l2p6J26O4l27M56j84l06
4454b40M39m37L11q1k57K27J42j31L06l28j78M31m80J62J41p4jJ07k28L49k01
4475b1kK67n08J76J49k67J10J31n8o4K9k02M02j37k03L02k42j04L75o5J06k05
4497c1j17K03l0l15L36L4l83N45k63O0J68n16L18Pk30M37k22k34K31J7k12L53
$$ y = [-138, 37, 77, -144, -103, 146, -217, -50, 111, -154, -72, 63, 0, 84, -34, 23, 140, -192, 166, 212, -88, 8, 160, -343, 150, -264, 69, 101, 60, 28, 78, -289, -168, 117, -273, 203, 132, -58, 241, -6, -299, 203, -93, -154, 39, -61, 26, 190, -38, 96, 125, -451, 193, -39, -209, 293, -86, -69, 13, 97, -33, 48, -172, 177, -10, -41, 209, -126, -155, 166, 98, -39, 212, -141, 67, 11, -176, 99, 22, -239, 291, -28, -109, 155, -105, -88, 98, -319, 114, 102, -322, 331, 272, -39, 141, 39, 12, 52, -206, -37, -4, 50, -111, -70, -257, 39, 7, -69, 57, 121, -206, 250, 66, -240, 199, -238, 73, -8, -265, -38, 104, -27, 279, -49, -227, 204, -276, -114, 27, -47, -48, 59, -169, 180, -21, -23, 244, -264, -88, 61, -206, -96, 35, -23, -87, -58, -260, 142, 5, -198, 104, -138, -242, 133, 68, 174, -31, -148, 55, 25, -290, 46, 80, -303, 242, -21, 39, 207, -309, 9, 16, -214, 223, 1, -233, -2, 15, -197, 156]
4519A56k42J4K26j76K67j25j43L2Q8l72L73j77m6K95l31J61N9k16L39O4k84K3
4541a5N3k21M08j42k39L15j42K1O7j05J76l07m9L88j03j65Q9lj57L52n27M44K2
4564A60k26l2K09k30J07Q7k09K48k91K01p5Q7k1Mk02M51k02k42M17l21j68L68
4586A20j79N4Q9j93K78J82l35J29J24m64M10j46OJ39k65p2K37k24RJ30j29K61
4608A61N2j64K36n61J6M62n35L76R1j50PN7l63K26p3K19J06p6k69K29k47J74J86
4631A60m22K79l6j97M13j47k34L19k36J92j08j84K31m4m8K6J52j67o0K00k63K83
4653A09J16l78L64l00K19j20q3N8J00j50K89k88pK61l73J51J01k26J6M65l69n4
4675i9K27l01K12J07k95M75m52j8K01k43J89O7k95M03k78k40M14j21j02J24oN4
$$ y = [156, -86, -72, 154, -22, 245, 120, -23, 9, 97, -275, 98, -79, -125, 170, -161, 0, 59, -157, 182, 246, -38, -15, 38, -183, 225, 83, -156, 159, 17, 38, 105, 0, 176, -131, -180, 208, 105, -60, 29, 26, -131, 221, -306, 138, 160, -66, -98, 111, -119, -12, 75, -134, 114, -177, 24, -51, 36, 15, 19, -183, 268, 66, -176, 241, -80, -248, 120, -59, -5, 84, -109, 169, 351, 16, 145, 269, -195, 215, 69, 75, 214, -51, -123, 114, -110, -101, 29, -100, 161, 213, 49, 285, -276, -260, 202, -333, 43, 134, -16, -9, 48, -315, -89, -162, 57, 163, 87, -182, 47, -200, -26, 160, -262, 17, -19, -216, 197, 50, -184, 135, -101, 91, -17, -201, 30, -14, -62, -36, 116, -51, -111, 89, -174, 109, 225, -153, 211, -89, 130, 10, -73, -15, 85, -65, 224, -64, -71, 190, -183, -32, 69, -157, -141, 324, -45, -99, 128, -173, 39, 146, -149, 326, -126, -144, 57, -186, 3, 70, -225, 178, -100, -340, 74, -47, -149, -25, -31, 23]
4697B3J53k37J05M1j84K05K36l33n2p1n3K06j87J23J61k02J2J92l01M08k30k33
4719b18N56m89J92J43k15o6K6j60M12P2o47L16n2k4J06l0q4L23k97Q9K58l40J94
4742F5m1k28L30k4k83J00PP4Q1l16R8K15l08K22J00m1L3pl9J33k76L0L36m90K47
4767A8R1m8k03J50k31L29j01M8K47m01m3J99l30J02M28k56RR1p0m0l7N6K34p0
4791A72k54K00k59J43J75m17K08K43m16L91j77l76O12k28j46N2L2J06N0k07K16
4812A20j41j54M46k30p6L80l44L5N1j39o2J19k26M42k04l04L09Q1l18M78m03L6
4834a04K83k13k3Q7j64L07K0j02J62j08k43Q8q9m3L74l61J33J65j34j5p7J9L35
4857B97k63j82Q2R7q3J6Q8N2Ql08K21k69L04J7q5j48K51j87J89J36m54J40K46
$$ y = [23, 176, -61, 44, 85, -99, 106, 342, 9, -43, -114, -167, 39, -148, -25, 136, -66, -54, 138, -163, 245, 15, -218, 338, -151, 41, 184, -31, -97, -71, -231, 181, 253, -394, -78, -130, -154, -48, -78, -162, 161, -136, -47, 211, -129, 65, 24, -204, 126, 102, -181, -81, -74, 0, 81, -235, -137, 78, -230, -8, 92, 51, 84, 77, 38, 171, -105, -75, 261, -229, 18, 109, 61, -142, 8, -223, 106, 5, 53, 300, -101, -144, 55, -275, -173, 255, -1, 8, 99, 29, -11, -48, 8, 242, 172, -82, 118, -141, 2, 177, -240, -32, 211, -205, 186, 9, -367, 245, 17, -129, -77, -45, 61, 111, -96, 120, -21, -175, 271, 41, -35, 345, 1, 36, 87, -52, -114, 5, -221, 221, 17, -287, 22, 103, -215, 263, -140, -104, 179, -34, -57, 30, -134, 173, 193, 91, 253, 145, -98, -10, -99, -142, 232, -129, 4, 169, 35, 20, -57, -38, 297, 34, -148, -66, 31, -52, -36, 52, 104, 112, -196, 25, -244, 60, 77, -8, -156, 95, -92, 97, 233, -221, -81, 165]
4880A65k83P4M3j93K37o0n8L2k02J70L13m00J82N6m02J92rK53J7j47j80M19l62
4903a43J65O7r5K62l16j10K03J09k95K84l91J11K91l71L34n2j17K10m5l35L17
4924H3j27j57N91o06K19J76j26j32K08k56J68O0j79J78Ql18K92k01n7M34l93P4
4946f1K92n18M06k08j74N71m18J40N8j36q1R7j53J79l5j00K46Jk08J55j74O4J48
4969I1m28L89J56j69R7J3l80O97n96l1K53j92O9J01k30J97j29K79j84K5k20K33
4991D1K22m32J07j23Q7M11m77Q4m2R4J62L6j72j78J05l7M51m07J22J00j22p6q3
5014a27J40J01k42j8J28N1k75N57l02n4K0M5O9j6o7R6R7l30K77k76j1K81k74m6
5038a76J95qL41l57k18L08J6j67Q2j66l3J92J36j85Q1k70J63J06j50J80j52o8
$$ y = [165, -118, -44, -1, -194, 43, -17, -75, -43, -245, -75, 238, -162, 20, 76, -326, -134, -143, 110, 127, -20, -200, 219, -143, 22, 89, -6, 256, -60, -170, 33, 142, -153, 131, -260, -149, 142, -229, 105, 53, -64, 146, 101, -234, 83, -44, -201, 390, -216, 3, 179, 53, -79, 129, -127, 41, 101, -78, 100, 108, -210, 82, -119, -176, 258, -135, -61, 231, -287, 119, -89, -263, 308, -110, 30, 88, -48, -129, -32, -185, -6, -41, -141, 105, 106, -102, 53, -121, -57, 91, -337, 52, 208, 39, 136, 149, -231, 466, -130, -161, 92, -100, -31, 70, -160, 37, -92, 187, 3, 28, -192, 41, 263, -169, -62, -185, -98, 313, -164, -80, -122, -28, 134, 170, -2, -180, -75, -112, 339, -68, 54, 154, 32, -44, -127, 13, 114, -128, -146, -18, 33, -242, 315, 13, -41, -21, 24, 93, 77, 10, 106, 203, -127, 150, -126, -137, 144, -130, -176, 19, 11, 352, -5, -223, 85, 101, -66, 16, -150, -183, 9, 145, -40, 41, -229, -66, 40, -110, 70, -82, -150]
5060a50K64j7l27L86m08j0M75l12Q9J73k83K66j38p8L54k18j08L1K7M8q0m36N33
5083H1J80n86L03J74l23L93l56n5J91k21L23k20r8M45k28k10M41j85j71M19k90
5104Gj43L72n40K55J01r1J33k23jN08m03q2J13l4M2J08j48O5K37m17M23k26k85
5127b29K87j40k0J37j79l6L53k71J6J31k15K45n7r5k5L12r0J34l15P6K84l53m2
5150i2K54m05L21O0k72J98l8m1J7J8j30L76l85J28J36l35J86J74k42J05K5m09
5172c51N38k38m4L43n74M72l2j34j03K38l05L86j65l6P0l29L27n1L8K30j81l59
5194b60M48j94j73K47n6j43L05j22M3R1n33K97R8n5J59j01m9K07k82qK94k04r8
5217h9p0Q0L1J64l50K87J01r5l9k25L09J23m74J33K25j76J01p2o5J33q9q0M08
$$ y = [-150, 114, 97, -230, 156, -252, -262, 213, -99, -10, 163, -120, 146, 8, -70, 284, 66, -42, -11, 16, 64, -16, -452, 81, 261, -325, -22, 152, -171, 222, -134, -189, 2, -219, 104, -116, -214, 231, 3, -207, 234, 49, -122, 297, 7, -136, 236, -304, -49, 52, -39, 94, -129, -130, 378, -25, -107, 6, -28, 14, 122, -26, 39, 276, -141, 282, 56, -229, 58, -82, -102, 35, -144, -180, 173, -98, -82, 49, -166, 79, 22, -73, -98, 214, 124, 258, -57, 19, 303, -50, -92, 162, -243, 78, 138, -134, 64, 26, -15, 2, 20, -110, 266, -119, 9, 145, -190, -4, 170, -72, 33, 58, -351, 187, -51, -95, 248, -326, 146, 114, -20, -123, 115, -190, 196, 31, -5, 65, -264, 63, 12, 50, 280, 99, -260, 188, -6, -179, 68, 12, -131, 174, 52, 95, 186, -347, -50, 48, -7, 152, 51, 2, 209, -73, -81, 213, 9, -89, -159, -79, -48, 116, -234, 53, 154, 59, 20, -205, 104, 227, -247, -114, 111, -65, 36, -36, -101, 32, -57, -137, 271]
5240B71j48o2j1k33J71K47l69K23rl58L87N5l65K15j2k11J94m4J67Nj38K74j84
5263F5k72K13Pj14K08l77N09k44L4N9K14m94L03o5m73N97j16j74J34K42k27J57
5285A86l77K87J43l23J54J46l34k1j50K64J33O4j49J3k66K65J96k98J03n8Q8o
5307F0j47j41L26j87J81j21j84K60M2l12L29k16m4L33j42j84K62l19J2N44m95
5328a43K85j16j91L23j14j61J80oj44L53m67K03O1k18M52Q9m70J38K0j08M92o16
5350a58K23p2k21J36J74j75K92l71n3M69l82J89O6k28K22j40j11J26J29k50J12
5371b3Q4l7O3r8m61N84j84P7L45m10n1J64m33M80j14P8J73l98O1O7p3J36J72k77
5395g5kJ50n2n1P8l71M96k81J46k1k56K46J40j46j25J44k39M23l01k10N07k16
$$ y = [271, 123, 61, 50, -183, -12, 235, -134, 89, 80, -278, 109, 164, -201, 14, 2, -209, -15, -59, 108, 113, -25, 249, 65, -207, 6, 13, -101, 107, -270, 239, -5, 29, 88, 302, -192, 111, 46, -427, 170, 54, -120, 14, 256, 29, 186, -191, 96, 239, -84, 70, 216, -118, -139, -289, -25, 108, 172, 23, 36, -230, 35, 231, -67, 36, -22, 66, 60, -87, -228, 98, -89, 92, -29, -213, 47, 89, -223, 106, -110, -154, 179, 37, -147, 115, -204, -192, 352, -143, 142, 26, -165, 158, 44, -117, 63, 57, -87, 266, -201, 2, 63, -155, 297, 386, -84, 54, 74, -34, 458, -158, 65, -7, -228, -92, 82, -93, 199, -172, -225, 244, -138, 51, 117, -111, 111, -29, -140, -14, 115, -135, -23, 61, 24, 87, -11, -472, 112, -72, 5, 350, -60, -111, 53, -380, 100, -14, 64, 237, -161, -100, -33, -106, 30, 202, -75, -77, 73, 21, -30, 48, -323, 173, -108, 38, 17, -239, 7, 147, 1, -124, 20, -219, 204, -97, -307, 200, -16]
5417a6j49Q3K13j1J2k33J84k7j32J31K8j47J31q1j63K52m6l3J7k5j8nJ16J25k74
5442f8j47L65k35j52K07j16K0K04k40L03j01j51M24k79r3qM1j41K71l52K22J32
5464A06n54N45j09k34K79j91L7K99j60J14k4K1J25j66o56Q39j50l25L06P5p8k6
5486G3k02K12j55j3J49j46o4L40q5q2L66o39L5M11l57K01M6l19K77J08k04J04
5508E6J43m18M79l41P7N6P2k85K58k65K33J33l57J82K64l22J13r9k14M51m59J87
5530e6O5k2r6K92m00J31R5j61L19k17k56O40n30J40J77j69L6J20j41J30r2j79
5552a74J56r9k08N97l68j13K81j13J30pq4p6n2m0L21L5k07J86q3j61Q9j40K67
5575A37l4j47J66k43k2M91m46k1j54J05K43j03j60L57j12l0J56m07J93L53l82
$$ y = [-16, -165, -82, 131, 120, 132, -101, 83, 56, -76, 55, 83, -64, 67, -14, -177, 75, 29, -4, 13, -12, -30, -35, 81, 206, -68, -215, 150, -85, -237, -30, -146, -126, 78, -162, 141, 40, -111, 313, 34, -59, -67, -26, -167, 104, -248, -26, 106, -448, 97, -12, -246, 33, -158, -121, 178, 18, 132, 108, 129, 254, 88, -568, 271, 121, -204, 102, 177, 99, 73, -129, 83, -72, -85, 64, -82, -146, 194, 109, 27, 393, -246, -211, 200, -157, 44, 90, -229, 48, 156, -48, 56, 199, -219, 260, -81, -4, 52, 124, -161, 97, -168, 65, 198, -159, 23, 287, -35, 78, -21, -235, 216, -243, -56, 9, -13, -109, 183, -217, -86, 9, -152, 167, -50, -306, 334, -196, -56, 121, -48, -12, 108, -33, 97, 5, -174, -18, -117, -325, 272, -96, -209, 72, -41, 89, 82, -2, -78, -130, -170, 151, 186, -21, 165, 82, -79, 10, -130, 137, 103, -44, 122, -121, -143, 348, -98, -119, -273, -168, 75, -28, -188, 169, 57, 27, 183, -224, -31, 322, -60]
5596f0J00l6j12J44N7k32P8K05k80K50j13k13K74j0j32K16j60J89k54O4om1j4
5619h6K71j70j37K40j50o5J20j46j04K98k19J31K03m61M07j4k05K01o0K05m29
5640a70K04M8k75J82J53j96J1P7k85r2O98l63n1J93l8O0j88L2j46OM0J21j22K00
5664I9k48j5K48n5j9J30l38R3L02j75p7Mn1O4Q3k03J17J78k54P0J39o4J3q6M5
5689@q7J03M1J50l88K13K95m98J92j11N5J89k24k10L71j50J20Qj04K65j7m33J12
5712a08qM7J78J1j35K88m21N8k2R1J11J7k20K03j10j13J44q0nL18m40L03p5l9
5736gk6K04k42J22j53k49P14l12j99K48m7J16j71j60K71k68n8M92n85P6K77J99
5758B42j52o4J3m8j7k18M07j32k55M35j59j78N6O9n5n2r7K95o6m3J23m6l68K16
$$ y = [-60, 40, 4, -108, 36, 93, -139, -61, 144, -136, 114, 1, -212, 62, 52, -80, 136, -24, 165, -89, -25, -31, -72, -86, 185, 15, -122, 118, -32, -97, 23, -123, -227, 71, -148, -17, 186, -275, 132, 118, -87, 114, 54, 259, -170, 34, 82, -193, -11, 142, -54, -43, 34, -251, -343, 355, -8, -59, 134, 96, 156, -32, 0, -146, -140, -100, 21, -101, 99, -149, -164, 84, 29, 10, 140, -198, -105, 197, 22, -55, -51, -102, -38, 45, -158, -41, 137, -117, -47, 92, 28, 41, -45, 0, -87, 16, 57, 207, -181, 32, 327, -171, 21, -90, -35, 154, -70, -280, 91, -59, 61, 69, -35, 230, 213, -220, -108, -116, -69, 109, 120, -15, 273, -148, -90, -112, -21, 90, 107, -113, 90, -20, -133, 11, -69, -74, 244, -196, 107, 32, -7, -33, 171, -71, 51, -102, -351, 363, 51, -148, 100, 53, 169, -2, -162, 109, -159, -217, 275, -310, -234, 43, 242, 90, 26, 39, -9, -26, -244, 163, 31, -224, 211, 52, -126, -70, -1, -56, -108, -205, 90, 24, -19, 104, 58, -310, -94]
5782i4P8j58M13l4j93mJ93j06j39j51L31l9j69O8J26k48K32j82J09p4R4r9j10
5805a56j27M37p4j76J03j20J50Q3j25q4K58k19R6J29k97J69p2j59K94j95k2J51
5827D4j1k35L97k49N5m6p2J05n6p0K19o4J7Q4k13J54j19k3J24J2j88J85J68j92
5851B6Q4j60K9J78k95n9K16k5KJ10k34L87l53R9K83j59l2Q3j72p2J06Q7j52J50
5875A27j19j86J20J16M9l7j63J1K56p9P7j69k0J32l50J62N8m7J61k91J07K11k66
5898a40L45j76m3J48j60j16M50l80oP4j16J7K22k58J4J23m2J13j81J07K2r2L07
5921B32n8k05J49n8J2o3N6k31J71k8j08J17J32j12K20k65o3J64J8j07Rj87J97
5944hK82j89k86p4J16P4L2o1K43k57O1J96k08J74k01J17j00n9L5K13j90L70k24
$$ y = [-94, -16, -174, 239, 205, 12, 8, 201, 95, -44, -195, 136, 97, -72, -4, 122, -126, 106, -76, 33, -41, 53, -46, -156, -283, 154, 80, -96, 7, -113, 37, 120, -5, -89, 169, -50, 46, 175, -122, 47, -25, -184, 110, -85, -107, 44, 33, -202, 195, -54, 1, -45, -117, -12, -68, -138, 81, 17, 34, 118, -95, 59, -60, -83, 41, 53, -135, 50, 218, 26, 110, -50, -21, 157, -138, -197, 19, -6, -4, 106, -128, 259, -94, 5, 288, 129, 97, 180, 8, -64, 42, 129, -23, 127, 8, -178, -58, 58, 107, 70, -93, -82, 174, 95, 172, 3, -17, 115, -235, -73, -15, -62, 99, -192, -85, 126, -140, 205, 29, -14, 134, -26, -142, 308, -72, -78, -4, -120, -103, 119, -139, -125, -2, -44, 69, -112, -5, 17, -75, 232, 174, -31, 118, 60, 72, 9, 65, -166, 5, -23, -131, -14, 118, 6, 226, -39, -102, 62, 80, -27, -18, -205, -8, 274, 85, -201, -275, -159, -85, -53, -114, 129, -128, -67, 129, -79, 95, -106, 11, -89, -148, -113, 100, -90, 280, 56]
5967E6j32J16J67k50L16j94l17O26m18j18J96m0j0M9k10J21p2K91m8n6j52J61
5989H2r4j08L07l15K09j18oJ5L2j2R3K8k03P0L2J30j54n6M1J1L5m2N7k99L71j17
6015a1k31K69J29j8k70o1J66j02J39O1pj80O3O7P8J70m39J68j00o4K47j9r1L8
6039BNq5j19J68P2J51l18J16O0k8J98k80KJ21q5N1j2Q2n4r2N7J1J86k57m2K43
6065A53m02K47K15k02l7J31j23J47j73O6J20k35M5J61j75Q6p1L5j60R0j19K42
6087D1q2j31K20k42K13j3n9J56L9k54K27j44l32M45j26j11J59M6l2nl7P5j54J2
6111h9J95k06j1r6L37j13L0K4n7k7j19K70j10j06J33j3R5j04j13J19m3j05J04
6134eq6J4J49J29j64n5j10Q7R3j76K01n4r6J60R1l06J10l7R5Q7l33K96L4l29k7
$$ y = [56, -76, 40, 207, -43, 273, 79, -238, 388, -30, -148, 48, 8, -2, 47, -163, -42, -114, 177, 129, 73, -79, 82, -12, -120, 187, -128, 81, -37, -43, -28, 4, -8, 85, 113, -90, -20, 12, 142, -12, -68, -27, -16, 19, -23, 34, -265, 106, -11, -242, 27, 156, 138, -132, -193, -27, -129, 10, 71, 64, -116, -53, 14, 92, 262, -177, -9, -109, -173, 74, 55, -36, 2, 7, -78, -197, -29, 43, 194, -124, -8, 52, 24, 222, -58, -56, 65, -20, 31, 19, 101, 47, -45, 12, 23, 209, -48, -90, 153, -249, -2, 213, 11, -26, 105, -18, 129, -44, 22, 142, -93, -48, 113, -62, 24, -47, -12, -172, -82, -201, 41, -41, -172, 48, -194, 19, 6, -53, 103, 142, -112, 115, -29, -361, 84, -42, -153, 6, 52, 20, 15, -22, 53, -101, -89, 106, -100, -111, -207, 130, 17, 47, 71, 14, -13, -132, 138, 28, -78, 55, 42, 137, 33, -80, 39, -4, -109, -5, -91, -77, 72, 201, 37, -18, -128, -41, 52, -124, 77, 23, -73, 87, 178, -128, -18, -55, 40, 127, -206, 90, 124, -205, -232]
6159b32K53k14K54j25l0J24J29k24K63j79O0J10q9o3j4k51J27M9J50L0l9N2k62
6182a21P6J48m62K00P2K25j47R0N5j08N9p6r1J40j4j74K20p9P4j14j4Jj75K50
6206C5R2J28k95J53m8l64M41rM7j62l1Q0r2J25r8J04j41Q0R1j56l7J80l76M9Q8
6231a16J88l2k9l9M7j51L04j10O6q1j21K59j46n3O9J71l66J12o1O0ML4l1L17l35
6256d0J97J32l15N1L1j14p5J12j00J13j07J33j52n7J25j6K3J05j47J43J16j02
6278E6o7j32O5J39O8l12J43j19Q0J92o5K0l1j30J45j1j38j4J80k62J93j8r5q1
6302a94L1J5K77l34L73pj75j2J71n9k7j30q4p4J50q6o2J42j04K53j41m3J6J82
6326G8k60J62L5Pj31k26L54k23K49q9KJ50M6j68kM6r9J04k02N3J33M8MOp4k27
$$ y = [-232, 21, -193, 61, -64, -94, 30, 159, -65, 198, 19, 79, 189, 100, 37, 23, -228, -101, -52, 98, 128, 89, 141, -121, -45, 103, -359, -159, -87, 138, -9, 81, 136, 28, 87, 11, -80, 60, 46, -128, 92, 13, 87, -27, -41, -40, -215, 35, 127, 255, -40, 113, 65, -299, 142, 133, 180, 18, -13, 67, -25, 100, 2, 106, -35, 45, 136, -20, -57, 123, -253, -204, -116, 72, 40, 11, -28, 19, -132, 172, 62, 128, 47, -74, 185, 39, -14, 55, 226, -140, -28, -89, -29, -25, 9, -22, 295, -40, 157, 289, -26, 25, 56, -58, -133, -21, -121, -8, -115, 18, -134, -191, -66, -82, -59, 46, -101, 42, 158, 56, -11, -143, -78, 61, 129, -183, -40, -159, -79, 113, 48, 68, 37, -93, 52, 41, -97, -111, 69, -193, 0, -18, -113, -194, -163, -148, 129, -205, 168, 161, -14, -26, 145, 86, 59, -71, -155, -229, -79, -165, -227, -85, -189, 64, -77, -120, -104, 78, -182, -20, 15, 22, -109, -335, 19, -204, 45, -44, -42, 108, 154, -14, -16, 30, -69, 35, -167, -114, 19, 67, 71, 77, 3, -224]
6352b24L55l30L39J27l36J69l0k3K4l42K49J09r8m8j00J65Q6m4J12J35l53M8P3
6375F3P5k86j01L22m6K4j89J81pj27J45n7k52K92O7k31J11k0R0J5q3P1j44L9J11
6400F3j36j02J12J13p5o0j14J05N6j8J76k63Q1J63J04j36n9q4P7J6j94KP1k5K16
6425H9J19k21P6k63NK27L4Q2k48J3k4J95k39L52m8l38K53j58Q0j55K24k69M94
6448B80m51N8J02k57N98m54J20R6j7j39Q1l3N4j67r9J74p2K36k6k2j08J23j84
6471a07M8k1Q4K8nj62J61o9o1K57j82q6N6K66k62R4O9J68k23m8j28j42J76J50
6495F1m5J36k27K84k79L3o1n4L43j22n7m7J5J92l46J39P5n7N4l18J10J41J27j52
6519e5O3M1q1J49o8j07K3L5J28m6j74K10l2R5j98K14k01MJ18k05K07r9Q3k41R4
$$ y = [-224, 131, -199, 140, 267, -69, 100, 70, 47, 71, -271, -22, 87, -11, -59, -159, 6, 92, 48, 160, 295, -58, -10, 63, 138, -148, -249, 73, 27, 51, -138, 43, 36, -91, 54, -3, -255, 37, 104, -127, -16, -36, 54, 69, -14, 57, -87, -48, 63, -73, -175, -63, 50, -25, -85, -199, -94, -38, -56, 120, -143, -62, 101, 205, 69, 10, -74, 3, 19, -175, -173, -102, -127, 89, 208, -13, 63, -200, -195, 32, 66, 148, -100, -87, -111, 84, -155, 197, 149, -189, 64, -94, -14, -169, 55, -214, 280, -171, -113, -11, -268, 330, -124, -4, 92, 75, -64, 17, -16, 38, -129, -228, -54, -126, 110, 84, 62, -46, 77, -107, -59, -80, 4, 32, 27, -135, 26, -43, -104, 153, -29, -115, -59, 207, -55, 39, 108, 276, 53, 5, -123, -265, -89, 61, 16, 152, -75, 209, -70, -37, -98, -152, 191, 69, 12, -35, -20, 172, -174, -35, 40, -17, 37, -281, -171, -30, 97, -55, 8, 49, -32, 117, 49, -58, -35, 0, 128, 82, -92, 118, 86, 181, -17, 197, -4, 0, 118, -87, 120, 21, 104, -137, -43]
6544d3Q4M9q1K08j73mM0J13l38O7p9J05J31l4j14M6m1J1J74j42J59p6k45J27J71
6569A15k00J65j51P9j24q4M02j64m5L40k94j14L08k93L5R9l3Q6j1q5M6p4j3K9
6593A9m7Q0k37J50O6k4k89J15K29l0j21K48j79n4J37k52J01J1L3J06k54J72l0
6616e0J07r3l12M2M86j35l04L93j83l7K74k46K53j65j74K31j51J62j56r2K03J51
6638B04k10RJ44k29J43l6m7Q3j17j99L97q9k4p5J70k89J48j20R2LJ53Lk08M2J93
6663A41k35J81j15j32L99j5k29J55j14j99J06k7J01K6P2M9l37J63j7j87K11p8
6685h1K00j28J74p5k87R4J27M5J9k31o9L24k00O8o5O2K12l07J09J18k28K62m7
6708I6j19J94k8j53j14J51M0J22k39L7P8N7j85L58l37j2J55k75o8L27k29N03m48
$$ y = [-43, 41, 90, 9, 217, 44, 40, 80, 193, -145, -78, -157, -52, 79, 45, -69, -23, -64, -53, 121, -21, 138, 62, -183, -56, 115, -85, 80, -71, 8, -116, -200, 202, 38, -7, 333, 39, -75, 233, -60, -25, 74, 41, 127, 116, 31, 77, 3, -10, 19, -28, 52, -185, -35, 31, 7, -282, -167, 62, 32, -89, 159, -20, -74, 63, -189, -88, -77, -44, 62, -192, -20, -50, 57, -36, -348, -306, 180, 45, -259, 134, -49, -86, 188, -58, 195, 30, -144, 87, -64, 98, -58, -150, 53, 204, -6, 3, 147, -82, 61, 25, -22, 61, -56, -255, 142, 53, 29, -46, 124, -165, -17, -137, -45, -42, 111, 114, -94, -52, 141, -94, 87, -28, -160, 239, 224, -5, 150, 36, -163, -57, -84, 17, 43, 115, 164, -173, -10, -27, -214, -3, -81, 119, -9, 165, 90, -197, -103, 24, 69, 88, -143, -212, 112, -88, -20, -85, -23, 189, -118, -9, 109, -119, 143, 96, -23, 171, 143, -10, -124, 27, 67, 189, -50, -13, 65, 122, -63, 295, -42, -54, 101, -174, -242, 85, -144, 359, -89]
6731h9Q5k22K22j03M9J03l0k16n5L47k17K06oM9j10K08k09M2n5o9J76N5o3j52
6755e4LP3Q4k26k7P9J23q1j75J39K27j76p0J55o4k82N24j11o3n6j07J33r3J69
6779A24k61K61k18J52J69l56J51L5j25K22j42K3M5j7j86P9O4p3Q1K4J07j29lj35
6803a08J17j12J50n9J05o3J6N9o9j19MJ09k38L91j94j55J69j05J28M1J8J06j80
6826A1p0j20O2M2m0J6L5K31m52M00Qj18J27j89o7L7p5M0Q1o9J73k1J31k24O7j14
6852i8J85kj19J3O2J0j74J02j36K45j46Q3M0k9R2j85o5O3k27K65j6q9k7K0p3K87
6878H1j62K49M4p6l40L39j19k86K99l8N3J85n11L67r4l6K81k75o7J18j2P4j3o8
6902gL1j6k55R0J27J77k05R4j55J93j24J87J34j06k24j2J11N1j18J73l4j26j0
$$ y = [-89, -4, -226, -4, -107, -58, 45, 15, -201, -256, 91, -126, 80, 74, 123, 13, 221, 12, 54, -1, -70, 106, 161, 98, -54, -51, 22, 106, -120, -147, -68, 55, -26, -201, -62, 165, -11, -81, 74, 10, -272, 252, 141, 78, 22, -85, 48, -45, 124, -137, 124, -94, 58, 227, -129, 22, 57, -68, 154, 12, 35, 80, 63, -123, -44, 20, -53, 28, 52, 159, 30, 27, -108, 9, -103, 47, -12, 93, 30, 46, 105, 36, -83, -79, 30, -208, 183, -11, -166, 3, -102, 26, 67, 85, 191, 11, -59, -179, -117, -75, -115, -99, -64, 167, -285, 115, 123, 5, 132, -57, -124, -87, -162, -122, -41, -110, 63, 42, 173, -51, 16, -98, 87, 85, -34, -21, 41, 51, -123, -21, -157, 88, -58, 25, 65, 36, 128, -57, -122, -59, -286, -21, -37, -126, -153, -133, -206, 81, -81, 168, 212, 136, -204, 135, 16, -270, 29, -9, 44, 229, -282, 85, -9, -45, 236, -39, -106, 12, 0, 74, 61, -7, 24, 8, -247, -157, -30, 147, -58, 36, -119, 74, -50, 137, 271, 165, -59, -71, 40, 91, -27, 146, 112, -14, -24]
6925b4K58k58m4N2j32K21o7R0j36J13j60R1j8o0L04K1l40J04j17L09j49p0r4K08
6949A02j06p2J01j07J57O5m22L70q8j59L26j91lj14K07J5O4j5j79o1K01n9o8J50
6973A14l08R3L15l16j25N39l83m6P9J15j15K8j36p4L72l85K94M2j66N2oJ10M2
6996A35j81K04m5j01O9p6ko2O4j7P8J3p5k6j47K00qJ18o5j13o5J58O8O4P2k21
7022C9j47J05n7O3K78m16J26j96L3j6K24k0O9k26J73R7r5j38N6o7L77k06j7J96
7046B35k73j3K9KK0nN3j25M7J39j99K18l99K48k9J32k27J62q8M7J0r5M2o4K24
7071I1j16j01L8J8P1J55k39J54K8R3j97R2j64l7K79k13M5q9j3K9k8J86k5j22R7
7096C2J7Q9j69Qj40J02J20m2J03r9k05N64n30M61k80j9n7j24J57L9N4j73J76l01
$$ y = [-24, 234, -24, -68, -16, -148, 73, 6, 96, -40, 73, -87, 4, -14, -74, 230, 251, -89, 15, -102, 207, 58, -12, -106, 102, -4, -76, 25, -82, 75, 140, -282, 88, 0, -159, 167, -24, -27, -141, 66, 81, 145, 130, -49, -110, 91, 32, -36, 114, -194, -101, 214, -102, -227, 312, -71, -117, -38, 77, -38, -10, -146, -220, 152, -233, 61, 103, -63, -11, -17, 93, 135, -46, 158, 113, 12, 81, 5, 3, -59, 5, -12, 66, 79, 4, -22, -169, 31, 23, 141, 76, -37, -102, 56, 124, 188, 260, 39, -108, -3, -60, 3, 281, -135, -9, -205, -172, -188, 36, 16, 85, -141, 32, 129, 34, -104, -48, -115, 262, 56, 39, 235, -38, -51, -22, -20, 0, -5, 48, -77, -30, 109, -90, 128, -271, -23, -52, 80, -147, 15, -73, -26, -16, -111, -69, -133, 91, -25, -126, -88, -70, 1, 156, -83, 71, 99, 192, -5, 87, -77, -114, 165, -48, -3, -92, -105, -76, -104, 82, 57, -65, 32, 49, 138, -31, -23, -163, -61, 59, 17, 120, 21, -184, 380, -150, 311, 31, 12, -45, -169, -12, 27, 81, -92, 84, -217]
7120b17M11n0j27N9K80k64j11J33O5j23r4J66j47j34L33k33PK55k58r5M7m0K56
7143A19j91J76j90N9j18K7J21qR0r8O1J00k6o4p5j30j44K04R6M2j87j41J37q0
7167b20k7L96k39q4L25l77K80j06Qp4J06J61qm35O9J29j2kl0Q7j34J18M4J31j15
7192iP7k34N7K3N6J20k01KJ87J70j67k66J28J5j19J60J83m10L03r6j36J79q5J01
7216C8j8P6j6q7j63J96j84J41J19Q0n0qj16k7R6j21K52j87j55K64k38N2K84k12
7240A6p2J05m4p1R6j3Q5J18k83J01jj02J63k6j94L17n4j78k9k2j4J12j22M3K49
7265A80m27L25O6K5Rj65J1K2l32L67k5j86J20J4M8l6K1J5J63j67l8J9J51k26N6
7290A0j15o5j00L22R0k88J65M9j60R5N1j02K09r0r2K29k90r0K52j27J98j50P0
$$ y = [-217, 194, 144, 17, 76, 356, 92, -19, 114, 179, 56, -38, 128, -19, -153, 180, -53, -46, 209, -49, -144, -97, -137, 119, -72, 104, -86, -27, -145, -118, 3, -5, 85, -13, 48, 148, 122, 58, -17, -147, -291, -87, 9, 51, -136, -277, -140, -220, -247, 149, -90, -174, 151, -226, 54, -52, -44, -118, -12, 149, 141, -294, -225, -96, -108, -110, -140, -53, -187, -69, -25, 106, -9, 68, -166, -109, -86, -30, 90, -111, -109, 78, 248, 81, -185, -57, -42, -161, -1, 182, -228, 75, -21, -157, 22, -63, 38, 20, 96, 80, -7, -170, 26, -158, -17, 102, 182, 132, 124, 8, -19, 77, -44, 208, 21, -134, 130, -108, -56, 228, 16, -56, 49, 5, -66, 30, 17, 102, 220, -63, 38, 37, -65, 98, 72, -122, 195, 141, -37, -66, -88, -102, 10, -112, -69, 180, -247, 78, 144, 169, 178, 13, 24, 46, -286, 81, 56, -130, -10, 4, 52, 16, 37, 52, 215, 48, 10, 29, 180, -46, 10, -105, -170, -270, 52, 142, -146, 19, 68, -92, 3, 54, -48, 161, 71, -21, 208, -82, -172, 80, -47, 151, 1, 71]
7313G1j44Or0j00J95j91J57J22j60O9j1K16P9k98q2K24L1Q1j92Q0j99P6M0J4J55
7338A49j21O3q0R4l70J88P6J26l20K63j48L8K72j83j70J13O3K5j11J83k24O8j47
7361a53J61j13q6K35k69R0LJ72j10l2N5J94n5k29L02k93L0J04J26j80J37j95M6
7384f0R4o4J40l8P6m02J91k9L50j65j32rJ78j01j38O9J00k0j53Q8j04J44mj91
7408a80J02J39j16K80j78N2j89K57l58L12o1K21M1m11K20j91K7L2J47j96R3k15
7430a72J55J70K6Q2l37N7J58n5k86oK86k70K66j89n6K91l02J52L5M7j81L9j06
7453a96O8R0L1N5q2Q4p2l5K1M4o2J40j69J67lJ28j51J40j20n8j82p9M11q7j49
7478f6J18r3j35L88m14J79J02m6o2K56o58M96K40l33J15j30j53J26N6j40L33o3
$$ y = [71, -73, -67, -157, -257, -62, -253, -96, 26, -134, -65, -76, 140, 219, -79, -161, 63, 94, 175, -17, 63, -136, -60, -20, -6, 149, 28, 91, 11, 105, -265, -77, -1, 125, -195, 68, -80, -42, 230, 47, -123, -10, 53, 78, -33, 150, -74, -6, -153, 8, -105, -191, 44, -225, -135, -132, 40, -70, -102, -47, 147, 92, -137, 165, -128, -98, 6, 132, -48, 89, -106, -60, 34, -30, 110, 72, 148, -254, -63, -92, 258, 93, -39, -48, 130, 29, -109, -40, 60, 40, -113, -25, -129, 15, 11, -180, -78, 61, -55, 225, 47, 99, -90, 167, -191, 121, 60, 281, 322, -89, 131, -60, -33, -1, 146, -50, 43, -172, -17, 153, 179, 261, -76, -19, 139, 84, -202, -208, 78, -192, 74, -115, -171, 120, -182, -30, 5, 52, -129, -90, -196, -128, -38, -7, 48, -34, 50, -22, -57, -36, 8, -54, 86, -83, 84, 81, 209, 58, 198, 78, 20, -162, -241, 170, 83, -66, 52, -41, -176, 212, -202, -23, 79, 33, -29, 227, -431, 65, 305, -28, 87, -43, -196, -70, -14, -154, 179, 116]
7500A16J22k50j7l7p0J25J13R4l51L74m22P7K46p4j9R0j65M1l9K7m8M2O9M8o3
7525B9j72J73o8p8J64j66K42q5k89J20J78j14J85K6l53M29k57P6q5j07K20o3q4
7548g9L07l22J58J6J52j22k06M8j76L30j81K51k42q0P2J1L4R0j46O1J13l7m3J73
7572A82k11J23l6o5K85k17j24L4J28j01K29j10J2k74L8K28j41J73j57j02J43l3
7594Dl0j37K62r5K6M9k37L10j38k59L34p7r6R8O1k27K05j81N9J93k12L1K70k53
7618d0K07n7k34L67k52N4n0P9j65K27M1p9p7j56J00L3j50j09jJ29J47Q5l6M9j36
7643b4m8J07l56L68J15j30J8j09j77M18k60r8K27%R2j54n7J95j66o8J28n6MP4
7667D3k63J62J6JK36k51L5K3k4P7k14K1J07J24r3K28k6k29K19k08m5K68k59m4
$$ y = [116, 238, -12, -29, -66, -136, -11, 102, 196, -155, 219, -203, -126, 120, 46, 27, 117, -48, -7, -46, -19, -67, -25, 44, 92, 29, -143, 30, -38, -116, 48, -118, 124, 39, -250, -130, 48, -66, 119, 145, -208, 221, -36, 40, -45, -152, 68, 5, -79, 228, -94, 64, 80, 232, 110, -96, -48, -224, 106, -75, 176, -66, -146, -74, -63, -29, 61, -85, -24, 89, 52, 9, 182, -29, 94, 58, -7, 278, 61, -63, -29, 99, -2, 227, 117, 129, -145, -107, 121, -20, 153, -4, -106, 37, 4, -26, -163, 99, 4, 30, 79, -158, 152, 14, -245, 89, 12, -84, 14, 75, -152, 53, -128, -69, 124, -88, -57, 213, -40, 167, 110, -124, 243, -9, 45, -5, 74, -91, 136, 177, 98, 21, -135, -35, -2, -152, -261, -262, -133, 14, 99, 63, 112, -24, -72, 35, -321, 47, 162, 32, 50, -59, -236, 182, -78, -176, 51, 51, 143, -11, -68, 127, -39, -107, 21, -35, -31, 43, -220, -58, -42, -41, 195, -56, -21, 2, -22, 55, -159, -138, -31, 93, 0, 228, 202, -27, 192, -16, -61, 207, -52, -96]
7691i6K62k33o7J74j97J43M6q4J53R5j53J30j91o7L05k4k61N8r4O5K94j99j52
7714i3Q7j24M17m80L09j7l09L06j09m9J93lk37L08k10K4K06k34k4J61j38O5k61
7737b12K18J66j58J09l48K86j04J47o1j70L18k90J21O7Kj30J86k05M5J8m2M33
7759C96m72J33o5j22JJ95k9j78K43l46M72k39j2J35k02N2L3j48n2M52m61K31O0
7782G7k17L74l14J6K72j35k23J26M4l3O1j52K47n4l36M16j74J23l2k13L53j38
7804H8k26K58J83l67K93k35O0R2j23O9j56K21j1N5l85K81Qk98K64q2l4M6J20j01
7828B0k7Op9K43k71J35o5l5o9M9J27K48k19k9Mr6k5K17j42k02K75l06N05k95q
7853c9r6J69j39J93j34L18O1n49J80L01l15J43%m1M7j99K16N8l61L33q0l29J01
$$ y = [-96, 166, -67, -134, 40, -157, -14, 32, -52, 101, 196, 43, 173, -18, -85, 220, 196, -65, -7, -101, -36, 258, 59, -93, -6, -130, 287, -193, 116, 99, -210, 96, -13, -62, 131, 128, -109, 199, -11, 13, 219, -15, -39, 122, -16, 49, -212, 6, 172, 14, 123, -225, 61, -43, 104, 43, -127, 191, -99, 22, 89, 91, -39, 147, -58, -13, 5, -37, 396, -76, 57, -8, -130, -129, 66, 37, -141, 102, -244, 228, -11, -23, 112, -90, -38, -5, -153, -205, 247, -214, 17, 77, -140, 234, -80, -64, 208, 73, -150, -24, 20, -13, 48, -104, 143, 89, -247, 169, -5, 118, 86, -127, 226, 88, -138, 120, 303, -64, 229, -6, 54, 146, 23, 92, -64, 157, 146, 201, -184, 97, 105, -193, 71, -11, -45, 1, 121, 20, -7, -1, -80, 163, -108, 27, -38, -73, -142, -93, 34, 282, 63, 34, 38, -58, -83, 134, -8, -210, 65, -241, 264, -31, -39, -135, 34, -105, 88, -46, 272, 333, -216, -36, 265, -50, 93, 93, 52, 99, -100, 116, 174, -187, 146, 66, -263, -162]
7876a62j00R8K53o8k7K82o32M43J30l02L82k67r8Ql2j83M88l59o9M03l40K71j26
7899gK61l43K16k14N24k50l7j55rL3j2k35J53L90m84L12l27J4K19q5k4k8J47j21
7923f2J97l26J74J18j72m6L8LR0Pj66K13k30J8K76j62J52j27j68K41J14k46J93
7946A29l40K60j21K42j59K65n17K47J38j79l9Q7K62n52K67om0j62K38m1j98L38
7968A19m9k25K61k08K1J19k33J68J78j88J82Nj72J10J6k74J65M5n6K10kK1J1j99
7992B5k09J57m6P3p9l9L09j71j64K38j27oJ06o4L2J37l14J03O1j77J33o0L33k59
8016hp6K41j11k34J66J31r2j05r1l8O18l64j87M93j72l31P1q1K24M7k31K68j53
8039a5o9N6n1L0J04j40l0K03k66K55m1k0P1k38J05L38k87Q3J8k75L06j84j9J14
$$ y = [-162, -262, -164, 89, 21, -6, 276, -356, 87, 217, -85, 297, 30, -68, -60, -92, -275, 213, -146, -215, 188, -152, 119, -7, 254, -89, 127, -87, 437, 187, 150, -5, -14, 19, 7, -228, -75, 315, -169, 143, -184, -170, 49, -36, -60, -88, 59, -62, 135, -191, -17, 101, -71, -117, -79, -76, 14, 21, -145, 68, -162, -144, 132, -30, 122, -5, -173, 68, 182, -64, 129, -211, 49, -72, 170, 11, 276, -241, 6, 144, -35, -74, 13, 275, -277, -10, -16, -56, -218, 20, -21, -219, 119, 70, -155, 106, -102, -81, 38, -195, -27, 151, -37, 145, 150, -22, 88, 104, -170, -5, 40, -16, 194, 192, 213, 224, 25, -184, -27, -73, 0, -79, -118, 191, 20, -144, 94, -33, -39, 67, 3, 35, 172, -142, -39, 22, -155, -22, -82, 251, -8, -84, 157, 46, -188, -22, 109, 17, -88, -179, -217, 401, 37, -150, 343, 171, -160, -89, -170, 54, 101, -130, 138, -15, -84, -28, -79, -49, 55, -85, -115, 88, -178, 77, 36, 16, 87, -151, -46, 292, 5, 88, 106, -169, 137, -47, -66, 48]
8063D8P0n3n0J68l23L03l8K7j32m1M0p6%n6L52l04J72j64j3J10p4o9L17k88j9
8088i3M4J3J08j58j60J96L8p9J35j79j4J44R6k38J01o4MP2J09K1N5j06o6k4J63
8113A18j97j31J27K86l12Q8J3m7K20k77L9J49j77N7L23l84J25j16O3J70j70j66
8135a99M02l2q4p0N0q3J67k37L86r2k41KJ81k90K30q2k40L87j62nP7j1L8k04J08
8160dj06Q2k3M28m93l2L26l09J94q0j39Rm8N3J46j41MJ3j6K47J30l61J30M6k49
8185a93J67K13k54K00j25k60
$$ y = [48, 118, 65, 15, 183, -140, 163, 125, 152, 20, -21, 19, -57, -57, -113, 239, -65, 107, -57, -70, 40, -34, -103, 214, -74, -93, -49, -36, 72, -86, -246, -50, -12, -91, 44, -135, -149, -5, 91, -147, -46, -110, -106, -34, 75, 96, 151, 45, -21, -45, 118, -79, -210, -83, 203, -109, -21, -8, -55, 165, -112, -73, 76, -101, -44, 279, -105, 20, -96, -33, 137, -33, -199, 203, 171, 87, 17, 67, -16, 151, -86, 300, 208, -33, -31, 150, -140, 90, 8, -232, 155, -7, -12, 65, 54, 92, -112, -4, -110, -28, -51, 377, -116, -148, 178, -131, 63, -17, -156, -147, -195, -142, 4, -137, -133, -120, -136, 111, 241, -120, 10, 56, -193, -26, 187, -67, 133, 8, -252]
8191b52
$$ Imaginary data points
##PAGE= N=2
##DATA TABLE= (X++(I..I)), XYDATA
0@%%%%%%%%%%%%Qj6J6j6J6k4L2m0M8n6O5p3Q8j04J20j38J62j87K12k42K76l16
34a69L59m03M53n08N68o34P06p85Q73r68J072j186J308j444J591j751J929k124
52a113K340k582K851l153L495l884M333m860N485o242P182q381R976j2216J5607
67H838k1400L3952j11129P5362Q9880j74713J07922J3837j05401O4426Q3058o1668
79B964Q60L1418l3516m0016J02736J4977j41142N2597Q8917j38995M5478J04791
91I1069j47375m7J12844q5853J6452P8577r4498k9250R3542Q498n1744Q434L6246
104C6895o6030j4112J14251m7500q1492Q5457n2416n4240J41009l9013j04878
115h2069R1156q408o1900Q3802K4827o4942j0265L8821J3435k4554L1944K143
$$ y = [0, 0, 0, 0, 0, 0, 0, 0, 0, 0, 0, 0, 0, 8, -8, 8, -8, 8, -16, 16, -24, 24, -32, 33, -40, 48, -56, 64, -74, 88, -99, 113, -129, 147, -169, 190, -213, 240, -268, 300, -334, 372, -413, 460, -508, 564, -622, 686, -758, 833, -918, 1011, -1113, 1227, -1355, 1496, -1657, 1838, -2046, 2287, -2573, 2912, -3330, 3852, -4529, 5447, -6769, 8838, -12562, 21390, -89739, -14377, 75503, -99210, 8712, 22549, -82852, -18426, 64632, 2964, 3824, 35242, 1726, -38290, 64446, 79423, -61719, -9122, 79795, -59200, -13722, 91069, -56306, -56353, 56491, -29362, -12910, 65667, -28831, -58081, 35461, 43959, -7785, 649, 36895, -29135, -43247, 71004, 23504, -57988, 27469, -24947, -79187, 61822, 22809, -82069, 9087, 679, -61221, 22581, 47408, -17534, -27799, 11022, 24457, -97, 31847, 33990]
127C3990q2181N4428N2471r5957M1499M3598j17778M4339Q1783q3387L824L7475
139A4104n0039J7896M6208j0259k6329l555K8267j6703K334O1598o2417m9565
151d8460Q7479k8934l7103P9534n4185n6963P3987j2473k3805M0782k6198k8785
163c5124K0695K5464M640l1460J3750J1995m5315M8212L2256p8179K7963K8947
175B3844o1791N0382K8445p3165K0521K3087k6908K5317P567k0309q799P37L3729
188B2657q574j9581L2348l6838j6173O9394l3885k8388M8321m6125j3650O0387
200B9893k9170j7453J9821k3399O808J5504j383L017k5685J2549K3502k8668K6579
213A1915J0415n4471L6281K3434m4307L3229J841m4565L2413P555j9073J6950
$$ y = [33990, -48191, 6237, 58708, -37249, 4250, 47848, -69930, -25591, 56192, -27195, -23371, 14104, -35935, -18039, 28169, 17910, -8419, -11974, 16293, -410, 1924, 63522, 1105, -48460, 39019, 10085, -27018, 52516, -1669, -58632, 15355, 2882, -20923, 19859, -6339, -35124, -14429, 11035, 15675, -15785, -2035, 9960, -35355, 12857, 45113, -33066, -5103, 23844, -37947, 12435, 40880, -32285, -11764, 11323, -15585, 9732, 17299, -3010, -11809, -11072, 22657, 14083, -5498, 26850, -9988, -26161, 43233, 9348, -19040, 29281, -16844, -30494, 29893, 723, -16730, 3091, -20308, -13500, 2004, 621, 3638, -22047, -9498, 14004, -14664, 11915, 22330, -32141, 4140, 27574, -16733, 16496, 18337, -26228, 6185, 13740, -5333, 11617]
225A1617j5269p326J0165n166K0944j3049k2809L1066j6497o628M3514l5083j5610
238b0131L9338k9017M209L2295l5637J04J6261j7185J5781j136j2597J1480j6989
251a3224J0539J9153l0338J5767R107l3614L3011P292l5242K7131m148k1886L1237
264A4785r648j3636J6304j7034O543J1251j7315J4476p658j5193K9696j3348r284
277a0061K7007k6307m96K8598k5719P202J5123k8425J4690P969j7733J6205q731
290f78q788J8289j6616M369J3859k4650J5125P581k4338K3797j072k1921K6625
303A1582q957j2298K3393j7066j464J7110j9830R366N944j9867J8765m116j4217
316a1655K2090j4518o295K3144k0118K735J6186k2915J2330Q432k0480J7638l265
$$ y = [11617, -3652, -10978, -813, -5979, 14965, 1916, -20893, 10173, -6324, -12952, 30562, -4521, -20131, 19207, -9810, -5601, 26694, -8943, -8839, 7422, -9763, 6018, 4882, -7715, 3765, -13224, -2685, 16468, -13870, 1897, 11004, -22610, 10401, 17693, -17549, 9582, 5434, -16452, 14785, 5137, -8499, 7805, -9229, -2686, 8565, -8750, 5726, -1932, -17125, 12571, -777, -10061, 16946, -9361, -9857, 18741, -6978, 224, 15347, -13078, 1612, 9581, -8152, 8053, -678, -9466, 8823, -7793, -3424, 10435, -14215, 910, 8491, -15847, 7950, 6878, -15043, 11582, 2625, -9673, 13720, -3346, -4810, 12300, -7530, 1836, 7780, -12087, 6678, 2562, -11655, 10435, -4083, -10378, 12766, -7352, -4617, 11569, -11346, 984, 9416, -11064, 6574, 3309]
329C309j4306K1446j1328n747J7266j8763M870J4685k0427J1902L564j9215K0082
342G338k555j2621J8833j4166m818J9341j5722N012R012k2407J3508N100j6395
355a0540J8188p638j3919K0466j0366j827J6775j9501L519J1896j4554J5113k11
368G401j7507J7655o130o046K0634j7402m751J5728j6699Q796J1101k2041Q738
381e23J947j1676J8947p256j0889J3333j2570M865J5767j8769N572M255j6225
394a3222K0142J523j7202J4475r004o612K1430j0882l561Q675j5962J0069R391
407I260j2778J0289p243j0053K0939p137m708J3512j9845J826J7328j4840O864
420C414K871j9994J3044L564q057J2153j2763n598J4992r071P466O932k0494J0841
$$ y = [3309, -10997, 10449, -879, -6626, 10640, -8123, -3253, 11432, -8995, 2907, 6471, -12744, 7338, 4783, -7838, 10995, -3171, -7989, 11352, -4370, 642, 9654, -12753, 755, 5855, -10540, 7648, 10, -13909, 6557, -3809, -5636, 11139, -8362, -4843, 7053, -7501, 7612, 7401, -10106, 7549, 1419, -4627, 16007, -1395, -6146, 9582, -7117, 1679, 12780, -9261, -523, 1424, -10252, 8695, 1439, -9450, 3883, -8687, -3822, 11945, -6824, -1252, 3003, -13222, 6920, 8443, -8759, 5716, -3288, -9900, 11530, 648, -2913, 5762, -10200, -131, 9260, -3518, 6771, -472, -10525, 10414, 3277, -1431, 12081, -7764, -5938, 11390, -3450, 3414, 6285, -13709, -665, 2899, -5158, 6995, -5768, -11366, 3626, -5445, 2021, 8953, -11541, -700]
434g00N808j0585J8045o616j6374J6551n597j468J4288j6965k877Q459r507J1849
448D311Q27j5527R239n282j199J9378j3225n093J1424j3670J0479J3386j8082
461c034M665J558j0604J6631j020j0757O367j0478K910J3212j1828L526r7j4754
475a3703J6785M287j1649J1723j0202p967J9915o401l330O708j6091M598J0338
488E011q694O807o480j1162J4311k700j81J0605j7030J346J4883r120R960L805
502A1361j8560J0306M603n908J2698r311r793Q697n616N367N302j6834L215J925
516b548p227J5859m489j2895J1369o287Q55J6435j2009l712O898q930J0703N116
530I138j2731M912n111l360J4360o857m178N185j2558Q832J1319j2492N776q83
$$ y = [-700, 5108, -5477, 12568, 5952, -10422, 6129, 532, -936, 13352, -3613, -6490, 1969, -7538, 4311, 5138, -10389, -1150, -6432, -7631, 11747, -1478, -6571, 4853, -8817, 1662, 15048, -3034, 1631, 3189, -7415, 9216, 8196, -2561, 3806, -6672, -3762, 9450, -2378, 1148, 1051, -13703, 3082, 7369, -4280, 7443, -2759, -10726, 9189, 2788, -542, 6166, -9925, -5327, 5011, -3683, 3124, -3356, -14518, -207, -2907, -3088, 7517, -9513, -8167, 6716, -2404, 7556, 11361, -7199, 3107, 7710, 1802, 14500, 5189, -4604, 4093, -1523, 3844, 9146, -7688, -4473, -2548, -9775, 6084, 1595, -11300, 69, -6218, -5363, 11072, -937, -4649, 2249, -6681, 4022, 9138, -3593, 1319, -3792, -7152, 7208, 351, -3827, 1358, -11200, -2368, 8951, -3541, 2235, 1352]
544A352j0337J5848J314p546P639j0627j513J2988p101J697n04j3359R632L065
558B548p314R694r579p330J4328m424J970P737j4568L116R578o556Q507j831j1953
573f077Q571j655j336R457j2249l436P195p507Q604K860j4478P050Q25m644J4034
588G214n324p857Q597n116M155R075j1255J068J940o502J1595j814r293O584p711
603d644j64J3217r385j311M198j0065Q842O263r544N596l761n558J2056l462k819
618e41M836j1417L855Q009q106M989j878j0389J0810K98m475Q948q903k924J1268
633D380n094L233L770j0945O052K951m483Q405o269o988R298n251J183P154j1996
648d600Q10N739p090Q066J30r930O987j893j069R522p957k049N696o710O443M283
$$ y = [1352, -8985, 6863, 8177, 631, 8270, -2357, -3870, 9118, 2017, 3714, 3210, -10149, -517, 2548, -4766, 4928, -4651, -11981, 2347, -2077, -107, 7630, -6938, -3822, 5756, -800, 7707, 5876, -6077, 2494, 839, -497, 8960, -3289, -6725, 470, -7037, 1567, 4427, -10051, -3001, -2176, -6820, 7214, 1890, -5967, 2630, -2486, 1669, 10744, -511, 557, 2497, -4005, 7590, 5776, -3517, 3067, -4644, -4808, 8409, -976, -2287, 1911, -8154, 688, 6951, -2593, 3003, -758, -6316, 5740, 2278, -541, 4295, -7122, -3267, 4742, -3364, 1625, -253, -10642, 168, 466, -4009, 4939, -3964, -6888, 4380, -714, 2519, 6289, -4656, 1396, 4347, -136, 8269, 2000, -4988, 4310, -941, 242, 7396, -4600, -3790, 1949, -5141, 2925, 3055, -6875, 112, -1781, -2850, 6672, -1285, -3334, 2362, -4348, 2095, 6378]
664F378j0530N452j316n592J1105l821o159P042p101J646Q510q173K116J461o935
679e917Q774M83n714O548o203j620R922o621N99M254j0085N533M251p498O096
694B802k870o579R227k663j894N860q148K215O073o751N695J19q493P736n00m166
710b337Q040o854k963P665n868J959M233r092M484J499n068P990k952n284P326
725B778m658P03P009q327K221M041p492O618J037p722O483k914l432Q189n789
740a255j477N457p237M066L483p068N416m88n431Q574l144l381O632o017J54O595
756D879p072K722K502p372O034M2n138O482m227k760P403n425O73N112p807M108
772A56K906o544N999p83n378O904l597k160O581o455Q57M678o936M444J520o345
$$ y = [6378, -4152, 1300, -16, -5608, 5497, 1676, -4483, 2559, -4542, -2896, 5614, -2559, -443, 1018, -5917, 2857, 3340, -2374, 4174, -2029, -3649, 6273, -348, 251, 4505, -5580, -47, 4204, -3294, 2802, -68, -6647, 2580, -83, -1977, 3883, -4265, -2050, 4023, -2728, 2967, 3086, -5407, 2329, 1829, -2337, 5703, -1151, -4114, 3551, -2317, -358, 3875, -5217, -733, 766, -4302, 3688, 736, -4548, 2778, -1880, -1177, 5832, -2495, -274, 3767, -3725, 2893, 3930, -3792, 2691, -223, -3655, 4534, -1255, -2732, 2725, -4512, -446, 3037, -4031, 1385, 897, -4534, 4040, 896, -2485, 4147, -1870, -1716, 4879, -2193, 529, 3031, -4341, 1693, 1735, -3403, 3079, -1148, -3908, 3495, -1930, -1257, 3855, -3952, 156, 3062, -3482, 2517, 1734, -3644, 3260, -337, -2497, 4084, -2371, -1514, 3164, -3772, 672, 2192, -4153]
788d153O289j207m737P413m279j732O742o167J468M251o921M195J715o681O189
803B385j954m195P304m751j608N882o366J928M296o625M556J004n841O729j636
818A108l562O018m612n71O018o222J954L162p256N394P57n484N821k858l539P068
834C196m536q0M544o610K770L469n573M678l26n574O217j865k393O115n779o56
850b403N332n601L324K209o731M963l39l780O905l500k970N469m645J407M703
865D343o913K638K192n660N962j060m970N595l581j201O436n508J67L758o059
880c861M412K383n756M710j704l235O750k873j896M322n651J577M629n638K934
895A103K49n896O116n89l499N377m834j598O231m222J616K496o721L876K225l944
$$ y = [-4153, 2136, 929, -3808, 3605, -674, -2406, 4336, -1831, -363, 3888, -3033, 1162, 2877, -3804, 2385, 431, -3764, 3540, -1211, -2819, 3063, -3303, -1375, 2921, -3704, 852, 1856, -3985, 2744, 1108, -2454, 3564, -1048, -1619, 4399, -1823, 131, 3293, -3963, 1431, 2188, -3296, 2525, -333, -3872, 3196, -1340, -1420, 3124, -3486, -716, 2753, -2820, 1858, 1532, -4042, 2175, 310, -2083, 4032, -1747, -2403, 2929, -2672, 652, 2861, -3870, 1093, 754, -3026, 3879, 379, -2591, 2878, -1767, -360, 4343, -2570, 68, 2260, -3400, 2562, 1502, -3468, 2127, -1454, -2655, 3781, -1727, -1560, 2198, -3861, 551, 2934, -2822, 1888, 184, -3051, 3699, 826, -1070, 3252, -2399, -822, 3807, -1831, 1103, 1352, -4544, 1572, 983, -2516, 2861, -1973, -3571, 2660, -1562, 54, 2550, -4171, -295, 1930, -2014]
911b014N157k873l986O039k874j52M734o511J169L640m633M550J52n746N018j271
927C99j981O034m829j528M441m875L310K585o770L360j44l302N948k618l547M722
943A205m466J386N308n448J345J652m771N611Q72m573M177l035j443O426l808
958D38l75K453n981L601K830m716L194j236m276O066j404j487M104n639O48M720
974B940m230K707L53n922M885M77l014M867m402k028N044l411J734K825o159K647
990f87J901l320N261k060m429N136k367n8N040n748R4K758m216M127J304n513
1006b777L260j352j460N437l155j813L196l792K471L711n315K517k10l666N889
1021B941j122l370L748m065L17M821m342O55J493n092M147J459l713L790k926
$$ y = [-2014, 3143, 270, -3716, 2323, -551, -703, 4031, -2480, -1311, 2329, -2304, 2246, 2398, -3348, 1670, 399, -1582, 4452, -377, -1905, 2536, -2339, 971, 3556, -3214, 146, 2, -3300, 2648, 30, -3517, 1205, -3261, -1875, 3433, -2015, -670, 982, -3789, 1822, 2694, -1879, 2298, -737, -2180, 4246, 438, 63, 2516, -3465, 136, 2966, -1750, 1444, 208, -4068, 1998, 594, -893, 3211, -2428, -1780, 2940, -1290, 1417, 1770, -4152, 733, 1210, -1804, 3063, -1339, -3367, 1677, -1734, 0, 2825, -3334, -687, 1214, -2106, 3155, 1095, -3334, 1802, -565, -623, 4417, -1331, -1237, 1521, -2695, 1432, 2736, -2777, 483, -869, -2329, 3108, -47, -1860, 1336, -2456, 15, 3726, -1589, 928, 718, -2948, 2941, 1819, -1551, 2197, -1868, -1551, 3270, -1072, -417, 1076, -4016, 131, 1590, -2123, 1667, -1259]
1036a259k018N579k562j66K891n462K117L334l982L590j039m670N147j004j424
1051i28M251m893j09M096m079K900J298n306L278M72k449M873k970k770M136l107
1067a307J222L302n400J386J448l574M606n77m074L635k133m21M925m143OK405
1083A306l958L431J996m503K831j181k495N659k326j659K859m179J578L365m145
1098a421K023J24m210M897j39k709L706l412r95M528k921J087J440m659K674J629
1114A642l055L407j892l186M593k139k08L123m542R51K596l362L409L8m085L724
1130A014p40j441L872k952j452L286k956K016J748m759K608J67k585M086j435
1145D77k541L551k694J96L942m066Q74J498l314L443L65l485L276k001j297M030
$$ y = [-1259, -3277, 2302, -260, -426, 2465, -2997, -880, 2454, -1528, 2062, 1023, -3647, 1500, 496, -928, 3323, -1570, -1679, 2417, -1662, 1238, 2536, -2770, 508, 980, -1469, 3404, 434, -2336, 1800, -1307, -85, 3217, -2183, -797, 651, -2923, 1683, 1106, -2968, 667, -1466, -1887, 3038, -1105, -1099, 1306, -2652, 779, 2775, -1728, 1103, -78, -2573, 3086, 760, -899, 1960, -2219, -641, 2724, -1421, 602, 726, -3484, 1413, 1274, -1435, 2271, -1141, -2136, 2392, -529, 558, 1998, -2661, 13, 1642, -1413, 1994, 102, -3084, 1509, -630, -838, 2285, -2257, -1306, 1290, -2072, 1337, 1375, -2710, 1014, 274, -1167, 2705, -247, -1699, 1587, -1369, 647, 2395, -2364, 244, 411, -2174, 1912, 477, -2064, 1487, -1207, -1011, 2931, -1135, -261, 1237, -2077, 1366, 1731, -1754, 1522, -479, -1776, 2254]
1161B254k973j17K285l966K349K011l843K964q06k799M268j188j581L403l517
1176a256K61K986k922J674O62l663L152L7k313L323k565j508L999k869O10K382
1192A990m085J992J319k667K917o28k841L613j720p09L368l575L62K088l348K553
1208F29R01l801K967n02k261L755j883j266L127l012R12K621l731J971N47k745
1224a771L390r49k201L237k439o66L275l055O91J736l237K418O50k800K953j206
1240B6j523L526k096n31K698l248J217J670l256K313J49k848K863j000j510L131
1256A581k626n0K499k619R20J853l107J975M90k335L191j383j514L129k598N5
1272e39K320l137J404J425l159K193l1k311K946j237j437L119k713N26K301k975
$$ y = [2254, -719, -836, 1449, -2517, -168, 1843, -2000, 964, 158, -2641, 1627, 439, -1142, 2261, -1256, -995, 1991, -931, 743, 1405, -2258, 894, 931, -1382, 1941, -624, -2132, 1867, -1002, -392, 1990, -2095, -103, 1216, -1451, 1466, 838, -2003, 1610, -110, -819, 2549, -1026, -664, 1424, -1924, 629, 1530, -2271, 696, 194, -2067, 1688, -195, -1461, 1666, -1346, -434, 2187, -1544, 427, 974, -1771, 1619, 670, -1531, 1706, -733, -1399, 1876, -1179, -488, 1248, -1989, 429, 1079, -1721, 1232, 26, -1497, 2029, -67, -598, 2100, -1148, 69, 1739, -1517, 796, 945, -1903, 960, -40, -1550, 1581, -1045, -1095, 1404, -1215, -295, 1558, -1549, 426, 916, -1419, 1772, 389, -1125, 2004, -594, -539, 1781, -1356, 48, 1473, -1686, 507, 476, -1835, 1111, -126, -1563, 1556, -1157, -631, 1670, -1305]
1288a305J687J045k930K376r3k447L288j876j027K632k360M25K032k887J350J088
1304I98k631K476j77k096L059j577r45K986k917N32J964k929J758O23k923K452
1320F53l16j687K797k379n41K805k648J099J657k830J567R20k256K609q59k039
1336a448K894j619n33K607k779L22J654k480J999M20k862K533q78r87K676j634
1352a15q32K309k435J013J718k946J935j73k159K939r09j585K317j973k27K698
1368A575k743J049R87k611K214M99k198K443j207j116K723j606l6J678k660R13
1384i6J309k302J939m18k379K649o28j025K143k338n8K098j878J446Q87k917K240
1401F72n5j472K450j549j059K316k064N66J789k683Q11Q03k109K364l39j883K090
$$ y = [-1305, 382, 1427, -1503, 873, 780, -1667, 1621, -255, -1282, 1350, -1010, -585, 1447, -1440, -90, 998, -1633, 843, 666, -1430, 1629, 52, -893, 2093, -824, -292, 1672, -1257, 501, 1124, -1799, 653, 337, -1350, 1447, -932, -1473, 1332, -1316, -217, 1440, -1390, 177, 1097, -1159, 1450, 591, -1448, 1446, -173, -706, 1901, -878, -556, 1098, -1382, 617, 1037, -1825, 708, -170, -1157, 1519, -115, -947, 1362, -1073, -60, 1658, -1288, 647, 474, -1685, 1254, 345, -1240, 1077, -896, -1123, 1575, -1168, -119, 868, -1743, 471, 970, -1228, 1215, 8, -1108, 1615, 9, -27, 1651, -1009, -96, 1213, -1089, 850, 432, -1947, 702, 74, -951, 1192, -1146, -1204, 894, -984, 462, 1349, -1568, 672, 617, -855, 1595, 46, -1013, 1303, -761, -195, 1594, -1089, -278, 525, -1584, 780, 441, -1442, 648]
1418F48j191k61K507k122j80J712k310J724R19k300J467m04j650K754j280j010
1434i77J743k270R90J690k341J482j0k176K679j49j184J928j791o17K612j815
1450b06J64J491k857J418Q67j765J728j058j522K461r34m69K009k348O21J437
1466A037j850J918j05k155K017n27q78K160j879o23J913k154J184J025k641J336
1482b22L10j558K499r73j289J993j268J64J919j962K66P91j818J756M42j979J830
1499I01j306j035K694j761M9J185k296J347J222j645J275m18j550K556n11j087
1515c80J730k209L86J813j794P92J44k103J911j72j044J917j488r43K229j186
1531c97M97R92k220R97J078j483J690m50j955J930r22k12J602j969m7J272j770
$$ y = [648, -543, -804, 1703, -419, -599, 1113, -1197, 527, 1446, -854, 613, 209, -1441, 1313, 33, -977, 766, -1504, -514, 1176, -1165, 317, 307, -1869, 810, 661, -523, 1405, -386, -1003, 1609, -206, -42, 1449, -1408, 10, 877, -888, 840, -218, -1740, 721, -213, -682, 1327, -1021, -400, 1037, -813, 1105, 1000, -1155, 862, 335, -543, 1617, -262, -885, 1028, -1126, 58, 1083, -1558, -222, 88, -1470, 1029, 56, -1233, 760, -508, -344, 1575, -387, -121, 670, -1148, 608, 1050, -929, 901, -405, -1440, 1254, -507, -458, 727, -1569, -222, 1000, -645, 630, 212, -1338, 1218, 707, -380, 1350, -859, -473, 1340, -454, 338, 482, -1621, 290, 118, -926, 991, -497, -1440, 789, -397, 100, 1092, -1128, -131, 947, -536, 1154, 704, -1251, 679, -243, -455, 1147, -822, -869, 403, -1367]
1548a367J845J34j888J486l32r19K391j223o27J290j509O83J385j855O44K63j495
1565a094K070m84j168J419j431j89J906j585K52Q78j749J506M52j435J575q44
1581G9r69J924r57m03J331j915N95J248j906J468k45j736K008o81l52J518j774
1598g67LJ658j266Q75L49j804J374m3q75J832j203j034J739j349K41J306k090
1615a054O85R12j414J477j59j523J677p12p9J546j678k31J379j930J250P00j592
1632g46J335m11j384K087q15o64J360j648L59J499j724J005K29j742J908j4j283
1649f49J628j227l49J563j501M09R71j871J030M61j389J508m72j001J419q82p8
1666d30J454j768M92J143j421J213j96j291J342k71q09J434j434j48J165j241
$$ y = [-1367, 478, 612, -1276, 210, -122, -1041, 1350, 127, -500, 790, -719, -36, 1349, -506, 138, 401, -1094, 976, 492, -676, 743, -688, -877, 1029, -556, -304, 574, -1175, 331, 783, -652, 923, 79, -890, 1034, 77, -326, 1005, -910, -315, 933, -973, 495, 250, -1486, 522, -159, -511, 1007, -767, -764, 894, -372, 503, 852, -952, 422, 379, -496, 1336, 133, -901, 838, -511, -270, 1036, -1054, -369, 543, -871, 606, 447, -1076, 601, -111, -190, 1356, -322, -553, 826, -1104, 146, 846, -746, 589, 178, -1206, 881, 66, -598, 762, -886, -527, 972, -752, 253, 482, -1260, 648, 634, -649, 979, -248, -597, 966, -535, -126, 845, -1026, 4, 465, -924, 584, 112, -889, 530, -352, -430, 1024, -744, -252, 891, -530, 683, 487, -804, 538, 267, -542, 892, -542, -690, 475, -766]
1682g66O72P81j615R40N40j276J572o62q50J675j291q9J468j499M08N80j302J201
1700D87j23j348J474n16q79J683j236J6J239j597J051L73j188R27O1j144J621
1717I01p30p51J407j316nJ238j448N73N30j307J328k42j008J560p89l54J302j059
1735a70j10J240j594J027M86j648J349k7j173J114p05m00J271j422L89J147j518
1752g44J021J99j267J269k75o57J284o23n53J190j358M4J093j459J035J42j345
1769a004J389l61q03J537r33j36J391j721M24J116j268P18K90j372J321n54n19
1786d85J161j160%J165j406O87N39j478J046K01j171J409m15p23J355p24r9R36
1804H38j265M21P29j338J165j30j149R07l41m97J215j031j69J250r76N44O19j385
$$ y = [-766, -94, 687, -928, 12, 552, -724, 848, 186, -664, 1011, -280, -369, 1099, -400, 8, 588, -714, 487, 364, -984, 490, -26, -905, 778, -458, -442, 797, -800, 251, 624, -564, 363, 424, -720, 901, 171, -580, 827, -489, -494, 744, -704, -131, 399, -908, 420, 178, -830, 730, -59, -413, 889, -170, -280, 960, -634, 393, 879, -769, 580, 553, -620, 494, -211, -611, 660, -762, -373, 774, -744, 277, 476, -791, 478, 203, -454, 830, 207, -346, 844, -514, -470, 623, -836, 199, 341, -1004, 385, 24, -779, 758, -175, -311, 1080, -641, -217, 899, -369, 349, 639, -733, 588, 34, -485, 676, -484, -484, 681, -725, -38, 501, -977, 69, 270, -901, 508, 93, -630, 725, 1, -98, 838, -427, -6, 723, -615, 550, 420, -729, 178, -163, -660, 555, -476, -645, 605, -371, 173, 792, -593]
1822e93P60L84j272J407p33n63J458j456L22J126j496N82M76j120J008pr51J213
1840E45n52n96J490j138K02P14j183P32M86j205Q65k01r21J391p60k67R22j204
1858f80L40R75j316Q38K08j051J151l76n87J282p28n64J377j046N91L60j527R44
1876A91K46j216J312m58r27J321r02j85J081r52J45Q87j248J001J96j282J374
1893E84m98n15J192r42k69R96j040O62N28j491Q14J17r36J246l18p69R06p27M02
1912e8O81q60L56L75j072R99k69o87J035p37p07J559p58j5M39j390R02L59r34
1931g82J036L0j006J335m75k25Q79j026J02N51o51M88L05j283R85p2j109J481
1949E63p00l99R72r58N31O93j449R24L61j005J356l29p86Q52q49K5J121j353q0
$$ y = [-593, 167, 551, -721, 686, -47, -610, 848, -608, -286, 840, -656, -74, 402, -718, 290, 283, -668, 545, -7, -603, 887, -251, -49, 665, -518, 214, 700, -505, 360, 159, -762, 629, -131, -398, 524, -680, -340, 635, -681, 157, 365, -686, 465, 89, -498, 784, 56, -508, 869, -177, 414, 774, -753, 191, 437, -779, 533, 75, -852, 469, -433, -618, 463, -489, -344, 543, -705, 296, 492, -790, 584, 86, -429, 763, -179, -448, 548, -492, 170, 698, -793, 21, 138, -798, 448, 130, -639, 267, -460, -58, 623, -237, 119, 494, -578, 421, 152, -535, 500, -237, -944, 615, -143, -158, 281, -1109, -207, 152, -782, 254, 284, -722, 613, 138, -87, 792, -234, -132, 419, -232, 256, 561, -722, 263, 191, -918, 563, -137, -536, 436, -522, 9, 702, -747, 177, 538, -467, 889, 560, -226, 626, -223, -198, 923, -430, -510]
1968e10P56r84R17J07j160J103m65m33J344o18l50Q25j086M85J101j548Q33Rj053
1987g27J236n30k92Q28j046O6J040j077N54K00r67P10L11o49J031n59p07J143
2005E65o34o0P16j130N83L23r14R63j70j085Q45j18l27J003p92j39Q15q27N87
2024B04N32j228Q95O7p47J170q69k93Q07r41L67O22r01L63K49j077J245k91n91
2043d17R24o54j17Q19o43R4P06j146P58K49j096J028o25m06J065q03r2P79q75
2062d52K06P28j055N89K42q03O57l2l02R40r15j63R99j035M50L08q70N90L40p84
2082c62O80l25m88R90n78k08O14p27M95N52q52O90k89o37J057n10n97J160n92
2101G3o81J008p60N46J88q97N49m8o43J050l84m73R29r45M11N08o18M12J74r21
$$ y = [-510, 246, -738, 179, 286, -874, 229, -236, -669, 675, 57, -293, 532, -554, -69, 1032, -516, 317, 326, -727, 509, -21, -313, 515, -531, -465, 575, -502, 52, 252, -715, -5, 306, -343, 688, 129, -578, 565, -69, -129, 587, -543, 40, 363, -551, 412, 242, -843, 2, -116, -443, 560, -232, -371, 444, -383, 204, 736, -492, 403, 470, -277, 893, 24, -269, 538, -403, -36, 586, -315, 48, 297, -780, 465, 174, -417, 507, -147, -264, 555, -88, 6, 712, -434, 324, 573, -523, 505, -120, -526, 539, -264, -356, 423, -452, -246, 482, -573, 16, 258, -545, 112, 80, -222, 718, -197, -360, 639, -396, 54, 362, -508, 82, 422, -362, 318, -7, -495, 495, -83, -291, 323, -404, 91, 643, -209, 481, 192, -445, 612, 102, -495, 665, 73, -608, 400, -360, 186, 374, -523, 26, -22, -665, 385, 1, -472, 457, -488, -77, 431, -187, 225, 399, -522]
2121e22R01O0n97N57n31k14P33o13L5M81q47M20M80n85M55j39p14R86o19J38O15
2142D80q56K19N40o84M11J35q49P85j18p05J130l92l53N49p18N00K94p64O04K57
2162D65p42Q82j60o90O98o04l37J012j065M23M76j030Q90j49o30O91k77k89R72
2181E36m05j94N67r27M98L68q04Q19j30p87Q21m55j57P01o00j94O52n57J01N23
2201C76p76Q41k78n71Q74l04k82M65m62J8N00p11K52K42p36Q25m20k01Q40m60
2221C2l21P10n70k12Q19q05P67j16q29R70l65j74N63n19k75O24o08L20J34m90
2241c45M16%m46O27j57n75Q80l72l15P18o56L13J81n97M73R1p95Q51l89j63N68
2262C08n03j51Q29p39L96J49m79K74J38o17N59N9o50O47m01R4M31o28K03L19p55
$$ y = [-522, 379, 439, -158, 399, -132, -346, 387, -226, -191, 290, -557, -137, 343, -242, 213, 74, -640, 346, -273, -135, 480, -376, -157, 383, -301, 110, 245, -604, 181, 63, -642, 488, 96, -257, 292, -426, 74, 368, -396, 208, 465, -277, 605, 445, -245, 453, -151, -488, 524, -541, -118, 358, -672, 218, 69, -561, 130, -147, -436, 536, 131, -63, 504, -423, 75, 443, -361, 458, 328, -459, 362, -93, -250, 451, -149, -343, 309, -248, -147, 376, -400, 441, 163, -408, 466, 162, -120, 345, -117, -99, 401, -310, -58, 184, -552, 273, -147, -348, 492, 32, -289, 421, -149, -361, 458, -347, 420, 304, -525, 445, 80, -94, 469, -50, -325, 299, -309, 11, 145, -345, 71, 71, -375, 252, 95, -480, 400, 28, -287, 431, -225, 88, 269, -328, 145, 236, -559, 292, -97, -260, 308, -195, -346, 483, -256, 140, 289, -190, 84, 222, -395, 164, 223, -427, 220, -181, -87, 344, -284, -81, 238, -517]
2283e17P05N8l28M75m76k76Q12n96M0O49r62N40J16o28K30L13m04N20k87k71M90
2304B03m96J44N13q80L78L19n06O97l92k93O20m19j36P09l77k12K92o85N49K50
2324B78n91L46r1j98M27q7m14O59p31M78M48q98O67l0p04P45n7m37N07m48m6L18
2346A41n46K62L77p73N80Q4n96P35j34l60L26k48K19J88n02M51j2m76O89k44m67
2367c06O17k17m12O80o22j19O16m35K08J12n40N36Q4l56N77m54j18L12l32j4L85
2388B02m11K44J4m56L75J72n74P07o51nP84o90K31L31n00K00K03j42P4J14m99
2409b77N20l09j19O28o99n2M04l24K39K75p00M22j68rN88n45j53M99m32J01N94
2430D83p46J99J84l72L02n9m84N00j78j0L17l46L81o7m91N20J90o60L94ml33P18
$$ y = [-517, 188, 246, -82, 393, -83, -359, 453, -143, -103, 546, -416, 124, 240, -388, -158, 155, -249, 271, -16, -287, 203, -293, -149, 364, -516, -138, 181, -325, 372, -20, -313, 307, -112, -248, 461, 84, -128, 164, -521, 28, 278, -313, 33, -58, -256, 171, 84, -330, 329, -402, 76, 524, -374, 293, 263, -441, 304, 247, -190, 317, -131, -177, 141, -405, -143, 234, -539, 41, 125, -471, 264, 130, -230, 96, -152, 67, 255, -247, 204, 192, -284, 405, 161, -306, 311, 94, -318, 362, -260, -379, 237, -198, 10, 122, -418, 118, 202, -154, 423, -31, -149, 163, -169, -183, 202, -209, 35, 49, -407, -32, 140, -434, 273, -378, -383, 401, -289, -58, 273, -227, -27, 176, 34, 108, 222, -277, 243, -66, -185, 443, -256, -308, 96, -228, 11, 286, -414, 8, -160, -169, 419, -126, -279, 220, -212, -111, 483, -263, -64, 120, -252, 50, -9, -493, 7, -171, -181, 136, -210, 171, 104, -387, 133, 323, -337, 57, 53, -280, 438]
2452D38k78l60L70m16K76J80m22K15K16m60M20j83l30N14k59L2L06n68M09O4m37
2473b73N02k16L5K56l75k19O26m86J11M94n52P0j6j02J90Q9l29M53k50j70K53
2494I1j44J56R5l27J03K32l68K20L1l70M21k46k9L55j08j83K44m30J77L21l37
2515i6N55m33j5J20k84K10K62l21O7R5m30L72M6j04P8k10j20M70l04P0J04l13
2537a81o4M32m22L98j16k30N10l60j24O93p01Q2K34l52J07L60n88K15J20k87M72
2558A98m61p0M19j78K3J97k81J38K08m06M29j44l14L12j07j15L21k36o2J90l38
2579b77K88k0k40N9L24j08J88J47n10L58m52K08K93l24J30j05K6J83m74R3L88
2600A75m48P5N13n58K03K88l64J66j3K1K53l85l5J65j35J49N6k49M7R0j86J79
$$ y = [438, 160, -200, 170, -246, 30, 210, -212, 3, 219, -241, 179, -4, -334, 180, -79, -47, 259, -309, 100, 164, -273, 229, 13, 48, 304, -71, -290, 336, -150, -39, 455, -97, -27, -43, -145, 45, 134, -195, 258, 8, -162, 91, -53, 103, 198, -129, -26, 206, -162, 58, 89, -281, 140, -106, -135, 220, 112, -71, 173, -257, -80, 241, -96, 459, 26, 11, 131, -153, 57, 319, -2, 65, 160, -270, 102, 148, 44, 122, -88, -208, 262, -42, 28, 132, -181, -245, 187, -235, 163, 47, -183, 327, -33, -157, 536, -165, -83, 151, -201, -94, 266, -322, -107, 13, -274, 198, -263, -333, 86, -92, -69, 128, -153, -15, 193, -213, 216, 72, -242, 70, -37, -152, 169, -67, -129, 61, -277, 11, -9, -249, -190, 134, 26, 214, 361, -149, 209, -243, -35, 258, -66, 64, -41, -15, 168, -306, -213, 175, -273, -198, 315, -243, -40, 248, -116, 50, 37, 58, 311, -74, -109, 56, -79, 70, 126, -123, -76, 14, -172, 7]
2622Gj8j39K38m3j49K24k60j23L88r1J18J56m62L40j55k26K91K3l96N13n45K28
2644h1N9j7J0J10k91L35k43k83O78k16j55K91j9k39K13l20R3K81l07R6rk42L31
2667G5p7q1K26j30k37K83p5N3r3j54J64k05RK32n4j36J34k14J40M10l86K53r1
2690D6j25J14J26j91L31k75k46K33k09P6K48l69K59J38j77o6k54L12J25k36K16
2711G6J48l33K77L8l32K08L6k05L9J05k20L55k38o8J22r3q1L34k69j1M29l55J68
2734A30K2j53J42k97L39r5j46Q4N0r2j9M1k4K30n17R8J96J01k10J57k11J82j0
2757bl19L77m0LR6j73R8J3j39L21j46j50K05Lk12J23K8p4K16k57m1L0L4q9K42
2782A47k05j12M15l50oP6P6J27k58L7K81l89J00K22k87K11J26l71J42N5l25L24
$$ y = [7, -11, -150, 88, 45, -104, 120, -140, -263, 125, 34, 152, 308, -154, 186, 31, -195, 96, 119, -277, 236, -309, -81, -22, -39, -29, 81, -210, 125, -118, -401, 277, 61, -94, 197, 178, -61, 152, -168, -75, 206, -101, -5, -14, -256, 75, -2, -83, 143, 13, -224, 59, -16, 37, -56, -210, -46, -251, -242, -10, -64, -200, -66, -280, -140, 270, -116, 137, 46, -79, 35, 161, -30, 301, 26, -220, 13, -196, -120, 128, -241, 18, 156, -21, -87, -341, -29, 96, -140, 76, 224, -109, 168, 206, -126, 82, 118, -87, -48, 57, -163, 192, -46, -114, 8, -85, -166, 168, -101, -112, 317, -38, 130, 152, -1, 141, -156, 183, 88, -58, 26, 76, -16, -35, 6, -18, 212, -305, -207, -11, 90, -120, 37, -174, 8, -2, -321, 56, 16, 19, 115, -58, 40, 53, -86, 235, 89, -61, 144, 147, -65, 58, 86, 12, 228, -29, -70, -40, -6, -95, 147, -58, -170, 245, -105, -111, -35, 41, 168, -90, -53, 228, -161, -61, 161, -126, 85, 211, -160, -18, 37, -288, 36]
2804C6P3j62K89l60K34k06J10J29j3k14J00J24j21L3j21N4J32j70K16q1l07J47
2826g8J92j35J30J59j49J50l86O0J13p0K19pk63J99j02J8j47O0K0O0l0O2P3k96
2850a48j2R6O6J36q2q1J60k73k8L16k75m1L07m1l4j0O8k64o5K31L5kj28L6J25
2875I2k02J71k68L16K2k04K29m41K00L5N0q0k1j45K78q3k65M24mj77J32J95m26
2898a72N19j17l70qJ15l4J33l1l0m8J19L4k45m1L68j42j72K2J59j55J46k14J22
2921d2l2J30k28J02Q1Q9j48Jj88K00K7j43O7Q0J12j43l0j13nO6O8J27j52q8L14
2946A52k47N2J36j57J0Q0m8J33j5j54J20J2k06K10j59J72j25J55l37P8Jl0K04
2969C7M6k92J45K1J3j35M3J07j3J13j62K51j95J43l91K15O0L1P4j15N1K0n7n5
$$ y = [36, 109, -53, 236, -124, 110, -96, 14, 143, 130, -84, 16, 140, 19, 52, -69, -15, 117, -53, 163, 82, -225, -78, 114, -21, 109, 268, 119, 269, -117, -57, 56, -14, 205, 198, -65, 134, 32, 50, -97, -37, -17, 43, 13, 75, 148, -148, -160, -64, 2, 138, 56, -25, 135, -138, -166, 150, -125, -166, 141, 100, 66, 56, 124, -140, -205, 26, 61, 59, -69, -33, 92, -110, 61, -207, 109, 131, -73, 156, -285, -85, -50, 0, -80, -101, -246, 32, -51, -316, 108, 104, -73, 59, 254, -172, 347, 230, -140, -148, -33, -67, 66, 35, 5, -43, 76, 110, -135, -176, 192, 50, -122, -100, 59, -96, 50, -164, -42, -74, 56, -172, -70, 11, 100, -48, -47, -235, -35, -8, -151, -84, -4, 108, -35, -65, -178, -183, -117, -49, 78, -74, -162, 152, -95, -43, 93, -64, -54, 26, -22, 111, 96, -58, 62, 74, -132, 78, -81, 91, -34, 121, -216, -138, -137, -167, 37, 83, -209, -64, -43, -30, -165, -122, -15, -28, 85, -77, 174, -21, 122, -269, -54, 6, 37, 111, -4, 47, 67, 10, -45]
2993d5Jml4J02j76NJ86j92K94k21K16j25Nk26J14J0l9o0J56J27j02j34J25J87
3017A70k82j9K63j64j21K90j47J85j15m4j75L20j56lP2m4Q8k69NJ1L5K31m17L65
3041G9k1j04J25j04o6l7J65q2K13j18J59j69r4k7M02l78L1J22k38J96j49j32K77
3064E0J0p7r2pO0n8K25r8k01L64j02j20J5k7Q3j52J98p3p3M5o7p6P3Q0L5J1j5
3091A1j29J01L4J43n3k17L22l04J94j63K5J03K3k33mJ24j35J60l8P0j20P1m7J44
3115H2l8k4R0n5K1k28J17o0J63j32k69K94j33J96JJ80%m70J79J89k16K39l61K11
3139b4J72j20j64M9L0J04L3kq6K06k44J18L1m17L64n2m7L89p0k99M3J10j94L8
3163c2k31K62j22R8R7k2j64M2K76l3j16K3j61R1j14PL36m48J60Q9o5O7o2J0K41
$$ y = [-45, -44, -48, -82, 20, -156, -151, 35, -157, 137, -84, 132, 7, 12, -214, -100, -90, -129, -189, -33, 94, -8, -142, -17, 170, -112, -131, 132, -32, -153, 137, -10, 175, 60, 16, -159, 161, 5, 2, 74, 30, 118, -151, -146, -135, -100, 131, -286, 79, 58, -46, 79, -25, -91, -128, 37, -45, 168, 50, 209, 40, -54, -81, 321, -57, -26, 96, -142, 54, -95, -227, 50, 60, -17, -109, -116, -56, -114, 111, 13, -188, 176, 74, -46, -31, -58, 25, -127, 71, -2, -75, -30, -97, -173, -100, -20, 15, 26, 11, -118, -17, 17, 160, 107, -110, 212, -92, 102, -61, -36, 67, 90, -143, -147, -23, -158, 2, -36, 34, -86, -15, -62, 82, 44, 20, 110, 55, 76, -152, -35, -95, 68, -64, -333, -39, -172, 24, 25, 205, 205, -265, -86, 103, -113, 126, -235, -24, 148, 28, -136, -87, -57, 47, 80, 78, -8, 198, -46, 72, 103, -314, 50, -2, -49, 340, 270, -29, 14, 124, -70, -32, -263, -1, -123, -25, 72, 50, -114, -72, 204, 171, 55, 78, -83, 8, -106, -99, 237, -211, -51, 38, -27, 40, -22, -12, 229]
3188B29r2j45J07k98J70J43l84L10r1n3K98r7j59L83k10k25J00kP8pj69O7N8j51
3212a40K68j32q2P8j69K31q9Pj10K80j82j0Q3j91L0n9J46J4k0J31k10J62ol8k05
3237b13J63r4J4K80j38j89J95q5M9K81m29J75K0j56J37LP6l20M13k93J52l6n8
3260e3m7N%J34k61L60l3k78K6O8K45J4j85P6N7k46K31l1j14n8K63l75J40K4q9
3285a27K04k02R0m5J74q3j33J72J30j96J20j42n9P3Q4j4M1k31p2L69N4k98J00
3308Ij03J30J14l11J84J43l35L46j43k32M06k26j05K81j18j33J55k81K44J11l31
3329a95J39J33k33M27j67Q3J4j26j21J38o0j77J01j51L15o6k7k5J92m67K23J88
3351A38k20K42k07J1J30o8K02r3l92L31l2j38J37J48l46K29j31K12N6j88N3m2
$$ y = [229, 137, -8, 99, -199, -29, 114, -270, 40, -51, -104, 194, 97, -62, 321, 111, -114, -14, -16, 62, 55, -114, -47, 11, -140, 128, -4, -86, -8, -177, 54, -35, -28, -138, 142, -40, -50, 33, -158, -128, -187, -41, -27, -47, 84, -126, 36, 30, -8, -213, -50, -144, -130, 150, 12, -177, 18, -67, -18, 263, -166, 9, 29, -127, 10, 13, 89, -231, 182, -111, 41, 5, -53, -100, -95, -95, 39, -222, 138, 105, -173, -147, -79, 166, 180, -5, 71, 128, -118, 113, 82, -32, -90, 173, -202, -62, -38, -127, 77, -125, -35, -80, 94, 11, -122, 50, 180, -16, 104, -38, -97, -24, 60, 46, 87, -144, -216, 153, 207, -91, 9, -94, 36, 150, -161, 23, 166, -169, 177, 34, -198, 208, -18, -123, 158, 40, -93, 62, -219, 25, 136, -195, -56, 77, -156, 271, 104, 187, 201, 75, -46, 92, 32, -145, -44, -195, 120, 54, 27, 2, 194, -273, -50, 138, -82, 160, -47, -36, 94, 26, 228, 135, -257, 74, 42, -96, 41, 189, -157, 72, -59, 153, 209, 21, 74, 32]
3373C2k35J21J97k58K55r9O5o0r8k9L17j77J19M9k01r2N9k9K08o6k37L27j05p7
3397a4P5j23j8R0j35J66k7k43L62o4PJ03l91J08L68l65J67q4k13M62k27j58K82
3420A28k80R6J57k89K10n7j72M94m36J55j9Q6j74L13l60R0J48q2J05rj95M0l8
3443h9J82j3j15k6k2K66j78M4k31J87mj87R7J70k22J16R9m30M51l03K75P2k35
3466i6J80n0k93M53k55l6J30j19R1l4n3J9K43l31L19j20l4l1j2r4K77m5j25J82
3490A66k88j77N92k23j50K02j32K41j17j16J70j95N9n4j71J67J68l35K18ml86
3511c65L76n1K6L13l32Q0J66j70J02Q0m32L04m5j48M59l71k78L97k2o8J14j87
3533e2J20J3l63J96K7r1L07j23j27L69l61j58J29k0mL97l84L36k16k49M34j89
$$ y = [32, -203, -82, 115, -143, 112, 13, 78, 18, -80, -109, 208, 31, 150, 199, -2, -94, -35, -64, 144, 78, -159, 168, 63, -14, 61, -62, -80, 10, -125, 41, 14, -229, 133, 69, 76, 179, -212, -104, 264, -101, 66, -18, -231, 231, 4, -154, 128, -152, -56, 101, -188, 22, -35, -207, 287, -149, 6, -13, 73, -101, 212, -148, -58, 90, 8, 113, 104, -91, -51, -89, 93, 80, -35, -61, -83, 183, 5, 49, -182, 5, 1, -186, -89, 81, -141, -25, 74, -356, 95, -208, 67, 139, -96, 84, 34, -259, 194, -61, -97, 33, -86, 5, -29, -82, -63, 180, -151, 168, 48, 14, -17, -29, -123, 154, 109, -16, 166, -122, -299, 293, 70, -80, 122, -10, 231, 114, -2, 168, -27, 32, -22, -193, -26, 142, -193, 25, 21, -365, 11, -40, -14, 299, -33, 47, 213, 43, 145, 225, -207, 97, 52, -96, 363, -8, -286, 111, 89, 21, 135, -52, 68, 81, -282, -86, -59, -150, 157, 34, -93, 276, -85, -243, -114, -134, -138, 259, -125, 211, -5, -254, 180, -9]
3555ij22K30k04J44k41jL64n9l25K52j05P1K10l01J23K4j36n5L08l90K34n8k38
3578b84M80k81p8L91j40k95M97l38J4N8k07J97J33k76K25M0k04J49kk55M4K2J08
3601bJ55k62J47J5m09L86r6q9J47R5j71K81l19L48p6k86J28j55M7J51o3k29L79
3624A22k30J33L57m76J5n5M8K94j53j34L18k69k88K95N0j67L93m49J86K15m46
3645b41M44k1k54J18j57n9L28r9P2P8l00m2M10n49M86j87j80J04j49O0L31q2o3
3668D8J26k36K58k14j44L02n1p8J86l52m2M86m03J84K3j94K07P8k45P6J5r8L37
3691B69j91j01Kn4M5K61m33K31K07m05M26l32o8L14l32Q9K07m37K70J89j83J17
3713I1J38m10K57j11r5L29k89J8J26k0k64J64J31q5K14m77L37l5J6K3p2j58L77
$$ y = [-9, -131, 99, -105, 39, -202, -203, 161, 102, -223, 29, -76, -5, 205, -96, 27, 51, -85, -140, 168, -222, 12, -46, -284, 196, -85, -163, 228, 88, -207, 290, -48, -34, 24, -183, 14, 147, -129, 96, 136, -68, 81, 79, -176, -132, -110, -2, 153, -109, 38, 53, -356, 30, -66, -155, -8, 87, -84, 197, -122, 226, 150, -136, -8, -163, -116, 35, -28, -257, 122, -108, 25, 382, -94, -79, -134, -86, 208, 55, -79, 239, -30, -318, -23, 27, -140, 253, -196, -10, 205, -241, 203, 182, -72, 46, -111, -170, 158, 59, 131, 209, -91, -133, 277, -272, 214, 27, -153, -49, -198, -138, 193, 111, 48, 174, -62, 196, -18, -162, 140, 89, 11, 197, -155, -197, 289, -114, 70, 93, -101, 106, 184, -61, 15, 30, -68, 269, 78, -23, -21, -75, -30, 231, -202, 29, 236, -169, 257, -75, -143, 171, -161, -72, 135, -302, -32, 157, -26, 91, 229, -181, 76, -35, -130, 199, -90, -72, 54, 34, -230, -66, 65, -20, 194, -283, 54, 19, 35, 58, -14, -172, 205]
3736B05m04K80n3j90M33k18j74J75n4j98N11m99J05L63l96Q6J54k86J74K9k78
3757b35J68j68K84K63n28L06k06j73M06l3k21K33l4k92M11J1l96M24l19l5Q7K0
3779b7M8J40l37K21o8n3K11q1j70L72l53R4K18l92J55K26l38K49j51l42M12j29
3801i5Q3Q7K2j18LO3k27J60j18L83k80J45R2j48j85L33o45M73J0k42J70J17k66
3824a83L62n9k23J64j84N8N81o57K64L7k43K29j62J0J69l22n7L00l80M16l3l61
3846b74L72Ql19M94o4n08M04m7r9K30j77JL05m25J20J16j48j52K32j62L28l09
3868g4k8J61k06K25J09l36K54R2k91L4K31n06M94k96J14M11o95L51K11l22K67
3889B00k6l25L66l86K88J67l26q1L83l75J53O1l99N33j72k34L05J9k44K50k83
$$ y = [205, -199, 81, 28, -162, 271, 53, -121, 54, 0, -198, 313, -186, -81, 282, -114, -28, 126, -160, 14, 43, -235, -67, -235, 49, 312, -216, 90, -116, -289, 117, 84, -137, 96, 62, -230, 181, 192, -204, 220, -99, -134, -47, -27, 21, 161, -176, 45, -23, -76, 135, 54, -116, 256, -97, -3, 215, -177, -22, 204, -134, 115, -36, -378, 34, -95, -12, 75, 97, -21, -18, 45, -182, -22, -140, 243, -37, 108, 200, 52, -133, 200, -445, 28, 38, -204, -34, 83, -183, 179, 120, -103, 61, -123, -65, 516, -141, 123, 160, -83, 146, -16, -6, 163, -159, -216, 84, -296, 120, 87, -274, 98, 106, -213, 281, 217, -291, 113, 66, -33, 197, 20, 21, 326, -99, 21, 137, -11, -163, 69, -93, 235, -74, -102, 59, -147, 78, 187, -149, 105, 197, -94, -60, 171, -335, 159, -137, -23, 388, -307, 44, 255, -67, 200, 174, -151, 215, -171, 117, 284, -42, -123, 260, -115, 38, 99, -300, 233, 61, -173, 132, 151, -93, 157, -126]
3910a26R5J28l25J78K56l97K65j14k03O38m44l9K89l41M5L78l28M0K06m83L38
3931E6k73J74J59k07j8P7k46K68J98m65L85n2k74K63j3l36P14m34k1L21m80J3
3953a91L52m39K36Rm3K62j00l00L02k66pM07m88K42P6r7R2J10l50L45k31n6N6
3976g9j77L84qk22L7L9l51N37l19l1K37j31P1L35k35k39L75m33J60L29m73L60
3998A66j48k74M26k86P8k2J48Q2j20J9k2K27l85K67P7m58L54n1k10J68k60K49
4020B5J51l25j0K56k29K78j88M0J97k76j12L03j42j8J11k12K21j03J0J01K1n61
4042d62N59q0l30N59o01K95K02m54K75L11n45O14k61j84K38j25l2J10j84K2K42
4063A69k84J14J40l49J82Q9l45N42n49J38J87k01J67J24k54K98J23n34K18k9j09
$$ y = [-126, -31, 97, -228, -50, 206, -191, 74, -40, -243, 395, -49, -88, 201, -140, -95, 283, -45, -5, 201, -282, 56, -217, -43, 116, -91, -109, -32, -278, -10, 188, -277, 108, 56, -218, 45, 32, -304, 410, -24, -45, 276, -204, -191, 161, -278, -42, -33, -76, 186, 86, -214, 88, -178, -185, 222, -266, -24, 52, -45, 47, 157, -193, 152, -79, -135, -79, -256, 128, 120, -102, -65, -26, -377, 160, -159, -190, 47, -84, -13, 322, 87, -152, 223, -210, -50, 279, -194, 166, 18, -256, 170, -116, -38, -60, 88, 170, 50, 69, 47, 274, -111, 156, 233, -225, 129, 78, -132, 36, -224, 25, 176, -149, -159, 97, -132, 146, -42, -2, 195, -81, -193, 110, -32, -50, 61, -151, 70, -33, -23, 78, 99, -462, 97, 17, -313, 246, -355, -60, 142, -312, -37, 274, -271, 343, 82, -102, 136, 11, -21, 89, -95, -73, 169, -115, -1, 139, -210, -28, 61, -284, 258, -291, -153, 34, -167, 0, 124, -130, 168, 291, -243, -25, -54, -163]
4084a63L25m6J6Q6n61J97M08n67L35M6l63N28k27pL20j39j78J09k35J51P0m26
4106c21N82k33k74K89n5J0J12k31O3K21n09N38nm67N59l41j30L00j24j48K95l33
4128b02P8J78k95J96K01l93K92J11n75P58n31j4M26l65L4K91l87M09k20j53K57
4149I6J11m95M75k0k14J22k89J49J69l11K79K90o09M88l01P1K28k14J44p5m22
4170c28K82K99m75K50Ll53J68Q3j1L77l78o0L20m51K15L85m98N00l05j45K60K32
4192C70l92J31j28r9J46j50q2N77o36K62R2m49N05m40J20M56l68j76K26p6q8J98
4214an1K09k03j22L38j17M4j28k04J31K12n21K89K79m40M85o7l05M19j71q8K09
4236A97l32J63K68j51k13M77m59K63k75j01L80k60k3K43k71J9J79m44N82k01k28
$$ y = [-163, 162, 116, 132, 218, -343, -146, 262, -305, 30, 76, -287, 241, 14, 7, 327, 188, 10, 119, -116, 35, 105, -321, 261, 28, -246, 43, -12, -2, 110, -121, -58, 163, -346, 192, 187, -280, 279, -62, -192, 108, -16, -164, 131, -202, -124, 54, -241, -45, 156, -237, 55, 166, -409, 349, -182, -196, 230, -135, -101, 190, -197, 212, -8, -161, 96, 207, -288, 187, 167, -47, 75, -214, -65, 104, -207, 72, 362, -247, 241, -60, 11, 239, 25, 169, 94, -328, -46, 253, -222, 28, 31, -322, -154, -71, -82, 295, -83, -143, 177, -274, -59, 326, -172, 328, 23, -122, 138, 370, -22, 109, -19, -118, 28, -122, -204, 373, -263, -1, 91, -358, 147, -293, -173, 283, -85, -261, -35, -111, -199, -1, -52, 157, -46, -168, 170, 53, 97, -31, -235, -104, 108, -413, -124, 155, -285, 200, 133, -172, 247, 76, -12, 197, -135, 28, 296, 145, -68, 409, -50, 213, -62, -163, 217, -43, -66, 177, -94, -75, 104, -340, 242, 41, -187]
4257a87L40k58J12K78l74n4L99m40j03N20m51J27N0k16J74K39m05K48j14p8M45
4278B52m32J44L66l95L84k94l02L44j80J68j12j62R9K10j19k55O87l58m3k40J7
4299b21J45J03j43K98k57J92L6k50J84K3k07P2J12k94M15l73k74O60l00j1M04
4320C14l38K5O7q0R9r0j59M03j64l03O15n86M3K99l70L00M7m01L77N5m44M08j10
4343Go3J81k89K03J78l15K47k4m98N21j22k49M82m44j6M23m52J45L61l46R4Q0
4365A04j80J20m2j66O39n43K0L63m01K92o9l87K48p0mK69o8r4K52o35N6M57j69
4388hJ52j2k63M3K88l21M38n20M00j99j22J1L25m01J64j6NJ02N7k93L07k45Q9
4411a9M9k9J63j33j6j42K09k33K81q2j03j00L4j52M52n12K85K59k26k6J10j89
$$ y = [-187, 153, -105, 7, 285, -89, -143, 256, -184, -287, 233, -218, -91, -41, -257, -83, 156, -249, -1, -115, -193, 252, -180, -36, 330, -65, 319, 25, -277, 67, -113, 55, -57, -219, -120, 90, -29, -284, 403, 45, 2, -238, -221, -76, 27, -116, 182, -75, 117, 153, -97, 87, 110, -97, -25, 87, -207, 208, -165, -439, 221, -79, -90, 314, -24, 1, 68, -12, 87, -3, -162, 241, 77, -226, 389, -197, -154, 145, -225, 75, 122, -279, 98, 153, -291, 117, 7, -56, 125, -164, 39, 217, -98, 149, 125, -373, 148, 26, -223, 259, -185, -201, 222, -230, -85, 276, -70, 24, 104, -76, 44, 2, -164, 475, -68, -48, 315, -86, 206, 137, -250, -2, -72, -76, 193, 125, 31, 283, -352, -296, 161, -8, 144, 132, -131, -88, 200, -121, 317, -203, 197, -2, -124, -113, 212, -189, -25, -41, -36, 66, 123, -170, 137, -108, -19, 30, 1, 164, 31, 15, -127, 82, -151, 130, 48, -55, -155, -121, -273, 179, -333, -48, 211, -15, -41, 69, -120]
4433a20K71K02o62N04k33Q7j39r3J48J57m54L48L1k14N17n42k42O28k87M7J80
4454A34l19L27L7j57j16K61k88K28k49k8L24k78p4L44l13R3M3n2R2k6j65J69n8
4477g1j49M12k90R7J39l62M9M20l33L08N3m50L48q8l04M49j45j30K61k19J43j03
4499C5l9n7J28k75M42m13Q0K89j13k89L13k41J32K45l95N8J21j2Qj99N2K92k87
4522a25K54N3o8k19K19l14K43J92k76L16k84j60K65k44J79J90m12L30m9k28K24
4543H6l5k30K36j48K21r5k78M46j45l50K53J79l95N51j28n46O23m52J41K65j61
4564C8j49M21l97R3J53k76L59m54J88J9j60K53l5k50J27K38m36L09N4l8K4q3j63
4587a65K73k34N1J53k09J38L4k87N12k38j42L88j80j42O1q7j33K60k53K14R0k71
$$ y = [-120, 151, 353, -309, 195, -38, 49, -90, -183, -35, 122, -332, 16, 47, -167, 350, -192, -434, 194, -93, -46, 134, -185, 142, 179, 22, -94, 167, -121, 107, -142, -170, 154, -124, -198, 146, -167, -74, -31, -83, 9, -17, -182, -13, -71, -220, 192, -98, -1, 138, -224, -175, 245, -88, 220, 273, -177, 171, 83, -221, 228, 83, -47, 214, -5, 138, 35, -4, -61, 67, -208, 234, -179, -99, 190, 77, -212, 101, -140, -8, 237, -158, -100, 21, 9, 17, -182, -130, 162, -125, 129, 182, 114, -105, 114, -200, 43, 235, -41, 275, -9, -169, 96, -148, 31, 221, -191, 139, 90, -138, 86, 51, -179, 57, -91, 130, 35, -243, 203, 58, -292, -39, 140, -255, 296, 168, -378, 245, -207, -66, 199, 38, -111, 310, -87, 6, 159, -117, 242, -212, -24, -5, -165, 88, 53, -197, -70, 168, -268, 41, 95, 57, 81, -2, -165, 108, -126, -75, 78, -131, 7, 41, -246, 266, 28, -114, 274, 94, -48, 13, -74, -207, 53, -200, 14, 104, -167]
4609a67L7Q6N8N0j31K8L07l13L0K03j29J46J3m42K46k01N8J47Ll24O77m63J17
4632C6J28m36M39j33j72J85J35k95J78o1k48L96k79q8N53n29M9K56k39J75J21
4653A71k88K66k0k42L47k66j69L98k17K08k15j73K78o0j83L34k77q3L46m43J54
4674a34L62l29P2R7j30J96M9k70J68j10j24L05j58O2L43m19QN7k04K99rl84M44
4697A91j28k74N63l66j7K13n28N20l1l51N07k88r5Q8r8j9L71m64l3L66r4qmj07
4721h6K96j74j18K70l38J33J37j72Lj01k34M96r2j21J21J08m26K90m2M0J49k78
4743a39m2K62k01M06k50l5j17R6j7L06k49M3Q2p15Q06j15j68K10m4l94K75K8j73
4766a45O0p6L08N1l21K06j24j66L19M7k54J45k11k98N64l11K82J8l87K81J13m36
$$ y = [-167, -130, -44, 14, 64, -67, -39, 268, -45, -15, 188, 59, 205, 218, -224, 22, -179, -121, 26, 29, -295, 382, -81, 36, 164, -272, 167, 34, -138, 47, 182, -113, 65, 4, -244, 152, -127, -215, 338, -191, -142, 114, -125, 50, 171, -117, 149, 129, -113, 234, -32, -201, 197, -20, 188, -27, -200, 78, 18, -165, 169, -108, -191, 155, -288, -134, 228, -101, -29, 68, -62, 134, 183, -87, 81, -29, -153, 152, -6, 56, 399, -20, -12, 45, -159, 140, 131, -253, 191, 63, -211, 352, -14, -31, 182, -346, 174, 143, -208, 299, 11, -84, 4, -94, -113, 258, -206, -239, 127, 33, 25, 21, -86, 210, 36, -82, 188, -150, -17, 120, -52, -49, -150, -384, 112, 20, -101, 20, 128, -298, -8, -50, -10, 139, -139, -181, 81, -120, 286, 36, 1, -116, -20, -37, 269, 20, 63, 145, -570, 236, 121, -47, 163, 119, -275, 0, 28, -145, -85, -161, 147, 198, -123, 83, -41, -207, 112, 159, -95, 50, -161, -459, 105, -206, 76, 94, -293, -12, 101, -335]
4788c35M74k60j03L41j79N2k7k19L5M91n65M31Kl18L07K7k22K26q7r2M14m33j38
4811a78K61k79R0N4j34M72j04l99M04m2k18K4l1K8k7J47k0o7j85K90j83O8L61
4834C32n45N9J39p1J68N3j69P9r9p8K54j80p5K19j91k8J88k04K02k2l63M02j16
4857d6j32M15j90l09L08r7J2R1j72R1K15l97J36L7k02N40k59k63K48j0q2K41n78
4880d03O03j70N1r1q4L1J24j07r4L02k80K07J56k83J21j69k9K25K4m20L09M1k19
4903a55M33l67Q0O4k61K61O7j97J92j04N7J72o52N18o2r8K79J36l78k19K79k68
4925b23L60j30k23K78j8k11K08j37n9J34l9j9K44l66L01j24j89M36k74J7J22j78
4947i0J07M1p6r8K16p8J38q1l03J65j84K9L83n59K40J75M2K62k25k00J67j98m
$$ y = [-335, 139, -121, -224, 117, -62, -10, -37, -256, -221, 270, -295, 136, 138, -180, 127, 154, -68, 158, 71, -21, 393, -40, -178, 83, -196, -106, -52, -186, 286, 182, -217, 187, 145, -73, -49, -80, -52, -79, 68, 48, -19, -204, 86, -97, -29, 332, -213, -154, -15, -86, 82, 135, -34, 45, -54, -132, 122, -58, -133, 86, -105, -133, 55, -149, 53, 31, -332, 70, -46, -178, 237, 47, -262, 46, -51, -39, 52, -120, -29, 186, -211, -75, -38, -240, 300, 41, -222, 26, 16, -66, 175, -403, 200, 30, 81, -10, -94, -63, 61, -46, -140, 162, -118, 89, 245, -38, 83, -86, -115, 110, 134, -286, 23, 64, -155, 278, -89, -9, 55, -206, 55, 122, -75, 117, 13, 70, 242, -410, 108, 46, -52, 227, 363, -15, -234, 45, -223, 137, 7, -216, 62, 44, -167, 41, -96, -155, -21, -60, -79, 165, -201, 100, -24, -213, 223, -51, -34, 88, -90, 17, 58, -18, -116, 100, 22, 160, 79, -224, -59, -243, -214, 169, -390, -150, 25, 67, 329, 104, -96, 71, -127, -131]
4970a31J96n4Q4j5k35J43J98m11L67j72N7K1pk18L74k58j63M15m27J69O2%K5K18
4994B38m84K52P5l73O41l35m7R7q6J57J06l86K05k01j61L44l06PL12l8n2N1j42
5017a26K11M2l06L26j03J1K82n24j34K63k1O5L09n40K26K40k38N2j4k96M01r5
5039C1k52L85k02J54K68o52J96O0j50L48o5l27L71q1l32K77k02Q2L42l74J30O2
5061F9k14L30k07j20L32m49K92K91l61N7Q5k52J91l2j81M82j66k45J29M0k49K44
5083F6k18J90K10m26K73l1k49N0J95j57K60k80K5L80l83L6L04m89L03Q7j05J46
5105A87j24k48J70j10J44J15l06R6R4j44J45j28J52N8j72N1K88l36J56M5k83L10
5127A60j88J20p9J70j29p1j35j65N27l06nJ48k57K96N6k61K79J00j33J45l50o1
$$ y = [-131, 65, 11, 95, 80, -155, -12, 186, -225, 142, -30, 27, 48, 41, -177, 197, -61, -224, 191, -236, -67, -5, -5, 20, 238, -246, 6, 81, -292, 349, 14, -33, 64, -22, 135, 241, -145, 60, -141, -302, 42, -264, -257, 55, 17, -35, 16, -126, 85, 127, -179, 147, 44, 55, 337, -187, -321, -58, -79, -14, 295, -245, -19, 221, -17, 35, 21, -275, 126, 31, -221, 164, -38, 116, 384, -268, -72, -12, -162, 186, 121, -206, 165, 84, -248, 29, -173, -91, 251, -123, 7, 69, -145, 185, -22, -142, 190, -259, 33, 324, -37, 20, 105, -147, 44, 12, -169, 313, 147, -98, 31, 71, -178, 66, -152, 38, 248, -178, 95, 64, -185, -135, 60, -97, 163, -117, -92, 288, -95, -59, 245, -244, 59, 146, 41, 187, 63, -185, -15, -125, 19, 134, -172, -76, 18, -126, 19, -109, 43, 101, -71, -20, 268, -68, 88, 133, -150, 160, -28, 92, 13, 183, 54, -17, -152, -317, 210, -96, -101, 47, -210, 86, 142, -119, 160, 260, 127, 272, -78, -139]
5149a39M75o70L96N6k98J95m1k92M54p5j38L46k75j80R3%j2K86j6k59K83m38J92
5172e7J08q4K92J2k88P1j3j21K98m06K95r5n8K26k28q0J79j01k81M45j22j62K3
5195a47k96O76l37j97M81k28J10J05m08J36J83j96J70J41l68K81j16k12L89k91
5215a24J44K05j99q9M24l82K15o1l31M64j00m03L89m32L22J82m86R7J66k08L58
5236A51K2m06M85k53j25L21om03K42j28K54j05r8Q3J17j84m8j47K61j8Lk66L73
5259A25j61J38M3m26L65nj27k6L21l56L77m98L63J48n28K68%Q6P4j45o3J20m6
5282D7m15N40l08J61K38l92L1K43k90J12Nk7Q9o6J22nk62J22J87m09O08j96j76
5305d1J49j17k38L41L6k22K00m11R4L71l58J60J63j72J33j67R0L72m93L3K32l03
$$ y = [-139, 336, -334, 62, 118, -180, 15, -26, -318, 136, 61, -77, 269, -6, -186, -93, -93, -105, 181, 165, -94, 189, -249, -57, 51, -33, 259, 271, -17, 54, 41, -80, 218, -188, 107, 12, -46, 180, -48, -128, 51, -50, -331, 114, -8, -170, -147, -443, 233, -104, -301, 180, -48, 62, 167, -241, -105, 78, -118, 52, 193, -175, 106, -10, -222, 167, -124, 20, 225, 26, -63, 361, -21, 194, 133, -198, 266, 166, -237, 152, -280, 42, 224, -262, -165, 1, -207, 151, 173, -233, 252, -1, -126, 195, 189, -214, 28, -100, 154, 49, -49, 34, 151, -33, -81, -228, 33, 15, 18, -248, 125, -36, 102, 145, -281, 84, 79, -48, -74, 247, -109, 268, -230, 133, 281, -247, 21, 21, 107, 181, 36, -27, 93, 47, -368, 172, -136, 25, 263, -129, -98, 145, -145, -33, -28, -55, 34, -32, 90, 85, -177, -55, 132, -277, 331, 135, -41, 108, -9, -247, 94, 130, -92, 108, -303, -209, 162, -196, -36, 127, -45, 88, -79, 11, 383, -110, -77, 155, -148]
5327a48%J68P7j70P6j84L49k84q0J89J25j45J77k84n8M67l02K4K28m13K05J04
5349A21k31L99l64J61Ml40J98K13m05M12m31K99L1j53j07J35r4J95o9J1j18M20
5371B87m26j7M13k94L95K0m95J07J5m9L1l23M20J13l59K92r6j64M88k92j22m7
5393a03N9q1K31k92K07q0j04L58n6j90J82j04Pj11jk1K61l66L18o1j93L24l03
5416a19J88pk71K45J3o3n5K56k06j25K41k43K05j29j62J79K2NK41l71K06J85m28
5439a93K16K77j80ro9k34K91N7j93P6p8K64j6l41K07L1q3K99j72j47K26l38J11
5462BJ54l02K57j70k49M95j88q1R2N1j75J45j94J95J74l70K23J82l64K01L6j11
5484CR4k63n9L91j04j41K79k04m0n6j02K64rm16L61l5j04M81m95K83J9j90K03
$$ y = [-148, -148, 20, 97, -73, 3, -181, 168, -116, -196, -7, 118, -27, 150, -134, -192, 275, -27, -3, 225, -188, 17, 121, -110, 289, -75, 86, 90, -250, -52, 161, -244, 168, -263, 36, 67, -86, -193, -58, -152, 43, -26, -15, -133, 287, -139, -156, 257, -37, 358, 378, -117, -10, 5, -44, -13, -336, 84, 197, -162, 130, 34, -130, 358, 66, -56, -103, -44, -125, 106, -186, 21, -59, -163, 195, 139, -51, 131, 27, 34, -77, -78, -99, 162, -204, 114, 53, -140, 184, -119, 69, 62, -209, 36, 49, -14, -69, 187, -19, -144, 97, -146, 59, -70, -232, -53, -31, -26, 215, -156, 50, 235, -193, 23, 300, 120, 111, 42, -192, 99, 156, -37, 39, -39, 225, 209, -132, 75, 106, 23, 322, 150, 3, 229, -109, 2, 156, -146, 111, -59, -308, 187, -1, -82, 10, 61, -114, 31, -163, 32, 206, -164, 59, 241, -123, 78, 114, 3, 97, -166, -225, 166, 62, -79, 200, -4, -44, -100, -202, 62, 53, -363, -2, -37, -141, 340, -155, 128, 147, -43, 160]
5507A60j77K2J12q3j26L44m70L17K34n85K52J16l42L85J52m42L24j20j55J05o9
5528d6P7N2rk3K14n25K62J52k01P3K8k3P2K4k46K83k44mL97l89R3j37j03N33l51
5553d1R8Pp6K2L1k53J18J29j03J06Kk61M83l84r5J03OMJ17J6q1J39k74QL37k86
5579a28J10Q7j10R3kj23K3k5K25p7k13L8J36k46K13J37l33J19J0J86J46k49N3
5602G0Ql9J1l8j12K15j7k86J94r8M6K75m44K95L0k70Q6m0J24K83m47mL87m04J79
$$ y = [160, -17, 5, 117, 34, -92, 252, -218, 99, 333, -252, 0, 116, -226, 159, 311, -131, 193, 73, -82, 23, -46, 31, 83, 74, 51, 265, -260, 2, 154, -47, 26, 54, 31, 103, 127, -119, 164, -80, -84, 313, -76, 17, -120, -223, 310, -41, 57, 64, -12, 10, 41, -212, -94, 35, -68, 38, 40, -221, 262, -122, -217, -114, -108, -104, 13, 29, -52, 87, -187, -179, 158, -128, -18, 69, -41, 52, 50, -73, -50, -75, 150, 73, -140, -102, 34, -212, 1, 138, -195, -76, -66, 120, 266, 17, 70, 78, 39, 50, 12, -100, 115, 98, -188, 6, -92, -46, 229, -215, 80, 110, -160, -74, -114, 10, 293, -154, -158, 229, -175, 4]
$$ [...]
8191a9
##END NTUPLES=NMR FID
##END=
