##TITLE=1H_DE-80H_X3
 200.13MHz, d2o
 8 sc
 
 19ns.26.2.2025
##JCAMPDX= 6.0         $$ Bruker NMR JCAMP-DX V2.0
##DATA TYPE= NMR FID
##DATA CLASS= NTUPLES
##ORIGIN= UXNMR, Bruker Analytische Messtechnik GmbH
##OWNER= pz
$$ XWIN-NMR		Version 3.5
$$ Mon Apr 21 14:42:07 2025 Russian Standard Time (UT+4h)  Yarkov@DPX200
##.OBSERVE FREQUENCY= 200.1313
##.OBSERVE NUCLEUS= ^1H
##.DELAY= (6, 6)
##.ACQUISITION MODE= SIMULTANEOUS
##.ACQUISITION SCHEME= undefined
##.AVERAGES= 8
##.DIGITISER RES= 18
##SPECTROMETER/DATA SYSTEM= spect
##.PULSE SEQUENCE= zg30
##.SOLVENT NAME= DMSO
##.SHIFT REFERENCE= (INTERNAL, DMSO, 0, 14.3821)
##AUDIT TRAIL= $$ (NUMBER, WHEN, WHO, WHERE, WHAT)
$$ ##TITLE= Audit trail, XWIN-NMR		Version 3.5
$$ ##JCAMPDX= 5.01
$$ ##ORIGIN= Bruker BioSpin GmbH
$$ ##OWNER= Yarkov
$$ C:/Bruker/XWIN-NMR/data/yarkov2/nmr/H-C/1/audita.txt
$$ ##AUDIT TRAIL=  $$ (NUMBER, WHEN, WHO, WHERE, WHAT)
(   1,<2025-04-21 14:39:42.78 +0400>,<Yarkov>,<DPX200>,
      <created by zg, POWCHK disabled, PULCHK disabled
       configuration hash MD5:
       00 E9 B6 7A A2 85 ED C7 34 08 36 98 17 FE 4E 26
       data hash MD5: 16K
       B1 1A AC 67 78 6A CD EC 17 B8 94 DF 71 EB 92 26>)
$$ ##END=
$$ 
$$ hash MD5
$$ 3A 1B 11 06 65 02 52 75 E5 9A 9B 23 40 85 8A B2
##$RELAX= 
##$RELAX= 
##$RELAX= 
##$RELAX= 
##$RELAX= 
##$RELAX= 
$$ Bruker specific parameters
$$ --------------------------
##$DU= <C:/Bruker/XWIN-NMR>
##$EXPNO= 1
##$NAME= <H-C>
##$PROCNO= 1
##$TYPE= <nmr>
##$USER= <yarkov2>
##$AMP= (0..31)
100 100 100 100 100 100 100 100 100 100 100 100 100 100 100 100 100 100 
100 100 100 100 100 100 100 100 100 100 100 100 100 100 
##$AQSEQ= 0
##$AQ_mod= 1
##$AUNM= <au_zg>
##$AUTOPOS= <>
##$BF1= 200.13
##$BF2= 200.13
##$BF3= 200.13
##$BF4= 200.13
##$BF5= 200.13
##$BF6= 200.13
##$BF7= 200.13
##$BF8= 200.13
##$BYTORDA= 1
##$CFDGTYP= 0
##$CFRGTYP= 5
##$CHEMSTR= <none>
##$CNST= (0..31)
1 1 145 1 1 1 1 1 1 1 1 1 1 1 1 1 1 1 1 1 1 1 1 1 1 1 1 1 1 1 1 1 
##$CPDPRG= <>
##$CPDPRG1= <>
##$CPDPRG2= <>
##$CPDPRG3= <>
##$CPDPRG4= <mlev>
##$CPDPRG5= <mlev>
##$CPDPRG6= <mlev>
##$CPDPRG7= <mlev>
##$CPDPRG8= <mlev>
##$CPDPRGB= <>
##$CPDPRGT= <>
##$D= (0..31)
0 0.7 0 0 0 0 0 0 0 0 0 0.03 0 0 0 0 0 0 0 0 0 0 0 0 0 0 0 0 0 0 0 0 
##$DATE= 1745231982
##$DBL= (0..7)
120 120 120 120 120 120 120 120 
##$DBP= (0..7)
150 150 150 150 150 150 150 150 
##$DBP07= 0
##$DBPNAM0= <>
##$DBPNAM1= <>
##$DBPNAM2= <>
##$DBPNAM3= <>
##$DBPNAM4= <>
##$DBPNAM5= <>
##$DBPNAM6= <>
##$DBPNAM7= <>
##$DBPOAL= (0..7)
0.5 0.5 0.5 0.5 0.5 0.5 0.5 0.5 
##$DBPOFFS= (0..7)
0 0 0 0 0 0 0 0 
##$DE= 6
##$DECBNUC= <off>
##$DECIM= 32
##$DECNUC= <off>
##$DECSTAT= 4
##$DIGMOD= 1
##$DIGTYP= 9
##$DL= (0..7)
0 120 120 120 120 120 120 120 
##$DP= (0..7)
150 150 150 150 150 150 150 150 
##$DP07= 0
##$DPNAME0= <>
##$DPNAME1= <>
##$DPNAME2= <>
##$DPNAME3= <>
##$DPNAME4= <>
##$DPNAME5= <>
##$DPNAME6= <>
##$DPNAME7= <>
##$DPOAL= (0..7)
0.5 0.5 0.5 0.5 0.5 0.5 0.5 0.5 
##$DPOFFS= (0..7)
0 0 0 0 0 0 0 0 
##$DQDMODE= 0
##$DR= 18
##$DS= 0
$$ [...]
##$SUBNAM2= <"">
##$SUBNAM3= <"">
##$SUBNAM4= <"">
##$SUBNAM5= <"">
##$SUBNAM6= <"">
##$SUBNAM7= <"">
##$SUBNAM8= <"">
##$SUBNAM9= <"">
##$SW= 18.0517328524113
##$SWIBOX= (0..15)
0 0 2 0 0 0 0 0 0 0 0 0 0 0 0 0 
##$SW_h= 3612.71676300578
##$TD= 16384
##$TD0= 1
##$TE= 0
##$TE2= 300
##$TE3= 300
##$TEG= 300
##$TL= (0..7)
0 120 120 120 120 120 120 120 
##$TP= (0..7)
150 150 150 150 150 150 150 150 
##$TP07= 0
##$TPNAME0= <>
##$TPNAME1= <>
##$TPNAME2= <>
##$TPNAME3= <>
##$TPNAME4= <>
##$TPNAME5= <>
##$TPNAME6= <>
##$TPNAME7= <>
##$TPOAL= (0..7)
0.5 0.5 0.5 0.5 0.5 0.5 0.5 0.5 
##$TPOFFS= (0..7)
0 0 0 0 0 0 0 0 
##$TUNHIN= 0
##$TUNHOUT= 0
##$TUNXOUT= 0
##$USERA1= <user>
##$USERA2= <user>
##$USERA3= <user>
##$USERA4= <user>
##$USERA5= <user>
##$V9= 5
##$VALIST= <valist>
##$VCLIST= <CCCCCCCCCCCCCCC>
##$VD= 0
##$VDLIST= <DDDDDDDDDDDDDDD>
##$VPLIST= <PPPPPPPPPPPPPPP>
##$VTLIST= <TTTTTTTTTTTTTTT>
##$WBST= 1024
##$WBSW= 4
##$XGAIN= (0..3)
0 0 0 0 
##$XL= 0
##$YL= 0
##$YMAX_a= 58406
##$YMIN_a= -29615
##$ZGOPTNS= <>
##$ZL1= 120
##$ZL2= 120
##$ZL3= 120
##$ZL4= 120
##$ABSF1= 10
##$ABSF2= 0
##$ABSG= 5
##$ABSL= 3
##$ALPHA= 0
##$AQORDER= 0
##$ASSFAC= 0
##$ASSFACI= 0
##$ASSFACX= 0
##$ASSWID= 0
##$AUNMP= <proc_1d>
##$AZFE= 0.1
##$AZFW= 0.1
##$BCFW= 1
##$BC_mod= 2
##$BYTORDP= 1
##$COROFFS= 0
##$CY= 83.5205535888672
##$DATMOD= 1
##$DC= 2
##$DFILT= <>
##$DTYPP= 0
##$F1P= 10.8118882576601
##$F2P= -7.23987719738617
##$FCOR= 0.5
##$FTSIZE= 0
##$FT_mod= 4
##$GAMMA= 1
##$GB= 0.15
##$INTBC= 1
##$INTSCL= 1
##$ISEN= 128
##$LB= 0.25
##$LEV0= 0
##$LPBIN= 0
##$MAXI= 10000
##$MC2= 0
##$MEAN= 0
##$ME_mod= 0
##$MI= 1.114404
##$NCOEF= 0
##$NC_proc= 0
##$NLEV= 6
##$NOISF1= 3.799351
##$NOISF2= 2.8
##$NSP= 1
##$NTH_PI= 0
##$NZP= 0
##$OFFSET= 14.38212
##$PC= 1
##$PHC0= -984.6477
##$PHC1= 1.133718
##$PH_mod= 1
##$PKNL= yes
##$PPARMOD= 0
##$PSCAL= 0
##$PSIGN= 0
##$REVERSE= no
##$SF= 200.129724274929
##$SI= 16384
##$SIGF1= 3
##$SIGF2= 2
##$SINO= 400
##$SIOLD= 16384
##$SREGLST= <1H.CDCl3>
##$SSB= 0
##$STSI= 0
##$STSR= 0
##$SW_p= 3205.1282051282
##$SYMM= 0
##$S_DEV= 0
##$TDeff= 0
##$TDoff= 0
##$TI= <>
##$TILT= no
##$TM1= 0
##$TM2= 0
##$TOPLEV= 0
##$USERP1= <user>
##$USERP2= <user>
##$USERP3= <user>
##$USERP4= <user>
##$USERP5= <user>
##$WDW= 1
##$XDIM= 8192
##$YMAX_p= 0
##$YMIN_p= 0
$$ End of Bruker specific parameters
$$ ---------------------------------
##NTUPLES= NMR FID
##VAR_NAME=  TIME,          FID/REAL,        FID/IMAG
##SYMBOL=    X,             R,               I
##VAR_TYPE=  INDEPENDENT,   DEPENDENT,       DEPENDENT
##VAR_FORM=  AFFN,          ASDF,            ASDF
##VAR_DIM=   8192,          8192,            8192
##UNITS=     SECONDS,       ARBITRARY UNITS, ARBITRARY UNITS
##FACTOR=    0.0002768,     1,               1
##FIRST=     0,             0,               0
##LAST=      2.2672688,     0,               0
##MIN=       0,             -29615,          0
##MAX=       2.2672688,     58406,           0
$$ Real data points
##PAGE= N=1
##DATA TABLE= (X++(R..R)), XYDATA
0 0 0 0 0 0 0 0 0 0 0 0 0 0 0 0 0 0 0 0 0 0 0 0 0 0 0 0 0 0 0 0 5 -6 8 -8 8 -8 8 -8 10 -13 15 -15 16 -20 21 -23 27 -29
48 -29 30 -35 37 -43 46 -51 57 -61 68 -74 82 -93 103 -116 130 -148 168 -189 216 -226 120 1724 29277
71 29277 12328 -14394 206 4148 -7604 -7130 -10102 -17955 4745 22337 -3864 -17074 13817
84 13817 20651 -8585 -13413 3617 6285 8168 10273 -3822 -6303 12341 3756 -26728 -19314 10743
98 10743 7709 -5970 2711 10161 6329 6179 -3931 -18916 -4900 15413 965 -13394 7296
111 7296 20200 2496 -7589 -2436 -2151 1980 7466 -5066 -10386 9042 9636 -17870 -21919 -2101
125 -2101 -215 -7907 -1001 5735 8687 16775 10969 -8368 -4403 12193 1916 -12905 -687 11441
139 11441 3872 -2318 -3327 -7514 -3426 3857 -4826 -9650 7950 16169 -182 -6733 2604 2455 -3981
154 -3981 -2758 -1785 195 9793 8990 -5919 -7458 3170 -2872 -15729 -9730 1202 1313 1328 2464
169 2464 -1290 874 6404 -589 -7629 3471 13256 4728 -806 4780 4271 -1754 -3151 -5081 -5471
184 -5471 3416 7034 -1454 -2318 6314 3040 -7879 -7598 -1639 -1168 39 1919 -109 1548 5656 -668
200 -668 -8477 -3418 3246 -289 -2944 1947 4013 1424 -798 -3781 -5191 275 3482 -727 -205 7219
216 7219 7291 -491 -3103 -1291 -1238 -1727 -1410 -1446 1836 5896 2544 -3870 -1918 2147 -419 -3257 -349
233 -349 3192 3548 1637 -2168 -4341 -2285 -1524 -5402 -5352 1357 4883 1753 -13 1482 2337 1665 -178
250 -178 -1260 1693 5170 3317 -1708 -2203 -167 -2393 -6186 -5878 -1909 1421 2304 879 941 3490 3888
267 3888 -77 -2268 929 3812 2170 -494 -511 561 -329 -3396 -5438 -3427 669 1498 -316 514
283 514 3613 3679 248 -2091 -708 1713 1571 -368 -839 1023 1416 -1939 -5103 -3994 -1126 -358 -1321
300 -1321 -375 2958 4499 2844 281 182 2063 1991 -519 -1509 297 1142 -1277 -4146 -3897 -1648 -572
317 -572 -1195 -416 2741 5362 4212 1309 659 1650 799 -1703 -3094 -1635 86 -846 -2844 -3024 -908
334 -908 72 -1071 -1229 1189 3419 2897 1044 282 924 1262 -656 -2334 -881 1589 1288 -607 -861
351 -861 352 79 -1205 -2207 -1780 532 1600 190 -554 1104 2200 111 -1287 -440 839 748 -27
368 -27 -1026 -705 652 177 -2123 -1582 1276 1731 401 574 1476 1330 482 -914 -2356 -1568 406 -842
386 -842 -2156 19 2100 723 -132 690 1009 1059 1197 16 -1083 338 846 -2183 -2987 -579 -11 -1327
404 -1327 -404 629 354 1372 1576 -851 -1081 1367 769 -1648 -302 1981 726 88 1267 350 -112
421 -112 1652 611 -1910 -550 1337 -1195 -2667 -581 -289 -1695 -291 671 -677 777 2631 384
437 384 -964 1666 1344 -1459 -948 597 -1143 -1296 533 -905 -2222 540 990 -2000 -757 2039
453 2039 347 -723 1662 1256 -217 1843 2503 -389 104 2777 641 -1954 185 474 -2403 -1238
469 -1238 44 -2338 -1901 1373 96 -2056 1067 2510 -688 -468 1783 -302 -1562 811 -361 -2989
485 -2989 -79 1731 -1592 -1643 2035 989 -886 1273 1547 -910 726 2458 -1136 -1647 1948 933
501 933 -2349 -19 2006 -385 -40 2025 -134 -923 2280 1057 -2951 -580 1920 -1462 -2740 294
517 294 -511 -2211 -149 -119 -2812 -501 2587 -807 -1917 2463 2453 -899 292 1998 -260 250 2358
534 2358 -528 -1881 1741 1528 -2745 -1409 1859 -68 -1182 1376 716 -473 1993 1765 -1952 -510
550 -510 2624 -262 -2754 158 814 -1729 -1031 -40 -2276 -1250 1589 -789 -2382 1474 2432 -1387
566 -1387 -1059 1430 123 -760 1094 117 -1060 1933 2350 -1454 -760 2666 876 -1489 594 1297 -370
583 -370 549 1067 -1625 -1103 1690 -407 -3028 13 1677 -917 -796 1013 -425 -844 1025 -263 -2085
600 -2085 761 2032 -1379 -1654 944 254 -1646 -154 309 -847 805 1829 -580 -489 2310 1062
616 1062 -1397 223 1611 -101 -32 1132 -260 -587 1113 -51 -2249 -265 1520 -589 -1198 915
632 915 305 -1006 16 -47 -1399 -41 1412 -739 -1234 1100 883 -1217 -493 501 -605 -289 910
649 910 -2 -539 1320 849 -1265 -384 1043 -201 -758 658 504 -421 486 370 -1031 -227 1127 6
667 6 -625 1036 1012 -323 -27 354 -678 -392 437 -282 -720 602 742 -537 -442 508 -182 -641 258 186
687 186 -264 332 463 -702 -513 154 -465 -807 -21 461 -29 159 415 -264 -288 255 -107 -516 424 724
707 724 18 300 664 177 -61 270 50 -166 398 538 -79 -140 390 -131 -601 -190 -85 -326 -36 180 -173
728 -173 -278 25 -494 -663 -318 39 -190 -64 347 169 101 85 94 -140 62 379 257 148 514 161 -66 88
750 88 122 -17 234 370 160 134 196 26 -360 -196 -201 -325 -59 162 -41 49 34 2 -297 -253 -198 -176 -124 120 -45
775 -45 -164 -42 -119 -186 -153 -14 166 103 298 259 138 90 45 -102 -59 -37 115 53 249 201 24 -45 -58 -81 -61 157
801 157 63 133 220 199 41 -18 84 -152 -59 125 131 -38 31 52 -262 -403 -151 -262 -253 -62 45 -230 -67 -50 -137
826 -137 -214 33 -19 -55 100 238 -30 84 200 21 -104 209 229 26 295 487 237 50 262 159 -46 62
848 62 89 -218 102 332 -185 -464 -118 -192 -449 -281 -161 -312 -188 168 -240 -483 6 -81 -406 -47 350 -2
870 -2 -9 247 193 -217 357 261 -277 170 545 197 -141 358 153 -232 179 335 -183 56 324 -9 -490 130
892 130 419 -474 -292 136 -122 -292 398 -155 -525 115 255 -608 -310 512 21 -308 231 232 -242 206 507
913 507 -373 -79 778 170 -577 112 470 -380 -241 136 -202 -349 503 -44 -612 399 701 -535 -426 566
933 566 83 -413 434 289 -433 397 650 -626 -534 691 212 -702 75 416 -299 -110 320 -333 -616 736
953 736 117 -1012 156 749 -483 -435 470 20 -374 350 100 -642 176 845 -541 -812 622 295 -828
972 -828 113 568 -220 161 728 -366 -377 975 546 -761 -29 1003 -215 -486 368 -230 -528 443 52
991 52 -997 -105 856 -501 -931 501 462 -530 22 478 -475 12 783 -381 -813 713 542 -800 -232
1010 -232 610 -72 -417 541 -15 -420 714 578 -869 -104 991 -251 -791 377 213 -559 87 346
1028 346 -645 -124 851 -181 -834 567 729 -754 -319 327 -302 -337 482 -279 -834 367 666 -775 -357
1047 -357 768 169 -500 365 335 -422 249 461 -620 -321 825 -124 -817 128 566 -476 -134 450 -168
1066 -168 -104 751 153 -573 485 756 -449 -259 500 77 -553 310 14 -612 109 362 -538 -429 763
1085 763 135 -585 14 489 -344 -55 375 -401 -420 493 145 -619 74 656 -232 -194 422 156 -392 370 377
1106 377 -343 120 600 -213 -449 438 76 -430 133 276 -318 -40 331 -229 -469 417 285 -375 -59 355
1126 355 -171 -211 246 -12 -398 329 163 -432 -55 418 -65 -229 320 197 -268 109 242 -234 -46 379
1146 379 -80 -280 369 285 -237 5 218 -66 -205 271 85 -257 203 186 -243 -82 344 -30 -182 202 185
1167 185 -178 51 41 -66 24 286 -24 -276 182 11 -333 -66 131 -94 -219 128 32 -164 139 190 -65
1188 -65 37 194 62 -79 150 123 -168 17 303 -83 -107 223 12 -143 137 240 -79 -123 24 -143 -112 52
1210 52 -64 -227 -69 66 -251 -95 144 -4 -168 21 83 8 -96 39 -40 -87 40 26 -194 -23 -46 -21 70
1233 70 58 109 11 184 258 134 217 219 92 100 -11 -117 -102 -150 -95 -246 -232 -212 -116 -61 -55 15 -11 -44 -7 36 19 91 23
1262 23 -101 -64 -92 -83 -52 61 -75 33 98 104 39 160 143 115 -5 118 -12 -6 -19 -23 -11 -98 71 -6 -52 139 -22
1289 -22 -49 99 -50 40 -107 -27 -143 -287 -208 -176 -403 -110 -149 -137 -152 49 77 90 182 321 126 239 227 94
1313 94 81 104 193 -204 -185 -90 -298 -125 50 -123 69 109 57 9 62 112 -13 -19 -35 -192 -192 66 -77 -233 -166 -62
1339 -62 -216 -256 43 -19 -119 202 195 -134 90 197 64 -51 189 86 -10 86 80 -52 83 106 39 -96 195 111
1363 111 -158 9 58 -222 -115 108 -34 -282 72 159 -149 4 131 -154 -176 79 200 -182 149 214 -201
1384 -201 -76 247 -150 -343 15 27 -301 -23 112 -184 47 285 92 -129 299 267 -10 -60 279 -176 -299
1405 -299 179 131 -313 84 189 -248 -288 176 -31 -171 142 31 -303 68 283 -142 -150 338 73 -234 107
1426 107 371 -193 -145 168 -145 -331 136 8 -453 198 345 -229 -144 276 95 -174 216 245 -88 57 368
1447 368 -113 -299 257 105 -570 -18 96 -347 -229 316 -101 -349 282 164 -416 33 503 -68 -206 330
1467 330 49 -219 79 95 -396 29 383 -73 -330 290 226 -197 108 371 -191 -77 213 -122 -215 123 -67
1488 -67 -495 -86 4 -175 -216 365 92 -274 163 299 -331 -88 379 -123 -285 202 250 -267 16 135 -306
1509 -306 8 522 -27 -243 342 314 -107 96 275 -139 -290 143 -83 -385 96 190 -320 -274 82 -176 -331
1530 -331 142 196 -75 141 376 -35 -31 221 -76 -405 52 190 -200 -156 176 -202 -242 98 -29 -229 217 371
1552 371 -36 -48 373 16 -319 -12 -111 -286 -13 120 -152 -223 144 -31 -326 208 233 -56 18 258 -104 -206
1574 -206 115 -29 -347 35 217 -193 -151 238 86 -156 59 -26 -111 24 245 -22 -132 239 135 -219 11
1595 11 20 -213 -64 131 -45 82 149 100 -291 -133 242 -217 -88 29 15 -81 32 36 -342 -81 107 -62 -297
1618 -297 75 214 -251 -159 -61 -165 -77 127 35 27 165 33 1 -29 121 -96 -61 90 57 10 181 105 -161 -148
1642 -148 40 -107 -265 56 32 -1 -3 189 -49 -27 131 -51 -92 122 63 -17 8 36 23 -154 7 -149 -9 176
1666 176 158 48 113 155 19 -176 -1 62 117 98 86 92 -13 -48 -134 -174 -9 12 10 -38 137 5 141 -21 -97 -188
1692 -188 -63 38 -57 11 -4 -16 -143 12 -32 156 -100 28 120 244 99 7 -24 -30 96 -58 -212 20 114 40
1716 40 -26 -40 -116 -68 82 -270 19 93 35 -75 -45 75 10 -118 16 63 165 70 87 -164 -115 21 -63 -155 -193
1741 -193 68 94 259 127 115 115 45 -53 -12 -2 54 -86 49 -57 -124 -95 -121 -59 -10 134 -15 -238 -2 58 -22
1766 -22 -71 -89 -37 -22 179 -41 -41 92 46 -124 -157 -93 -32 -26 -65 41 82 99 -35 -160 -52 121 57 -36 7 106 -39
1793 -39 -93 -124 -5 -43 71 13 65 89 155 -17 -64 55 -75 -105 -35 -49 60 72 -12 -138 -154 -14 10 -159 -36
1818 -36 61 136 -32 17 21 -20 -73 -74 -92 123 204 107 -137 53 1 -101 -193 -23 -54 152 92 58 30 100 191 -94 -3
1845 -3 183 94 -18 36 -114 -172 -31 -95 -201 -47 105 -82 -212 107 168 45 -92 27 -148 -39 203 -1
1867 -1 -97 101 79 -84 -60 -132 79 -35 35 -18 105 120 -74 -182 -10 91 -27 -59 36 177 27 79 14 -193
1891 -193 -36 77 -156 -126 74 283 19 -53 16 -1 -73 92 81 -90 129 93 -138 -131 65 -2 -230 -83 107
1914 107 3 -8 220 -256 -91 64 21 -188 119 159 -53 -30 45 -72 13 -92 -82 -246 69 189 -12 -30 198
1937 198 74 -66 -46 79 93 69 112 -147 -99 84 28 -275 -126 123 -65 -23 158 130 26 97 -11 -36 70
1960 70 61 -46 -62 13 59 -89 -39 -2 -118 -36 143 -21 6 226 126 -127 88 233 39 -42 20 -105 -103 -49 -140
1985 -140 -164 16 56 -38 -114 13 90 -80 138 69 -5 -23 84 -112 -147 107 -39 -234 51 162 64 97 47 -19
2009 -19 16 207 109 -34 98 218 -89 -58 30 44 4 40 55 -142 72 122 -17 -97 61 50 -105 -47 86 -152
2033 -152 54 -43 -12 -142 21 -34 -163 -89 185 -105 -71 40 143 -66 164 57 -55 83 109 35 -121 52
2055 52 70 -16 -87 62 58 30 -59 38 9 108 -6 -183 -144 86 -76 -102 -62 52 -28 104 -27 -57 5 87 -7 -120
2081 -120 -42 128 61 -14 -7 -12 32 90 -24 -89 112 33 -181 -53 132 85 -64 -48 -1 -87 58 76 -85 61 134 1
2107 1 -21 20 138 -65 -74 -50 -78 6 -26 -58 -86 -10 -68 -121 29 28 131 -113 -121 -9 -10 82 -3 33 -10 129 31 -14 -20 2
2137 2 -63 9 29 79 -28 34 -28 -63 -1 139 127 51 37 30 42 -104 -20 -52 -56 71 -167 -87 29 65 -169 -88 -15 151
2165 151 110 -47 -27 -4 -14 -26 -38 -124 12 -40 29 -118 -76 51 -12 21 96 77 -22 -23 -145 -13 38 -36 27 -55 -88
2192 -88 6 -59 -23 33 -17 -13 41 -21 -70 8 -37 108 15 17 -46 -27 4 -66 -103 -99 -12 39 88 -9 -105 136 129 14 -97 -42
2222 -42 -53 -16 139 28 -88 38 -38 -54 -134 -30 -59 43 -59 49 108 -21 -41 20 -165 -105 -74 -139 60 71 -108
2247 -108 -87 -125 33 -107 27 -62 -55 157 5 18 13 7 -70 93 5 -125 68 -21 -24 -42 -13 4 45 5 34 90 6 101
2275 101 39 26 -53 -45 -53 -117 45 105 29 12 18 28 -64 57 -84 -81 11 50 -75 121 -10 9 -84 5 -49 -14 26 -68 -13
2304 -13 41 101 -40 -107 14 -40 18 -51 -66 70 -31 -31 -15 -45 6 176 -15 192 -5 -91 -53 -13 -21 50 76 -38 -93
2331 -93 23 24 21 10 93 56 -12 11 55 61 31 95 -57 -43 -54 27 -50 75 118 28 -105 58 28 33 67 115 99 11 151
2360 151 -32 -32 140 -1 -136 -56 45 52 102 63 -153 38 60 -25 -92 48 -46 -36 -3 123 -78 -54 -75 -78 -70 28 19
2387 19 -75 29 26 23 -40 94 -64 -41 -1 85 -59 21 102 14 5 108 -27 3 9 -16 109 -87 45 17 45 -5 -7 -110
2415 -110 11 -25 -134 -20 51 -25 -66 -50 60 -22 86 31 -8 34 121 -24 -7 -55 14 45 21 121 14 55 168
2440 168 22 78 -3 -10 56 111 -18 -27 -103 10 54 -44 -23 20 50 24 -34 -25 118 80 4 -4 -33 135 83 0 101 58 -25
2469 -25 103 71 27 12 11 -115 -76 115 -21 -8 89 48 72 -12 -10 217 -51 -16 58 -34 -26 49 -72 -92 -155 15 44 67
2497 67 -19 27 -17 134 -8 7 -44 69 67 -78 -94 49 -50 -126 18 1 98 -17 -43 6 62 21 -58 -48 111 82 63
2524 63 44 57 -27 34 10 -4 79 12 -24 -38 -48 -59 -46 -51 -17 95 -70 39 -2 -17 -74 -142 -90 -19 -68 64 88 -17
2552 -17 -41 -18 48 -33 41 4 4 27 -77 -44 105 14 59 -18 0 -99 57 44 61 53 103 15 -18 -14 22 -41 46 -70 47
2581 47 -25 -97 -43 68 -66 30 -97 -134 -7 -73 -40 -42 14 34 -2 66 65 2 -70 26 2 -93 -82 -1 9 0 140 42 9
2610 9 -25 57 -9 42 -57 -87 20 2 67 9 -16 -33 -29 72 -41 -9 -45 -84 -101 5 33 -113 -32 31 -44 9 -28 -114 -137
2639 -137 -64 62 -17 101 92 74 124 42 -47 -42 -8 23 -51 27 -21 11 15 40 78 -40 -67 88 40 39 31 -40 34 -28 44 -17
2669 -17 50 44 122 -43 -26 -44 -23 -9 72 -66 87 31 -6 35 -79 59 -55 56 13 12 -115 100 124 -35 24 14
2695 14 -80 -44 -67 139 -60 -84 54 -61 66 -32 46 5 19 -86 102 -44 94 -16 -83 -2 -32 -34 41 39 96 15
2721 15 -13 10 59 -24 -21 139 107 28 29 -9 -7 -72 15 -195 53 -45 -56 76 -29 63 76 -6 -10 112 5 21 71 53 -78
2750 -78 -8 -118 3 -116 16 -52 -64 -21 -78 -69 -32 45 31 -72 -35 81 68 -32 44 -28 18 -32 -68 20 -41 37 -49
2777 -49 -96 -60 -7 -45 -24 -57 -16 22 12 -92 1 -87 -23 -18 -47 -51 27 39 -21 24 -16 6 -124 -50 -43 -36 -118 -54 -24 -34 -69
2808 -69 83 -105 -4 170 -117 58 -57 145 -76 3 -41 91 50 90 97 -45 -63 33 -7 46 35 -134 -63 -79 30
2833 30 -130 -46 -1 -35 -46 -76 -48 72 -13 55 81 -47 -20 -31 -24 13 37 -60 36 49 116 -126 -11 -44 45 -44 36 -65
2861 -65 31 117 -75 103 -68 -35 22 11 76 29 63 41 50 40 -41 -1 14 -73 13 -66 -55 76 -100 -41 -68 73 44 16
2889 16 80 -51 1 -32 108 115 -110 -27 89 -3 -58 -31 79 -2 15 73 17 -110 -42 -29 43 125 -17 -18 17 -44 29 43
2917 43 -114 -98 13 14 -56 30 147 -154 23 30 -57 -22 -21 14 -74 -47 3 39 31 -36 -26 75 -8 16 -64 54 -41 -67 93
2946 93 125 12 16 68 -81 34 -10 46 54 135 73 36 -11 -7 52 -6 -25 107 168 -127 56 105 -86 -1 -9 7 39 11 31
2975 31 -89 1 17 40 -59 30 -100 8 101 -9 -23 68 -18 -44 38 -31 27 -52 -15 44 -29 -17 -36 48 -36 -27 -11 -112
3003 -112 -96 51 9 -24 27 87 -3 -2 80 -68 24 91 -23 -83 145 -125 -7 44 -50 1 -8 57 11 0 35 97 31 64
3031 64 -9 65 -90 19 55 -44 -13 -80 -57 63 -67 47 -93 -74 18 -35 -80 70 33 -35 -4 -11 -113 -22 85 54
3057 54 93 52 -27 76 16 -38 93 49 63 -33 10 93 114 -85 119 71 71 2 -18 101 -65 -23 -59 23 -51 -101 125
3084 125 51 -64 66 34 114 51 -75 -3 -59 -38 21 -59 44 -28 83 -36 -21 41 -43 -42 -68 29 -118 29 -122 -43
3110 -43 40 103 1 -26 -67 -104 31 34 17 -50 -2 61 47 22 63 -82 47 -18 -19 6 -61 -70 -22 -35 7 49 -55 -15 40
3139 40 -118 -18 61 26 31 -18 -95 14 -66 84 77 83 -3 -9 46 36 -79 48 41 8 39 120 -82 -92 24 -2 70 41 58
3168 58 -49 6 -10 24 -60 -2 -62 -116 -114 -16 19 4 131 45 -82 38 23 57 48 -17 -46 -7 44 -135 -36 101 204 37
3196 37 -7 6 46 93 27 73 47 73 -1 11 7 -8 12 53 -3 -28 -44 63 -23 -16 -115 -5 -44 56 -31 -28 0 20 6 -75
3226 -75 -39 -95 28 -9 -7 49 -84 -66 -41 15 -107 62 -62 -98 32 40 63 109 55 -17 -50 48 -43 -38 -84 57 -50 52
3254 52 56 17 -87 72 -27 -51 18 48 41 -58 62 -16 -59 -80 63 -48 -12 46 -123 -7 -12 103 -94 -56 -81 7 57
3281 57 -73 -40 65 62 16 -26 33 -14 -44 35 28 41 -172 61 -101 67 -1 100 17 -90 -73 -2 28 32 66 28 -64 68
3309 68 -38 98 -76 52 55 23 44 29 -28 10 3 -19 -7 -23 68 16 41 71 -71 11 59 -30 7 22 -58 6 27 54 1
3338 1 109 -17 -57 -117 -27 -80 -64 -72 -6 -58 -100 -31 -33 32 37 -102 70 -78 43 -45 -6 103 14 75 -44 -17 -14 34 -4
3367 -4 -4 44 31 14 -11 4 50 -8 64 41 -21 29 -78 48 -122 -19 12 -95 38 -32 -4 -21 22 -43 -10 28 101 -100
3395 -100 0 20 108 50 -22 -19 -63 128 -83 19 134 23 -162 -75 99 -32 -13 -19 97 42 -1 -97 38 77 -63
3420 -63 33 30 -7 16 -37 -3 1 7 -33 -113 21 5 153 -29 8 -16 14 -125 -48 -40 18 -51 -9 -84 -2 48 -57 76 -2
3449 -2 -29 -56 -50 65 14 19 112 -3 -7 0 56 -13 113 -29 146 -30 125 -11 73 101 -67 -59 67 -34 -42 -95 2 -51
3477 -51 20 9 19 39 4 32 -32 34 38 118 -75 86 142 61 158 -85 57 98 99 2 5 94 -43 -55 -35 -53 112 -94
3505 -94 -80 65 -30 28 -153 -11 7 -10 47 -33 19 -66 -13 -16 24 13 -36 -20 112 77 7 45 83 -28 -57 79 -33
3532 -33 -21 16 -9 -21 -97 10 59 -22 2 71 -115 -45 120 -23 94 -48 62 73 -105 -11 54 -92 8 1 -44 -2
3558 -2 -21 12 127 -62 -31 3 60 105 38 -14 88 0 -43 31 -130 68 7 124 -44 130 91 64 6 -72 -32 -24 119
3585 119 -3 13 77 -28 51 -24 -67 93 120 0 -26 58 -101 -9 6 91 -38 53 63 -138 22 -43 123 -6 4
3610 4 26 -68 -33 50 96 21 -39 -38 -72 16 -69 -61 83 57 96 -28 -46 -89 -156 -73 51 -66 -39 46 -11 20 19 -15 37 -97
3640 -97 -91 -102 -56 -82 96 1 55 86 0 28 -29 -23 -46 -32 -14 18 18 33 28 -66 5 18 -31 -18 52 -16 86 -33 -6 -50 -90
3671 -90 -144 27 44 -30 -1 -19 -75 -43 -19 56 -26 65 -53 76 -63 60 98 43 -26 -51 -37 -1 32 -63 64 -9 19
3698 19 85 -12 76 21 62 -47 40 87 -18 -98 -32 11 18 -121 -25 65 26 -24 -98 1 -17 -107 9 143 -43 13 13 -60
3726 -60 163 -36 -70 -61 -79 -3 48 7 18 31 12 43 -72 -47 27 81 7 15 -17 31 11 21 27 107 35 101 -76 -62 10 -14
3756 -14 57 5 -50 -15 13 63 26 29 -6 -80 65 -48 -21 -17 1 -168 -62 -96 48 -31 4 37 -35 43 90 46 -15 -68 -20
3785 -20 81 -60 0 -19 -2 -90 41 -15 29 22 112 74 -24 49 -25 32 -7 -38 -56 -78 -2 -91 0 -21 21 -12 -8 5 -17 42
3815 42 17 -29 -65 93 98 -94 -65 77 43 61 -74 49 -34 74 109 101 82 -11 -15 7 2 -87 31 -39 34 3 -49 -56 8
3844 8 -52 38 -38 -7 -171 -21 -16 -12 23 -39 -6 33 57 15 -113 -44 -7 -59 161 -28 -9 73 79 -31 -129 -90 40 24 -8
3873 -8 -82 60 92 -32 -43 -64 6 70 0 -12 62 -65 -78 43 -19 -45 58 41 77 -64 16 -6 36 22 73 -49 -48 75
3901 75 -36 78 62 10 37 21 46 45 -89 8 13 -57 48 -35 -34 -19 -40 75 65 -31 -79 41 15 85 -84 51 -1 46
3929 46 26 -35 -15 -21 -116 71 -25 10 37 42 -14 -9 -40 37 58 20 -4 -16 -26 54 -41 58 108 -55 -43 33 13 -29 81 88 37
3960 37 -64 -67 36 -62 -5 79 -10 39 27 -64 31 -45 -19 41 -9 -29 -139 -8 -52 114 133 50 72 -13 87 25 -55 -92
3988 -92 -19 -70 -21 -32 -108 14 69 -56 -44 137 -70 -2 -15 -2 19 21 -97 -8 144 17 8 -32 -58 88 0 17 26 -77
4016 -77 -22 -112 58 -100 64 85 -105 -1 -47 -17 -48 58 -60 -27 28 4 9 106 1 24 -1 -105 100 86 -39
4041 -39 -58 -17 12 51 -25 -47 -72 -115 104 -13 -105 32 -91 -128 -3 -66 24 82 -20 -59 -40 -32 18 -83 22 14 3
4068 3 -166 8 23 -11 -10 4 -90 -28 119 -54 86 71 -50 74 90 -28 -53 58 -39 84 64 75 -32 1 102
4093 102 56 -58 14 174 -71 6 8 -59 19 -83 -27 54 -8 20 13 50 -39 27 -109 -24 89 -98 22 -45 3 -90 -48
4120 -48 94 12 -55 -45 95 12 -6 27 -15 -97 -9 107 50 28 105 71 28 5 -39 31 94 -25 -96 -16 -59 -27 67 10
4148 10 89 77 -41 69 -30 -59 14 16 -8 1 -27 -20 89 38 -44 -40 -30 14 21 20 41 -45 -99 -91 -68 -49 71 29 -20 11 -29 123
4180 123 69 97 -31 -54 63 -93 -9 -108 -98 -6 -126 -64 106 96 58 -27 11 -5 11 -25 -89 100 -103 64 68 9
4206 9 -12 13 17 44 76 -7 39 20 -16 -54 57 71 -103 -17 96 -71 -73 49 41 20 -2 28 -38 -103 30 5 -4 13 49 -12
4236 -12 55 55 132 -74 63 -47 74 -58 -17 9 147 -21 110 -1 -5 29 17 33 94 101 48 111 12 90 19 34 -25
4263 -25 12 -17 63 22 14 45 -18 -76 -49 39 14 18 -17 11 -35 17 -96 -93 -48 -6 -99 -45 117 -71 22 47 -98 28 -48
4292 -48 82 43 86 -11 -40 -59 5 1 -30 19 19 -108 -46 100 -38 3 27 -7 -55 -12 -14 46 20 16 -4 -84 -14 -14 28 -108
4322 -108 -87 -1 -40 -169 107 -74 -16 -5 6 4 3 143 -10 10 15 32 83 109 -6 13 1 55 91 32 -85 7 -185
4349 -185 -64 -35 -6 -3 -86 0 -18 11 -3 -130 54 -44 -5 -59 -108 10 -160 54 97 -23 43 -21 -29 8 1 -32 -73 26
4377 26 86 16 -68 90 52 9 -7 99 49 37 17 46 58 36 -20 16 -2 110 9 -54 -37 9 58 25 -82 70 -8
4404 -8 -19 -70 -9 -30 -47 58 41 28 1 -26 88 41 86 123 6 19 51 -88 -22 86 -21 38 -22 -31 -46 -24 49 -57
4432 -57 -61 30 79 35 16 45 -38 -78 25 -13 18 53 -17 -4 4 5 -55 -49 -116 0 -14 10 -35 -85 -7 -3 0 -21 16 -12 26 90
4464 90 -40 35 -60 -90 76 157 -3 -20 107 -38 -25 -58 18 0 -34 -4 24 -112 -52 15 -78 189 33 -45 -21 -60
4490 -60 -105 -79 32 28 -28 9 -58 23 0 94 36 84 11 119 25 27 9 -41 44 -47 107 72 10 125 -22 27 123 42 14
4519 14 94 67 91 10 35 18 -22 44 -147 -73 -97 -36 82 2 95 -89 -81 -2 15 -2 -56 71 -62 -145 51 60 130 105
4547 105 47 -10 -6 -12 14 -4 -109 69 144 -50 9 13 -24 6 -76 26 5 18 -58 -36 -15 7 71 -61 -50 -24 -22 0 -22
4576 -22 -146 11 132 -14 93 -30 25 -70 -16 10 -26 -27 28 -73 -56 64 -136 -83 -72 37 -53 -112 -29 -6 11 4
4602 4 -17 45 -72 31 -39 1 84 2 64 138 -51 13 8 12 -13 -14 -43 67 6 -39 48 112 -29 75 -52 -3 -81 119
4630 119 -31 -25 -29 -48 -5 -5 4 66 40 -5 19 50 -35 33 27 93 -16 48 -104 -89 -100 -12 42 -91 -29 86 26 -126 19
4659 19 -47 155 -70 92 13 79 11 27 27 -16 105 131 57 106 -57 -15 -4 49 -63 -10 0 84 32 -23 -8 -33 73
4686 73 -7 -2 47 -27 -23 101 73 -22 95 -3 56 73 54 -78 -75 24 -16 -86 91 55 -16 3 91 42 24 129 -38 -71 109
4715 109 15 -39 -94 40 -62 29 -7 -33 61 12 -2 -51 81 24 90 -77 -9 24 -43 38 -15 -120 -1 16 -125 -26
4741 -26 58 -7 -46 63 95 -59 -20 85 111 27 -88 126 -12 86 84 -42 -35 49 -26 -50 65 -61 13 144 -20 25
4767 25 -28 29 -23 89 -113 -117 21 148 -34 26 100 -12 6 -24 15 -3 -11 87 169 -26 4 12 -92 28 73 85 -41
4794 -41 103 -43 -45 42 120 -48 129 47 47 -75 1 -5 -13 25 14 -30 37 -42 -13 76 14 6 -24 -72 -19 72 -30 -41 -27 6
4824 6 83 -16 -22 -118 -69 -25 -14 -32 19 5 -50 43 -17 13 35 31 34 44 -69 -56 -17 41 -20 86 17 120 95 56 -63 24
4854 24 19 -97 17 -44 -27 -18 -95 -1 -39 58 30 -33 72 102 -18 -6 43 74 45 74 -37 25 -4 -36 34 162 4 68
4882 68 50 -74 7 -65 13 -27 -97 19 -91 32 -20 69 -27 15 -95 67 131 -89 57 -126 -2 4 44 -3 99
4907 99 22 -77 69 -97 -76 -94 80 21 -4 -166 5 -52 -136 26 14 61 -24 -9 92 111 1 39 17 92 64 -124
4933 -124 9 -111 104 -9 -104 52 6 -74 -27 94 -100 -18 -11 66 56 19 98 32 -1 102 -71 -102 127 62 58 19
4959 19 119 -25 173 62 67 168 8 29 -13 56 67 80 11 18 70 -97 32 53 -73 101 175 -1 40 -12 -99 -90
4985 -90 95 -30 -99 40 -76 -19 74 -36 -111 56 38 2 49 10 84 12 151 -28 -24 -41 86 39 60 -40 -47 16
5011 16 -29 -59 13 5 3 105 -94 29 -3 -84 107 16 -45 -2 32 -6 -30 -49 -3 69 6 67 11 -1 58 -72 -20 -87 12
5040 12 -89 12 22 85 -42 1 -80 -43 -58 40 -96 -128 105 151 16 39 52 7 -53 24 83 -81 38 -97 -3 36
5066 36 43 43 0 56 -31 3 -90 158 26 -61 62 -24 -72 29 132 31 -29 -132 -101 -63 -17 24 46 -37 89 1 32
5093 32 -6 -89 82 -36 -18 -59 -17 -31 -61 46 52 106 51 -71 -71 0 108 54 69 -18 -70 -18 25 33 -14 -76 -138 -103 85
5122 85 -45 -136 69 -25 -127 54 23 18 -126 51 25 -8 178 4 -82 106 54 28 -58 -24 9 92 -124 32 27 -26
5148 -26 68 -37 21 8 103 19 57 -86 21 -1 21 19 9 -50 -31 60 -38 -39 -47 46 -28 -25 -39 -74 11 47 72 -55 33 53
5178 53 -171 52 -56 81 -122 -20 64 -105 22 112 51 -45 -22 95 57 4 56 -11 48 -36 32 -132 -31 -1 -27
5203 -27 112 40 51 -71 -28 -21 82 36 -7 100 70 1 3 47 -23 -35 4 122 12 56 -79 -5 -30 52 194 24 70
5230 70 63 50 39 38 33 -3 27 83 -15 96 -45 -25 -79 -21 -21 52 -29 7 57 48 41 -23 15 -64 137 27 -75 5 43 -9 47
5261 47 16 80 -60 -130 -12 18 44 64 72 -6 36 49 -17 -62 -48 -77 -42 -67 27 -51 -99 139 8 -52 -68 -41 99 8
5289 8 -30 -112 34 35 -85 -40 -8 75 -80 -89 -2 -43 43 -9 -82 -110 -5 -112 19 -3 1 22 53 115 -81 31 23 7 -84
5318 -84 60 -44 -56 -7 -44 -139 7 34 32 5 -25 2 -38 -101 -15 -84 -30 1 -5 26 -82 18 32 22 14 17 7 -62 -57 142
5348 142 46 -18 47 -40 -45 -13 106 -58 14 7 7 -114 74 49 77 -31 -18 -18 -62 -10 17 16 16 48 -20 124 35 -52 65
5377 65 115 32 26 98 98 83 -3 -3 23 -38 -84 -31 -68 87 58 86 -68 -64 58 136 59 -53 31 87 91 59 48 1 -22 54 33
5408 33 -20 -4 -129 112 79 -16 -96 43 11 58 -22 -71 10 45 88 12 49 23 -6 -83 -17 -21 115 72 -56 14 37 -58
5436 -58 49 -73 -62 -12 63 88 42 22 94 141 -109 23 25 -52 -18 16 -20 -61 59 53 8 41 10 29 26 7 35 -162 54
5465 54 71 69 -62 -14 32 -40 127 93 5 68 -23 -67 16 -80 152 145 14 8 -15 -66 -64 81 105 -52 88 -14 8 -48
5493 -48 -48 -4 8 -28 104 9 -58 157 15 -60 -22 14 5 -65 -27 85 -13 -66 -95 158 -5 78 64 -18 -13 5 -2 -37 16
5522 16 76 58 63 3 20 -13 61 10 -63 47 73 71 47 -162 129 65 -10 1 -91 -77 -9 35 56 84 -98 34 90 22 -40
5551 -40 -56 30 -14 50 71 -10 -23 44 29 44 -30 124 33 8 42 88 -28 -39 11 75 104 45 -30 -51 -70 -2 -20 22 -28
5580 -28 57 70 -87 -75 -81 27 -35 -52 -19 -35 70 -13 -17 -55 -26 -28 -42 45 -53 -59 38 26 90 20 -70 122 35 81 -18 -36
5610 -36 -31 21 31 -7 50 43 15 22 0 -8 -127 94 -119 -40 -39 -55 -71 -49 -35 49 72 -36 -57 24 2 -40 -102 50 -66 -29
5640 -29 -63 2 64 -19 96 -38 25 -47 -126 67 19 58 7 30 58 40 51 30 133 -75 127 38 48 11 -71 68 -78
5667 -78 -5 -9 -3 57 -34 -34 -48 -84 -39 26 33 45 12 121 67 -23 37 34 99 5 101 -39 4 -41 113 -58 -59 -1 44 43 120 -19
5699 -19 8 81 -50 57 52 -111 -4 -94 55 22 -9 -93 44 64 -9 -10 -14 34 42 136 74 112 141 -53 100 -34 -7 -51
5727 -51 9 -19 16 -5 16 -33 1 139 -21 46 27 39 -51 -54 0 21 -78 -108 -2 -29 23 -135 80 14 13 -70 49 0
5755 0 -79 -37 6 -15 -79 31 -3 -12 43 -89 60 -41 27 0 65 44 -46 45 -46 -34 -19 -1 6 10 -97 -20 38 94 54 -131
5785 -131 -13 -41 -45 -95 59 -48 -49 -67 -1 -1 62 -14 54 -68 -57 16 -73 56 -15 123 -55 17 -124 81 -54 -33
5811 -33 75 25 -1 118 38 -114 -7 58 46 139 -22 47 -42 -34 -5 -98 12 -58 40 -1 58 68 -94 -38 74 -30
5837 -30 5 74 -136 37 61 -69 -1 85 51 55 -28 74 112 -55 -20 40 31 -60 -68 35 73 -23 36 1 -30 -44 20 14 38
5866 38 48 -63 101 -30 76 -29 40 -38 -48 -27 46 23 -59 10 15 -74 -11 -117 -89 -66 -64 85 4 -1 -12 -63 100 -23
5894 -23 -120 28 -31 28 87 30 67 -92 -109 -18 -75 -53 -56 49 -12 -20 -12 -28 11 35 -9 -21 55 21 74 -36 5 -9 67 -27
5924 -27 -102 -20 -20 -84 44 -38 10 70 -117 7 4 -5 -4 4 66 61 -5 41 -20 46 -169 143 39 27 -45 72 94 32 -61 26
5954 26 23 -18 -69 -91 172 -55 -96 19 -44 136 9 -46 -39 4 -70 39 -60 78 -15 -65 -16 -64 114 -10 0 58 100
5981 100 -171 -41 -93 9 158 -77 74 -8 13 95 -34 -61 -13 32 90 0 -127 -45 -18 -82 40 47 -22 -13 64 57 -38
6008 -38 10 4 -130 71 19 100 -59 115 25 -122 20 -12 99 -50 30 81 -46 -14 4 -27 -10 -115 94 -29 34
6033 34 -56 -43 133 57 40 -79 -13 67 16 13 56 -30 10 -28 -205 -115 -104 -10 66 22 23 38 64 29 67 55 35 132 62 -53
6063 -53 4 -35 15 4 65 5 0 -44 26 -45 24 183 -86 8 45 -31 99 32 98 -47 73 -3 59 51 138 -53 -13 38
6091 38 111 -50 121 40 -57 50 -68 -15 -22 27 -65 35 54 71 -65 35 -38 8 -15 -99 17 40 28 19 -38 -29 -10 -29
6119 -29 -106 -57 43 14 -52 73 21 58 -30 -67 147 -135 -80 -6 -76 -31 58 43 -2 -31 24 107 55 -60 83 -3 7
6146 7 -55 31 -32 -11 65 142 97 -41 14 21 41 -127 8 19 5 -75 26 96 -5 -95 -59 79 -31 9 -154 100 -128
6173 -128 -78 -29 -72 65 117 -22 43 94 -59 34 138 96 39 -79 -45 92 36 148 18 -45 33 75 15 -56 -118 34
6199 34 -1 -8 -16 26 -22 118 19 -30 43 -81 84 -14 -75 -19 -66 -49 -65 -31 -43 -56 31 -52 -19 67 33 -10 -18 41 5 -15
6229 -15 3 -32 34 39 39 17 -16 126 -22 10 -36 -23 31 15 17 -8 46 12 90 -80 -61 -15 -21 -50 91 23 -110 52 -19
6258 -19 -18 -12 90 -36 -5 37 -32 63 32 -6 -37 -21 -55 -149 70 82 -26 78 48 59 2 94 0 -123 40 24 -33 39
6286 39 77 -14 -28 -21 -40 -36 -33 0 -16 126 -87 48 42 -5 28 -22 29 9 18 19 -54 3 128 -27 31 6 -23 6 -105 62
6316 62 7 3 -15 73 22 59 -31 25 -49 -40 -122 18 -72 -1 14 100 -2 -93 -60 -74 -32 -23 -56 29 66 68 -87 -50 -81 -12 -86
6347 -86 -21 -114 -1 -8 95 -27 -31 -146 -31 -84 -57 34 -122 53 -26 51 46 -92 -83 -30 -10 32 -198 -25 45 1 90
6374 90 25 -61 -49 8 88 -45 -32 46 -15 45 -70 88 3 64 59 -8 -75 -2 4 91 -105 -46 -66 123 48 -103 35 98
6402 98 9 -6 51 -33 -17 -1 -29 48 -11 21 -79 -23 -1 -78 90 -106 2 -22 23 10 -6 -51 -83 -35 21 112 90 17
6430 17 17 -35 -55 -76 -7 131 -35 20 16 83 -66 -82 -41 65 20 -13 33 3 3 18 21 -54 48 -10 103 -4 -45 -40 53
6459 53 -52 -75 41 5 -79 60 22 -26 -74 -24 13 -34 23 -13 -19 -50 77 -58 -21 61 -75 -78 24 2 -22 27 3 85
6487 85 -21 28 -7 -62 97 60 53 -52 33 -24 -21 23 44 -97 48 45 14 36 51 39 -11 16 63 9 -5 69 34 58 -57
6516 -57 72 -50 -13 -17 -44 28 28 -49 -25 52 -50 -15 -52 20 104 -138 -71 43 76 -57 -65 -50 22 38 56 5 -24 1 -31
6545 -31 8 7 103 -12 39 -61 -55 -69 57 -98 -43 -46 -122 -151 -85 126 -15 -59 23 98 -42 7 -51 -34 -25 21 -12 66 -4
6574 -4 -31 -69 -34 -2 24 66 -38 -119 -30 76 2 19 -17 -65 -69 -11 103 53 -29 -22 95 27 -28 27 69 -72 16 60 47
6603 47 29 -86 38 53 25 -56 47 -45 17 35 80 -33 -50 2 70 25 15 -19 -39 2 25 70 18 -82 22 0 -138
6630 -138 7 -25 43 43 64 130 3 -142 -96 36 -47 17 78 11 -43 10 -13 61 90 -76 -27 -75 -88 48 27 129 -84
6657 -84 -57 -39 -24 -57 0 -6 -86 19 165 30 -5 -20 -34 2 -13 -70 -57 -11 85 -5 56 -22 -25 -71 -29 -24 -20 38 -21 5 26
6688 26 -64 -1 20 -32 49 -94 26 39 124 -47 30 2 68 10 -19 31 -10 -46 7 -5 11 153 -49 102 -19 -68 -21
6715 -21 29 28 52 -71 -10 177 81 -72 -14 -76 -114 32 -103 33 -31 45 11 -20 29 -34 94 -109 114 114 -68 40
6741 40 -80 85 -38 115 -15 19 -91 -86 3 26 -27 -1 40 45 75 43 8 -45 68 23 42 -160 -83 -7 -95 -114 42
6768 42 -30 -50 129 -59 -63 50 47 37 26 41 60 -61 36 -2 -92 -32 3 -27 62 20 -31 -2 -53 120 -45 91 -10
6795 -10 -4 55 -27 -55 -43 67 -54 52 8 -41 -35 -20 -115 97 -41 71 -4 93 22 -31 68 11 61 -55 70 -8 68
6822 68 41 73 3 66 10 -31 -35 63 74 92 -18 -4 -35 -92 158 84 16 72 5 34 50 -66 -16 -120 -34 37 -69 -9
6850 -9 23 41 -66 -11 48 17 -50 -1 -90 -112 -1 -76 -65 8 62 49 -11 20 -57 30 61 9 0 66 -22 -68 18 -28 125 43
6880 43 -74 -38 62 24 47 137 41 -132 47 -5 0 21 19 -51 6 -34 -29 -55 -25 28 89 -7 -35 81 -45 -53 -41 -77 4
6909 4 30 -53 49 -14 68 -88 -2 -37 24 -205 -48 55 -46 97 45 79 89 24 37 66 -117 3 29 17 66 -55
6935 -55 -143 -83 -51 29 -38 -18 40 -29 -58 -115 52 16 -18 -104 -28 100 69 26 -18 11 47 83 -10 32 12 11 20 -5 99 89
6965 89 82 -5 110 -7 141 -49 -94 -11 -44 -39 1 -33 46 4 129 49 -66 -48 96 63 26 50 40 -65 -37 -24 -6
6992 -6 148 -40 -118 145 21 10 1 -54 57 8 -45 -40 29 4 180 51 -19 -89 90 -48 -133 -30 -120 19 -53 79
7018 79 -140 98 -20 83 -65 -119 -4 21 35 15 14 72 -103 -43 -93 30 38 -82 -2 80 13 57 181 -70 43
7043 43 25 -33 124 49 -106 97 -13 146 70 20 18 -24 -75 -74 -11 -33 11 23 -38 31 55 -79 18 93 41 35 -29 -83 -14
7072 -14 4 -31 -16 14 60 -17 36 38 -155 62 39 16 -15 -10 -45 -20 -1 -39 -9 -37 -8 131 65 -14 43 50 47 39 -17 2 -14
7103 -14 -16 146 -8 -75 -51 -112 -2 -19 -12 -27 -129 -13 -38 24 25 74 -2 54 73 -28 -65 26 -86 13 58 -36 61 20
7131 20 -45 -3 8 -44 -44 -53 92 49 -10 16 -2 60 -35 -54 54 12 2 -41 34 -75 17 60 -79 83 -111 5 -19 64
7159 64 -19 17 -18 35 -63 16 -89 -75 44 -22 -85 27 56 -23 29 16 37 121 -25 19 -119 5 -34 -67 21 -81 53
7186 53 -44 -54 28 80 71 45 -25 -106 20 25 86 -118 -61 14 64 -7 -10 25 38 -13 -146 -5 -83 -28 -3 -11 100 -25 42
7215 42 -59 39 -53 -24 -51 22 -141 89 -58 -18 28 -39 -19 12 5 -43 -4 94 -29 -80 52 3 36 17 -47 -18 179
7242 179 5 51 10 -66 23 26 -51 114 -5 44 20 71 -34 -70 -77 -58 -17 62 -9 115 9 75 1 -50 76 10 -29
7269 -29 82 -20 -18 147 -17 39 -23 -52 -96 67 -105 -6 74 13 -56 15 39 -43 17 -139 0 -30 76 27 80 -36
7295 -36 21 25 21 25 -113 -51 1 -18 -36 -61 -16 -6 -11 80 38 53 18 -105 61 32 -11 10 61 10 22 43 -23 85 -72 37
7325 37 -21 3 46 -23 3 -89 2 116 9 -15 -95 71 3 -70 -131 32 75 -65 86 -50 40 56 -1 -97 -57 -16 -30
7352 -30 -45 111 132 -60 -85 19 13 -18 66 55 87 75 -16 0 86 -96 49 51 13 -30 136 -9 57 5 -5 9 77 36
7380 36 75 -16 -107 11 -12 47 62 -71 -15 62 21 13 -61 -27 -36 -47 8 -13 33 7 -99 1 104 -71 -60 16 -122 -63
7408 -63 -48 -46 -56 59 -45 -1 -10 65 29 -111 -73 71 102 -32 31 -74 46 -76 -29 -33 52 -26 -60 103 -4 3 -57
7435 -57 94 -45 -82 -6 -15 -84 60 20 -10 35 69 -4 24 10 -102 -4 111 51 36 4 -57 12 -25 50 -108 -57 80
7462 80 -39 -94 -47 -104 2 62 60 119 19 -38 44 -69 -64 -25 18 11 -22 85 47 19 18 19 -98 56 14 -8 -87 47 -73
7491 -73 104 -41 -47 -2 -78 -7 -161 -22 -89 80 25 -19 48 0 -79 49 51 92 -61 -165 -74 -38 26 41 -7 40 37 -74
7519 -74 135 -93 42 -19 -16 20 28 -33 7 -49 12 15 51 -3 6 -82 -125 86 -64 -20 -60 -2 -18 69 69 -43 72 81 -23
7548 -23 27 -58 24 -38 101 0 88 35 -45 -12 -91 -13 87 27 1 -7 -100 -16 83 21 53 -96 41 56 -35 0 74 4
7576 4 -172 29 140 23 8 20 -29 -55 33 -11 85 5 57 29 41 49 55 48 101 -25 146 -15 14 68 83 13 -102 40
7604 40 64 106 -90 -14 11 55 23 107 -26 -89 -166 99 -21 34 -93 -55 -134 54 -62 -87 48 0 48 -4 46 -57
7630 -57 -14 -25 18 -109 -33 71 24 83 -51 48 -129 56 57 -42 10 42 86 38 32 9 -30 0 43 41 -73 -39 55 -35 -65
7659 -65 -101 53 10 71 103 -133 -17 86 38 29 147 65 -138 -60 -104 -109 48 30 50 3 -6 91 -98 54 73 -2 25
7686 25 16 2 9 -43 -8 -9 -90 38 26 80 -24 20 -83 -37 -89 -43 -30 -64 11 -47 -36 22 24 -7 59 77 -6 -40 90 -19
7716 -19 -15 11 -43 10 56 -50 -65 29 10 -7 20 -45 -24 -70 19 28 -141 -42 79 -101 -44 31 88 -57 -41 -35 21 -35 -76
7745 -76 38 -43 -79 -27 9 -6 51 -50 -99 31 -10 26 71 -20 68 -11 -26 49 -3 -7 -5 81 -32 45 -103 -50 46 -62
7773 -62 13 8 35 4 38 28 -27 -158 34 44 -17 -75 95 -67 2 57 14 34 20 -6 -107 56 12 -55 8 48 56 -1
7801 -1 94 -5 -29 3 -11 22 99 -8 9 15 -19 -13 -63 16 17 -98 30 73 15 -78 51 -100 -26 -140 -84 -97 93 29 -119
7830 -119 87 -43 -16 36 53 63 -36 -5 77 -47 22 80 -127 156 60 10 4 48 31 93 -88 -65 30 110 70 44 -31
7857 -31 24 -24 -23 -18 -73 5 -21 -154 83 10 15 69 40 -9 6 86 -27 16 8 -36 -4 -19 10 -53 66 -93 93 -64 -85
7886 -85 38 6 89 18 88 -113 -45 116 -110 -4 -167 -53 24 -32 32 -7 31 -47 -68 -53 38 -16 9 29 -30 41 -22
7913 -22 -11 29 12 49 -48 35 3 -29 -18 -46 13 -42 -21 -81 -62 -58 -24 88 62 80 -51 59 -76 26 121 81 -52 -70
7941 -70 -65 36 -10 -45 -51 -117 57 19 -102 42 73 129 -64 -78 -110 -52 85 102 22 18 -78 185 -37 42 -14 -4 31 5
7969 5 44 58 -67 -23 -35 64 30 -23 9 23 26 32 15 85 7 52 87 -54 -55 -14 13 83 -57 51 40 -51 68 12 2 -63
7999 -63 -21 -78 27 57 -16 90 16 -9 -45 -42 -73 7 72 -83 -50 -1 35 65 37 -63 75 20 42 9 -42 -30 -48 95
8027 95 48 -56 -4 10 -37 -76 -4 -52 -64 13 -47 8 -67 44 34 -10 117 -54 -1 -177 -3 -23 17 -65 -32 -7 56
8054 56 -91 27 -6 25 -88 -21 90 -21 56 -5 13 -18 8 -62 37 -96 10 8 89 -56 -64 -31 57 19 -55 102 10
8081 10 -72 -17 -32 59 5 -105 -46 37 -83 43 73 53 63 41 -25 7 -4 63 28 35 74 74 81 -58 139 59 86 57 -32
8110 -32 22 -1 18 -14 10 -14 -20 39 -7 -14 -98 124 9 -32 -112 97 9 106 97 34 -23 -63 -79 25 3 49 27 -1 80 -106
8140 -106 -57 -61 -35 -28 -16 -34 12 53 -47 12 4 55 8 -37 -82 46 5 84 -126 -111 85 -73 9 47 -24 -65 40 39 -37
8169 -37 45 -22 -49 -158 41 -47 72 -2 -108 -130 -108 3 -92 -7 -59 -16 68 -58 40 63 14 64
8191F4
$$ Imaginary data points
##PAGE= N=2
##DATA TABLE= (X++(I..I)), XYDATA
0 0 0 0 0 0 0 0 0 0 0 0 0 0 0 0 0 0 -3 8 -8 8 -8 8 -16 16 -16 19 -24 24 -32 33 -40 48 -53 58 -65 75 -85 96
38 96 -105 120 -131 147 -163 179 -199 219 -243 268 -294 324 -356 395 -434 481 -529 586 -650 725
58 725 -813 916 -1037 1187 -1377 1626 -1968 2467 -3272 4779 -8616 42692 58406 -792 12681
73 12681 11989 -4215 -13638 -8128 -16446 -1015 10504 -12549 -29615 2209 12669 -15065 -19170
86 -19170 8067 12545 6095 4554 -5275 -11446 3313 -1724 -26939 -18158 15037 11209 -9670 -2984
100 -2984 8165 1017 -2084 -4086 -9858 4563 25076 11557 -6010 11008 23208 1432 -11605
113 -11605 -579 4356 3947 7048 -1821 -8533 6474 8183 -17015 -19868 4417 7993 -5526 -2760
127 -2760 3980 23 -997 -6538 -21078 -15036 5760 1492 -11851 2463 18021 8242 -1343 1615
141 1615 1756 3630 9293 2171 -5166 7184 12345 -6769 -15283 -2084 1718 -4592 -1387 4287 5881
156 5881 10637 8656 -5378 -7333 4593 1540 -10647 -4269 7816 4459 -1759 -2289 -5389 -5517 -607
171 -607 -4658 -9937 893 10324 853 -6966 126 2586 -3118 -2458 696 2272 8700 10978 1164
186 1164 -2308 4973 2476 -8451 -6933 2186 2529 370 1124 -882 -1689 1316 -2774 -8623 -1740 6971
202 6971 3360 -1036 3194 5010 133 -2864 -3687 -3441 998 3678 -1201 -2762 2839 1895 -6228 -7472
218 -7472 -2147 497 563 1824 2660 4413 6094 1783 -4263 -2259 2960 716 -2649 533 3722 1868
234 1868 -1265 -3843 -4024 -892 1164 -1152 -1158 4537 6005 309 -3118 -1471 -857 -1792 -2667 -2303 689
251 689 3771 1407 -2881 -2312 1381 626 -2129 -302 3870 5318 3158 -76 -1563 -194 -543 -3924
267 -3924 -4666 -359 3022 1413 -1142 -236 1493 1075 -1245 -2026 690 3838 2865 -667 -1319 409 -358
284 -358 -3793 -4890 -1472 1730 1747 350 182 1991 2173 -973 -3099 -1024 1941 1913 -131 105 1962
301 1962 2036 -700 -2655 -1419 1200 1650 -293 -570 1511 1810 -860 -3063 -2181 391 844 -394 -596
318 -596 1285 2182 -67 -2845 -2542 -291 69 -895 -645 1721 3311 2033 -436 -619 947 1090 -725
335 -725 -1688 143 1493 -139 -2156 -2362 -613 558 -310 -663 1319 3583 2539 -63 -883 134 -117
352 -117 -1654 -2320 -969 907 1498 -234 -959 864 1650 -212 -1558 -108 1093 555 -815 -1415 -1043
369 -1043 184 -243 -1633 -653 2292 2605 752 550 1518 946 -236 -1284 -1781 -781 983 -146 -1851
386 -1851 -233 1564 -31 -1773 -208 610 441 793 261 -336 1143 1915 -370 -1394 1498 1822 -316
403 -316 -282 534 -649 -1084 -957 -2837 -2930 -221 120 -1878 -293 2613 1476 201 1512 1274 311 1308
421 1308 956 -1492 -571 1421 -820 -2440 -98 895 -901 10 1209 66 256 1949 -26 -1891
437 -1891 761 1362 -1436 -1018 1420 304 -624 1082 167 -1698 356 1003 -2244 -2040 911 -580 -2338
454 -2338 -192 413 -1339 397 1823 -521 -548 2658 1351 -1682 628 2057 -583 -379 1722 -183
470 -183 -607 2205 1298 -1695 412 2199 -1066 -1851 730 -470 -2418 98 -50 -2620 -323 2188
486 2188 -953 -1811 1811 1327 -1439 -60 1203 -1253 -446 1442 -1282 -2618 1127 1012 -2582 -757
502 -757 2294 -8 -634 1699 583 -728 2225 2275 -1352 384 3745 698 -1631 1468 1173 -1566
518 -1566 -470 -30 -2745 -1642 1277 -1551 -3605 543 1602 -2025 -1110 1812 55 -115 2057 34
534 34 -1853 1315 1595 -2631 -2016 1963 218 -1854 621 1053 -735 1168 1808 -1234 -248 3368 1104
551 1104 -1777 1112 2451 -560 -989 647 -1030 -1069 1479 -350 -2722 635 1983 -1976 -2419 808
567 808 168 -1517 246 175 -1480 474 1464 -2069 -1907 1936 803 -1919 452 2133 174 494 1525
584 1525 -599 -618 2098 653 -2080 533 2468 -671 -1465 693 23 -1147 490 130 -1434 748
600 748 2279 -1000 -1807 1272 765 -1868 -453 643 -921 -302 827 -1472 -1916 881 362 -2251 -449
617 -449 1877 260 -331 1325 607 -263 1277 999 -1282 298 2307 96 -1198 816 743 -1198 -313
634 -313 272 -829 -48 1541 -430 -1436 845 782 -1643 -948 702 -430 -671 717 106 -855 566
651 566 472 -1592 -887 1199 88 -866 575 732 -328 245 605 -399 36 1526 728 -462 809 1074
669 1074 -558 -561 223 -423 -547 449 -83 -651 339 608 -853 -819 147 -216 -736 -93 301 -480 -3 372
689 372 -665 -624 545 179 -393 524 982 302 148 513 26 -173 557 335 -188 606 709 -105 -202 174
709 174 -311 -711 -192 -161 -518 -90 226 -454 -505 58 -184 -543 -42 322 -124 -7 243 -224 -445 -129 -46
730 -46 -343 246 771 521 413 640 357 159 375 326 -90 116 311 20 -164 -4 -226 -596 -341 -113 -226
751 -226 -137 169 -205 -213 -210 -346 -465 -474 -94 -47 -18 248 223 -109 102 71 -48 303 444 315 341 347 430 185 30
776 30 69 -25 -65 110 69 -41 -47 -239 -391 -372 -278 -331 -186 16 58 29 -32 19 -269 -187 -59 -159 -66 202 228 57
802 57 64 203 -83 -55 131 196 153 354 235 -8 36 -15 -238 -293 -53 -62 -173 60 36 -263 -164 -6 -185 -298 64
827 64 110 -96 126 213 -43 -55 195 -21 -36 227 361 63 214 317 32 -224 89 78 -111 190 242 -118 -9
850 -9 286 -113 -398 -44 4 -425 -101 169 -54 -208 173 -90 -541 32 213 -231 79 452 93 -115 193
871 193 147 -229 112 433 -220 -42 509 -12 -381 7 79 -247 -10 202 -141 -171 413 -72 -562 100 426
892 426 -432 -268 332 62 -147 412 133 -413 209 344 -355 -274 630 154 -373 225 314 -277 -126 334 -357
913 -357 -215 691 163 -561 132 631 -369 -490 348 37 -247 473 199 -659 132 658 -542 -676 477
932 477 264 -571 82 296 -313 -48 502 -394 -539 706 324 -759 31 639 -195 -514 330 -173 -412 540
952 540 214 -930 -93 891 -341 -646 540 172 -338 270 349 -540 142 786 -296 -746 564 469 -733
971 -733 -151 529 -298 -311 392 -436 -751 633 486 -813 -188 1004 26 -595 575 353 -396 409 475 -754
991 -754 -33 925 -261 -847 405 528 -599 -268 416 -410 -162 742 -78 -842 449 735 -788 -514 766
1010 766 -150 -587 230 -15 -738 240 580 -649 -326 1050 122 -689 394 604 -273 -2 432 -374 -171
1029 -171 820 22 -885 401 819 -543 -396 650 -10 -491 265 -111 -805 111 500 -1010 -758 425
1047 425 -30 -862 -29 324 -457 96 725 -305 -134 1027 384 -619 338 910 -242 -323 549 -28 -297
1066 -297 465 253 -605 276 748 -254 -581 594 354 -539 137 227 -460 -109 448 -552 -765 238 -24
1085 -24 -795 -232 478 -246 -268 493 1 -255 637 371 -446 165 715 -129 -418 401 211 -387 225 346 -265
1106 -265 134 635 -120 -434 344 333 -475 -124 287 -288 -405 291 -240 -517 101 284 -438 -221 489 44
1126 44 -224 387 193 -168 132 410 -273 -18 433 2 -337 271 286 -203 55 349 -73 -252 323 13 -328
1147 -328 256 274 -356 -80 48 -141 -223 177 10 -254 170 215 -197 -84 230 36 -87 144 219 -212 61
1168 61 334 -59 -48 240 41 -113 286 225 -119 -67 123 -58 -188 30 42 -152 49 215 -266 -235 214 -59
1190 -59 -204 -56 202 -200 -89 215 -56 -88 27 105 -174 162 283 124 13 212 163 -116 113 195 -76 35
1212 35 48 -104 -86 -14 -73 -121 4 128 -164 -181 115 8 32 -13 -9 -89 54 11 -97 -116 -20 -76 -194 -88 39
1237 39 -112 -40 200 51 125 180 353 199 172 272 107 36 81 -43 -97 -110 -81 -144 -150 -17 -156 9 22 -11 -148
1262 -148 -84 68 -61 -50 -112 -192 -185 -128 -138 -177 -156 -84 -139 -35 40 109 124 88 102 87 107 107 58 -55 99 -36 54 43
1290 43 17 3 55 224 60 114 136 156 -29 -78 -161 -182 -241 -130 -244 -275 -187 -130 -120 -154 91 37 68 117 152 -24 106
1317 106 94 -28 93 138 -79 -21 132 39 2 144 25 1 86 186 5 53 296 198 -85 -35 55 10 -30 -52 -85
1342 -85 -258 -136 -170 -319 -233 81 -112 -180 154 -64 -41 -82 200 -96 -20 336 77 -48 207 275 -58 53 259
1365 259 4 -18 236 28 -140 127 83 -149 -154 57 -79 -216 103 117 -108 26 178 -188 -186 136 55 -239 48
1388 48 149 -252 -73 191 -236 -129 148 206 -170 12 288 -165 -129 296 -39 -130 204 233 -130 141 252 -50
1410 -50 -199 343 -22 -381 -75 82 -144 -47 117 -149 -430 185 67 -330 45 329 -152 -179 214 -68 -213
1431 -213 292 132 -347 -27 361 -54 -298 174 71 -363 -29 199 -136 -14 380 -172 -304 326 207 -358
1451 -358 40 300 -65 -153 401 -145 -308 118 185 -251 55 356 65 -124 315 150 -433 -35 212 -255 -196
1472 -196 349 -75 -339 238 134 -299 -102 282 -184 -119 222 50 -259 198 106 -469 -120 260 -35 -202 237
1493 237 249 -209 143 329 -103 -81 420 100 -274 145 338 -197 -60 158 -195 -255 128 71 -448 179 174 -249
1515 -249 -107 177 -108 -207 223 58 -290 36 224 -415 -355 274 -46 -357 96 390 -199 72 298 -109 -110
1536 -110 341 251 -325 71 374 -196 -203 129 -118 -250 144 171 -305 128 358 -74 -166 280 83 -162 -21 7
1558 7 -187 -93 82 -172 -195 84 47 -396 54 314 -24 20 380 -5 -151 228 94 -128 4 311 -211 -239
1580 -239 117 -18 -69 -116 44 -156 33 332 71 -77 240 84 -351 -62 129 -11 17 147 123 -228 112
1601 112 40 -319 31 376 46 -180 157 137 -48 19 116 -112 -62 91 -29 -220 135 200 -139 -69 97 -62
1623 -62 -127 150 120 -128 266 90 -123 -116 147 15 -145 68 161 35 60 132 -105 -79 96 13 -2 161 255 101
1647 101 1 20 -99 -122 -71 -86 -38 197 192 26 -70 2 -11 -104 -178 147 -12 56 135 -23 -89 66 -15 -147 -82 93
1673 93 -21 -197 -10 -56 -69 -51 -61 -51 87 161 100 125 124 206 -38 104 36 -102 131 61 -78 45 -41 -100 -312
1698 -312 -192 60 28 64 8 37 -12 -104 -85 -186 -62 -6 -57 -139 156 58 -132 43 -145 -55 -30 26 -30 198 289
1723 289 214 212 148 133 136 -16 0 19 45 -71 -7 -273 -136 45 -172 -100 -184 144 54 30 -106 -128 -255 -199 -302 -259
1749 -259 -15 -32 -196 -70 72 39 16 62 122 176 290 153 58 154 95 14 -71 -88 -65 144 -16 8 -6 -3 -10 -33 -76
1776 -76 77 158 -4 56 -44 -87 -91 -238 -144 -202 -63 -136 -272 -86 63 16 -50 17 50 164 115 263 201 153 155 -85
1802 -85 -76 -58 105 -167 38 6 -11 72 100 -51 -59 111 13 -140 -125 62 -87 -116 -159 -186 -90 8 34 -47 -52 251 -4
1829 -4 -57 -74 58 -134 -112 29 -119 110 8 -14 55 44 111 -132 17 185 95 -38 -101 64 -38 62 53 -105
1853 -105 -18 114 -22 -42 -41 101 -40 -100 26 -128 18 43 48 -44 107 148 -74 -145 4 151 -1 33 73 -27
1877 -27 25 97 -213 13 159 -102 -60 -31 80 -137 -57 -25 -208 -37 69 99 -161 164 186 -23 -25 118 43 -12
1901 -12 -63 62 -38 -22 48 -203 -89 116 51 -109 139 90 32 200 -34 -67 -25 153 -19 -204 14 74 -142
1924 -142 -66 14 51 -46 79 50 -122 20 166 -55 -193 152 32 -33 -138 30 -18 -3 120 -253 -75 167 112
1947 112 -235 15 209 -80 -97 103 58 -19 55 19 -182 22 35 -4 -45 44 135 -107 -62 -1 65 -97 101 -95
1971 -95 -18 179 24 -166 -117 111 -66 -95 3 41 -32 77 -17 -85 109 199 172 -98 158 37 -8 -38 -30 -135 -60
1996 -60 98 -74 -154 34 58 -94 112 108 55 -207 128 9 -26 -24 49 -110 113 16 -40 -87 79 36 -36 -68 22 -164
2022 -164 -57 74 -89 -69 81 182 -179 -48 93 74 -31 77 -6 -7 142 134 -189 -138 173 -40 -228 33 63
2045 63 0 -30 -45 -70 -10 104 -131 22 79 59 -9 -74 61 144 25 124 3 -67 -36 15 -127 -54 177 -63 8 55
2071 55 174 -99 89 83 -85 6 166 75 -127 -59 147 -56 53 87 15 35 65 163 -32 67 114 -102 -113 89 82
2096 82 -173 -58 35 19 17 73 37 96 10 -33 -50 -15 39 -94 -5 -41 37 -55 43 3 -91 1 137 15 -52 18 117 -80
2124 -80 36 41 79 55 -56 -38 -69 51 -21 -15 -43 96 -65 -39 -23 84 -5 -9 -32 -40 -21 183 15 -105 93 72 -33
2151 -33 -90 -72 -41 41 -94 63 47 65 0 -39 -59 108 -4 -25 120 108 -2 -26 -37 -96 -111 151 14 -50 82 2
2177 2 39 -44 -147 43 -119 87 -111 -67 74 59 66 -158 15 -4 9 -53 -31 46 163 -8 -77 -18 21 101 13 29
2203 29 -27 43 3 146 -56 -139 24 -24 -50 30 146 -6 96 112 71 -3 -94 42 -96 33 19 -12 -3 13 41 -117
2229 -117 -12 132 30 73 -19 -56 39 -4 27 -6 26 4 22 -10 20 79 -89 97 -18 19 34 9 -2 41 18 -84
2255 -84 -51 -71 -93 -74 114 -101 52 -123 16 41 -155 17 -129 -34 -20 132 48 -76 44 -23 8 -20 44 -12 -97
2280 -97 51 -27 27 -19 -24 -123 -41 -15 42 128 5 99 -70 0 -6 91 12 56 27 -67 45 -58 -31 11 -3 -122 2 43
2308 43 -60 52 32 16 -62 4 64 72 -27 -18 -43 -20 -11 -44 -71 -59 -30 -36 -71 2 -79 25 61 -33 -130 -68 133 -24 -18 80
2338 80 -81 50 6 -32 -87 16 61 95 -60 -92 -73 -101 -53 17 81 -3 169 238 42 113 142 -11 42 109 -27 -28 22
2365 22 -15 82 -49 59 183 -168 27 -55 40 114 31 4 43 -113 -150 0 10 60 -53 84 71 136 -97 101 -10
2390 -10 131 -50 30 16 -39 -103 38 -65 -1 119 -76 118 43 -115 6 -8 -25 -169 52 53 -76 -50 73 -74
2414 -74 -67 -66 -59 27 -19 10 34 73 97 22 -9 25 30 50 3 7 -18 123 69 57 -31 47 -117 20 -72 6 -8 35 -6 -69 91
2445 91 -44 54 -55 -57 34 14 -19 57 -47 -44 23 38 -80 -82 -62 -39 -47 -83 -5 -120 24 108 -138 -63 88 35 94 112
2473 112 15 67 -144 26 -6 -12 22 -23 21 -34 -64 2 13 -41 63 -102 -44 74 -50 26 61 -123 -21 59 -63 -1
2499 -1 -45 35 -52 -111 45 -13 21 27 124 -61 38 45 -37 -6 -23 -73 -79 48 25 0 -92 -15 52 -28 24 -8 104 -2 99
2528 99 61 -55 147 -17 -10 19 -53 0 -76 -19 -77 -30 -50 -10 -77 48 -6 -48 5 44 93 -65 -59 -19 -146 48 64 7
2556 7 49 -78 94 -60 -25 11 -21 -112 36 -37 61 -57 40 -102 -55 17 115 -49 -74 -44 25 96 70 -6 -22 117 -19
2583 -19 67 105 -55 -111 -63 69 74 -10 15 76 -36 36 108 36 -16 -5 -25 -41 -88 88 49 37 9 -85 -28 6 21 -81
2611 -81 61 19 65 50 -2 -29 44 3 77 -72 -17 -31 -26 -40 155 26 -68 45 -10 22 8 63 14 41 18 -45 8 112
2639 112 82 -44 33 98 -61 41 23 -119 -13 -34 -10 -25 -37 -9 71 -116 95 39 -51 -32 103 -36 -36 57 88 -68
2665 -68 36 -62 -10 86 -52 67 93 -29 -99 77 32 45 69 90 81 70 -8 -1 -22 10 18 -1 -141 13 52 -25 -45 -82
2693 -82 93 -23 6 37 -23 37 26 -55 -66 49 16 49 -10 58 -61 -64 19 99 -36 -11 -133 5 -38 -11 73 -22 89
2720 89 24 -12 -4 45 -42 -18 -40 98 -101 5 142 123 60 56 37 -17 -52 17 22 52 -40 -3 91 62 8 18 -72 -34 33 31
2750 31 -11 -98 -44 -55 30 -81 -6 -26 96 109 43 -52 -20 -1 -48 11 56 -7 79 -62 -13 -46 -119 108 6 -80 -86 68
2778 68 -23 -5 47 -101 11 -17 -37 35 -84 -102 73 -45 -15 63 -20 -20 19 25 -37 35 -6 -11 2 13 1 68 5 -63 27
2807 27 110 -177 63 -56 18 16 93 39 13 36 -67 60 24 27 43 -18 153 22 56 -111 75 58 -33 -22 -71 -22 29
2834 29 101 5 55 -46 -94 -89 -31 89 -114 -13 34 79 -46 -25 61 -60 148 -51 -14 -62 -20 22 157 39 -62
2859 -62 86 -61 -81 -44 -40 -85 -6 40 -80 -13 -51 -5 31 -69 -85 -34 -88 -85 -56 -11 -92 30 -39 6 -55 -35 8 23 -67
2888 -67 16 -27 -88 -17 43 -36 -19 26 12 58 109 -29 148 93 15 76 -92 -5 -87 -41 -7 23 -15 -73 65 150 -81 4
2916 4 -21 -91 6 -60 -110 47 97 -65 -80 -2 113 -112 45 43 76 78 11 43 38 -42 35 -66 7 -156 -85 31 32 13 -6
2945 -6 -59 37 38 -9 32 -49 6 44 -43 -56 -60 43 -44 -39 -75 -64 8 25 -21 -42 16 7 -19 -31 21 28 -44 29 -5 109 -59 36
2977 36 -73 -88 52 22 -55 -30 55 -39 34 36 19 -76 -31 -23 112 -17 -72 -58 23 62 -4 70 83 -98 -89 45 12 -16 42
3006 42 -16 65 -77 -18 14 -43 23 -2 77 12 -116 103 -12 10 -27 -19 -34 36 -13 -58 -5 -78 17 10 -69 98 23 44 -73
3035 -73 -32 -63 -44 -25 29 -62 6 48 -18 -81 15 76 -48 26 108 55 -17 28 10 76 68 25 15 -71 -102 49 90 13 -123
3064 -123 -39 18 -21 24 -72 -85 51 51 -80 43 18 -51 13 15 132 18 20 -76 6 12 -69 -73 -53 25 10 72 31 50 -38 -94
3094 -94 -29 16 -178 -35 -31 39 -74 -67 23 -45 -75 -1 -16 -80 -54 -57 -55 -43 -20 67 82 87 44 68 -6 -31 -105 46 -35 8 23
3125 23 98 -45 39 126 -69 62 -75 104 -78 11 -135 31 -2 22 -14 41 17 -62 41 -6 -89 154 29 24 14
3150 14 -7 57 37 -38 -12 -13 61 51 -50 46 77 24 -17 -47 -107 2 -29 -30 -151 6 47 39 4 32 67 -83 28 -72
3178 -72 -45 44 10 21 46 50 69 118 15 32 21 55 66 -88 58 106 -57 45 -14 -57 -1 15 -38 20 -85 37 -58
3205 -58 21 -63 -6 -12 12 47 38 6 -59 -6 -2 15 77 13 57 -57 -45 20 15 -120 -15 -19 2 -71 56 29 47 -27 18 -26 10
3236 10 10 37 -23 -116 8 61 28 191 72 -91 24 50 -52 -38 -48 -53 -11 -100 65 -32 65 -68 -138 -27 -44 -83 139
3263 139 68 23 13 24 48 -38 51 17 -61 58 57 24 -14 72 68 -42 31 -66 98 -2 -19 101 -5 -38 70 -17 33
3290 33 24 20 -107 -21 -85 -18 -28 105 130 -80 73 19 -67 -18 6 -9 -41 -88 28 -9 -44 50 -123 39 12 -20 -52 -35
3318 -35 21 -69 84 76 -10 -88 43 -26 -10 54 7 -10 -36 -13 -59 -42 -26 6 46 17 -12 -52 64 43 -68 40 -2 50
3346 50 -23 -13 33 -23 -109 15 -123 79 11 57 6 92 86 72 79 -59 95 -4 -122 109 -23 34 5 70 -11 200 45
3373 45 -78 78 14 98 68 116 -14 57 -2 74 5 -71 84 -18 -6 46 85 -83 -35 -31 -37 52 28 13 28 30 11 64 64
3402 64 -125 -60 -100 -45 -81 -106 76 29 16 -65 -105 40 63 43 -84 -71 101 64 -109 30 36 81 -107 -38 92 -101
3428 -101 -87 -21 21 -40 -27 -38 -68 100 -70 9 -146 -46 17 -4 85 34 21 -24 6 68 -41 -4 -11 17 -18 -8 -72 -17
3456 -17 29 33 49 -105 139 -9 -27 73 -117 62 17 -31 -14 88 -102 -55 79 26 -36 -138 81 82 76 100 -41 -59
3482 -59 31 -21 -56 58 57 -77 -10 48 16 -6 24 -85 -11 32 169 1 -82 -114 -46 -73 -47 47 80 -70 -4 57 13 -21
3510 -21 30 -88 14 -11 -3 -45 60 -24 -136 83 123 86 -27 38 41 -57 -12 -11 -30 46 -52 38 -102 -52 -1 78 -13 -7 62
3539 62 7 -41 -50 33 -39 22 -34 -95 39 -68 57 -17 77 31 68 100 50 -78 35 -111 15 -47 4 86 42 41 -86
3566 -86 -65 51 -19 -21 -9 72 -56 20 1 -49 94 -105 -27 134 -71 -76 53 -139 3 -71 -66 -10 -92 -22 -76 -64 16
3593 16 -21 -10 57 -19 100 -34 -35 58 10 75 15 94 12 -13 -57 159 -36 32 -6 -49 7 -22 38 -124 94 53 58 46
3621 46 -59 36 -11 17 32 -67 -125 -2 -47 10 -81 67 -22 54 1 -67 -16 74 -14 -46 -11 -68 -2 17 38 44 -35 -72 94
3650 94 -46 -71 113 2 6 -40 -87 -55 -39 -50 163 -6 -21 7 51 75 -56 -6 73 128 -12 -63 -6 50 93 93 122 -26
3678 -26 97 1 71 -19 -136 -49 3 -36 68 79 -28 -4 -113 -98 -58 40 72 -55 -33 -17 -20 -2 13 -36 13 -25 -34 -13
3706 -13 -19 -62 7 -49 21 -3 -121 -73 63 0 -9 -62 14 -45 43 -131 8 110 1 -91 -47 -82 -14 -107 78 -19 7 -65
3734 -65 -16 -25 -13 110 -10 135 12 44 -50 -2 -85 -16 74 28 10 -29 75 5 82 -37 12 6 -49 -32 -27 0 21 124
3762 124 38 41 -5 -118 -119 -22 95 67 95 24 -15 -47 6 -77 65 -13 -2 -3 97 17 -36 100 94 -21 24 29 -34 44 -2
3791 -2 -13 12 -42 74 -160 28 -27 -122 -95 -47 110 -20 36 21 -20 2 37 26 46 90 -66 63 -3 18 33 36 -55 55
3819 55 -50 19 -30 -48 -30 12 1 12 90 60 97 100 100 -42 -27 27 -33 -39 2 56 26 42 67 -85 -57 22 -31 -22 12 -45 73
3850 73 -39 34 53 -228 20 -55 -86 -92 62 19 -130 66 78 -26 16 4 9 48 52 124 31 48 75 -91 -80 31 -101
3877 -101 -87 101 16 30 -70 93 60 20 -13 -39 131 -23 11 1 -40 26 -38 58 40 -39 -23 -5 -53 -15 26 -39 34
3904 34 -102 5 -106 40 58 47 59 34 -70 119 -76 -8 -24 120 -40 81 60 15 91 -67 102 73 -44 -90
3928 -90 -4 32 97 85 7 -16 -66 -29 -11 -101 37 -32 -24 133 -38 -6 -9 -135 -21 -11 8 55 -2 -14 45 -31 -74 -1 70
3957 70 27 46 63 129 -178 64 87 -20 -4 -66 -39 30 49 4 -84 42 -48 -9 -39 -35 -10 -86 -12 -146 175 62 -32
3984 -32 -4 88 60 79 32 15 -55 72 82 17 -67 108 81 29 25 -66 -13 33 -53 69 71 -88 101 -5 82 -71 26 -22
4012 -22 33 85 72 -6 -74 -2 69 -77 -85 -5 -10 94 80 -29 -19 5 -28 85 -12 27 -77 -24 -20 14 59 -38 32 -38 38
4041 38 31 11 -46 48 -35 -52 38 -4 -53 -3 -15 39 34 152 61 42 154 -98 111 -171 90 84 -1 39 -41 44 22 18 -42
4070 -42 -17 70 -91 96 51 -9 -26 -29 18 -4 4 -62 -11 -29 17 -15 -85 -26 24 36 -109 1 121 -115 26 64 -64
4097 -64 22 -26 95 -8 10 23 21 45 84 -50 77 54 28 53 70 -33 8 16 31 59 -50 7 72 -97 162 15 68
4124 68 30 -18 73 -7 -23 -3 82 106 100 16 -64 29 137 -46 -18 -8 -9 21 31 3 71 110 54 20 -2 125 3 -51 52
4153 52 -40 124 19 60 -19 -4 71 -57 -90 130 41 72 -21 25 -13 -10 -9 1 -38 -74 50 5 28 -101 -46 -46 -35 17 66
4182 66 28 -73 29 -61 -29 -11 -9 -32 50 -22 -105 11 -11 35 7 66 -115 19 108 29 128 91 -5 87 -42 37 -5 12
4210 12 45 -52 32 -59 179 -17 -92 -168 55 -10 36 65 78 -25 20 -100 -42 47 34 27 19 96 -2 43 -7 -78 39 -1
4238 -1 120 -45 -26 79 8 92 -39 55 25 -23 -98 -46 101 55 -71 20 -84 87 1 37 -10 -102 -64 101 20 -58
4264 -58 -61 -40 53 -94 63 -14 138 40 63 -50 12 16 -40 91 58 -92 46 44 24 117 -117 45 -44 -90 63 -32 165
4291 165 -38 59 -36 -29 7 64 90 -10 -115 111 47 5 -86 -21 40 -66 16 42 7 -2 -153 77 -10 44 82 -10 -32
4318 -32 27 20 16 25 -44 -23 5 71 -73 34 20 -97 9 16 -93 -25 62 -59 -75 -12 -62 -5 -41 -68 -5 -84 77 12 -72
4347 -72 32 -135 38 -23 -18 61 24 -76 -53 -57 -59 -86 17 -115 -33 -10 69 -55 -81 14 -118 -16 21 70 -146 20
4373 20 23 -37 -17 16 -76 26 8 -97 -15 60 -158 3 77 -62 39 -9 -93 -44 35 3 -56 54 143 41 -198 -49
4399 -49 -30 -31 -88 -80 -45 -22 36 28 54 60 11 -52 71 103 88 30 17 24 31 97 73 -8 -40 64 15 9 -78 -30 23 31 -93 2 1
4432 1 -34 -29 12 -29 -33 -63 28 35 34 -30 65 68 49 24 -87 48 -49 -26 -55 -91 -2 27 -125 -96 49 -9 -9 -63 60 8 62
4463 62 91 -16 -9 -147 -24 21 -108 2 77 103 25 73 54 -73 -48 5 65 49 55 -14 -11 26 77 11 53 -22 -98 3
4491 3 83 31 54 92 -91 0 117 66 120 -123 -61 28 39 106 38 11 63 -10 -27 -13 17 48 -17 103 -86 -30 -133 -72
4519 -72 25 -20 25 -34 -95 -55 -43 6 20 48 -10 37 -59 -51 21 41 -68 63 39 33 -62 43 22 22 -48 -44 -36 -63 3 40 5
4550 5 -48 55 70 -72 -16 38 33 22 -103 42 -107 -63 14 -6 -2 58 41 -4 103 -74 65 -20 -126 21 -27 156
4576 156 -13 62 80 45 96 104 45 -72 45 1 -35 80 86 13 -78 -72 56 62 62 171 11 24 27 -27 52 -42 104 1
4604 1 49 83 22 -7 -50 -21 -132 -42 98 143 -58 -141 67 115 24 10 71 -37 -50 20 -13 -48 17 -156 -65 -27 -27 -25 88
4633 88 -63 118 57 -7 13 -39 33 -52 -1 52 105 12 13 18 11 -98 16 -3 -115 -70 69 -76 -62 -25 9 24 50 -60
4661 -60 -82 15 -58 -4 96 22 77 -27 -29 -52 -152 -56 -23 -45 -8 0 -45 57 15 69 -11 -25 -57 26 58 5 42 41 -35 -65
4691 -65 36 -28 -27 4 46 -102 131 33 81 65 49 128 24 26 42 43 -4 19 -50 25 32 125 -41 33 51 -12 -74 -81 -22 -37
4721 -37 -77 -87 -82 -4 -80 6 -24 -128 -13 20 -126 77 37 9 40 68 -60 -83 -71 9 13 -14 56 -69 6 28 12 43
4749 43 -48 35 26 -17 56 -28 -30 -7 -99 10 -121 4 -4 23 27 -44 57 -53 -5 -69 -91 -102 3 29 80 -36 -102 -174 -61
4778 -61 -21 35 4 6 45 -49 80 0 35 -64 171 -78 6 -26 -49 24 -10 -65 56 -44 30 23 -20 59 33 -15 70 -1 -39
4807 -39 42 -17 -151 -41 32 -45 24 18 5 -56 -12 -39 -31 3 -4 43 -18 -55 31 9 -14 -27 -32 -21 -93 -25 11 -123 44 11
4837 11 72 -84 -56 -39 43 54 23 66 1 79 -40 -26 62 70 -27 -28 -22 -18 11 -14 -1 -7 36 -5 -73 19 82 7 -59 -41 41 66
4869 66 -46 23 -8 126 34 -12 -40 -16 41 4 -82 -56 -65 -33 41 -11 118 -2 99 25 32 -36 -3 -34 -2 35 136 34
4897 34 150 45 45 56 2 -11 -41 31 25 4 -44 -3 -113 20 41 60 -24 -52 18 -46 94 -90 -21 -4 -37 12 -12 -47
4925 -47 14 81 -38 -76 -9 -18 -3 75 -92 -150 44 28 -95 34 69 90 -39 63 -93 26 -146 -23 90 -89
4949 -89 14 -50 -58 -103 7 50 -17 -8 36 16 60 -124 43 111 10 63 21 70 2 31 42 -9 -7 160 60 5 63 23
4977 23 129 -94 23 -25 -28 52 133 -22 97 5 -3 -25 60 71 6 38 24 30 -67 83 119 -156 -56 -48 13 -9 36 -84
5005 -84 -10 -27 54 23 -79 68 6 82 78 18 33 97 -25 -26 -22 58 -15 -33 -23 65 -55 50 4 57 -9 -101 60 45 -61
5034 -61 -58 116 9 -17 53 -56 -15 25 -57 36 44 166 20 40 -40 66 69 -18 79 -82 31 46 -99 99 -10 -67
5060 -67 15 122 54 -4 90 31 3 4 48 -70 -70 75 -20 -14 -85 65 -27 -66 122 -76 62 115 0 23 -55 7 -32 -13
5088 -13 20 -22 52 51 34 -2 -58 97 -5 11 -92 87 30 -102 34 12 -18 -24 160 94 65 31 22 8 -23 18 -4 1 40
5117 40 -130 26 -51 -24 12 1 82 20 -75 10 72 43 29 56 39 104 18 -64 4 81 30 -66 110 24 99 -38 34 -64
5145 -64 -25 -168 -85 122 -65 -43 33 48 -17 -39 34 64 -75 11 -48 9 130 111 44 -98 18 104 33 -51 20 0 -31
5172 -31 42 -21 38 -53 116 96 76 17 85 47 30 148 9 -121 -66 -14 -67 28 138 6 -33 33 42 -53 -115 -92 35
5199 35 -93 -56 -9 -126 -70 61 -35 44 104 95 -14 5 45 15 0 25 -134 -70 5 -22 48 102 14 86 -12 108 30 -41
5227 -41 99 -49 46 -64 -135 -69 44 -17 43 -53 19 -19 106 56 -3 -106 -42 111 33 13 -15 -86 46 91 -70 -56
5253 -56 64 39 -17 93 -9 3 -6 -75 10 -17 -92 -29 70 -128 14 -30 -24 75 106 -40 -57 47 6 65 15 -10 68 -33
5281 -33 56 5 -80 44 -123 39 100 47 58 -87 34 43 -99 98 16 -29 104 13 59 -30 -55 9 60 -31 -10 104
5307 104 90 16 -2 -9 69 0 -171 -27 16 -21 -49 71 -70 -55 0 69 -95 22 12 81 7 2 18 73 -43 -13 17
5334 17 -39 49 -8 25 -36 117 -54 25 79 -3 -22 89 -30 -5 -56 -3 5 24 19 -80 34 34 130 12 50 -4 84 128 19
5363 19 5 -13 -83 95 25 20 -62 6 -80 29 13 -60 -117 -95 11 -19 72 -76 -81 81 -20 81 -96 80 7 -50 17
5390 17 -19 -34 53 49 -124 2 -59 34 -35 43 -26 3 16 -39 126 6 -74 34 -41 -106 -72 -16 33 51 75 37 -78 15
5418 15 -25 55 -33 1 9 34 -21 2 -15 41 71 9 -39 -65 -5 55 86 30 7 -44 79 -23 1 17 -22 109 -30 -109 -3
5447 -3 -5 -114 -28 50 25 -20 167 53 33 -111 -41 49 4 15 -72 -50 147 115 -1 76 7 148 -31 -82 -33 -56 47
5474 47 106 -110 -44 24 86 6 -16 79 22 -44 -14 23 25 -91 47 12 -17 -26 54 89 54 -64 -35 33 -20 10 27 64 87
5503 87 26 78 66 -96 11 -30 -35 -29 30 60 -61 -99 -88 18 -13 -9 40 7 15 30 53 22 27 51 -7 72 68 -3 -67 -22 17
5534 17 -84 -37 -34 38 -94 -78 113 -33 56 -17 86 24 30 37 -19 31 34 -104 -40 -65 -64 123 -31 42 5 -24 -36 48 33
5563 33 26 -99 6 15 -38 -90 53 4 -39 -33 69 81 108 165 -66 -2 -26 18 21 4 12 14 2 1 21 -54 -30 -131 1 -119
5593 -119 -67 -5 22 95 -61 18 -73 45 90 -19 14 -20 46 66 -19 -48 -28 -46 -70 -38 -3 -147 -44 -27 -107 23 -31
5620 -31 -96 -68 26 40 -6 -24 -41 -45 15 73 -31 73 -66 -165 26 80 125 -59 81 -52 -19 36 -29 71 89 -114
5646 -114 24 18 -66 -32 -11 -38 -15 -26 -42 36 -47 -14 -92 -107 35 134 103 -148 -46 51 -12 -36 20 7 91 89 -17 40
5674 40 -8 66 -86 31 4 -67 93 -9 -90 -59 30 -27 120 -13 119 37 -72 1 -56 59 -15 98 28 -6 18
5699 18 98 -88 18 1 -110 -8 -29 -8 -68 -49 -147 22 22 9 57 49 22 -87 12 91 33 -58 -10 78 34 -31 0 53
5727 53 -26 -108 -136 -63 -9 -1 86 10 -40 9 30 86 74 19 -48 -2 -15 -74 5 12 97 29 54 -56 -25 23 -54 122 53 -122
5757 -122 54 92 -56 42 10 -45 14 8 53 61 -66 -138 -90 -65 -56 2 -16 6 -43 54 -48 -1 58 -12 -34 31 -23 -48 -18
5786 -18 2 -21 8 -31 -48 -24 -15 0 48 27 -10 -38 2 -102 30 62 36 -30 -171 14 -60 46 116 -10 -38 6 -80 -86
5814 -86 33 6 -9 -46 -49 56 -101 -34 72 10 25 -155 41 -67 -58 -30 -137 -57 20 -36 -10 23 2 126 40 -50 54
5841 54 1 4 46 -30 101 -6 -130 -63 -32 -35 49 92 -48 3 -48 84 -15 0 97 126 -12 -30 -65 -10 35 29 -17 -41 45
5870 45 -16 -24 96 67 -46 17 59 1 -51 -54 -62 -27 -8 131 15 38 -37 -3 115 -19 -60 25 -55 -9 -34 19 69 86 -90
5899 -90 75 -75 -22 -54 -92 -133 35 21 -27 -19 52 -25 -43 133 -13 -26 15 98 -87 88 -61 43 -52 55 34 -37
5925 -37 91 -65 -136 2 -47 -58 -17 42 47 102 1 -105 21 14 52 -15 57 22 43 29 -61 -69 -12 38 -30 -8 41 -132
5953 -132 41 52 15 23 40 125 0 -87 -26 -56 -116 -70 -51 158 3 14 86 -5 56 -28 -185 -12 -28 -138 -17 61
5979 61 -25 -7 -16 -65 -2 -57 -58 -28 73 -127 94 4 114 -4 -100 131 -76 -25 -33 99 -42 -120 -31 -19 -47 48 79
6006 79 -27 24 115 29 56 38 -30 -56 -66 61 -11 -59 11 -57 -40 -35 94 97 1 -13 77 -64 50 -32 69 10 -51 -7
6034 -7 -59 -52 -111 115 7 -14 52 -7 -7 -112 2 0 -137 70 13 27 -14 30 121 -59 -39 32 -9 14 25 124 13 -74
6062 -74 -45 -29 48 -43 27 5 -38 84 -41 -9 89 11 -11 63 31 -12 4 -22 15 -9 -52 58 -15 4 37 -73 80 -114
6090 -114 124 45 7 33 101 -16 -57 44 75 20 21 55 23 -133 -61 -56 -25 0 -64 47 54 -29 33 40 -65 22 43 -80
6118 -80 36 -32 61 -13 50 -87 -65 -38 43 -5 135 1 95 111 -22 35 -138 -22 -37 -8 46 83 -30 56 36 63
6144 63 -56 -70 -84 -25 43 46 -23 -18 129 -28 -43 -128 -29 86 -51 -68 -64 -185 13 33 96 131 -67 -66 -32 51 54 -32 -30
6173 -30 -50 13 -103 28 -23 -15 63 52 -46 19 9 -23 -10 50 -84 40 32 20 -35 19 -26 -62 51 -26 88 62 82 80 33
6202 33 -78 64 182 4 43 -53 -50 -26 -91 0 55 -20 16 -158 -52 106 -17 -49 -83 1 -128 45 72 94 12 -31
6228 -31 4 34 -123 -45 27 -76 13 -66 65 -86 -96 36 91 21 -14 43 64 -4 -36 -80 51 -21 -18 2 -52 -14 -34 -4
6256 -4 -73 -92 -81 -50 -29 -22 60 80 27 68 -47 104 2 25 -40 -72 -19 10 103 12 -8 2 65 -27 -44 96 30 -4 38
6285 38 -50 -96 4 12 -79 -68 13 -57 -27 -30 65 -29 -17 -31 5 -74 -75 -5 35 11 -76 53 -80 -71 6 8 82 -88 -12 -51 -33
6316 -33 1 -24 -37 6 21 16 -142 17 -1 30 60 100 88 157 -73 78 5 -34 76 97 -52 -118 45 -15 44 -19 99
6343 99 35 49 -22 2 -116 -63 -3 -99 0 20 42 54 -26 -2 55 21 10 21 -176 -78 15 -26 110 -14 -18 -92 -96 -19 16
6372 16 35 24 -11 -13 -43 26 10 2 -13 -69 -44 4 -17 -50 -23 26 62 117 -62 -43 13 -94 -49 76 18 3 -11 -34 53 -25
6402 -25 -19 -49 -42 -27 -44 94 70 -83 48 62 4 -25 -85 11 104 -3 -28 -74 150 49 65 112 -9 -61 -37 -12 -51 105
6430 105 56 -63 -44 -8 -24 -85 56 84 -13 -28 127 -3 -104 48 12 69 -45 38 -51 9 9 -30 42 5 35 71 -90
6457 -90 -76 -54 12 -15 44 24 21 26 21 -20 77 -23 91 31 2 -59 -86 -30 -31 92 37 64 -70 -14 -44 -19 -73 97 96 56
6487 56 -45 36 -83 53 7 -60 -55 -78 83 -17 38 26 69 -12 -36 23 -15 -60 -7 4 -65 -36 1 -25 9 11 25 13 78
6516 78 -30 4 -47 -61 18 -35 -78 -44 61 -23 57 41 98 -77 19 -11 57 -23 11 -15 -29 4 49 82 1 145 118 -59
6544 -59 -47 -11 -35 98 -16 104 -33 -93 -44 13 -29 16 -16 22 23 7 36 39 -26 18 -35 -39 -62 -41 -45 -1 4 -56 -32 53 6
6575 6 -72 24 -8 10 -18 122 14 11 -34 -1 37 -48 92 -13 -49 -49 -119 138 47 128 15 58 152 7 -1 65 -86 -13
6603 -13 118 12 -18 -4 -37 33 123 5 -25 -1 24 -53 -25 84 58 -55 -67 32 -105 29 -8 -50 25 -82 -37 52
6629 52 -7 -17 2 20 -65 75 -36 53 -88 22 142 -7 109 196 -47 2 -8 79 80 0 163 31 25 -112 -64 108
6655 108 78 13 57 65 0 27 -11 -3 -13 -2 -56 15 -9 -35 3 102 5 54 -37 121 67 25 -102 -53 40 59 -76 -28 -27 25
6685 25 -25 -99 -64 -68 0 24 -10 -73 20 184 76 45 65 -32 -6 93 16 60 -24 -14 -84 91 31 98 -26 -7 4 37 42
6714 42 17 33 85 17 -44 5 -41 -57 34 4 20 -23 29 -11 -69 -26 20 38 -17 -55 12 -63 6 25 -5 -7 -77 -63 -52 64
6744 64 -16 37 48 -49 -41 37 70 -20 6 79 -38 18 -9 -69 -26 10 -115 37 -31 -88 21 79 0 -24 74 18 104 -3
6772 -3 -85 45 58 -28 -94 -30 15 98 -73 7 -105 96 -43 49 100 79 12 -54 93 5 112 41 91 -11 -67 38
6798 38 149 -73 -19 -165 56 1 95 37 78 -10 -85 101 44 118 34 -14 -33 59 72 -68 -73 -71 42 75 -54 57 50
6825 50 96 -24 226 -14 2 3 51 64 61 -101 82 -48 -39 -23 -25 -86 -24 -40 77 42 1 75 -101 67 -97 -9 30
6852 30 40 18 -32 -33 -4 108 34 -66 -81 89 33 -50 -120 32 -27 138 -11 -35 -91 12 10 15 -9 32 25 -40 -80 -9 19
6881 19 158 54 176 -122 12 -35 19 -136 -70 -81 59 96 25 -163 -41 94 -1 13 21 31 -35 -5 21 -82 8
6906 8 56 63 70 -33 89 167 0 52 93 -49 32 131 0 -52 131 129 117 -17 8 82 -52 6 -43 -1 -34 -64 -40 -9
6934 -9 42 22 -43 -47 7 34 -43 -14 -22 37 85 58 76 123 0 -20 0 -100 67 -4 -77 89 81 -79 -77 -74 48 1 97 8
6964 8 90 1 -4 -32 70 22 -72 -175 -49 -114 53 -14 -82 33 -45 -78 -30 76 24 -41 67 -89 -40 105 41 30 -82
6991 -82 -25 94 125 4 59 98 -43 -85 43 -34 -28 -71 100 -67 47 -43 78 -44 33 -145 3 5 53 28 164
7016 164 83 75 15 46 18 -21 -12 26 114 13 73 -71 16 37 25 -9 -15 2 -31 -15 -30 -24 37 78 -126 50 17 125 99
7045 99 -27 -50 -6 -34 -62 -96 124 -124 71 16 -9 43 -20 8 11 9 -87 -33 3 -179 -120 127 11 -50 8 -13 28 -13
7073 -13 82 -68 -80 89 39 -63 62 1 20 37 -17 -4 41 -53 73 -46 -7 71 -17 15 -110 -6 -58 -93 21 -28
7099 -28 9 104 40 21 -51 -71 24 16 -11 -50 52 -30 12 3 8 -31 29 -33 -27 -18 -39 71 30 11 -48 -46 32 -31 48 -70 -62 22
7131 22 -86 -82 -104 126 -53 -58 101 43 -41 -80 -81 29 -112 -142 99 63 47 -45 -2 -13 -63 -7 -73 71 -106 57 -83
7158 -83 29 13 -28 53 -6 72 37 18 53 73 -82 25 55 -28 -36 -43 35 128 32 -65 66 -15 -48 68 -45 11 -61 -16
7186 -16 -12 29 -23 -106 40 42 45 88 -20 -17 2 -8 -8 3 -62 -81 87 51 10 -14 -51 55 65 -41 -30 -70 15 -8 -12 11 38
7217 38 40 63 23 -4 35 -42 31 19 -44 3 -84 71 -54 -70 74 14 -15 11 49 14 -116 -42 -38 24 -10 -21 53 5 52
7246 52 -43 -98 55 -75 -109 21 76 46 35 -96 -50 -127 -11 -105 -30 131 118 26 13 7 -44 40 -108 -34 -99 39 11
7273 11 129 -135 158 -62 -2 -14 10 -46 18 -51 -48 25 -11 28 45 103 71 67 -82 3 27 45 -9 -69 54 104 55 -106
7301 -106 -51 -92 -38 -16 -23 -29 -36 79 13 7 -36 -44 -11 91 -119 -103 -10 -1 -78 -10 -2 33 -120 -83 -78 175 23 -28 31 87 -34
7332 -34 -98 55 -16 -58 -60 85 58 9 -70 7 -112 -71 33 13 -71 -26 -104 22 10 -5 -14 3 13 10 -15 -51 12 36 -60
7361 -60 41 8 -42 -14 -32 -77 -5 18 1 -53 50 -53 22 55 -30 66 -19 36 -49 -34 -34 40 34 -100 16 82 -10 6 -10
7390 -10 -43 -13 91 -53 -56 45 -93 96 -54 88 -135 70 -44 -38 118 24 8 52 55 -55 74 -70 -17 125
7414 125 101 -12 100 -108 79 -34 -70 72 73 -38 13 32 -23 57 -68 19 -83 18 72 -6 -3 -45 -64 33 8 -92
7440 -92 -46 83 -4 -67 10 -29 78 17 -113 15 31 -16 -36 47 127 -108 -28 124 -95 18 47 -47 -47 -47 -33 -95 -39
7467 -39 49 61 -44 10 83 17 -17 42 -27 -39 112 66 -61 -28 18 -122 93 -19 -10 22 30 -25 -22 -82 -25 -25 58 2 -25
7496 -25 3 -16 -43 -22 14 55 11 61 106 29 -52 59 -2 -90 8 -95 18 27 -71 66 36 -25 -168 11 63 73 -62
7523 -62 34 38 73 -45 69 -95 -48 -35 -16 85 -17 -112 28 45 -20 35 33 22 -77 34 7 -17 -6 82 -37 60 -21
7550 -21 -87 52 -69 30 138 -101 0 -13 -4 -63 3 51 -108 11 -79 -47 -90 -44 -33 38 18 32 -96 -74 -30 -101 31
7577 31 -15 -35 -84 61 34 -7 3 20 27 -25 102 -82 -23 12 -119 -24 8 43 -55 6 73 -128 23 -18 -4 -39 51 6
7605 6 -24 -1 62 26 -1 30 16 4 -68 -43 -97 -24 -61 -13 84 -35 37 -113 88 39 -65 -24 22 23 9 -30 -37 62 -197
7634 -197 2 5 69 13 31 7 51 18 1 -23 26 63 12 -34 -69 -77 -61 11 -60 -55 -76 48 43 -24 7 -58 -33 -2 55 18 -59
7665 -59 22 -20 -26 -6 13 -69 17 -35 -1 14 44 -10 -94 -33 -40 -29 10 33 31 15 -32 41 45 -70 5 10 34 113 7 3 2 42 15
7698 15 -39 -104 112 56 -49 57 27 -34 -54 -39 -34 -19 68 -3 49 116 22 20 49 122 -74 123 32 -8 46 31 -29 -16 -75
7727 -75 40 -32 -17 62 -103 -2 -5 19 10 -78 -34 56 11 39 -86 -87 38 30 -56 -58 34 18 41 -119 -30 -7 13 56 12 1
7757 1 -26 53 -4 52 36 -50 -17 -61 8 -4 -26 -50 48 -116 -47 -84 -47 107 116 35 1 82 -119 -28 32 -10 65 -46 80
7786 80 -45 98 94 -77 45 -1 12 68 36 -58 -40 115 20 -34 15 -8 120 65 16 -69 -5 55 58 53 16 -44 72 -6
7814 -6 -97 28 75 163 96 17 -73 28 -15 -3 77 1 -28 -20 -30 -63 115 -42 57 3 -38 25 -22 71 0 -26 24 20 -54 -25
7844 -25 7 84 -130 43 -36 -37 39 -4 -11 -13 30 -119 43 10 -14 -66 -80 -88 -44 28 -30 -6 38 -14 71 22 -54 48 60 49
7874 49 -30 -106 -40 -118 2 -72 -42 24 18 -24 51 73 -8 44 180 23 77 -32 -89 53 -22 8 -21 39 -20 8 9 -25 145
7903 145 121 -54 7 -96 11 -61 22 -6 105 25 -93 108 -50 -98 -36 12 -93 -49 -41 71 46 -44 -90 52 -42
7928 -42 2 17 -61 -37 61 5 -5 -11 29 32 69 43 -84 -14 53 -30 58 -85 147 -28 -10 62 -91 -68 -60 -37 -57 -32 37
7957 37 71 72 19 -25 19 -60 35 -7 -35 -21 -103 -67 -44 31 4 -23 10 -20 -98 -10 72 -37 -93 -4 50 58 -79 92 -64
7986 -64 -65 -60 14 -30 16 47 29 60 -44 3 -51 -72 -28 -134 -78 -51 11 -30 18 41 8 -48 -31 -55 -62 50 -39 -44 -20 26 21
8017 21 24 65 110 -40 64 26 -35 -8 -97 23 13 -4 67 -64 40 -101 75 -51 -68 92 -49 29 -141 10 46
8042 46 -15 13 -36 -55 18 -85 63 61 -114 9 -104 -38 -39 28 15 32 -40 -13 53 -3 49 -88 -89 23 84 -3 -95 78
8070 78 29 -59 -56 13 -19 -52 -66 -45 1 -38 46 -64 -105 -6 -18 70 -7 68 73 110 -112 98 -75 -69 97 -4 -21 3 -86
8099 -86 -206 -143 49 -98 37 47 -64 -91 68 12 -54 54 -89 55 -56 -37 -56 -63 -32 -41 31 59 15 -33 -113 45
8125 45 -38 20 -123 23 -58 -16 -11 30 18 -8 -71 41 137 55 -181 169 85 -28 -48 -17 52 -96 -10 40 -27 98 -5
8152 -5 39 6 57 98 26 -177 -51 -61 -20 -54 60 -14 -16 21 21 75 52 4 -108 32 -6 92 18 -51 19 33 -34 -34 -45 -16
8182 -16 -11 -42 50 34 -2 -28 -123 -117 89
8191H9
##END NTUPLES=NMR FID
##END=
