##TITLE=1H_DE-80H_X3
 200.13MHz, d2o
 8 sc
 
 19ns.26.2.2025
##JCAMPDX= 6.0         $$ Bruker NMR JCAMP-DX V2.0
##DATA TYPE= NMR FID
##DATA CLASS= NTUPLES
##ORIGIN= UXNMR, Bruker Analytische Messtechnik GmbH
##OWNER= pz
$$ XWIN-NMR		Version 3.5
$$ Mon Apr  7 14:09:15 2025 Russian Standard Time (UT+4h)  Yarkov@DPX200
##.OBSERVE FREQUENCY= 200.1313
##.OBSERVE NUCLEUS= ^1H
##.DELAY= (6, 6)
##.ACQUISITION MODE= SIMULTANEOUS
##.ACQUISITION SCHEME= undefined
##.AVERAGES= 8
##.DIGITISER RES= 18
##SPECTROMETER/DATA SYSTEM= spect
##.PULSE SEQUENCE= zg30
##.SOLVENT NAME= CDCl3
##.SHIFT REFERENCE= (INTERNAL, CDCl3, 0, 14.3821)
##AUDIT TRAIL= $$ (NUMBER, WHEN, WHO, WHERE, WHAT)
$$ ##TITLE= Audit trail, XWIN-NMR		Version 3.5
$$ ##JCAMPDX= 5.01
$$ ##ORIGIN= Bruker BioSpin GmbH
$$ ##OWNER= Yarkov
$$ C:/Bruker/XWIN-NMR/data/yarkov2/nmr/H-C/1/audita.txt
$$ ##AUDIT TRAIL=  $$ (NUMBER, WHEN, WHO, WHERE, WHAT)
(   1,<2025-04-07 14:07:41.79 +0400>,<Yarkov>,<DPX200>,
      <created by zg, POWCHK disabled, PULCHK disabled
       configuration hash MD5:
       00 E9 B6 7A A2 85 ED C7 34 08 36 98 17 FE 4E 26
       data hash MD5: 16K
       13 4A 0E 91 58 EB 62 27 01 8C 7C 82 3C 76 F6 AC>)
$$ ##END=
$$ 
$$ hash MD5
$$ E9 DE 53 2F CE DA D1 98 DB D0 82 B9 A6 5D 06 40
##$RELAX= 
##$RELAX= 
##$RELAX= 
##$RELAX= 
##$RELAX= 
##$RELAX= 
$$ Bruker specific parameters
$$ --------------------------
##$DU= <C:/Bruker/XWIN-NMR>
##$EXPNO= 1
##$NAME= <H-C>
##$PROCNO= 1
##$TYPE= <nmr>
##$USER= <yarkov2>
##$AMP= (0..31)
100 100 100 100 100 100 100 100 100 100 100 100 100 100 100 100 100 100 
100 100 100 100 100 100 100 100 100 100 100 100 100 100 
##$AQSEQ= 0
##$AQ_mod= 1
##$AUNM= <au_zg>
##$AUTOPOS= <>
##$BF1= 200.13
##$BF2= 200.13
##$BF3= 200.13
##$BF4= 200.13
##$BF5= 200.13
##$BF6= 200.13
##$BF7= 200.13
##$BF8= 200.13
##$BYTORDA= 1
##$CFDGTYP= 0
##$CFRGTYP= 5
##$CHEMSTR= <none>
##$CNST= (0..31)
1 1 145 1 1 1 1 1 1 1 1 1 1 1 1 1 1 1 1 1 1 1 1 1 1 1 1 1 1 1 1 1 
##$CPDPRG= <>
##$CPDPRG1= <>
##$CPDPRG2= <>
##$CPDPRG3= <>
##$CPDPRG4= <mlev>
##$CPDPRG5= <mlev>
##$CPDPRG6= <mlev>
##$CPDPRG7= <mlev>
##$CPDPRG8= <mlev>
##$CPDPRGB= <>
##$CPDPRGT= <>
##$D= (0..31)
0 0.7 0 0 0 0 0 0 0 0 0 0.03 0 0 0 0 0 0 0 0 0 0 0 0 0 0 0 0 0 0 0 0 
##$DATE= 1744020461
##$DBL= (0..7)
120 120 120 120 120 120 120 120 
##$DBP= (0..7)
150 150 150 150 150 150 150 150 
##$DBP07= 0
##$DBPNAM0= <>
##$DBPNAM1= <>
##$DBPNAM2= <>
##$DBPNAM3= <>
##$DBPNAM4= <>
##$DBPNAM5= <>
##$DBPNAM6= <>
##$DBPNAM7= <>
##$DBPOAL= (0..7)
0.5 0.5 0.5 0.5 0.5 0.5 0.5 0.5 
##$DBPOFFS= (0..7)
0 0 0 0 0 0 0 0 
##$DE= 6
##$DECBNUC= <off>
##$DECIM= 32
##$DECNUC= <off>
##$DECSTAT= 4
##$DIGMOD= 1
##$DIGTYP= 9
##$DL= (0..7)
0 120 120 120 120 120 120 120 
##$DP= (0..7)
150 150 150 150 150 150 150 150 
##$DP07= 0
##$DPNAME0= <>
##$DPNAME1= <>
##$DPNAME2= <>
##$DPNAME3= <>
##$DPNAME4= <>
##$DPNAME5= <>
##$DPNAME6= <>
##$DPNAME7= <>
##$DPOAL= (0..7)
0.5 0.5 0.5 0.5 0.5 0.5 0.5 0.5 
##$DPOFFS= (0..7)
0 0 0 0 0 0 0 0 
##$DQDMODE= 0
##$DR= 18
##$DS= 0
$$ [...]
##$SUBNAM2= <"">
##$SUBNAM3= <"">
##$SUBNAM4= <"">
##$SUBNAM5= <"">
##$SUBNAM6= <"">
##$SUBNAM7= <"">
##$SUBNAM8= <"">
##$SUBNAM9= <"">
##$SW= 18.0517328524113
##$SWIBOX= (0..15)
0 0 2 0 0 0 0 0 0 0 0 0 0 0 0 0 
##$SW_h= 3612.71676300578
##$TD= 16384
##$TD0= 1
##$TE= 0
##$TE2= 300
##$TE3= 300
##$TEG= 300
##$TL= (0..7)
0 120 120 120 120 120 120 120 
##$TP= (0..7)
150 150 150 150 150 150 150 150 
##$TP07= 0
##$TPNAME0= <>
##$TPNAME1= <>
##$TPNAME2= <>
##$TPNAME3= <>
##$TPNAME4= <>
##$TPNAME5= <>
##$TPNAME6= <>
##$TPNAME7= <>
##$TPOAL= (0..7)
0.5 0.5 0.5 0.5 0.5 0.5 0.5 0.5 
##$TPOFFS= (0..7)
0 0 0 0 0 0 0 0 
##$TUNHIN= 0
##$TUNHOUT= 0
##$TUNXOUT= 0
##$USERA1= <user>
##$USERA2= <user>
##$USERA3= <user>
##$USERA4= <user>
##$USERA5= <user>
##$V9= 5
##$VALIST= <valist>
##$VCLIST= <CCCCCCCCCCCCCCC>
##$VD= 0
##$VDLIST= <DDDDDDDDDDDDDDD>
##$VPLIST= <PPPPPPPPPPPPPPP>
##$VTLIST= <TTTTTTTTTTTTTTT>
##$WBST= 1024
##$WBSW= 4
##$XGAIN= (0..3)
0 0 0 0 
##$XL= 0
##$YL= 0
##$YMAX_a= 100884
##$YMIN_a= -152780
##$ZGOPTNS= <>
##$ZL1= 120
##$ZL2= 120
##$ZL3= 120
##$ZL4= 120
##$ABSF1= 10
##$ABSF2= 0
##$ABSG= 5
##$ABSL= 3
##$ALPHA= 0
##$AQORDER= 0
##$ASSFAC= 0
##$ASSFACI= 0
##$ASSFACX= 0
##$ASSWID= 0
##$AUNMP= <proc_1d>
##$AZFE= 0.1
##$AZFW= 0.1
##$BCFW= 1
##$BC_mod= 2
##$BYTORDP= 1
##$COROFFS= 0
##$CY= 83.5205535888672
##$DATMOD= 1
##$DC= 2
##$DFILT= <>
##$DTYPP= 0
##$F1P= 10.8118882576601
##$F2P= -7.23987719738617
##$FCOR= 0.5
##$FTSIZE= 0
##$FT_mod= 4
##$GAMMA= 1
##$GB= 0.15
##$INTBC= 1
##$INTSCL= 1
##$ISEN= 128
##$LB= 0.25
##$LEV0= 0
##$LPBIN= 0
##$MAXI= 10000
##$MC2= 0
##$MEAN= 0
##$ME_mod= 0
##$MI= 1.114404
##$NCOEF= 0
##$NC_proc= 0
##$NLEV= 6
##$NOISF1= 3.799351
##$NOISF2= 2.8
##$NSP= 1
##$NTH_PI= 0
##$NZP= 0
##$OFFSET= 14.38212
##$PC= 1
##$PHC0= -1194.84
##$PHC1= 16.79226
##$PH_mod= 1
##$PKNL= yes
##$PPARMOD= 0
##$PSCAL= 0
##$PSIGN= 0
##$REVERSE= no
##$SF= 200.129724274929
##$SI= 16384
##$SIGF1= 3
##$SIGF2= 2
##$SINO= 400
##$SIOLD= 16384
##$SREGLST= <1H.CDCl3>
##$SSB= 0
##$STSI= 0
##$STSR= 0
##$SW_p= 3205.1282051282
##$SYMM= 0
##$S_DEV= 0
##$TDeff= 0
##$TDoff= 0
##$TI= <>
##$TILT= no
##$TM1= 0
##$TM2= 0
##$TOPLEV= 0
##$USERP1= <user>
##$USERP2= <user>
##$USERP3= <user>
##$USERP4= <user>
##$USERP5= <user>
##$WDW= 1
##$XDIM= 8192
##$YMAX_p= 0
##$YMIN_p= 0
$$ End of Bruker specific parameters
$$ ---------------------------------
##NTUPLES= NMR FID
##VAR_NAME=  TIME,          FID/REAL,        FID/IMAG
##SYMBOL=    X,             R,               I
##VAR_TYPE=  INDEPENDENT,   DEPENDENT,       DEPENDENT
##VAR_FORM=  AFFN,          ASDF,            ASDF
##VAR_DIM=   8192,          8192,            8192
##UNITS=     SECONDS,       ARBITRARY UNITS, ARBITRARY UNITS
##FACTOR=    0.0002768,     1,               1
##FIRST=     0,             0,               0
##LAST=      2.2672688,     0,               0
##MIN=       0,             -152780,         0
##MAX=       2.2672688,     100884,          0
$$ Real data points
##PAGE= N=1
##DATA TABLE= (X++(R..R)), XYDATA
0@%%%%%%%%%%%%%%%%%%%%Pj5J6j6J6j6J6k1K8l1L2l6M3m8N3n9O7p4Q1r2J00j09
$$ 0 0 0 0 0 0 0 0 0 0 0 0 0 0 0 0 0 0 0 0 0 7 -8 8 -8 8 -8 8 -13 15 -16 16 -20 23 -25 28 -31 36 -38 43 -49 51 -58
42e8J22j36J50j63J77j95K18k39K62k89L18l52L91m37M90n51O25p17Q31r78J172
$$ -58 64 -72 78 -85 92 -103 115 -124 138 -151 167 -185 206 -231 259 -292 333 -384 447 -531 641
63F41j442J837k456L527n686J1459n1482j09178K23672J7501j09333Q6969j6281
$$ 641 -801 1036 -1420 2107 -3579 7880 -43602 -152780 70892 88393 -20940 66029 49748
76D9748o6878N5318L246n2601N494L9519m5235o1177R2356O477j24069P7960N4384
$$ 49748 -17130 38188 41434 -11167 -5673 33846 -11389 -72566 19790 26267 -97802 -19842 34542
89C4542r7410O2341K1401q0150R4497K4666r4227M2193K4756k6681K1983j7202
$$ 34542 -62868 -527 20874 -59276 35221 59887 -34340 7853 32609 5928 27911 10709
101A0709j0808P548q114J3157l2318l966N0517n5717j4612O5906m2139p931M3799
$$ 10709 -99 7449 -665 12492 -19826 -23792 26725 -28992 -43604 22302 -19837 -27768 16031
114A6031k3715K3236p580m6744O6613O776m6468L9498l2166j9722O8793m2487
$$ 16031 -7684 15552 7972 -38772 27841 34617 -11851 27647 -4519 -24241 44552 2065
126B065l4733N5143j3683k3451R603J044M258j7163J9669J4239n4333M0808L2275
$$ 2065 -32668 22475 8792 -14659 -5056 -4012 246 -16917 2752 16991 -37342 3466 35741
139C5741q0326M9110M4597r5691L4194N6656n9842K0260J7171m9676K6521K7854
$$ 35741 -44585 4525 49122 -46569 -12375 44281 -15561 4699 21870 -27806 -1285 26569
151B6569k6348j6746J1769K8280l1300k2849N1700k3435k1859N5841l7925k0888
$$ 26569 221 -16525 -4756 23524 -7776 -30625 21075 -2360 -24219 31622 -6303 -27191
163b7191N8118m0181r424N7379m1464k0787L2069j0502R341r8k1195J7586l378
$$ -27191 30927 -9254 -18678 38701 -2763 -23550 8519 -1983 7358 7260 -13935 3651 273
176B73l302Q754k3048K1736J4262m0390K0722J4694k4790K3287q501j4988L1652
$$ 273 -3029 5725 -17323 4413 18675 -21715 -993 13701 -11089 12198 3697 -11291 20361
189B0361k7566p601M1201k8406q034J7780k9875K2912K1359m3138P997K3991j1657
$$ 20361 -7205 -14806 26395 -2011 -10045 7735 -22140 772 22131 -21007 -13010 10981 -676
202f76l843m824J4911Q522k1394J6400l527k2793L8793j2076l4995M8867j3012
$$ -676 -4519 -9343 5568 14090 -7304 9096 5569 -17224 21569 9493 -25502 23365 10353
215A0353m5360M4466N027k9165J7275p870q286J8580j891o985n157J3222J4725
$$ 10353 -35007 9459 14486 -14679 2596 -5274 -13560 5020 3129 -3856 -9013 4209 18934
228A8934l2938O434L4575l2647Q08K5469l4721R878K3419l4882J1926J8906k8484
$$ 18934 -14004 -7570 27005 -5642 -4834 20635 -14086 -4208 19211 -15671 -3745 15161 -13323
241a3323L003J0000j056P228j3945J469J2222r871J1362k423j5014K6505p142
$$ -13323 -10320 -320 -1376 5852 -8093 -6624 5598 -4273 7089 4666 -10348 16157 9015
254I015k4559K4908l397j1768J6838j6918k600J7974j7859K964J0718j2477R743
$$ 9015 -15544 9364 5967 -5801 11037 -5881 -8481 9493 -8366 -5402 5316 -7161 2582
267B582n641j0914K4919m737j4236J3470n858J618P411j4839R705N767j4887Q544
$$ 2582 -3059 -13973 10946 6209 -8027 5443 -415 1203 8614 -6225 3480 9247 -5640 2904
281B904o529m172K2839j8915j1654K5424j2677p157J6438j0480M226O575j4953
$$ 2904 -3625 -7797 15042 -3873 -15527 9897 -2780 -9937 6501 -3979 247 6822 -8131
294h131Q162N976m896N302j0986L841J2851k0632M375J5362j6815N004K276j4646
$$ -8131 31 6007 1111 6413 -4573 -732 12119 -8513 -4138 11224 -5591 -587 1689 -12957
308a2957J8120L26j6937J4673j126p146R026q563O141R777j6789M611N575p884
$$ -12957 5163 5489 -11448 3225 2099 -5047 3979 -4584 1557 11334 -5455 -844 4731 -3153
322c153J0348o776p637J6677j1961p846J6085p759M02N367j4138J0179O804j3438
$$ -3153 7195 419 -7218 9459 -2502 -10348 5737 -2022 -1620 3747 -10391 -212 6592 -6846
336f846R154N16n343R843j1255n31J6772j2788k236P576j0503P681J534j1637
$$ -6846 2308 2824 -2519 7324 -3931 -4462 12310 -478 -2714 4862 -5641 2040 3574 -8063
350h063J2768k610j1584J1440m215L24R461j4563L059J1888j1648M315K688n666
$$ -8063 4705 2095 -9489 1951 -2264 -1940 7521 -7042 -3983 7905 -3743 572 3260 -2406
364b406J1438r345q455J6624p201l335R733j4739L906J1106j4629N908P849j0465
$$ -2406 9032 -313 -8768 7856 655 -2680 7053 -7686 -3780 7326 -7303 -1395 6454 -4011
378d011L154j929J161J0151j2392K10J0336j0779O820J970j5548J7076L991k0364
$$ -4011 -857 -2786 -1625 8526 -3866 -3656 6680 -4099 2721 4691 -10857 6219 10210 -10154
392a0154R190L096n928R951p940l526R673p699J452M855m859P439p701p404J7788
$$ -10154 -964 2132 -3796 6155 -1785 -5311 4362 -3337 -1885 2970 -1889 5550 -2151 -9555 8233
407H233n448q297J0997r170K979R892j7655M512J3940j1410O99m77m183J2917
$$ 8233 2785 -5512 5485 -3685 -706 9186 -8469 -3957 9983 -1427 -728 -1205 -5388 7529
421G529o175p314J1140o301j515N717q576Q630K750j4746Q347L047m260O850j1131
$$ 7529 1354 -5960 5180 -1121 -2636 3081 -5495 3135 5885 -8861 -514 2533 -1727 5123 -6008
436f008K521J5412j7942j544J5834r471M063J860j5366J1899P444j2784L003J884
$$ -6008 -3487 11925 -6017 -7561 8273 -1198 2865 4725 -10641 1258 8702 -4082 -1079 805
450H05K01N28q494R367L621j2691Q844k055q604J7016r489j1993K4151n635j6723
$$ 805 1006 1534 -6960 2407 6028 -6663 2181 126 -8478 8538 -951 -12944 11207 5572 -11151
465a1151J2848Q62j137M625r466P84M082k15L399r699K869J1532j6439J891J5457
$$ -11151 1697 2559 1422 6047 -3419 -2635 1447 1232 4631 -5068 -2199 9333 -7106 -5215 10242
480A0242j5301Q85Q353j1144Q379K264j2273J1339K376p412L625o537N658J0197
$$ 10242 -5059 -4174 4179 -6965 1414 3678 -8595 2744 5120 -2292 1333 -5204 454 10651
494A0651j2416R89M540q170P883j236q072J0031m434n624P445n298L284L293j0596
$$ 10651 -1765 -776 3764 -4406 3477 2241 -5831 4200 -234 -5858 1587 -3711 -427 2866 -7730
509g730J0862J734j5043J3911J821j1059J3459o257j2062J8104J457j2315Q68
$$ -7730 3132 4866 -10177 3734 5555 -5504 7955 1698 -10364 7740 9197 -3118 -2250
522b250L154K113n791m17Q318j1396J140J3146j7618L759J8890k1727N97K2457
$$ -2250 904 3017 -2774 -3191 5127 -6269 -5129 8017 -9601 -5842 13048 -8679 -8082 14375
536A4375j7944n537J6163m311q28K890o506j747L922P673p193j0927J6132j315
$$ 14375 -3569 -9106 7057 2746 1918 4808 -1698 -3445 477 8150 957 -9970 6162 4847
550D847j7305J5894P83j4847J5873k863j2911J6870l132j2328J1808K487n659
$$ 4847 -12458 3436 4219 -10628 5245 2382 -10529 6341 3209 -9119 2689 5176 -483
563d83j816J81R325l098p786M643m868M445Q180j5761K564J3015j3904J10R042
$$ -483 -2299 -2118 7207 4109 -3677 966 -3902 543 8723 -7038 -4474 8541 -5363 -5253 3789
578C789o259M107k018n098J0370m761m660R563n527K83O154j2021L212J1149p210
$$ 3789 -2470 1637 -381 -5479 4891 130 -4530 5033 -494 -211 5943 -6078 -2866 8283 1073
593A073k965P46J613L166p402L607M809j0318P509K474j5935J3413O448j7891
$$ 1073 -1892 -1146 467 3633 -3769 -162 4647 -5671 1838 4312 -11623 1790 8238 -9653
607i653R158O927j1599N696K981m818L211k473j624J880K396M518j0799k004J4217
$$ -9653 -495 6432 -5167 529 3510 -1308 1903 -570 -2194 -314 2082 6600 -4199 -6203 8014
622H014r541m247J3496j1111j219J3641j4045k361J4952p388l813N921j866r09
$$ 8014 -1527 -5774 7722 -3389 -4608 9033 -5012 -7373 7579 191 -3622 2299 433 -476
636d76j496K779L753p153K851J925q303R983K390j4115P681M854p967M473k037
$$ -476 -1972 807 4560 -2593 258 2183 -6120 3863 6253 -7862 -181 4673 -3294 1179 -858
651h58j548P918p113k103P093n291K248K362o947N855L10o714P026R69m064O02
$$ -858 -2406 5512 -1601 -3704 3389 -1902 346 2708 -4239 1616 1926 -4788 2238 3207 -857 -255
667b55l604M984K995p412M819j19n449Q738n319n973J3708n240q631J0413l360
$$ -255 -3859 1125 4120 -3292 1527 1408 -4041 4697 -622 -6595 7113 1873 -6758 3655 295
682B95m378O983k699j544K237j674O27j582L873K146j1059N540Q734j2267L387
$$ 295 -4083 2900 201 -1343 894 -780 -153 -1735 2138 4284 -6775 -1235 7499 -4768 -1381
697a381P498j0681N236M498j1435N897N927p886Q40J845m40j02k456M658m08n459
$$ -1381 6117 -4564 672 5170 -6265 -368 5559 -2327 -1487 358 -82 -184 -2640 2018 1610 -3849
713c849N339k334k377R901o583o120J0454l408m085O108m002J282K817o990L107
$$ -3849 1490 -844 -3221 6680 97 -6023 4431 1023 -3062 3046 -956 326 3143 -3847 -740
728g40K878l442L008l225q90O057n661o82O085l874O95j55l391P083j725n507
$$ -740 2138 -1304 1704 -1521 -2411 3646 -2015 -2697 3388 -486 209 54 -3337 3746 2021 -3486
744c486O135k768j824N835o726J127P876q680j226O138l295J263N18k784K807
$$ -3486 2649 -119 -1943 3892 -2834 -1707 6169 -2511 -3737 2401 -894 369 887 -1897 910
759I10j104n75J769k893M887j55q693P246K800q044N628K10o255O921j827n480
$$ 910 -194 -769 1000 -1893 2994 2839 -5854 1392 4192 -3852 1776 1986 -4269 2652 825 -4655
775d655O753q2l821Q55p53L520p99l397M650k502j424N268o233J203P723q028
$$ -4655 2098 2016 -1805 -950 -1703 1817 1018 -2379 2271 -231 -1655 3613 -2620 -1417 6306 -1722
791a722j772O398l838R49J422m121L825l58l594L330j002J171J706o529L483M816
$$ -1722 -3494 2904 -934 15 1437 -2684 1141 783 -2811 519 -483 688 2394 -4135 -652 4164
807D164o103J789K024l292L888k762k853O508k297k682K379l578L528J742o537
$$ 4164 -1939 -150 1874 -1418 2470 -292 -3145 3363 1066 -1616 763 -2815 713 2455 -4082
822d082M611K053n707L192m6r67M344m454j215M911k663L45M43k229M889k597
$$ -4082 529 2582 -3125 67 21 -946 3398 -1056 -2271 2640 -23 322 765 -1464 3425 828
838H28n179O177r03k805M097m569M73M960n322R59M111l818O25P5j259N008l026
$$ 828 -4351 1826 923 -1882 2215 -2354 -1881 3079 -2243 -1284 2827 -991 -366 -291 -1550 3458 432
855D32k412M474l033M80K176n015M154K038o819K859J263k501M009l123j438M557
$$ 432 -1980 2494 -539 -59 2117 -2898 1256 3294 -3525 -666 597 -1904 2105 -1018 -2456 2101
871B101l704K82L616l448K254j04m331N435N9m052L663j854n21L221m998J336
$$ 2101 -1603 -1321 2295 -1153 1101 997 -3334 2101 2160 -1892 1771 -83 -604 2617 -2381 -1045
887a045M340m426O98L72k709N050j661l619M666k016j151L162k982K461K026o233
$$ -1045 3295 -1131 -433 -61 -2770 2280 619 -3000 1666 -350 -1501 1661 -1321 1140 3166 -3067
903c067K876K317l347K788j774j715M809l901j928M689j797R75o64m060N039Q71
$$ -3067 -191 2126 -1221 1567 -207 -1922 2887 -1014 -2942 1747 -50 925 261 -3799 1240 2111
919B111m644L815j055j590M122m666L61N856n038o81L008k720K283j000k648M769
$$ 2111 -2533 1282 227 -1363 2759 -1907 -1546 4310 -728 -1409 1599 -1121 1162 162 -2486 2283
935B283j395l387K458j517L057J444o939L002L945m586K430K06l120M591k517
$$ 2283 888 -2499 -41 -1558 1499 2943 -3996 -994 2951 -1635 795 1001 -2119 2472 -45
950d5k795N004j625r65J022k782L559L8m747M518Q31l147J881k795R04N408m921
$$ -45 -2840 2164 539 -426 596 -2186 1373 1411 -3336 1182 2013 -1134 747 -2048 -1144 4264 -657
967f57j189L157k404K271n22l440N004j271m193M459j285r77L088m014J222L559
$$ -657 -1846 1311 -1093 1178 656 -2784 2220 949 -3244 1215 -70 -1047 2041 -1973 -751 2808
983B808m240L78K372q89J261l138l67M837l399J27K110n389L660L034p124L613
$$ 2808 -1432 -1054 1318 429 1690 -1448 -1815 3022 -377 -250 1860 -3529 131 3165 -3959 -346
999c46L520n459J485J556j868K207j150j78J191j973J781p80j692N211k660n183
$$ -346 3174 -2285 -800 756 -1112 1095 -55 -233 958 -1015 766 -14 -1706 3505 845 -4338
1015d338O226j367k362M404l678j398N202l493j212L342j405N84p47m01K536k805
$$ -4338 1888 521 -1841 2563 -1115 -2513 2689 -804 -2016 1326 -79 505 -242 -643 1893 -912
1031i12K44L016l941J346K513n383L447L073n750J265J400j658K904j757j155
$$ -912 -668 2348 -1593 -247 2266 -3117 330 3403 -2347 -1082 318 -1340 1564 -193 -1348
1046a348L203k821M2K518k925K362O91l997K593Q13k263J887j110L58J344l788
$$ -1348 1855 -966 -924 1594 -1331 1031 1722 -2275 318 1131 -1132 755 -355 3 1347 -2441
1062b441K149K903m115K230j71l262M870p98m548M709j95l168K285p57k3J304
$$ -2441 -292 2611 -1504 726 555 -2707 2163 1365 -3183 1526 1331 -1837 448 -309 -332 972
1078I72j561N30k88j78K381l307R05M314o030r5N778m152M8L084m766J466L291
$$ 972 -589 -59 -347 -525 1856 -1451 -546 3768 -2262 -2357 3421 -731 -683 2401 -2365 -899 2392
1095B392l709J19K093j49n15k251J973J510l382K832M55l663L894p85l700N261
$$ 2392 -1317 -1198 895 746 231 -2020 -47 1463 -1919 913 1368 -2295 1599 814 -2886 2375
1111B375m86m779K866N20n48J332k763J140J421j990J239m80r74L097k442j265
$$ 2375 1889 -2890 -24 496 -52 1280 -1483 -343 1078 -912 327 -153 -1127 1970 -472 -1737
1127a737L343j645m70J644k048J275M07k775L071K61k648K457k314l61M162l071
$$ -1737 1606 -39 -509 1135 -913 362 769 -2006 1065 1326 -1322 1135 -1179 -1540 2622 -449
1143d49r69L345k304m14J573j901J492P61j655N71j166J608R79l972L004K032
$$ -449 -1418 1927 -377 -791 782 -1119 373 1134 -521 50 -1116 492 1471 -2501 503 2535
1159B535n320K611K349l969K509N50l813L054J239k495N04J92P84p31j847K680
$$ 2535 -2785 -174 2175 -1794 715 1265 -2548 506 1745 -750 -246 -54 730 -1 -1848 832
1175H32m9k042K815k367j136M546k974j590M441k588j377K507j777J126J040k767
$$ 832 783 -1259 1556 -811 -1947 2599 -375 -1965 2476 -112 -1489 1018 -759 367 1407 -1360
1191a360J219N31q20J007j721J130K079l509O50K057j957J320j27k152K793r31
$$ -1360 -141 390 -430 577 -1144 -14 2065 -1444 -794 1263 -694 626 499 -1653 1140 209
1207B09j628K890j438n11J763k911R97L091l594L36J940j780O77j53k55J422j494
$$ 209 -1419 1471 33 -478 1285 -1626 -629 2462 -1132 -796 1144 -636 41 -112 -367 1055 -439
1224d39K0O56j709K790k17l457L709M7l981L504N8k273K583j089k174K616j1j111
$$ -439 -419 237 -1472 1318 1101 -2356 1353 1400 -2581 923 981 -1292 1291 202 -1972 644 633 -478
1242d78M6K87J161j810n40L532k477n38K684l614Q86L638l794j48L101k644j78
$$ -478 -432 -145 1016 -794 -1334 2198 -279 -817 1867 -1747 -861 2777 -1017 -1165 1936 -708 -886
1259h86J438q70J174p37r79J146j027J369M25k665K380M58l378K441Q69j992J843
$$ -886 552 -318 856 119 -860 286 -741 628 1053 -1612 768 1226 -2152 289 1158 -834 1009
1276A009j352j121K717j422o47J364j194J200l23k313L144Q7k298J640o33l00
$$ 1009 -343 -1464 1253 -169 -816 548 -646 554 231 -2082 1062 1149 -1149 491 -142 -442
1292d42J952k260L13J539j682M08N9o40K409j802j768L246j398j107K482k037
$$ -442 1510 -750 -437 1102 -580 -172 -113 -753 1656 -146 -1914 1332 -66 -1173 1309 -728
1308g28L86K220l145M07K146j255K56r99J58J662j825J31J707j986J166L20k763
$$ -728 -342 1878 -1267 -860 1286 31 287 -712 -554 1108 -717 -586 1121 -865 301 621 -2142
1325b142L022J028l655J741R52j733J520r72k49J817j594n80O90k80J648j288
$$ -2142 880 1908 -1747 -6 946 -787 733 -239 -488 1329 -265 -845 -155 -435 1213 -75
1341g5j540K928j094j554K442j235M2J690k942P41K304k202K92O76j168J585j324
$$ -75 -1615 1313 219 -1335 1107 -128 -86 1604 -1338 -597 1707 -495 -203 473 -695 890 -434
1358d34p12K475j331m57P91j380J658N37k379J634K67j442J408r91k59K141k176
$$ -434 -1146 1329 -2 -459 332 -1048 610 1147 -1232 402 669 -773 635 -356 -615 1526 -650
1375f50k09J933j783O20Q29j887J725q2j875J788m0l34P18j654N56J527j896J018
$$ -650 -859 1074 -709 -89 740 -1147 578 496 -1379 409 369 35 753 -901 -345 1182 -714 304
1393C04K46j476J762p85j251K145n74j388J644j069J13J237j787R70P32j951J068
$$ 304 550 -926 836 51 -1200 945 371 -1017 627 -442 -329 908 -879 91 823 -1128 -60
1410f0p0j75J776j848q50K181j049j4Q02j699J499L29k009J495K24r50R43j175
$$ -60 -130 -305 1471 -377 -1227 954 -95 -109 693 -1006 493 822 -1187 308 532 -418 525 -650
1428f50J43J643k128L77J687j177J66m2j116K249o63j524J426o20p5J181j759
$$ -650 -507 1136 -992 -615 1072 -105 61 19 -1097 1152 489 -1035 391 -229 -304 877 -882
1445h82J024R51j873N85N00o24Q60p25m81J812j492m48J470q75P06J04k047J703
$$ -882 142 1093 -780 -195 305 -319 541 -184 -665 1147 -345 -793 677 -198 508 612 -1435 268
1463B68J033j734N84l11k84J116j343P2J495j266K76J94j076J851p72j224J994
$$ 268 1301 -433 151 -160 -444 672 -671 -599 896 -370 -94 100 -976 875 103 -1121 873
1480H73l15j615J665q47N7J250j742q1J342p61M82m48o49J478p79q12J596r89
$$ 873 558 -1057 608 -239 -182 1068 -674 -755 587 -174 308 -140 -789 689 -90 -902 694 -295
1498b95J16R83j923R67J271j895R77L85r83Q23p39r6J571j279m59P86q18R63J51
$$ -295 -179 804 -1119 -152 1119 -776 201 586 -397 426 -313 -409 1162 -117 -576 210 -608 355 506
1517E06j404J160K02j202R91o36J49J119j459M24J068j655Q43O30j245J138k32
$$ 506 -898 262 464 -738 253 -383 -234 885 -574 -150 918 -737 106 736 -509 629 397
1534C97j705J698K80j131O44p15K49R38j318M55O02o56Q77j048l17K237j452p83
$$ 397 -1308 390 670 -461 183 -532 -283 655 -663 -208 394 -262 615 -433 -750 1487 35 -748
1552g48J906j506k61J698j684J51J182j364r0Q23J46R2j346J034Q92j766Q46Q98
$$ -748 1158 -348 -609 1089 -595 -444 738 -626 -716 107 253 345 -1001 33 925 -841 5 903
1570I03j763J532K83k452J843P65j944J123m0q46P92q91M03J122j146K67j99o6
$$ 903 -860 672 955 -1497 346 1111 -833 290 250 -596 196 -695 -292 830 -316 -49 -248 -314
1588c14J448j203q76K047j093m64J129j014L05Q74j741M63P60p66N19l92k22J447
$$ -314 1134 -69 -945 1102 9 -455 674 -340 -35 839 -902 -439 321 -445 74 -318 -540 907
1606I07j474k92K254j100n25O36q98R95N8j050R92m01l66R35j777O55J799k340
$$ 907 -567 -859 1395 295 -230 406 -492 503 561 -489 503 102 -264 671 -1106 -451 1348 -992
1624i92L42J496j557M97Q68j598J305L37j429Q36K21R6k02j049R99M00j353J460
$$ -992 -650 846 -711 -214 654 -944 361 698 -731 105 326 422 220 -829 170 570 -783 677
1642F77n09j294K284j367j558K818m83j457J328r67J86R60r78N86J00l59M99r91
$$ 677 168 -1126 1158 -209 -1767 1051 568 -889 439 -528 -342 618 -360 226 326 -33 466 -525
1660e25M89J332j861N3J152j306O07K70j357J863J6k066J589j2l96J024j492K01
$$ -525 -36 1296 -565 -512 640 -666 -59 211 -1146 717 733 -1333 256 244 -152 872 -620 -419
1678d19J676j715KJ230q12L32n90l82J514p73l42M75j306J435L78k504K235J055
$$ -419 1257 -458 -456 774 -38 294 -296 -678 836 63 -279 196 -1110 325 703 -1801 434 1489
1696A489k952J285P47j195J350k40j434J497k20n47m9J98J311j553r20K202j164
$$ 1489 -1463 -178 569 -626 724 484 -950 547 327 -220 -269 -71 1240 -313 -1233 969 -195
1713a95o49K121k089N8K324k488k13K677j343o75P36m01M52l24k93O91q45O41
$$ -195 -844 1277 -812 -754 1570 -918 -1131 1546 203 -472 264 -137 315 -9 -302 389 -456 185
1731A85K81j891K037Q16l024J484Q28j810J550k03r81J526p67p51J288n61O79
$$ 185 466 -1425 612 1428 -1596 -112 716 -1094 456 253 -728 798 31 -720 568 7 686
1748F86k86j645J773m9j353J325m36m77J268j442K01J268j210K29j1p41J720o72
$$ 686 400 -1245 528 479 -874 451 15 -462 806 -636 -435 833 -377 -148 -159 -900 820 148
1766A48j105K147r78j083J627j117P4J440j751L7Q60m83O8l69K85R50j639J91
$$ 148 -957 1190 212 -871 756 -361 -287 1153 -598 -561 299 -184 -116 -485 -200 750 -889 -698
1784f98J466j626J457M48k390J843P88k513J451O59j350P37m89k17J021p52j72
$$ -698 768 -858 599 1047 -1343 500 1288 -1225 226 885 -465 272 -217 -434 587 -165 -337
1801c37J32l58J215j101o54K455j216j137J751q87J46J412j873J15J412j563L93
$$ -337 -205 -563 652 -449 -1103 1352 136 -1001 750 -137 9 1421 -452 -337 1075 -488 -95
1818i5J13k05P48j113j32J141p34O4P20j413J203K02j791J778M00j226P58q13
$$ -95 18 -187 561 -552 -684 457 -277 -213 507 -906 297 499 -1292 486 886 -340 418 -395
1836c95J42J602j725k2J039j149M37K96j082J397J4j521R83J32l51O75j222R80
$$ -395 -253 1349 -376 -398 641 -508 -71 225 -857 540 554 -967 16 148 -203 472 -750 230
1854B30N29j664Q22N81r18J314j058j125K118o13j118J337m39l73N70j051R83
$$ 230 759 -905 -83 498 -420 894 -164 -1289 829 216 -902 435 -4 -377 193 -858 125
1871A25L51p69N73m91l7J154j441K30J426j596J16Q58r87J054J1j529J061J24
$$ 125 476 -293 280 -211 -248 906 -535 -305 1121 -475 -359 499 -488 566 577 -952 109 233
1889B33p80J010p02m2R99j394N06P01r86R02k49q43J333n78q05J428o76k75N72
$$ 233 -547 463 -239 -281 718 -676 -170 531 -455 447 198 -645 688 110 -695 733 57 -218 354
1908C54j070M95J374j855O95O3o66Q42m48n04J343q36k53R65p49Q60J34j317R30
$$ 354 -716 -221 1153 -702 -7 56 -610 232 -216 -720 623 -213 -466 499 -250 610 744 -573 357
1927C57q8q04Q65l25j76Q54j438J38J407j005R6L12q37J099m21o19J307n44m48
$$ 357 269 -535 330 5 -171 683 -755 -617 790 -215 -119 193 -644 455 34 -585 722 178 -270
1946b70N69p77N94P56j589O25P18j244N97j83j17J150j141n02J323q45L77K95
$$ -270 299 -478 116 872 -717 -92 626 -618 -21 -204 -321 829 -312 -814 509 -336 41 336
1964C36q33Q17K51j179R18J32n28O56q63l5J054j036J07P05j044M33rn32J329
$$ 336 -497 320 571 -608 310 442 -86 570 -293 -328 726 -310 -203 502 -542 -109 -118 -650 679
1983F79j71j196Q60m07%R17j204N93N19j230Q00ro88J180n48o04J160p67l41P55
$$ 679 508 -688 172 -235 -235 682 -522 71 590 -640 160 151 -537 643 95 -509 651 -116 -457 298
2003B98l86J06L62j123R05K49m78L01n09k99J358j129N6J237j097L7L74q76P70
$$ 298 -88 18 380 -743 162 411 -67 234 -275 -574 784 -345 -289 948 -149 -112 262 -614 156
2022A56J28r06P37k67j54R08r13L75P54j457M84N71p20P82k42j022J248j70r78
$$ 156 284 -622 115 -152 -306 602 -311 64 818 -639 -155 416 -304 478 236 -786 462 292 -686
2041f86R14j15r2K62q38M47N18r09P24k69l43J016r52j82J345q11m56O15n71Q04
$$ -686 228 113 21 283 -555 -108 410 -499 225 -44 -387 629 -323 -505 840 29 -427 188 -383 421
2061D21N3j374J113j0n78N81m48J26Q40j313L1J016p76L40K68m82O36k60q66R80
$$ 421 474 -900 213 203 -375 206 -242 -116 724 -589 -558 458 -318 22 290 -192 444 184 -682 298
2081B98o1j71L26j041M78J018j451N28P05j006P34m79n35J305p18l45O62n16M35
$$ 298 237 66 392 -649 -171 847 -604 -76 629 -377 357 -122 -657 648 -70 -415 247 -269 166
2100A66O3q03R38r5r89Q10m1k56Q27j060KJ209q92k99P53n13L15R1q83P02K59
$$ 166 229 -574 364 269 -720 90 49 -207 620 -440 -438 771 -121 -420 333 -180 135 226 -657 45 304
2121C04m49M64o97L28P56j338O59P63j386P37r0k31R09o33o30J091o71j47O45
$$ 304 -145 319 -378 -50 706 -632 27 790 -596 141 51 -180 729 96 -534 557 -114 -261 384
2140C84j006Q73K71j252O57M69o60O00n69r3Q58j002J37Q00j001P48K8j223J470
$$ 384 -622 251 522 -730 -73 396 -264 336 -233 -326 532 -470 -333 467 -534 214 242 -981 489
2159D89p6r40P47k17l85P06m57O2P25n92k32J67l10J045q94l12J282j161N2R47
$$ 489 413 -527 220 3 -382 324 -133 -71 654 62 -170 -3 -313 732 -162 -474 808 -353 -301 646
2179F46j238N34Q89j732N07R80p94pL96l68O14q42J00Q44r22O82l12q52J313j19
$$ 646 -592 -58 831 -901 -394 586 -208 -215 181 -187 427 -415 -315 529 -393 289 -23 -875 438 319
2199C19j046J070j80n63Q14n90k63J144q82j49L84k63M59l70l61J165q57l60Q29
$$ 319 -727 343 163 -400 414 -176 -439 705 -177 -326 58 -205 254 -116 -477 688 -169 -529 300
2218C00l28K40M57j390O67M16q09O59l70o1O96q69q1J282q28j57M30o41L67M77
$$ 300 -28 212 669 -721 -54 362 -447 212 -158 -219 477 -392 -473 809 -19 -176 254 -387 -20 457
2238D57q29N79L04o91L24l14K36N38j141M97M52j173R44J05r33J174j78j110Q48
$$ 457 -372 207 511 -180 144 -170 66 604 -537 -40 412 -761 183 288 -645 529 351 -759 89
2257H9L08n02M10n23K9M94o24O61m71j78O30o05j36J209r70l95R90p63L4P69q15
$$ 89 397 -105 305 -218 -189 305 -319 342 -129 -307 323 -282 -418 791 -179 -574 416 -347 -313 456 -359
2278c59N37L23p25J86M1M0N15q46l1P92q09M18J74p33Q22n3q89R38j52n35N00
$$ -359 178 501 -224 -38 3 43 558 -288 -319 473 -336 82 256 -477 345 292 -597 341 189 -346 154
2299A54l07m2P15j028M64N19o99K74k22k01P53l41l57N83l27m5J41n15P31K06
$$ 154 -153 -195 520 -508 -44 475 -224 50 -172 -373 380 39 -318 265 -62 -107 34 -481 250 456
2319D56r92N49rl98P97o36j27P35m78l60Q68l08M1O4m61M09K0m78O25m93J03M98
$$ 456 -536 13 4 -394 403 -233 -360 375 -103 -463 405 97 138 202 -259 150 170 -308 317 -176 -73 425
2341D25q98K06Q99r13R9N75p64N55J19o50M75Q4n22L39k99L51J4n03N19P4m51
$$ 425 -473 -267 632 -281 -182 393 -371 184 303 -347 128 212 -310 29 -270 81 95 -408 111 185 -266
2362b66N64l47k77P00n51j28M87j26r9M39p11M93L3m48M05j34j65K26l80j2Q41
$$ -266 298 -49 -326 374 -177 -305 182 56 -43 396 -315 178 211 -237 168 34 -131 95 -285 -297 544
2383E44p49O1L66l94L02K2l99N30k11l90M62k06j75N51n42J23O27p94R4M17n68
$$ 544 -205 -144 222 -172 130 152 -247 283 72 -318 144 -62 -237 314 -228 -105 522 -272 -178 239 -329
2404c29N51k55l36P21k39j34N8k98L80J48p65N97L03p85P93l52l33O26l79l29
$$ -329 222 -33 -369 352 113 -21 37 -261 119 267 -498 99 402 -383 410 58 -275 351 -28 -357
2424c57O11l55P5k7k86O85j01n67L42J8k06L65m47Q2P02q88P3N99l48K18j30n54
$$ -357 254 -101 -26 -53 -339 346 245 -322 20 38 -168 197 -250 -168 534 -354 -281 318 -30 188 58 -496
2446d96O12j19k10L66j48r3K76n04M11M92o10k9K11m41O49n84n4O51l75k75M18
$$ -496 116 -3 -213 153 5 -88 188 -316 95 587 -23 -52 159 -282 367 -217 -271 380 5 -270 148
2467A48l28N38r9p33N46N8n90M57J56l01M94n66j14P59n50J84j02m67Q64k21n06
$$ 148 -180 358 259 -474 72 130 -460 -3 153 -148 346 -220 -334 425 -125 59 -43 -510 354 133 -373
2488c73O68j02l87M64n81K53L63m94J21K51m61M10p6j90N86n94j78N34l15L10
$$ -373 295 193 -194 270 -311 -58 305 -189 -68 183 -278 132 56 -134 452 -142 -320 214 -101 209
2508B09o3n87N50K97r15O47j96j40M15l94K9O44n80n9L96n37N02l7m94O15J23
$$ 209 146 -441 109 406 -509 138 -58 -198 217 -177 -148 496 -84 -143 253 -284 218 181 -313 302 425
2529D25p08L90m28K96M38p46P5O15p95L82P2k44P92l24n89N54j84j00L22m95K66
$$ 425 -283 107 -321 -25 413 -333 -258 357 -438 -56 16 -228 564 240 -349 205 21 -79 243 -252 14
2550A4L20p41L11K40k52L19k94k36N94l44j87O57n76K02J05n31M43L46o01L80
$$ 14 334 -407 -96 144 -108 211 -83 -319 275 -69 -256 401 -175 27 132 -399 44 390 -211 169
2570A69k76PN73m82k20O79o77K5O0j56N71j20m63L12k8m38Q40n14J91L35q17L81
$$ 169 -107 -100 473 -9 -229 450 -227 -202 -142 -298 273 153 -310 2 -26 -464 376 -138 53 388 -429 -48
2592d8M81n83K99j8l46O03l55m34P20k98m1J48l97M29K07p83M04L52n58N36l58
$$ -48 433 -150 149 131 -215 388 33 -401 319 21 -20 128 -269 160 367 -416 -12 340 -218 318 -40
2613d0j08N26m51l25N29m06N15N6o55O14k28n32O94j53k15N32p46J39N12n23L69
$$ -40 -148 378 -73 -398 131 -275 240 296 -359 255 27 -505 189 36 -179 353 -393 -254 258 -265 104
2634A04j09k97N86l98j37O02n10l9O08o61K54M37q90M25L06l58%l0M0L36m68l5
$$ 104 -5 -302 284 -114 -251 351 -159 -198 410 -251 3 440 -450 -25 281 -77 -77 -107 -67 269 -199 -234
2656b34N63n60K65R3n26N69M6p51P71j2m62M04k41q0K56k20j76M90l69K87k13
$$ -234 329 -231 34 127 -399 170 216 -535 236 224 -238 166 -75 -155 101 -119 -295 195 -174 113 -100
2677a00k73P76l45l08M75l10J78M17q58L13M79o01Q0K18k25K20m14M2N14n71K8
$$ -100 -373 403 58 -250 225 -85 93 510 -348 -35 444 -157 -77 141 -84 136 -278 -236 278 -293 -265
2698b65M21m80M97K5n54L35L57m40L67m48J2N07o82K25L61n65L32J09m71N11J81
$$ -265 156 -324 173 198 -356 -21 336 -104 263 -185 -173 334 -348 -123 238 -327 5 114 -357 154 335
2719C35o52K73J44k13K50j46K09n9o04L94L74n62M91l17m40R45m45n23Q90l48
$$ 335 -317 -44 100 -113 137 -9 200 141 -463 -69 305 -257 234 -83 -523 422 -23 -546 344 -4
2739dl01L40l83M18K63l73J53Q2n1K63n30J76N27p51j55O70q23O08J53o42M09
$$ -4 -305 35 -348 70 333 -40 113 195 144 407 -123 53 580 -171 -326 344 -479 129 282 -360 49
2760D9L5l57L06j44K65K55o42K03K74m92M04J54m06N21m48m10O53k72j10L68o72
$$ 49 84 -273 33 -111 154 409 -233 -30 244 -248 156 310 -96 425 -23 -433 220 -52 -162 206 -466
2781d66N06K54o18N50r5o65Q96l70m36Q87m78l50N58k63P6J77l81L88R1n89M87
$$ -466 40 294 -324 226 131 -534 362 -8 -444 443 -35 -385 173 -90 -14 163 -218 170 261 -328 159
2802A59l18R3M00o01M4P07p62J65N33o71K76K67p72M77K99m16L24l75L30J36o13
$$ 159 -159 -66 334 -267 -223 484 -278 -113 420 -251 25 292 -480 -3 296 -120 204 -171 159 295 -318
2823c18L74K83o79N90l50k63R05n27n57Q61k57l37N65l95L50o5n13N55R4o30P15
$$ -318 56 339 -340 250 -100 -363 542 15 -542 319 62 -275 290 -105 245 180 -333 222 316 -314 401
2844D01n94J08L61n58J01M59m31K3J42k60L57J02m65N04k70r6N64o28K03N14p53
$$ 401 -193 -85 276 -282 -181 278 -153 -130 12 -248 109 211 -254 250 -20 -116 448 -180 23 537 -216
2865b16N1K59k16M03l87j93O39m42j68O40o71M59K50r08O04L24q15N81N4n66O74
$$ -216 -165 94 -122 281 -106 -299 340 -102 -270 370 -301 158 408 -500 104 428 -387 194 248 -318 356
2886C56k97m76O66m37J21J29n20N59j16l97O82m16QM47l35j77Q78o97k63M98m48
$$ 356 59 -417 249 -188 -67 62 -458 101 -15 -412 270 -146 -138 309 -26 -203 675 -22 -285 213 -235
2907b35L28N9n39P50m92l35P78m18L6L29p72L55O48p21M07l8k85K95l05q3Q06
$$ -235 93 152 -387 363 -129 -464 314 -104 -68 261 -511 -156 492 -229 178 140 -145 150 -155 -238 568
2928E68m88l44L97m31L63K15q19Q01P4p64M10j91K09M57o75LN97o48L00N3m59
$$ 568 80 -264 133 -298 65 280 -539 262 336 -428 -18 -209 0 457 -218 -215 382 -266 34 87 -372
2949c72R31m92n88Q54j0o15M04m32R9N86o79R0L83k28K11m61R2P86n73j89N63
$$ -372 559 67 -521 333 323 -292 112 -320 -221 365 -314 -224 159 -69 142 -319 -227 559 -14 -203 360
2970C60o05L09K75o75N15K31p94M00J05q4L45n61L1M38m59j28L97l18N20k06o12
$$ 360 -245 64 339 -336 179 410 -384 16 121 37 382 -179 -148 290 -169 -297 100 -218 302 96 -516
2991e16Q86p1m69N90k85j54M32p46J78P26r59L38K3k37N11k78k77O28m27o8M37
$$ -516 370 299 -170 420 135 -19 413 -333 -155 571 -388 -50 -27 -264 247 -31 -308 320 -107 -175 262
3012B62m31L97K52q02L34J01k09L79k86j24M92o68j16Q87n93J78j87m17Q41J7
$$ 262 -169 228 480 -322 12 113 -96 283 -3 -127 365 -303 -419 468 -125 53 -134 -551 290 307
3032C07o24O24m35M1M00p33M55O04q16M6J79k28N09j09n87O35m03r4M30l96J44
$$ 307 -317 307 -128 -87 313 -420 35 639 -177 -131 48 -180 329 220 -367 268 -135 -229 201 -195 -51
3053e1L64p87M87L01n57M29j37k49N39n63j59R27n75J12K29o27K78J60m47L36
$$ -51 313 -474 13 314 -243 186 49 -200 339 -224 -383 544 -31 81 310 -317 -39 121 -326 10
3073A0N4j23L34n75L33O14q40M1N10o68M63K59n32L78l92k18L52m5k4M23n94l5
$$ 10 64 -59 275 -300 33 647 -193 -152 358 -310 153 412 -120 258 -134 -352 0 -45 -69 354 -240 -275
3095b75N14n99L08L10j91K56n38pN29k61k34M07l93K59K08p19N36K05o53M24j29
$$ -275 239 -360 -52 258 67 323 -215 -222 307 46 -188 219 -174 85 293 -426 110 315 -338 86 -43
3116d3p7M84n00j1O11o10J85Rl77O82k20m20M73p5k37J82l16J83M38q06N23K11
$$ -43 -120 364 -136 -147 464 -146 39 48 -329 353 133 -287 186 111 -126 56 -260 -77 361 -445 78 289
3138B89m63L12l12m11Q86k29l77Q71o09L47L1q98M27L63n26L52l3k90L87k14j54
$$ 289 -174 138 -174 -585 301 72 -305 566 -43 304 335 -563 -136 227 -299 53 20 -270 117 -97 -251
3159b51M87m44mL31l72M38O1o74Q72l04k87M21k03j65N26q54J28P16o90K36N6
$$ -251 236 -208 -212 119 -253 185 246 -428 444 140 -147 274 71 -94 432 -422 -294 422 -268 -32 24
3180B4m33N95Km65O23l33K0n3k86L29M09p39L13Pl06M55k10l32P43n86n8N90l47
$$ 24 -409 186 188 -277 346 13 33 -20 -306 23 432 -307 6 13 -293 162 -48 -380 363 -223 -281 309 -38
3203c8R8Q8l89L45Q9m95N34k49R5L45o67K13N42o94K13N4l36M39J7p52Q23p7o08
$$ -38 60 148 -241 104 193 -302 232 -17 78 423 -244 -31 511 -183 30 84 -252 187 204 -548 275 198 -410
3226d10L34J01j2L61p73K80L92o41L79J52j29J93k38l95P29l35j52L98n44N31
$$ -410 -76 25 13 374 -399 -119 273 -368 11 163 34 227 -11 -406 323 -12 -164 234 -310 221
3246B21p0m85M99Q4l92M32m55k48P73m77j75O60n49K82N8m38N27k21k37K42m1
$$ 221 151 -334 165 249 -143 289 -166 -414 359 -118 -293 367 -182 100 158 -280 247 26 -211 31 -10
3267a0j66N51p24K99N75j025K22N13n40O22j01n06M88j07k31L87m33M68m9p12
$$ -10 -176 375 -349 -50 525 -500 -278 235 -305 317 216 -290 198 91 -140 247 -186 282 233 -479
3287d79N52K95n71K97j21k38N85m28k44Q42n40j1K67l28L30K20o20N23k67j48
$$ -479 73 368 -203 94 -27 -265 320 -108 -352 490 -50 -61 206 -122 208 428 -192 331 64 -84
3307h4N44q81L16O20r07K01M62o32N77k1o12O97k58j71L46k4r0K28o29N13N8n12
$$ -84 460 -421 -105 515 -392 -191 271 -361 216 195 -417 280 22 -149 197 173 83 311 -318 195 253 -259
3329b59M05L0l93M41k86k18O83n51j56M25l72L29J96n72O30r0p02O73j0k28L82
$$ -259 146 176 -217 224 -62 -280 403 -148 -304 121 -251 78 274 -298 332 242 -460 213 203 -25 357
3350C57o89Q3L83m0or6l99M91j26m60Q19l62n1K65o70L63O28o93J67J70k95K53
$$ 357 -332 -249 134 94 88 -8 -407 84 -42 -502 317 -45 -96 169 -501 -138 490 -203 -36 134 -161 92
3372I2q1j31O00p26L1L79m46J80L40o67N41lo92P42o2qJ90l74k8N05n00K94M1
$$ 92 11 -120 480 -246 -215 164 -282 -102 238 -429 112 109 -583 159 97 89 279 -95 -123 382 -118 176 217
3395B17l65M67l06l02O01j63n54O24l90J19L68p15K96M15o38M38k50j64P96l88
$$ 217 -148 319 13 -289 312 149 -405 219 -171 -52 316 -399 -103 312 -326 112 -138 -302 494 106
3415A06l50O41n03O2N03o87K30O2m17L09Q1k13K10p3j6L33l68m4N07l71K06j11
$$ 106 -244 397 -106 -44 459 -228 2 64 -353 -44 37 -176 34 -39 -55 278 -90 -134 373 2 208 97
3437I7l65N84J40n92K55%l50K52j78J56K86n87J53K35l30M59k00m97P90n16N4
$$ 97 -268 316 456 -136 119 119 -231 21 -157 -1 285 -302 -149 86 -244 215 15 -482 308 -208 -154
3458a54L95j57O1Q1n70L60J62k35J57l80O8O49o01r0N80n02pK08k44J87K71m47
$$ -154 241 84 145 226 -344 16 178 -57 100 -280 -212 437 -164 -254 326 -176 -183 25 -219 -32 239 -208
3480b08L86r0l04O09m61J08K64n35R4L84m48K47m2j46K06N6n38N74k25j2L62o67
$$ -208 178 88 -216 393 -68 40 304 -231 -137 247 -201 46 4 -142 64 120 -418 156 -69 -81 281 -386
3502c86M98L35o03L41k6k28K75k99k51O19k35j43L51l01j14J17j63L67M4m53K96
$$ -386 112 447 -156 185 159 -69 206 -93 -344 275 40 -103 248 -53 -167 -50 -213 154 198 -255 41
3523D1j72P8K70n34K53K61m37K81Q3k19K57L8p63P40j34k7L25n75k4N46m79K89
$$ 41 -131 -53 217 -317 -64 197 -240 41 124 -95 162 200 -563 177 43 16 341 -234 -258 288 -191 98
3545I8K09m97L33j44k15P65m33j90L48k74P4O9n19L98K96o09J48J65j11L61j65
$$ 98 307 -190 143 -1 -216 549 116 -74 274 0 74 143 -376 22 318 -291 -143 22 -89 272 107
3566A07k03L00l69J23J55j11L19l12j85L28p1k22L81k06j20J75k91K15K06l75
$$ 107 -96 204 -165 -42 113 2 321 9 -176 152 81 -141 240 34 -86 89 -202 13 219 -156
3586a56J88M1k12L59l46N1L01k20r0J89l76L81J68m39J5K42k08J34p1l42O82l29
$$ -156 32 73 -139 220 -126 -75 226 6 -84 105 -271 110 278 -161 -146 96 -112 22 -49 -391 291 -38
3608c8q7N16l51J2J17m51M85p6m94N20O8k56K77k60j94N58m21J36K6l97M45j03
$$ -38 -125 391 40 52 169 -282 203 127 -367 153 221 -35 242 -18 -212 346 -75 61 87 -310 135 32
3630C2k84L89k17p4L54k12K41J31n88J73L04m97K34J08l91M25j27k75N56k90r5
$$ 32 -252 137 -80 -154 200 -12 229 360 -228 -55 249 -248 -14 94 -297 128 1 -274 282 -8 -103
3651a03K03m85L09K84n33O26o2m50L73k97K5M13n15J42K75m19K20Q3l36L47j04
$$ -103 100 -385 -76 208 -325 301 239 -211 162 -135 -110 303 -212 -70 205 -214 6 89 -247 100 -4
3672dj70L12k5q8L49o48J38M27m21O3K38k16K51p7l74O60l91l4L33m70N3K59m70
$$ -4 -174 138 113 25 374 -274 -136 291 -130 -67 171 -45 206 129 -245 415 24 -10 323 -147 -94 165 -305
3695c05M66J37m43J97n3k56P31m54k54N36n65J97K96l51K03l5l64M27N6k82K10
$$ -305 161 298 -145 52 -1 -257 474 20 -234 302 -263 -66 230 -121 82 47 -317 110 166 -116 94
3716I4j91K1L36n21J27L51k96J58j19j04P9O8q2L28m05O0J61l88M66R0n43L18
$$ 94 -97 -76 260 -261 -134 217 -79 79 -40 -144 -65 3 -79 249 -156 -96 65 -323 143 233 -310 8
3738HRk78M92l09ML41m64o5L70o3R9k6o22O07J21m33O56n93p3M53n35J0O75n11
$$ 8 17 -261 231 -78 -74 267 -197 -262 108 45 144 118 -504 103 224 -209 447 -146 -219 234 -301 -291 384 -127
3762a27J43J79l09K98m4k51K69k02j24K10l62M52K65o23J70J66k03Q7j03lL09
$$ -127 16 195 -114 184 140 -111 158 -44 -168 42 -320 132 397 -226 -56 110 -93 -6 -109 -112 197
3783A97m23Q4L61k96jJ41l92M15Ql27K80K3o6J43m97K58N15n18J39J04k72L01
$$ 197 -226 -142 219 -77 -78 63 -329 86 94 -233 47 70 4 147 -350 -92 423 -95 44 148 -124 177
3805A77k08k78O71l56k19L80k15p0M40m78L10J80o92N84l11j61O59l72l82O24
$$ 177 -31 -309 362 6 -213 167 -48 -118 322 -156 154 334 -358 226 -85 -246 413 41 -341 283
3825B83k66r8L42m77K39J67n17L16L70n27J25k74J92L99l35K97J30o70K78J95
$$ 283 17 -81 261 -216 23 190 -327 -11 359 -168 -43 -317 -125 274 -61 236 366 -304 -26 169
3845A69n71N01J2m33M50n5j91K87l12L36N6n26M33j5k37L72l73k89O05k69j10
$$ 169 -402 99 111 -322 128 73 -118 169 -143 193 249 -277 156 141 -96 276 -97 -386 219 -50 -160
3866a60K77k75J51J34n40M59J80m07J23J23j82L56k93j42N68m14j26N01l61K01
$$ -160 117 -158 -7 127 -413 46 226 -181 -58 65 -117 239 -54 -196 372 -42 -168 333 -28 173
3886A73p0l10K09k6k83M20j53l5K91m21J15K73k75Q6J31l57M99k87p3K00k21J44
$$ 173 103 -207 2 -24 -307 113 -40 -75 216 -205 -90 183 -92 -6 125 -232 267 -20 -93 107 -114 30
3908C0J42m59K19K22m94L88P3l12M02l09n5M29l31rM9K2m7J84m04L92o2M2J6k24
$$ 30 172 -287 -68 154 -340 48 121 -191 211 -98 -153 276 -55 -64 -15 7 -40 144 -260 132 70 112 128 -96
3932i6J04J46l90R0K37p2J51l7k50J64l9j82M09j25r1P8m13M14M1l73K94K19o05
$$ -96 8 154 -236 -146 91 19 170 133 -117 47 8 -174 235 110 19 97 -316 98 139 -234 60 279 -326
3955c26N61j59j55M48n34L1J61j26J89J40n81M90j02m01M73J36m54M80n11J2M99
$$ -326 235 76 -79 369 -165 -134 27 -99 90 230 -351 139 37 -364 109 245 -209 271 -240 -228 271
3976B71k89n1K98l54J95O1l16L04j46j64M25l15J78J42m56K38K63m48P1J04q1
$$ 271 -18 -69 229 -125 70 131 -185 119 -27 -191 234 -81 97 239 -217 21 284 -164 -93 11 -70
3997g0K54j48k96L35q0q2Q1M0L3l7m02K68L16n13M29l35Q5M13l90M1L30m26J50
$$ -70 184 36 -260 75 -5 -87 -6 34 67 30 -372 -104 212 -301 128 -207 -122 291 -99 -58 272 -154 -4
4020dm6k06K61k4j31J69M0k78M63l71K27J97n17J59L58n33K40Lk51N86k43j96
$$ -4 -50 -256 5 -19 -150 19 59 -219 244 -127 100 297 -220 -61 297 -236 4 7 -244 342 99 -97
4042i7J68r0o6L02m75K19K20l59J75N9p7K55k45j49M33j74k15L48l27K35Q0l92
$$ -97 71 -19 -85 217 -258 -39 181 -178 -3 56 -21 234 -11 -160 273 99 -116 232 -95 140 220 -172
4064a72L19k8l17K05l3LL69n04P4K52j44J81k26k86L06n5k23M48k45r7L31l01
$$ -172 147 119 -198 7 -26 -23 346 -158 -84 168 24 205 -21 -307 -1 -56 -279 169 -76 -173 158 -143
4086a43K46K12m91J42K48l49J93j68j95O01l36j60L60k40K7Q6l27L97j69j93M46
$$ -143 103 315 -176 -34 214 -135 58 -110 -305 296 -40 -200 160 -80 -53 33 -294 103 -66 -259 187
4107A87j36q8J53l49p4M68o76O06J47l51K53j39k49K86r9J26j2j63J48K96o00
$$ 187 51 -37 116 -233 -307 161 -515 91 238 -113 140 1 -248 38 -61 65 53 -110 38 334 -266
4128b66K98J6j11J65k12q5M43j87l63M01l24KK03j80M27r9m39N80k61j27K90k90
$$ -266 32 48 -63 102 -110 -195 248 61 -302 99 -225 -223 -20 -200 227 128 -311 269 8 -119 171 -119
4150a19J2L93m87R1L33l83K60j43l49M85n8k79K58k30J87J39n07L74L34m74K5
$$ -119 -107 286 -201 -110 223 -160 100 -43 -392 93 35 -244 14 -216 -29 110 -397 -23 311 -163 -138
4171a38K64m13N36j93j45M24k36k65M41n38M26K3n51L86K04l81K74k3k61L67l31
$$ -138 126 -287 249 56 -89 335 99 -166 275 -263 163 186 -365 21 225 -156 118 95 -166 201 -130
4192a30r3M80m27K94N3n55M05Q8l93M62q3j80M68o17L00K23n56K09J93l00L33
$$ -130 -223 257 -170 124 177 -378 27 115 -278 184 101 -79 389 -228 72 295 -261 -52 141 -159 174
4213A74j05j46J29p6k55M81k03R6L5l76K56K13l91K56Q1n19M66l32J54L59k58
$$ 174 69 -77 52 -24 -279 202 -1 95 130 -246 10 223 -168 88 169 -350 116 -216 -62 297 39
4234C9RQ9l39K31J78m28M17Pl60J45r2m6M42n78K81J79m94M42m8k57N85l04m46
$$ 39 48 137 -202 29 207 -221 196 203 -157 -12 -104 -150 292 -286 -5 174 -320 122 74 -183 402 98 -348
4257c48N41o8k27L27l98J42M11m46L01j19k64K76k95j13M10j50k00K91k36J06
$$ -348 193 125 -102 225 -173 -31 380 -66 235 116 -148 128 -167 -280 130 -20 -220 71 -165 -59
4277e9J72m78O08m3l57J10Kj11L02l65J78K72k74l4L72o91N49l0n31M69r0j72
$$ -59 113 -365 243 200 -157 -47 -45 -156 146 -219 -41 231 -43 -77 295 -396 153 123 -408 61 -29 -201
4299b01L51m00K59J71l12J14K53l97K57q6k53N81k44k18L34l36O2K68l40K06P7
$$ -201 150 -250 9 180 -132 -18 235 -162 95 9 -244 337 93 -125 209 -127 -65 203 -137 69 146
4320A46n25N12j13n4L58l88l7M08m75J67L86o25M04m2m48O00k73m33O25k04j05
$$ 146 -379 133 20 -34 324 -64 -101 307 -168 -1 385 -240 164 122 -326 274 1 -432 193 -11 -116
4341a16J83l92K14M71l68J53k8m78N52k05l06P20l63j05K01m25L78J99o42K87
$$ -116 67 -325 -111 360 -8 145 117 -361 191 -14 -320 400 37 -68 133 -292 86 285 -357 -70
4361g0J83m86M98k09l9K45l58K7M58l34J59K9k94L35J30n63O38k64j12K29l23
$$ -70 113 -373 125 -84 -123 122 -236 -209 249 -85 74 103 -191 144 274 -289 349 85 -27 202 -121
4382a21J95J83l76P7J36j91M1R9j65L59k35k75M08k25M7R2j79Q3L50o14M42J5
$$ -121 74 257 -119 -42 94 -97 -56 43 -122 237 2 -273 135 -90 -43 49 -130 -47 303 -311 131 146
4404A46l46M23k72r8L75k42oK35n14L01K7l02N22lk92K12j69r5M28n09J75J94
$$ 146 -200 223 -49 -147 228 -14 -20 215 -299 2 29 -273 249 246 -46 166 -3 -98 330 -179 -4 190
4426A90n11M80j67j75K96K0l12K79l1k22K65j55k00M75n54L98J5j61K91j33l16
$$ 190 -321 159 -8 -183 113 133 -179 100 69 -153 112 -43 -243 232 -322 76 91 -70 221 88 -228
4447b28M92k31j23L86m60K00r9k29M59K3o13O08k39j33M97j63l17L19k61J21q
$$ -228 264 33 -90 296 -164 36 -63 -292 167 190 -423 185 -54 -187 310 147 -170 149 -112 9 1
4468Aj45M01k55l99O73k35m26P17m57N7J74k72k5N18k49j4j06k44N58l09k01N35
$$ 1 -144 257 2 -397 276 41 -385 332 -125 -68 106 -166 -191 327 78 64 -42 -286 272 -37 -238 297
4490B97k50k24L56l88L44J75p75M66j9k06O16k71l50N17l55p2L92j84J27j73k54
$$ 297 47 -177 179 -209 135 310 -465 1 -18 -224 392 121 -229 288 -67 -139 253 69 196 23 -231
4511b31L31j11j76K01J8q1L49m47M4M50o41K20l4p1K85O5n86P07l43k83L63j67
$$ -231 100 -11 -187 14 32 -49 300 -147 -103 347 -294 -74 -108 -179 106 171 -415 292 -51 -334 29 -138
4533a38Q9K92m40K48J15n18L62J05l71O66m46k16N05k13J00J23k97K47J93p29
$$ -138 -49 243 -197 51 166 -352 10 115 -256 410 -36 -252 253 40 140 263 -34 213 406 -323
4553c23M78J0j99K03k37R4K00l99J91J97l38K01p2p3K26O9m40L14l60K53L71m92
$$ -323 155 165 -34 169 -68 26 226 -173 18 215 -123 78 6 -67 159 228 -212 102 -258 -5 366 -126
4575a26j8M58n55L26J74l88K74j14l50M55r1l27L69k29K72l9l01L53k55j07K98
$$ -126 -144 314 -241 85 259 -129 145 31 -319 136 45 -282 87 -142 130 91 -210 143 -112 -219 79
4596G9r1j84N30l72j30M00k99J54J7l92O04k22j33L21k17j65L24k14K23J79o38
$$ 79 -12 -196 334 -38 -168 232 -67 87 104 -288 316 94 -39 282 65 -100 224 10 233 412 -226
4617b26K19J54k84M12j40k85L58k24j61L58l77J64Q7l13L59N5m47M56o8l87N10
$$ -226 -7 147 -137 275 135 -150 208 -16 -177 181 -196 -32 55 -258 101 156 -291 165 97 -290 220
4638B20k63l3K18j41j39J6k3J41R1k20L12j62j25K56j33r5K19m50J04L51k82M7
$$ 220 -43 -76 142 1 -138 -122 -145 -4 87 -133 179 17 -108 148 15 -80 139 -311 -207 144 -138 -91
4660i1K38j82J93j68k35K98j49M5J62k19J84K84o51K23K72m89L12m3j87M46l29
$$ -91 147 -35 158 -10 -245 53 -96 -51 111 -108 76 360 -291 -68 204 -285 27 -16 -203 243 -86
4681h6o8M38l66P7J86m46L05K58m26N7K76j72J28k94K3K31l20O7K14k54M46j94
$$ -86 -154 284 -82 -5 181 -265 40 298 -128 -71 205 33 161 -133 -110 121 -199 -132 82 -172 274 80
4703H0j53K30j64m3J60j44Q6J78m26K52K03n13K01J81j41K35j99k17M24k12N9
$$ 80 -73 157 -7 -50 110 -34 52 230 -196 56 259 -254 -53 128 -13 222 23 -194 230 18 77
4724G7L1j66Q7J90n48M78N6l71K25j61K9J09n6R0R5m04J82j69k5J76J73k59L57
$$ 77 108 -58 29 219 -329 149 205 -166 59 -102 -73 36 -20 70 165 -239 -57 -226 -251 -75 98 -161 196
4747A96k94j5L71l90J80K65l95J62L5j91K46k15j18L00j21k34L03q5p3K60m51
$$ 196 -98 -113 258 -132 48 313 -82 80 115 -76 170 -45 -163 137 16 -218 85 0 -73 187 -264
4768b64L05R0k30K53j23k33M37l53j8L76j92Mj10j01K28ok52J94o4j39L62l47
$$ -264 41 131 -99 154 31 -202 235 -118 -136 240 48 52 -58 -159 69 63 -189 5 -59 -198 164 -183
4790a83P8L27l99J06K80l15K96j58j80K54j67l6L47l20J43J41m96J56J97l04M10
$$ -183 -105 222 -177 -71 209 -106 190 32 -148 106 -61 -97 250 -70 73 214 -282 -126 71 -233 177
4811A77l20L5K70j09k29N88k57j30J31m49L78m7l24L35j39J1J52l01K44J38k81
$$ 177 -143 -108 162 53 -176 412 155 25 156 -293 85 38 -286 49 -90 -79 73 -228 16 154 -127
4832a27L1J92o7l6J38k71L36k42j45M44k29M2K27m78J45K57m73K46J10l31M01
$$ -127 -96 96 29 -7 131 -140 196 -46 -191 253 24 66 293 -185 -40 217 -256 -10 100 -231 170
4853A70k13m3K44j69j5J99j87P3Q6n00M90j55k22R5Q6r6L39k30p4K91k70O0j8
$$ 170 -43 -86 158 -11 -26 173 -14 59 145 -355 135 -20 -242 -147 -61 -157 182 -48 -122 169 -101 -41 -59
4876e9o5K79p7j40J71q1j28J19N2j39K19k26P3L00l22O1j12k22N01k20l12M39
$$ -59 -124 155 78 -62 109 28 -100 19 71 -68 151 -75 -2 298 -24 37 -75 -297 204 -16 -328 111
4898A11n1j93L99m04K01j02j08K53J6k83K63j77J59J76l34j3J18j54J89K5j75
$$ 111 60 -133 266 -138 63 -39 -147 106 122 -161 102 -75 84 260 -74 -87 31 -123 66 91 -84
4919h4K08j93m7L53k21%K48m73K28K40m78J85L0m7J23j5l06L53L8m09J94k29K66
$$ -84 124 -69 -116 237 16 16 264 -209 19 259 -219 -34 -4 -51 72 57 -249 104 142 -267 -73 -302 -36
4942c6P7l21K10J90j87K03k05K5K31l62J29J99k24K2K15l61K13k03J22K41k49
$$ -36 41 -280 -70 120 -67 136 -69 -44 187 -175 -46 153 -71 -49 166 -195 18 -185 -63 178 -71
4963g1q2J64k00J70K68k77mP9r9Q3O5k27J87l2j68K99lj84J98l40K17P4l99K41
$$ -71 -153 11 -189 -19 249 -28 -32 47 -52 31 96 -131 56 24 -144 155 152 -32 166 -174 43 117 -282 -41
4987d1J06l01L58p9j12K22k53L5L4J95j32J28n20N25J03n43P4J82k06M02j85Q2
$$ -41 65 -236 122 43 -69 153 -100 -65 -31 164 32 160 -360 165 268 -275 -201 -19 -225 177 -8 74
5009G4r9k46J84K81m50M46k34j14L67l22J78p5r3M5K53l09J67j2k09M15k53j21
$$ 74 -25 -271 -87 194 -256 190 -44 -158 209 -113 65 -10 -103 -58 195 -114 53 41 -168 247 -6 -127
5031a27L37k62j63K73j36qK78l16J61J51l93L70j77j49L22k48k2L70k10r9J38
$$ -127 210 -52 -215 58 -78 -86 192 -124 37 188 -205 165 -12 -161 161 -87 -109 261 51 -48 90
5052I0l03L00o7k13J88J82m20M32l52K11J40j49j10J37j29l2P5p3J42L0j58k1
$$ 90 -213 87 20 -193 -5 177 -243 189 -163 48 188 39 -71 66 -63 -95 -20 -93 49 79 -79 -100
5074a00J21l0k5j34J36J51k18k1J54j28L44k58qM16l69k7J19k22N8J26l08K31
$$ -100 21 -9 -34 -168 -32 119 -99 -120 34 -94 250 -8 -16 400 31 4 123 -99 -41 85 -223 8
5096HJ67m52M71k81J23L3j43n7K26l51J65N3J41m4J16l03J33O4k02M6O9R2Pk56
$$ 8 175 -277 194 -87 36 69 -74 -131 95 -256 -91 -38 103 59 175 -128 5 69 -133 -87 -18 74 81 -175
5120a75J40J52k04J93k31n9J75P6k06K56p8l5J70l30L14K9l79J83K72k77K09k84
$$ -175 -35 117 -87 106 -125 -184 -9 67 -139 117 39 4 174 -156 158 187 -192 -9 263 -14 195 -89
5142h9J44J95l46j24J61J6K06n8j68J14m0k47M08l8k63L18l11M7J74k65J87N5
$$ -89 55 250 -96 -220 -59 -43 163 105 -63 51 11 -236 172 134 -129 189 -122 -75 99 -166 21 76
5164G6r3N0k14j23N09j77m3O6r7j0L43n44L47R4m11M04j29n6l3J5Q6K02k55oR5
$$ 76 -17 33 -181 -304 205 28 -15 51 -46 -56 287 -257 90 184 -227 177 48 -8 -41 -26 60 262 7 1 96
5189I6j41J51n8j8n3q1M8L6K9r4J59j14k2K13l75J56J9k1J87j54m6q9O5O8J87
$$ 96 -45 106 48 30 -23 -104 -56 -20 9 -85 74 -40 -62 151 -224 -68 -49 -70 117 -37 -83 -172 -107 -39 148
5214A48j29K5J6r4l0J14k75L40r1n8N0k8j22J64q7Q0J24k66J11K5k16L03m0jJ13
$$ 148 19 44 60 -34 -64 50 -225 115 24 -34 16 -12 -134 30 -57 23 147 -119 -8 17 -199 104 64 63 176
5239A76o2j72M6o9K0jl8J10J33l34K46p3j21K41j26n1N3o8K02N0k44J3J08O0J53
$$ 176 114 -58 -12 -81 -61 -62 -100 10 143 -191 55 -18 -139 102 -24 -75 -22 -90 112 162 -82 -69 39 99 252
5264B52k41p8O0P1k0N7j64K31q4k77J49J26q5L8j6k5K45l14J20o9n3Q4K2j49L74
$$ 252 11 -67 -7 64 44 101 -63 168 84 -193 -44 82 -3 35 19 -6 239 -75 45 -24 -77 7 29 -120 254
5289B54Jm55J44n1J07J14j95j1K75j66j07M8j94L20J4j87N2j16M7mQ7j33M46m56
$$ 254 255 -200 -56 -107 0 114 -81 -92 183 17 -90 -42 -236 84 98 -89 -37 -153 -106 -110 -23 -156 290 -166
5313a66J85J42l57K32J3p4J13j35n9K25o0j00J47k43J84P8j82J95k21p2K41n4
$$ -166 19 161 -196 36 49 -25 88 -47 -106 119 59 -41 106 -137 47 125 -57 138 -83 -155 86 32
5335C2p1J71k02O9L0k02Q9J46l46M60j22j59O3PJ31J27l93K19N1om8J8K0n9N2
$$ 32 -39 132 -70 -1 29 -173 -84 62 -284 176 54 -105 -42 -35 96 223 -170 49 100 94 46 64 84 25 77
5360G7j84K98j64j39K80k47oJ10k7N2J95n59M78k60K3P7j35O4K27l06J07K03l72
$$ 77 -107 191 27 -112 168 -79 -85 25 -2 50 245 -314 164 -96 -73 4 -131 -67 160 -146 -39 164 -208
5383b08K45R3l00J76K9j22J57l63J77J32j13J46M0k15J41Ml0L57l98M3K78r4k98
$$ -208 37 130 -170 6 35 -87 70 -293 -116 16 -97 49 89 -126 15 19 -11 346 -52 -9 269 175 -123
5406a23J75k38J34K78m21J01J88j64J94j39J14k2k86J14J86k91K82J50m49K99
$$ -123 52 -186 -52 226 -195 -94 94 -70 124 -15 99 77 -209 -95 91 -200 82 232 -217 82
5426H2P1j69J45j99j5K71m03K63J95j95k9j17JK2J94j30K75k23l77M46k29N1K78
$$ 82 153 -16 129 -70 -85 186 -217 46 241 46 17 -100 -99 -77 117 -13 262 39 -338 108 -121 -70 208
5449B08m47o0L19j29K34n1l24M84k51j29M44j75j04K06n54L40K82l72K60k29J10
$$ 208 -239 -299 20 -109 125 74 -250 234 -17 -146 298 123 19 225 -329 11 293 -79 181 -48 62
5470F2J05k90O6K28j15j36J14j83K66O0m95L98O4j76P1j41J68J48k47NP4j41K5
$$ 62 167 -123 -57 171 56 -80 34 -149 117 177 -318 80 144 -32 39 -102 66 214 -33 -28 46 -95 -70
5493g0J81k91M66k12l71M69o7j51L38m91J62L16l20J75j44N5K4j61L4L28k09M3
$$ -70 111 -180 286 74 -297 172 105 -46 292 -199 -37 279 -41 134 -10 45 69 -92 -58 270 61 104
5515A04j42p6J07j15j55J09K54l8j11k7O1J62l81K57K04l60K10j73P8J83j27j24
$$ 104 -38 -114 -7 -122 -277 -168 86 48 -63 -90 -29 133 -248 9 213 -147 63 -110 -32 151 24 -100
5537a00R0qKlp3J2K02l29K03K23m58K59J2j63K77j49j41L01j91Q0K9k38L48k82
$$ -100 -10 -18 -16 -19 -92 -80 122 -207 -4 219 -239 20 32 -131 146 -3 -144 157 -34 46 75 -163 185 -97
5561i7o8J65j7M5J96j69j83K63l78J95J40p9J02J01k53J58j41p2J61k2M6N8l21
$$ -97 -165 0 -17 28 224 55 -128 135 -243 -48 92 13 115 216 -37 121 -20 -92 69 47 93 151 -170
5584a70K97q9k26K1r7K04J85k56o0L16q8j87K33k26R4K34k28L7K0j3J47l92K80
$$ -170 127 38 -188 -167 -264 -60 125 -131 -191 125 37 -150 83 -143 -49 185 -43 -6 14 1 148 -244 36
5607C6J17k24j00L18k93J42K5l12L62Jj95L18l88J46K02l17J97K72l64N7kq6K12
$$ 36 153 -71 -171 147 -146 -4 21 -291 71 72 -123 195 -193 -47 155 -162 35 307 -57 0 -2 -88 124
5630A24r7j95L33p8k85L71k85J16K40m61K75Q8l76M95m24J60R8j96j48M71l50
$$ 124 27 -168 165 87 -198 173 -112 4 244 -217 58 146 -230 265 -159 1 99 -97 -245 226 -124
5651a24L3J17k14L35r8l6K27j28j49J31p1M3J27k87j06L53k17J64j60j76M72r9
$$ -124 -91 26 -188 147 49 13 240 112 -37 94 23 66 193 -94 -200 153 -64 100 -60 -236 236 137
5673A37k82L11j51o7P4j47N2K99l92J24J14pR3j42k54L59j10J11L5j24Ml4l41
$$ 137 -145 166 15 -52 22 -125 -73 226 -166 -42 72 65 158 16 -238 121 11 122 157 33 37 3 -338
5696c38M14l9j25N2j28K9L78l36JJ32k77K25N2m9J86j14l24L30j79r2L18j36O8
$$ -338 76 37 -88 -36 -164 -135 243 -93 -92 40 -237 -12 40 -9 177 63 -261 69 -110 -202 116 -20 48
5719D8O4m07J59K27k64L44k18k28L62Qj58R9p8N8J66l83L03m2j95J13m8j7K92
$$ 48 112 -295 -136 91 -173 171 -47 -275 87 95 -63 36 -42 16 182 -201 102 60 -135 -22 -70 -87 205
5742B05k97K1K10j66k2J62Q9p8k22r0K85j58k3K24j71J60J06l56NK26k07P3m3
$$ 205 -92 -71 139 -27 -49 113 202 124 -98 -188 97 -61 -84 140 -31 129 235 -121 -116 110 -97 -24 -67
5765f7j07J81K7k11L72j84j54J85j26L3Q1k80K76Q7j28RRk9J08J1j86K55k18L2
$$ -67 -174 7 34 -177 195 11 -143 42 -84 -51 30 -250 26 113 -15 -6 3 -26 82 93 -93 162 -56 -24
5789b4J60k44J68J49k62J52R9k61K16j90j27K56j43r3L07k33K51j72k65M16j84
$$ -24 136 -108 60 209 -53 99 198 -63 153 -37 -164 92 -51 -144 163 -70 181 9 -256 160 -24
5810b4jJ39j01r9L10k87Q8K87m99J33n8j7M37m11q5L68l22N6J28l69K29J82l10
$$ -24 -25 114 13 -86 224 -63 25 312 -187 -54 -112 -129 308 -103 -188 180 -142 -86 42 -327 -98 84 -226
5833b26J62K19k82R4p2jK72k56K16K06l15L9n2p7J98r0k08L25k31j6J74j26m6
$$ -226 -64 155 -127 -33 -105 -106 166 -90 126 332 17 56 4 -73 125 35 -173 152 -79 -95 79 -47 -93
5856i3J87n00L83J24k20K75j74k3K2NQ3J03k41Q2O0k57R1L12m52J45K37r3K29
$$ -93 94 -406 -23 101 -119 156 -18 -41 -19 -14 69 172 -69 13 73 -184 -93 219 -233 -88 149 56 285
5879B85m48K2K73k23j70J72K1K64ok46J43P1l50K58k20J76K07m68Q1J59j09J46
$$ 285 -163 -141 132 -91 -261 -89 -68 196 190 -56 87 158 -192 66 -154 22 229 -239 -158 1 -108 38
5901C8j28J4J57j05o5J48K9j86N6k67K60J34r6O8M2l42N05n17J06M29m48J63K21
$$ 38 -90 -76 81 -24 -89 59 88 -98 -42 -309 -49 85 -11 57 99 -243 262 -255 -149 280 -168 -5 216
5924B16k39M4j3j48L75k17p6K20j63j28L68m01R4J83j51J95l8k95K57n1l00L89
$$ 216 -23 21 8 -140 235 18 -58 162 -1 -129 239 -162 -68 115 -36 159 121 -174 83 32 -268 121
5946A21j57k07L15l42K60J17k41K52K1j07pP7k70L96k98k31N51m01M58j46k58
$$ 121 -36 -243 72 -270 -10 107 -134 118 139 32 25 102 -168 228 -70 -301 250 -151 307 161 -97
5967i7rK52l04J91M7j57J90l97K82J38k38n9K93k03J42jj98L08j44k64L14j80
$$ -97 -106 146 -158 33 80 -77 113 -284 -2 136 -102 -161 132 -71 71 70 -128 180 36 -228 86 -94
5989i4J40R8j55L8R0j63N2J14k96N06l33r4K00j45P7J63l19J15r2j30L36l7j19
$$ -94 46 144 -11 27 117 -46 6 120 -176 330 -3 -97 103 -42 35 198 -121 -6 -98 -228 108 71 -48
6012d8J55j65o8K40j29Q2J21j0j93J22k67L16k38K1J41j59r7L17l23J06K52l96
$$ -48 107 -58 -126 114 -15 67 188 178 -15 107 -160 156 -82 -61 80 -79 -176 141 -182 -76 176 -220
6034b20J59J27j30K51j45j97K44k76o6L84j18K6J81k46J26n9k11J24Q5j74L09
$$ -220 -61 66 -64 187 42 -155 89 -187 -253 131 13 39 220 -26 100 41 -170 -46 39 -135 174
6055A74j70j53J96o5q6M40n13J29K14k09K93k82j01L19l05R4J47l48J96J68l47
$$ 174 4 -149 47 -18 -104 336 -177 -48 166 -43 250 -32 -133 186 -119 -25 122 -226 -30 138 -209
6076b09M22j67l11L65j60m3K63k67O8K41l94L30J17k62Q8m1j94L23m13K53K47
$$ -209 213 46 -265 100 -60 -103 160 -107 -39 202 -192 138 255 -7 81 40 -154 169 -244 9 256
6097B56m82K04J56l11J58N5k07M47l29j58M74j87N4j34k66K42N9L6k22J83r4L87
$$ 256 -226 -22 134 -177 -19 36 -171 276 -53 -211 263 76 130 -4 -270 -28 31 67 -155 28 -66 321
6119C21l03k30L76k64Q2L7l34L02K82l73J68k7j58J61ok46L16j19q9K93k33K0
$$ 321 18 -212 164 -100 -18 19 -315 -13 269 -104 64 37 -121 40 34 -212 104 -15 -104 189 -44 -24
6141b4L5j97K54J0j58QK25j90N3j19R9K02m12M3M87n09L65l38j06M89j75k50K52
$$ -24 11 -186 68 78 -80 -72 153 -37 16 -103 -4 198 -214 -171 316 -193 172 -166 -272 217 42 -208 44
6164D4m6l5J38k11J40J3j30P0Q3m8J03l1p7L54l07j49K42j58J65q8m46M29ml5
$$ 44 -2 -37 101 -110 30 43 -87 -17 66 18 121 90 13 367 60 -89 153 -5 160 72 -374 55 51 16
6188A6q8L1j61J86j89N1L12l33J33R9l26N17k58n5J91j12J03p4k08K32J30m10
$$ 16 -72 -41 -202 -16 -205 -154 158 -175 -42 57 -269 248 -10 -65 126 14 117 43 -165 67 197 -213
6210b13K06J92l32K61j82L3K81j17k00J21o9P2p9l31M44J4l55L32j19m6K97m34
$$ -213 -7 185 -147 114 -68 -35 246 129 -71 50 -19 53 -26 -357 87 101 -254 78 -41 -87 210 -224
6232b24J36J74k89J36J68k61J91J41l63L79j23q6N5j31O6J09j13L8J59k91J84
$$ -224 -88 86 -203 -67 101 -160 31 172 -191 188 65 -21 34 -97 -31 78 -35 3 162 -129 55
6253E5k11N9K42l26J49J52k03J38J36l58J74R2j53J23j21Q1K0n2o2L60m43MK19
$$ 55 -156 -97 145 -181 -32 120 -83 55 191 -167 7 99 -54 69 -52 29 49 -3 -65 295 -148 -144 75
6276G5j98nK02k09M33k46j59K67k04Q7J34j18m1O7k10J97p1k02L61k20j88K13
$$ 75 -123 -128 74 -135 298 52 -107 160 -44 43 177 59 18 85 -125 72 1 -201 160 -60 -248 -35
6298c5J8o6K01r2j89L84m28K23J0m6J18k01R0K01l54R3J64j88o4J67k66M46j07
$$ -35 -17 -83 118 26 -163 221 -207 16 26 -20 98 -103 -13 188 -166 -73 91 -97 -161 6 -260 186 79
6321G9j68J34j9k56L57j06l8J22j91J46o3p8J48j30j69K82o8p0J81k20K11Qk78
$$ 79 -89 45 26 -230 127 21 -17 105 -86 60 -3 -81 67 -63 -232 50 -18 -88 93 -127 84 92 -186
6344a86L15kk77K51k96M6L68l26M9K5r4J39Q2j85K36Qk63J71J24l14K51k06J09
$$ -186 129 127 -150 101 -195 -149 219 -107 -58 -33 -127 12 94 -91 145 153 -110 61 185 -129 122 -84 25
6367B5J79l47K7K52k09K0J08l05M14m8j34J30k83J12L15m38J70J87l38J59Q0k01
$$ 25 204 -143 -116 136 -73 -53 55 -250 164 116 -18 112 -171 -59 256 -182 -12 175 -163 -4 76 -125
6389a25J25L7k44N01l17k5K56k82J29J74m92Q4K69k46K24j73O3K35j64k4Q2k8
$$ -125 0 37 -207 294 -23 -48 208 -74 55 229 -263 -179 90 -156 68 -105 -42 193 29 5 87 59
6411E9j07K33k39J65K3k96K64K4k42J43q8j6J18j18J8K23j99q5J56r5L84l40k30
$$ 59 -48 185 -54 111 134 -162 102 126 -116 27 -61 -77 41 -77 -59 164 -35 -120 36 -59 325 -15 -245
6434b45K85j65J76J21l50K35J09m13J94L18l52K90l63J56J22j72r9M29m14N6m
$$ -245 40 -125 51 172 -178 57 166 -247 -53 265 -87 203 -160 -4 118 -54 -153 276 -138 -82 -86
6455h6j54M27j03l4R3r7q5J39k17R9J95k33O2J52j04O9r3k74L02j32j3K74j35
$$ -86 -240 187 84 50 143 46 -39 100 -117 -18 177 -56 6 158 54 123 30 -244 58 -74 -87 187 52
6478E2J10j17j91J46P7j16J90j75j88K85m7q2J12J2k24J49k82K25l9k7J73j33
$$ 52 162 45 -146 0 77 -39 151 -24 -212 73 26 -56 56 68 -156 -7 -289 -64 -103 -130 43 -90
6500i0q8J58P3k0K11l14QQ6o3P7n8k37L00J5n6J64j09M3K7k84j6J97j05J39Q3
$$ -90 -178 -20 53 33 244 -70 -62 24 -39 38 -20 -257 43 58 2 166 57 100 127 -157 -173 24 -81 58 141
6525A41k53J41j18N6R9L5j82M4j71J84O1k50L49j13j10j5J51o8J32j45r6L49m31
$$ 141 -112 29 -89 -33 66 101 -81 -37 -208 -24 37 -213 136 23 -87 -102 49 -19 113 -32 -128 221 -210
6548b10L80p4j12J59k70QJ04MR4q2k33J23J51n7J92k72N7O0j33k5J82j06j48L02
$$ -210 170 96 -16 143 -127 -119 -15 -11 83 1 -232 -109 42 -15 177 -95 -38 22 -111 -136 46 -60 -208 94
6572I4j99J12K0j95K56j02k65N22k79j11K12j31j0K95j36q1J9j47J96j27r3K10
$$ 94 -105 7 27 -168 88 -14 -279 243 -36 -147 65 -66 -76 219 83 2 21 -126 70 -57 -150 60
6594F0O7k75J98q8R4M3j83J82J50m33J30j33J25P4j3n8L34m58k5K61r7K26m8k57
$$ 60 127 -148 50 -38 56 99 -84 98 248 -185 -55 -188 -63 11 -2 -60 274 -184 -209 52 -45 181 133 -124
6618a24J00M5k0J49k83j26J86M4j68L91m13K50p4K4J27r0j42K92m33L48J37k55
$$ -124 -24 21 1 150 -133 -259 -73 -29 -197 194 -219 31 -43 -19 108 18 -124 168 -265 83 220 -35
6640c5O9r5L6L4P0k08J92R0k30K21jl21L35j88R7j11k11K61Q9r6J06j49j08K97
$$ -35 34 -61 -25 9 79 -129 63 153 -77 144 143 -178 157 -31 66 -45 -256 5 94 -2 104 -45 -153 144
6664A44k40j5L73m59K34K27l62J94o3j83J31Q7j09K73m49K19l4r5O0Q0l3oL1p8
$$ 144 -96 -111 262 -197 37 264 -98 96 33 -150 -19 68 -41 232 -217 2 -32 -127 -67 13 -20 -26 5 -73
6688g3J10j33J51n8nP1J29k71mJ95k38K44k10J71J6l32P0K13p9j3K18m99K11J97
$$ -73 37 -96 55 -3 -8 63 192 -79 -83 112 -126 118 -92 79 95 -237 -167 46 -33 -46 172 -327 -116 81
6712H1k42L16P4k82J86O0j68Q0m1M3q4q9J34j20k8L34k30j10K21o1k8j34J87k09
$$ 81 -161 155 229 -53 133 193 25 105 64 107 23 -66 68 -52 -80 254 24 -86 135 74 46 -88 99 -110
6736a10O4k10L72J78n39M43m20J65K14m4j26j0j26J48J01k28O8J62j58j2J55j45
$$ -110 -46 -256 116 294 -245 198 -222 -57 157 113 -13 -23 -149 -1 100 -128 -60 102 -56 -68 87 -58
6758e8J10j15M7J48k19%K40k03J30j54J6K42k14j09J40j34J80M6j23O0q5K65k40
$$ -58 52 -63 -16 132 -87 -87 153 -50 80 -74 -58 184 -30 -139 1 -133 47 93 -30 30 -55 210 -30
6781c0P4j67K37j01o6J97j86j11J35O2j6n6J7j0R2r9O1m5N0K24l56J29M2k66O4
$$ -30 44 -123 114 13 -53 144 -42 -153 -18 44 28 -28 -11 -21 71 -28 33 -12 38 262 -94 35 77 -189 -125
6806a25J27p5L12r1j14p9J88J4o2l1j06J84j83L7j4j20O6N4j60M51l39j29K60
$$ -125 2 -73 239 148 34 -45 143 157 95 64 -42 142 -41 -4 -18 -138 -72 -18 -178 273 -66 -195 65
6829F5j37jJ02j21j4J64l02K05J12k72L35l0l57K04N2j5O5M0M4l5j73J53r4J08
$$ 65 -72 -73 29 -92 -106 58 -244 -39 73 -199 136 106 -251 -47 5 -10 55 95 139 104 -69 84 -10 98
6853I8j68K6R0N9j16p9P5j50M36k77m0j1N3J00K8j7j87n2l4K96Q7l89K98j97j75
$$ 98 -70 -44 46 105 -11 -90 -15 -165 271 -6 -46 -57 -4 96 124 107 -80 -132 -166 130 217 -172 126 -71 -246
6878b46L19P6j90K9j4J0N0j58N6J27j4R5j69K1J97l80J92q0k1K66P4j62j67J51
$$ -246 73 149 -41 -12 -26 -16 34 -124 -68 59 45 140 -29 -8 189 -191 1 -79 -100 166 240 78 -89 62
6902F2L5P1j57p7K11j58J01j66K5L1K27l04J3K8p5Q2M8j43J26O1k6J09p0Oj52
$$ 62 97 168 11 -66 145 -13 88 -78 -53 -22 205 -99 -86 -58 -133 -51 -3 -146 -20 41 15 124 54 60 -92
6927i2L7M7N7j71K97j36j53K02j98O6J78k75R0J33r1k1j1j52J87L0k5J26j28L4
$$ -92 -55 -8 49 -122 175 39 -114 88 -110 -44 134 -141 -51 82 -9 -30 -41 -193 -6 24 -1 125 -3 31
6951C1J71k74m3L02j52j01P3o8K94j28j84K79m00J01J44o9J30r4o6j3o9Q4J7p5
$$ 31 202 -72 -115 187 35 -66 7 -61 233 105 -79 200 -200 -99 45 -24 106 12 -54 -67 -136 -52 -35 -110
6975a10Q2J51j59p6K25k77J36K00k92p4K00k41L23p4q5J62q4j23L51k82R8J7k10
$$ -110 -28 123 -36 -112 113 -164 -28 172 -120 -194 6 -235 88 14 -71 91 7 -116 235 -47 51 68 -142
6998a42M8M7j17K15oj32L26l28Q1J2j10J87j79J64q6l1j48K51k23K4K67j42m4
$$ -142 -94 -47 -164 51 45 -87 239 -89 -8 4 -106 81 -98 66 -20 -51 -199 52 -171 -147 120 -22 -66
7021f6J46m8o3J95l30p7L18l4J92j41q2J8p1j6q6O0Q8R7j41m2K88k96l4o1K38
$$ -66 80 32 -31 164 -166 -243 75 41 233 92 10 28 -43 -59 -145 -85 3 100 -41 -83 205 -91 -125 -186 52
7046E2j10j3J62O3k18L9J32k59L00k04L9J20j60K4J29k6j65K73k47R5L6r1J7p1
$$ 52 -58 -71 91 154 -64 -25 107 -152 148 -56 -17 103 -57 -33 96 70 -95 178 -69 26 62 -29 -12 -83
7070h3mJ68k7J0O9k2j52K0kL9J29l08m0J68j47J00k4J46K16k67j33K34k8M0K0
$$ -83 -87 81 54 64 133 111 -41 -21 -23 16 145 -163 -203 -35 -182 -82 -106 40 256 -11 -144 90 62 102 122
7095A22j78r9J17p2J41J36p3r1j04K60j70k03L10k03pK79l09KL26k09r8j3J04
$$ 122 -56 -155 -38 -110 31 167 94 3 -101 159 -11 -214 96 -107 -114 165 -144 -142 184 -25 -123 -136 -32
7118c2P8j19J7L0o7O1J93k25J2L68k93L2j52O8K0j84K53M4M7j94J10N6j53R1q7
$$ -32 46 -73 -56 -26 -93 -32 161 -64 -52 316 23 55 -97 -29 -9 -193 60 104 151 -43 67 123 -30 61 -26
7143b6J0J02k76QK42l3J09j03r3J99q2J9j2k51J9J14Q8m3q6p8K63j91j24K50J68
$$ -26 -16 86 -190 -182 60 27 136 33 -60 139 57 76 64 -187 -168 -54 34 -9 -95 -173 90 -101 -225 25 193
7168A93k97L56l73J76J35k74K14j43N9L3M5k75Q6ML3Q4q2K9K49l65J6O7j03J95
$$ 193 -104 252 -121 55 190 -84 130 -13 46 79 124 -151 -65 -61 -28 56 -26 3 252 -113 -97 -30 -133 62
7192F2L6k18K86l44J00N9m1m0J60j36PO5l6J42j69j2J58k05O1J18j55J77j46J1
$$ 62 98 -120 166 -178 -78 -19 -60 -100 60 -76 -69 -4 -40 102 -67 -79 79 -126 -65 53 -102 75 -71 -60
7216f0K73j21j69Q1J64k19J02j04j7k2M29n08J60K4J06j83j30J12R2n9JJ55Q1
$$ -60 213 92 -77 4 168 -51 51 -53 -70 -92 337 -171 -11 13 119 -64 -194 -82 10 -49 -48 107 188
7239A88q7j33j06K78j21j56P8J16M0j81l5J69N2p4p5NQ7Mj81P8m3j03K13oO2j11
$$ 188 101 -32 -138 140 19 -137 -59 57 97 -84 -119 50 102 28 -47 -42 45 49 -132 -54 -97 -200 13 7 69 -42
7265d2J00m2O1Oj21J56p6j54K93j50L0j05J2r8J99j80P7O7jj20J86j36J31j99
$$ -42 58 16 77 83 -38 118 42 -112 181 31 61 -44 -32 -130 69 -111 -34 33 32 -88 98 -38 93 -106
7289a06Q7l2Q2P3k60P7pL6J09j39J18L0J2k65L73l44L4L29j32qP9l79L09r3J2
$$ -106 -19 -51 31 104 -156 -79 -86 -50 59 -80 38 68 80 -185 188 -156 -122 207 75 67 146 -233 76 -17 -5
7314eo0J97qj33j3k9J56j26j53K96k1L5j73OJ02lj30j0L6O5qJ19nM5j13j65J57
$$ -5 -65 132 124 -9 -22 -51 105 -21 -174 122 101 136 -37 -31 71 68 -62 -72 -36 29 21 140 135 180 67 -98 59
7341E9j32J93j20m4J40Q0k49N4j12K36j20O8m8n6P2p6N4L0k0k1j96L52N8l39P4
$$ 59 -73 120 0 -44 96 176 -73 -19 -131 105 -15 53 5 -51 21 -55 -1 29 9 -12 -208 144 202 -137 -63
7366f3k1J1K6J8K02mj20k57L56j67J61j17j01K53j14oj9j76J27N1K5k2j2j71J30
$$ -63 -84 -73 -47 -29 173 169 49 -208 148 -19 142 25 -76 177 63 57 38 -138 -11 40 65 43 31 -140 -10
7391a0o9j85K11l8K27m3j52M0k2M6J5J27k44J58k9j64L24k55j49L13j89m0n6J09
$$ -10 -79 -264 -53 -91 136 93 -59 -19 -41 5 20 147 -97 61 32 -132 192 -63 -212 101 -88 -128 -184 -75
7415g5n2K20j48J51q1j32K02k06M8J51j97J19n1J45J22l40P9J57k90K32k9p5o1
$$ -75 -127 93 -55 96 15 -117 85 -121 -73 78 -119 0 -51 94 216 -124 -45 112 -178 54 25 -50 -111
7438a11R0o2J94p8J2J12j16q2O5j44N6J71j46R0P2j12J02j16N7J15k88J42L4m0
$$ -111 -21 -83 111 33 45 157 41 -41 24 -120 -64 107 -39 51 123 11 113 -3 54 169 -119 23 57 17
7462A7O7K2j66n9R4k19M04k18J34o4j59J72J2J6P4j10m9O9j8j01K55l01n1L19
$$ 17 84 106 -60 -119 -25 -244 160 -58 76 12 -147 25 37 53 127 17 -32 37 19 -82 173 -128 -179 140
7486A40l98L27j3j64L7m4J85J96k30j56K77l11O4Q0K5l4m3k1QK66k36J37nm1L4
$$ 140 -258 69 56 -108 -71 -115 70 266 36 -120 157 -154 -90 -10 15 -19 -62 -83 -75 191 -45 92 87 46 80
7511H0k32K31P6l1k80J61j8P0o2k0P4n3k2n4l8J41J61k13o6K48k01J45r9N4J89
$$ 80 -152 79 155 124 -156 5 -13 57 -5 -25 49 -4 -26 -80 -118 23 184 -29 -95 153 -48 97 -2 52 241
7536B41k65j69K22Kj05K21l36J15K3K6J67k49J23j3j2L5m3J8M3J31j64r2P5r6
$$ 241 -24 -193 29 31 -74 147 -189 -74 -51 -25 142 -107 16 3 -9 26 -17 1 44 175 11 -81 -6 -102
7560a02K54rk73j7J10l7J60l8k30J26l0j25K41N5n6j23m6K51k0l24L31p0j54M5
$$ -102 152 143 -130 -147 -37 -74 86 48 -182 -56 -86 -211 30 85 29 -94 -140 111 91 -233 98 28 -126 -81
7584h1m5K37Qj21J03p7k5P1n2n6J8JJ22k54N0O9O9j60J42J11l05K29j20O6L2q
$$ -81 -126 111 119 -2 101 24 -1 70 18 -38 -20 -19 103 -151 -101 -32 37 -123 19 130 -175 54 -66 0 32 24
7610B4j39J74r1R7j07j9K98k94qO6O8K0j11j27K83P2m19L40l6k18J51n3Nm3J01
$$ 24 -115 59 -32 65 -42 -61 237 -57 -65 1 69 89 -22 -149 134 206 -213 127 91 -127 24 -29 -24 -67 34
7635C4m9L6J47k01L03m65K26J2J05r9l9j45K32j63K0J01j48J56O6j43J77j35j43
$$ 34 -15 21 168 -33 270 -195 31 43 148 49 10 -135 97 -66 -46 55 -93 63 129 -14 163 28 -115
7658a15J17j65k0L68k30J00R2k44J23Ro0K72k21k30J92J6k8Lo4J27j12q7J12J56
$$ -115 2 -163 -183 185 -45 55 147 -97 26 35 -25 247 26 -204 -12 4 -24 -21 -85 42 -70 -157 -45 111
7682A11k45J78n8rK8j30K6K56j84J3n6p1J45L5j52K04n9P8p4k96J64L07l26q1
$$ 111 -134 44 -14 -23 5 -125 -99 157 -27 -14 -70 -141 4 39 -113 91 32 110 36 -260 -96 211 -115 -196
7706a96J81r2M5K41j76J25k2j99J80PN6kj45O1L2j50J41K0k56K26j07k8J74j63
$$ -196 -15 -107 -62 179 3 128 106 -93 87 94 150 148 3 64 96 -54 87 107 -149 77 -30 -58 116 -47
7730d7RQ4j83J28L6j30K53k18K7J01O5j46O2j04Q6m3j95K96n5j01J07O7Pq6j49
$$ -47 -38 46 -137 -9 27 -103 150 -68 -41 60 125 -21 41 -63 23 -20 -215 81 26 -75 32 99 106 20 -129
7755a29P8K05k40k8J86k26J58J59o5l9n4j2m7Q4K7J90l13N4K21k98J09J62j76
$$ -129 -51 154 -86 -114 72 -154 4 163 98 59 5 -7 -54 30 57 247 -66 -12 209 -89 20 182 6
7778Fj3K1j52K13l15J61J13j15n5K32j73J56j52J22M0k17l1K94J00l16M2p1P0
$$ 6 -7 14 -138 75 -240 -79 34 -81 -136 96 -77 79 -73 49 89 -128 -159 135 235 -81 -39 -110 -40
7801d0K48l64J29n5OJ71q1r6R8l9N0j7j05M3Q6L5l8j04o9K91n7j09R2j85J6M2
$$ -40 208 -156 -27 -82 -76 95 14 -82 16 -23 27 10 -95 -52 34 69 31 -73 -142 149 92 -17 75 -110 -94 -52
7827e2M1K1J44k40K80k04j03J73k61J52p1K07j86r0K19M2n1j41P9J96k87J57J15
$$ -52 -11 10 154 -86 194 -10 -113 60 -201 -49 -120 87 -99 -189 30 72 21 -120 -41 155 -132 25 140
7850A40k25K43k41o7nL3J84K2k28J47k60K45J73k33l8K58j63k8R2k81J76J52k32
$$ 140 -85 158 -83 -150 -155 -122 62 84 -144 3 -257 -12 161 -72 -110 148 -15 -43 49 -232 -56 96 -136
7873a36K78j21k8M1j99J30J01k08J10R4r5pk45K13J15Mk27L11k0k26J33m0J73
$$ -136 142 21 -7 34 -165 -35 66 -142 -32 62 -33 -40 -285 -72 43 47 -180 131 111 -115 18 -22 151
7896A51l01pQ4q3K45J42k73o8J36j34K02m0k82J91R3j59P1no4%K5%J65m3N1L3
$$ 151 -150 -157 -73 -156 89 231 -42 -110 26 -108 94 54 -228 -37 56 -103 -32 -37 -101 -101 -76 -76 89 46 97 130
7922A30l28Q2M7K21o0K7k40J31p3K2J46k68K61J5n8l3J6j77K31k04R2J12j64M7
$$ 130 -198 -116 -69 152 92 119 -121 10 -63 -41 105 -163 98 113 55 22 38 -139 92 -112 -20 92 -72 -25
7946b5J28nm7q8L7J0o8p0K29j46j68L34k76J55K8j72N9N1j61K62N5m7J18j93j31
$$ -25 103 98 51 -37 0 10 -58 -128 101 -45 -213 121 -155 0 28 -144 -85 -34 -195 67 122 75 193 0 -131
7971a31L62m96K50K51l92N4O5M0l0O5kJ43k35J02J66k31j14J97j68J06p3q7J48
$$ -131 231 -265 -15 236 -156 -102 -37 3 -27 38 36 179 -56 46 212 -19 -133 64 -104 2 -71 -158 -10
7994a0J70o3P3j17J5O3l2k56K22j59J30J12k07M6L6o1J78j73j26K76j27q2N4j14
$$ -10 160 97 170 53 68 131 99 -157 65 -94 36 148 -59 -13 23 -38 140 -33 -159 117 -10 -92 -38 -152
8018a52L20l8j40J96j65j28L5M1k32M94k34R9j07m7J34K1j56L6l7n4K74k36j60
$$ -152 168 130 -10 186 21 -107 -72 -31 -263 231 -3 96 -11 -58 76 97 -59 -23 -60 -114 160 -76 -236
8041b36K32j09J80n5n6J86j23j20J60ok12J46k1l0P5j29o6J15N2L2Kr6J40n9o2
$$ -236 -4 -113 67 12 -44 142 19 -101 59 53 -159 -13 -34 -64 11 -118 -184 -69 -17 15 17 -79 61 2 -60
8066f0J20j0q3n0J48j45M29m20J33l1p5MO1P6M6r0j21n3j20K57r3J6J36j0k31
$$ -60 60 50 -33 -83 65 -80 349 -71 62 31 -44 -40 21 97 143 53 -68 -121 -241 16 -77 -61 75 65 -166
8091a66L28j69n1N5j24j96N36k00j12J97k18L9j8J30J94l34Q5L3J4J3J97m78K10
$$ -166 162 -7 -58 -3 -127 -323 213 13 -99 98 -120 -81 -99 31 225 -109 -24 9 23 36 233 -245 -35
8114c5J00k77K43M6n9QN2j21o0J35q5n0O3J68j52M0JQk22K39l4j21J66p5N9n1
$$ -35 65 -212 31 77 18 26 78 -43 -103 32 -53 -103 -40 128 -24 16 17 25 -197 42 8 -113 53 -22 37 -14
8140a4J28j56J66k14J24j73q5L45j02Pk4Oj9k4N3m4M1j22K04q5j51L37j32l28
$$ -14 114 -42 124 -90 34 -139 -224 121 19 26 2 8 -11 -35 18 -26 15 -107 97 12 -139 198 66 -262
8164b62L39j04N4kj66l9K36j8j02R3o5n9qK42K7k51P6l9M5J19P0k85K14l62R7
$$ -262 77 -27 27 25 -141 -180 56 38 -64 29 -36 -95 -103 139 166 -85 -9 -48 -3 116 186 -99 115 -247 -150
8189a50L5J23
$$ -150 -115 8
8191H
$$ Imaginary data points
##PAGE= N=2
##DATA TABLE= (X++(I..I)), XYDATA
0@%%%%%%%%%%%%Qj6J6j6K4l2L2m0M9n7P2q8J04j20J37j58J83k11K42k75L14l57
$$ 0 0 0 0 0 0 0 0 0 0 0 0 0 8 -8 8 -8 16 -16 16 -24 25 -32 40 -48 56 -64 73 -85 98 -113 129 -146 168 -189
34a89M03m55N11n73O41p16P97q86R85j092J208j334J471j624J793j974K174k396
$$ -189 214 -241 270 -303 338 -378 419 -467 518 -574 634 -700 771 -853 940 -1034 1140 -1256
52a256K641k911L212l554L939m379M888n482O189p045Q109r472J1284j3834J7708
$$ -1256 1385 -1526 1686 -1868 2071 -2308 2580 -2902 3287 -3758 4351 -5121 6163 -7671 10037
67A0037k4359L8864j27440P3846J29936j98544P9287M0642o2844M9334M9115n8196
$$ 10037 -14322 24542 -102898 -29052 100884 -97660 -18373 22269 -40575 8759 57874 -322
79c22J5693L8198j9523o1308O8144L2573j23897K6018R6179j12766J452O3379
$$ -322 15371 53569 34046 -27262 40882 73455 -50442 -24424 71755 -41011 -39559 23820
91B3820q5241M3043O2286j06935K4899O8709l8192J0718R249j7672K1272k933
$$ 23820 -61421 -18378 43908 -63027 -38128 30581 -7611 3107 12356 -5316 15956 13023
103A3023P575p293j7874M3422k9599m3770O4357k4411m5116N1184j8064j4081
$$ 13023 20598 13305 -4569 38853 9254 -34516 29841 5430 -39686 11498 -6566 -20647
115b0647J8388m0674M4504L5021o4784K5663J1193l8079O1959r541n7279N6112
$$ -20647 -2259 -42933 1571 36592 -28192 -2529 8664 -29415 32544 23003 -34276 21836
127B1836N801m1410J6384M270j877p460J209J9626m1854R749N3116o9062M942
$$ 21836 27637 -13773 2611 6881 5004 -2456 -1247 18379 -23475 -13726 39390 -29672 -24730
140b4730P3910q0825n153Q5846n5793j4943M3831m3536J1011M3351l0610j8725
$$ -24730 49180 -31645 -36798 49048 -6745 -21688 22143 -21393 -10382 32969 2359 -16366
152a6366J6967K2447j8527l3154M4147J836m5518M4108q689m5164N7693j1201
$$ -16366 601 23048 4521 -28633 15514 17350 -28168 15940 7251 -37913 19780 8579
164H579l8970N9261k0644m3451M4868J548j0975Q555k1498J2586J0401j5615J0403
$$ 8579 -30391 28870 8226 -35225 9643 11191 216 8771 -12727 -141 10260 -5355 5048
177E048j1431L847K2353l7474L927L2967k9580O740J2211k4213K5679n461k3438
$$ 5048 -6383 -2536 19817 -17657 -13730 19237 -10343 -3603 8608 -15605 10074 4613 -18825
190a8825M2440j3067k9223K9995j4371R78K9720l9391o951L4908j6434j1572M252
$$ -18825 23615 10548 -18675 11320 -3051 -2073 27647 -11744 -18695 16213 -221 -11793 -7541
203g541O067J0542k0100M588J4570k4363K4562J1463m3094L3611J3500n2752L4110
$$ -7541 -1474 9068 -11032 -6444 8126 -16237 8325 19788 -23306 10305 23805 -28947 5163
216E163K5493m3332J0554Q769j7211J5950Q5j3424j187N977J3393k1943p028L9440
$$ 5163 30656 -12676 -2122 6647 -10564 5386 5471 -7953 -9140 -3163 10230 -11713 -18741 20699
230B0699j9655j8053L5310k1129q401L5782k7140o790L0627k5308p249K0434o697
$$ 20699 1044 -17009 18301 -2828 -11229 24553 -2587 -9377 21250 -4058 -11307 9127 2430
243B430P72q358p258J6353p408n71O743j6244J7458P331k9514K0137J3297k1638
$$ 2430 3202 -5156 -12414 3939 -3469 -4040 2703 -13541 3917 11248 -18266 1871 15168 -6470
257f470J3790l734j2266K1561j0780r553J7583j1887j495M709j3839J7160L618
$$ -6470 7320 3586 -8680 12881 2101 -7452 10131 -1756 -3251 1458 -12381 4779 8397
270H397k3335J2742M216p331J0723r289J738J3147j5486L288O795j0090J6838
$$ 8397 -14938 -2196 2020 -5311 5412 -3877 -2139 11008 -4478 -1190 5605 -4485 12353
283A2353p158k0878K4630k745j8863J8482m565q269J1398j1869J556J2483q745
$$ 12353 5195 -15683 8947 6202 -12661 5821 1256 -7013 4385 -7484 -5928 6555 -2190
296b190K756k507k898J5255j2295n174K0984j3491n502J2318j3964Q602R382k1590
$$ -2190 566 -1941 -4839 10416 -1879 -7053 13931 440 -5062 7256 -6708 1894 11276 -10314
310a0314Q174P703j3255Q038j810l109J2723j3105k843J4146q097M961J770j2302
$$ -10314 -2140 5563 -7692 346 -1464 -4573 8150 -4955 -7798 6348 -1749 3212 4982 -7320
324g320J4474j685j5351J6567j262r806Q761j0657K051J3222j4948J705Q235r794
$$ -7320 7154 5469 -9882 6685 5423 -4383 4378 -6279 -4228 8994 -5954 -4249 3986 -5808
338e808P285k833o660J7771p019j0802J3328n628J32Q098j2595O986N253j5824
$$ -5808 1477 -1356 -8016 9755 2736 -8066 5262 -366 -234 7864 -4731 2255 7508 -8316
352h316Q902L878p948Q464r237m098J5805r997l533R920p069N660o90j1690J6194
$$ -8316 586 4464 -3484 4980 -4257 -8355 7450 -2547 -6080 3840 -3229 2431 1741 -9949 6245
367F245Q57j2438J1332o989m583J5014j1445k472J2609j1147j471N392l216P677
$$ 6245 7102 -5336 5996 -993 -5576 9438 -2007 -4479 8130 -3017 -4488 904 -2312 5365
381E365p086o341J3837p302k122R950j3327P646J1844k1035L915J2750j0080N706
$$ 5365 -1721 -8062 5775 -1527 -3649 6301 -7026 620 12464 -8571 -4656 8094 -1986 3720
395C720j390r607J1032l090m459P998n491J857R7j0098J4307K079j5298R900q75
$$ 3720 2330 -7277 3755 665 -3794 4204 -1287 570 667 -9431 4876 6955 -8343 1557 682
410F82n065J2424j1878l731J8799j0378o849O860m495Q592k36j2929J1061K35
$$ 682 -4383 8041 -3837 -7568 11231 853 -5996 864 -3631 4961 4725 -8204 2857 3092
424C092p838Q439n033J207P127j4243L793J0326q772L335l275l969J5504j1806
$$ 3092 -4746 3693 -1340 -133 6994 -7249 -3456 6870 -1902 1433 -1842 -5811 9693 -2113
438b113r893K0199n425o890P880j1525O302J3057j4745m81P323l870J248m764
$$ -2113 -12006 8193 2768 -4122 3758 -7767 -1465 11592 -3153 -3634 3689 -181 1067 -3697
452c697L855Q051j3209L113P374j1747J0254Q37j7623J8282K660k2411J2296Q450
$$ -3697 158 8209 -5000 -1887 5487 -6260 3994 4831 -12792 5490 8150 -14261 -1965 6485
466F485q223M612n330k187Q162j872J276m706k574J2873r603n998J7814j0174
$$ 6485 -1738 2874 -2456 -4643 3519 1647 2923 -1783 -4357 8516 -1087 -7085 10729 555
480E55p975J3998q844j79Q667j3188N322P921j1555K398L00j48J1439r925n520
$$ 555 -7420 6578 -2266 -2445 6222 -6966 -1644 6277 -5278 -2880 -2580 -2728 8711 -1214 -6734
495f734J0503n695L099N237j0162O877K265j0450P187r08l231N681r266L794Q486
$$ -6734 3769 -1926 1173 6410 -3752 3125 5390 -5060 2127 1219 -2012 3669 -5597 -1803 6683
510F683j5859O728J0025j4826P263K963j4315J5207P109j6431J836P502P34l397
$$ 6683 -9176 -2448 7577 -7249 14 2977 -11338 3869 10978 -5453 -3617 3885 4619 1222
524A222k634P864n912o121J3951j0202p140K0435j4533j0577K4547j1176j4663
$$ 1222 -1412 6452 540 -5581 8370 -1832 -8972 11463 -3070 -13647 10900 -276 -14939
537a4939J9970p16q392M898l753n24N857M347l682j0609J1077O314j9113R443
$$ -14939 5031 4315 -4077 821 -2932 -3456 2401 6748 3066 -7543 3534 9848 -9265 178
551A78J0105j8712Q956P049j7387J1210M988j6442R397O457r507N5J779O216p21
$$ 178 10283 -8429 527 7576 -9811 1399 6387 -10055 -658 5799 -3708 -3653 -1874 4342 3621
566C621r248N224J656j312Q868j1045m700J6520r684o946J2787n305k022K953
$$ 3621 -5627 -403 1253 -59 8809 -2236 -6936 9584 -100 -7046 5741 436 -1586 1367
580A367p082P225J082r184Q769r23n608Q163p189j700J3614o483p130M452J146
$$ 1367 -5715 1510 2592 -6592 2177 1254 -4354 3809 -3380 -5080 8534 2051 -5079 -627 519
595E19K864m385r18Q108q016Q09P615j3655N637J2532j8448J913J3829j2572O54
$$ 519 3383 -1002 -1920 6188 -1828 -1019 6596 -7059 -1422 11110 -7338 -5425 8404 -4168 -3514
610c514P985o671J507Q96k919L813J428J085o026m653J3885l520j0868J3759l959
$$ -3514 4471 -2200 -693 203 -2716 1097 2525 3610 -2416 -7069 6816 3296 -7572 6187 2228
625B228r342J3980p330q956J6394l868r766Q260l44l356J140J017L589n704r46
$$ 2228 -7114 6866 -464 -9420 6974 3106 -6660 1600 1256 -2100 -960 57 3646 -2058 -3004
640c004O261o575L943O868j3731L166J0525r723P50L629m958O604k907o260Q286
$$ -3004 3257 -3318 625 7493 -6238 -3072 7453 -2270 -1520 2109 -2849 3755 848 -5412 2874
655B874k369k290N151o590J877N198p657M194L835o666J048j99J402M995p221
$$ 2874 505 -1785 3366 -3224 -1347 3851 -3806 388 4223 -2443 -1395 -1594 -192 4803 -2418
670b418O64M594o703N593Q03r053J1251M93j3201R374K626q386O436j55m598L309
$$ -2418 -1754 2840 -3863 1730 2533 -6520 4731 5224 -7977 1397 4023 -4363 2073 1918 -2680 629
686F29p55l65N04O34K805q116R08J1614r905l212J1391q367n51Q874r938J429
$$ 629 -126 -491 13 647 3452 -4664 -3756 7858 -2047 -5259 6132 -2235 -2786 6088 -3850 -2421
702b421R469q493j843N218j463l7j557J969J741o396L145K498n027O827k028r277
$$ -2421 7048 -1445 -3288 1930 467 430 -1127 842 2583 -3813 -668 1830 -3197 3630 1602 -7675
718g675J0177J235q282O363l25l122M308m631J64N763m351K53P53l072N072k329
$$ -7675 2502 3737 -4545 1818 1493 -1629 2679 -1952 -1788 3975 -376 -123 630 -2442 2630 301
734C01l999O654k463l040L054k940L727J778p102M596J432m851O008l040l529
$$ 301 -3698 2956 493 -2547 507 -2433 1294 3072 -4030 566 1998 -2853 3155 115 -3414
749c414Q980n590n195Q484k118k308K958l581J452J244k522K247j539J284K330
$$ -3414 5566 -24 -5219 3265 1147 -1161 1797 -1784 -332 912 -1610 637 -902 382 2712
764B712p552L626P119q817J721N033p187M217K485p485N463K521o216R66Q93J462
$$ 2712 -4840 -1214 5905 -2912 -1191 3842 -3345 872 3357 -4128 1335 3856 -2360 -1394 -501 961
780I61N92m467L182Q96m138M765k162k535Q091n051n416Q682j759k947L456l542
$$ 961 1553 -2914 268 1164 -2974 1791 -371 -2906 5185 134 -5282 3400 1641 -1306 2150 -1392
796a392J415K310n000K830J267k047K080m403M77O886n814j230M918l689J879
$$ -1392 23 2333 -2667 163 1430 -617 1463 -2940 -2463 4423 -1391 -2621 2297 -1392 487
811D87O69m156N701nn224L550j410K41L589n913J432M776o356P60L517l041K954
$$ 487 1156 -3000 2701 2696 -2528 1022 -388 -147 3442 -2471 -1039 3737 -2619 -1859 1658 -1383 1571
828A571j742l491N630j342k036K669k435K490P64n841M928K450n342L116j481
$$ 1571 -171 -3662 1968 626 -1410 1259 -1176 1314 2078 -3763 1165 3615 -1727 1389 -92
843i2k668O056l594k791N749l322j469K624k200L505q62m309M532m90k064L602
$$ -92 -2760 3296 -298 -3089 2660 -662 -2131 493 -1707 1798 936 -3373 1159 669 -1395 2207
859B207l543J057M768o864M78M858l647J698O7m131M627j424k680M514k337j008
$$ 2207 -1336 -279 4489 -2375 -1897 2961 -686 1012 1079 -3052 1575 151 -2529 1985 -352 -1360
875a360K449m165L298L037n918K585J423k807L508k594j156N704l976j851L124
$$ -1360 1089 -3076 222 3259 -2659 -74 1349 -1458 2050 -544 -1700 4004 28 -1823 1301
890A301k500K467P99n167L697M91l807L564j083q60L398m593M53N185m293P19
$$ 1301 -1199 1268 2067 -3100 597 1088 -2719 845 -238 -1098 2300 -2293 -1840 3345 -948 -229
906b29J497l224L936j144l950N245p19k390J841l682K925L069n783K205J791l552
$$ -229 1268 -1956 1980 836 -3114 2131 1412 -978 863 -2819 106 3175 -2608 -403 1388 -2164
922b164L398j680k349O357l276l229M853j925k04J857l541L136R27m795K585N51
$$ -2164 1234 -446 -2795 3562 286 -2943 1910 -15 -219 1638 -1903 1233 2160 -2635 -50 501
938E01l2K296o127O39O714m901l52K737l539L136L47m493M724K36l305J811j203
$$ 501 469 2765 -3362 -2723 3991 -910 -1262 1475 -2064 1072 1419 -3074 1650 1886 -1419 392 -811
955h11J199J877n133K599L527n018R04O19j140M765l228l720M763r67l48J599
$$ -811 388 2265 -2868 -269 3258 -1760 -856 -237 -1377 3388 160 -3560 1203 236 -112 1487
971A487l432K967J161n326L607J348l634L166j959j470M777l503j418L928j414
$$ 1487 -1945 1022 2183 -3143 464 1812 -1822 1344 -615 -2085 2692 -811 -2229 1699 285
986B85l38p46j320M933j660k820L566l289L06N163o163K79N895n757n89L906k499
$$ 285 -53 -799 -2119 2814 1154 -1666 1900 -1389 -1083 4080 -2083 -1804 4091 -1666 -2255 1651 -848
1003h48P54N01j562J751j402L18J579k825L533O3n935M797K215m877L577j075
$$ -848 -94 407 -1155 596 -806 -488 1091 -1734 1799 1862 -4073 724 2939 -1938 1639 564
1019E64l632N297j507l561L978l97j526O57r44K024j056j583L631k474q39M093
$$ 564 -3068 2229 722 -2839 1139 742 -784 -127 -1071 953 -103 -1686 1945 -529 -1368 2725
1035B725m169N79M613n277q17M162k145J006j96k700L377j243j960L433j958j00
$$ 2725 -1444 -865 3748 -1529 -2346 1816 -329 677 481 -2219 1158 -85 -2045 1388 -570 -670
1051f70K685m003J140K996l263J091P01j203J565k457M33L947l738k00K209l318
$$ -670 2015 -1988 -848 2148 -1115 -24 677 -526 1039 -1418 -985 2962 -776 -976 1233 -2085
1067b085K959J503n305L486K091m718J856R29j427J631j098m87J048j113J632
$$ -2085 874 2377 -2928 558 2649 -2069 -213 716 -711 920 -178 -665 383 -730 902
1082I02j139j404M329l695k380O695k392l294M387k982r26M723k878j606K997
$$ 902 -237 -1641 2688 -1007 -3387 3308 916 -2378 2009 -973 -1899 2824 -54 -1660 1337
1097A337o31r08j224Q46K472l114P14K306m045K221J903m497L516J838n588K373
$$ 1337 706 -202 -1426 -580 1892 -1222 -508 1798 -2247 -26 1877 -2620 896 2734 -2854 -481
1113d81K321j990R75j615m2K497k195O7J093j704K195q04k830L620k79k250K413
$$ -481 1840 -150 825 -790 -832 1665 -530 -463 630 -1074 1121 317 -2513 1107 828 -1422 991
1130I91j400j64J839k576J447J969l431J253J98j715L694j485l056L660q42j966
$$ 991 -409 -573 1266 -1310 137 2106 -1325 -72 126 -1589 2105 620 -2436 1224 382 -1584
1146a584K493j105Q6J317j920M29J39J07J565l005O53L566m507J52M612m182K78
$$ -1584 909 -196 -110 1207 -713 -284 -145 -38 1527 -1478 -825 2741 -1766 -1614 2998 -1184 -906
1163i06K583l708J621K732l179J81J184j37q7j621J758Q67k708J882j39k394L946
$$ -906 1677 -2031 -410 2322 -857 -676 508 371 284 -1337 421 1288 -1420 462 323 -2071 1875
1180A875j028l390M229q88l110L190m98q59J732k109Q8J714j136O14n37n35K306
$$ 1875 847 -2543 1686 798 -2312 878 380 -479 1253 -856 -768 946 -190 424 -113 -648 1658
1197A658k591o52L334j846l39J248k281J830Q88k929K301L7k121K343j615l63
$$ 1658 -933 -1585 1749 -97 -436 812 -1469 361 1249 -1680 621 658 -1463 880 -735 -1098
1213a098L473k907j240L072j240m02P20p77J100o50j016J368q74Q09J347l926
$$ -1098 2375 -532 -1772 1300 60 -342 378 -399 701 51 -965 403 -471 338 1685 -2241
1229b241K063K391m434J947K476l479J619O69k785K387O79k172P40J96M92q98
$$ -2241 -178 2213 -2221 -274 2202 -1277 342 1011 -1774 613 1292 -880 -140 56 548 -350
1245c50j147K966j098k163L004j519j390M373k743k172M243j780j850K544o78
$$ -350 -1497 1469 371 -1792 1212 -307 -1697 2676 -67 -2239 2004 224 -1626 918 240
1260B40m2K86j543J261l11K0J204k450R67K084l414J096K420k711R52K77j763
$$ 240 198 484 -1059 202 -109 -89 1115 -1335 -368 1716 -1698 -602 1818 -893 59 336 -1427
1277a427K350m4j933J683p34K7P03k221J865J319k926J034Q16j428J995r28j289
$$ -1427 923 879 -1054 629 -105 -78 625 -1596 269 1588 -1338 -304 512 -916 1079 151 -1138
1294a138K388j186o72R06r02J739n74k620K894J02k581K465p92j027K538k213
$$ -1138 1250 64 -608 298 -604 1135 561 -2059 835 937 -1644 821 29 -998 1540 -673
1310f73j010L315r99j157K33p4J267j001r33K105j324k95J466k381J363K160l675
$$ -673 -1683 1632 633 -524 -291 -365 902 -99 -1032 1073 -251 -546 920 -1461 -98 2062 -1613
1327a613N79K505k343O66O45j043J746r41j225J434l60O97l05k104K219L78k586
$$ -1613 -1034 1471 -872 -206 439 -604 1142 201 -1024 410 50 747 442 -1662 557 935 -1651
1344a651K154K2j523J893j605m22K711j521q42J461j183Q70k5j626K327m18j694
$$ -1651 503 525 -998 895 -710 -1132 1579 58 -784 677 -506 364 339 -1287 1040 622 -1072
1361a072J139m91L14J305k211M59J495j800R88J39j031J969j421j151K431r59
$$ -1072 67 -424 -110 1195 -1016 -557 938 -862 126 265 -766 1203 -218 -1369 1062 103
1377A03n34J494j887Q83Q94k210J124J170j249L07o79k51K316j886j51J482j571
$$ 103 -431 1063 -824 59 953 -1257 -133 1037 -212 95 -584 -835 1481 -405 -556 926 -645
1394f45O91O62j911J764M76k188J500j36p56J259j227P7J674k109M88J024j002
$$ -645 46 708 -1203 561 1037 -1151 349 213 -543 716 -511 -434 1240 -869 -381 643 -359
1411c59J287j160j246K341k22j354J470j355L96J214j831R08R42j569P56m7q70
$$ -359 928 -232 -1478 863 641 -713 757 -598 -202 1012 -819 89 1031 -538 218 171 -699
1428f99J759j315p61K179j340n41Q21q78J385M63k185Q23N48p41J319j197r3J511
$$ -699 1060 -255 -1016 1163 -177 -718 103 -775 610 1073 -1112 -289 259 -482 837 -360 -453 1058
1446A058j586j21J419j017L58J24j307J852m77j582J855k39o01Q24j699Q58J729
$$ 1058 -528 -649 770 -247 111 235 -1072 780 303 -1279 576 337 -264 560 -1139 -281 1448
1463A448j832j3P59q06J202p54p22J429o29o84R59r30P24O24j903J119R18k167
$$ 1448 -384 -397 362 -444 758 4 -718 711 82 -602 357 -573 151 775 -1128 -9 909 -1258
1481a258J310L56r05J390j496m48K008n92m40J75o69J054k02j305J528k94q68
$$ -1258 52 408 -497 893 -603 -1051 957 365 -75 100 -569 485 283 -1022 506 212 -656
1498f56J430j400M9J716j631m5J385j244K93L81p59J425o19j141J268m81j54J241
$$ -656 774 -626 -577 1139 -492 -537 848 -396 -103 278 -481 944 325 -816 452 -29 -183 1058
1516A058j703K53J258j541K92O98q44J038m61q21J433j055P7J280j459N09P01
$$ 1058 -645 -392 866 -675 -383 315 -529 509 48 -773 660 -395 -318 962 -497 12 713
1533G13j666J105J071j834N99o7l55J076r90j94R42q38M44K5j207K196q75j499
$$ 713 -953 152 1223 -611 -12 -79 -434 642 -348 -542 400 -438 6 31 -1176 1020 145 -1354
1551a354K191m42j317J948n43j340J873r12q51J556n49o5r53L51J399j467j94
$$ -1354 837 395 -922 1026 483 -857 1016 104 -747 809 260 195 -758 -407 992 -475 -669
1568f69J776j416J55J208k210J067J473j930N32J059j368M35r8k93R60r62k82
$$ -669 1107 -309 -154 1054 -1156 -89 1384 -546 -14 1045 -323 112 14 -279 681 -281 -563
1585e63Q00n46J030m06j722K066p3j652J660k36q14J441j292k86J429r67K55J14
$$ -563 237 -309 721 315 -1407 659 586 -1066 594 358 -456 985 -307 -593 836 -131 124 238
1603B38q73J107n10j208K184m90j348R05l19L96P84j267M84L36o49Q79q13l05
$$ 238 -635 472 -38 -1246 938 448 -900 5 -314 82 866 -401 83 419 -230 649 -164 -469
1621d69J943j581j261K252j194m33J386j447M30J166j402K19Q12k35M6r27M73
$$ -469 1474 -107 -1368 884 -310 -743 643 -804 -374 792 -610 -391 421 186 232 -695 -222
1638b22J302j626O90O71j739J480j41j931K150O40k415J289j46p83J181o78K67
$$ -222 1080 -546 144 815 -924 556 415 -1516 634 1274 -1141 148 2 -781 400 -278 -11
1655a1M37q86M86j59m35J840j340r18J979r68m11J017j123O93P74k118Q07J007
$$ -11 426 -460 26 -133 -568 1272 -68 -986 993 25 -386 631 -492 201 975 -1143 -336 671
1673F71j212R64n07r47J942r19r48J758p60j10K27o38J095j06j065Q49o63J64
$$ 671 -541 423 -84 -1031 911 -8 -956 802 42 -68 159 -479 616 510 -555 294 -369 -205
1691b05J270k245P79K163k842K4K028j665Q47O87j823J137O26j139K15L16P34
$$ -205 1065 -1180 -401 1762 -1080 -1056 972 -693 154 841 -982 155 781 -358 -143 173 907
1708I07o39j616J854K58j900K054j015j199K809j717j483L083q94j529J012N5
$$ 907 268 -1348 506 764 -1136 918 -97 -1296 1513 -204 -1687 1396 502 -1027 -15 40
1724D0J31M8m47N50l34m3Q58j605Q60J678k897M16K104k073N89P63j812J429K09
$$ 40 171 219 -228 322 -12 -55 803 -802 58 1736 -1161 -745 1359 -714 -125 638 -1174 255 464
1743D64j799J649M6k90K01j157R96Q49j725J126L22j375J222o79n73J838r89p74
$$ 464 -1335 314 360 70 271 -886 110 959 -766 360 682 -693 529 -150 -723 1115 126 -648
1761f48P08o99R24P6j411J409k5j666J816k99p66J719j219p65J770p18m23K93
$$ -648 60 -639 285 361 -1050 359 334 -1332 484 185 -581 1138 -81 -846 924 206 -217 76
1779G6r0N03q29n28J774j257o8J244k027P97J845k436N06J933j871J23N43n81
$$ 76 -14 489 -340 -868 906 -351 -419 825 -1202 -405 1440 -996 -490 1443 -428 -305 238 -343
1797c43J136o90n57N89k28M55m9j302J628j71j962J491K30q72J420j200n94K153
$$ -343 793 103 -454 135 -93 362 313 -989 639 468 -1494 -3 227 -645 775 -425 -1019 1134
1815A134j177k94R55m35J78k55j120J860l74j042Q60o47J18Q87j594Q16J318j761
$$ 1134 -43 -337 618 183 361 106 -1014 846 472 -570 290 -357 -239 648 -946 -130 1188 -573
1833e73K88J87k85J542j123j012J866o73o17J003q73N06M26j488P57P77j065N92
$$ -573 -285 -98 -383 1159 36 -976 890 217 -400 603 -270 236 662 -826 -69 708 -357 235
1851B35n52m1J063j491L21J410j122M58L6j303J625J74j580J252j75q60Q77m95
$$ 235 -317 -358 705 -786 -465 945 -177 281 317 -986 639 813 -767 485 310 -550 327 -168
1869a68j16R82j120K58L89p89J113o86o86J797r45q56J545q74J31R88j868O77
$$ -168 -284 698 -422 -164 225 -564 549 -137 -823 974 29 -827 718 -156 -25 963 -905 -228
1887b28J108j172K56J55n16J001r53k33J388j173J17P06j194R58jr32J203M6j022
$$ -228 880 -292 -36 119 -397 604 -349 -582 806 -367 -250 456 -738 220 219 -713 490 536 -486
1906d86P17n60K33J148j355lR22o61K01O4p21R97l10j055J142l64j84Q35j233
$$ -486 231 -329 -96 1052 -303 -306 616 -45 156 220 -501 496 186 -869 273 -91 -275 560 -673
1925f73P73L98j039O88M40q43P02o17m71J542q22o91R20o73J91M72r00O82K99
$$ -673 100 498 -541 147 587 -256 446 -171 -642 900 78 -613 307 -366 -175 297 -603 79 378
1944C78r11O30j55k75J204j206L5J087j154R4P12o39O42l72q95J161j18o13P46
$$ 378 -533 97 -58 -333 871 -335 -300 787 -367 -273 439 -200 442 70 -825 336 218 -395 351
1963C51o36J05Q76j478O46P32r82O19k31n26J263n58p31J079n94l07N53n30Q14
$$ 351 -285 -180 696 -782 -136 596 -386 233 2 -524 739 181 -550 529 -65 -372 181 -349 465
1982D65J74j408N16M18n22R54r28j81J213r03l14J064p17N17M5j101J012j72n27
$$ 465 639 -769 -253 165 -357 597 -331 -512 701 -202 -516 548 -169 348 393 -708 304 132 -395
2001c95P01k85m29Q03q30L69P24r66K97nl43Q78l48q12J360n51n48P71o93J37
$$ -395 306 21 -408 395 -435 -66 658 -308 -11 -16 -359 519 171 -641 719 168 -380 391 -302 -165
2021a65Q37r87J46N70r55O01j28o8O17r51n5J161q72K48M92j380J189K23r75O67
$$ -165 672 -315 -169 401 -554 47 -81 -149 468 -483 -538 623 -249 -1 491 -889 300 523 -452 215
2041B15N22j009M51l92p1Q25o64P6J45o92R30k53q07J506n42p48O17j24l7N83
$$ 215 737 -272 179 -213 -284 541 -123 -47 98 -594 336 83 -724 782 240 -508 109 -15 -52 531
2061E31j149M57P92q23J55J50l65Q53r52k91J100p22Q2L65n10N35M6r08Q48R6
$$ 531 -618 -161 631 -192 -37 113 -252 601 -351 -642 458 -264 -182 183 -327 208 254 -654 194 290
2081B90m95M21n13J02R46j133j99J342j059j1N61p93Q91Q2j110O41P4N8K27q85
$$ 290 -205 216 -297 -195 751 -382 -581 761 -298 -309 252 -541 350 432 -678 -37 37 95 322 -563
2101e63N87M60j121O96O50j006P95m33q96J644n32q65J038n57n9L58o15M57M31
$$ -563 24 484 -637 59 709 -297 498 65 -831 813 281 -584 454 -103 -162 196 -419 38 469
2120D69q58M74k98m7R06j054P1J238j047m16J092q02N32k7r37J059k43m60P80
$$ 469 -389 85 -213 -260 646 -408 -337 901 -146 -562 530 -272 260 233 -704 355 112 -348 432
2139D32m90j91J036j264J3J025o89L26l68l05J060l64n15O98n97J01P48j422O87
$$ 432 -58 -249 787 -477 -464 561 -128 198 -170 -475 585 221 -294 404 -193 -92 656 -766 -79
2158g9J025j545N41K67q09R47l08m29J027q04j56M85l58O09m62o30J291l33r77
$$ -79 946 -599 -58 209 -600 347 39 -390 637 -167 -323 162 -196 413 -49 -679 612 279 -698
2177f98J274p85p0J157j248k80J525p41n64O05k83K01j34l44Q20l61k72O11j153
$$ -698 576 -209 -279 878 -370 -650 875 134 -430 175 -108 93 -41 -385 435 74 -198 413 -740
2196g40Q27P30j681Q44N83j019M27J9m01J074o00o53Q90l85J10J26p20J016K0
$$ -740 87 817 -864 -20 563 -456 -29 -10 -411 663 63 -590 300 -85 25 151 -569 447 467
2215D67j175J073j5n41O50q40Q2R69r38L0O19o73N21l12m97J145m53p65R31m49
$$ 467 -708 365 350 -191 459 -381 -299 670 -268 -238 381 -292 229 -83 -580 565 112 -653 278 -171
2235a71rP42q42R2O99o59o3L15j30M94n77k89R96r93K50P36j223P11L76j311Q12
$$ -171 -180 562 -280 -188 511 -148 -211 104 -26 468 -109 -398 598 -395 -145 591 -632 79 455 -856 -44
2256d4P28j025J54J79j76M27l98R5K45n63N35q8n56J155m05r05R80r2q30Q41m54
$$ -44 684 -341 -187 -8 -184 243 -155 -60 185 -378 157 69 -487 668 263 -642 338 246 -584 257 -197
2277a97l1N97r64L21N03k19K99k93l76R49o15k79R38p49J5N14j100N97N32o54
$$ -197 -228 369 -595 -274 229 10 309 16 -360 589 -26 -305 633 -116 -101 413 -687 -90 442 -212
2297b12J30Q1l48O26o94P5R11p31M4K96o39P75J09r16O11R4m19M97l98K39L56
$$ -212 -82 -1 -349 277 -417 -342 569 -162 -118 178 -461 314 423 -493 118 212 -207 290 -108 131 487
2318D87r38L25M75q56O37Lo81J112n19p56R90nm94L73m62K98M90o86K13J02l30
$$ 487 -451 -126 349 -507 130 133 -548 564 45 -711 279 274 -220 153 -309 -11 479 -207 6 108 -222
2339b22N81n86j22R22p67k54Q47o69J18N20q65P39O9p11K62K11q9L41o35J5O08
$$ -222 359 -227 -349 573 -194 -448 399 -270 -152 368 -497 242 311 -400 -138 73 -16 325 -310 -295 313
2360C13n87L94M8n32N88M3q39R83k52n97O02k91n5M62n24J82M15o55L44J05l46
$$ 313 -274 120 168 -364 224 267 -572 411 159 -438 164 -127 -182 280 -244 -62 353 -302 42 147 -199
2381a99O38l70n43Q06m10n8L32n39M21K63q48O34n3l66N72k67n24Q60l50k14P22
$$ -199 439 69 -474 332 -78 -136 196 -343 78 341 -507 127 74 -292 280 13 -511 349 -1 -215 507
2402E07n71n3J69m16N87p0m45N04l27K3M33n67j07Q85p96J61L71m89M27l2n47
$$ 507 -64 -117 52 -364 223 153 -292 212 -115 -92 341 -226 -333 552 -244 -83 288 -201 226 194 -353
2423c53L61J05k65J08o0J29K30p38N09K40n70M77k39j90N04k98k34N88j50k08
$$ -353 8 113 -152 -44 -104 25 255 -483 26 266 -304 173 -66 -256 248 -50 -284 304 154 -54
2443e4J54n16M67K74q10N16J90n87N07k64r2N05n01k03O84m77L46n6l65N50j05
$$ -54 100 -416 51 325 -485 31 221 -366 141 -123 -215 290 -211 -414 270 -207 139 83 -282 268 163
2464A63n22O33j68k26L94n34L83J56n88J72L33l32L08l94k65Q67k58k32L49n10
$$ 163 -359 274 106 -120 274 -260 123 279 -309 -137 196 -136 172 -222 -487 380 122 -110 239 -271
2484b71M30K28p33N39J70m74R6j18O8M18n22j83O12m70J18K66m16L59M7p39P14
$$ -271 159 387 -346 193 363 -111 -15 -133 -65 353 -169 -352 260 -210 -92 174 -242 117 164 -575 139
2505A39J14l33M69p28K91O59r05K09M51o96N32l37j08M63p8m83N12l30J1L43n02
$$ 139 253 -80 389 -339 -48 611 -294 -85 366 -330 202 -135 -243 220 142 -341 171 -159 -148 195 -307
2526c07L60K89n72K06nm6N08n94k25P07m24k26O46m26K53R4p74O24M6m58N94l64
$$ -307 53 342 -230 -24 -29 -75 433 -161 -386 321 -103 -329 317 -109 144 238 -536 88 134 -324 270 -94
2548i4r1O17p05p4P70l82L3J0m81P09j08n28O40r4m58L03l95L27M62q58L68J99
$$ -94 -185 432 -273 -347 423 41 74 84 -397 312 204 -324 316 222 -236 67 -328 -1 461 -397 -29 170
2570A70m76O94k91m16J008p98j69N44k75J61m8m80M25K75o59M00n0k14M27l63
$$ 170 -306 388 97 -319 689 -109 -278 266 -9 152 104 -376 49 324 -335 65 15 -199 228 -135
2590a35j52Q56o49k39M20m33N50m2l57L26Q9n37M05j17J35J84o81K29K54m54M41
$$ -135 -287 569 -80 -319 101 -332 218 176 -181 145 234 -303 102 -15 120 304 -377 -148 106 -348 93
2611I3M6l68N28k74k52O15k01k5J9m63M83J07p24N09K63n88L16k78M3N82m62k47
$$ 93 139 -229 299 25 -227 388 187 162 181 -282 201 308 -416 93 356 -232 84 -194 -151 431 -31 -278
2633b78N73n83K04K66n01O15k20n02O71m14q2P53p48J25M78o06m5M93k20J57j21
$$ -278 295 -288 -84 182 -319 296 76 -426 245 -169 -251 502 -246 -121 357 -249 -294 199 -21 136 15
2654A5m73P36k66k86O60o82L32L61o69K02N36n88P1J51m10O15j65k18J06k07j24
$$ 15 -458 278 12 -274 386 -296 36 397 -272 -70 466 -122 -51 100 -310 305 140 -78 28 -179 -303
2675c03L83m82O40p8p04P09k17j39N33m89j17O73m62k31O20l15J78l32k79M92
$$ -303 80 -402 238 160 -544 165 -52 -191 342 -147 -264 409 -53 -284 336 21 199 -133 -412 80
2695H0m9m78N67l95J43J95l45J20O44n27K0M2l26O98l92j74P03o03l60O25l76
$$ 80 31 -447 120 -275 -132 63 -282 -162 482 -45 -25 17 -309 389 -3 -177 526 -77 -437 188 -188
2716a88K23K61q96M75L61m76K56p8q3M46n67L9N15l17K45j95m42O36Q2p34P11
$$ -188 35 296 -600 -125 236 -240 16 -62 -145 301 -266 -227 288 -29 216 21 -421 215 297 -437 274
2737B74k26l42L76k61o0M77n10rM41l52M38j35k57O65n80l41P82m11q4N04o50
$$ 274 48 -294 82 -179 -239 238 -272 -281 160 -192 246 111 -146 519 -61 -402 380 -31 -115 389 -261
2758b61N9M60n90K71J31j99K66m17J40O13n77K4L28m74M01j3m32L96L34p08K67
$$ -261 -202 258 -332 -61 70 -129 137 -280 -140 473 -104 -80 248 -226 175 162 -270 126 460 -248 19
2779A9k83K38M37n76O9K33m54L33O6l92N91j24o84O67O6l76N07l57p9M96n42J33
$$ 19 -264 -26 411 -165 -96 137 -317 16 82 -310 281 157 -527 140 206 -170 337 -20 -99 397 -145 -12
2801a2K21k83L02j63m44Q96m65n09Q79n15n8L58n76K70L53l42n1J9J7M39l75o6
$$ -12 209 -74 228 65 -379 517 52 -457 422 -93 -151 207 -369 -99 254 -88 -139 -120 -103 336 -39 -105
2823a05M37n16J19M27o49P25j78q98Q92j21l30K87j25k29N07p05K60M72l75K36
$$ -105 332 -184 -65 362 -287 438 260 -638 254 133 -197 90 -35 -264 243 -462 -202 270 -105 131
2843A31j10l28P85n10l73P24j57k92K00l27L23K90n91P1M80n46M50k71j10Q52
$$ 131 21 -307 478 -32 -405 319 162 -130 70 -257 66 356 -235 -164 316 -230 220 -51 -161 691
2863F91q61r3N11m27L73Po48P79k32m59L48j12j15N86r31L02Q59r02J55M13m95
$$ 691 -170 -263 248 -179 194 201 -447 332 100 -359 -11 -123 -238 348 -583 -281 578 -324 -169 244 -251
2884b51L13K76o60N59j52k12K90m01K85K49q15N10K51q33O94qo13R78m49m90P06
$$ -251 62 338 -322 237 85 -127 163 -238 47 296 -519 -9 242 -591 103 95 -518 460 11 -479 227
2905B27k65l0M08o38M91J28o20O11j14m04M91n70j33Q41o49J35L76p36M40R5l64
$$ 227 -38 -68 340 -298 193 321 -299 312 198 -206 285 -285 -418 423 -226 -91 285 -451 -11 84 -280
2926b80O39j42n15N49k80q3M78n82K82K47n03N7L15l89N17n31k72P43k05k90M88
$$ -280 359 217 -298 251 -29 -112 366 -216 66 313 -190 -133 182 -207 310 -221 -493 250 45 -245 243
2947B43m35L49R9p19O55K94o83J59J01k64P19o90j48P39n82J9Q6k03N30q3o65
$$ 243 -192 157 256 -463 192 486 -197 -38 63 -201 518 -172 -320 419 -163 -144 -58 -261 269 186 -479
2968d79P31j80l96N84n59L30N53q76J80M98m64J95j21k51O64m76k49L72j80L38
$$ -479 252 72 -324 260 -299 31 584 -292 -112 386 -78 117 -4 -255 409 -67 -316 56 -124 214
$$ [...]
8191E5
##END NTUPLES=NMR FID
##END=
