##TITLE=1H_DE-80H_X3
 200.13MHz, d2o
 8 sc
 
 19ns.26.2.2025
##JCAMPDX= 6.0         $$ Bruker NMR JCAMP-DX V2.0
##DATA TYPE= NMR FID
##DATA CLASS= NTUPLES
##ORIGIN= UXNMR, Bruker Analytische Messtechnik GmbH
##OWNER= pz
$$ XWIN-NMR		Version 3.5
$$ Thu Apr  3 12:20:37 2025 Russian Standard Time (UT+4h)  Yarkov@DPX200
##.OBSERVE FREQUENCY= 200.1313
##.OBSERVE NUCLEUS= ^1H
##.DELAY= (6, 6)
##.ACQUISITION MODE= SIMULTANEOUS
##.ACQUISITION SCHEME= undefined
##.AVERAGES= 8
##.DIGITISER RES= 18
##SPECTROMETER/DATA SYSTEM= spect
##.PULSE SEQUENCE= zg30
##.SOLVENT NAME= DMSO
##.SHIFT REFERENCE= (INTERNAL, DMSO, 0, 14.3821)
##AUDIT TRAIL= $$ (NUMBER, WHEN, WHO, WHERE, WHAT)
$$ ##TITLE= Audit trail, XWIN-NMR		Version 3.5
$$ ##JCAMPDX= 5.01
$$ ##ORIGIN= Bruker BioSpin GmbH
$$ ##OWNER= Yarkov
$$ C:/Bruker/XWIN-NMR/data/yarkov2/nmr/H-C/1/audita.txt
$$ ##AUDIT TRAIL=  $$ (NUMBER, WHEN, WHO, WHERE, WHAT)
(   1,<2025-04-03 12:18:27.68 +0400>,<Yarkov>,<DPX200>,
      <created by zg, POWCHK disabled, PULCHK disabled
       configuration hash MD5:
       00 E9 B6 7A A2 85 ED C7 34 08 36 98 17 FE 4E 26
       data hash MD5: 16K
       1B 67 B8 6C 05 0C C0 3F 04 C4 6D B3 1E 68 48 10>)
$$ ##END=
$$ 
$$ hash MD5
$$ CA EA 1E 39 55 C8 27 26 2E F5 25 14 4E 10 EC 64
##$RELAX= 
##$RELAX= 
##$RELAX= 
##$RELAX= 
##$RELAX= 
##$RELAX= 
$$ Bruker specific parameters
$$ --------------------------
##$DU= <C:/Bruker/XWIN-NMR>
##$EXPNO= 1
##$NAME= <H-C>
##$PROCNO= 1
##$TYPE= <nmr>
##$USER= <yarkov2>
##$AMP= (0..31)
100 100 100 100 100 100 100 100 100 100 100 100 100 100 100 100 100 100 
100 100 100 100 100 100 100 100 100 100 100 100 100 100 
##$AQSEQ= 0
##$AQ_mod= 1
##$AUNM= <au_zg>
##$AUTOPOS= <>
##$BF1= 200.13
##$BF2= 200.13
##$BF3= 200.13
##$BF4= 200.13
##$BF5= 200.13
##$BF6= 200.13
##$BF7= 200.13
##$BF8= 200.13
##$BYTORDA= 1
##$CFDGTYP= 0
##$CFRGTYP= 5
##$CHEMSTR= <none>
##$CNST= (0..31)
1 1 145 1 1 1 1 1 1 1 1 1 1 1 1 1 1 1 1 1 1 1 1 1 1 1 1 1 1 1 1 1 
##$CPDPRG= <>
##$CPDPRG1= <>
##$CPDPRG2= <>
##$CPDPRG3= <>
##$CPDPRG4= <mlev>
##$CPDPRG5= <mlev>
##$CPDPRG6= <mlev>
##$CPDPRG7= <mlev>
##$CPDPRG8= <mlev>
##$CPDPRGB= <>
##$CPDPRGT= <>
##$D= (0..31)
0 0.7 0 0 0 0 0 0 0 0 0 0.03 0 0 0 0 0 0 0 0 0 0 0 0 0 0 0 0 0 0 0 0 
##$DATE= 1743668307
##$DBL= (0..7)
120 120 120 120 120 120 120 120 
##$DBP= (0..7)
150 150 150 150 150 150 150 150 
##$DBP07= 0
##$DBPNAM0= <>
##$DBPNAM1= <>
##$DBPNAM2= <>
##$DBPNAM3= <>
##$DBPNAM4= <>
##$DBPNAM5= <>
##$DBPNAM6= <>
##$DBPNAM7= <>
##$DBPOAL= (0..7)
0.5 0.5 0.5 0.5 0.5 0.5 0.5 0.5 
##$DBPOFFS= (0..7)
0 0 0 0 0 0 0 0 
##$DE= 6
##$DECBNUC= <off>
##$DECIM= 32
##$DECNUC= <off>
##$DECSTAT= 4
##$DIGMOD= 1
##$DIGTYP= 9
##$DL= (0..7)
0 120 120 120 120 120 120 120 
##$DP= (0..7)
150 150 150 150 150 150 150 150 
##$DP07= 0
##$DPNAME0= <>
##$DPNAME1= <>
##$DPNAME2= <>
##$DPNAME3= <>
##$DPNAME4= <>
##$DPNAME5= <>
##$DPNAME6= <>
##$DPNAME7= <>
##$DPOAL= (0..7)
0.5 0.5 0.5 0.5 0.5 0.5 0.5 0.5 
##$DPOFFS= (0..7)
0 0 0 0 0 0 0 0 
##$DQDMODE= 0
##$DR= 18
##$DS= 0
$$ [...]
##$SUBNAM2= <"">
##$SUBNAM3= <"">
##$SUBNAM4= <"">
##$SUBNAM5= <"">
##$SUBNAM6= <"">
##$SUBNAM7= <"">
##$SUBNAM8= <"">
##$SUBNAM9= <"">
##$SW= 18.0517328524113
##$SWIBOX= (0..15)
0 0 2 0 0 0 0 0 0 0 0 0 0 0 0 0 
##$SW_h= 3612.71676300578
##$TD= 16384
##$TD0= 1
##$TE= 0
##$TE2= 300
##$TE3= 300
##$TEG= 300
##$TL= (0..7)
0 120 120 120 120 120 120 120 
##$TP= (0..7)
150 150 150 150 150 150 150 150 
##$TP07= 0
##$TPNAME0= <>
##$TPNAME1= <>
##$TPNAME2= <>
##$TPNAME3= <>
##$TPNAME4= <>
##$TPNAME5= <>
##$TPNAME6= <>
##$TPNAME7= <>
##$TPOAL= (0..7)
0.5 0.5 0.5 0.5 0.5 0.5 0.5 0.5 
##$TPOFFS= (0..7)
0 0 0 0 0 0 0 0 
##$TUNHIN= 0
##$TUNHOUT= 0
##$TUNXOUT= 0
##$USERA1= <user>
##$USERA2= <user>
##$USERA3= <user>
##$USERA4= <user>
##$USERA5= <user>
##$V9= 5
##$VALIST= <valist>
##$VCLIST= <CCCCCCCCCCCCCCC>
##$VD= 0
##$VDLIST= <DDDDDDDDDDDDDDD>
##$VPLIST= <PPPPPPPPPPPPPPP>
##$VTLIST= <TTTTTTTTTTTTTTT>
##$WBST= 1024
##$WBSW= 4
##$XGAIN= (0..3)
0 0 0 0 
##$XL= 0
##$YL= 0
##$YMAX_a= 29727
##$YMIN_a= -81960
##$ZGOPTNS= <>
##$ZL1= 120
##$ZL2= 120
##$ZL3= 120
##$ZL4= 120
##$ABSF1= 10
##$ABSF2= 0
##$ABSG= 5
##$ABSL= 3
##$ALPHA= 0
##$AQORDER= 0
##$ASSFAC= 0
##$ASSFACI= 0
##$ASSFACX= 0
##$ASSWID= 0
##$AUNMP= <proc_1d>
##$AZFE= 0.1
##$AZFW= 0.1
##$BCFW= 1
##$BC_mod= 2
##$BYTORDP= 1
##$COROFFS= 0
##$CY= 83.5205535888672
##$DATMOD= 1
##$DC= 2
##$DFILT= <>
##$DTYPP= 0
##$F1P= 10.8118882576601
##$F2P= -7.23987719738617
##$FCOR= 0.5
##$FTSIZE= 0
##$FT_mod= 4
##$GAMMA= 1
##$GB= 0.15
##$INTBC= 1
##$INTSCL= 1
##$ISEN= 128
##$LB= 0.25
##$LEV0= 0
##$LPBIN= 0
##$MAXI= 10000
##$MC2= 0
##$MEAN= 0
##$ME_mod= 0
##$MI= 1.114404
##$NCOEF= 0
##$NC_proc= 0
##$NLEV= 6
##$NOISF1= 3.799351
##$NOISF2= 2.8
##$NSP= 1
##$NTH_PI= 0
##$NZP= 0
##$OFFSET= 14.38212
##$PC= 1
##$PHC0= -1187.613
##$PHC1= 3.39226
##$PH_mod= 1
##$PKNL= yes
##$PPARMOD= 0
##$PSCAL= 0
##$PSIGN= 0
##$REVERSE= no
##$SF= 200.129724274929
##$SI= 16384
##$SIGF1= 3
##$SIGF2= 2
##$SINO= 400
##$SIOLD= 16384
##$SREGLST= <1H.CDCl3>
##$SSB= 0
##$STSI= 0
##$STSR= 0
##$SW_p= 3205.1282051282
##$SYMM= 0
##$S_DEV= 0
##$TDeff= 0
##$TDoff= 0
##$TI= <>
##$TILT= no
##$TM1= 0
##$TM2= 0
##$TOPLEV= 0
##$USERP1= <user>
##$USERP2= <user>
##$USERP3= <user>
##$USERP4= <user>
##$USERP5= <user>
##$WDW= 1
##$XDIM= 8192
##$YMAX_p= 0
##$YMIN_p= 0
$$ End of Bruker specific parameters
$$ ---------------------------------
##NTUPLES= NMR FID
##VAR_NAME=  TIME,          FID/REAL,        FID/IMAG
##SYMBOL=    X,             R,               I
##VAR_TYPE=  INDEPENDENT,   DEPENDENT,       DEPENDENT
##VAR_FORM=  AFFN,          ASDF,            ASDF
##VAR_DIM=   8192,          8192,            8192
##UNITS=     SECONDS,       ARBITRARY UNITS, ARBITRARY UNITS
##FACTOR=    0.0002768,     1,               1
##FIRST=     0,             0,               0
##LAST=      2.2672688,     0,               0
##MIN=       0,             -81960,          0
##MAX=       2.2672688,     29727,           0
$$ Real data points
##PAGE= N=1
##DATA TABLE= (X++(R..R)), XYDATA
$$ [...]
1390a06J35J15lj98J31j86O0J0O7k27R6M3J1M9m7l1Q0Km2J05j85J19p1J66J84
1415B77j18q7j98Q6j40J58J37p3J13j23N9r8J1k56J58M7JR8p9J29l2p2l3O0j33
1440a08Q6K56j89jl5J33q2r4p5N0q9J51J36Kj17j4r4k5j47K33M5p5j6J21l7J6
1466C1j0j53L7n3J26P9n1J31J6j80r0k7J10J5K3P8k1Q8o2j75q9k1P2k8J73J50
1492A69j36J12r8o8K2K1j69J63J12M0j47m5J46k90j4O3O7j7K6R4m0j25J17j86
1516a83P4N9j3J42J44j62J43j43j78Q8n3R6m8PL07j56l0j06j70J04lj32J23J31
1540D1P4n9pN8k74K8j36J61J96j1j27M9J18j50rj28n7K31q4K16p3Q1j21N1L1j02
1566cpn3L7m0J36Q5K5l42K02Qr4P8M6Q0m0J00j97j13Q0O5j13nJ71q3J30j11jM8
$$ plain form
1390 -106 29 144 141 -57 74 -112 -52 -42 25 -202 -106 -63 -52 -3 -50 -81 -1 1 -41 64 -121 -2 -73 93 277
1415 277 159 72 -126 -40 -180 -22 115 42 155 32 91 -7 4 -252 -94 -47 -46 52 -27 102 70 -2 -35 25 -108
1440 -108 -22 234 45 44 9 142 60 -34 -109 -59 -148 3 139 141 24 10 -84 -109 -256 -23 22 -53 -69 52 15 31
1466 31 21 -132 -95 -148 -22 57 6 137 153 -27 -117 -144 -34 -19 4 82 61 149 87 -88 -177 -198 -126 -154 19 169
1492 169 33 145 47 -21 1 22 -147 16 128 168 21 -24 122 -168 -182 -119 -52 -69 -43 51 11 -114 3 -183
1516 -183 -109 -50 -63 79 223 61 204 61 -117 -29 -82 14 -34 -27 280 124 94 -12 -182 -78 -81 -213 -90 41
1540 41 115 56 49 107 -167 -139 -275 -114 82 71 -56 -7 111 -39 -48 -176 -233 -2 -86 130 57 138 17 68 99 -3
1566 -3 -10 -63 -26 -66 70 155 180 -162 40 48 -46 32 78 158 118 218 21 -92 -12 53 -60 -65 106 23 153 42 41 89
1594H9qk06J26j55J00q4J22J44q6j06R6nj27K17j38J51k1j13K30j10m5p3n1j4
1618f7j87J89n6K36j6k2K4o3r2k13Q6J33J38J41k62Q1L9j11Q5k25R7K46j76r7
1642i2P6J67N8j15r7j30J8K17j19l9K61j15K22m34J35J2j71N2r0J26K7J12n2k31
1666b02K21L9j10Q8j91L05k37k1J37J87j43q7kj2j19J59rjK89j82k86K5R5k7J39
1691E5k4r5J09J1j1k11J43n3J13K0k14K48L9r1L8o6PP3j39q2K96k45J48k5J44
1716A88r8n0j26j20J08K51l6j75n9K65M1k16k50K24l7J87k09O7J87l48K08j66
1738a64K68K3j09j0j3J80j11j17J50j98J97j19q0J47Lo3O5j39k5m2K0J33q5K32
1762A43N4l07J25K8L0p0m9O0LJ07j48P9j46P0R0m7k9Q3j1r4L0o1J17N1j69q0J86
$$ plain form
1594 89 81 -125 1 -154 -54 -138 -16 128 42 -64 32 27 -100 117 -21 130 109 -4 226 116 71 -2 -53 -67
1618 -67 -254 -65 -121 115 99 77 101 38 -54 -267 -181 -48 90 231 -31 50 89 -22 63 -162 -65 181 5 -92
1642 -92 -16 151 209 94 -3 -133 -115 102 -17 -56 205 90 312 -122 13 25 -146 -94 -184 -58 -31 81 29 -202
1666 -202 19 58 -52 36 -155 150 -87 -108 29 216 73 -14 -16 -28 -147 12 3 2 291 109 -177 -152 -57 -84 55
1691 55 31 -64 45 56 45 -166 -23 -76 37 57 -157 91 130 39 77 11 18 91 -48 -130 166 -79 69 44 188
1716 188 90 40 -86 -206 -98 153 117 -58 -117 148 189 -27 -277 -53 -90 97 -112 -45 142 -206 2 -164
1738 -164 104 127 18 8 -5 175 64 -53 97 -101 96 -23 -103 44 47 -16 49 -90 -115 -157 -137 -4 -89 143
1762 143 197 -110 15 43 73 3 -46 14 17 124 -24 55 -91 -21 69 22 -7 76 65 -29 1 -60 57 108 -61 -141 45
1789D5J13j82K3j60J64l7j19l3O2J14J14j27n5L5L0J5m2J1J59O3j16k50J10P4
1813A1j30M7j0kN8n1Pl2L43l61o6R2K29j09j58K22k17K44N8j68L1Oj08Q9j07M6
1839c6J15k4j60O8P7L0j15L5J1KJ5p2Q7j51K7R9m2k7J29L3j88J7J55o2k4pj74
1866a82J97J42j13j08R6J74o5j64j5KJ61l18J34J64j0j20j4J5J40m0r1j78J60
1889c3J13j07O7k21J80k8n9r3J57OO7l2l6j9J22K3j70P3LM5k19J5P0K2k7L4l8
1916h5J14Q3j25j4K3P9k46R0J03J37k12M4N7M9j41j57J5R0K17j06J2p3L1K69j55
1941I9k68O8K25k00p6k4J29J03lk4j17J06q4K23j06K6q5j31J35p6L2J31l25J82
1965f0K1J35j32L8j87K38L7qj51j18K89j09m5J37k46J78k7K0j25L07k71Lq8K08
$$ plain form
1789 45 158 -24 -1 -161 3 -34 -153 -186 -124 -10 104 -23 -78 -43 -13 2 -40 -29 130 193 77 -173 -63 11
1813 11 -119 -72 -82 -84 -26 -77 -70 -102 241 -120 -186 -94 135 26 -132 90 -127 117 175 7 38 44 -64 25 -82 -36
1839 -36 79 55 -105 -37 40 70 -45 -10 1 3 18 -54 33 -118 -91 8 -34 -61 68 101 -87 -70 85 23 -1 -8 -182
1866 -182 15 157 44 -64 32 206 141 -23 -38 -36 125 -193 -59 105 95 -25 -39 -24 116 76 -15 -193 -33
1889 -33 80 -27 40 -181 -1 -29 -88 -181 -24 -18 49 17 -19 -38 84 107 -63 10 13 58 -161 -146 -76 -54 -81 -47 -85
1916 -85 29 112 -13 -27 -4 75 -171 -81 22 159 -53 -9 48 97 -44 -201 -186 -96 121 15 27 -46 -15 254 99
1941 99 -169 -101 124 -76 -152 -176 -47 56 53 29 -88 18 -66 157 51 77 -8 -139 -4 -80 -48 83 -242 -60
1965 -60 -39 96 -36 2 -185 53 90 82 -69 -187 102 -7 -52 85 -161 17 -10 10 -115 192 -79 -76 -164 44
1989D4J87r2l0j52j0l9J47j30J59J9k7j09n7J21J04j34J01J4l20K03n4l9J77J80
2013B63l07J50OM3r7o6J36j94p2J52K43m34K79m8k06J21k8p5O8N7K2J09j72jJ06
2038E5M6j3K7j79k0J0J57J2j70L7P0O0j9j42K91k76P9n8J49j08j09K07k53L07
2062A60j14n6J2j21N9k0j03L2K10LK9j41J19J03j31j41J82p1R7r8n3q2K43Q1j04
2087I5j14q7J96j07o5k0K0j44K42l2%kM4J0J41j49J82j91j98J65Q9L4Pj19l9J10
2113F8k5k62K11j2RN4lr8K86k29o9P7j19K86j78l4K22k35p1J33o8J08O7j89oJ70
2139I3k3m0n1J33k88J31J18q2j8J42j20K3j21J72l4j51k0K50p4J4j52P2P6j45
2163i5J55o0j37J51K0K6o4M9j35O0P1r8O5Q7o5N0j83P6J8J4K1n0j1O0l8J6n1J28
$$ plain form
1989 44 231 139 109 -43 -53 -92 55 -75 84 103 76 -33 -90 31 135 1 102 116 -204 -1 -55 -94 83 263
2013 263 -44 106 112 155 58 -8 128 -66 -138 14 257 -177 102 54 -152 -31 -59 -134 -66 -9 13 122 -50 -51 55
2038 55 101 88 115 -64 -84 -74 83 95 -75 -38 32 92 73 -69 222 -54 25 -33 116 8 -101 106 -147 160
2062 160 46 -10 2 -119 -60 -80 -183 -151 59 62 91 -50 69 172 41 -100 82 11 108 10 -43 -125 118 199 95
2087 95 -19 -106 90 -17 -82 -102 -82 -226 16 -16 -16 -18 26 36 177 28 210 19 -179 -14 75 109 116 -3 -42 68
2113 68 43 -219 -8 -20 -11 43 40 -58 228 -1 -70 7 -112 174 -4 -38 184 -51 -122 11 -57 51 118 -71 -77 93
2139 93 70 30 -21 112 -176 -45 73 -9 -27 115 -5 18 -103 69 35 -116 -136 114 40 54 -98 -26 50 -95
2163 -95 60 0 -137 14 34 60 -4 45 -90 -30 41 -57 8 95 30 80 -103 -27 -9 5 26 -24 -35 25 -13 3 -48 80
2191H0j90l6K39J14l49J65J59j87R8q6m0M7j69J21O1j34J06J12j23j2M1K2nj07
2215g3O8r5Q4r9j78J98O9J20k32L9K88k40L4l0p0K97j73k6P3j55J85l8j62K30
2239A14j3l5j49J33p3j56O2J14O5j5m9M6n4L0n8k7m2m3J60O0j31pL4J9j4m5R3
2266A9n3O2p0O5o0J15k29L05l13N6K83l39N4J04o9O0J02kJ0q0k1M2n2J24j01K10
2292B22k52j5R0L1j0qJ3J5j03P5kl14J85J22q0mm8q6K9J22M1j04j5M2K4O5P5j3
2320I7J27k68L7k9J5O9j32m9K07j49J9J38j09L6l4R7j02K94k84J8j1k6M9L1K20
2345B61q6l25K85j75K96j64k02J00k6J9M7j44J46j95J16n1Q3m6r2J33O4Qkn9M2
2370C3m3Q8p2J06j78j32J06J96Ok14J17r4K2J89jj08p9J37j13J11ln4jN2j66P0
$$ plain form
2191 80 -110 -146 93 207 -142 23 182 -5 93 7 -33 14 -155 -34 27 -107 -1 111 -12 -24 17 39 34 -73
2215 -73 -5 -100 -16 -115 -293 -95 -26 94 -138 -99 189 -51 -17 -47 -117 180 7 -19 54 -101 84 46 -116 114
2239 114 101 66 -83 50 -23 -179 -117 -3 62 47 -2 44 -10 20 -38 -65 -107 -150 10 70 -61 -68 -34 -15 -29 -74 19
2266 19 -34 28 -42 23 -37 78 -151 154 -159 -103 180 -159 -105 -1 -70 -10 92 90 100 20 -1 41 -11 113 12 222
2292 222 -30 -45 45 76 66 58 71 86 -17 58 56 -258 -73 49 -31 -35 -83 -169 -140 -18 23 -81 -96 -54 -30 35 110 97
2320 97 224 -44 -7 -36 -21 48 -84 -133 74 -75 -56 82 -27 9 -25 72 -30 264 -20 -2 -13 -39 10 41 261
2345 261 175 -150 135 -40 256 92 -110 -10 -36 -17 30 -114 32 -163 -47 -98 -15 -61 -153 -20 44 52 50 -9 33
2370 33 -10 78 6 112 -66 -198 -92 104 110 -104 13 -81 -59 130 129 21 -58 79 -34 77 74 20 19 71 -95 -25
2396b5p8M5O6o6j0M0n1J89p2J02j34J0j34J39Q7m1j21J69j11j31J39J2j40J70
2420E4n3j01P9p7j70J56K28p7O1j84O1M8l6o5J40n7M1n1k1r4Q9Q3p6l6P3L9L0
2447H4p5J45j76m2M6m8J2L32l75J06j12J10P8o6j58K72k20J06l6n2Q8k03K35l5
2471A6M4K09k01%K07k02k79P9P4j03k8J63J26l1k45J04J02p3N1K0n9j21J43r3
2495i7P7L6r4J75p4j26P4Q6o3q8N8L8R9Q4n0k3j32nJ52j24l8M7J7j4J11j65LJ64
2523A28q3j93J55q2J78j35K6N3r2O0NL5l5o8j49J51L8LO5j07J67j19m9m3M4J47
2549A00j76kL18k36j50J61q4J6K14j00j16J23j0j05M0K3L1J3L5r0k36M42k89J96
2573A18j02j6J11j28K9K45k62p4K20j44oJ44j07r5j3J33p9j7O9j51P8J7J20p1
$$ plain form
2396 -25 -103 -58 8 -58 -68 -28 -79 110 38 140 6 16 -118 21 108 67 -54 115 4 -127 12 24 -116 54
2420 54 1 -100 -21 -98 -268 -112 116 39 100 -84 -23 25 -11 -76 64 7 48 -3 -24 -118 -29 54 -22 -58 15 54 84
2447 84 9 154 -22 -64 -18 -66 -54 278 -97 9 -103 7 85 19 -139 133 -87 19 -17 -69 19 -184 51 16
2471 16 60 269 68 68 275 73 -206 -127 -53 -156 -184 -21 105 74 -171 -67 35 -38 13 33 -26 -147 -4 -97
2495 -97 -20 16 -78 97 23 -103 -29 57 -6 -94 -36 2 101 185 135 112 -20 -25 127 3 -35 12 29 15 126 -39 -36 128
2523 128 45 -148 7 -75 103 -32 -6 47 -45 15 20 55 20 -48 -197 -46 -8 -5 60 -47 120 1 -48 -91 -47 100
2549 100 -76 -78 240 4 -146 15 -69 -53 161 61 -55 68 58 -47 -7 16 47 60 95 5 -231 211 -78 118
2573 118 16 0 111 -17 12 257 -5 -79 141 -3 -9 135 28 -67 -80 53 -26 -43 26 -125 -47 -30 90 19
2597A9R4k12%K05j62J4N9J16m0m0j26p7J20J2J1J00j49J22r8o1J25pl1Q2p6l7
2623c7NJ30k03K53j29j56J96j03q1K21n8l5r3k6P8k11K37J14j31j74O2O7P3k2
2647b3J21k91J87P8o1N1r9K3j8J5M4J08o8k7q1K%J9N5n4l2j21R3J59q6N4l8j15
2675a05l8K09j48L5lm4J05pk6o2K26l12J57Q0j79K40Q7l29K76n7L0j03O0j64j04
2700a76K08R5j00J27j96N6Lj58L15k39o0L58k87M6J01O3p2j13k7K18q6j14J77
2723A39j54M6j4k8Oo0J76j00O0j07P4j1k7m6R9L4k06O3K33j63j2J14l9j57J95
2748A15j80L0L5o3k0J65o3n5r1j1J19O6l8J70j96M7O7l06K03j32k1M19l02J83
2772A41p0r2J90k33R1k0j9N3M8j04j46J24n9O2j41Q0J09J0Q4N8o5j08J64j69K52
$$ plain form
2597 19 113 -99 -99 106 -56 -42 17 133 93 53 -73 -150 -30 -18 -7 93 -56 66 -32 -93 32 25 -6 76 0 -37
2623 -37 -32 98 -105 148 19 -137 59 -44 -125 96 38 3 -90 -116 -38 -249 -12 102 -29 -203 -141 -74 -1 -23
2647 -23 98 -193 -6 72 11 62 -37 -14 -32 -17 27 135 67 40 -41 -39 -39 -20 35 -19 -51 -172 -79 80 -6 48 10 -105
2675 -105 -143 66 -82 -47 -50 -94 11 4 -22 -84 142 -170 -13 67 -112 128 215 -114 162 105 135 32 92 -72 -176
2700 -176 32 127 27 154 -42 14 17 -141 174 -65 -125 233 -54 -8 93 156 84 -29 -56 162 76 -38 139
2723 139 -15 31 17 -11 -5 -65 111 11 71 -36 38 27 0 -46 53 87 -119 -56 177 14 2 116 77 -80 115
2748 115 -65 -35 0 -63 -83 82 19 -36 -127 -138 -19 47 9 179 -17 30 97 -209 -6 -138 -159 260 -42 141
2772 141 71 -21 169 -64 27 7 -12 41 89 -15 -161 -37 -96 -34 -175 -95 14 24 108 166 101 -7 157 -12 240
2797B40j87j52R2q6K50j50j10J15o1n2J57n6j36K14l32K43R3K4k31R4Q1r8L4O1
2821D7J03j49P9k10k6J48j6Q4m6r6q9J49J9J70k22L8k5J35j88J03N2j2L6k7m4
2846A3P5q4q5Q3mP8j66N9j01R3J20M9j00N2M0j12l1l0J5J20o3Q5k04J21J45Lk49
2873g8R9L0j37q6K96l2Ro0L8l5n7p3P8J59j29j95K62Q1j55m1l9NK66k28J03j64
2899h3J51N5M6k21M3J15j7n6J1J96k58Q0N0j07N2j8J5k10J72p6J3J14k25J87Q0
2924A09r2p7o3N5Q8M2j4L9k43Q1O5Q1r4M0j0op1PM7J94j44j80K09m9j03L12j42
2951H1k6j10J60k24J91J1j64J53O3k63M9L30j91j58J02J4KO0j29kJ65j24l4l2
2975g6L2N7j30P4M3Q2M2j28lj08J00k2Q1J2j11mR7j2k01K52j50j4J72k3k55J52
$$ plain form
2797 240 53 -99 -7 -93 157 7 -103 12 -49 -101 56 0 -136 78 -254 -11 82 106 -125 -31 50 -48 -14 47
2821 47 150 1 80 -130 -156 -8 -24 60 14 -82 -171 -22 -3 167 -55 -17 -42 93 -95 8 60 48 84 57 13
2846 13 88 4 -81 2 -2 76 -90 -31 -132 -39 81 130 30 82 122 10 -21 -51 -36 84 21 106 -98 23 168 171 -78
2873 -78 21 51 -86 -172 124 92 101 41 79 44 -13 -86 -8 151 22 -173 89 170 15 -26 -65 -60 206 -22 81 -83
2899 -83 68 123 169 -52 -9 106 89 33 44 240 -18 62 112 5 57 39 54 -156 16 -60 -47 67 -158 29 109
2924 109 17 -60 -123 -68 20 62 48 87 -156 -75 -10 71 -23 17 7 1 -70 -63 -16 178 34 -146 63 14 -89 223 81
2951 81 55 -55 105 -119 72 83 -81 72 135 -128 -79 251 60 -98 4 18 20 80 -49 -51 114 -10 -44 -76
2975 -76 -44 13 -117 -43 0 82 124 -4 -7 -115 -15 -37 44 56 -55 -59 38 26 -175 77 -73 -87 85 62 -193 -41
3001d1J32L5k26k8J11J23N1j47M7j31r3J96n4Q5j34J08Q7J6j44RL6k2j13L9J61
3026A03j33n9m3J29Q9j87K0K53k48P7r0Q4L7L2m1k22Q1J84j34o7R0j34q0K16p5
3051a18N2J89k8m7j0j71k0O3K45k06K18k32n9P7L9K0O4Lo6J5K1R3o5j05J9p5J16
3078C2J05k21J43q5P2p3r6NL19n7j86j97L13j06J03q9l5O3p8K35k67M3q7N0Q6
3103hM2m3lN6K5n6K6l3J31j87J83k63J95Mj22J10j31l9J99%k21k9K03M3j07m9
3129g4R9j07K24j94J2k6n5K01n2q8J94j69RM6j30J16j0O9j70o8J34Q9Q1j33k4
3154b6p9J19P9j11M8J60k17N0K1J02q1O2r4j3o6M2M4%M6j05K4j00J43j04M0K4
3180Hq2MJ37kl2k8l2j37J04LJ63j36J34k09Q9O6Qm5p5R8J14o1n0j23K84j87N0
$$ plain form
3001 -41 91 126 -100 -128 -17 106 157 10 57 -74 -167 29 -25 60 -74 34 121 137 -7 2 38 16 -97 -58 103
3026 103 -30 -89 -132 -3 86 -101 -81 172 -76 1 -89 -5 32 64 23 -199 -118 66 -68 -135 -45 -179 -259 -43 -118
3051 -118 -66 123 95 48 38 -133 -153 -90 155 -51 167 -65 -124 -47 -8 12 76 79 13 28 49 142 77 -28 -9 -84 32
3078 32 137 -84 59 -26 46 -27 -123 -118 201 144 -42 -239 74 -32 71 -18 -53 10 -68 167 -100 -57 -144 -94 -8
3103 -8 34 -9 -12 44 69 13 39 6 137 -50 133 -130 65 69 -53 57 -74 -113 86 86 -135 -164 39 82 -25 -74
3129 -74 25 -82 142 -52 -40 -66 -121 80 28 -60 134 -35 -26 20 -110 6 -4 65 -105 -173 -39 50 131 -2 -26
3154 -26 -105 14 93 -18 30 190 -27 23 44 146 65 127 33 20 -46 -4 40 40 86 -19 5 -95 48 -56 -16 8
3180 8 -74 -70 67 65 33 5 -27 -164 -60 -57 106 -30 104 -105 -16 50 58 13 -62 36 150 89 39 -84 200 13 63
3207F3j69j6P0m2K20k07r2J01L6J64j50nR0j24m6K00O2l01J67j5J48k47N8N1P
3232B3L4n3q3J97p5kJ5n2K9P7k21J64j46J76k46J99n6j06J50M9m0p7J02j2j6k42
3258b12J83J18l7k1o6L3L4o0k2K82k10p9K66o7M2k28K5Pl2KJ10n3J2L9j02J2N2
3285B8j87J13K7L8r2Q3K9r7j20L20k37R7l9L31l39o6K65k37%o3P2P3m4J0Op5l3
3312a37J74pj84L25j52j27P0l8j5R5Oj8m5l0J55o4L5p8n6J06M0n3q1K03Qk87J30
3339b5o9K16k04M4n0K91k52K02o0Nj97Q7m4P7j30j6J27j95K78l2O4k43J90j21
3363e7L0j1L7L3l0J23l07K43m8n2Q3j2j19K4K82k90m4L9R2j17K9Q4j05p0P3Q9
3389aM5k2j95R1J95j17N3J14k25J02q2J90j61k4M6J15j07qJ3J4j20Q4n2J17k24
$$ plain form
3207 63 -106 -122 -52 -94 126 -81 -173 -72 -36 128 -22 -27 63 -61 -107 93 155 -146 21 6 154 -93 -35 16 23
3232 23 57 4 -79 118 43 41 56 4 33 110 -111 53 -93 83 -163 36 -20 -126 24 73 33 -44 58 46 30 -212
3258 -212 -29 89 52 31 -35 -2 32 -28 -50 232 22 -57 209 142 184 -44 -19 -12 -44 -42 68 15 27 66 -36 -24 28
3285 28 -159 -46 -19 19 -73 10 39 -58 -178 142 -95 2 -37 294 -45 -111 154 -83 -83 -146 -74 -1 -45 -35 -29 -104 -137
3312 -137 37 30 -154 171 19 -108 -38 -76 -91 4 10 -8 -53 -83 72 8 43 -35 -91 15 55 2 -79 124 132 -155 -25
3339 -25 -94 122 -82 -38 -88 203 -49 153 93 98 -99 -12 -56 21 -109 -125 2 -193 85 53 117 -126 64 -57
3363 -57 -27 -38 -1 32 2 125 -182 61 13 -39 44 32 -87 -63 219 -71 -115 -76 16 -101 -72 12 -93 -163 -90 -1
3389 -1 44 22 -173 -82 113 -4 49 163 -62 40 -42 148 -13 -37 9 124 17 9 22 36 -84 0 -52 65 -159
3414a59J01K8j1QJ85lj7j15J69m54J34J41Pl1L8M2j85L5J05l7J10J0K7j35%J2
3440Ep3J33q1O2J8j16J02K3k11L7J41J11p4o6R0k27J02noO0m5p2Q8q4M3L4J38
3467A27j91Q2j10J92r0m2k7J82q5J21r8J00k31P0OJ0r9N0K8J1K74l05m4N6M2O1
3493I0j92J09j8k1K8o0J12n2J0N8j24K5J84j54Kj76K56P8k24R7j3M5j17K34j28
3518D9k00j26L38k77L29r5j89K37n8P7k02K00k4m4k7O8r1k6J50p1k8N5k12M4J92
3543F9o2M2J3J10k97J62r4J45l34M59j06r8J10j38M0l9m9K72k15k4J50n3J9o4
3567A8o5Q1j27K8L7l1Q5K0M6l1j3N8q6Rj23J20mj25J20qj09J67j43Nj8l1j7J09
3595b8O9J4J03j64K5r2L1j2J17N1k08N0j24J70p3k4J00j19J77j6k97J33J82m3
$$ plain form
3414 -159 -58 -30 -41 -33 152 149 132 17 186 -268 -134 7 14 -17 21 63 -122 -87 18 -19 91 101 128 -7 -7 5
3440 5 -68 65 -16 46 64 -52 50 73 -138 -101 40 151 77 11 101 -126 -24 -29 -35 25 -20 -92 -4 -88 -45 -11 127
3467 127 -64 18 -92 100 10 -32 -59 123 38 159 61 161 -70 0 6 16 -83 -33 -5 6 280 -25 -69 -13 29 90
3493 90 -102 7 -11 -32 -4 -64 48 -4 6 64 -60 -35 149 -5 -3 -179 77 155 -69 28 15 60 -57 177 49
3518 49 -151 -277 61 -216 113 18 -171 66 8 85 -117 83 59 15 -12 56 -35 -61 89 18 -10 45 -167 -123 69
3543 69 7 49 62 172 -125 37 -57 88 -246 213 107 9 119 -19 21 -18 -67 205 -10 -34 116 63 82 18
3567 18 -47 34 -93 -65 -28 -59 26 46 92 61 48 106 20 29 -94 26 22 -103 17 9 -100 67 -76 -71 -89 -120 -137 -28
3595 -28 41 55 158 -6 19 -73 -42 -54 63 114 -94 -44 -168 2 -71 -95 5 -114 63 47 -250 -117 65 22
3619B2J7l7oJ1n5j24R1J1Q6N7q1Q8n7N5j18J03p8R6o7q9O9j50J96J40j4k65J93
3646I4o6P5n8J33m8j0r0K1l5j0p5J10%Lol0k8N9n6n2j11J38J55j99N5p9J81O0
3674A31k03l4P7M1n3O1m0kN2n2O6N3j53J25qj93R4J09j55O0N9l6L5k03J99P4j15
3701a1m8j5K23k31K23m0j06k8k5j3j8K32j06q3OJ08PO3j88K5O4n7o9Rk6J7M3R
3729c5O1p1J44p2r2R5j15J71j30J97Jk51K97k84K28j39k42K66p5j10J43j22J64
3752B9m0J49k35m2J76ol2J5K6P4j39N4o8K03p7k11O2R9J3k7nm9o2Q0L1j26q7K44
3780D9m3n0J03l9l5J61j48K1Kj96K10j51m8J89o8J24j54m8J11M2r6j36J14J28
3804D2n6j02J08m9k5J5K19p5j26l7k8J66n3J14l3j37L9L0O6o7KO4Kj4k17Q4J18
$$ plain form
3619 22 39 2 -4 7 -48 -172 -81 -70 16 73 -8 80 23 78 -40 63 -15 81 14 -75 -6 -156 40 180 166 -99 94
3646 94 28 103 45 178 130 120 30 51 16 6 -69 41 41 44 38 8 -20 39 -17 -69 -180 -42 113 -86 -31 -110 71 131
3674 131 -72 -106 -29 12 -41 20 -20 -22 30 -22 44 97 -56 69 61 -132 -38 71 -84 -24 35 -1 34 -169 30 104 -11
3701 -11 -59 -74 149 -82 141 101 -5 -33 -58 -71 -89 143 37 -46 -40 68 75 138 -50 -25 39 -18 -87 -78 -104 -87 -44 -35
3729 -35 26 -45 99 27 -65 30 -85 86 -44 153 154 -97 200 -84 144 5 -237 29 -46 -156 -13 -135 29
3752 29 -11 138 -97 -139 37 31 -1 14 40 114 -25 29 -39 164 87 -124 -62 37 50 23 18 -31 -93 -13 18 -108 -195 49
3780 49 6 -44 59 20 -15 146 -2 19 21 -175 35 -116 -164 25 -43 81 -73 -121 -10 32 -64 -200 -86 42
3804 42 -14 -116 -8 -57 -82 -67 152 77 -49 -86 -114 52 -1 113 80 -57 -18 12 78 11 13 77 79 65 -152 -68 50
3831E0PP0o7M0j99K45j76J28j79Q1j09Q0mJ60l6j61K66l46J13L2lo0J19k57J56
3856e0l8J26n9N9j2K7r5J28j17R8k0p7q6J59k9p9R0n9Q2l2L2qp5M6M0L3q9R9n6
3885C8N7j37N7j05K33n0k29jM7J42k34K54p6Q2j70J68j6j5k7j28J33J44k33Q4
3909A8J18r2K09l05J19j2J83j68%q9n3J42j67P2J15j81M2j9J26j44P8K1O3l2j39
3934i5J70j24r5K54l8j53K40j91j9Q1K08l11R7M1j30K43p3j30p8n3J14k5K7P1
3958C1q7J2Q1j4o0M9r9L5r8K66o6Q2j28q8L7O2J72j70J2N5K4j81j04J83M6pm2
3985CrK8r3Q8O2j3j9q9R7p5R9j65k6J04J4j51J29p1K33j70r9K02J2m9n2K7N1m6
4013B2j48J35j46K40j18j06N9N7m0JN1p1k6O6j38K5K36n7J9k49N8J37k1L6n8J28
$$ plain form
3831 50 57 127 60 100 -99 146 -30 98 -81 0 -109 -29 -33 127 91 -70 196 -150 -37 -5 -8 -68 51 -206 -50
3856 -50 -88 38 -21 38 26 53 -42 86 -31 67 47 -30 -116 43 14 -65 25 -34 48 16 48 40 -35 11 51 84 -5 94 38
3885 38 95 -42 15 -90 143 93 -136 -137 -90 52 -182 72 -4 78 -92 76 60 45 18 -110 23 167 -66 18
3909 18 136 44 253 -52 67 55 238 70 70 -19 -72 70 -97 -25 90 -91 -49 -68 58 -86 -8 13 76 44 -95
3934 -95 75 -49 -144 110 72 -81 159 -32 -51 30 238 -73 24 65 -65 178 105 -25 -103 -156 -42 -67 -40 31
3958 31 -56 -44 37 23 -37 12 -87 -52 -150 116 50 132 4 -84 -47 15 187 17 29 84 108 -73 -177 6 52 45 3
3985 3 -6 22 -71 17 79 66 47 -42 55 -20 79 -86 -112 -8 6 -145 -16 -87 146 -24 -123 79 91 42 -10 17 68 22
4013 22 -126 9 -137 103 -15 -121 -62 -5 -45 -44 7 -64 -90 -24 -162 -137 99 42 61 -188 -130 7 -14 22 -36 92
4039I2l4P0l68R4K29r2JO2j42J13n7n5P5R1j28J89j04P9j27K6K3P6p4j08J27L
4065F1m7l3kJ2pM0Mq3O9p7L3O6j11J40j21o2J38n4O4N4k14J1J96p6k1P9j39J65
4093H5j10r3R7J13k6k40J09P7%J88l25J2K07q2p9q5J91J20r2k29O0J97j61N0M5
4118B9k53K85j43O4j85J71j49J58L4j06n8K13l6q1L6R2j72L1J47j19NJ65k45J51
4142C4n5K10j97J67j37%j86L8J42R8j53L0L3j54K11j58KK3R4j50J51J1o3m2J69
4167A18l8JO9j62J3J63j21P3n9n2J10r6J04j67J90j51j02O5OPo9J82j60Q7K7n7
4193a9k4n6k7J62J12n0j87J04m8j8l6L5J3j06L28k68m9K58j18N1O6q8j12J04j21
4218i4J04N3o2Q7j16P7MM1o0P9j29j6J26p1pM9m6q6J05p7k7K34k50J63O9k63l6
$$ plain form
4039 92 58 128 -240 -146 83 -9 -8 54 -88 25 -32 -87 -12 79 -49 140 36 115 -12 14 37 113 39 -69 58 61
4065 61 14 -19 -21 -9 -16 24 28 -55 14 -63 -30 36 -75 65 -56 -118 20 -34 30 84 -130 -119 77 1 -20 59 -80 85
4093 85 -25 -118 -21 92 66 -174 -65 12 12 200 -125 -113 94 12 -67 -152 39 159 67 -162 -102 95 -66 -16 29
4118 29 -224 61 -82 -18 -203 -32 -181 -23 11 -95 -153 60 24 -57 -21 71 -101 -70 77 -42 -37 128 -117 34
4142 34 -21 189 -8 159 22 22 -164 -126 16 114 -39 -9 24 -130 81 -77 -75 -52 42 -108 43 54 -9 -51 118
4167 118 80 81 150 -12 1 164 43 116 57 5 115 19 123 -44 146 -5 -107 -42 -36 -29 -98 84 -76 11 38 -19
4193 -19 -43 -99 -126 36 148 98 -89 15 -33 -51 -87 -52 -39 -145 183 -85 -134 124 6 57 123 35 -77 27 -94
4218 -94 10 63 1 88 -28 49 53 94 34 113 -16 -32 94 23 16 65 19 -67 38 -39 -66 168 -82 81 150 -113 -149
4245a49K8J13m0pJ36m0j67J77j12N2M3k2k4L8q7J70jj42n3J77r9q7Q1l6P4J31
4271A54k40K07k45J06k8n4J09L4k01M0J68j51J31j67N4K01j53J71q8J20j49p5
4293e6j1R1r8J01K5RK4p8j67J88L3j10rJ51j34lJ47P4k32R0r7m1J04k19K50m0
4319hO8j92K02O3p4J33j80R9q0k16R7M1l4K1P1q6Q2j48K22p7j26L93m35J96q1
4344d9j15J54m0J4J83l40K14O5k20J69PL0q4n0K52l95L24q2j64K46j05p6J25p9
4368a6MO5r6K83k90LN6j23l5K38o9k3j06R5m6P6J20j54J43Pp6r3M2m3j03J19q0
4395a02P0J40l0J6q4l6K3M1P4j27M3J4j16J38M3o0P5j56j35Q7J50JP5k29J77j18
4421b6j58O2K2J07Pj60K22%K2o6Q7j47p0J54L5j4k11J74J7pj01J27m9j38l5K07
$$ plain form
4245 -149 -121 -8 -48 -55 81 41 -126 51 -61 -9 34 12 -12 26 -61 109 108 -34 -87 90 -9 -96 -15 -51 23 154
4271 154 -86 121 -124 -18 -46 -100 9 43 -158 -118 50 -101 30 -137 -83 118 -35 136 48 168 19 -56
4293 -56 -67 24 -74 27 52 61 85 7 -160 28 61 -49 -58 93 -41 -44 103 177 -55 35 -62 -103 1 -218 32 -8
4319 -8 60 -132 70 133 59 192 12 111 31 -185 -88 -47 -81 -60 11 -75 7 -141 81 4 -122 271 -164 32 -49
4344 -49 -164 -10 -50 -36 147 -193 21 86 -134 35 42 72 -12 -62 190 -205 119 37 -127 119 14 -62 63 -16
4368 -16 -12 53 -43 240 -50 -47 9 -114 -149 89 20 -3 -109 -14 -60 16 136 -18 125 132 56 -37 5 -38 -141 -22 -102
4395 -102 -32 108 78 94 10 -26 -3 38 112 -15 28 42 -74 64 107 47 122 -34 -169 -82 68 69 144 -85 92 -26
4421 -26 -184 -122 -100 7 14 -146 76 76 98 32 119 -28 -98 56 91 77 -134 40 57 50 -51 76 27 -111 -146 61
4447F1j65J81j79Q1Q8Q4j59L34k23kpk19J79r2J65j77m0M4J30q9J47P2l9l04J25
4472dJ51r3n0Q8k95K93m5q7K03j23J9Q5k09N4K03k12J28J0j47J8J01K4L5q4R3
4497A56q1l5J5k33K45J3j40L4j7Ql0O7j4j97L60j64j5P0j09J38J1o6m9j26P8Q0
4523aRj06R0P1M1j18K88k90M9J04j84Q8N4r7J4L8m3o2j14J63k13J18K22j21j59
4548a59J42j39J75N6k09J97o6p7J44r1LM0p9n3J74N7k7k26K23Jn2N9K4m9j47J26
4574D7p2K8qr0R3q5nO0Oj36K17J6k17K99j21ln6j2j9qK37k77K2m9R3J01Rj7r7
4603d4J22ln9m4J65j73Q8R5k85L35j00l7l7m2j43J85N5j34J03lj90J3J74J18j28
4628C1k9k9p9J88k2k32J85o6Q4O7j40R5j50k07M39p9p7j61K54q4K02k42J12j13
$$ plain form
4447 61 -104 77 -102 -21 67 151 -8 326 103 101 94 -125 54 -38 127 -50 -90 -46 84 -5 142 214 175 -129 -4
4472 -4 147 54 4 92 -203 90 45 -42 161 38 57 142 -67 -13 190 -22 106 116 -31 -13 88 112 147 63 156
4497 156 75 40 55 -178 67 80 -60 -26 -43 -35 -65 2 -12 -209 151 -13 -28 42 -67 71 82 16 -33 -159 -81 -1
4523 -1 8 -98 -8 63 104 -14 274 -16 33 137 -47 41 95 -2 12 50 7 -55 -169 -6 -219 -101 121 0 -159
4548 -159 -17 -156 19 75 -134 63 -3 -80 64 -27 -24 16 -63 -116 58 115 88 -138 85 86 34 93 117 68 -79 47
4574 47 -25 3 -5 -95 -2 -87 -92 -32 -26 -162 55 71 -146 153 32 29 -27 -39 -58 -66 171 -106 -84 -133 -40 61 70 53 -44
4603 -44 78 75 16 -28 137 -36 52 147 -138 197 97 60 23 -19 -162 23 78 -56 47 44 -146 -133 41 159 31
4628 31 2 -27 -106 82 60 -172 13 -53 31 98 -42 53 -97 -304 135 56 -21 -182 72 -12 190 -52 60 -53
4652e3J1J6p3J11Qj15J7j5J27m1j7l2N1M2o9k0K22l1j63J37k15J55N0j90p4K90
4678A29j35j74Q7K36j36J17M9j73j8o5K5Q7p5J28j63m1J16K02r7q7J85k29J38
4701A06j37N2Oj37N2R6l8p2n2K1L1L4K24j76N0Mm2k1j4k0j19K04m2j09O4l2j8
4728h5nJ16J6j43J06j23J37J1J96l34P8j48J09J06k40J05P2K48k16J01j03K9O5
4751I8j1j16N5O3P5j26j33J61N9j22j81J17N8J63j29j24J02m2nJ31n6N2j51O1
4775aP7l4r8P7k8l3P9o3j8M3j41R6J46L9j34k4N1qm7K23k61N1o5J51k7q1J39j65
4803e6Q8J2l7n3J64r4m5j1O6j2j25R2K23j03j1j07Q3k00K16o5P4p8N8j2j23M3
4829a3l5K2J64j62n2K4J21j05pK51k63P0k43K03N5Lj35N6K2K4Q2j51M5L2M3Q7
$$ plain form
4652 -53 -42 -26 -99 12 20 -95 -78 -93 34 -7 -24 -56 -5 37 -32 -52 170 139 -24 113 -102 53 103 -87 -161 129
4678 129 -6 -180 -93 143 7 124 173 0 -18 -83 -58 29 -46 82 -81 -122 -6 196 99 12 197 -32 106
4701 106 -31 21 27 -110 -58 38 0 -72 -124 -103 -72 -38 186 10 60 64 22 1 -13 -33 -152 52 10 -99 -35 -67 -85
4728 -85 -90 26 42 -101 5 -118 19 30 226 -108 -30 -178 -69 37 -203 -98 -26 222 6 107 4 33 98
4751 98 87 -29 26 89 164 38 -95 66 125 3 -178 -61 -3 160 31 -93 9 -33 -38 93 37 89 -62 -1
4775 -1 76 42 -56 21 -7 -40 39 -24 -42 1 -140 -44 102 141 7 -17 34 26 -21 202 -59 -8 -73 78 51 -30 109 -56
4803 -56 32 44 7 -46 118 24 -21 -32 34 22 -103 -11 212 109 98 -9 74 -126 90 25 99 21 79 67 -56 -13
4829 -13 -48 -26 138 -24 -76 -52 69 -36 -43 208 -55 15 -228 -25 30 33 -102 -46 -24 0 82 -69 -24 8 51 138
4855A38j21N5j98lO7M1K27k65O5j03K17k12j1K19n0m5M7%q6P1o2N0j35J58j66
4880a02K9m3J4M0P5Oj52Q7R2j10N8p6J5R7J02j49r2N8K14j42L9m5j69L14j5l5
4906A10n9l5O4j69P4j76K08j04J01o7J67l5Lk44J82K3J19j6j37M3q1J7P2m7o9
4931e6j68J76Q6m7K5R7k04Q3j6o3J52j13J10o8J1m7K71k04o1K1R7M6J3k22N8j07
4957a30J6p1J70m4N4J33n8r3p9R0R9n3k5O1o1L2O0k94K57k1N2R6n4o3j39n7J75
4984E3P6j32m9Q0j44L7L08k48p2r6J84nK6O2n2K3k41J72O8J9l7n1J63j96P9j04
5010g7K13l77L87k34M5n9J24J02j73m9J34l2j06R0J85j97O4K4j23J19m0lj5j3
5034a1p3L3K19k43J2J46l6J26k42qP8J08k92K19o1M1l0p3J88p5l7R3Lk29L0O5
$$ plain form
4855 138 17 72 -126 -129 -62 -21 206 -59 6 -97 120 -92 -103 116 66 21 68 68 -18 53 -9 41 -94 64 -102
4880 -102 -73 -116 -102 -62 13 19 -133 -46 46 -64 -6 -82 -67 30 132 -17 -109 -51 163 21 60 15 -154 160 145 110
4906 110 51 16 80 -89 -15 -191 17 -87 14 -53 114 79 82 -162 20 43 162 146 9 52 -29 -12 60 13 -56
4931 -56 -224 -48 38 -9 16 113 -91 -8 -24 -87 65 -48 62 -6 5 -42 229 25 -36 -15 82 128 141 -81 -23 -130
4957 -130 -114 -185 -15 -59 -5 128 70 -23 -102 -12 87 34 9 70 9 41 101 -193 64 43 95 191 137 74 -65 -122 53
4984 53 129 -3 -52 28 -116 -79 229 -19 -91 -187 -3 -8 18 80 28 51 -190 -18 50 69 32 -19 144 -52 27 -77
5010 -77 136 -241 146 -88 -43 -102 22 124 -49 -98 36 4 -102 -12 173 -24 40 64 -59 60 20 17 2 -11
5034 -11 -84 -51 168 -75 -63 83 47 173 -69 -77 1 109 -183 36 -25 16 -14 -87 101 26 -11 82 85 -144 -114 -49
5060d9L7J4j00J04k9M5j43M8j04K37q4P9K5J43k87J7P7O0K7j06Q3j47K35j16p8
5085a2O9N6l9o9j07Q0P8M7J60l18P8n6N9r5J18j64O6J1J57k21Q8J4j22J41O4r1
5111hk1j34P9J09o8J17J7j04j43J08o3K18n9j44R5J26ok37O3p0K48q3k48K43K5
5136F0j05M3p2Q8J3q3J04k00J40P5k09J32j7l7j3J22oJ0j13J46r9p8K94k15j4
5161c4J74m2k34O7k5K29m0m1j27R1j47rK02j24o7J00k8K04j05j9o0M6P9k41J66
5186A5J07j43J99q1j64n5J20R3j80J29j14P3J41K2j89O3o5P7J60j36o3P3r9K23
5210B06Kk04j18R1J30j22L6j8oM9O4j88l4K51k2j17n3L2m4p4J25R1L0j35J1J76
5236A59j80n2R7r6M6n4R8j56Q7O5J5M6j37Q3O0k19J8J15j49N4J11J5j5J13q9o
$$ plain form
5060 -49 -12 2 -98 6 -23 22 -121 -73 -177 60 -24 55 80 223 -64 -47 30 90 117 11 94 -53 182 66 -12
5085 -12 57 113 74 5 -102 -22 56 103 263 -55 23 -33 26 -69 49 -115 -49 -38 119 -102 -14 0 -122 19 83 -8
5111 -8 -29 -163 -84 25 -43 74 91 -13 -156 -48 -111 107 48 -96 -1 125 119 -118 -55 -125 123 40 -208 35 60
5136 60 -45 -2 -74 14 27 -56 48 -152 -12 63 -146 -14 -31 -68 -81 41 35 45 -68 78 -21 -99 195 -20 -34
5161 -34 140 98 -136 -69 -94 135 95 54 -73 18 -129 -138 64 -60 -127 -27 -55 149 44 25 -35 11 90 -151 15
5186 15 122 -21 178 97 -67 -122 -2 91 -89 40 -74 -1 140 162 -27 36 -29 48 208 72 9 82 -17 206
5210 206 208 4 -114 -23 107 -15 21 3 -3 46 110 -78 -112 139 117 0 -53 -21 -65 -139 -14 77 107 -28 -17 159
5236 159 -21 -73 24 -72 -26 -80 18 -138 -51 14 29 75 -62 21 81 -138 -120 -5 -154 -100 11 26 11 124 35 29
5262B9j92J79K2j45K6P3J09j54K1J74jp3P4j53K52j53j47L6k4O0j3R1l5j61J7
5287h8J6J03j99K86j70P0j32M8J48j95J27nK7O9j76P6j33k4K17J00k02N3k6J5
5311Ek2J01j52Q3J57j89J37J41k49O9q9n7m0Q1P4n8O7o1K33j35%j33J14j16O0
5336B1J06j74P6l3Q3j53R2q1L0K62l72Q1Q2m9J06j24O2j06O4K0J0J16j56n7J06
5361A2MK2L0j77J66p0r7L04k32J08k19K61jj23n9r6J77P7o7J73r6p4K4j57J75
5386F5q4M7kj4j05K06n9j61m7j74L17N4p8J1l0n7J26n3rJl0K21k81J84M3M8j35
5413DR0k53J45J38p1K7j69N5n9K11j32q9K02j89J0J76J7j41K6n4K3J33j96J46
5437E0j16J43m9j50R0J09k06M5j0J90j84O8Q9K5j10K4J32j54r2J29Oj33R3m6J05
$$ plain form
5262 29 -163 16 38 -107 -81 -8 101 -53 -32 142 141 68 142 -11 241 88 -59 -23 -47 13 0 91 56 -105 -88
5287 -88 -72 31 -168 118 -52 18 -114 -66 82 -113 14 9 36 105 -71 5 -128 -152 65 165 -37 16 -10 5
5311 5 -17 84 -68 15 172 -17 120 261 12 81 -8 -65 -105 -24 50 -8 59 -2 231 96 96 -37 77 -39 21
5336 21 127 -47 29 -4 79 -74 18 -63 -33 229 -143 -62 20 -29 77 -47 15 -91 -27 -7 3 119 -37 -94 12
5361 12 16 38 68 -109 57 -13 -110 194 -38 70 -149 112 111 -12 -71 -167 10 87 20 193 97 23 47 -110 65
5386 65 -19 28 26 12 -93 113 54 -107 -154 -328 -11 43 -35 -24 -54 -111 15 -38 -47 -46 -76 145 -136 48 91 139 4
5413 4 94 -159 -14 124 53 80 -89 -34 -93 118 -14 -103 99 -90 -80 96 113 -28 -2 -56 -33 100 -96 50
5437 50 -66 77 28 -122 -32 77 -129 -84 -94 96 -88 -20 69 94 -16 8 140 -14 -106 23 29 -104 -11 -57 48
5462D8q6r5N5J92k50R4J49l8j51K6j05O8J37j58K32j54J06r3K9k8k9J90P0k48
5486c9q9J08J2l6J03K5j53J83j13j17J49j21O0J03J2o2J7j99K36j70J43l6j0K9
5510C5j32lJ48J52j04j57j4N8j3R4l0k6n2J89k3M7j62P6l1J23j57J1j32j8R5m9
5536g5K85l17p2K42j64J16k43J28J54j81k1J98M9M4o0l6j5L2n4r6J46j01O2j1
5560A0m1k3K01j10j69J56j03J84J1r0Nj63J77N8j33J13m3p9J03jm7n5n3J2K21
5585A41j18M5J14l85K32q7O7p4J50j08j14J49k98M88j55k21K44j86P2K18j62L2
5607D4j92Q8P6pN7Jm6l5j35j4K08j30J38j22J89k14J26j64J87j90O8KM4j1r4J97
5633G1J18j52n7lJ52j66L7Jk8J24l37L47j7l8m9j0K3j8J7j68K58k73J32j16L4
$$ plain form
5462 48 -38 -133 -78 114 -136 -42 107 69 -82 -56 -161 -93 44 -114 118 -36 70 -23 6 -22 -51 139 209 -39
5486 -39 -128 -20 -8 -44 59 84 -69 114 1 -116 33 -88 -28 75 87 25 42 -157 79 -91 52 16 6 35
5510 35 -97 -100 48 200 96 -61 -75 -17 -30 64 34 8 -44 145 122 169 7 83 52 175 18 29 -103 -121 -26 -75
5536 -75 210 -107 -179 63 -101 15 -228 -100 54 -127 -148 50 99 143 83 47 32 64 10 -86 60 -41 21 10
5560 10 -31 -54 147 37 -132 24 -79 105 116 26 31 -132 45 103 -30 83 40 -39 64 63 16 -39 -92 -80 141
5585 141 23 68 182 -203 29 -58 9 -65 85 -23 -137 12 -286 202 47 -174 70 -116 -44 174 12 44
5607 44 -148 -60 16 9 66 67 21 -14 -149 -163 45 -85 53 -69 120 -94 32 -132 55 -135 -67 -65 -21 -32 -126 71
5633 71 189 37 -20 -23 129 -37 0 1 -27 97 -240 107 90 52 3 -7 16 -2 15 -153 105 -168 -36 -152 -118
5658a18K86q3q3J14k1q2M7m7p5P3n1N9j34K26K3j16k4j20K33J1k33K33m2j92L8
5683g8k2mJ11o3L4j39K42j26j05Q7M3k0Q2p9N1j28M8J44r6j77K05r3mR8Rq7P8
5710A1J14o4j55J70p3J39q4q2QM1J23j38Ooo6L0j20J77k13J49J81k30j11K56j00
5735c7p5j89K21N5l4J56j78J10q7J22PJ2j30J49K6k7J34l31j62K10R1lpL6r4J1
5761a4J42j38p8R3JJ18m9j93K08k25J83j20J55K5o4k2k6j4J70j1n5o8nm0J31r5
5787Ij37J08j17R9J8j58J02J97j98K31p5Q5j60j5l2J07n2q4J12J7k05P8Q3j05
5811i2L1q6K11j28l2R9nl9J42j83J58Qj25J20j88J27Q9j94K1N0J7P7Ol3n8K30
5837B23m24L35k00O9M4l2J87j80j8n5L9J9j56M4J03r1J12j65J76j40J44k17K26
$$ plain form
5658 -118 168 85 2 116 95 13 60 13 -62 11 -40 19 -115 111 134 18 -6 -126 107 118 -115 118 76 -116 -78
5683 -78 -100 -104 7 -56 -22 -161 81 -45 -150 -63 -20 -40 42 -37 14 -114 -66 78 -18 -195 10 -83 -87 11 20 -67 11
5710 11 125 61 -94 76 3 142 58 -24 -16 25 148 10 16 10 -56 -26 -146 31 -182 -33 148 -82 -193 63 -37
5735 -37 -112 -301 -80 -25 -59 97 -81 29 -58 64 71 83 -47 102 128 101 235 -96 -258 -48 43 40 33 69 -25 -14
5761 -14 128 -10 -88 5 6 124 75 -118 90 -135 48 -72 83 108 44 22 -4 -18 152 141 86 18 13 -27 104 9
5787 9 -128 -20 -137 -38 -20 -178 -76 121 -77 154 79 164 4 -11 -43 64 12 -72 40 57 -148 -70 13 -92
5811 -92 -61 -147 64 -64 -96 3 -2 -41 101 -82 76 84 -41 79 -109 18 107 -87 -66 -16 1 78 84 51 -7 223
5837 223 -201 134 -66 3 47 15 202 22 4 -51 -12 7 -149 -105 -2 -93 19 -146 30 -110 34 -183 43
5860D3k6J3J60l46K51k2M7K4j7k17K31j37J72l40P5K53j12j10J58j12n4O5r7J85
5884H7k04L6J67k2J3r3rJ12j40J09Nj23M3M4n1j03J12K1j9q3j4K16k43K47j88
5909h0K04j09l8J00O2j22M3l7r9n3J28L1K0j8j1N5Q6p6k00K27j57q6J51p8l9K13
5935A17j6p0m6J30j47m5J20p6P3j18J26n3oj09K15j65J86m2l6O9j51N6O0p8j64
5960a70K15j22K7q7K34j65l5p3Q5k6K73k8rm9o2q5O9rj01K38q0qr2J26RJ08l9
5987A44j71j4J3J16r8q1N5j41J29K00j75jNR9j73k0Q8j39L8J62o1K3K3P2j4L0
6013A09l0M0k00j44J01R0O2J27l60K50J01j78j53J52N4j11K00j44K14k39L5r5
6035a19K30k21K79j32M1j06J3l4j6J66l4j06l9P1N3JK8q2K7O5N6j31K2pj41K14
$$ plain form
5860 43 17 30 190 -156 95 73 120 144 127 -90 141 4 176 -164 -89 164 52 -58 100 -12 -66 -1 -98 87
5884 87 -117 -81 86 64 77 -16 -25 87 -53 56 61 -62 -19 25 -26 -129 -17 4 -15 -98 -112 104 -139 108 -80
5909 -80 124 15 -23 77 139 17 60 23 -76 -129 -1 30 50 32 21 76 162 86 -114 113 -44 -130 21 -57 -96 117
5935 117 101 31 -15 115 -32 -77 43 -33 40 -78 48 -5 -11 -120 95 -70 116 74 38 107 -44 12 72 -6 -170
5960 -170 45 -77 -50 -137 97 -68 -103 -176 -91 -117 156 128 119 70 8 -77 -8 -17 -118 120 40 32 -60 66 75 183 144
5987 144 -27 -41 -28 88 -10 -91 -36 -177 -48 152 -23 -24 -19 80 -93 -113 -25 -164 -126 36 -25 -2 21 93 79 109
6013 109 79 119 -81 -225 -124 -34 28 155 -205 45 146 -32 -185 -33 21 -90 110 -34 180 -59 -24 -119
6035 -119 111 -110 169 37 78 -28 -15 -49 -65 101 67 -39 -78 -7 46 47 75 -7 20 85 141 10 32 25 -116 98
6061I8k18J35J7J30j63k02J38K18l35J84J19rj36J3L5j18R5j1n4k1K30j59j1J96
6085A71k54J97P5k23Jo1O5J01p6k1J43j35R2l9k6P6p7oj1JqO2j1O7q9kR4n0j01
6114d5N5p5mJ37j8j57K19r2K4m1k19K44j62N6O1k1J94r9N6m8l6j04P7o5j26J20
6140f9J19K8J1j3j51%J7J0j51J45Nk6L0q3J63P9j33K8P6j83J64j03K14j9k00n7
6166i9J73j64J65q0m7R1j39J74r1J59j70o9J85j73J29j65K56j38j68K58k7P5j96
6189f1R9p4J02k04K00r9l9M4J07l6j9pL7K8p4Q1q4r0L4pJ05j03N2j4J3p7J56j46
6217g6J32r8Q6J08j29j2r5J64j35J10j01J25p3o4j5J73N1k15l1Q2l1J88q3m8J0
6242B3J30l2j75N4P4q6P2j67K89oj14j09M1J4j06J60p3N4j17J45lj14J12j44O4
$$ plain form
6061 98 -120 15 32 162 -1 -203 -65 153 -182 2 121 112 -24 -11 24 -94 1 -10 -64 -85 145 -14 -25 171
6085 171 -83 114 189 -34 -33 -94 -29 72 -4 -25 118 -17 75 36 10 86 9 3 -8 -7 -15 47 36 103 14 12 106 56 -45
6114 -45 10 -65 -69 68 50 -107 112 20 44 3 -216 28 -134 -78 -17 -38 156 57 113 65 29 -75 2 -63 -189 -69
6140 -69 50 78 89 76 -75 -75 -58 -48 -199 -54 -49 -75 -45 -128 35 114 -19 9 85 -98 66 -37 177 158 -42 -99
6166 -99 74 -90 75 -5 -52 39 -100 74 -17 142 -28 -97 88 -85 44 -121 135 -3 -171 87 60 135 -61
6189 -61 38 -36 66 -138 62 -37 -76 -32 75 39 20 13 50 78 4 85 1 -89 -55 -62 43 -60 -8 -22 -9 -86 70 -76
6217 -76 56 -42 44 152 23 11 -84 80 -55 55 -46 79 6 -58 -73 100 151 -64 -95 -13 -44 144 61 13 23
6242 23 153 121 -54 0 74 -12 60 -107 182 176 62 -47 -6 8 -98 62 -11 43 -74 71 68 -46 66 -78 -14
6267a4L9lm6l2K1L4k04K05j24N8M4R5j02K7j54K35P7k66R7l2J8K02l21L10k32
6292f8J78j31J3l5J28k8j58J14oQ9j35n5P9M0l9K1Oj70J66j1Q6R6l00J29n5M0
6318fn1K5L7k23K16j49j0k6J13J4k4J77J6r2K4J09j07p2m9j3P4RJ03j57p5m7J92
6345HJ36q1j82R9J59r4p1Oj4N0J00j68J17j32J99k23K48k43k04L33M3R8k53K65
6369A96j23J14k03J02j74Q1J66l01J68Q2n1k09M0J36k3P6r8p2K0l6J05K2J2k07
6393a77K13k7l4J73k32J4J17j22R0j12K18j59J08j9j65L01k66M5j5j3o7K44j99
6416h4N4N2J4R8k00j02JK56k60k2K97r5j60L04k26n1K34j71J19J15j81J22j58
6439d4Q9J17k08J02j34K2L2qN7p6J73l6j75qM3K1j8M7o8j7K39j70J51r7m3k1J57
$$ plain form
6267 -14 25 22 -24 -56 -35 -1 -205 0 -124 -66 -22 73 -29 -2 -156 79 156 -110 -13 -45 -27 175 -146 164 -68
6292 -68 110 -21 -8 -43 85 57 -101 13 7 96 -39 -94 -15 25 -14 7 13 -157 9 -2 84 180 -120 9 -46 -6
6318 -6 -57 -32 5 -218 -2 -151 -161 -187 -74 -60 -84 93 109 17 41 150 43 -29 -78 -91 -17 -8 95 -62 -137 -184 8
6345 8 144 63 -119 -20 139 45 -26 -20 -34 16 116 -52 65 -67 132 -91 157 -86 -290 43 86 184 -69 196
6369 196 73 187 -16 86 -88 -7 159 -142 26 108 57 -152 -112 24 1 77 -21 -93 -73 -109 -4 18 30 -177
6393 -177 36 9 -25 148 -84 -70 47 -75 15 -97 121 -38 70 51 -114 187 -79 -34 -49 -62 -129 115 -84
6416 -84 -30 22 36 134 -66 -168 -167 89 -171 -193 104 9 -151 153 -73 -124 110 -61 58 173 -8 114 -44
6439 -44 45 162 -46 56 -78 -56 -24 -32 25 -51 122 86 -89 -97 -54 -33 -51 -4 -72 -89 150 -20 131 34 -9 -30 127
6466A27J6jjj89M1Kq8N9j4O7m2q8J51j27K13o7O3j98K4Q6m0j39K56j06L4j27J44
6493E6o4LR9j09O4J4p2n4K00j74R7j13n4K95k45R7O2j88P6o2K74k13J8mK5j70
6519a42J63L2J2j43j66K23P8q1o9p4J81O4j46K0J41j44j34L37k07J41j48P3k9
6542a8P1k6j11l2K26Nj48j38J87J14m1r1m1l2j8K85k65M5p6QK53j65j56J73j04
6567i5J74k1J27k37qK19j67R9qq9KJ9j66K63l9n8k17J05J96j46N5J21j09j38R0
6592b8N0j15J32r1P7M0j70j0K08N0j75N0l46K91j3k1P6m2k1p5J70k8n6Q7r9n3
6618a12q6J65J50k37K1J21J8Q7n3j2R7k11P5O5l27J36k9J27L9J33k62P2q7J85
6642G5Q1j55J00r7n2n0Q2J3Qm6J74k38K45o6L3j13J96o3j98K7k9K1J33mJj44q0
$$ plain form
6466 127 143 142 141 -48 -7 -5 -93 -34 -48 19 -23 -111 40 -87 126 59 122 -76 -52 34 -6 -145 111 5 39 -88 56
6493 56 -8 -5 94 -15 49 63 -9 -63 137 -37 60 -53 -107 188 -57 40 102 -86 -10 -72 202 -11 7 3 28 -142
6519 -142 21 53 65 -78 -244 -21 57 -24 -93 -167 14 78 -68 -48 93 -51 -185 152 -55 86 -62 11 -18
6542 -18 53 27 -84 -116 110 115 -33 -171 16 130 89 -2 -43 -75 -93 192 -73 -28 -104 -96 157 -8 -164 9 -95
6567 -95 79 58 185 -52 -60 159 -8 91 83 -6 -4 15 -151 112 73 15 -202 -97 99 -47 8 129 20 -118 -28
6592 -28 22 -93 39 -52 25 65 -105 -115 93 143 -32 18 -328 -37 -50 -71 5 -37 -58 -133 37 9 -47 40 -59 -112
6618 -112 -198 -33 117 -120 -99 22 40 127 74 62 159 -52 23 88 -239 -103 -132 -5 34 167 -95 -23 -110 75
6642 75 156 1 101 4 -48 -98 -16 -3 5 -41 133 -105 140 74 107 -6 190 127 -71 -44 -73 -52 81 77 78 -66 -146
6669a46J76R2K1%k16J03N4j2O0o7p3K1O2k34J02K39j53Kj86K01o9J84j27r7J6
6694d7R0n8n0J37K1r2PJ9j68J92q5rJ06Q0p6j05l8O7K1N2L5j39J71j03O7K8k19
6721i6K47k24r3K58n7j5M1n7l6J84j02j62J43m3j02J41j04P9P9M7j26J79r7q1
6745CK9M0j73K05O2m4o8J65j59j65m4N5J1Q1kl7m8J34j67j10L54k01K8l5Q3j8
6771b1q6P9j67K70k02J70r7J0n9K39j49J28j17O9p2k14M6M0P7Q6l4M5P6j64J47
6796A00j16k2L7O4j60oM7p2J99n3r3J56j1k75J52J02p2N5j36J1J12j33p7J97J25
6821A31k36J69n7n1P1P4j09N2o6Q4J07j35J3Ro0K31k90Q9k9N3q6K9K03q2j15L8
6847C7K6j6pQ1j07K8j28P0J42l5M5k33q7J93M2J8k1k69P4J22rj88K50J07j00o7
$$ plain form
6669 -146 30 122 143 143 -73 30 84 72 132 65 -8 13 75 -159 -57 182 29 31 -155 46 -23 161 34 -63 -47
6694 -47 43 -15 -65 72 93 1 8 27 -141 51 -34 -43 63 143 67 -38 -76 -9 12 64 99 -40 131 28 95 123 -96
6721 -96 151 -73 -166 92 35 20 61 4 -32 152 50 -112 31 -12 -114 27 -77 2 81 128 2 181 84 3
6745 3 32 72 -101 104 166 122 54 219 60 -105 -149 -94 -83 -2 -4 -41 -89 45 -122 -232 122 -79 -51 -86 -3 -21
6771 -21 -107 -28 -195 75 -127 43 -54 -44 -103 136 -13 115 -2 67 -5 -219 -173 -133 -56 30 -4 41 117 -47 100
6796 100 -16 -38 -1 63 -97 -103 -56 -128 71 18 -75 81 70 -205 -53 49 -23 32 -104 -93 19 -114 -191 6 131
6821 131 -105 64 7 -44 27 101 -8 44 -22 62 169 34 47 56 -4 227 -63 26 -3 50 -36 -7 196 114 -1 37
6847 37 63 47 40 121 14 42 -86 -16 126 91 136 -97 -184 9 51 69 48 -221 -147 -25 -34 -222 28 135 35 -32
6873c2N0Nj28N8J15j24K50j40k7J1J11j18j43Q6K9N0qm3Q9J32j88J9jk8n5r4L
6900a21J45j75R9q0M9K04j0p6J04j76J64j30r6J98j03l9k1J93J7j92N6k2k0j4
6924d6K0R1j58J21Mq8L6q5K65j11k3L9j22M5Q8l6J06k13n0K64m8j97J04J26k40
6949a08K8J51N5j15j60J62l2j65K57j0l3oJ49m42L45j88K0RJ31K3j37J89l5j94
6973a06K85p3m1j77J38l06M19o3j00o3n1K16k25J41Q2N2o4Nk21J29J0J05k4j87
6997a19J53m0J57j40P3o7m7j21K4l2M3R7j5J53j45oP1N4o7N9j97O8K14k32L3K
7023b7n7J57j41L0k1j6K8n6J73o3l9M1n1l0J53k39J16j30P0M2R3J03j49J86k37
7048f4J26o5P7P7j34%j73N0K21Qq6nK0j03L6J44J0j64J19j32j7J72p1l3j14J18
$$ plain form
6873 -32 18 23 -105 -47 68 -56 194 54 27 38 149 31 -112 -26 3 53 45 2 91 223 35 54 53 25 -30 -124 -121
6900 -121 24 -151 -52 -132 -83 121 111 35 139 -37 127 -3 -99 99 -4 -43 -64 129 146 -46 10 -12 -32 -46
6924 -46 -26 65 -93 28 32 -56 -20 -105 160 49 26 65 -57 -12 76 40 146 -67 -117 147 99 -98 6 132 -108
6949 -108 -80 71 126 11 -149 13 -19 -184 73 63 30 24 173 -269 76 -112 -92 -83 48 71 -66 123 88 -106
6973 -106 179 106 65 -112 26 -280 139 76 -24 -87 -138 78 -147 -6 76 128 64 69 -152 -23 -13 92 68 -119
6997 -119 34 -6 151 11 84 17 -30 -151 -127 -159 -116 -19 -34 119 -26 -32 39 93 26 85 -112 -44 170 -62 -29 -27
7023 -27 -84 73 -68 -38 -59 -75 -47 -103 70 7 -32 9 -42 -72 81 -158 -42 -172 -102 -60 33 136 -13 173 -64
7048 -64 62 -3 74 151 17 17 -156 -106 115 123 37 32 52 -51 -15 129 139 -25 94 -38 -55 117 46 13 -101 17
7074A7j68J13Q2r5J6l1K5J32L7j01p1k7L4L2Q8j08r9J65j07J14j37P3J35n4k2
7099D3L0p2J0n0O9M6J67l37p7K68j38K12k63O9rnj77K38K6j37N2R5P6k22N2J47
7125A13j75K5j7O1o4J75j22k8L7J09n7j32OJ03P2j10n5J1m6j9J44o5k9J43j95
7150a15J26Q4k7J2p5J34j01m1l2Ol7J38L6p4m1n1J76l34J28o0J11R7mL0j18K02
7176A70k63J94q9J29r9j34R9O6j01O7k6p4J87r7j42k0K76o5J2Oj24j59K6J03p4
7201a32J73J7j31J28N3p0OL3j37l0R3J02j38jK62m48M03j46j0m4n0J91p5o1P6
7226F4J03j93O5O3j92j63p9L37N0j17J29P8k64K42k7K1j88J47n7rO1M8j45J94
7250A68k03L0j20K30j28j56J76k7j34J60k06K63j22O7r5R8J45j2Q6k49m8Q8J07
$$ plain form
7074 17 -151 -38 44 -51 -35 -66 -41 91 128 27 -44 -71 -37 -5 83 -25 -124 41 -66 48 -89 -16 119 65 43
7099 43 73 1 11 -39 30 76 243 -94 -171 97 -41 171 -92 -23 -32 -37 -214 24 50 -87 -35 60 136 -86 -34 113
7125 113 -62 -37 -54 7 -57 118 -4 -32 5 114 57 -75 -69 34 106 -4 -59 -48 -94 -113 31 -34 -63 80 -115
7150 -115 11 95 68 80 5 139 38 -3 -35 -29 -66 72 108 34 -7 -58 118 -216 -88 -148 -37 60 56 86 -32 170
7176 170 -93 101 12 141 42 -92 7 73 -28 39 13 -61 126 29 -113 -133 143 78 90 96 -28 -187 -161 -58 -132
7201 -132 41 58 -73 55 108 38 44 77 -60 -90 3 105 -33 -34 228 -220 183 37 27 -17 -67 124 49 -12 64
7226 64 167 -26 39 102 -90 -253 -332 5 55 -62 67 145 -119 123 96 117 -71 76 19 10 71 119 -26 168
7250 168 -35 -5 -125 105 -23 -179 -3 -30 -164 -4 -210 53 -69 -2 -97 1 146 134 220 -29 -77 11 118
7273A18J86k14l9j72J64j56R6n0Q3j24q7N15k75oj70J70j96M4O7m2J11o4J69J
7297A29j67K3P0o5K38k40o2L3lJ2Q4j24N5N4J21j69J7l9K17j47P1j13R2o6j5M5
7323E1k16K58r2q6RJ59n3j01p7J77R8j26J00k87R0K13j11l5J36o0j33m0K44N9
7347A77j25N9m0p1j2N2k7K6j10K6P0O2J7k61J15k6JO7K5J74l03L3K1NK37j13m3
7374C6j28mP8M4l7JK4P4m9R9j76J91j33j5n8o6K36o3Rj07Q3j33J24j45m3J66J57
7401A65q7j87oL4O4K1j13P4r5K90j67o9J57j9K6j25M7J31j48O7j42J11j29J04
7425Dlj79K25k19M35j97p7J43J3k46J9L3p6J78r5J67j39o8K61j19k62K12L3m0
7449Cr3R7M3m23K42M0O4J19r8r9J61K5J37j47k1q3j35J97k3r0M8K7O5o3n5K70
$$ plain form
7273 118 304 90 51 -121 43 -113 -17 -67 16 -108 -195 320 45 39 -131 39 -157 -113 -46 -88 23 -41 128 129
7297 129 -38 -15 55 -10 228 -12 -74 -41 -44 -32 52 -72 -17 37 158 -11 6 -33 184 37 108 -5 87 21 6 51
7323 51 -165 93 1 -85 -76 83 30 -71 -148 29 127 1 101 -186 -96 117 6 -29 107 47 -86 -126 118 177
7347 177 52 111 71 0 -12 40 13 39 -71 -45 25 87 104 -157 -42 -68 -67 0 25 199 -104 -71 -50 -45 192 79 36
7374 36 -92 -96 -18 26 -11 -10 14 88 39 138 -38 153 20 5 -53 -119 117 54 63 -44 39 -94 30 -115 -158 8 165
7401 165 78 -109 -115 -81 -17 4 -109 -35 -130 160 -7 -76 81 62 88 -37 10 141 -7 60 -82 29 -100 4
7425 4 1 -178 47 -172 263 66 -11 132 145 -101 -82 -49 -125 53 -42 125 -14 -82 179 60 -202 10 43 3
7449 3 -90 7 50 -373 -131 -91 -27 92 -6 -105 56 81 218 71 50 -33 -168 29 6 -84 -36 -9 56 -7 -62 208
7475B08j60k04K51p3nN3k7M2j61J80j10m7m2K9J22j15K60j45o1m4O7J13k04J31
7499E8m2j30K62k11J25K0k7j45J40N7m0N9j25J31j5r7m1m3l9J79j89J03l2J76
7523A34k66J28k0Lj15O9l9J3J52L7j5j34O1J0J7N0P6j29Jj24Q0J18j2q2J6Q2j29
7550a8Q4J5n4j38K38j74k17K24J00j66K94q8n8jn3r6J25J1j29J7J64J00k85J24
7574A9r2o6J95M8j33K8l5r9K22O6j37j3q4M9J63q5j39J09j08L8J25j19j1r1R9
7599e1j4k4J40K6k4mj28J14n5l6j62K61Q0k9j26J00M4j94K48j96kn4l9K01pr2
7625b3nJ3N8j04J11k7J39q6k0r2Rr8j4J09k9J10R6j00N9j07j56J24j06R3J38R
7651A01j65J49J41l91N0J56j73L5J34O3k86K49K8j33L6p5P3j80N2Q7OO8n5M3n4
$$ plain form
7475 208 48 -156 95 22 17 70 43 85 -76 104 -6 -53 -95 -66 56 -59 201 56 -5 -49 18 131 -73 58
7499 58 16 -114 148 -63 62 82 55 -90 50 107 67 126 1 132 117 20 -21 -64 -103 76 -113 -10 -42 134
7523 134 -132 -4 -24 -21 -136 -67 -106 -93 59 96 81 -53 8 18 35 85 161 32 33 -91 -11 107 95 13 29 111 -18
7550 -18 66 81 27 -111 127 -47 -264 -40 60 -106 188 100 42 41 -12 -108 17 28 -101 -84 80 180 -105 19
7574 19 -73 -139 56 104 -29 -1 -36 -135 87 153 16 3 -81 -32 131 46 -93 16 -92 -54 71 -48 -59 -150 -51
7599 -51 -65 -89 51 77 53 49 -79 35 -20 -56 -218 43 123 94 -32 68 112 -82 166 -30 -32 -86 -125 76 69 -23
7625 -23 -28 -15 43 -61 50 23 162 76 56 -36 -27 -125 -139 -30 -59 51 147 47 106 -1 -157 -33 -139 -46 92 101
7651 101 -64 85 226 -165 -115 41 -132 -97 37 100 -186 63 91 -42 -6 -81 -8 -188 -136 -49 -43 25 -30 13 -41
7676d1n2J69j26J29Q8j15j47k2m5J45pK5J4p5j6J28rk2M8M4j22j36J76k4N4p6
7702a5Q0j63J21J58j78k14J38P6q3J75kk26J59o3P0j04J21k8O4J7j33J98k29o0
7726a21J79l9p8J33N4j66K0J70j35p1RN5j13oK44j48R8J1j98J79j3j15K06j96
7750d1N2J09N6j00J34k05P6j7j12nR1Q2r2L1J22j57kO5j55K06k92K29l5o3O9j12
7776f6J01Lj9j90O2Q1j42K51l1J5j25J67k25J55P3j88mn7J06mJ23j76N1Q0O9L
7802A13p0j91J27m6kL7N0J21k11J03Q2k18r1K48Oj79P2O1M3j27j52L34j26r0K42
7827A36k34J26k7l0m2O2P9l1k1J07k24K44L2l13J63o2J23k9j23j1P7J31M9j86
7851dkj5J06r3O1n0j14o2L31k03Ln0K2O1l4K03k64J68l6m0J06j62O4O3j44L56
$$ plain form
7676 -41 -93 76 -50 79 167 52 -95 -117 -162 -17 -24 1 15 -60 -76 52 43 21 69 113 -9 -145 31 7 61 -15
7702 -15 65 -98 23 181 3 -211 -73 3 -80 95 93 -133 26 -37 33 -71 50 22 86 103 -30 168 -61 -121
7726 -121 58 19 -59 74 128 -38 -18 152 17 -54 -45 10 -103 -109 135 -13 85 96 -102 77 64 -51 155 -41
7750 -41 11 120 176 76 210 5 81 64 -48 -53 38 120 28 59 181 24 22 87 -68 138 -154 75 40 -23 46 -66
7776 -66 35 38 19 -171 -109 -28 -170 81 50 65 -60 107 -118 37 110 -78 -82 -139 -33 -37 86 -90 -39 41 110 113
7802 113 43 -148 -21 -67 -69 -32 18 139 -72 31 113 -105 -196 52 58 -121 -49 12 55 -72 -224 110 -16 -106 136
7827 136 -98 28 1 -29 -71 -9 70 39 18 125 -99 145 177 -136 27 -35 88 59 -64 -75 2 133 182 -4
7851 -4 -6 -21 85 -8 53 3 -111 -173 158 -45 -42 -92 -70 -9 -43 160 -104 64 28 -12 94 -68 -4 59 -85 271
7877B71m03J69n1j4Q1K1N1j42o7K65m4j26q1J55J64j11k46J15j20J9KL9nMJ02
7902D8N9j60O7j27O3J15o0K12k44N1j27J29k23K66q1j1J88k43N4O8O0j19%J13
7926I8j63L1P3r5J09j88O1J20L9j59j8O5L7j68J30M6j49J09j12N9N5J71m2m8j43
7951h2K21j13lj39M1P9L0q1R4j29J92J08k58N4O5j8jl6l1o6J0J61j71J09n3Q0
7977F3p5K0r4Pp5J64j32Q1J13p7J65j74k1o3J48l8j15J12J85k52J31j49O7jR4
8002H4k8J95k54O8j22j08K22p7J07k6j16M6j6J70Oj23kL1j40j2Q9m1l4O1P5%J20
8029A75k72J21K9K0j86J50j65K18J0j56M8N9l0J19j89J97j36o7n6J55k5LO2L0
8053A14j51O1q9J42q9kOj82K9O3P6nR8Ql2k28J62o1L0Q9LP1j77K01j16J5pJ55
$$ plain form
7877 271 -132 37 -14 -28 53 74 125 -17 -84 181 137 11 -70 85 249 138 -108 7 -113 -94 -92 -53 -58 -54 48
7902 48 107 -53 14 -113 -50 65 5 217 -27 24 -103 26 -197 69 -12 -23 165 -78 -24 44 104 -15 -15 98
7926 98 -65 -34 39 -56 53 -135 -74 46 85 -74 -92 -27 10 -158 -28 18 -131 -22 -134 -75 -20 151 109 61 -82
7951 -82 139 26 23 -116 -75 4 34 -47 47 -82 110 218 -40 14 79 61 60 24 -7 -73 -63 98 -73 36 -17 63
7977 63 -12 8 -86 -79 -154 10 -122 -41 72 -5 160 -14 -35 -98 50 12 -103 9 194 -58 73 -76 -9 -10 84
8002 84 56 251 -3 65 -57 -165 57 -20 87 61 -55 -9 -25 145 151 28 26 57 -83 -95 -6 -47 -81 -20 55 55 175
8029 175 -97 24 53 73 -113 37 -128 90 100 -56 -8 51 21 140 -49 148 12 -55 -111 44 19 22 84 114
8053 114 -37 24 -65 77 -12 -14 -8 -190 -161 -98 -22 -27 71 79 47 -181 -19 -80 -50 39 42 113 -64 137 21 36 29 184
8081A84j80l6j34L24k14J6K07j73q6Q4K9n3K26r2m1j93J03R1K2j05O3k0r6Pl4
8106a01P8J40K4j71J35lr0J42o0k51J68K5j39J72O9q9m0N9J5P7q0j09Q0o3L8q4
8132e8J72j92K11j21J8j38O4N2J18j56j56L3N2J35p7O1j03J36j03K9J24l48J41
8155a06K3mQ7o7J33n5k5l4K6R7p4J24p0k37P5J54j31L2J32k05J01L5J42k8p1j06
8181e2J68k1j67L3k00K49J61l28K26k08
$$ plain form
8081 184 4 -32 -166 158 -56 -40 167 -6 -92 -8 21 -32 194 102 61 -132 -29 62 84 -21 42 22 -74 -67 -101
8106 -101 -23 117 141 -30 105 102 12 154 94 -157 11 36 -103 69 138 49 9 68 83 160 80 -29 51 -12 26 -58
8132 -58 114 -78 133 12 30 -108 -44 8 126 -30 -186 -153 -101 34 -43 18 -85 51 -52 -23 101 -247 -106
8155 -106 -83 -87 0 -67 66 11 -14 -48 -22 75 1 125 55 -182 -107 47 -84 -52 80 -125 -24 11 153 125 54 -52
8181 -52 116 95 -72 -39 -239 10 171 -157 69 -139
8191a39
$$ Imaginary data points
##PAGE= N=2
##DATA TABLE= (X++(I..I)), XYDATA
0@%%%%%%%%%%%%%%%%Qj6J6j6J6k1K9l2L5m3M8n6O7p5Q8j04J17j30J49j68J87k10
38a11K34k62K93l25L58l98M43m88N38n94O55p22P96q76R65j064J175j299J439
57G57j601J788k008K270k587K981l491M175n146O659r347J5599o0409l1600N3011
72b8949L230J2116R070K1348k111j3234j6875O911J1314L619q483Q939J7961M871
86B9727j8206j4688j093O141l574p045L453J8165R046j1695j6970n59N161o698
100h835j2686K489J5919J2318m054r703O11P662m531j4741l602J6155J4678j802
114I878o440M030P756l223j4536q569R217J1870k448q527L367J1051j139j5230
128b943r836M747P145k635p561K406J3116M434j1450r501M839Q541l170q241K515
$$ plain form
0 0 0 0 0 0 0 0 0 0 0 0 0 0 0 0 0 0 8 -8 8 -8 8 -13 16 -16 19 -24 24 -32 35 -40 48 -56 61 -69 80 -88 99 -111
38 -111 123 -139 154 -171 187 -211 232 -256 282 -312 343 -379 417 -459 506 -558 617 -682 757
57 757 -844 944 -1064 1206 -1381 1600 -1891 2284 -2862 3797 -5550 10049 -50360 -81960 -28949
72 -28949 -25719 -13603 -4533 16815 14704 1470 -15405 -8494 2820 6439 -2044 6895 24856 29727
86 29727 11521 -3167 -4260 1881 -1693 -8738 -5285 12880 21926 10231 -6739 -7298 -2137 -8835
100 -8835 -21521 -19032 -3113 9205 5151 -4552 -3941 3721 -810 -15551 -19153 -2998 11680 9878
114 9878 3438 7468 15224 12001 -2535 -11104 -1887 9983 7535 -992 2375 13426 12287 -2943
128 -2943 -12779 -8032 -887 -3522 -11083 -8677 4439 8873 -2577 -12078 -7239 1302 -1868 -10109 -7594
143g594J2477O543o378p817M005Q844l256j1209j373J0326O495n908p167L428
157A416P453k651j1291m918P404O705n892p751M156R776L95r816m864O604O072
172B798m602p135L335J1342L651q352m942O198N738n010q161P65R602M019o318
187B928n456M586N989m690j0525j140Q030L952n064m084M403O948k681r655k762
202i221O961N102m256m355N339Q093j207q173l780N263M614l875n380M126Q484
217G735L64q110m386M453L754m461n430K437Q063K107o862m820L960M304l988
232h80o077J687Q169K884n281m134L145M428k899o590M23P855L643m776l948K734
248C83M139k828o553o95O514M276l301m294K354M482k308p089j411N444M644k190
$$ plain form
143 -7594 4883 11426 5048 -2769 1236 10080 6824 -4385 -5758 4568 11063 5155 -2012 1416
157 1416 8869 6218 -5073 -9991 -2587 4118 -1774 -9525 -5369 4407 4802 -5014 -9878 -3274 2798
172 2798 -1804 -8939 -5604 5738 9389 1037 -3905 2293 8031 3021 -5140 -4375 5227 9246 2928
187 2928 -2528 2058 8047 3357 -7168 -8308 -278 3674 -1390 -5474 -1071 5877 3196 -6459 -9221
202 -9221 -2260 2842 -1414 -5769 -430 7663 6456 -1717 -5497 -234 4380 505 -4875 -749 7735
217 7735 8099 -11 -4397 56 3810 -651 -6081 -3644 4419 6526 -336 -5156 -1196 3108 -880
232 -880 -6957 -5270 2899 5783 502 -3632 -487 3941 1042 -5548 -5125 2730 6373 1597 -2351 383
248 383 4522 1694 -4859 -5554 960 5236 1935 -2359 -5 4477 2169 -4920 -6331 -887 3757 1567
264A567l558K266M523j366o997l222M701M685j640l036K476M862m61o674m106
279e980L049M058r82l017K342N778R28o132m428J724K948j221k991K063O405K263
295F807m546m497P39K440j969l852J432O065L416k823l991M70J851k318m736l
311e515N380M512j822k936J058K344k224n232j379M301L976m50k052J691K836
326D488j210n301k889K781L339p13j675J920L856q4m933l321J387K462r81k017
342b891J683M253J032l419k874R13J631j194k471P81M382J907k100k370Q20J859
358A942j503l218m1L293K155j398j979J019K274j240l400j019K428K041j185j793
374a624J358K477k88k819j542K026J718j773j777J190K812O79k333j326J602J273
$$ plain form
264 1567 -1991 275 4798 3432 -3565 -6787 -2086 2599 959 -2077 399 5261 4800 -1874 -5980
279 -5980 -2931 1127 145 -2872 -530 5248 6176 44 -4384 -2660 288 -933 -3924 -1861 4544 6807
295 6807 2261 -2236 -1497 943 -1026 -4878 -3446 2619 6035 3212 -779 -309 1542 -776 -5512 -5515
311 -5515 -135 4377 2555 -381 677 3021 797 -4435 -5814 -1513 2463 2013 -39 1652 4488
326 4488 3278 -2023 -4912 -2131 1208 495 -1180 740 4596 4512 -421 -3742 -2355 107 -874 -2891
342 -2891 -1208 3045 4077 658 -2216 -1303 328 -866 -3337 -2556 1826 3733 1633 -737 83 1942
358 1942 439 -2779 -2820 473 2628 1230 -749 270 2544 1304 -2096 -3115 -687 1354 169 -1624
374 -1624 -266 2211 1923 -896 -2438 -412 1306 -467 -2244 -1054 1758 2437 104 -1222 380 1653
390A653j591k306L08K961N63j648p55J507J381j104k808m62K170Q60j097o64J664
407F32K096r20k434q49J299O42j259q85J521K600j76k144j025J058M9j833r34
424b562J324K221Q68j339j063J307M0j979j400Q62K054R75q12o7J191N71j645
441E46k232j7J837O94o97O0J561O32j463k072n94Q17O06q75j08J509J592p24j826
460g54n33N64j4q80qJ532J819q7j051q09P57K77j237p58J410J220K59r36m26O06
480I51r1r59j403M52J269K64r52j12N98K05j138p15J17R14N48o28j35R94O93n11
500C61q01L50Q86Q8m32l96P96Q10m22j044k27R06o8r12m53O07K40o55n20k82O25
521e43M50m12q35N08N91k15n97J88J018K59k01q9M10L04K95q17l48Q59L55o25
$$ plain form
390 1653 62 -2244 -1936 1025 1588 -60 -815 692 2073 969 -1839 -2301 -131 729 -368 -1032 632
407 632 2728 1808 -626 -1475 -176 466 -793 -1678 -157 2443 2267 123 -902 156 205 -1628 -2562
424 -2562 -1238 983 1851 512 -551 756 796 -1183 -2583 -1721 333 1308 496 429 1620 2191 546
441 546 -1686 -1703 134 828 131 191 1752 2384 921 -1151 -1745 -928 -322 -1197 -1305 204 1796 1072 -754
460 -754 -1287 -723 -737 -1617 -1625 -93 1726 1639 588 -221 536 813 -424 -1182 228 1448 1707 771 345 951
480 951 860 -99 -1502 -1050 219 483 -469 -581 17 222 -916 -1631 -1514 -600 -52 -680 -815 179 872 361
500 361 -440 -90 796 884 452 56 852 1662 1240 196 -31 875 807 -105 -558 49 289 -366 -886 -1168 -543
521 -543 -93 -505 -1340 -832 -241 -456 -1053 -865 153 412 211 122 532 836 1131 314 -34 825 1180 555
541E55q9O26M2l85q01o40J58L40J27n73o4Q74l28p82j13J11K20n9k16M85O41N38
563F67k47n26J56M34l50k29P18N25J69m48o6l50m1j08p08q6O17J88m14j90J52
584a37o1n31j57l45K44O47J01N1J98L14j99m51J11P6L15L57k27J20O32m3m35m88
606I2RJ92m75J95J10K39q8k94m79j95M07k65k67L28K48m0j22K41J43o5J53k78
628b11j2K32M08l7j75K77J88m49p9l6R4O5P0l24j44L25J8m56p2N5L5j51l7K77
652a39J67j47j4K4R3K62j73k04L51j54j8Q3j24P4J65j32k76o3K3K16m4k45L44
675F9J53k90K69k27q6K42m7j89J41J90J02k27L9O8p5L9j30j67J73pj18n6R3q2
699a23l9o2J32j77j30L19Rk00J84J56N4L1j1Rp2O0J45K01k31J47n6k63l2J87l19
$$ plain form
541 555 466 1092 1134 749 -52 -692 -534 -194 -67 -640 -704 170 -158 -940 -1053 -942 -722 -781 -997 -512 129 667
563 667 420 -106 50 484 134 -95 623 1148 1317 869 803 453 412 304 -404 -490 127 315 -99 -289 -137
584 -137 -198 -729 -886 -1231 -987 -340 -239 -188 10 324 125 -326 -215 -139 176 533 306 426 1058 1015 580 92
606 92 101 293 -182 13 123 362 274 -20 -499 -694 -287 -552 -819 -491 -243 -283 -405 -164 -21 -86 67 -211
628 -211 -223 9 417 380 205 482 670 221 142 106 200 265 335 11 -133 192 210 -246 -318 -263 -228 -379 -416 -139
652 -139 28 -119 -133 -109 -16 246 73 -131 220 66 48 131 7 81 246 114 -162 -225 -202 14 -30 -275 69
675 69 222 -68 201 -26 -112 130 83 -106 35 225 327 100 139 207 132 171 41 -126 47 40 -78 -134 -41 -123
699 -123 -162 -224 -92 -269 -399 -80 -71 -271 -87 69 123 154 143 152 80 140 285 486 255 402 346 83 51 238 -81
724h1J87l1J8O8m71mj99Ok7J51q6K74M9l7J72n0k61L79j84K38RK71J21j43N3n
750D17l8l26K14j30K10p2Rj59M8k58l73m2k38K18K35n5J63P2k51p3J4K02k24K93
774a44L84K53P1j4j49l0q9p3J46o4J17J26L5k05J3l82l05j09k18K23P8J15p4K22
798g3l29r6j03o4K14J14L58J14L97j1j04o4k7j71k2K51K0L01P7rm24j98l26k30
822d05J46p5M7K49j73M5j45r4k93PP9K15J27L11%J58o7Q8j58M1M8K81J8j7O5P8
848E76j6l28j47pj89m0P7k4q2j71R4j24k19K51P4k63Q0Q2K61j91J93M6J17p2J62
873A40j30K62J44k35J98l5O9q6j22J45k71k0k69K97j84p4J38j31J06k23p0J02
895b49m15J67J61K15J79O6p6o4Nj0K9q1K78K89J04j17Q0l20j33j38j43L0K26j20
$$ plain form
724 -81 106 75 93 161 -310 -314 -513 -507 -534 -383 -469 -195 -146 -183 -11 -61 -322 57 -127 111 120 391 512 369 422 417
750 417 379 53 267 137 347 275 284 125 173 -85 -458 -500 -738 -520 -285 -340 -177 -105 -356 -429 -415 -213 -437 -144
774 -144 240 493 564 550 401 371 282 209 355 291 408 534 569 364 377 -5 -310 -419 -637 -414 -336 -221 -295 -73
798 -73 -402 -498 -601 -665 -451 -337 21 135 532 521 417 353 326 155 133 384 404 705 782 773 349 151 -175 -405
822 -405 -259 -334 -287 -38 -211 -166 -311 -405 -698 -691 -612 -397 -270 41 41 199 132 220 62 103 151 432 450 433 498 576
848 576 560 232 85 78 -111 -151 -74 -98 -180 -351 -257 -381 -600 -349 -275 -538 -458 -376 -115 -306 -113 -67 50 -22 140
873 140 10 272 416 181 379 344 413 327 205 350 79 59 -210 87 -97 -171 -33 -164 -58 -281 -351 -249
895 -249 -664 -497 -336 -121 58 124 48 -16 -11 -21 8 -73 205 494 598 481 561 241 108 -30 -173 -143 83 -37
919c7L14k16J30k60l67N8k3J03k9K80J85j29K4l1o9l5j67K32l5K84K26pj29k22
943H0j33L5N0j65J75Q3O8p1j70O8k30K4k54J94Q6K97k47K36k31K1nk09M3J92Q2
968A9kJ90Q1j16l09K4J63o2Q5J8%O3k97k8Q1m1O5K9%m2L3J08k23j0J07J00j02
995f6J0P6R0r5j00K6j42l5K80J23J17P2k94p0k86K01q2K15m9K52Jq1p0l09J77
1020c9j29q9K21J16P3K9K2j55o6q6j01J45j77L12K72M5k10j16j24j10j84J12K42
1043CJ48J12o0J41j79k09j84j84L19M2L46p8K91l18j03l18p1p9L57NO0J58Q9j59
1067A29k40Q7m69L30J42n5R4L55J20k80k08o6j51L9K12k1K54J02j71r0j26k21
1089b34O1j26N9L01k06M98j69j25j34N8k73J24J82R4J32k9j29p9L1q8%j3ql8J47
$$ plain form
919 -37 277 61 191 -69 -436 -378 -401 -298 -327 -47 138 9 33 2 -67 -102 -269 -37 -72 212 438 431 302 80
943 80 -53 -18 32 -133 42 125 193 122 -48 20 -210 -186 -440 -246 -160 137 -110 126 -105 -84 -89 -298 -255 -63 19
968 19 17 207 288 172 -137 -113 50 -12 73 91 91 154 -143 -171 -90 -131 -66 -37 -37 -79 -46 62 -161 -171 -64 36 -66
995 -66 -56 20 110 15 -85 -59 -201 -236 44 167 284 356 62 -8 -294 -93 -175 40 -9 243 244 163 93 -216 -39
1020 -39 -168 -257 -36 80 153 182 204 49 -17 -103 -204 -59 -236 76 348 393 183 67 -57 -167 -351 -239 3
1043 3 151 263 203 344 165 -44 -228 -412 -93 -51 295 217 508 190 87 -231 -302 -381 -24 -19 41 199 288 129
1067 129 -111 -24 -493 -163 -21 -76 18 373 493 213 5 -61 -212 -173 39 18 272 374 203 113 -13 -234
1089 -234 -173 -299 -240 61 -145 353 184 59 -75 -17 -290 -166 16 110 242 213 84 5 36 -52 -52 -65 -73 -111 36
1114C6M2J1k47J16j33J55K3J0RK7q4mr9QO7M0l6J40J9q6j17O3o8Q4J72j50J5K69
1142B82l20j5ro8RJ05pK33k38K8j46K7j62m9K46n7R1m3L50r8j72J30j98J8M8N3
1168C8P1K46n1j50p3n7j26J23j28m0L11M4k35J1q0j31K02k99L35j55J19j44K76
1191A07n7j92O0j2L7Q1lK87o8O2j69n0J65k77J21k56L06k10L6J41j99O4j98K39
1215A5l00o3J80mR0p3q3O5J93p9J04K6p7pP6m4J75N6J03q9m0j5j4k54L6j20J25
1242a8k5K74j03k62l1k5j53o7J17K51K9n7K26N9k14m9J7k33J94J72J17J81j11
1265B89Jj9l73J07j04J23m7J42J21Q4j72j71k05l14J72%J98J01M5K12r5r7j97
1288a99j2j84L74M5K73J54q3J58k74k59j35J0o0K56J26J0n4J13l32k15r9n1J55
$$ plain form
1114 36 78 89 -158 -42 -175 -20 3 13 22 49 -35 -39 -138 -130 -63 -23 -59 81 100 14 -103 -40 -108 -24 148 -2 13 282
1142 282 -38 -53 -62 -130 -121 -16 -23 210 -28 0 -146 -119 -281 -330 -84 -141 -50 -93 257 159 -13 117 -81 -63 -15 38
1168 38 109 355 304 154 81 24 -102 21 -107 -147 164 208 -27 -16 -96 -227 -25 -324 11 -144 -25 -169 107
1191 107 50 -142 -82 -94 -57 24 21 308 240 302 133 83 248 -29 92 -164 142 -68 -32 109 -90 -26 -224 15
1215 15 -285 -348 -168 -172 -82 -155 -238 -173 20 -59 45 71 -6 -13 63 19 194 250 353 264 224 209 195 -59 -23 -143 -18
1242 -18 -43 231 128 -134 -165 -190 -343 -410 -293 -42 -13 -70 156 215 1 -48 -31 -264 -70 102 219 400 289
1265 289 290 271 -102 5 -99 24 -23 119 240 324 152 -19 -224 -538 -366 -366 -168 -67 -22 190 95 -2 -199
1288 -199 -211 -395 -21 24 297 451 368 526 252 -7 -142 -132 -192 64 190 200 146 259 -73 -288 -387 -438 -283
1311b83K7K73K74k05k7k38j92O0M0P8J33M38j41K52j40j45k54j24L1K96j25K48
1333B76m3LK5k19k3l75P2P3J85M8O3l7j7l53P6m1M9k0K23J26J68o2r6j53j8L6
1359c4j2J20PJ55j13M7R2q1j46j6j83J45q8q1J31K4O5l19K62j29j09L7l3J58J32
1384C1J10kL0j08n8j6P3K81m76L30%j02J41j23j52L5l2J09j68j35L13j20N9R3
1408A13k48L3K3l43L10K1q3J98J5L6J22j99m0K1m2L2J06M7r2j10J86k13j5N3J43
1433G4N1k2J7%kRj75M8k76K8M17o1n7n7K30j27j74O4p3r6K6J69P4J40l0j59k4
1460A4o7K1J10j79L17J9j47k13M2J8r8K2MP1L33N9l94R2j91J55mR9m4mm4L50k70
1487G1o2l1j27O2J10L4R3k8Jj05q9n1J55q9m2J95k7K5n4J33k33m4O2O5J73j67
$$ plain form
1311 -283 -256 17 291 86 59 -179 -371 -311 -271 -193 -60 378 237 489 349 204 -50 -174 -143 153 28 276
1333 276 233 236 261 42 19 -356 -284 -211 -26 22 85 48 31 -322 -246 -287 -238 -258 -35 91 259 197 101 -52 -70 -34
1359 -34 -46 74 81 236 123 170 262 181 35 19 -164 -19 -107 -188 -57 -33 32 -287 -25 -154 -263 -226 -259 -101 31
1384 31 141 139 169 61 3 -13 60 341 -135 195 195 93 234 111 -41 -6 -38 71 -97 -232 81 -39 20 113
1408 113 -135 -102 -79 -422 -112 -91 -174 24 39 75 197 -2 -42 -21 -63 -31 75 122 30 -80 106 -107 -122 -69 74
1433 74 125 103 120 120 118 127 -48 0 -276 -248 169 108 51 -6 224 97 -77 -13 -86 -182 -156 13 87 227 197 38 14
1460 14 -53 -32 78 -101 216 235 88 -125 -83 -65 -163 -141 -137 -66 267 326 -68 24 -167 -12 -16 83 39 35 -9 341 71
1487 71 9 -22 -149 -87 23 57 150 122 123 18 -71 -122 33 -56 -98 97 70 95 41 174 -59 -103 -41 24 197 30
1513C0j5L02k49j32n1j44K61L2M2k8p2J06L9j88j30O5R1MK24n7L1m9m9j49J10
1538B4P1l5p5M3J0J4R3j69J10l1k33L2j18K16M3Rn9Q4n2L4k11J92l7k1J25O1o7
1565E3j0R0j62N0J1lM4p4J44J4k85m1K0J10J3J51m5Q7J52k15j56O5k52O1N1qP7
1592e8qK16m9j89O2J35r5j35P2Q9lj04m7J66l1R4j30j49J17J29j69k1k2R8N6r7
1618g3o7R3J15j56J32j12J49Jk13Q6k7M4q1R3j75R5J64o8J58%p8j6q5N8j11O1
1644a3p9K8p3P0MM7m9L6o2mK07r6O7J08J4k77m2K70m29J36J60M5J14k20j06R3
1670e1m3K16j73O1J67j67R0j21L7j44J44M9j71J68J15O6j00l4R3k92k8j3K41K1
1694A31j75J08J04k29j18J89k10J53R8o8K6J77n3rl18O2K01J65k45Q6j02K22j37
$$ plain form
1513 30 15 317 68 -64 -115 -259 2 34 76 48 -24 82 121 -67 -197 -132 -41 -37 187 130 161 112 63 -86 24
1538 24 95 60 -15 28 38 52 145 -24 86 55 -178 -146 -264 -48 -5 4 -55 29 -23 11 -200 -8 -45 -66 59 120 53
1565 53 43 133 -29 21 32 29 73 -1 143 157 -128 -169 -149 -39 -26 125 80 167 319 104 -52 13 -239 -178 -127 -135 -58
1592 -58 -66 150 101 -88 -26 109 14 -121 -49 40 37 -67 -114 52 21 115 -15 -164 -47 82 -87 -108 -130 -32 24 -73
1618 -73 -140 -47 68 -88 44 -68 81 82 -131 -45 -72 -28 -109 -16 -191 -96 68 0 158 158 80 64 -21 37 -74 -13
1644 -13 -92 -64 -137 -67 -63 -16 -65 -29 -91 -95 112 16 83 191 205 -72 -114 156 -273 -137 23 68 182 -38 -144 -51
1670 -51 -94 122 -51 10 177 10 100 -21 16 -128 16 65 -106 62 177 243 143 109 202 -90 -118 -131 110 131
1694 131 -44 64 168 -61 -179 10 -200 -47 51 -17 9 186 133 124 -194 -132 69 234 -11 75 -27 195 58
1717E8o8j09K11j45J18r8R5j56N1K07k78J43j39R8J8Poj21kK01j31J85r3k54K56
1742D8j1k6j2M9J33p0j50L6o4J00r8J05n8q2K13j73J3j0O0j65J66p7N4q1M9N9
1768HK1l1K7m9j05O7J99j00j04O0J37K6j04j33l2K31O9k32q6p2K59kR4k28J62
1793H2j32N3j69L1J96K8j49j25L27j79l4J65Q0k46m2J0P9M7J09j21j91J30K51
1816B00j79l7pk9J74l8q1O4o1r0J1K3qK0J37j12p1J98o2k6O1j05o4J14j1RK5j79
1844a24K37R2l75L83r9j60r6J94n4J12o2k00L68j23j6k46L19ql8r7K1K0j80k4
1868a56j5J28l2O5m6q0J43J69k57RQ1J74k66m6L06k13J14l57K50MJ2q5O5N2J60
1893A79k70R0j12K16R6k49J30m1j03j6N8P4R3k46J9J36o6O6n0Ol0L5J26k1j09
$$ plain form
1717 58 -10 -119 92 -53 65 -33 62 -94 -43 164 -114 29 -110 -12 6 13 7 -114 -116 85 -46 139 46 -208 48
1742 48 37 11 -1 48 181 111 -39 -3 -67 33 -65 40 -18 -100 113 -60 -47 -57 3 -162 4 -73 -19 -100 -51 8
1768 8 29 -2 25 -24 -129 -62 137 37 -67 -7 130 156 52 -81 -113 118 187 -45 -131 -203 56 54 148 -80 82
1793 82 -50 3 -166 -135 61 89 -60 -185 142 -37 -71 94 174 -72 -114 -104 -25 22 131 10 -181 -51 200
1816 200 21 -16 -23 -52 122 84 3 67 6 -84 -73 -50 -58 -38 99 -13 -84 114 52 26 87 -18 -82 32 21 30 55 -124
1844 -124 113 205 -170 213 114 -46 -142 52 -2 110 48 -152 216 93 77 -169 150 142 104 7 28 48 -132 -156
1868 -156 -171 -43 -75 -10 -56 -136 7 176 -81 -72 9 183 -83 -129 177 -36 78 -279 -29 -25 -13 -98 -33 19 179
1893 179 -91 -1 -113 103 199 -50 80 39 -64 -80 -22 52 145 -101 -82 54 -12 54 4 10 -20 15 141 120 11
1918A1K2o5q9K72l5j66l4O3J96k19OJ85k49l8J88O6n8q8p8L16k05%j03m3O9K60
1944A84m15K48j23J14j10r3N3K9Qj4p5R5J56N6r3rm3J90j23l3M6L2r9K57m54L08
1970I2J8k30Q7o7K83k00J34k36J12O7j56K86j82p8J37j10j2p0K20J41j09p5p5
1993b3J83j52j26J21K47k62J6j7j3Oj21N7P9L0Lj91O7K06M0k50Q3R4j58M7N5n8
2019c7k9O5J8M4j56K11J2j61L7P6k15R1j5J27j0j29jk44Q3K36k2l51L71J85j06
2044H0j82J89l4M5k31J29o5K28k11KJ6J66N6k35m4Q1M1j84K38j31P9P0Lo9Oj06
2070f3J0P1j40J98J7L3k62J02o3J00p4N0Kl2R2j39M2Q3J16j79l9J4J13P4p1nr3
2097d3J17r7rkP6N6j53J44jj05l8J43p7K8Q0j03O1k20N5Q2r7P5j2O6O9j30L7l7
$$ plain form
1918 11 33 -32 -121 151 116 -50 -84 -21 175 -44 -38 147 -102 -140 48 114 56 -32 -110 206 1 1 -102 -145 -76 184
1944 184 -231 17 -106 8 -102 -195 -142 -113 -105 -119 -194 -99 57 113 20 11 -32 158 35 2 48 80 -19 238 -216 92
1970 92 110 -120 -33 -100 183 -17 117 -119 -7 60 -96 190 8 -70 67 -43 -55 -125 95 236 127 52 -23
1993 -23 160 8 -118 3 250 -12 4 -13 -26 -20 -141 -84 -5 25 28 -163 -96 110 150 -100 -17 77 -81 -34 21 -37
2019 -37 -66 -1 17 61 -95 116 128 -33 4 80 -135 -44 -59 68 58 -71 -72 -316 -233 3 -19 -370 1 186 80
2044 80 -102 87 53 98 -133 -4 -69 159 -52 -50 -34 132 188 -47 -91 -10 31 -153 85 -46 33 103 106 37 43 -63
2070 -63 -53 18 -122 76 93 126 -136 -34 -97 3 -71 -21 -19 -51 41 -98 -56 27 143 -36 -75 -61 52 126 55 50 -43
2097 -43 74 -23 -32 -34 42 98 -55 89 88 -17 -55 88 11 39 119 16 77 -143 -88 -6 -103 -28 -40 26 95 -35 2 -35
2125c5O5m1M4J7j16j9J43r4P3n4m5L7k25K01j04J26Q8J00j82j7N1p7o7K32o5j87
2151a51K10l31J32J16j32J99QK15k63M5o9l24J77O5J18O9m3j60K13j26n4jJ16
2174B9j01K2L9L1ql6j33J46k8qK3r8L55k40J8J58j83RJ24j2l1k72J06L27p0j76
2200ij89K32K3J52l59P0J18j53K9o1K26L1j67k8J30L3L7o7K0j30R0K6j03K3L9
2225A3J45j87l0p6K01k08o5O7K81j0l9n8k36J91K8k2o7N1l6K2m4J31j46J61o2
2250Ej36K29L7j36Kp8Q1rj63J57P6l1L0j26mJ60n1K8o8M4J14j90Q1J00j36p9M8
2277a5N5M6j7j42m9J16R9k83K50r7k0l5J14j62J79K0m3n3Q1J08p1j45P5M4M4K7
2303A26q9j28J17K04j38R9j25j9J1P8l01K48m4k0J3j77L14j71J08j15R6p8l9J12
$$ plain form
2125 -35 30 -11 33 50 -66 -85 58 -36 37 -17 -62 -25 -250 -49 -153 -27 61 161 -21 -38 13 -64 -131 101 36 -151
2151 -151 59 -272 -140 -24 -156 43 51 266 3 48 -21 -345 -168 -103 15 84 41 -119 94 -32 -86 -87 29
2174 29 -72 -50 -11 20 12 -24 -157 -11 -39 -47 -24 -122 233 -7 11 169 -14 -5 119 107 76 -196 -90 237 167 -9
2200 -9 -198 34 57 209 -150 -80 38 -115 -86 -147 79 110 -57 -85 45 78 115 48 68 -62 28 54 -49 -26 13
2225 13 158 -29 -59 -135 66 -142 -207 -140 141 131 92 34 -202 -11 17 -5 -72 -21 -57 -35 -79 52 -94 67 5
2250 5 -131 98 135 -1 1 -77 4 -5 -168 -11 65 34 64 -62 -66 94 43 71 3 47 161 -29 52 152 16 -63 -15
2277 -15 40 86 69 -73 -122 -6 93 -190 60 -37 -57 -92 22 -140 39 59 16 -37 44 152 81 -64 11 55 99 126
2303 126 37 -91 26 230 92 191 66 47 58 136 -165 83 39 19 32 -145 169 -2 106 -9 87 9 -30 82
2327H2n7O0j32j9P8jmJ3rP7j88J12j52J55j29O7J19j50q2J38M0m9P3q2J76j21
2353A5m7rJ03K4K2k89N0P4L6O5j59K25k80L51k13j64K15N9r2R8j4l8j40N8n9J74
2379F5q8O5q5j41K45j66J44k5k1R3o8r5R4N9N9j66J03p1j42J51o8K0n5K5Q7N6
2405G5K7j5r3N1j14J04j47j4K12J07j46o6J4M5k46L23Lk87J91j23K2K32l06P9
2429g2O8QN2p3L0r5J23K1K9q7j7J62j53Q5j40L24l48Q7O5k15L23k00JN8j59L2
2455i1K46j43m3J15j39M5Ql5j20J16q4J79Po1R6k66L2L06k17k0l2L9l4J7O3J19
2481A03j54P1q3K16j89L3k4n5J25o4J30j97K11p4j10K6nQ7n5P6p3m5N0ml0J44
2507A10j46K7Q3Q9k04N7m4O3q7J18j23O2N6l6Kr6P2q2J19j66J89k7p2Q0n2m4o9
$$ plain form
2327 82 25 85 -47 -66 12 11 7 20 11 88 -100 12 -140 15 -114 -47 72 -78 -160 -22 18 -31 42 -40 136 15
2353 15 -32 -41 62 86 108 -181 -131 -57 -21 44 -115 110 -170 181 -32 -196 19 78 -14 84 70 32 -108 -50 -109 65
2379 65 -23 42 -43 -184 61 -105 39 14 -7 86 18 -77 17 76 135 -31 72 1 -141 10 -58 -38 -93 -68 19 75
2405 75 102 87 -6 45 -69 35 -112 -126 86 193 47 -19 -5 40 -206 117 120 -167 24 -99 -77 155 -151 -72
2429 -72 -4 4 56 -17 13 -82 41 62 91 4 -13 149 -4 81 -59 265 -83 4 69 -146 177 -23 -22 36 -123 -91
2455 -91 155 12 -31 84 -55 -10 -2 -37 -157 -41 -125 54 61 0 96 -170 -138 168 -49 -69 -101 -62 -96 -79 -16 103
2481 103 -51 20 -63 153 -36 -3 -27 -82 43 -21 109 -88 123 49 -61 -35 -40 47 -8 68 -5 -50 0 -4 -34 110
2507 110 -36 -9 74 163 -41 16 -28 35 -52 66 -57 5 61 25 27 -69 3 -79 40 -126 63 36 -36 44 -8 -52 -121
2534a21K7K91k94L6J61o0r3J58j30K08j38j21J5j2L4J9Q4q5J07j47J44j67j7J3
2558h8J90j23N1j03J44k34K8J68j65J72q2J9K3J13qK8k19J35O8j36J2q7Q2Kml1
2584d5J1p8O9r0K6J63j65J39j99J72M6j08K8P4l4M5o1j14K6L2K06j64lk2J99j88
2610c5m7J04J70j21k07J43n6J55j18M1m1j6J02j70J72p8L6j10Q9o8n3J01j19K20
2634I4j48K9K1j13J12J31M8l1k5p0j18K7l3L3K65k61O6j66J00j33N9k1J92Oq7
2659b3m1N2j15J87k2P8k7p7j8q7J50j5l6qq1l7J24m3J41L8k24K1J2qJ32k69J78
2686a8Q9j4j36J78N7k10k1J54n9r5N1J12j9j24kN9k07L79j91r0PO1n0J2Q8K2r8
2713f5J26P6j59j67J80M9k25K64k30J77N1j3j17R2M4p2K12r7j71K05j22J47k71
$$ plain form
2534 -121 -94 197 -97 -61 100 40 -53 105 -25 183 45 -76 -61 -73 -39 -20 64 -21 86 -61 83 -84 -101 -88
2558 -88 102 -21 30 -73 71 -163 -135 33 -132 40 -42 -23 0 113 105 133 -86 49 117 -19 -7 -94 -12 -10 -14 -45
2584 -45 -34 -112 -43 -133 -107 56 -109 30 -169 3 49 -59 -31 43 9 54 -7 -121 -95 -63 143 -21 -24 -46 153 -35
2610 -35 -82 22 192 71 -136 7 -49 106 -12 29 -12 -28 74 -96 76 -2 34 -76 13 -55 -108 -7 -126 94
2634 94 -54 -25 -4 -117 -5 126 174 143 118 48 -70 -43 -76 -43 222 -39 27 -139 -39 -172 -113 -134 58 64 -23
2659 -23 -64 -12 -127 60 38 116 89 12 -6 -93 57 42 6 -2 -83 -120 4 -39 102 140 -84 -63 -51 -59 73 -196 -18
2686 -18 71 57 -79 99 156 -54 -75 79 20 -75 -24 88 69 -55 -57 2 -205 174 -17 -107 -100 -39 -89 -77 11 33 -65
2713 -65 61 137 -22 -189 -9 40 -185 79 -151 26 77 64 -53 39 83 11 223 126 -45 160 38 185 -86
2736h6J00M9j60J37q9k5M1P4l3j2RJ09q1L7j26q0J07L3ML6j76p9K44P9K3l08J66
2763gK2n2J05o6p5J10l8L3K9j85K33r6K9j4J5j09J04R9j12l3j55K22P5j55J08
2788H7r8l9J44j65K1J08k02J07Q3k3Q2kk77K32n8o1M3q3O3M9k3n0J19N9k15o7
2814a66J37KK3Pr8J25j3o8K9lN9m3m2PJ08N0p4p5O8q6N5r7K00l6j2NK0K2j27J19
2844I6j34R8j16M2J24j80oQ2q3M9mL8j53J36R8j74J30M3K1k45K51j51M6J63j13
2869E8j30Q3j09J76j35k9O5j3O2J6j18L1J01M7n4o5J37j81J04q6P1M8n2P2j83
2894h4J16on5m1Q0r5OJ02O0q3n3Q3j95J49l5R8o0N6l2r5Q1K67l5l00l8OK12r3
2922A6r9o8L4J01K5J66k82O1J70j8l7j84Q0j26J72j42lJ1J94p0j15J32p1j5P4
$$ plain form
2736 -86 14 63 -97 40 -49 -74 -33 41 8 -4 5 114 33 70 -56 -136 -29 4 8 44 -132 -211 33 112 135 -173 -7
2763 -7 15 -37 68 2 -73 37 -1 32 61 -124 109 13 42 28 43 -66 38 137 25 -8 -163 59 134 -21 87
2788 87 -11 -50 94 -71 -50 58 -144 -37 46 23 105 103 -174 58 0 -61 -18 -101 -38 11 -12 -62 57 116 -99 -166
2814 -166 -29 -27 -4 3 -95 30 17 -51 -22 -25 34 -9 -51 -44 64 114 40 -35 33 -53 2 -95 105 69 57 62 82 104 -23 96
2844 96 -38 60 -56 -14 110 -70 -76 6 -77 -28 -32 6 -147 -11 87 -87 43 86 107 -138 113 -38 8 171 58
2869 58 -72 11 -98 78 -57 -86 -21 -34 28 44 -74 -43 58 105 51 -14 123 -58 46 -40 31 79 27 99 -84
2894 -84 32 26 -29 -70 10 -85 -79 23 83 0 -53 30 -165 -16 -51 47 -13 43 11 -84 -3 264 229 -71 -109 -103 109 16
2922 16 -83 -151 -117 -16 9 175 -107 -46 124 106 69 -115 -35 -161 11 -131 -134 -123 71 1 -114 18 -53 -68 6
2947Fj1j46K21n6q7K17q5O8p7l1P5j48J56q0o2K34j66j11N7n9R2M9j69J72j9J9
2973E9r7L3q9k9J92j66nJ34j3r8L5r8J64j2M5k50Q8J95n0n6M5j08M9r4J54k1R1
3000I8j58K43Pl48K69Oj13O6k7M0l2N0p7%L4l3j26M3j05K04o2o8P6jJ73Pm6m9
3028G1j47J2LP5P8k6j82K62l70R7J93p7o4J32n4l1M2N2k4l7k88L90k24L9J92n2
3054F2o3M8K5p3k7kJ7j45J50n5L9O1P6n4l2r8J47J6r7j6K6o3K99m05J51L5o6J
3082d3J64M4l28K05j16O4p6R6j57P4J24j13j11K45j33J72o1M5j65J47j11J1K27
3105B04k27l3j52J08J58O6q5l4j3p9R1q8l6JJ07J89j70Lo5O6KM6Q0k93J03o1J02
3132a0Q7q1P3l6j9%J54l27J01P3Lk1P9j46K49k43J62j29m9J19j27LJ38p8j82J42
$$ plain form
2947 6 -5 -151 70 14 -73 144 59 127 50 19 94 -54 102 22 -40 194 28 -83 -26 -85 7 56 -113 59 40 59
2973 59 -38 -5 -94 -123 69 -97 -102 32 19 -79 -44 -142 22 10 55 -195 -107 88 38 -18 27 -81 -32 -126 28 7 98
3000 98 -60 183 190 -158 111 117 4 70 43 83 51 101 24 24 58 25 -101 -58 -163 41 -21 -89 -13 -14 159 166 120 71
3028 71 -76 -64 -61 14 92 66 -116 146 -224 -127 66 -11 -75 57 3 -28 14 66 42 5 -283 107 -117 -78 114 62
3054 62 -1 47 72 -1 -28 -30 -13 -158 -8 -63 -24 37 113 59 27 -71 76 92 -5 -21 5 -58 241 -164 -13 22 -44 -43
3082 -43 121 165 -163 42 -74 -10 -86 10 -147 -73 51 -62 -173 72 -61 111 50 95 -70 77 -34 -23 204
3105 204 -23 -56 -208 -100 58 124 39 5 -8 -87 4 -84 -120 -119 -12 177 7 10 -55 11 13 59 139 -154 -51 -112 -10
3132 -10 77 -4 69 33 14 14 168 -159 -58 15 18 -3 76 -70 179 -64 98 -31 -80 39 -88 -85 53 -25 -207 -65
3158f5J47m3Q5j32n4j7QN2j1M7N1o4k04J57J41n4O1k5j03j06J76N2l39K96M2r0
3184Ho5J68j61J57Q5k14p5J79j73J27o1KK2J58j9m8j81k0J25j16K90l07J82J0
3208G3K1k08J20M6L2j59J82j75mL3l2J83p9l8J00l6r8pN8r9P4j45K37Kj07j06
3234a32J88J5o4o7J88j73P3J39j91N2J68j34j30rk2J16kQ8j13K9j70J48o1K33
3258A69m0j94J68o0L0p1L5J49j03j64J65p3q8J2p1J91l5M5n8R3j46rK6J78j26
3283B3r5qM7J39j78J77N4j71p1K7J03n1L3K0j35K06j82o5J53q7M5q1K64j26j58
3308a17J38j20M3R4rn3m6O3J19j64O2Pj62Q6j6J06q8j26J56R0l7q8J1oM9k24J52
3335h0j27J46lQ9J24l42L7J13j24J88n0j67L41k13o6L2O5r4K35k16K46n2j81j12
$$ plain form
3158 -65 82 39 124 -8 -62 -79 -71 -19 -30 17 68 4 -200 -43 98 44 105 80 -23 -129 47 99 -240 56 98 8
3184 8 -57 111 -50 107 192 -22 -97 82 -91 36 -25 -23 -1 157 138 90 -91 -111 14 -102 188 -119 63 73
3208 73 94 -114 6 52 84 -75 107 -68 -72 -39 -71 112 33 -5 95 59 -39 -46 12 -87 -13 -158 79 81 -26 -132
3234 -132 56 71 7 -60 128 -45 28 167 -24 28 196 62 -68 -77 -99 17 15 103 -10 19 -151 -3 -64 169
3258 169 129 -65 103 43 73 2 37 186 83 -81 84 11 -77 -65 -136 55 20 65 7 100 -46 -55 -29 149 23
3283 23 -72 -80 -33 106 -72 105 159 -12 -83 -56 47 -4 29 49 -86 120 -62 -127 26 -61 -16 -97 167 41 -117
3308 -117 21 -99 -56 38 29 -24 -70 -7 112 -52 10 17 -145 -59 -75 31 -57 -183 -27 63 26 -62 -51 -57 -8 -232 -80
3335 -80 -207 -61 -64 25 149 -193 -156 -43 -167 21 -29 -196 145 -68 -134 -102 -37 -131 104 -112 134 82 -99 -211
3359b11K67j06k9Q3Rm7J31j02J16m9m2k0N6q8k2N2p9J87j26j0p9K0K35l0k20O6
3385c8J79p3q6rN9k17m1L21j54J75n7j60n0Q2R9R3j20O6o2P3m3j35PO8r0j8J62
3412C1n7k7l6K44O1j83J84k30j2O9K2J7k14J58L1j02Q0j40M6J17Q6l5k22J04J48
3437A40j01l3K4o5P2n2Oj11J38k5O7j36J90r0mm1J3k3J02L1o3q3k0K3J09j75J25
3464A8j35L18j25j3N9j66N0m9j95J51M3j8N0J20M0j11o7n4J94o4Q5j45L2j45P9
3489d8N1m7mJ51j34J27J9n7r7R3j52J99qj11m3r7J18J20j46r2K56jm1k9k09K28
3515D6m4J42L2k33K1L9pn2r5K38k7m5O1l8j07RO4m5J42k03Mm4R4J40o4p7J36k3
3543F4o6M5p6j8J94j09q5O8J27j17M2j38L4R8O2j33l6J93P1K3q7j30M9J12j65
$$ plain form
3359 -211 56 -50 -79 4 13 -34 97 -5 111 62 20 0 56 -32 -54 -2 -81 106 -20 -30 -109 -89 146 116 -104 -38
3385 -38 141 68 -18 -27 32 -185 -226 95 -59 116 59 -101 -151 -69 30 123 3 69 7 80 37 -98 -91 -23 -113 -131 31
3412 31 -26 -53 -89 155 216 33 217 -13 -25 44 66 83 -131 27 58 -44 36 -104 -58 59 145 110 -112 -8 140
3437 140 39 6 30 -35 37 -15 -9 -120 18 -7 60 -76 114 24 20 -21 -8 -31 71 102 39 -44 -64 -41 68 -107 18
3464 18 -117 201 76 63 122 -44 6 -43 -238 -87 -44 -62 -12 108 148 37 -30 -84 110 46 131 -14 18 -127 -48
3489 -48 3 -44 -48 103 -31 96 115 58 -39 54 -98 101 93 -18 -61 -158 -40 80 -66 -158 98 97 56 27 -182 46
3515 46 2 144 176 -57 -36 3 -4 -56 -151 87 60 15 76 38 -69 -60 4 -41 101 -102 -98 -142 -48 92 28 -49 87 64
3543 64 -2 43 -33 -51 143 34 -51 17 144 27 69 -69 -35 63 125 -8 -44 149 220 243 156 26 75 187 22
3568B2p1P9rk6o5J09j42N2K12j89q7K4J16j15K0N4l5L03k56O4p2j18J93k35M6
3593a26K15M3q8j35K9J48q9q7L3lO2k1K44k91O7o8N7Ok6K9%j7J03j29J31j3j86
3620a12Q0l3J36l12J93l9Q4j35J20p4N0O4J0K0j95N5J53O2j37n2J0O0J23j55M3
3645A9j36J54K6J9J60m10J66q4R3K1j86J93O6q0j28N1J07k0r5PlJ68j13r7PL6
3671e9K5K62k57p9m3M5J89L2Ql50K78m8n9l1l3q3K12o6J0o8K85ok42O4K1%L1p3
3699c5qj5J41n2r0N7J73k21P6J21k86K26j47K21k20k4k4P7P0j31J32k10L09j12
3723B8O5o2J29j95r6J67j96K45q9oj18J58p8J29q0k8j01M5o2J94Q4j68J37j47
3747d5j38J65qLN0k4oR7j93OJ01J2O2j99M0Kj1J08M1K5j9l2J2n3m7n8J49n7M6
$$ plain form
3568 22 -49 30 21 -5 -70 39 -103 -51 161 -28 -115 -91 25 -90 -70 -16 -51 252 -4 60 -12 -130 63 -172 -126
3593 -126 89 132 44 -91 -62 86 -3 -90 -57 -60 2 -19 225 -66 1 -67 -10 -4 -30 -1 -1 -18 85 -44 87 74 -112
3620 -112 -32 -65 71 -241 -48 -87 -3 -138 -18 -92 -42 22 32 52 -143 -88 65 127 -10 -62 -52 8 131 -24 19
3645 19 -117 37 63 82 242 -168 -2 -86 7 28 -158 35 101 21 -107 -56 51 31 -64 -57 -60 108 -5 -102 -95 -59
3671 -59 -34 228 -29 -108 -151 -106 83 115 123 -227 51 3 -56 -87 -120 -203 9 -57 -47 -115 170 164 -78 -14 7 7 38 -35
3699 -35 -43 -58 83 31 -59 -2 171 -50 26 147 -139 87 -60 161 -59 -83 -107 -30 40 -91 41 -169 140 28
3723 28 93 31 160 -35 -131 36 -160 85 -4 -10 -128 30 -48 81 1 -27 -128 -83 -145 49 133 -35 102 -45
3747 -45 -183 -18 -26 -23 27 3 -3 94 -99 -93 8 20 82 -117 -77 -75 -86 22 63 88 69 37 49 -4 -51 -109 40 -17 29
3776B9L8N1j03j96L55l0k96p9K77k3qp3M8N8n8J05k98P2JN7L2j49K62m4j3l3l6
3803e4R6j72J28o6R0N0j57K4lJ83j59NK6r8J60rQ3k64J77R2j49J16j32J01Q2j29
3829B1n6nJ78q4K9k7n3J09o1Q8r5j99K44j05j19J54l9k3j50K37n0j05K11q2N5
3854G3j38r4N7J64j54J73j19j94L02k7j47n8L12j41J01p5o3J14jk29R1J40p0P9
3878I6n9j2O6q0j07P4j06N4J01n9J17n7j41J78L1j54p6J08J45k49K41k32K4p0
3902a67K78k17J68j50j06J73J08k32J35m2O9%k6j70O5N9J36P1j06j0JO7j8l6k3
3927B7J1M3j93J26q5K81j92q6K06Lj06l2j61L0J42oMq1K72k72lK53j33j96J02
3952d6M8r7J83j33P7j90K04j5p7L4Q1q9mP1k28L30j24n7o6N9j7J48Rj84J6QRO1
$$ plain form
3776 29 67 118 15 -181 174 144 -152 -231 46 23 15 -58 -10 48 -10 95 -203 -131 -130 -73 -41 -190 72 28 15 -18 -54
3803 -54 42 -130 -2 -68 22 72 -85 -61 -64 119 -40 -35 -9 -107 53 44 127 -137 40 132 -17 99 -33 68 150 21
3829 21 -35 -40 138 54 83 56 3 112 51 139 44 -155 89 -16 -135 19 -20 -43 -193 44 -6 -111 100 18 73
3854 73 -65 -159 -102 62 -92 81 -38 -232 70 43 -104 -162 150 9 110 35 -28 86 85 -144 -53 87 17 96
3878 96 37 25 91 11 -96 -22 -128 -74 27 -32 85 28 -113 65 96 -58 -134 -26 119 -130 111 -121 -97 -167
3902 -167 111 -106 62 -88 -194 -21 87 -145 -10 -52 17 17 -9 -179 -114 -55 81 152 46 36 37 104 86 50 27
3927 27 38 81 -112 14 -71 210 18 -68 138 141 35 3 -158 -128 14 8 12 -69 203 -69 -72 181 48 -148 -46
3952 -46 2 -95 88 -45 32 -158 46 31 -46 -12 69 -20 -24 47 -181 149 25 -32 -98 -39 -56 92 101 -83 -67 -59 -50 11
3980A1P7p6O5j30J05N8k22M9O6o2Q3r6J7M0j15J01O5J6k3q8M2M4Pm5J29k8j27
4007c7N2j72L17j64r5K6L61k99o6J75J8j00M6k9n7q0J9R3J14p5mj24R2K2m6J36
4033A23r8j42J68j79R0M8q5J56j65n8M4L5n0J47rn1j7Q9j15J47p8j26q5R3Q8j34
4059a64N4M7p4J12q3K68j80L3Q7k55J05Q8J23j30l8o8J46m9n1l0J42j68M9l2J82
4084A14k53K28j66J03j57J07m9l6K70%k58R4RNJ07j09J1l8J40k65J41r7RJ80m6
4109D4M7kj29rn4P7m5N8L4j1k0k4J85k29J97j79R9J43k32L9J33j40N6j18P9O2
4135F1Mk26J11M9O1j42J45o5K6m6o4O0oN2L0j8k4k5J2N8l4j37J50jm8m2K7j10
4163a42J21m2Q7Q2k4k52K4L6L2j24J02J36r1N3O5p9p3P5Q8p0k05K54k27O2J8J87
$$ plain form
3980 11 88 12 77 -53 52 110 -112 -63 3 -59 24 -72 -55 -15 -130 -29 36 52 29 -59 -17 27 34 -11 118 90 -37
4007 -37 15 -157 160 -4 -99 -73 288 -11 -77 98 116 16 62 33 -24 -104 -85 8 122 47 43 -81 11 33 -13 123
4033 123 25 -117 51 -128 -38 10 -75 81 -84 -142 -98 -63 -113 34 25 -26 -43 46 -69 78 0 -126 -211 -118 -30 -164
4059 -164 -110 -63 -137 -25 -108 160 -20 13 100 -155 -50 38 161 31 -7 -75 71 22 -29 -59 83 -85 -36 -68 114
4084 114 -139 89 -77 26 -131 -24 -73 -109 161 161 -97 -3 6 11 118 9 20 -18 122 -143 -2 -99 -90 90 44
4109 44 91 89 -40 -49 -103 -26 -71 -13 21 10 -10 -34 151 -78 119 -60 39 182 -50 -11 122 -18 38 -80 -1 61
4135 61 65 -161 -50 -1 60 -82 63 -2 24 -22 -86 -26 -32 20 50 32 8 -17 -5 53 19 -118 32 31 -17 -59 -32 -142
4163 -142 -21 -63 24 106 82 -170 -146 -110 -78 -202 -100 36 -55 -2 63 -16 -89 -14 74 4 -201 53 -174 -112 -94 93
4189I3j93K48k60Q5j5l3O4j89J76K65j65l0j82J43r5k10K20P9p7J41q4J2J0p9
4213g6N0J45n8l1p6N3j31k6J52P6k10J11J59L3q6j54m8Q3J36j55R7J2k18J03M4
4238a5L1k6J4p2J44Pk25M1K1o5P5j6O0j7J08J1jj56J42k8o8J17q0o3P2lk8J00
4266H0o1l1K9Q3n5j81J32m6J46k39K22n7P9j97k7K52j33l8K50j26k24Q3p0J11
4290a8j60K43j84N9l5K56j55n9l1J16j29J38N0p4Q5j94JNK29m9j54K0K55j87Q3
4315A11j8q5j2p0P5k6%J61j05q9N0k4l5P8N6j2n2O6j22K55k19l2j6J98j78j3J08
4342E0j47J41k3p1n2l0J29r6M6J24Nj08R2j95J93K6q3j60J49R1j43J72j11K0R
4367B8J42J6j75LR1j54Q3o1j05J72J40k16Q6j3m3K02o8q0j1o7J71j48m9Q7J12
$$ plain form
4189 93 -100 148 -112 -27 -42 -75 -11 -200 -24 241 76 46 -136 7 -88 -298 -78 1 -76 65 -19 -7 3 -76
4213 -76 -26 119 61 30 -46 7 -124 -150 2 78 -132 -21 138 171 85 -69 -117 -34 102 -53 44 56 -162 -59 -15
4238 -15 16 -10 4 -68 76 83 -142 -101 -80 -145 -70 -86 -26 -43 65 76 75 -81 61 33 -35 82 2 -61 11 8 -20 80
4266 80 19 -12 17 100 45 -136 -4 -50 96 -143 79 22 101 -96 -123 129 -4 -42 208 82 -142 -59 -129 -18
4290 -18 -178 65 -119 -60 -95 161 6 -53 -84 32 -97 41 91 17 102 -92 -91 -86 143 94 -60 -40 215 28 111
4315 111 93 8 -4 -74 1 -25 -25 136 31 -58 -8 -32 -67 11 67 55 3 69 -53 202 -17 -49 -65 133 -45 -58 50
4342 50 -97 44 21 -50 -102 -132 -3 -99 -53 71 76 -32 60 -135 58 84 1 -159 -10 81 -62 110 -1 19 28
4367 28 170 186 11 14 105 -49 34 -27 -132 40 180 -36 50 37 -6 196 128 48 37 -30 141 -7 -56 31 143
4392A43j33k08K78O5m20M29k11Q9L7j03J32lk1N7j03r0J08j54R6K4K7q3j2J46
4416I0k98K27m5Q7O3l0p6k69K7K12n8J4L6J54j75J80k11j04K38M0q3M2k8j10K20
4441A43k09J65j3q8k5J39l0j9Q2l11J74K6n8J21j67l2J69j7j26J42Qj3QJ23k55
4466f3j55K30q5O2J83j83k8J51j58K0p6J51j26m0J66j45J58p8p9o6J41jj91K27
4490A5J09o9j16J15j81J46R3l9r7n8J23N0K8k14MJ68j0k07K68j96p4K73j88M5
4514a2n8N9J16L3k60J01N4l7jJ01j34J5l8n9M6R0oP7j24J41n0j21J14j00j28L11
4540A30j40RJ4p6k5K14m0J81l34Q4N4J4mj77r6J04MO2J20o5j36J13k3j6P2j8J17
4567A42k56J5J20p4P4J30j91J48j47k06J86p1J75j9R6k9j87L74j94j34O8Pq9M9
$$ plain form
4392 143 10 -198 80 145 -275 154 -57 32 69 -34 98 95 74 131 28 -62 46 -108 -12 12 39 -44 -56 90
4416 90 -208 19 -26 61 124 94 18 -251 -224 -12 -70 -56 -20 134 -41 139 -72 -176 62 102 19 61 33 -77 143
4441 143 -66 99 86 -2 -27 112 82 63 145 -166 8 34 -24 97 -70 -102 67 50 -76 66 74 61 69 192 -63
4466 -63 -218 12 -73 -11 172 -11 -39 112 -46 -26 -102 49 -77 -117 49 -96 62 -16 -95 -161 -20 -21 -212 15
4490 15 124 55 -61 54 -127 19 112 73 -24 -82 41 91 119 -95 -91 77 67 -140 128 -68 -142 131 -57 -12
4514 -12 -70 -11 105 138 -122 -21 33 -4 -5 96 -38 -23 -61 -120 -74 16 10 87 -37 104 54 -67 47 -53 -181 130
4540 130 -10 -1 13 -63 -88 126 86 267 -67 17 71 85 81 -96 -192 -88 -84 -22 98 33 -103 10 -13 -29 43 25 142
4567 142 -114 -99 21 -53 21 151 -40 108 -39 -245 -59 -130 45 26 122 93 -94 280 86 -48 20 27 -62 -13
4591a3r9J35j27J6q1K48o3m3p4Q4J34J0n0K2j74M2K59l19L9K7q0J36o6J5p2l5
4617a29J12J90l41L09k25J59j87K20j45j9j00M4J31j33J31k15J27Q3O0j55o6K6
4639a23J64o6k9K5L6J54j41j70J78jO1k26K09j25qj30K10MLM5k7j08j8J26j13
4664g0J8o6J47j76Q3J15K8M9j42nmM6k60K26om1J08p0m3jO1R4j09kn3l3J09k05
4692b02J20J76n5q1l9j8J11j80J11J5q0J79j50O8K9l2J08j47n9J71j11j9l9J29
4716Eq4M1j53K20j20L8l7K13n7l7j83K35j22Q0P6j78o2l2J00N5r1O8O0lL2l8o8
4743d2R1q8P8K9k43J67K08j20O4k13l9K22Qj64R5n7K6j61J04K6O4j22J42r5l6
4768e6N7J9l5n9J05J29j61j9j01J17l1n0N9J4P2j09k9j69K80j7o9J75r5j1Q5j78
$$ plain form
4591 -13 -112 23 -104 -88 -169 79 16 -27 -101 -17 117 127 77 99 -75 -33 226 -93 -54 -27 -107 29 -37 -22 -94 -129
4617 -129 -17 173 -168 141 -84 75 -112 108 -37 -56 -156 -112 19 -114 17 -198 -71 12 72 -83 -149 -123
4639 -123 41 -25 -54 -29 7 161 20 -150 28 27 88 -138 71 -54 -62 -192 18 22 25 70 43 -65 -83 43 -70
4664 -70 -52 -118 29 -147 -64 51 79 128 -14 -19 -23 23 -237 -11 -17 -58 50 -20 -63 -64 -3 91 -18 -20 -73 -106 3 -202
4692 -202 -82 94 39 -42 -81 -99 12 -168 -57 -42 -122 57 -93 -25 4 -28 80 -67 -126 45 -66 -85 -124 5
4716 5 -79 -38 -191 29 -91 -53 -90 123 66 29 -154 81 -41 39 115 -63 -125 -157 -57 -2 -93 -25 35 32 64 26 -42
4743 -42 49 -39 39 68 -175 -8 200 80 144 -69 -108 114 122 -42 53 -4 22 -139 -35 -9 55 -67 75 -20 -56
4768 -56 1 20 -15 -74 31 160 -1 -20 -121 -4 -35 -85 -26 -12 60 -49 -78 -247 33 16 -53 122 27 16 101 -77
4794g7L5JK31l72R7l0K90L1k72J49k05jJ06J29j14M3j55J66m9j86J53K01j63O2
4818G0j51K5L34j80n4K5n6m4o6O2l3Q5q7K63k51N0J02o9j46K0o1J21P4L2j12J72
4844A25k16J51j86K49k25K33r0K6j8o5J19k90M52m11J90j18o8J64m3j1J18j17
4866c1p3K49j30J21q4q2k0J20p7O7r3lJ40j15j09mK10l0J39k04j56P3J50O0rj73
4892f4l8P1K0k0n1N3J30k5k81J91l5N4j3o7J40p8R6mN7j54Q7o6Jp7J49L7p4j61
4920a22R2M9l9M0L7l5J04r8j70R5L7Q8j04J68j97J4R2j02J67k39J29N2p7M5q0
4945e4J71j44J1J00j71J0J25j93K00q4J11j11k5J21o4J44K2k81J52rm3kj31K77
4969A32q8k09J15Q5N3l7K0j49r3K11J08p9j03J66k28J05o7J58j4j46P8J57j61
$$ plain form
4794 -77 -42 -41 190 -182 -85 -115 175 206 -66 83 -122 -123 -17 112 -2 41 -114 52 3 -183 -30 171 8 70
4818 70 -81 -56 278 98 44 69 13 -31 -97 -35 -68 17 -70 193 -58 -8 94 25 -121 -101 -162 -41 33 65 -47 125
4844 125 -91 60 -126 123 -102 131 41 67 49 -16 103 -187 265 -146 44 -74 -142 22 -21 -32 86 -31
4866 -31 -104 145 15 136 52 -30 -50 70 -7 60 -33 -36 104 -11 -120 -124 86 56 195 -9 -165 -92 58 118 109 -64
4892 -64 -102 -31 -11 -31 -82 -29 101 76 -205 -14 -49 5 -8 -75 65 -13 83 79 136 -18 69 3 4 -73 76 113 39 -122
4920 -122 -30 19 -20 20 57 22 126 28 -142 -47 -10 78 -26 142 -55 -41 51 -51 116 -123 6 58 -19 26 -54
4945 -54 117 -27 -16 84 -87 -77 48 -145 55 -29 82 -29 -54 67 3 147 169 -112 40 31 -12 -14 -145 132
4969 132 44 -165 -50 35 88 51 71 -78 -171 40 148 69 -34 132 -96 9 -58 100 86 -60 18 175 14
4992A4n8J73l40J98n4J93p4p0M9n2q1Q3J41j69K01j91J44k07L54k01n3P4q5J8
5016GL3P3k53J97n3JJ47r8j43p1J97oL6o7J17p0o0L9k24L7K26o7J8P1n1L2j55
5043h7R5J07k98Q0J43l03L26J22p8k27J41o5j1N2p7J1R1J6RJ73j96Kn0P0Jj01
5069e4oR2Ql4Pj28R7J56k57O4O2L3q6J31J05j14n9J14Oj21J19k06K1J35n2J5j65
5096a17J61j69K43q8q3J60pj4q4j50K01J16k16Q6o4Q3kKk18K60k34J37k1J22k34
5121a30J69j29K33j45Q2Jp4k3L1L1K9n6l7O6j00Q2j43K85k24R8J4k19Q9mL5q6
5147a25J16J03r8o4J54j89J94q2j58K02L2Mp3r5P6R9j27j38Q0mJ41p0O0o2j05
5172a29P7O2j64J30j48J19k9Q8q6j7N7l6K33j51j7J47j64J09J0j69R6R5j11J48
$$ plain form
4992 14 -44 129 -211 -13 -67 126 52 -18 31 -21 -102 -19 122 -47 154 -37 107 -100 254 53 0 74 -11 7
5016 7 40 113 -140 57 4 5 152 54 -89 -160 37 31 67 0 117 47 -13 26 -198 -161 65 -2 16 87 36 68 -87
5043 -87 8 115 -183 -103 40 -263 63 185 107 -120 21 -44 -55 -3 -80 -69 22 38 47 220 24 26 -24 46 47 -54
5069 -54 -60 32 40 6 13 -115 -18 138 -119 -55 7 40 -46 85 190 76 17 131 137 16 135 -71 -50 85 33 48 -117
5096 -117 44 -125 118 30 -53 107 100 86 2 -148 53 169 -47 39 -25 58 56 58 -160 100 -134 3 -18 104 -130
5121 -130 39 -90 143 -2 80 81 7 -16 15 46 75 19 -18 48 -52 30 -113 172 -52 46 60 -159 -70 -74 -39 -125
5147 -125 -9 94 -4 -68 86 -103 91 9 -149 53 85 89 16 -79 -3 96 -31 -169 -89 -93 48 -22 38 -24 -129
5172 -129 -52 10 -154 -24 -172 -53 -82 6 -80 -97 -40 -76 157 6 -11 136 -28 81 91 -78 18 113 2 150
5196A50l41K14j32K25r8j7M6o8K04k26J5R5k0R0j27j56J04j11J40j2L17k61N9
5219I0j53J54j6k1j25M0j11L52j79o6J50j95N5k5j7k2K4K9N6lo3M1J7N4M8k38
5245a24J34R8k3l7n4k8n5o6K9QJ51n2J41p6J4k19J38J65n7k7Nk27K00Q4K6j07
5271D1j47J21m0J82j85j65L09j07L4N5J63k13j53Q5N0m4k0M5j6j15K19j72J77
5294A04k01k2K36j15O9j17j50J91L1O1k30K3J72J29k12M3j40J42k8k4J24j01K3
5317HRM7j55j0J15K9o5N4j07L8J24p3M1n7K8O5j4Kj13K1N3Jjk08J64O6j82K12
5345I2j00Rm4M2pJ05k60J85J7j93J69k7l1PR7j21J33O1j96r8J20P7J4l5j90L10
5371A36j14j73J2J98M1j02j1j12K91l12J56RQ9m1j11R0l7o4J87q7m2L2J0j5O1
$$ plain form
5196 150 -191 23 -109 116 18 1 47 -21 183 -43 -28 67 47 137 10 -146 -42 -153 -13 -25 292 31 90
5219 90 -63 91 75 54 -71 -31 -142 210 31 -35 115 -80 -25 -50 -67 -89 -65 -36 20 17 -46 -5 12 66 114 -124
5245 -124 10 108 85 48 -6 -34 -89 -155 -126 -118 33 -19 122 46 60 -159 -21 144 87 60 65 -162 38 122 148 41
5271 41 -106 15 -25 157 -28 -193 116 9 43 98 261 48 -105 -20 30 -14 -34 11 -5 -120 99 -73 104
5294 104 -97 -119 117 2 71 -46 -196 -5 26 87 -143 -120 52 181 -31 12 -128 14 -14 -38 86 -15 8
5317 8 17 64 -91 -101 14 43 -22 32 -75 -37 87 14 55 -2 26 91 77 79 -34 -13 40 41 40 -168 -4 62 -120 92
5345 92 -8 1 -43 -1 -8 97 -163 22 39 -154 15 -12 -43 -36 61 -60 73 134 -62 -160 -40 37 51 16 -174 136
5371 136 22 -151 -139 59 100 -2 -13 -125 166 -146 10 19 108 67 -44 46 9 -55 132 45 3 35 45 30 91
5396I1q9N8l8j7J1p4jR1l0k56K63l3M9n9O8k24J0K56j59J19p0R3m4o2J56o6j26
5423h3J48M2k38K48ok6J80k90L2O0r0P6n4o0j1l2M5J38j54j8J06o1J69j43N3J1
5449D2j07Q8j37J55q8l3%q7J80J3j61K43q7L3n4p7K36o8q2j01o4J51J12l01J89
5474ej80K69J5j62L9K2j5J90r2m2n1O2k13K58r6o3N2j92K40N7o3L7j67Q7n1J79
5500A15J0j95K8K8j52J16k4r8R8lJ24r1J37l5j08Q2j0J00k69J14P7j31J58k21
5524a50K94l46K59k16J90J34k17J17m2Qk02K75j52K5r4R2J9p2J23L9J1j47k9J49
5548F8k7j20O4L2o3N0Pj00J26N6j83J25n4kJ53j77k9J21J2j02M0K40l26R3J01
5573A05n2l9r2J02j63K77k4q9j7N4k35J24L5L9j06J01p0k0OJ31K6j26J4J17j36
$$ plain form
5396 91 2 60 22 5 16 -58 -59 32 2 -254 9 -24 25 -34 34 -190 -180 76 -83 36 -34 59 15 -47 109 43 -83
5423 -83 65 107 -131 117 111 85 265 -25 7 67 -23 53 -1 -61 -72 -104 -59 79 -75 -93 13 -48 121 -22 31 42
5449 42 -65 23 -114 41 -47 -80 -80 -167 13 26 -135 108 21 54 0 -77 159 91 9 -92 -156 -5 107 -194 -5
5474 -5 -185 84 99 -63 -24 -2 -17 173 81 39 -12 50 -163 95 -1 -64 -12 -204 36 93 30 67 -100 -13 -64 115
5500 115 125 -70 -42 -14 -166 -50 -74 -172 -74 -77 47 -44 93 58 -50 32 22 122 -147 -33 44 -87 71 -150
5524 -150 144 -202 57 -159 31 165 -52 65 23 31 -171 104 -48 -23 -117 -25 -6 -78 45 84 95 -52 -81 68
5548 68 41 -79 -15 17 -46 4 11 -89 37 93 -90 35 -19 -21 132 -45 -74 47 59 -43 -3 237 -89 4 105
5573 105 53 14 -78 24 -139 138 114 25 8 62 -173 -49 -14 25 -81 20 -50 -70 -64 67 93 -33 -19 98 -38
5598c8J36k9JQ3o3j26j07J05J57K4k1j43n3Q1O1j57j4J23L2M8j45J18j02L2n0
5623d7J21j65j00K58Lp3J53M7k38O8j62K05J5N1j98M7j45J34m6J33q2jn2J36O6
5648A28K4k86J61m8j05K4J29o4L3J30m9k07P5Q1p0j82K51j39K11r1O1p9M7pj63
5673a35K61r5P2j6k08J37p3M3q6m5J19j35J05n3J66l4o1J08j72J47j58J18P5j29
5697d9q5R4O2P1j01o9O2J02q1q1L3J24p2l5Q9Kj23R6r0J2q1O4O8j34K08M6o6j84
5725a18J2lPR8kM4j48J1J59j1j17P0j01J03Oj00J23j35%J11P7N3o5Nj35M9j03
5752a10J98r5m3p8K70k53J5JJ56j70K41j67r7N0l2K08o5J6K1J19l9k57n4M1J96
5777G2m2N4K2m3Ol0O6j12R7j90J28r3L1k2j38J20Q9J08j60n9L6K15j21o1J64k05
$$ plain form
5598 -38 98 69 70 153 90 -36 -143 -38 119 143 122 -21 -74 7 68 -89 -103 20 52 100 -45 73 -29 3 -47
5623 -47 74 -91 -191 67 70 -3 150 197 -41 27 -135 70 85 136 -62 -15 -160 -26 -72 61 -21 -22 -74 62 128
5648 128 152 -134 27 -21 -126 -102 27 -37 -4 126 77 -130 -55 26 -44 -226 25 -114 97 6 67 -12 35 28 -135
5673 -135 126 31 103 87 -121 16 -57 -14 -100 -145 -26 -161 -56 -109 57 23 -38 70 -102 45 -113 5 80 -49
5697 -49 -134 -40 22 93 -8 -77 -15 87 6 -75 -42 82 10 -25 64 66 -57 39 -51 -39 -120 -56 12 -122 86 132 66 -118
5725 -118 -106 -109 -102 -4 -6 38 -110 -99 60 49 -68 2 -99 4 10 -90 33 -102 -102 9 86 139 74 79 -56 -7 -110
5752 -110 88 -7 -50 -128 142 -111 -96 -95 61 -109 132 -35 -132 -82 -114 94 29 45 66 185 146 -111 -165 -124 72
5777 72 30 84 106 63 69 39 105 -7 90 -100 28 -65 -34 -56 -194 -74 15 123 -37 -96 -60 155 34 -27 137 -68
5803f8J51l0m3L3r3J04j29J42L1k56J43P7j61k8L50r1j54m8P0L2j77O5K57j91
5827a4r3K64q9j44P5j6m6K44m59L67q2P1k30J00J37j14j0J02j0K15l60Q7o0L7
5851b8l1J19j06J00Om6L3k43J86Q1m6j56P0n0M6mP0j2n5O4J09j4m3j47J59j35
5877g3O6P7r4j82J62J96o8j01o9J11j24J41M8j12J21j07j8o4Q8o6R3O1j54J3P0
5902A5j19o8K86K2j21j70J39j4J05j11J52k16jL07k93O7P6J7p6N6J9q6J04j7o9
5927Dq4l9R6k3Q2j5p0R4n5K5l1J65j39M2m5J3M3L1j51Q2L1j28QR1j42J62k7%J0
5956C0Q0k9k5n6j17LR2M8J34j73O6j46K6J30p8k4J4NJ6L7O5p6Jj81J69Q4m6K4
5984G3k6k8l6M1P4p3J2K1l1j35K2n3M5M1o2J32J91k01n4J17j82K15o9q3l5J73
$$ plain form
5803 -68 83 53 10 43 -50 54 -75 67 98 -158 -15 62 -99 -127 223 132 -22 -70 0 32 -145 -80 177 -14
5827 -14 -107 157 68 -76 -1 -17 -63 181 -278 89 7 78 -152 -52 85 -29 -39 63 53 268 -92 -5 -65 -28
5851 -28 -59 60 -46 54 60 14 47 -196 -10 71 25 -131 -61 -111 -65 -69 1 -11 -66 -2 107 93 50 -97 62 -73
5877 -73 -7 70 -24 -206 -44 152 84 -17 -86 25 -99 42 90 -22 99 -8 -26 -90 -2 -68 25 86 -68 -55 15
5902 15 -104 -172 114 136 15 -155 -16 -30 75 -36 116 -100 -101 206 -87 -20 56 73 -3 53 72 -14 90 73 4
5927 4 -80 -119 -23 -46 36 21 -49 45 -10 15 -16 149 10 52 7 20 63 94 -57 25 56 -72 -64 27 -115 47 20 20 30
5956 30 110 81 56 0 -117 -114 -22 26 160 -13 53 -93 -67 63 -15 -39 -25 -20 -4 33 98 22 23 -158 11 95 49 73
5984 73 47 19 -17 24 98 25 37 58 27 -108 -86 -139 -94 -53 -115 17 208 7 -47 70 -112 103 34 -49 -84 89
6010H9p1j34K34l54K61j9L5J2n4J81k60J77P9j92mn6O8J50l12J56J53j05J11j45
6034@k0J38J6k01M6p7P8nJ73p0m0n2q6N6m9p4J26J2J77k24J2q6m3M04l24P5K4
6061a4J11j73O8k2K6J7J07k04P5k4P8J67j99p9J62j13j3J59l9j04m6J89j61J31
6085I9j92N3o3K04l0M7kp7j16K72k90K50K9k10J83n5o3K2J1j74J20Q6l1O2k54
6110a19J69j65J05n5J3M2L3L9J20j81J45p4q5J08r2m2J07P2j08J05k01L4q0K5
6134h5N2jJ47j15k3j2J14p9m0m7J67j14J24j52K04j32j35J9J18L5j62n3K11J12
6158A53%j63p0L1N1J52j71R5k8J74k91K50l05J32j00j2J48p0O4O7l14P3K28j17
6182b3L4K6o7k9K06l4j83J80j43J34mn1k6K8Mj87J75k77L12j17L3k19J41p5JK18
$$ plain form
6010 89 18 -116 118 -236 25 6 41 53 -1 180 -80 97 176 -16 -20 -76 -8 142 -170 -14 139 34 145 0
6034 0 -20 118 134 -67 -21 -98 -20 -25 148 78 38 -14 -100 -44 -93 -167 -41 -29 148 -76 -64 -150 -193 211 -113 -38 -14
6061 -14 97 -76 -8 -30 -4 13 120 -84 -9 -33 45 212 13 -66 96 -17 -30 129 90 -14 -60 129 -32 99
6085 99 -93 -40 -103 101 71 118 116 39 -77 195 -95 155 184 -26 157 102 39 61 72 -102 18 104 73 135 -119
6110 -119 50 -115 -10 -65 -52 -10 23 62 182 1 146 72 -13 95 3 -39 68 140 32 137 -64 -30 -110 -85
6134 -85 -33 -34 113 -2 -25 -37 77 -2 -42 -89 78 -36 88 -64 140 8 -127 -108 10 45 -117 -170 41 153
6158 153 153 -10 -80 -49 2 154 -17 78 50 224 -67 183 -122 10 -90 -102 46 -24 40 107 -207 -134 94 -23
6182 -23 11 37 -30 -59 147 113 -70 110 -33 101 97 46 20 48 52 -135 40 -237 75 -42 -9 -228 -87 -162 -161 57
6208E7o1P5j38J02j68M1Q3J14j46P5p4J72k55r3J13J91j96LJ24l4N7L8J2j77K3
6233f2m1K63j01LK7j78R4m6N0J9j5r4K11j25P3j23RJ34j35K33j18m3k5j87J02
6258g5J05J0oq6J38o2L1j57K05k56K03n4J04j68J34P7r1j20O5l7J94j57N3J41
6282A91j19q7lP8ol3M4j02j5R0n6QK0k2o7o2J02m9N1J16j9m0p4J7l1q7J44p5K97
6311B11j83P2k06N8R7Q1o3j77R5k46J52Q6JO3n9j26J46l2q3R7k0M2J31r3p3o4
6337i3N8nP9p7P7P7Q8k75J38q5R9l12L97j06n6R5k54K03o3K7j27J54L8J5j93Q6
6363a5J8O9J7j4j38JM5K9%O9j40J28j93J54j58J06N8oQ1l6lrM2r8j4n2J90j26
6391EQK9%kj1J46n8j77J28j80L0M3M1J5j85J65j44J32J10j05O3j7Rj12OP4M9L0
$$ plain form
6208 57 -4 71 -67 35 -133 -92 -9 105 -41 34 -40 132 -123 -216 -103 88 -108 -105 19 -15 42 80 92 -85 -62
6233 -62 -103 160 59 62 89 -89 5 -41 9 28 13 -81 130 5 78 -45 -36 98 -37 196 78 35 10 -177 -75
6258 -75 30 40 34 -52 86 24 55 -102 103 -153 50 -4 100 -68 66 143 52 -68 -3 -40 154 -3 50 191
6282 191 72 -15 -18 60 54 21 65 -37 -52 38 -18 -10 10 -12 -79 -141 -39 -88 -37 79 60 20 -54 -37 -68 -155 -11 -86 211
6311 211 28 100 -106 -48 49 130 67 -110 -15 -261 -109 -23 -22 41 -18 -144 2 -30 -113 -16 -36 6 137 44 -29 -93
6337 -93 -35 -40 39 -38 39 116 204 -71 67 -18 81 -231 166 60 4 99 -155 48 -15 12 -115 39 77 92 -101 -15
6363 -15 3 72 89 75 -63 -62 -17 12 12 81 -59 69 -124 30 -128 -22 36 30 111 75 72 63 105 7 -7 -59 131 5
6391 5 13 42 42 40 29 175 117 -60 68 -112 -82 -39 2 17 -168 -3 -147 -15 95 -10 53 36 45 -67 -61 13 62 92
6419I2j40L8pj37R8Q5K7r0oJ03l20K84K41k48K4j1p0J1j8q2K00l6j58J49n5J18
6445I2l9ko7M2p1KN8J85j37N9j06q2P5p6n3L0J64n2j43J78M9k5P0n9j0p4j72J74
6473A0l0O6m4J36q7M6j64J75k89K17P7Q3j17j15l3R7k1J19q0j62K11j9j29N2m2
6498d3J6J4L6k3Kn9R9r2Nm4m8L07k17R7n4N5l9j47J57m3O6R9R9j81PJ1j33M1j71
6527a83L78j39j75P7lJ89l38J85q5R0K5k04J65K7k4R3j15pm5n8J93J05j46L0m9
6552a4m3On4J18k32K08O6nn2j7L2j0L1N6o2R6M6j38n9l00J32K58j88L5O0N0n4
6579c4j2O9k2j02R4j26RJ58r8K38o4kk56M1J05LO4j15J85j57J1n0M7J09j54k2
6605h1K56k73P4J8M7L6Q9r4K8r3n1K9O5j00J40Kp4N0j27j80K82R3N2k01m2J66
$$ plain form
6419 92 -48 -10 -17 -154 -56 29 56 -34 -40 63 -257 27 268 20 44 33 -37 -26 -44 -126 74 38 -120 29 -26 92
6445 92 53 51 -16 26 -45 -43 15 200 63 122 16 -66 9 -67 -120 -90 74 22 -121 57 106 81 151 92 82 8 -164 10
6473 10 -20 46 2 138 51 97 -67 108 -181 36 113 196 79 -36 -69 28 7 126 46 -116 95 76 -53 -1 -43
6498 -43 -27 -13 23 0 2 -57 42 -50 -45 -89 -137 170 -47 50 -4 51 12 -135 22 -21 45 144 243 62 69 80 -53 -12 -183
6527 -183 195 56 -119 -42 -45 144 -194 -9 -94 -4 21 -183 -18 9 -15 78 -37 -44 -89 -147 46 151 5 35 -14
6552 -14 -57 -51 -105 13 -219 -11 55 50 -2 -19 13 3 34 90 28 124 170 32 -27 -327 -195 63 -125 -90 -30 20 -34
6579 -34 -46 23 1 -101 -7 -133 -124 34 -64 174 110 108 -148 -107 -2 1 65 -50 135 -22 -11 -61 -14 95 -59 -81
6605 -81 175 -98 -24 -6 41 77 166 72 100 7 -44 -15 50 -50 90 92 18 68 -59 -239 43 136 188 -13 -55 111
6631A11r2k7K02k87M5P1j20l8L67m02K8J63K8O1j75Q9k1J31j43M2O7j8j12J27
6655I7j03J79k81J47R3j56j9m6K07p0j59J73j25J02n2p9kJ32N1J29l20J36J01
6678A35l31M13k66J80j74R2K4j60J09j12L5J48l44K90%j39K40j25l8J28l6j3n
6701E1O2l28K57K6r2RKk16K19O2j29r8J36J05j46J8J41q3j1p2J02r2o5J64n1k7
6727e6K29j01q0K92m51O7J27P5k40J85O6p5O7j49O6rR0R7l69M52l44Rn6rJ10R7
6753I0j13m4J0OM8j52J62q5J3pP4J28J20j30N4j98M2K2LK5M7j90J10j15J24j4
6779C0J0k47J29R1lJ0Q1j12l4k0K10k08m1p7K60K5mj5p8j3R0j66Q5j22J8N7K51
6806B07k19O0j30k9O0rJ50q3R3n8o8Q5P5n9q6R9nk6L2j83J91j27j20M8L5LN3K34
$$ plain form
6631 111 19 -8 194 -93 -48 23 -97 -135 232 -170 -142 21 49 110 -65 24 3 134 -9 33 100 82 -30 97
6655 97 -6 173 -108 39 132 -24 -43 -89 118 48 -111 62 -63 39 -13 -92 -94 38 89 218 -102 34 135
6678 135 -196 217 -49 131 -43 49 73 -87 22 -90 -55 93 -251 39 39 -100 140 15 -23 105 69 56 51
6701 51 113 -215 42 68 -24 -15 -13 -229 -10 52 -77 -175 -39 66 -80 -62 79 -4 -15 -87 15 -77 -142 22 -29 -56
6727 -56 173 72 -8 284 -167 -100 27 102 -138 47 113 38 105 -44 22 13 103 200 -169 283 -61 -52 -108 -117 -7 90
6753 90 -23 -67 -57 -51 -3 -155 7 -78 -65 -72 2 130 250 120 174 -24 18 40 43 68 115 -75 35 -80 44 30
6779 30 40 -207 -78 13 10 20 101 -11 -45 -65 145 -63 -104 -181 79 104 100 85 7 -6 84 -82 3 -119 -101 -44 207
6806 207 -12 48 -82 -111 -51 -60 90 7 100 42 -26 59 134 75 -11 88 83 57 89 -94 97 -30 -150 -102 -67 -64 -11 223
6834B23l19L22j98R3r7R3r7m3P4j97M3J45J05k19Q5J3r9l4R2j0N7p6J65k55J60
6859B6k1M2m3o8L7p0Q8m4K01j78m7l9lO6N1M6P4j12N2j50L3O6k5J2q4K5J60j56
6887f1J36j46J14OOj4p3K6J06K6k10J04P6K4j27j9j07R9P5k65K17j11J79L8k31
$$ plain form
6834 223 -96 226 28 121 24 117 20 -23 51 -146 -103 42 147 -72 13 26 -73 -107 -15 -25 32 -44 121 -134 26
6859 26 5 47 4 -64 -27 -97 -9 -53 148 -30 -77 -116 -119 -53 -2 44 118 6 58 -92 -59 7 -18 -6 -90 -65 95 -61
6887 -61 75 -71 43 49 55 41 -32 -6 100 126 -84 20 96 120 -7 -26 -133 -34 41 -224 -7 -118 61 99 -132
$$ [...]
8191a05
##END NTUPLES=NMR FID
##END=
