##TITLE=1H_DE-80H_X3
 200.13MHz, d2o
 8 sc
 
 19ns.26.2.2025
##JCAMPDX= 6.0         $$ Bruker NMR JCAMP-DX V2.0
##DATA TYPE= NMR FID
##DATA CLASS= NTUPLES
##ORIGIN= UXNMR, Bruker Analytische Messtechnik GmbH
##OWNER= pz
$$ XWIN-NMR		Version 3.5
$$ Thu Apr  3 12:31:03 2025 Russian Standard Time (UT+4h)  Yarkov@DPX200
##.OBSERVE FREQUENCY= 200.1313
##.OBSERVE NUCLEUS= ^1H
##.DELAY= (6, 6)
##.ACQUISITION MODE= SIMULTANEOUS
##.ACQUISITION SCHEME= undefined
##.AVERAGES= 8
##.DIGITISER RES= 18
##SPECTROMETER/DATA SYSTEM= spect
##.PULSE SEQUENCE= zg30
##.SOLVENT NAME= DMSO
##.SHIFT REFERENCE= (INTERNAL, DMSO, 0, 14.3821)
##AUDIT TRAIL= $$ (NUMBER, WHEN, WHO, WHERE, WHAT)
$$ ##TITLE= Audit trail, XWIN-NMR		Version 3.5
$$ ##JCAMPDX= 5.01
$$ ##ORIGIN= Bruker BioSpin GmbH
$$ ##OWNER= Yarkov
$$ C:/Bruker/XWIN-NMR/data/yarkov2/nmr/H-C/1/audita.txt
$$ ##AUDIT TRAIL=  $$ (NUMBER, WHEN, WHO, WHERE, WHAT)
(   1,<2025-04-03 12:29:50.00 +0400>,<Yarkov>,<DPX200>,
      <created by zg, POWCHK disabled, PULCHK disabled
       configuration hash MD5:
       00 E9 B6 7A A2 85 ED C7 34 08 36 98 17 FE 4E 26
       data hash MD5: 16K
       3F D9 0A 13 5F AD D7 97 B7 CF CA F7 CE 90 B2 6D>)
$$ ##END=
$$ 
$$ hash MD5
$$ 37 86 36 76 B3 18 5C B4 6A 75 A7 52 F2 3B 7A 5A
##$RELAX= 
##$RELAX= 
##$RELAX= 
##$RELAX= 
##$RELAX= 
##$RELAX= 
$$ Bruker specific parameters
$$ --------------------------
##$DU= <C:/Bruker/XWIN-NMR>
##$EXPNO= 1
##$NAME= <H-C>
##$PROCNO= 1
##$TYPE= <nmr>
##$USER= <yarkov2>
##$AMP= (0..31)
100 100 100 100 100 100 100 100 100 100 100 100 100 100 100 100 100 100 
100 100 100 100 100 100 100 100 100 100 100 100 100 100 
##$AQSEQ= 0
##$AQ_mod= 1
##$AUNM= <au_zg>
##$AUTOPOS= <>
##$BF1= 200.13
##$BF2= 200.13
##$BF3= 200.13
##$BF4= 200.13
##$BF5= 200.13
##$BF6= 200.13
##$BF7= 200.13
##$BF8= 200.13
##$BYTORDA= 1
##$CFDGTYP= 0
##$CFRGTYP= 5
##$CHEMSTR= <none>
##$CNST= (0..31)
1 1 145 1 1 1 1 1 1 1 1 1 1 1 1 1 1 1 1 1 1 1 1 1 1 1 1 1 1 1 1 1 
##$CPDPRG= <>
##$CPDPRG1= <>
##$CPDPRG2= <>
##$CPDPRG3= <>
##$CPDPRG4= <mlev>
##$CPDPRG5= <mlev>
##$CPDPRG6= <mlev>
##$CPDPRG7= <mlev>
##$CPDPRG8= <mlev>
##$CPDPRGB= <>
##$CPDPRGT= <>
##$D= (0..31)
0 0.7 0 0 0 0 0 0 0 0 0 0.03 0 0 0 0 0 0 0 0 0 0 0 0 0 0 0 0 0 0 0 0 
##$DATE= 1743668989
##$DBL= (0..7)
120 120 120 120 120 120 120 120 
##$DBP= (0..7)
150 150 150 150 150 150 150 150 
##$DBP07= 0
##$DBPNAM0= <>
##$DBPNAM1= <>
##$DBPNAM2= <>
##$DBPNAM3= <>
##$DBPNAM4= <>
##$DBPNAM5= <>
##$DBPNAM6= <>
##$DBPNAM7= <>
##$DBPOAL= (0..7)
0.5 0.5 0.5 0.5 0.5 0.5 0.5 0.5 
##$DBPOFFS= (0..7)
0 0 0 0 0 0 0 0 
##$DE= 6
##$DECBNUC= <off>
##$DECIM= 32
##$DECNUC= <off>
##$DECSTAT= 4
##$DIGMOD= 1
##$DIGTYP= 9
##$DL= (0..7)
0 120 120 120 120 120 120 120 
##$DP= (0..7)
150 150 150 150 150 150 150 150 
##$DP07= 0
##$DPNAME0= <>
##$DPNAME1= <>
##$DPNAME2= <>
##$DPNAME3= <>
##$DPNAME4= <>
##$DPNAME5= <>
##$DPNAME6= <>
##$DPNAME7= <>
##$DPOAL= (0..7)
0.5 0.5 0.5 0.5 0.5 0.5 0.5 0.5 
##$DPOFFS= (0..7)
0 0 0 0 0 0 0 0 
##$DQDMODE= 0
##$DR= 18
##$DS= 0
$$ [...]
##$SUBNAM2= <"">
##$SUBNAM3= <"">
##$SUBNAM4= <"">
##$SUBNAM5= <"">
##$SUBNAM6= <"">
##$SUBNAM7= <"">
##$SUBNAM8= <"">
##$SUBNAM9= <"">
##$SW= 18.0517328524113
##$SWIBOX= (0..15)
0 0 2 0 0 0 0 0 0 0 0 0 0 0 0 0 
##$SW_h= 3612.71676300578
##$TD= 16384
##$TD0= 1
##$TE= 0
##$TE2= 300
##$TE3= 300
##$TEG= 300
##$TL= (0..7)
0 120 120 120 120 120 120 120 
##$TP= (0..7)
150 150 150 150 150 150 150 150 
##$TP07= 0
##$TPNAME0= <>
##$TPNAME1= <>
##$TPNAME2= <>
##$TPNAME3= <>
##$TPNAME4= <>
##$TPNAME5= <>
##$TPNAME6= <>
##$TPNAME7= <>
##$TPOAL= (0..7)
0.5 0.5 0.5 0.5 0.5 0.5 0.5 0.5 
##$TPOFFS= (0..7)
0 0 0 0 0 0 0 0 
##$TUNHIN= 0
##$TUNHOUT= 0
##$TUNXOUT= 0
##$USERA1= <user>
##$USERA2= <user>
##$USERA3= <user>
##$USERA4= <user>
##$USERA5= <user>
##$V9= 5
##$VALIST= <valist>
##$VCLIST= <CCCCCCCCCCCCCCC>
##$VD= 0
##$VDLIST= <DDDDDDDDDDDDDDD>
##$VPLIST= <PPPPPPPPPPPPPPP>
##$VTLIST= <TTTTTTTTTTTTTTT>
##$WBST= 1024
##$WBSW= 4
##$XGAIN= (0..3)
0 0 0 0 
##$XL= 0
##$YL= 0
##$YMAX_a= 51931
##$YMIN_a= -85753
##$ZGOPTNS= <>
##$ZL1= 120
##$ZL2= 120
##$ZL3= 120
##$ZL4= 120
##$ABSF1= 10
##$ABSF2= 0
##$ABSG= 5
##$ABSL= 3
##$ALPHA= 0
##$AQORDER= 0
##$ASSFAC= 0
##$ASSFACI= 0
##$ASSFACX= 0
##$ASSWID= 0
##$AUNMP= <proc_1d>
##$AZFE= 0.1
##$AZFW= 0.1
##$BCFW= 1
##$BC_mod= 2
##$BYTORDP= 1
##$COROFFS= 0
##$CY= 83.5205535888672
##$DATMOD= 1
##$DC= 2
##$DFILT= <>
##$DTYPP= 0
##$F1P= 10.8118882576601
##$F2P= -7.23987719738617
##$FCOR= 0.5
##$FTSIZE= 0
##$FT_mod= 4
##$GAMMA= 1
##$GB= 0.15
##$INTBC= 1
##$INTSCL= 1
##$ISEN= 128
##$LB= 0.25
##$LEV0= 0
##$LPBIN= 0
##$MAXI= 10000
##$MC2= 0
##$MEAN= 0
##$ME_mod= 0
##$MI= 1.114404
##$NCOEF= 0
##$NC_proc= 0
##$NLEV= 6
##$NOISF1= 3.799351
##$NOISF2= 2.8
##$NSP= 1
##$NTH_PI= 0
##$NZP= 0
##$OFFSET= 14.38212
##$PC= 1
##$PHC0= -1177.282
##$PHC1= -10.60774
##$PH_mod= 1
##$PKNL= yes
##$PPARMOD= 0
##$PSCAL= 0
##$PSIGN= 0
##$REVERSE= no
##$SF= 200.129724274929
##$SI= 16384
##$SIGF1= 3
##$SIGF2= 2
##$SINO= 400
##$SIOLD= 16384
##$SREGLST= <1H.CDCl3>
##$SSB= 0
##$STSI= 0
##$STSR= 0
##$SW_p= 3205.1282051282
##$SYMM= 0
##$S_DEV= 0
##$TDeff= 0
##$TDoff= 0
##$TI= <>
##$TILT= no
##$TM1= 0
##$TM2= 0
##$TOPLEV= 0
##$USERP1= <user>
##$USERP2= <user>
##$USERP3= <user>
##$USERP4= <user>
##$USERP5= <user>
##$WDW= 1
##$XDIM= 8192
##$YMAX_p= 0
##$YMIN_p= 0
$$ End of Bruker specific parameters
$$ ---------------------------------
##NTUPLES= NMR FID
##VAR_NAME=  TIME,          FID/REAL,        FID/IMAG
##SYMBOL=    X,             R,               I
##VAR_TYPE=  INDEPENDENT,   DEPENDENT,       DEPENDENT
##VAR_FORM=  AFFN,          ASDF,            ASDF
##VAR_DIM=   8192,          8192,            8192
##UNITS=     SECONDS,       ARBITRARY UNITS, ARBITRARY UNITS
##FACTOR=    0.0002768,     1,               1
##FIRST=     0,             0,               0
##LAST=      2.2672688,     0,               0
##MIN=       0,             -85753,          0
##MAX=       2.2672688,     51931,           0
$$ Real data points
##PAGE= N=1
##DATA TABLE= (X++(R..R)), XYDATA
$$ [...]
$$ plain form
1328 51 -222 90 -4 -127 -159 49 81 -88 -93 -102 55 151 154 -1 93 28 8 86 324 -37 11 -13 31 213 177 137 41
1355 41 -181 26 -128 -180 -273 -471 -280 -96 -13 -89 -32 32 42 -81 104 158 36 35 213 44 164 227 386 106
1379 106 122 201 -24 -21 -207 -13 -319 -89 0 -161 14 20 -186 105 -30 -190 5 -269 38 83 -36 102 79
1402 79 73 162 163 24 79 47 154 319 318 245 157 -116 -4 33 -204 -276 -382 -143 -189 -125 -154 -110 -141 -58 -94 -31 0 -98
1430 -98 -1 20 -2 117 116 338 337 350 55 93 32 82 -96 -73 90 65 -257 -73 -20 -78 -227 -168 -242 -64 -125 -99 -21
1457 -21 -64 37 212 169 115 29 -26 4 -48 309 45 345 180 317 118 123 -23 77 -60 -157 -32 -154 -154 -251 1
1482 1 -116 -193 -84 46 -49 -101 -174 -49 -20 88 -24 153 251 160 295 194 279 35 171 73 101 124 117 83 -3 -254
1508 -254 -183 -209 -66 -136 -64 57 -134 -191 140 -53 79 77 -78 -96 -170 -8 65 52 74 30 85 147 270 0 -38
$$ packed form
1328E1k73L12r4j23l2K08L2j69nrJ57R6Lj55R4o5k0P8K38l61M8k4M4J82l6m0r6
1355D1k22K07j54n2r3j98J91J84Q3p6N7O4J0j23J85N4j22jJ78j69J20O3J59k80
1379A06J6P9k25Lj86J94l06K30Q9j61J75Ok06K91j35j60J95k74L07M5j19J38k3
1402G9oQ9Jj39N5l2J07J65jp3q8k73J12L7k37p2j06K39m6O4k9M4l1Q3l6O3L1r8
1430i8R7K1k2J19jK22jJ3k95L8o1N0j78K3J63k5l22J84N3n8j49N9p4J78o1K6P8
1457b1m3J01J75m3n4q6n5L0n2L57k64L00j65J37j99Nj46J00j37r7J25j22%r7K52
1482Aj17p7J09J30r5n2p3J25K9J08j12J77R8r1J35j01Q5k44J36r8K8K3pl4q6k51
1508b54P1k6J43p0P2J21j91n7L31j93J32kj55j8p4J62P3j3K2m4N5O2J23k70l8
$$ plain form
1533 -38 -150 -260 -53 -30 -37 -72 -36 -4 97 97 194 50 5 -35 -47 -61 -1 -23 16 52 -46 154 30 150 127 26 -13
1560 -13 126 -51 15 188 -100 89 -110 -58 6 -251 -96 112 46 -2 -165 189 21 -172 -164 -159 162 13 -124
1583 -124 88 15 90 284 42 291 62 163 -3 -135 -183 121 -17 -44 63 -137 244 16 -33 11 -117 258
1605 258 -214 -201 -77 -24 37 -36 36 66 145 -51 -57 70 149 125 4 10 -105 18 -55 -128 -8 89 83 25 226 75
1631 75 -24 -63 -39 -129 -71 65 -153 -60 12 -31 171 -7 166 17 127 91 -37 39 -56 -20 -7 -114 -24 -50 27 -170
1657 -170 221 -73 153 -29 -21 91 -75 -68 -48 -3 -10 155 3 -31 220 9 21 173 25 38 -20 -130 -220 -109
1681 -109 114 158 -96 -96 139 114 8 -111 42 140 -104 -261 -8 -37 -11 -177 -48 -95 21 -81 -159 -41 -48 187
1705 187 106 -15 -30 37 -33 158 -13 71 -157 -77 14 118 130 265 49 -8 -51 -24 -72 5 -11 -165 -1 -81 -109
$$ packed form
1533c8j12j10K07K3pl5L6L2J01%R7j44m5m0j2j4O0k2L9L6r8K00j24J20k3j01l9
1560a3J39j77O6J73k88J89j99N2O4k57J55K08o6m8j63L54j68j93QNL21j49j37
1583a24K12p3P5J94k42K49k29J01j66j32m8L04j38k7J07k00L81k28m9M4j28L75
1605B58m72J3J24N3O1p3P2L0P9j96oJ27P9k4j21Oj15J23p3p3J20R7on8K01j51
1631G5r9l9K4r0N8J36k18R3P2m3K02j78J73j49J10l6j28P6r5L6J3j07R0k6P7j97
1657a70L91k94K26j82QJ12j66PK0M5pJ65j52l4K51k11J2J52j48J3n8j10r0J11
1681a09K23M4k54%K35k5j06j19J53R8k44j57K53k9K6j66J29m7J16j02p8J18pK35
1705A87q1j21j5O7p0J91j71Q4k28Q0R1J04J2J35k16n7m3K7m8P7j6j54J64q0k8
$$ plain form
1730 -109 94 185 99 -9 18 114 18 -211 25 -99 24 27 -26 69 163 135 -45 -89 14 -31 -127 -11 17 58 302
1755 302 15 94 55 86 57 -47 -61 63 -38 -46 -89 -2 129 -90 1 -3 -147 32 -30 -112 0 139 -23 -15 11 71
1781 71 107 -17 73 -205 65 -26 -5 -85 159 102 57 -125 6 94 -103 -67 23 154 35 113 85 170 16 -31 38
1806 38 -141 34 56 45 -188 47 98 30 210 -94 71 62 145 35 -332 -10 5 -121 -34 -6 99 3 -45 -4 41
1831 41 133 -195 -189 -208 97 -38 56 4 -20 13 32 -162 -38 212 -156 -42 46 137 117 157 -52 -29 215 -50 -107
1856 -107 42 -184 112 161 37 -15 26 -32 -77 -59 -48 87 -84 -137 23 153 132 -64 186 15 -5 -133 -90 -230
1880 -230 -45 3 -3 6 -10 202 78 53 109 -21 83 -75 -178 -104 48 -42 -3 -150 77 13 55 -56 -189 -1
1904 -1 -31 -96 -71 -44 -2 79 -138 -103 -24 40 -206 -111 115 78 41 -134 -49 -185 -214 -42 -11 47 67 29 -12 136 151
$$ packed form
1730a09K03R1q6j08K7R6r6k29K36j24J23Ln3R5R4k8j80m4J03m5r6J16K8M1K44
1755C02k87P9l9L1k9j04j4J24j01qm3Q7J31k19R1mj44J79o2q2J12J39j62QK6O0
1781G1L6j24R0k78K70r1K1q0K44n7m5j82J31Q8j97L6R0J31j19P8k8Q5j54m7O9
1806C8j79J75K2j1k33K35N1o8J80l04J65rQ3j10l67L22J5j26Q7K8J05r6m8M1M5
1831D1R2l28Oj9L05j35R4n2k4L3J9j94J24K50l68J14Q8R1k0M0k09K3K44k65n7
1856a07J49k26K96M9j24n2M1n8m5J8J1J35j71n3J60J30k1j96K50j71k0j28M3j40
1880b30J85M8oRj6K12j24k5N6j30J04j58j03P4J52r0L9j47K27o4M2j11j33J88
1904al0o5K5K7M2Q1k17L5P9O4k46R5K26l7l7j75Q5j36k9J72L1N8K0l8m1J48J5
$$ plain form
1931 151 103 77 -114 -234 -51 -189 -7 -123 -20 84 94 -197 93 113 31 -54 -263 74 -15 82 -108 108 66
1954 66 82 115 -75 78 171 32 24 -13 121 36 -142 -90 93 216 -91 -81 -12 37 -36 -105 -18 -46 -91 142 -96 12
1980 12 -179 1 73 -44 -103 49 -190 -320 -29 -7 20 96 35 112 -152 -60 23 25 111 101 -55 -127 -4 208 32
2005 32 -98 -36 37 -10 57 52 158 62 -134 9 -198 -19 -280 -98 13 -53 140 86 -12 -110 -78 33 232 -18
2029 -18 -117 94 -14 -14 -157 117 151 71 -35 -90 -119 21 -69 -54 -124 -41 18 87 19 5 33 14 -175 39 22 -84
2055 -84 -94 79 37 139 -18 -195 -146 251 89 -90 -152 32 -15 -24 -167 -31 26 -66 -96 -78 118 -8 -83 129
2079 129 71 0 141 -178 -121 73 27 -39 -121 -132 -11 206 8 19 100 97 115 31 119 13 115 -4 -71 -167 14
2104 14 1 79 34 -107 -124 169 -131 -38 178 173 -136 44 -72 38 113 24 -110 106 105 -99 85 -69 -117 -4
$$ packed form
1931A51m8k6j91j20J83j38J82j16J03J04J0k91K90K0q2q5k09L37q9R7j90K16m2
1954F6J6L3j90J53R3j39ql7J34q5j78N2J83J23l07J0O9M9p3o9Q7k8m5K33k38J08
1980A2j91J80P2j17n9J52k39j30K91K2K7P6o1P7k64R2Q3KQ6j0j56p2J23K12j76
2005C2j30O2P3m7O7nJ06r6j96J43k07J79k61J82J11o6J93n4r8r8L2J11J99k50
2029a8r9K11j08%j43K74L4q0j06n5k9J40r0J5p0Q3N9O9o8j4K8j9j89K14j7j06
2055h4j0J73m2J02j57j77M9L97j62j79o2J84m7rj43J36N7r2l0J8J96j26p5K12
2079A29n8p1J41l19N7J94m6o6q2j1J21K17j98J1Q1lJ8q4Q8j06J02j19o7r6J81
2104A4j3P8m5j41j7K93l00R3K16nl09J80j16J10P5q9j34K16jk04J84j54m8J13
$$ plain form
2128 -4 77 -32 215 3 70 -63 75 -105 -11 43 160 128 21 -86 60 -126 26 66 16 -71 85 96 -113 -23
2152 -23 -49 -189 80 30 134 134 27 10 44 -152 96 -129 -8 -10 107 218 -25 140 37 5 78 -173 -24 -73
2176 -73 39 -29 -48 158 -58 -163 71 -78 122 -16 -58 -12 -146 8 -111 50 -109 -159 -34 -32 58 107 -133
2199 -133 -4 32 106 -130 -148 -71 -23 74 75 64 -173 -22 52 74 -49 -26 -23 21 -51 8 -113 40 -138 -12 -134 -55
2225 -55 32 -1 -185 24 105 116 -14 112 -104 -121 -21 59 -57 -51 -60 -72 93 -94 33 7 99 25 -85 151 8
2250 8 -35 58 -89 -167 52 -1 -161 -124 50 44 49 86 18 -18 -132 -6 -2 -16 -14 -135 45 102 88 -133 -72 155 0
2277 0 103 52 -33 88 33 5 -147 69 -38 32 -102 7 85 -82 -76 -188 -101 -148 -30 41 156 -244 220 -35
2301 -35 -72 -66 8 -97 -145 37 65 139 -4 111 69 -55 127 162 -43 -207 76 7 86 -20 -32 -252 -78 -231
$$ packed form
2128dQ1j09K47k12O7j33J38j80R4N4J17l2j07j07J46j86J52M0n0q7J56J1k09R0
2152b3k6j40K69n0J04%j07j7L4j96K48k25J21kJ17J11k43J65j03l2P3k51J49m9
2176g3J12o8j9K06k16j05K34j49K00j38m2M6j34J54j19J61j59n0J25KR0M9k40
2199a33J29L6P4k36j8P7M8R7Jj1k37J51P4K2j23K3LM4p2N9j21J53j78J26j22P9
2225e5Q7l3j84K09Q1J1j30J26k16j7J00Q0j16Orj2J65j87J27k6R2p4j10K36j43
2250Hm3R3j47p8K19n3j60L7J74oNL7o8l6j14J26Mj4Kj21J80N7j4k21O1K27j55
2277@J03n1q5J21n5k8j52K16j07P0j34J09P8j67Oj12Q7m7J18P1J15m00M64k55
2301c5l7OP4j05m8J82K8P4j43J15m2j24J82L5k05j64K83o9P9j06j2k20J74j53
$$ plain form
2325 -231 -111 92 -55 -67 50 -35 84 141 -58 144 33 -16 -68 16 -5 19 205 120 31 82 89 52 -4 10 -169
2350 -169 105 -101 8 34 103 -115 21 -86 129 -29 106 104 9 144 47 -43 -54 -4 -32 -50 -161 -15 69 -8
2374 -8 202 53 251 94 -121 55 192 -48 -95 20 1 -74 -30 71 -45 -74 179 -79 -11 29 23 181 85 -60
2398 -60 38 10 -150 18 45 60 -288 51 -61 -197 -40 28 39 -52 -9 -21 35 -32 -155 95 -114 -16 -81 95 -79
2423 -79 -34 42 -44 -104 -17 154 73 -32 52 -68 -181 58 61 1 96 10 161 91 -178 33 -17 -198 41 -92 -28
2448 -28 -24 66 -48 -91 -10 66 225 -55 -10 74 -143 -118 15 -38 61 -13 -62 -154 -151 57 -50 -91 126 121 -130 191 -135
2475 -135 8 -4 11 -79 -66 22 -11 114 -56 -43 -5 193 175 -1 -6 -66 41 -51 125 -25 -65 -110 35 -3 -24 202
2501 202 91 95 18 40 27 -106 -58 -136 -74 -20 -40 58 -136 -139 -112 145 -57 18 25 -70 -74 -108 37 -83 -133 -36 -34 17 -76
$$ packed form
2325b31J20K03j47j2J17q5J19N7j99K02j11m9n2Q4k1K4J86q5q9N1Pl7n6J4j79
2350a69K74k06J09K6O9k18J36j07K15j58J35kr5J35r7r0j1N0k8j8j11J46Q4p7
2374hK10j49J98j57k15J76J37k40m7J15j9p5M4J01j16k9K53k58O8M0oJ58r6j45
2398f0R8k8j60J68K7J5l48L39j12j36J57O8J1r1M3j2N6o7j23K50k09R8o5J76j74
2423g9M5P6q6o0Q7J71q1j05Q4j20j13K39Lo0R5q6J51p0k69K11n0j81K39j33O4
2448b8MR0j14m3Q1P6J59k80M5Q4k17K5J33n3R9p4m9r2LK08j07m1K17nk51L21l26
2475a35J43j2J5r0J3Q8l3J25j70J3L8J98j8j76no0J07r2J76j50m0m5J45l8k1K26
2501B02j11Mp7K2j3j33M8p8O2N4k0R8j94lK7K57k02P5Pr5ml4J45j20n0R7KN1r3
$$ plain form
2530 -76 -58 -129 -21 -7 -16 21 141 38 11 -75 -8 -4 52 20 131 96 -101 -37 -74 78 -113 -117 15 -32 -14 18 -105
2557 -105 137 10 84 54 8 153 -109 -14 81 217 -71 -71 -41 107 236 -135 7 85 84 80 -19 -95 199 127 -120
2582 -120 110 158 -108 -57 -84 80 62 1 61 116 -8 14 -64 -12 0 68 102 71 -47 -2 112 59 112 -9 -56 -203
2608 -203 63 47 59 -180 -71 -125 -117 11 -38 -47 -84 10 1 -160 -14 52 88 -23 57 -54 148 223 -217 60 -97
2633 -97 15 61 -69 -28 -85 -37 11 58 -61 50 -75 -146 65 25 204 -37 210 -83 -20 -99 -195 -1 128 -17
2657 -17 -87 34 93 84 -134 -76 -21 52 138 -29 12 183 -39 10 -37 27 108 -122 -130 55 62 -216 109 4 119 9
2683 9 56 -290 11 14 -12 -66 51 -85 -149 71 -63 -26 -38 -21 -76 91 9 45 85 10 124 -35 -112 9 -9 36
2709 36 -63 62 50 195 31 -106 176 44 54 -110 -92 61 -101 4 -17 -20 -244 107 128 -3 49 -70 91
$$ packed form
2530g6J8p1J08J4rL7J20j03k7q6O7MN6l2J11l5j97O4l7J52j91mJ32m7J8L2j23
2557a05K42j27P4l0m6J45k62R5R5J36k88%L0J48J29l71J42P8jmr9p6K94p2k47
2582a20K30M8k66N1k7J64j8o1O0N5j24K2p8N2J2O8L4l1j18M5J14n3N3j21m7j47
2608b03K66j6J2k39J09n4QJ28m9rl7R4rj61J46O6L6j11Q0j11K02P5m40K77j57
2633i7J12M6j30M1n7M8M8M7j19J11j25p1K11m0J79k41K47k93O3p9r6J94J29j45
2657a7p0J21N9rk18N8N5P3Q6j67M1J71k22M9m7O4Q1k30qJ85Pk78L25j05J15j10
2683IM7l46L01Lk6n4J17j36o4K20j34L7j2J7n5J67q2L6M0p5J14j59p7J21j8M5
2709C6r9J25j2J45j64j37K82j32J0j64J8J53j62J05k1lk24L51K1j31N2j19J61
$$ plain form
2732 91 87 31 -145 -16 -38 7 20 -45 -159 -76 152 -2 -35 194 -40 -5 -44 7 78 -9 -68 97 -140 -34 152
2757 152 -94 11 107 -17 99 102 -43 12 -11 -76 -58 46 -77 -78 8 42 -83 -20 66 34 -156 5 -53 49 -23
2782 -23 -24 46 -69 57 91 -111 0 -61 -102 -18 -3 -84 -62 11 -74 111 -85 107 -128 138 -111 -83 193 91 -38
2807 -38 -128 -175 -50 -70 -64 -92 -29 -63 1 45 142 -56 -1 -52 78 -60 -17 -53 113 -35 79 -68 100 126 -27 120
2833 120 -8 188 17 22 -71 70 -127 129 -80 170 -91 -3 68 -52 38 39 -63 -67 145 8 11 111 -39 49
2857 49 -144 146 63 -42 -90 117 -100 -17 -135 -88 43 73 55 118 -58 2 -105 -14 71 -8 175 24 -28 73
2881 73 33 146 -54 -63 -43 55 -56 -8 107 49 -85 -170 -67 9 -64 76 -42 216 -78 85 81 22 -60 -49 -70 117
2907 117 24 -101 97 210 -24 133 129 6 22 40 12 219 -27 -145 -119 -7 -50 -51 -14 -60 40 -98 27 -51
$$ packed form
2732I1mn6j76J29k2M5J3o5j14Q3K28j54l3K29k34L5l9N1P1q7n9J65k37J06J86
2757A52k46J05R6j24J16Lj45N5k3o5J8J04j23jQ6L4j25O3Q6l2j90J61n8J02p2
2782b3jP0j15J26L4k02J11o1m1Q4J5q1K2P3q5J85j96J92k35K66k49K8K76j02j29
2807c8r0m7J25k0Ok8O3l4O4M4R7j98N5n1J30j38M3l6J66j48J14j47J68K6j53J47
2833A20j28J96j71Nr3J41j97K56k09K50k61Q8P1j20R0Jj02mK12j37LJ00j50Q8
2857D9j93K90q3j05m8K07k17Q3j18M7J31L0j8O3j76O0j07R1Q5p9J83j51n2J01
2881G3m0J13k00rK0R8j11M8J15n8j34q5J03P6p3J40j18K58k94J63mn9q2J1k1J87
2907A17r3j25J98J13k34J57mj23J6J8k8K07k46j18K6J12m3jL7m6J00j38J25p8
$$ plain form
2931 -51 4 -26 51 57 45 8 25 -35 -81 -78 -29 148 44 -35 141 -72 -113 53 -13 64 37 50 46 -16 -67 -20 -33 -25 137
2960 137 71 34 -24 -2 68 71 18 87 37 -146 -105 48 -64 23 -150 -65 -73 14 83 -5 -20 239 92 151 63 131 3
2987 3 -51 22 -72 119 64 9 54 16 -68 -134 88 -56 4 -134 -55 78 42 -15 -68 -54 105 -66 31 -209 -16 -119
3013 -119 -157 -42 64 -110 120 -118 62 -53 17 3 -143 -38 179 -18 -104 43 -29 91 -2 11 -5 66 -38
3036 -38 -31 -57 97 94 -13 -79 2 -8 -32 105 58 5 80 -34 37 -148 -61 39 90 61 -44 15 -12 41 137 -116 81
3063 81 61 -81 -215 -137 -84 -253 72 -9 -10 -47 165 -100 -93 -168 -154 -38 -28 216 -37 103 75 -23 260 -143 -18
3088 -18 97 18 -52 -131 99 -76 105 64 -51 -11 -128 -59 12 42 72 31 31 55 -32 -131 -36 20 52 2 -65 -80 -33 -39
3116 -39 37 28 34 -128 -73 -78 -123 159 18 104 -29 37 63 -49 18 -74 -27 11 183 -54 49 -52 -67 13 -15 -54 -83
$$ packed form
2931e1N5l0P7Oj2l7J7o0m6LM9J77j04p9J76k13m1J66o6P7k7J3mo2n1M7j3QJ62
2960A37o6l7n8K2P0Ln3O9n0j83M1J53j12Q7j73Q5qQ7O9q8j5K59j47N9q8O8j28
2987Cn4P3r4J91n5n5M5l8q4o6K22j44O0j38P9J33l6n7n3J4J59j71R7k40J93j03
3013a19l8J15J06j74K30k38J80j15P0j4j46J05K17j97q6J47p2J20r3J3j6P1j04
3036c8Pk6J54lj07o6Q1j0k4J37m7n3P5j14P1j85Q7J00N1k9j05N9k7N3R6k53J97
3063H1k0j42j34P8N3j69L25q1jl7K12k65Pp5J4J16J0K44k53J40k8r8K83m03J25
3088a8J15p9p0p9K30j75J81m1j15M0j17O9P1L0L0m1%K4q7r9R5N6L2n0o7j5M7o
3116c9P6rOj62N5nm5K82j41Q6j33O6K6j12O7r2M7L8J72k37J03j01j5Q0k8l9k9
$$ plain form
3143 -83 -82 91 -128 -77 18 -69 75 22 205 -99 -37 98 -5 -10 -44 233 -69 30 97 -61 -87 -63 -89 -25 -71 -82
3169 -82 -74 -111 26 -70 23 25 -50 25 89 97 -91 -108 21 -132 -4 -161 -24 -39 43 -31 -61 56 98 -31 -66 109 -1
3196 -1 -30 -41 -8 162 182 19 -91 74 -152 -103 -153 -213 -56 -63 -30 -64 54 28 -137 -69 23 35 -21 22 40 130 -38
3223 -38 -37 -7 2 44 68 -18 15 98 -49 8 -66 -158 -90 63 81 39 -276 -113 60 -17 41 -103 -11 160 274 158 -32
3250 -32 75 14 -172 -123 -142 -46 66 -110 2 1 26 91 42 -38 135 -1 -75 -144 28 -65 -136 -124 -205 -138 56 33
3276 33 14 86 -150 -30 -27 106 25 -54 129 94 41 -47 -60 -18 64 -100 81 -67 -38 -53 -12 -129 99 46 -72 84
3302 84 -131 86 -62 17 26 -55 124 -18 -129 -146 151 -136 -57 131 -82 6 -54 -90 -149 -91 134 115 -79 108
3326 108 -32 -26 -126 -108 47 69 58 -46 -15 -45 -29 93 31 52 -28 82 50 -92 91 60 -36 231 15 30 -9
$$ packed form
3143h3JJ73k19N1R5q7J44n3J83l04O2J35j03nl4K77l02R9O7j58k6K4k6O4m6j1
3169h2Ql7J37r6R3Kp5P5O4Qj88j7J29j53J28j57J37j5Q2p4l0J17M2j29l5J75j10
3196ak9j1L3J70K0j63j10J65k26M9n0o0J57pL3l4J18k6j65O8R2J2n6M3J8R0j68
3223c8JL0RM2K4q6L3Q3j47N7p4r2O8J53J8m2l15J63J73p7N8j44R2J71J14j16j90
3250c2J07o1j86M9j9R6J12j76J12jK5O5m9q0J73j36p4o9J72r3p1J2q1O7J94k3
3276C3j9P2k36J20LJ33q1p9J83l5n3q8j3M2Q2j64J81j48K9j5M1j17K28n3j18J56
3302H4k15K17j48P9Rq1J79j42j11j7K97k87P9J88k13Q8o0l6n9N8K25j9j94J87
3326A08j40Oj00J8J55K2j1j04L1l0J6J22o2K1q0J10l2j42J83l1r6K67k16J5l9
$$ plain form
3351 -9 97 -76 -94 22 17 -115 -114 64 -41 26 43 82 -116 14 150 -51 -66 115 89 -162 -199 168 85 -21 -53
3376 -53 25 -58 -9 -47 -215 -164 130 93 9 -66 -167 -41 239 -107 -10 145 68 88 -2 -11 76 76 130 148 33 178 132
3403 132 -209 -70 104 35 149 63 -14 27 41 144 55 -150 -59 -47 51 92 49 4 117 16 151 107 -19 91
3427 91 -44 149 123 -75 -150 64 -92 55 25 -26 80 193 -98 -28 21 -23 54 129 -28 16 21 -62 155 44 115
3452 115 102 85 151 -55 -86 -110 11 -7 -3 -34 157 -7 -173 -55 -14 -40 71 -76 15 4 -4 -99 74 -165 6
3477 6 -132 -247 63 60 53 77 -117 -127 -73 -63 42 -59 -53 84 -40 -118 -50 15 16 -76 -155 130 22 -60 141 4 -18
3504 -18 -19 -121 67 25 -235 -116 -13 2 93 -73 -135 -2 -44 2 99 40 88 -105 -24 -18 178 47 -23 -33 -66 -55
3530 -55 152 -160 -42 54 63 32 10 -89 -74 -40 -120 -84 -33 159 75 95 -23 -80 40 100 -127 6 96 -55 63 108
$$ packed form
3351iJ06j73j8J16nj32JJ78j05O7J7L9j98J30J36k01j5J81k6k51l7L67q3j06l2
3376e3P8q3M9l8j68N1K94l7q4p5j01J26K80l46R7J55p7K0r0rQ7%N4J8j15J45m6
3403A32l41J39J74o9J14q6p7M1J4J03q9k05R1J2R8M1m3m5J13j01J35m4j26J10
3427I1j35J93k6j98p5K14j56J47l0n1J06J13k91P0M9m4P7P5j57M4Nq3K17j11P1
3452A15j3j7O6k06l1k4J21j8Ml1J91j64j66J18M1k6J11j47R1j1qr5J73k39J71
3477Fj38j15L10lpK4j94j0N4J0J05j01OJ37j24p8O8O5Jr2p9K85j08q2K01j37k2
3504a8jj02J88m2k60J19J03J5R1j66o2J33m2M6R7n9M8j93Q1OJ96j31p0j0l3J1
3530e5K07l12J18R6Rl1k2r9J5L4q0L6N1J92q4K0j18n7J20O0k27J33R0j51J18M5
$$ plain form
3556 108 -6 56 3 -72 0 20 69 182 -46 30 -201 -21 38 -74 169 66 53 47 -10 14 80 8 116 56 0 -49
3582 -49 -62 -42 -53 -130 83 -17 -4 75 -46 165 -59 79 -150 -137 -52 101 -17 -30 81 -94 1 5 -119 6
3606 6 94 -7 -94 -93 3 37 -8 34 57 104 2 -179 -36 -142 -224 15 -197 -33 -146 -126 45 10 16 -4 74 9 -116
3633 -116 -4 -54 -128 141 -32 2 -42 83 62 -169 -38 -68 -95 -112 -21 64 34 46 -71 -50 -135 124 -27 158 -25
3658 -25 14 24 51 -60 23 45 99 9 191 196 -21 135 -124 100 1 -105 -122 229 11 -94 16 121 104 19 14
3683 14 -68 71 72 55 -42 -100 30 13 48 64 -55 90 51 1 -56 1 266 100 55 -116 125 35 -64 -76 -172 -83 83
3710 83 223 -69 -97 7 56 270 200 -98 20 101 -169 39 106 7 36 -30 -3 53 55 -92 -69 -180 -160 -151 -27 -160
3736 -160 -103 -210 -45 56 55 28 -165 7 -112 -22 31 71 -70 -122 -51 -11 18 -79 -24 -108 -99 -25 87 -50 113 -18
$$ packed form
3556A08j14O2n3p5P2K0M9J13k28P6k31J80N9j12K43j03j3on7K4O6p2J08o0n6m9
3582d9j3K0j1p7K13j00J3P9j21K11k24J38k29J3Q5J53j18j3J11j75R5Mj24J25
3606FQ8j01q7JR6L4m5M2K3M7j02j81J43j06q2K39k12J64j13K0J71l5Ok0P8o5j25
3633a16J12n0p4K69j73L4m4J25k1k31J31l0k7j7R1Q5l0J2j17K1q5K59j51J85j83
3658b5L9J0K7j11Q3K2N4r0J82Nk17J56k59K24r9j06j7L51k18j05J10J05j7q5n
3683A4q2J39Jj7r7n8J30j7L5J6j19J45l9n0n7N7K65j66m5j71K41r0r9j2r6Q9J66
3710H3J40k92k8J04M9K14p0k98J18Q1k70K08O7r9K9o6K7N6Kj47K3j11K0RJ24j33
3736a60N7j07J65J01jk7j93J72j19R0N3M0j41n2P1M0K9r7N5q4RP4J12j37J63j31
$$ plain form
3762 -18 -70 -18 -135 6 -34 -21 39 60 51 66 -53 -70 79 -45 -53 -11 -50 97 113 -16 39 -125 -233 -30 -186 29
3788 29 -26 45 54 64 -45 -26 30 128 4 -20 56 -7 -216 87 46 -14 123 31 -7 85 -133 -4 22 16 -7 170 104
3815 104 -264 186 -36 72 55 -55 32 100 21 -27 175 40 69 5 95 34 -84 139 37 7 54 265 -92 -57
3839 -57 138 91 -86 -76 170 4 -92 77 -89 148 -63 91 79 -1 -178 -75 147 61 -143 -89 85 203 -28
3862 -28 41 -58 -162 69 82 -42 -24 -7 37 -67 133 176 23 73 -135 59 -220 24 4 161 81 158 103 -62
3886 -62 -47 -20 -114 84 -158 -41 12 188 44 -61 20 8 -188 -112 -52 -253 -117 -23 209 -123 116 -40 -81 38
3910 38 81 36 95 -151 -177 64 -73 78 154 43 39 -57 -24 4 84 -148 -47 11 -13 -28 -107 138 -64 -92 -150 -104
3936 -104 -115 31 -55 -137 -25 25 -12 -139 102 -1 -61 12 30 -69 46 104 33 104 90 -50 -1 53 27 21 -30 52 58
$$ packed form
3762a8n2N2j17J41m0J3O0K1rJ5j19j7J49j24qM2l9J47J6j29N5j64j08K03j56K15
3788B9n5P1RJ0j09J9N6R8j24k4P6o3k09L03m1o0J37r2l8R2k18J29K6ok3J77o6
3815A04l68M50k22J08j7j10Q7O8p9m8K02j35K9o4R0o1j18K23j02l0M7K11l57L5
3839e7J95m7j77J0K46j66r6J69j66K37k11J54j2q0j77J03K22q6k04N4J74J18k31
3862b8O9r9j04K31J3j24J8J7M4j04K00M3j53N0k08J94k79K44k0J57q0P7n5j65
3886f2J5K7r4J98k42J17N3J76j44j05Q1j2j96P6O0k01J36R4K32l32K39j56m1J19
3910C8M3m5N9k46k6K41j37J51P6j11mr6L3K8Q0k32J01N8k4j5p9K45k02k8n8M6
3936a04j1J46q6q2J12N0l7j27K41j03o0P3J8r9J15N8p1P1j4j40M9N4k6on1Q2O
$$ plain form
3963 58 102 95 113 115 61 -125 -91 6 4 115 76 28 4 101 -62 161 3 -95 -7 108 -111 -132 -70 154 -131 -4 60
3990 60 29 -195 -29 -140 32 -50 -4 121 36 97 -126 148 -119 186 91 -124 56 94 -47 70 65 -68 112
4013 112 78 92 -61 24 19 -22 99 113 -67 26 -75 16 -117 -168 -114 -65 -43 -94 -37 -109 -49 -82 107 -17 -37 77
4039 77 161 -26 -56 -59 6 -115 63 80 121 107 -78 58 8 -74 156 6 -64 151 138 63 -72 -78 -121 -56 150 74
4065 74 -50 8 112 24 91 -12 -94 79 -6 17 -33 -58 62 -47 0 -16 34 43 30 -49 53 184 -44 55 1 -2 60
4092 60 -30 85 231 209 -77 -68 -68 -17 8 -14 21 68 -102 -192 -155 -51 50 121 31 109 -42 68 -20 4 -16 7 131
4119 131 144 80 -104 -4 -33 -49 26 37 -35 166 -87 -88 121 28 -62 45 50 -166 214 13 -15 -36 -111 -97 -178 -39
4145 -39 -48 -116 23 -80 68 -69 -2 -72 -92 -44 -116 22 10 8 -5 -105 -84 -134 -212 65 44 -166 -33 92 -63 18
$$ packed form
3963E8M4pJ8Kn4j86L4R7kJ11l9m8k4R7j63K23j58r8Q8J15k19k1O2K24k85J27O4
3990F0l1k24J66j11J72q2M6J25q5O1k23K74k67L05r5k15J80L8j41J17nj33J80
4013A12l4J4j53Q5nm1J21J4j80R3j01R1j33n1N4M9K2n1N7p2O0l3J89j24k0J14
4039G7Q4j87l0lO5j21J78J7M1j4j85J36n0q2K30j50p0K15j3p5j35om3O5K06p6
4065G4j24N8J04q8O7j03q2J73q5K3n0k5J20j09M7j6N0Rj3p9J02J31k28R9n4lO2
4092F0r0J15J46k2k86R%N1K5k2L5M7j70r0L7J04J01P1r0P8j51J10q8K4k0K3J24
4119A31J3o4j84J00k9j6P5J1p2K01k53jK09r3r0J07Nk16L80k01k8k1p5J4q1J39
4145c9ro8J39j03J48j37O7p0k0M8p2J38j2kj3j00K1n0p8K77k1k10J33J25j55Q1
$$ plain form
4171 18 186 -187 -12 28 -39 110 -143 24 -93 36 60 -91 124 41 18 4 -36 50 -87 -156 -139 123 10 16
4195 16 -35 71 15 -5 65 -38 -36 167 -41 -48 -151 -84 15 -82 0 -33 -84 117 172 50 27 13 65 -146 232 70
4221 70 47 46 -167 46 -71 65 160 82 17 52 -34 -257 141 -39 -103 112 -151 53 -56 94 94 111 119 42 -24 -51
4247 -51 -107 -89 39 81 246 38 67 -3 -44 91 -51 -36 108 -68 -68 0 48 -20 17 134 143 133 -27 102 100 35 -131
4274 -131 -81 116 -194 -144 86 70 -22 -92 -184 -73 -38 116 92 -120 134 -7 -127 154 -27 32 -7 -57 79 -6
4298 -6 4 55 -36 34 53 -17 -137 -80 -114 48 -182 -62 -64 88 0 -157 68 -209 -47 15 187 -25 112 19 29
4323 29 -174 32 15 47 45 -35 91 31 -121 -26 -119 101 35 -106 81 17 -59 41 -112 -26 -51 18 14 101 -24 -42
4349 -42 3 15 -6 -44 -21 -54 57 45 4 72 -103 -80 -196 107 -64 80 -107 89 -46 -19 67 107 -48 -55 -112 -42
$$ packed form
4171A8J68l73J75M0o7J49k53J67j17J29K4j51K15q3k3j4m0Q6j37o9J7K62j13O
4195A6n1J06n6k0P0j03KK03k08pj03O7R9r7Q2l3n1K01N5j22k3j4N2k11L78j62
4221G0k3jk13K13j17J36R5p8o5L5q6k23L98j80o4K15k63K04j09J50%J7Qp7o6k7
4247e1n6J8J28M2J65k08K9p0m1J35j42J5J44j76%O8M8o8L7J17Rj0j60J29ko5j66
4274a31N0J97l10N0K30j6r2p0r2J11L5J54k4k12K54j41j20K81j81N9l9n0J36q5
4298fJ0N1r1P0J9p0j20N7l4J62k30J20kJ52q8j57K25k77J62O2J72k12J37r3J0
4323B9k03K06j7L2kq0J26o0j52R5r3K20o6j41J87o4p6J00j53Q6k5O9mQ7j25j8
4349d2M5J2k1l8K3l3J11j2m1O8j75K3j16L03j71J44j87J96j35K7Q6M0j55pn7P0
$$ plain form
4375 -42 5 -82 -29 231 60 -218 45 -7 -53 -5 89 48 -76 -39 -86 -100 -9 84 -25 81 141 -68 35 10 21 -60
4401 -60 69 2 8 -91 11 -99 -67 -25 -90 -30 -66 69 -66 28 -43 -33 -93 15 -103 34 -99 -179 126 38 -64
4426 -64 -106 164 46 16 -48 -69 95 -205 88 -198 177 13 -118 79 -46 -53 -55 -50 39 128 69 120 100 25 -90 22
4452 22 -70 -174 -17 187 -6 -62 115 -116 -29 -86 -36 -28 87 43 86 -9 -87 -49 -31 -51 104 200 -3 3 54 -104
4478 -104 -71 -14 91 17 -181 -7 69 -104 47 106 -266 -67 115 -47 114 112 170 -40 -114 -88 188 18 73 -56
4502 -56 24 -76 -78 -51 -187 -277 -188 -43 -142 -65 -112 18 13 109 97 -112 -6 -17 -121 128 45 -122 67 27 -124 -58
4528 -58 139 -5 34 -153 -119 86 152 30 -56 127 95 55 -10 -9 23 11 32 53 13 14 -60 -47 113 54 -2 -1 -34 5
4556 5 -19 -16 -149 54 -184 -80 34 43 53 95 39 -257 54 -46 -37 -57 28 -3 -15 19 30 -7 93 -92 177 -18
$$ packed form
4375d2M7q7N3K60j71k78K63n2m6M8R4m1j24L7m7j4R1R3j09J06O0k09J03k5J1q1
4401f0J29o7Or9J02j10L2M2o5O0l6J35j35R4p1J0o0J08j18J37j33q0L05q8j02
4426f4m2K70j18l0o4k1J64l00K93k86L75j64j31J97j25pkNQ9Q9n9N1k0p5j15J12
4452B2r2j04J57K04j93n6J77k31Q7n7N0QJ15m4M3r5p8L8J8k0J55R6k03ON1j58
4478a04L3N7J05p4j98J74P6j73J51N9l72J99J82j62J61kN8k10p4K6K76j70N5j29
4502e6Q0j00kK7j36r0Q9J45r9P7m7J30nR6j2k09J06j1j04K49q3j67J89m0j51O6
4528e8J97j44L9j87L4K05O6j22q6J83l2m0o5JL2j2K1K1m0Jp4J3J60n9n6Jl3L9
4556Ek4Lj33K03k38J04J14RJ0M2n6k96L11j00Rk0Q5l1j2L4J1l7J00j85K69j95
$$ plain form
4582 -18 -5 -29 -17 -6 -34 -239 -16 -16 26 -147 32 -180 -96 45 -57 15 -64 122 -108 16 2 26 8 -19 -69 -64
4608 -64 -224 109 -59 -61 64 -21 -128 59 76 141 -172 45 35 13 -92 -40 29 145 16 110 -25 53 -93 -67
4632 -67 -96 -150 40 148 -75 169 16 -135 67 209 79 34 -74 14 186 -60 -68 -6 -19 94 43 -160 61
4655 61 6 78 18 -13 -8 121 -79 23 -111 61 197 -286 82 39 -112 34 22 181 -108 -133 -87 -154 -8 -185
4679 -185 84 19 -76 -24 -28 30 4 87 -38 158 -202 37 -110 12 5 15 146 101 115 115 25 -84 63 -5 74 23
4705 23 57 -11 21 -26 -43 1 -136 -48 66 134 6 194 -53 54 62 28 -129 20 189 140 164 -46 37 -5 -107
4730 -107 44 24 40 17 -120 31 130 171 -48 -17 56 -109 29 18 -51 -60 117 -8 25 87 -129 66 139 51 -30
4755 -30 -161 -111 -34 156 -16 -170 36 41 108 -116 29 81 35 7 115 162 -5 -128 88 -77 86 51 -90 10
$$ packed form
4582a8J3k4J2J1k8k05K23%M2j73J79k12Q4J41j02P2p9J86k30J24j4K4j8k7n0N
4608f4j60L33j68kJ25q5j07J87J7O5l13K17j0k2j05N2O9J16j29R4j35P8j46K6
4632f7k9n4J90J08k23K44j53j51K02J42j30m5j08Q8J72k46qO2j3J13n1k03K21
4655F1n5P2o0l1NJ29k00J02j34J72J36m83L68m3j51J46j2J59k89k5M6o7J46j77
4679a85K69o5r5N2mN8k6Q3j25J96l60K39j47J22pJ0J31m5J4%r0j09J47o8P9n1
4705B3L4o8L2m7j7M4j37Q8J14O8j28J88k47J07Ql4j57J49J69m9K4k10Q3m2j02
4730a07J51k0J6k3j37J51R9M1k19L1P3j65J38j1o9rJ77j25L3O2k16J95P3q8q1
4755c0j31N0P7J90j72j54K06NO7k24J45N2m6k8J08M7j67j23K16j65J63l5j41J00
$$ plain form
4779 10 74 -119 -6 79 9 96 -47 -61 133 -83 -37 -143 21 -20 28 -28 4 -30 244 93 -115 -42 79 73 17
4804 17 -150 -56 10 101 2 -44 27 -134 145 -59 152 42 -22 10 -155 -29 -70 -50 80 182 -28 19 -43 51 -83
4829 -83 -79 -83 -76 -83 -67 -12 -76 58 -41 46 -145 -83 229 13 51 -151 -5 -52 -116 -75 -12 -74 -45 110 -99 60 123 -54
4857 -54 -130 -122 -187 -27 90 -97 147 93 -50 87 -147 41 -110 -132 -96 68 55 -41 26 94 -80 -20 30 -11 -27
4882 -27 154 171 -6 20 107 -152 62 -106 12 85 -84 32 -59 -45 -104 12 77 54 3 88 30 14 -76 -52 212
4907 212 -45 -104 -71 -85 92 -113 19 94 12 107 65 -21 -25 12 -146 -11 -53 83 -32 -28 64 -129 41 -12 4 82
4933 82 114 -108 -111 58 129 100 11 57 -74 93 -68 -1 117 34 146 22 9 -77 98 102 -58 84 -23 -179 -133
4958 -133 51 128 -76 63 34 40 129 -166 -91 77 3 239 -32 146 61 -7 -82 32 -186 -75 46 189 28
$$ packed form
4779A0O4j93J13Q5p0Q7j43j4J94k16M6j06J64m1M8n6L2l4K74j51k08P3J21on6
4804A7j67R4O6R1r9m6P1j61K79k04K11j10o4L2j65J26m1K0J30J02k10M7o2R4j34
4829h3MmPpJ6N5o4J34r9Q7j91O2L12k16L8k02J46m7o4M1O3o2K9J55k09J59O3j77
4857e4p6Qo5J60J17j87K44n4j43J37k34J88j51k2L6J64j3r6O7O8j74O0N0m1j6
4882b7J81J7j77K6Q7k59K14j68J18P3j69J16r1J4n9J16O5k3n1Q5n8j6r0K4K64
4907B12k57n9L3j4J77k05J32P5q2R5m2q6mL7j58J35m2J36j15MR2j93J70n3J6P8
4933H2L2k22lJ69P1k9q9M6j31J67j61O7J18q3J12j24j3q6J75Mj60J42j07j56M6
4958a33J84P7k04J39k9OQ9k95P5J68p4K36k71J78q5o8p5J14k18J11J21J43j61
$$ plain form
4981 28 82 103 -89 166 -125 70 -30 19 -48 243 -69 -124 -67 -59 27 122 -100 -30 9 31 -11 -5 11 -78 28 77 76
5008 76 -118 30 -128 61 20 -61 -52 -83 47 -87 -101 25 7 -7 -22 142 17 -17 70 16 32 -17 -32 -23 -127 232
5034 232 -85 -136 -8 -31 14 -131 -44 -22 38 -88 -64 -177 25 -75 -54 -93 0 104 16 -76 1 -126 -105 -184 -44
5059 -44 -116 186 41 -118 131 -61 -65 0 -56 -40 134 -73 -42 -50 -98 7 37 -177 -59 4 2 -210 -84 51 -6
5084 -6 -68 40 -118 13 -37 57 -92 18 -137 -12 18 -9 11 -50 -96 -84 -5 62 -33 116 141 -106 27 -138 -210
5109 -210 -107 31 64 3 -270 -1 -28 71 -122 -271 -100 6 59 -126 -126 53 -148 104 46 -5 -33 -149 -44
5132 -44 -42 -114 -161 22 -139 -38 66 38 45 293 16 82 -193 -51 35 86 -53 -41 296 9 -84 142 -112 -133 51
5157 51 98 -21 66 -61 18 33 -25 -155 28 37 88 -175 134 149 -184 2 -59 -57 -34 133 -109 -122 36 -88 82
$$ packed form
4981B8N4K1j92K55k91J95j00M9o7K91l12n5N7QQ6R5k22P0L9K2m2OJ6q9J06M9j
5008G6j94J48j58J89m1q1Rl1J30j34j4J26j8j4j5J64j25l4Q7n4J6m9j5Rj04L59
5034B32l17n1J28k3M5j45Q7K2O0j26K4j13K02j00K1l9R3J04q8r2P7j27K1p9J40
5059d4p2L02j45j59K49j92mO5n6J6J74k07L1qm8J05L0k14J18O3kk12J26J35n7
5084fo2J08j58J31n0R4j49J10j55J25L0k7K0o1m6J2P9O7r5J49K5k47J33j65p2
5109b10J03J38L3o1k73K69k7R9j93j49J71J06N3j85%J79k01K52n8n1k8j16J05
5132d4Kp2m7J83j61J01J04k8PK48k77O6k75J42Q6N1j39J2L37k87r3K26k54k1J84
5157E1M7j19Q7j27P9J5n8j30J83RN1k63L09J5l33J86o1KK3J67k42j3J58j24J70
$$ plain form
5182 82 -36 -13 -4 -3 68 11 -64 133 43 -93 101 146 62 -70 8 187 62 44 -256 -18 -30 95 -37 13 117
5207 117 -115 24 -26 75 -151 -32 -39 -30 182 -10 -95 -78 -170 -86 5 -109 -47 -313 102 -62 -74 124 -23 163
5231 163 10 -68 34 -93 50 36 48 92 -6 136 38 55 -23 -14 -100 -93 33 -51 -14 -84 -139 241 -32 37 52 61 -62
5258 -62 -83 5 -145 15 -64 61 -165 -45 55 63 5 48 139 23 -26 -4 -37 68 84 147 32 -21 64 219 -68
5283 -68 0 -44 82 14 -12 138 126 -145 -95 36 -62 -41 37 113 -117 -129 -62 28 58 -83 -48 61 -41 -60 -14 146
5309 146 58 50 -111 50 -29 -137 -122 58 2 87 -66 -65 -50 -121 115 -12 -92 25 -18 -89 -155 -164 -116 -46 56 -59
5335 -59 -42 -134 -107 118 62 4 -19 -98 -177 215 44 -33 -50 -23 -7 -170 -114 -47 58 -2 -34 -102 243 47 97 -50
5361 -50 137 48 -180 171 28 72 -39 9 111 -81 -39 125 74 111 38 -73 -47 -173 110 2 7 -93 138 39
$$ packed form
5182H2j18K3RJP1n7p5J97r0j36J94M5q4j32P8J79j25j8l00K38j2J25j32N0J04
5207A17k32J39n0J01k26J19pRK12j92q5J7r2Q4R1j14O2k66M15j64j2J98j47J86
5231A63j53p8J02j27J43j4J2M4r8J42r8J7p8Rq6PJ26q4L7p0n5L80k73O9J5Rj23
5258f2k1Q8j50J60p9J25k26J20J00Qn8M3R1j16m9K2l3J05J6O3j15n3Q5J55k87
5283f8O8m4J26o8k6J50j2k71N0J31r8K1P8P6k30j2O7R0L0j41L5J09j02j9M6J60
5309A46q8qj61J61p9j08J5J80n6Q5j53JJ5p1K36j27q0J17m3p1o6rM8P0J02j15
5335e9J7r2K7K25n6n8k3p9p9L92j71p7j7K7J6j63N6O7J05o0l2o8L45j96N0j47
5361e0J87q9k28L51j43M4j11M8J02j92M2J64n1L7p3j11K6j26K83j08Nj00K31r9
$$ plain form
5385 39 -58 130 65 -5 -162 -62 66 -34 -16 20 62 91 9 23 29 65 -23 78 54 -129 -82 -57 -122 -14 -81 -85 -219
5412 -219 -34 -10 63 104 -81 21 53 -98 -76 137 -105 16 -139 11 -65 -25 65 42 -234 106 146 -23 64 -12
5436 -12 217 51 35 -44 82 62 -28 66 -49 -29 22 77 -14 -65 72 16 217 -85 -22 59 113 -20 14 47 7 30
5462 30 77 92 -19 49 79 28 191 146 50 100 -45 -48 22 -4 26 -66 40 -69 23 21 -202 -66 104 83 -17 -47 -112
5489 -112 -74 132 11 -90 48 72 -48 55 -128 -26 3 22 -86 -58 66 76 143 33 5 -1 -12 95 81 115
5513 115 -50 132 -143 71 -113 -15 -57 -33 -63 -116 123 -123 48 -64 -31 -89 -111 -44 -3 94 186 -244 -125 55
5537 55 -61 23 104 12 -46 -140 -35 37 120 5 -170 -60 129 -86 -71 86 13 51 76 -22 47 111 58 6 -12 -31
5563 -31 -6 58 -4 -19 -34 83 -8 108 97 -4 51 35 -51 -55 -49 -78 15 10 -64 97 -37 -48 -101 -185 145 74 88 -142
$$ packed form
5385C9r7J88o5p0j57J00J28j00J8L6M2K9q2J4OL6q8J01k4j83M7K5o5J08o7mj34
5412b19J85K4P3M1j85J02L2j51K2K13k42J21j55J50p6M0R0k3k76L40M0j69Q7p6
5436a2K29j66j6p9J26k0r0R4j15K0N1N5r1n1J37n6K01l02O3Q1N4j33L4L3m0K3
5462C0M7J5j11O8L0n1J63m5r6N0j45lP0k6L0r2J06j09R2kk23J36J70k1j00l0o5
5489a12L8K06j21j01J38K4j20J03j83J02K9J9j08K8J24J0O7j10k8oj1J07j4L4
5513A15j65J82k75K14j84R8m2K4l0n3K39k46J71j12L3n8k2O7M1R7R2m30J19J80
5537E5j16Q4Q1r2n8r4J05P2Q3j15j75J10J89k15J5J57p3L8K5r8O9O4n3n2j8j9
5563c1K5O4o2j5j5J17r1J16j1j01N5j6q6mOk9R3np4J61j34j1n3q4L30p1J4k30
$$ plain form
5591 -142 -54 -202 -88 75 201 39 -190 -6 13 104 30 41 -20 -25 29 57 -46 1 28 2 -52 -45 29 -50 -106 -55 -44
5618 -44 -174 5 6 18 -74 -141 44 -67 -135 117 103 -23 156 -6 22 -42 8 106 -216 91 99 -1 -63 -125 -7
5643 -7 -61 -21 55 59 71 21 -177 0 -40 96 -126 108 -12 -37 64 -18 75 -83 -78 23 51 79 12 3 19 90 -66
5670 -66 84 45 40 -94 33 -15 40 -86 184 -265 51 -159 117 -124 -76 17 -152 -26 13 38 13 -72 -32 68
5694 68 -59 86 17 41 -65 116 -34 -97 103 87 60 -22 180 -9 7 -48 -18 36 -68 39 -86 -90 58 -88
5718 -88 68 -125 90 93 187 195 60 112 123 -46 126 79 82 101 31 125 64 -27 -85 51 -84 -135 -55 -50 156 -208 -16
5745 -16 -202 150 -58 -51 94 156 -95 -96 20 -60 23 94 147 199 133 -95 -159 90 -62 137 98 87 123 58 -34 109
5771 109 -4 9 -100 24 49 -55 -7 7 0 -23 61 68 48 -22 46 -55 111 146 -25 12 10 -46 -49 169 -83 138 49
$$ packed form
5591a42Q8j48J14J63J26j62k29J84J9R1p4J1o1nN4K8j03M7K7k6n4PP4p9n6N1J1
5618d4j30J79JJ2r2o7J85j11o8K52j4j26J79j62K8o4N0R8l22L07Qj00o2o2J18
5643gn4M0P6MJ2n0j98J77m0J36k22K34j20k5J01q2R3j58NJ01K8K8o7rJ6P1j56
5670f6J50l9nj34J27m8N5j26K70m49L16k10K76k41M8R3j69J26L9K5k5q5M0J00
5694F8j27J45o9K4j06J81j50o3K00j6k7q2K02j89J6n5L0N4j04J07j25mJ48j46
5718h8J56j93K15LR4Qj35N2J1j69J72m7LJ9p0R4o1r1n8J36j35n1Q0NK06l64J92
5745a6j86L52k08PJ45O2k51jJ16q0Q3P1N3N2o6k28o4K49j52J99l9j1L6o5r2J43
5771A09j13J3j09J24K5j04M8J4pk3Q4Pk0p0O8j01J66L5j71L7kn6lK18k52K21q9
$$ plain form
5798 49 90 39 0 -1 -87 36 93 137 -8 141 -39 -65 40 -45 31 -1 -70 92 35 5 -44 122 214 104 -299 -47
5824 -47 46 -46 105 -17 -177 -52 -137 -82 114 114 60 -17 74 -55 79 34 -102 51 90 28 164 185 -34 13 -43
5849 -43 109 -91 24 -53 48 -90 187 -4 -134 -150 48 38 -56 69 -35 82 -130 15 18 27 -35 127 -86
5872 -86 -8 -66 12 -41 81 1 75 94 39 -5 -44 -56 -44 45 18 126 -1 -137 -60 -115 28 -14 196 -98 -109 78
5898 78 -64 186 -86 87 -95 42 -56 93 -14 -2 5 -93 -117 -79 9 4 -76 -27 106 -153 66 172 -7 62 12
5923 12 -47 -82 -11 123 139 -91 102 60 -32 -158 13 -56 -29 71 51 11 55 -5 173 -28 68 -7 10 25 -45 -48 -56
5950 -56 -145 -193 -60 66 34 -121 32 187 -122 55 124 -69 100 -26 158 29 0 64 -12 -111 -22 75 -86 -75
5974 -75 15 -184 -30 224 48 163 50 60 43 163 129 -4 -13 -16 13 55 -53 -94 -24 -28 157 -28 73 -45 -82
$$ packed form
5798D9M1n1l9jq6J23N7M4j45J49j80k6J05q5P6l2o9J62n7l0m9J66R2j10m03K52
5824d7R3r2J51j22j60J25q5N5J96%n4p7R1j29J34m5j36J53L9o2J36K1k19M7n6
5849d3J52k00J15p7J01j38K77j91j30j6J98j0r4J25j04J17k12J45LRo2J62k13
5872h6P8n8P8n3J22q0P4J9n5m4l9j2J2Q9k7J08j27j36P7n5J43m2K10k94j1J87
5898G8j42K50k72J73j82J37r8J49j07J2Pr8k4L8Q8nq0M9J33k59K19J06j79O9n0
5923A2n9l5P1J34J6k30J93m2r2j26J71o9K7J00k0m0M4o0J78k01R6p5J7J5p0lq
5950e6q9m8J33J26l2j55J53J55l09J77O9j93J69j26J84j29k9O4p6r9Q9R7j61J1
5974g5R0j99J54K54j76J15j13J0j7J20l4j33rlK9M2j08m1P0mJ85j85J01j18l7
$$ plain form
5999 -82 78 -140 37 34 -99 -64 17 36 -57 -73 66 147 -41 94 55 -192 -86 -7 30 -100 126 124 87 104 -15
6024 -15 12 -85 -123 59 7 24 -115 -33 -131 19 219 -62 110 -27 39 24 -16 35 18 -110 27 55 -39 55 -137
6049 -137 -59 -75 -22 66 64 47 -96 92 28 34 4 36 130 -136 33 5 111 29 -47 28 -1 128 -15 95 20 -46 66
6076 66 45 57 13 -57 -237 176 -47 -38 0 -13 140 -190 -62 187 -39 50 -14 180 -3 29 -20 103 -33 -1 17
6101 17 132 -5 -59 12 115 43 23 -17 177 -41 138 -94 -16 0 -24 -8 -70 33 -107 -32 7 127 66 -62 -44
6126 -44 -36 -74 150 -17 -16 -34 -45 -55 -95 29 47 138 -39 -55 -104 -14 108 102 -109 -43 -51 100 -128 -148 -128 39 45 -80
6154 -80 122 -6 41 -78 -7 -159 60 118 -38 -48 173 68 -20 -91 -97 -34 -28 10 7 -61 8 -110 -106 0 49 67 -93
6181 -93 91 72 142 43 20 -8 33 -31 13 -146 101 -15 15 91 95 51 -89 11 189 148 -123 -142 -95 -34 136 8
$$ packed form
5999h2J60k18J77lj33L5Q1J9r3j6J39Q1j88J35l9k47J06P9L7j30K26kl7J7j19
6024a5K7r7l8J82n2J7j39Q2r8J50K00k81J72j37O6j5m0N1j7j28J37K8r4R4j92
6049a37P8j6N3Q8kj7j43J88o4Ol0L2R4k66J69k8J06q2p6P5k9J29j43J10p5o6J12
6076F6k1J2m4p0j80M13k23RL8j3J53l30J28K49k26Q9o4J94j83L2m9J23j36L2J8
6101A7J15j37n4P1J03p2k0m0J94k18J79k32P8J6k4J6o2J03j40P5L9J20o1j28J8
6126d4Ql8K24j67Jj8j1j0m0J24J8R1j77j6m9R0J22ok11O6qJ51k28k0K0J67Oj25
6154h0K02j28M7j19P1j52K19N8j56j0K21j05q8p1oO3OL8lo8O9j18MJ06M9J8j60
6181i3J84j9P0r9k3k8M1o4M4j59K47j16L0P6Mm4j40J00J78m1k71j9M7O1J70j28
$$ plain form
6207 8 -46 25 -18 91 -32 161 -30 61 -80 -175 -109 -13 15 -146 46 4 -30 24 -50 -86 -17 76 -96 -60 10 -81 5
6234 5 131 4 61 -3 -73 60 53 21 -15 -72 -61 138 -113 -2 70 43 80 11 83 192 -91 -13 187 -63 53 -36
6260 -36 26 13 24 -52 -159 -75 -53 55 -47 -17 23 114 -82 -150 -1 -95 -31 -28 -107 -118 -28 -93 39 -84 13 112 -52
6287 -52 -78 123 59 95 78 -121 -59 -47 -56 39 -174 6 137 35 83 -12 -13 -117 -12 -35 69 127 -39 -129 -64 -32
6313 -32 31 -24 -92 33 -126 60 -51 8 33 28 150 152 7 156 -220 -78 10 171 3 98 0 -32 -41 39 -11 -111
6339 -111 -61 257 -2 77 43 94 72 -134 45 13 -42 28 64 -194 113 -135 -172 53 48 55 -25 254 -46 -61 -148 -74
6365 -74 249 -179 62 -37 7 -75 17 55 24 61 112 231 13 -35 -128 -137 57 -83 -33 140 70 -34 -83 -18 130 -148
6391 -148 -73 149 55 27 67 82 15 8 -82 -117 26 -66 -69 -41 -16 31 -86 99 -144 -52 49 8 -12 75 97 124 59 -100
$$ packed form
6207Hn4P1m3J09j23J93j91R1j41r5O6R6K8j61J92m2l4N4p4l6O9R3j72L6P0r1Q6
6234EJ26j27N7o4p0J33pl2l6n7J1J99k51J11P2k7L7o9P2J09k83P8K00k50J16q9
6260c6O2j3J1p6j07Q4K2J08j02L0M0R1j96o8J49r4O4Lp9j1R0o5J32j23R7R9j64
6287e2k6K01o4L6j7j99O2J2rR5k13J80J31j02M8r5jj04J05k3J04N8j66r0O5L2
6313c2O3n5o8J25j59J86j11N9K5nJ22Kj45J49l76J42Q8J61j68R5r8l2rQ0n0j00
6339a11N0L18k59P9l4N1k2k06J79l2n5P0L6k58L07k48l7K25nPq0K79l00j5q7P4
6365g4L23m28K41r9M4q2R2L8l1L7N1J19k18m8r3rJ94j40N0J73p0j04m9O5J48k78
6391a48P5K22r4k8M0J5o7pr0l5J43r2lK8K5M7j17J85k43R2J01m1k0Q7K2K7o5j59
$$ plain form
6419 -100 124 -151 121 112 43 64 57 -52 -94 -70 -100 -123 17 29 -112 17 -80 -25 50 -92 -10 91 -1 34 64 14
6445 14 -195 -100 -101 31 -1 -46 -20 -37 -2 43 -27 153 21 17 12 178 46 -36 132 78 14 -51 -72 -42 30 -112 54
6472 54 -132 63 -1 50 116 -119 33 -173 -7 -105 102 69 -17 82 -48 92 69 136 -49 56 27 100 -9 -46
6496 -46 -50 106 140 6 -5 -79 -110 28 39 -101 -73 -61 -28 -80 -24 199 176 4 -140 43 68 26 46 -54 33 11
6522 11 22 -79 22 133 148 80 -33 -84 -214 37 -4 -1 84 0 4 89 -90 -81 32 165 89 -188 70 -69 -48 47
6548 47 156 -66 158 -3 -52 124 -76 285 38 60 -5 -65 17 -31 106 60 -58 40 30 56 92 -5 4 -64 -61 15
6574 15 62 9 34 -2 51 -167 42 46 12 78 -37 47 48 -60 168 -83 -2 -134 8 77 37 -115 82 51 -19 -8
6600 -8 -188 21 121 41 -17 64 68 65 177 -127 43 124 21 -96 -259 64 62 59 -87 -75 -107 18 79 114 -4 113
$$ packed form
6419a00K24k75K72ro9K1pj09m2K4l0k3J40J2j41J29r7N5P5j42Q2J01r2L5L0n0
6445A4k09R5jJ32l2m5K6j7L5M5p0J80j32mnJ66j32q2J68n4o4o5k1L0P2j42J66
6472E4j86J95o4N1O6k35J52k06J66r8K07l3q6R9j30J40k3O7j85J05k9P3j09l7
6496d6mJ56L4j34j1p4l1J38J1j40K8J2L3n2N6K23k3j72j44J83K5m2K0j00Q7k2
6522A1J1j01J01J11J5o8j13n1j30K51m1LQ5q4MQ5j79RJ13J33p6k77K58j39K1R5
6548D7J09k22K24j61m9J76k00L61k47K2o5o0Q2m8J37m6j18R8j0K6L6r7Ro8LP6
6574A5M7n3K5l6N3k18K09Ml4O6j15Q4Jj08K28k51Q1j32J42O9m0j52J97l1p0J1
6600hj80K09J00q0n8Q1MlJ12l04J70Q1j03j17j63L23klj46J2l2J25O1L5j18J17
$$ plain form
6626 113 213 -69 -58 -13 -94 -84 -83 20 48 89 28 -154 -48 21 105 -28 7 31 56 98 -171 -47 -120 -80 49 -43
6652 -43 -108 17 8 -152 153 -86 67 -24 -37 49 -275 50 145 123 150 -78 -40 22 128 -53 153 55 38 -64 -8
6677 -8 -39 -9 113 101 -38 -24 -85 103 12 36 -78 -58 221 265 202 60 -11 178 -9 23 127 33 127 -2 -4 -84
6703 -84 -136 -59 -91 -109 75 8 123 14 76 -106 19 -25 18 1 -118 -171 -71 85 -64 21 137 -141 29 -49
6727 -49 184 -96 -32 3 41 239 152 31 109 36 1 14 91 51 -27 -90 52 3 -59 3 46 1 -162 72 64 147 -5
6754 -5 22 -107 -137 77 -58 88 60 -63 5 155 33 48 -16 -141 -47 80 -150 -16 -3 -11 -297 93 64 63 147
6779 147 -139 101 -22 9 111 -2 -87 -79 -54 -172 42 20 112 165 -72 -157 -88 -75 160 88 172 -5 36 81 62
6804 62 70 51 -89 -123 66 38 81 -62 60 -6 -29 98 -49 102 -63 104 -27 -91 51 -101 162 -37 11 67
$$ packed form
6626A13J00k82J1M5q1J0JJ03K8M1o1j82J06O9Q4j33L5K4K5M2k69J24p3M0J29r2
6652d3o5J25rj60L05k39J53r1j3Q6l24L25R5k2K7k28L8O2J06j81K06r8j7j02N6
6677hl1L0J22j2j39J4o1J88r1K4j14K0K79M4o3j42p1J89j87L2J04r4R4j29kq0
6703h4n2P7l2j8J84o7J15j09O2j82J25m4M3j7j19n3J00J56j49Q5J16k78J70p8
6727d9K33k80O4L5L8J98q7j21P8p3l5J3P7m0p8o3J42m9o2O2M3m5j63K34qQ3j52
6754eK7j29l0K14j35J46k8j23O8J50j22J5o4j25R4J27k30J34J3qk86L90k9jQ4
6779A47k86K40j23L1J02j13q5QK5j18K14k2R2N3k37q5O9J3K35p2Q4j77M1M5j9
6804F2Qj9j40l4J89k8M3j43J22o6k3J27j47J51j65J67j31o4J42j52K63j99M8N6
$$ plain form
6828 67 -285 11 5 9 30 -109 87 -82 1 133 -88 188 31 27 89 2 -44 23 -62 -18 54 -56 -119 27 116 200
6854 200 -69 -99 63 0 179 -3 111 -55 -111 121 -70 -161 -32 -24 298 239 2 -11 -66 -164 -11 -26 -82 5
6878 5 -9 -108 35 141 40 48 -161 107 256 53 77 115 -50 -6 -68 56 -62 54 -56 -42 -45 132 -63 -135 43
6903 43 92 22 112 86 12 -123 -25 -128 -83 -90 -63 -8 -50 192 138 157 78 -8 102 -84 208 -105 -185 186 33 -19
6929 -19 113 -128 85 -27 124 65 60 15 39 -126 -76 -32 154 -20 -124 70 47 -40 -6 151 -222 58 -180 -168
6953 -168 -60 -153 -184 53 -95 186 -159 -38 19 43 5 87 -92 -36 -20 58 -2 -9 73 -76 -218 139 112 46 88
6978 88 -176 -46 7 -7 -106 142 -78 -74 202 -129 -69 56 -58 28 -10 73 137 -99 44 9 -51 -31 88 -8 -51
7003 -51 -147 -27 52 162 40 -111 -24 267 -109 -48 -133 22 -108 7 23 70 56 -98 2 48 -58 -57 77 70 13
$$ packed form
6828F7l52K96oMK1j39J96j69Q3J32k21K76j57mO2q7m6O7q5M4P2j10o3J46Q9Q4
6854B00k69l0J62o3J79j82J14j66n6K32j91r1J29QL22n9k37j3n5r8J53j5n6Q7
6878Ej4r9J43J06j01Qk09K68J49k03K4L8j65M4o2J24j18J16j10J4lJ77j95p2J78
6903D3M9p0R0k6p4j35R8j03M5pK7N5m2K42n4J9p9q6J10j86K92l13q0L71j53n2
6929a9J32k41K13j12J51n9nm5K4j65N0M4J86j74j04J94k3q7L4J57l73K80k38J2
6953a68J08r3l1K37j48K81l45J21N7K4l8Q2j79N6J6P8o0pQ2j49j42L57k7o6M2
6978H8k64J30N3j4r9K48k20MK76l31O0J25j14Q6l8Q3O4k36J43l5o0K0J19r6m3
7003e1r6J20P9J10j22j51Q7K91l76O1q5J55j30J15J6M7j4j54J00M6j06JJ34pn7
$$ plain form
7028 13 22 232 169 -63 89 25 -163 135 -89 14 62 -31 127 169 -176 82 -60 -85 -27 -2 -21 -92 106 6
7052 6 -34 105 10 -37 119 -62 -20 -10 -97 -17 -46 77 23 43 -156 -64 35 77 -44 -172 83 -35 8 -37 -30 26 80
7079 80 -73 102 64 174 39 11 -158 128 24 -37 -39 -121 79 53 97 -12 -7 -132 -155 -1 -5 -40 203 -82 15
7104 15 -89 -99 65 118 -109 98 17 62 48 34 -94 103 -72 -11 10 -12 -66 -62 141 38 47 -69 -9 -81 -123 -133
7130 -133 44 -62 60 113 69 -96 -21 113 133 -18 -19 15 56 115 -30 6 47 164 -22 -90 41 -2 29 115 -22
7155 -22 32 116 -26 -12 109 12 -33 11 -18 95 21 78 11 48 103 32 6 -149 -104 -98 -96 45 21 131 43 23 119 -179
7183 -179 -13 38 -93 22 96 -140 236 -187 5 21 -61 -48 110 41 -51 12 -39 -12 86 39 60 -184 177 63
7207 63 2 280 27 -134 99 -60 131 54 20 -26 5 113 137 71 -2 -58 -35 71 -41 -96 -161 35 -82 -100 102
$$ packed form
7028A3RK10o3k32J52o4j88K98k24J03M8r3J58M2l45K58j42k5N8K5j9p1J98j00
7052Fm0J39r5m7J56j81M2J0q7Q0k9J23n4K0j99R2R9M2j21j28K55j18M3m5PN6N4
7079H0j53J75l8J10j35k8j69K86j04o1kq2K00k6M4j09Nj25k3J54ml5K43k85R7
7104A5j04j0J64N3k27K07q1M5j4j4j28J97j75O1K1k2n4MK03j03Rj16O0p2m2j0
7130a33J77j06J22N3m4j65P5J34K0j51jL4M1N9j45L6M1J17j86o8J31m3L1Q6j37
7155b2N4Q4j42J4J21r7m5M4k9J13p4N7o7L7N5p1k6j55M5OKJ41k4J10q8k0R6k98
7183a79J66N1j31J15P4k36L76m23J92J6q2J3J58o9r2O3n1K7R8m7K1k44L61j14
7207F3o1K78k53j61K33j59J91p7l4m6L1J08K4o6p3n6K3J06j12n5o5J96j17j8K02
$$ plain form
7232 102 51 74 87 101 121 -51 -4 110 109 14 57 46 49 -21 195 -107 -22 139 -8 16 34 -73 122 11 58 83
7258 83 -14 -47 -105 -86 70 -95 -204 -58 -11 116 0 88 -58 183 -65 -2 201 -226 107 79 19 30 136 -44
7282 -44 -157 41 -152 162 -39 -69 -73 -14 -50 -3 9 -123 40 -11 -26 -25 9 11 159 2 64 -34 72 -103 -57 -71
7308 -71 26 79 -53 42 53 -11 -90 -136 -83 57 -215 18 40 -204 124 25 158 75 93 -118 -28 -44 49 -38 1 -32
7334 -32 -80 4 -7 29 -133 -41 20 -4 1 8 -204 70 -159 -31 6 47 149 216 -56 -89 -114 -8 -109 97 54 113
7360 113 48 -66 -18 73 -117 -108 46 -61 -45 43 5 -201 134 114 -7 -121 33 -5 -1 -21 -76 22 -51 102 51 82
7386 82 53 -77 40 99 -47 -49 171 56 -116 29 -7 34 -32 18 188 43 101 27 -113 -9 -66 -13 -85 46 106
7411 106 -37 -17 -35 -104 -114 -44 -8 -103 -38 140 -14 -19 49 -53 -12 -230 -33 -50 -56 65 -12 16 16 -80 51 -2 -46
$$ packed form
7232A02n1K3J3J4K0j72M7J14jr5M3j1Lp0K16l02Q5J61j47K4J8j07J95j11M7K5
7258H3r7l3n8J9J56j65j09J46M7J27j16Q8j46K41k48O3K03m27L33k8o0J1J06j80
7282d4j13J98j93L14k01l0mN9l6M7J2j32J63n1j5JL4KJ48j57O2r8J06j75M6j4
7308g1R7N3j32R5J1o4p9m6N3J40k72K33K2k44L28r9J33q3J8k11R0j6R3q7L9l3
7334c2m8Q4j1L6j62R2O1k4NPk12K74k29J28L7M1J02O7k72l3k5J06j01K06m3N9
7360A13o5j14M8R1j90RJ54j07J6Q8l8k06L35k0j21j14J54l8Mk0n5R8p3J53n1L1
7386H2k9j30J17N9j46kK20j15j72J45l6M1o6N0J70j45N8p4j40J04n7N3p2J31O0
7411A06j43K0j8o9j0P0L6r5O5J78j54nO8j02M1k18J97j7oJ21p7K8%r6J31n3m4
$$ plain form
7438 -46 -127 0 35 -62 10 -23 24 42 -71 -37 27 -102 82 2 -196 -47 143 -105 77 71 24 -84 -76 -8 123 -154
7464 -154 19 69 -29 -145 -11 77 -130 -122 -53 197 -136 -37 85 1 -21 -47 -39 27 20 -65 -49 48 93 -29 -95 28 -136
7491 -136 59 150 -233 101 4 -294 14 66 81 -6 -12 -191 -4 94 -94 -72 18 -37 52 82 47 81 -110 75 -73
7516 -73 17 -87 89 134 40 -95 101 140 83 130 87 79 31 -18 -109 55 84 -28 69 -42 -64 -88 91 -132 -69 -118
7542 -118 -253 12 8 1 46 166 -189 2 -51 194 -84 69 70 71 -98 -5 126 49 -110 42 66 -127 118 63 -34
7567 -34 82 -93 19 118 -23 96 88 120 33 -37 -123 28 72 126 8 -45 -58 -85 -2 92 -51 -2 117 37 53 -13
7593 -13 94 168 -45 9 58 -38 198 27 76 55 70 57 90 -81 134 121 98 -8 -94 -30 140 -1 -76 14 4 -34
7619 -34 -86 10 -71 -69 -71 -58 -109 38 52 25 -14 23 193 -30 -6 -38 -26 51 61 90 69 86 122 -25 57 65 208 -52 36
$$ packed form
7438d6q1J27L5r7P2l3M7J8j13L4O4j29J84q0j98J49J90k48J82om7j08QO8J31k77
7464a54J73N0r8j16J34Q8k07QO9K50l33R9J22q4k2k6QO6pq5J6R7M5j22o6J23j64
7491a36J95R1l83L34r7k98L08N2J5q7oj79J87R8j88K2R0n5Q9L0l5L4j91J85j48
7516g3R0j04J76M5r4j35J96L9n7M7m3qm8m9r1J64K9j12R7j11k2k4J79k23O3m9
7542a18j35K65mpM5J20l55J91n3K45k78J53JJj69R3J31p7j59J52K4j93K45n5r7
7567c4J16j75J12R9j41J19qL2q7p0q6J51M4N4j18n3j3k7Q3R4j43M9J19q0J6o6
7593a3J07P4k13N4M9r6K36j71M9k1J5j3L3j71K15j3k3j06q6O4J70j41p5R0j0l8
7619c4n2R6q1KkJ3n1J47J4k7l9L7J70k23K4l2J2P7J0K9k1J7L6j47Q2QJ43k60Q8
$$ plain form
7648 36 -46 100 -8 140 -114 -122 106 25 10 96 -172 -17 48 47 -45 -33 -177 0 198 -27 69 -82 29 92 -59
7673 -59 142 -68 -63 65 -107 98 -63 -41 10 30 -16 -58 10 -46 86 -167 127 -83 236 -89 -17 65 -92 -69
7697 -69 0 68 -46 112 31 -57 -27 -40 -108 -51 85 102 54 73 15 48 -130 101 -87 -87 13 -16 -186 104 37 129
7723 129 -42 100 123 41 -103 22 56 -54 132 -69 82 -31 91 -95 57 167 76 96 39 -25 22 38 69
7746 69 34 -146 14 -79 73 -6 -28 -9 57 72 -2 7 55 123 32 93 -60 37 -9 -161 122 255 147 -104 7 -145
7772 -145 -146 -6 163 11 119 -110 128 -115 -41 17 -12 -60 90 -52 10 -81 -153 127 2 122 121 88 -63 -8
7796 -8 109 88 -45 -1 128 1 34 -99 14 117 -20 85 23 68 -84 -2 1 76 46 102 50 -19 26 4 85 -55
7822 -55 46 -3 -111 -48 3 0 -153 17 -44 -133 56 76 -78 134 -152 -67 34 -178 36 -70 208 12 -91
$$ packed form
7648C6q2J46j08J48k54qK28q1j5Q6k68J55O5jr2J2j44J77J98k25R6j51J11O3j51
7673e9K01k10NJ28j72K05j61K2N1K0m6m2O8n6J32k53K94k10L19l25P2Q2j57K3
7697f9O9O8j14J58q1q8L0j3o8N7J36J7m8J9n8L3j78K31j88%J00k9j70K90o7R2
7723A29j71J42K3q2j44J25L4j10J86k01J51j13J22j86J52J10r1K0n7o4M7J6L1
7746F9l5j80J60r3J52p9k2J9O6J5p4RM8O8r1O1j53R7m6j52K83J33j08k51J11j52
7772a45jJ40J69j52J08k29K38k43P4N8k9m8J50j42O2r1p2K80j25J20jl3j51N5
7796hJ17k1j33M4J29j27L3j33J13J03j37J05o2M5j52Q2LP5l0N6n2o9M5k2Q1j40
7822e5J01m9j08O3N1lj53J70o1q9J89K0j54K12k86Q5J01k12K14j06K78j96j03
$$ plain form
7845 -91 -2 109 32 67 115 33 79 128 110 -88 -98 -49 43 160 85 -123 23 -153 -12 -94 71 -17 17 23 4 9 -33
7872 -33 -38 11 0 -120 -69 132 -42 -4 63 37 79 21 5 -110 -28 89 70 -107 42 179 -79 107 -112 -44 -60
7897 -60 40 -1 -13 42 57 81 60 -88 -146 44 42 -70 112 -18 25 -81 -38 -103 -44 -146 7 114 64 88 43 43
7923 43 74 -18 -16 -49 15 -104 53 -78 130 89 152 27 87 -54 54 119 -68 85 -88 -27 -45 48 -75 97 79
7948 79 -100 58 -125 -106 50 -59 -10 31 -61 59 41 -103 -37 -16 177 -44 -18 9 -77 7 122 -8 -128 64
7972 64 -67 65 -18 -104 42 -20 8 -74 129 43 -87 -46 8 -11 -10 -149 -18 168 102 -49 11 -7 62 126 14 -4
7998 -4 -83 -19 59 45 84 -185 38 84 126 -4 -83 39 -102 59 -208 -18 -30 0 -34 36 -75 37 106 129 68 -54
8024 -54 228 74 113 -26 74 12 -68 -31 32 -70 -25 -259 -102 17 203 120 -20 -55 -29 60 -93 18 -27 -158
$$ packed form
7845i1Q9J11p7L5M8q2M6M9j8j98j0M9R2J17p5k08J46j76J41q2J65q8L4Oj9Nm2
7872c3nM9j1j20N1K01j74L8O7k6M2n8j6j15Q2J17j9j77J49J37k58J86k19O8j6
7897f0J00m1j2N5J5K4k1j48n8J90kj12J82j30M3j06M3o5N9j02J53J07n0K4m5%
7923D3L1r2Kl3O4j19J57j31K08m1O3j25O0j41J08O5j87J53j73O1j8R3j23J72j8
7948G9j79J58j83J9J56j09M9M1r2J20j8j44O6K1J93k21K6K7q6Q4J15j30j20J92
7972F4j31J32q3q6J46o2K8q2K03q6j30M1N4j9Jj39J31J86o6j51O0j8O9O4j12j8
7998dp9O4P8j4L9k69K23M6M2j30p9J22j41J61k67J90j2L0l4P0j11J12O9K3o1j22
8024e4K82j54L9j39J00o2q0L7O3j02M5k34J57J19J86q3j40l5K6Q9j53J11m5j31
$$ plain form
8048 -158 -41 -64 6 -21 -7 135 37 -30 -29 -71 -61 22 30 -101 133 18 -17 59 -48 -98 -53 101 5 7 65 153 -120
8075 -120 -99 -102 1 74 -35 -46 46 190 87 -25 -76 -98 81 -43 172 31 -54 -37 -11 -44 -33 247 49 -100
8099 -100 79 83 -19 -106 -200 137 -79 102 66 -35 6 -18 -16 32 14 44 14 61 -143 130 200 -31 61 -1 120 -93
8125 -93 -64 -33 -18 -140 211 -72 -129 94 55 -110 -5 -32 -242 -88 -162 -97 -5 -262 63 -171 -116 80 -9 -47
8149 -47 -26 24 -19 -169 190 -54 7 -33 189 -132 39 23 -20 55 173 45 15 1 -227 -26 12 28 61 -3 -148
8174 -148 -4 -203 -3 -178 -16 102 39 43 -35 70 -98 -39 111 86 14 82 44
$$ packed form
8048a58J17k3P0k7J4J42r8o7Jm2J0Q3Qj31K34j15l5P6j07n0M5J54r6KN8Q8k73
8075a20K1lJ03P3j09j1R2J44j03j12n1k2J79j24K15j41q5J7K6l3J1K80j98j49
8099a00J79Mj02q7r4L37k16J81l6j01M1k4KM8j8L0l0M7k04K73P0k31R2o2J21k13
8125i3K9L1J5j22L51k83n7K23l9j65J05k7k10J54p4O5R2k57L25k34N5J96q9l8
8149d7K1N0m3j50L59k44O1m0K22l21J71j6m3P5J18j28l0j4k28K01L8J6L3o4j45
8174a48J44j99K00j75J62J18o3Mp8J05j68N9J50k5p2O8l8
8191D4
$$ Imaginary data points
##PAGE= N=2
##DATA TABLE= (X++(I..I)), XYDATA
$$ plain form
0 0 0 0 0 0 0 0 0 0 0 0 0 0 0 0 0 -5 8 -8 8 -8 8 -16 16 -16 24 -24 32 -32 40 -45 48 -56 64 -73 84 -96 105
37 105 -118 133 -149 165 -182 204 -224 248 -276 302 -334 368 -407 447 -493 543 -599 663 -734
56 -734 815 -907 1016 -1142 1294 -1484 1720 -2031 2456 -3075 4077 -5960 10789 -54945 -85753
71 -85753 -26080 -21653 -8465 1513 24889 24971 15449 103 2727 4897 -893 -16115 -11800 4869
85 4869 15741 9818 8852 16120 24285 16725 2058 -6132 -449 1973 -7375 -17577 -11661 -253 -1692
100 -1692 -13838 -16003 -7445 -952 -6574 -12697 -6398 8544 12425 3232 -1629 7014 12803 2137
114 2137 -9818 -5899 5888 9784 4539 4181 14996 23181 15353 46 -4974 -1681 -6500 -20087
128 -20087 -24875 -14663 -3476 -980 -3510 -219 9750 12060 1096 -10007 -8677 -2099 -4010 -10883
$$ packed form
0@%%%%%%%%%%%%%%%nJ3j6J6j6J6k4L2l2M0m8N6o4P2q5R3j04J20j37J57j80K01
37A05k23K51k82L14l47L86m28M72n24N78o36P02p75Q54r40J036j142J262j397
56g34J549j722J923k158K436k778L204l751M487n531P152j0037J6749o5734l0808
71h5753N9673M427J3188R978K3376Q2r522j5346K624K170n790j5222M315J6669
85D869J0872n923r66P268Q165p560j4667q190N683K422r348j0202N916J1408j439
100a692j2146k165Q558O493n622o123O299J4942L881r193m861Q643N789j0666
114B137j1955L919J1787L896n245l58J0815Q185p828j5307n020L293m819j3587
128b0087m788J0212J1187K496k530L291R969K310j0964j1103J330O578j911o873
$$ plain form
142 -10883 -7173 6932 15986 12836 7205 9938 15199 10064 -3469 -8948 -2144 3086 -2198 -8219
156 -8219 -2469 6469 4915 -5094 -9799 -4640 -573 -6017 -12670 -7640 3615 6155 -529 -3047 3529
171 3529 7424 1248 -5950 -4829 3257 6945 2369 305 6766 13037 8705 -1085 -3908 703 769 -6474
187 -6474 -11082 -5284 3123 3317 -3133 -3644 3136 5092 -2938 -9845 -6174 901 282 -4747 -3172 5445
203 5445 9753 5206 -1186 541 5400 2998 -4520 -5940 974 5810 2590 -1839 902 5615 4150
218 4150 -3443 -7584 -3930 1 -2831 -6885 -3722 3837 6293 1324 -2012 1324 4427 775 -5775
233 -5775 -6121 350 3499 -503 -2761 2304 7817 5190 -1330 -2242 2052 2777 -2540 -6279 -2695 3046
249 3046 1986 -2917 -2941 2020 4195 -130 -4120 -1798 2779 2092 -2141 -3163 928 3752 715 -3650
$$ packed form
142a0883L710J4105R054l150n631K733N261n135j3533n479O804N230n284o021
156h219N750Q938j554j0009m705N159M067n444o653N030J1255K540o684k518O576
171C529L895o176p198J121Q086L688m576k064O461O271m332r790k823M611O6p243
187f474m608N798Q407J94o450n11O780J956q030o907L671P075o19n029J575Q617
203E445M308m547o392J727M859k402p518j420O914M836l220m429K741M713j465
218D150p593m141L654L931k832m054L163P559K456m969l336L336L103l652o550
233e775l46O471L149m002k258N065N513k627o520r12M294P25n317l739L584N741
249C046j060m903k4M961K175m325l990K322M577o87m233j022M091K824l037m365
$$ plain form
265 -3650 -1970 2243 2546 -1702 -3210 982 4307 1968 -2349 -1932 2153 2725 -2160 -4824 -1002 2794
281 2794 1071 -2663 -1847 3116 4276 -38 -2913 -131 3227 871 -3160 -2937 1430 2310 -1285 -3208
297 -3208 -416 2927 1833 -1670 -1629 1592 2833 87 -2881 -1572 1928 1242 -2139 -2790 567 3094
313 3094 1039 -1962 -711 2440 2195 -1601 -3382 -336 2439 379 -2466 -1315 2430 2616 -886 -2613
329 -2613 -76 2347 355 -2677 -1553 2187 3042 -20 -1267 847 2322 180 -3057 -3011 -103 699
345 699 -975 -1673 628 3178 2594 -130 -1344 102 510 -2114 -4111 -2518 767 1791 360 559
361 559 3052 4479 1950 -1363 -1333 166 -378 -2901 -3221 -167 2345 1136 -571 117 1852 1215 -1973
378 -1973 -3364 -1295 368 -575 -1778 -610 2167 2112 92 -1178 136 1032 210 -1037 -324 2269 2992
$$ packed form
265c650J680M213L03m248j508M192L325k339m317M17M085N72m885k664L822L796
281B794j723l734Q16M963J160m314k875K782L358k356m031K23M367Q80l595j923
297c208K792L343j094l503M1L221J241k746k968J309L500o86l381o51L357K527
313C094k055l001J251L151k45l796j781L046K775k060k845J151L745J86l502j727
329b613K537K423j992l032J124L740Q55l062j247K114J475k142l237M6K908Q02
345F99j674o98K301K550n84k724j214J446M08k624j997J593L285J024j431J99
361E59K493J427k529l313L0J499n44k523l20L054K512j209j707O88J735o37l188
378a973j391K069J663r43j203J168K777n5k020j270J314Q96q22j247P13K593P23
$$ plain form
395 2992 1632 314 639 1263 -178 -2845 -3472 -1545 -62 -627 -1040 769 3026 2180 -894 -2299 -1305
412 -1305 -1360 -2951 -3757 -1509 1658 2734 1752 2242 3624 3605 1190 -1291 -1622 -578 -735 -1353 -826 1378
430 1378 2642 1981 430 -182 -190 -1038 -3299 -4010 -2278 -576 -174 -208 416 1836 1965 351 -1413 -1345 -259
449 -259 -417 -985 -128 2619 3759 2852 1756 1797 1456 31 -2391 -2878 -1581 -685 -817 -847 800 1791 894
468 894 -626 -1419 -1362 -1685 -2478 -2531 -1263 559 1602 1415 1290 1971 2032 707 -541 -487 244 905 840 849 1716
489 1716 2449 1421 -506 -1434 -1484 -1931 -2720 -2688 -1138 604 1214 921 712 939 126 -1783 -3054 -2710 -1481
508 -1481 -1079 -343 1487 3554 4092 3730 2645 1742 502 -1212 -2456 -2800 -1729 -677 120 794 1628
525 1628 2050 1675 267 -1185 -1858 -1961 -2491 -2713 -1887 -254 580 775 978 1503 1551 867 165 241 742 1005
$$ packed form
395B992j360j318L25O24j441k667o27J927J483n65m13J809K257q46l074j405R94
412a305n5j591q06K248L167J076r82M90J382j9k415k481l31J044j57o18N27K204
430A378J264o61j551o12qq48k261p11J732J702M02l4O24J420J29j614j764O8J086
449b59j58n68Q57K747J140r07j096M1l41j425k422m87J297Q96j32l0J647R91q97
468H94j520p93N7l23p93n3J268J822J043j87j25O81O1j325j248N4P31O61o5RQ67
489A716P33j028j927r28n0m47p89L2J550J742O10k93k09K27q13j909j271L44J229
508a481M02P36J830K067N38l62j085r03j240j714j244l44J071J052P97O74Q34
525A628M22l75j408j452o73j03n30k22Q26J633Q34J95K03N25M8o84p02P6N01K63
$$ plain form
545 1005 371 331 864 909 173 -907 -1019 -790 -639 -746 -217 544 1165 1031 201 -343 -895 -1709 -2404 -2727
565 -2727 -2137 -923 256 1455 2327 2875 3094 2069 641 -588 -1037 -1619 -2106 -1990 -802 842 1451
582 1451 1741 2233 2291 1101 -349 -1600 -1825 -2119 -2151 -1932 -905 188 656 941 1323 1182 701 281 -343
601 -343 -451 -246 -214 33 293 145 326 364 125 13 -132 183 282 226 294 594 432 -143 -700 -856 -1261 -1273
623 -1273 -1255 -401 217 654 979 989 1311 971 92 -736 -622 -1199 -1246 -971 -322 512 959 1144 1396 1108 604
644 604 68 -601 -1078 -1135 -1210 -666 -385 157 512 872 945 468 89 -102 -384 -531 -567 -289 -28 116 36 297
666 297 401 250 47 68 -131 -14 -240 -287 267 275 -48 -4 107 65 -82 -431 -278 -90 117 177 305 247 336
689 336 166 4 -102 -350 -442 -290 -46 -137 -151 212 529 345 57 29 -175 -198 -97 -169 -65 211 -49 49 335
$$ packed form
545A005o34m0N33M5p36j080j12K29J51j07N29P61O21j34q30n44n52q14o95l23
565b727N90J214J179J199Q72N48K19j025j428j229m49n82m87J16J188J644O09
582A451K90M92N8j190j450j251k25k94l2K19J027J093M68K85L82j41m81m20o24
601c43j08K05L2K47K60j48J81L8k39j12j45L15R9n6O8L00j62n75n57j56m05j2
623a273J8Q54O18M37L25J0L22l40q79q28J14n77m7K75O49Q34M47J85K52k88n04
644F04n36o69m77n7p5N44K81N42L55L60P3m77l79j91k82j47l6K78K61J44q0K61
666B97J04j51k03K1j99J17k26m7N54Ql23M4J11m2j47l49J53J88K07O0J28n8Q9
689C36j70j62j06k48r2J52K44r1j4L63L17j84k88k8k04k3J01p2J04K76k60R8K86
$$ plain form
712 335 260 70 -237 -99 -43 -177 -161 151 -59 30 128 90 196 27 -168 -252 85 -109 -96 -166 137 59 -3 -28
736 -28 336 50 -227 -175 70 13 -330 -12 127 -133 -47 -79 200 177 63 -138 96 106 -153 -147 -74 -137 -266 -124
760 -124 256 25 206 211 199 51 -51 -82 -306 -130 -101 -318 46 162 282 74 125 130 124 -179 -226 -81 -153 -224 -27
785 -27 239 63 130 35 36 -129 -325 -233 -94 106 -49 -24 451 435 149 -93 -24 -219 -134 -339 -158 -45 0 -26
809 -26 63 330 308 46 -133 9 -132 -194 -251 32 109 -4 201 356 264 32 63 -94 -164 -193 -142 15 257 193
833 193 154 193 202 -130 -1 -176 -226 -76 -20 224 365 157 75 -11 -76 -355 -376 -300 -185 -269 -82 192 427 523 329
858 329 208 36 -62 -467 -322 -343 53 241 239 473 518 403 268 -46 19 -451 -499 -268 -232 -201 28 25 262 33
882 33 -131 -91 -278 -307 -401 -303 -20 284 197 134 367 236 189 87 220 141 55 -40 217 386 97 167 -95 -192 -405
$$ packed form
712C35p5j90l07J38N6j34J6L12k10Q9R8l8J06j69j95q4L37j94J3p0L03p8o2k5
736b8L64k86k77N2K45n7l43L18J39k60Q6l2K79k3j14k01K34J0k59OP3o3j29J42
760a24L80k31J81Nj2j48j02l1k24J76K9k17L64J16J20k08N1Nol03m7J45p2p1J97
785b7K66j76O7r5Jj65j96R2J39K00j55K5M75j6k86k42O9j95Q5k05J81J13M5k6
809b6Q9K67k2k62j79J42j41o2n7K83P7j13K05J55r2k32L1j57p0k9N1J57K42o4
833A93l9L9Rl32J29j75n0J50N6K44J41k08q2q6o5k79k1P6J15q4J87K74K35R6j94
858C29j21j72r8m05J45k1L96J88kK34M5j15j35l14O5m70m8K31L6L1K29lK37k29
882C3j64M0j87k9r4R8K83L04q7o3K33j31m7j02J33p9q6r5K57J69k89P0k62r7k13
$$ plain form
907 -405 -396 -382 -384 -566 -250 -94 -147 117 -22 114 117 8 -355 -137 41 9 222 244 501 684 623 549 144 133 -94
932 -94 -273 -185 -178 -144 -152 -72 92 -100 -289 -512 -287 -687 -398 -521 -212 -134 23 419 586 383 335 394 140 -106
956 -106 158 296 297 502 316 523 290 75 -105 -139 -189 -550 -705 -509 -308 -235 -243 -181 -216 -231 -321 -362 -112 -72 48
981 48 -17 400 552 552 487 436 577 257 184 369 287 180 155 35 167 47 -149 -301 -299 -490 -458 -411 -373 -557 -304
1006 -304 -6 -107 58 -31 -10 -10 290 3 103 464 496 261 511 440 428 387 212 -21 -97 -148 -441 -306 -191
1029 -191 -443 -262 -253 -275 -158 -191 -350 -212 -369 -312 -182 37 179 288 232 271 291 197 343 225 212 78 41 201
1053 201 108 -76 -60 -70 -14 -228 -485 -132 -184 -138 -387 -348 -214 -82 -360 -17 -141 -135 -121 159 107 210 381 362
1077 362 335 300 279 307 380 188 48 -91 21 -175 -143 -152 -94 -121 -89 -308 -201 -286 -221 -298 -159 47 -120 68 169
$$ packed form
907d05RJ4kj82L16J56n3K64j39J36Lj09l63K18J78l2K13K2K57J83o1p4m05j1k27
932i4j79Q8PL4qQ0J64j92j89k23K25m00K89j23L09P8J57L96J67k03m8N9k54k46
956a06K64J38JK05j86K07k33k15j80l4n0l61j55J96K01P3qO2l5j5r0m1K50M0J20
981D8o5M17J52%o5n1J41l20p3J85q2j07k5j20J32j20j96j52Kj91L2M7L8j84K53
1006c04K98j01J65q9K1%L00k87J00L61L2k35K50p1j2m1j75k33p6n1k93J35J15
1029a91k52J81Rk2J17l3j59J38j57N7J30K19J42J09n6L9K0r4J46j18j3j34l7J60
1053B01r3j84J6j0N6k14k57L53n2M6k49L9J34J32k78L43j24OJ4K80n2J03J71j9
1077C62k7l5k1K8P3j92j40j39J12j96L2rN8k7L2k19J07q5O5p7J39K06j67J88J01
$$ plain form
1102 169 48 184 9 89 157 212 7 126 172 208 49 -122 155 206 42 -5 -99 32 -49 -181 -10 -238 -11
1125 -11 -57 -55 -129 21 -86 -83 116 115 150 80 191 150 95 78 140 141 137 18 182 -90 -56 -2 67 153 -119 152 -94 -84
1153 -84 -102 -111 -40 -102 18 -8 16 38 -73 63 -27 -47 -32 14 -142 239 29 92 -27 202 105 75 48 59 -23 -102 64
1180 64 127 -64 24 -4 257 160 -131 -35 117 107 -101 126 97 111 -64 -133 67 -50 33 32 61 -6 -132 -46 82
1205 82 86 84 -56 73 -37 9 49 -71 -15 96 -32 4 174 90 -9 -79 -53 19 65 52 -28 -7 -99 50 102 33 -146
1232 -146 -3 -57 -75 6 -83 68 83 173 37 189 99 -19 141 17 28 101 -202 8 116 -102 64 48 189
1255 189 -122 -88 29 -92 -126 -109 19 140 -14 161 -98 -61 -12 -56 -145 44 -48 -22 58 93 76 71 20 -18 34 -64
1281 -64 -116 29 -37 -43 159 101 93 2 93 94 66 -107 -205 86 -51 -10 -41 90 36 26 -96 25 -63 -243 8 -46 -64
$$ packed form
1102A69j21J36j75Q0O8N5k05J19M6L6j59j71K77N1j64m7r4J31q1j32J71k28K27
1125a1m6Kp4J50j07LJ99jL5p0J11m1n5j7O2Jmj19J64k72L4N4O9Q6k72K71k46J0
1153h4j8rP1o2J20k6K4K2j11J36r0k0J5M6j56L81k10O3j19K29r7l0k7J1q2p9J66
1180F4O3j91Q8k8K61r7k91R6J52j0k08K27k9J4j75o9K00j17Q3jK9o7j26Q6J28
1205H2Mkj40J29j10M6M0j20N6J11j28L6J70q4r9p0K6P2M6j3q0K1r2J49N2o9j79
1232a46J43n4j8Q1q9J51J5R0j36J52r0j18J60j24J1P3l03K10J08k18J66j6J41
1255A89l11L4J17j21l4J7J28J21j54J75k59L7M9m4q9J89r2K6Q0L5j7nn1l8N2r8
1281f4n2J45o6oK02n8qr1R1Jk8j73r8K91j37M1l1J31n4j0j22J21q8j80K51n4j8
$$ plain form
1308 -64 27 12 -19 120 28 182 -142 43 -70 -75 -72 10 37 -12 116 30 183 160 24 -30 34 34 68 -107 208 53
1334 53 -159 -189 21 -230 -199 -77 -59 92 26 -130 172 68 122 29 39 -104 -2 24 111 75 131 144 175 242 1
1359 1 -45 -30 -271 -69 -217 -153 -186 -1 -110 -36 76 -102 -226 -182 82 -191 -113 -222 137 -8 133 121 54 336
1383 336 209 121 81 120 -71 74 -60 34 46 -68 -84 -203 -72 -222 -174 -83 -127 -168 -327 15 -111 161 30
1406 30 54 -31 102 167 291 413 -12 217 329 264 128 29 171 -89 -190 -55 -6 18 -70 -34 -48 -71 -205 -111
1430 -111 -270 -74 -343 -114 -49 -174 -65 196 209 218 165 86 208 38 -62 188 180 -38 315 128 166 113 21 -98
1454 -98 -287 -305 -167 -230 -245 -180 -126 -189 -151 6 35 -258 25 -65 72 -137 127 130 29 178 332 229 122 116 -93
1479 -93 -14 -93 71 -40 -15 106 -112 -45 -87 -99 -323 -133 -87 -142 -157 19 -12 102 49 91 74 102 186 -67 189
$$ packed form
1308f4R1j5l1J39r2J54l24J85j13nLQ2K7m9J28q6J53k3j36n4O4%L4j75L15j55
1334E3k12l0K10k51L1J22J8J51o6j56L02j04N4r3J0j43J02K6Q7l6N6J3L1O7k41
1359Am6J5k41K02j48O4l3J85j09P4J12j78j24M4K64k73P8j09L59j45J41j2o7K82
1383C36j27q8m0L9j91J45j34R4J2j14j6j19J31j50M8R1m4m1j59L42j26K72j31
1406C0K4q5J33O5J24J22m25K29J12o5j36r9J42k60j01J35M9K4q8L6j4k3j34R4
1430a11j59J96k69K29O5j25J09K61J3Rn3p9J22j70j00K50qk18L53j87L8n3r2j19
1454i8j89j8J38o3j5O5N4o3L8J57K9k93K83r0J37k09K64Lj01J49J54j03j07ok09
1479i3P9p9J64j11K5J21k18O7m2j2k24J90M6n5j5J76l1J14n3M2j7K8Q4k53K56
$$ plain form
1504 189 197 138 108 54 78 28 87 -112 -85 -222 -151 -148 -91 79 -11 -18 -117 87 -75 70 -82 -240 -170 -102 -9 -42 144
1531 144 283 93 242 58 22 23 -27 25 -210 121 33 -13 73 -36 -57 -52 22 -13 -112 20 -18 31 -266 -74 -132 71
1557 71 94 -33 42 38 181 89 77 98 128 93 -5 52 -42 -74 -153 -74 275 1 43 69 -7 49 71 -38 107 -112 -259
1584 -259 -70 42 31 26 40 284 209 73 78 70 -222 140 -18 -65 -17 -134 -140 225 56 226 -19 -60 147 -147 -77
1609 -77 -122 -217 -5 6 -114 -77 17 267 22 17 3 151 -71 -12 47 73 140 -165 14 -28 -43 -73 -77 180 148 56 55
1636 55 89 -101 57 24 -211 -92 27 -3 189 -3 7 118 177 34 33 37 9 49 -33 -142 -145 130 -57 -120 34
1661 34 133 99 -38 124 140 51 -32 -238 -154 -22 3 -67 93 -158 45 106 10 -105 61 105 -59 -46 -21 -47 33
1686 33 -46 84 -73 155 -8 -63 32 9 48 -27 -25 -9 184 40 -46 127 159 82 -205 -130 -2 -22 -5 62 140 -21
$$ packed form
1504A89Qn9l0n4K4n0N9j99K7j37P1LN7J70r0pr9K04j62J45j52j58P0O8R3l3J86
1531A44J39j90J49j84l6Jn0N2k35L31q8m6Q6j09k1NP4l5r9J32l8M9k97J92n8K03
1557G1K3j27P5mJ43r2j2K1L0l5r8N7r4l2p9P9L49k74M2K6p6N6K2j09J45k19j47
1584b59J89J12j1nJ4K44p5j36Nqk92L62j58m7M8j17oL65j69J70k45m1K07k94P0
1609g7m5r5K12J1j20L7R4K50k45nj4J48k22N9N9K6O7l05J79m2j5l0mK57l2r2j
1636E5L4j90J58l3k35J19J19l0J92j92J0J11N9j43jMk8M0q2j09lK75j87o3J54
1661C4R9l4j37J62J6q9q3k06Q4J32K5p0J60k51K03O1r6j15J66M4j64J3K5k6Q0
1686C3p9J30j57K28j63n5R5k3L9p5KJ6J93j44q6J73L2p7k87P5J28k0J7O7P8j61
$$ plain form
1712 -21 66 17 44 -9 -125 -106 -250 -54 1 18 -73 -173 -91 -9 -47 70 -209 -128 33 141 27 -34 166 34 5
1737 5 39 16 -153 -289 -144 75 96 -30 40 101 128 -3 -160 -26 -152 86 -183 -202 81 -57 101 -85 30
1760 30 -17 265 62 70 -117 -19 42 -100 -58 -21 169 67 19 -109 -98 31 74 51 -238 33 143 15 -88 4
1784 4 165 -28 -7 -39 -33 -107 -25 -79 91 29 89 -45 -93 -159 -40 -68 -288 14 17 121 43 152 -30 206 -37 -187
1810 -187 -129 52 -10 -117 -223 128 215 173 155 76 182 148 -33 -203 -123 40 -27 -58 213 48 90 -12 0 -48
1834 -48 -22 -173 -122 -93 97 53 -64 -33 -45 -18 -42 110 65 95 -79 -61 -28 131 139 -120 -155 -30 19 -98 -37 -40 -36
1861 -36 62 77 43 195 -28 -107 -121 -301 79 -37 125 32 75 159 212 -4 63 168 -131 -149 -133 -60 -93 -47 115
1886 115 182 60 -30 -132 4 -167 121 21 -225 -102 -95 159 41 -207 47 47 59 8 -14 -105 196 122 6 2
$$ packed form
1712b1Q7m9K7n3j16J9j44J96N5J7r1j00Q2Q2l8J17k79Q1J61J08j14o1K00j32k9
1737EL4k3j69j36J45K19K1j26P0O1K7j31j57J34j26K38k69j9K83j38J58j86J15
1760C0m7K82k03Qj87R8O1j42M2L7J90j02m8j28J1J29M3k3k89K71J10j28j03R2
1784DJ61j93K1l2Op4Q2n4J70o2O0j34m8o6J19k8k20L02LJ04p8J09j82K36k43j50
1810a87N8J81o2j07j06L51Q7m2j8p9J06l4j81j70Q0J63o7l1K71j65M2j02J2m8
1834d8K6j51N1K9J90m4j17L1j2K7k4J52m5L0j74J8L3J59Qk59l5J25M9j17O1lM
1861c6R8J5l4J52k23p9j4j80L80j16J62r3M3Q4N3k16O7J05k99j8J6P3l3M6J62
1886A15O7j22r0j02J36j71K88j00k46J23PK54j18k48K54%J2n1k2r1L01p4j16m
$$ plain form
1910 2 88 35 -45 -170 42 -1 32 -40 -35 -20 116 72 -66 -43 -17 -29 18 -138 44 -83 48 114 -51 91 101 82
1936 82 -123 -48 -7 -96 -274 -26 -96 127 92 -30 -113 70 36 -44 -112 115 130 -21 -65 -95 138 20 26 66 2 91
1962 91 25 20 -55 -86 -7 -95 -97 6 17 17 -81 -196 -17 75 208 -1 -87 -34 34 -49 -82 203 189 -129 -2 -184 62
1989 62 200 120 -101 84 85 235 58 0 105 57 -115 142 -29 118 -94 -50 30 122 -95 19 44 -119 30
2012 30 -129 -34 -54 129 114 -81 0 -2 25 -59 -82 -109 -100 158 -73 -11 43 -100 5 19 -62 -25 45 -122 -19 69 283
2039 283 35 155 -116 117 -47 15 -10 35 -76 175 -29 -104 97 89 -30 16 -26 -38 56 110 -2 -123 -70 173
2063 173 -110 126 57 -129 32 -11 157 128 45 52 -53 -89 134 39 135 116 40 -83 20 157 203 184 -7 29 2
2088 2 -62 -30 -29 -312 86 226 -114 -46 -57 -170 -99 -205 48 -218 -232 53 32 120 131 -73 25 106 -9 148 -2
$$ packed form
1910BQ6n3q0j25K12m3L3p2NJ5J36m4j38K3K6j2M7j56J82j27J31O6j65J42J0j9
1936H2k05P5M1q9j78K48p0K23l5j22q3J83l4q0o8K27J5j51m4l0K33j18OM0o4Q9
1962I1o6np5l1P9q8kJ03J1%r8j15J79R2J33k09q6N3O8q3l3K85j4l18J27j82K46
1989F2J38q0k21J85JJ50j77n8J05m8j72K57j71J47k12M4Q0R2k17J14K5j63J49
2012C0j59R5k0J83j5j95Q1kK7q4k3k7RK58k31O2N4j43J05J4q1L7P0j67J03Q8K14
2039B83k48J20k71K33j64O2k5M5j11K51k04p5K01qj19M6m2j2R4N4j12j21N3K43
2063A73k83K36o9j86J61m3J68k9q3Pj05l6K23r5R6j9p6j23J03J37M6j9j91L6k7
2088Bo4L2Jk83L98J40l40O8j1j13P1j06K53k66j4K85k1Q8J1k04R8Q1j15J57j50
$$ plain form
2113 -2 44 -98 97 -54 -90 138 -126 49 13 -136 -52 -159 23 79 -78 -58 67 -79 75 -114 137 -16 19
2136 19 -167 -78 -6 -159 46 -73 -214 11 -84 -52 90 55 165 -75 35 -10 148 -21 31 -111 134 37 40 -74
2160 -74 102 71 -116 -27 -89 -49 73 103 -56 66 92 66 50 -30 75 20 97 -24 -12 -84 57 58 -340 -97 -68 -72
2186 -72 -26 3 -52 -2 -44 -15 35 -13 49 8 75 64 -60 -6 94 95 -99 -16 -38 -38 137 36 -36 158 -4 41 -146
2213 -146 -122 51 -171 -17 -168 -4 123 98 -158 -186 -146 1 -132 -116 63 154 45 -144 72 -16 -144 -104 -3
2236 -3 -163 11 -76 51 -183 19 -114 -108 -27 -137 -132 -52 -21 38 -63 -113 106 4 147 -77 131 -127 15 -69
2260 -69 -48 -39 -144 91 125 -46 210 -119 -117 -29 162 6 75 37 106 -85 56 67 21 101 107 -53 67 -28 -120 84
2286 84 -3 -96 -111 125 -154 120 60 -104 33 -57 -69 -2 -196 -169 1 20 78 -2 -75 24 -35 -3 -116 56 -20 -84
$$ packed form
2113bM6j42J95j51l6K28k64J75l6j49Q4j07J82N6j57K0J25j46J54j89K51j53L5
2136A9j86Q9P2j53K05j19j41K25r5L2J42l5J10k40J10m5J58j69N2j42K45r7Lj14
2160g4J76l1j87Q9o2M0J22L0j59J22K6k6j6q0J05n5P7j21J2p2J41Jl98K43K9m
2186g2M6K9n5N0m2K9N0m8O2m1O7j1j24N4J00Jj94Q3k2%J75j01p2J94j62M5j87
2213a46K4J73k22J54j51J64J27k5k56k8M0J47j33J6J79R1j09j89K16q8j28M0J01
2236cj60J74q7J27k34K02j33OQ1j10NQ0L1N9j01n0K19j02J43k24K08k58J42q4
2260f9K1Rj05K35L4j71K56l29KQ8J91j56O9l8O9j91J41J1m6Q0Oj60J20r5r2K04
2286H4q7r3j5K36k79K74o0j64J37r0j2O7j94K7J70J9N8q0p3R9n9L2j13J72p6o4
$$ plain form
2312 -84 77 64 94 -83 -198 -44 -141 31 -52 30 94 -21 -2 -183 33 80 -92 102 -38 -60 -151 78 92 -47
2336 -47 126 -7 206 -105 -141 8 -176 -133 91 -138 15 47 59 42 13 85 -291 34 14 -51 -80 125 -47 -12
2360 -12 -159 -113 43 80 -30 -38 180 27 64 32 -63 -84 -108 44 109 -32 65 -10 -155 22 -130 46 -123 14
2384 14 -137 170 -2 30 -15 -27 -102 24 146 -56 -60 12 197 -21 -47 24 56 23 -34 28 122 -102 -43 -39 43 -77
2410 -77 -65 -9 -4 -9 98 -79 94 40 26 91 8 -45 -23 -209 -34 16 -129 28 68 36 -73 32 120 -89 -222 40
2436 40 78 65 -101 118 -21 -56 30 -166 85 91 45 -71 -59 -22 -59 -83 1 82 111 243 91 -67 -13 -67 -183 -16
2462 -16 -65 91 -6 -199 79 81 -104 -57 -40 -106 -39 24 -29 -2 251 -126 -138 161 -180 11 -44 82 107 -32 79
2487 79 92 -61 65 17 56 -72 -37 -4 -80 26 -20 46 -50 111 191 -65 -128 110 -30 107 -49 186 -87 -6
$$ packed form
2312h4J61j3L0j77j15J54r7J72q3Q2O4j15J9j81K16M7j72J94j40k2r1K29J4j39
2336d7J73j33K13l11l6J49j84M3K24k29J53L2J2j7k9P2l76L25k0o5k9K05j72L5
2360a2j47M6J56L7j10qK18j53L7l2r5k1k4J52O5j41R7p5j45J77j52J76j69J37
2384A4j51L07j72L2m5j2p5J26J22k02mP2J85k18k6P1L2l3n7O2R4k24N9MQ2j20
2410g7J2N6NnJ07j77J73n4j4O5q3n3K2j86J75N0j45J57M0l2j09J05Q8k09j33K62
2436D0L8j3j66K19j39l5Q6j96K51Om6j16J2L7l7k4Q4Q1K9J32j52j58N4n4j16J67
2462a6m9J56r7j93K78Kj85M7J7o6O7O3n3K7K53l77j2K99l41J91n5J26K5j39J11
2487G9J3j53J26m8L9j28L5L3p6J06m6O6r6J61Q0k56o3K38j40J37j56K35k73Q1
$$ plain form
2511 -6 112 -16 -56 109 66 -35 87 91 -130 38 -20 21 6 -131 167 71 -126 -140 20 63 168 -138 13 45
2535 45 30 81 40 104 -142 107 -104 4 -63 89 -76 -35 75 12 18 -130 73 -21 -111 -93 26 -71 -45 -33 35 -83
2561 -83 -96 -50 -31 10 -65 22 37 82 79 64 -28 35 25 31 74 32 69 169 -198 -75 93 -78 -25 -147 38 108 -95
2588 -95 40 -92 170 4 24 -50 6 108 -98 19 -63 -133 -17 95 -33 -84 -212 -5 -77 -89 1 59 176 29
2612 29 96 136 16 -107 127 -73 30 28 -70 86 -73 75 56 31 244 77 -23 -145 159 2 -31 -56 -26 -124
2636 -124 4 -28 221 2 18 78 -26 -46 -83 -105 -31 42 96 -128 0 16 53 83 -58 -2 -22 -19 -4 -62 -20 183
2662 183 71 156 -29 -62 -56 -36 -32 145 11 -185 155 -24 14 -141 -81 -166 -53 -42 -38 161 169 43 94 -30 -78 110
2688 110 -38 128 -130 55 6 178 -49 -54 44 -3 -46 43 162 -69 -40 127 -123 -149 125 99 -66 36 84 -51
$$ packed form
2511fJ18j28m0J65m3j01J22Mk21J68n8M1j5j37K98r6j97j4J60M3J05l06J51L2
2535D5j5N1m1O4k46K49k11J08o7J52j65M1J10o3Oj48K03r4r0J8J19r7K6J2O8j18
2561h3j3M6J9M1p5Q7J5M5lj5r2O3j0OM3m2L7J00l67J23J68j71N3j22J85P0k03
2588i5J35j32K62j66K0p4N6J02k06J17q2p0J16J12j28n1j28K07p2j2R0N8J17j47
2612B9O7M0j20j23K34k00J03kr8J56j59J48j9k5K13j67j00j22L04j57l3k5L0r8
2636a24J28l2K49k19J6O0j04k0l7k2P4P3N4k24J28J6L7L0j41N6k0LJ5n8M2K03
2662A83j12Q5j85l3OK0MJ77j34j96L40j79L8j55O0q5J13J1MJ99Qj26N1j24m8J88
2688A10j48J66k58J85m9J72k27nR8m7m3Q9J19k31K9J67k50k6K74k6j65J02M8j35
$$ plain form
2712 -51 -109 -112 -59 -70 -29 -230 100 -9 45 19 13 -38 -35 -72 18 -50 -40 -1 -31 121 110 -111 16 7 -74 208 -88 80
2740 80 153 1 -105 46 -170 -13 -8 46 -141 -121 -109 59 -55 1 70 -98 118 100 126 -9 93 1 77 -50
2764 -50 76 -43 30 -67 91 170 89 -218 -142 42 -48 -30 36 138 -150 69 132 -17 124 14 48 0 -22 -271
2788 -271 94 189 48 10 -120 -1 -112 -62 128 -21 72 -49 -29 23 70 0 -88 204 5 -127 -53 -89 -120 -4
2812 -4 -23 -97 -86 81 6 19 64 6 50 126 -170 -18 -95 -97 -49 13 -54 5 77 28 -35 -185 45 -47 27 -141 85 -30
2840 -30 -52 -155 54 24 -144 12 -108 -88 -11 -45 -48 -93 -40 63 -5 -81 -41 72 74 -37 -51 63 -41 -14 103 61
2866 61 133 -56 -11 26 -46 -16 -240 107 -127 -74 31 27 54 -78 103 -32 92 -125 29 -83 182 -51 -10 -67
2890 -67 -245 -58 -56 40 -202 12 45 -176 -36 5 -16 22 -112 50 51 104 -181 -107 25 -27 -29 -46 -49 -166 154 -135
$$ packed form
2712e1n8lN3j1M1k01L30j09N4k6on1Ll7R0o8J0L9l0J52j1k21J27rq1K82k96J68
2740H0P3j52j06J51k16J57NN4j87K0J2J68j14N6O9j68K16j8K6j35J02r2P6j27
2764e0J26j19P3r7J58P9q1l07P6J84r0J8O6J02k88K19O3j49J41j10L4m8k2k49
2788b71L65R5j41l8j30J19j11N0J90j49R3j21K0N2M7p0q8K92j99j32P4l6l1J16
2812dj9p4J1J67p5J3M5n8M4P6k96J52p7kM8O2o7N9P2m9o3j50K30r2P4j68K26j15
2840c0k2j03K09l0j68J56j20K0P7l4lm5N3J03o8p6M0J13Kj11j4J14j04K7J17m2
2866F1P2j89M5L7p2L0k24L47k34N3J05mK7j32J81j35J24k17J54j12K65k33M1n7
2890f7j78J87KR6k42K14L3k21J40M1k1L8j34J62JN3k85P4J32n2kj7lj17L20k89
$$ plain form
2916 -135 -1 111 -221 -2 -61 -64 38 25 -34 -87 20 -54 82 10 -114 -35 -28 -31 -160 -79 -3 -117 106 44 -71
2941 -71 54 7 50 81 -242 11 55 -74 74 137 113 -29 -64 40 183 144 18 -62 -54 32 70 17 177 111 -55
2966 -55 -24 -14 -5 -112 129 -158 42 -40 26 16 -40 -8 -162 221 -114 119 -39 -243 35 -20 -67 120 -159 53
2990 53 -54 -113 22 13 37 -15 152 -158 -19 -142 -55 -72 16 73 28 -114 -45 -71 -19 88 -23 -2 153 87 17 38
3016 38 52 -28 40 31 104 20 -34 -41 79 19 -53 71 8 91 -109 130 104 16 45 7 51 33 -121 18 -37 0 -97 -98 -54
3045 -54 -54 -9 31 101 111 63 10 222 -67 -48 8 66 261 21 -3 -62 78 73 46 -23 -121 2 178 65 249 63
3071 63 -145 -19 -18 -56 59 56 81 112 24 -88 17 61 123 155 -117 60 -45 -21 22 -36 -35 -81 -116 6 -48 30 -119
3098 -119 -19 -96 31 -48 29 6 64 6 24 -80 -28 22 3 -25 135 5 -76 -85 -94 46 -22 46 57 -37 1 -98 1 46
$$ packed form
2916a35J34J12l32K19n9lJ02j3n9n3J07p4J36p2j24P9Plj29Q1P6j14K23o2j15
2941g1J25m7M3L1l23K53M4j29J48O3k4j42l5J04J43l9j26q0QQ6L8n3J60o6j66
2966e5L1J0Rj07K41k87K00q2O6j0n6L2j54L83l35K33j58k04K78n5m7J87k79K12
2990E3j07n9J35rK4n2J67l10J39j23Q7j7Q8N7m5j42O9k6N2J07j11K1J55o6p0K1
3016C8J4q0O8rP3q4n4pJ20o0p2J24o3Q3k00K39k6q8K9l8M4j8j54J39n5L7r7jM4
3045e4%M5M0P0J0m8n3K12k89J9N6N8J95k40k4n9J40nk7o9r8J23J76j13J84j86
3071F3k08J26Jl8J15lK5L1q8j12J05M4O2L2k72J77j05K4M3n8Jm6l5J22n4P8j49
3098a19J00p7J27p9P7k3N8n8J8j04N2N0j9k8J60j30q1rrJ40o8O8J1r4L8r9R9M5
$$ plain form
3126 46 -13 199 -147 79 -68 95 49 60 -80 47 131 26 38 100 -165 42 33 -42 -209 -2 22 50 63 -7 75
3151 75 110 47 57 -66 -120 -38 -92 8 11 -36 -167 -74 -119 -111 -179 -45 -4 -56 -29 69 -174 104 13 171 -63 -31 -72
3178 -72 -108 74 -17 49 -109 17 28 23 90 -21 8 40 -21 -104 29 89 -33 140 52 -56 74 90 32 -21 65 137
3204 137 -66 -54 4 -20 189 23 -106 -3 44 220 -180 43 6 52 270 69 -250 53 -23 26 -6 4 15 -29
3228 -29 49 14 -95 -103 30 94 -18 -65 -72 46 -6 10 46 -17 61 -20 10 171 -7 109 -51 44 125 -106 109 45
3254 45 7 -107 -28 -45 100 76 134 -74 -105 112 -118 17 -53 68 61 124 50 -97 -62 -20 90 -60 115 38 163
3279 163 145 -12 -148 -75 -84 68 -53 -60 27 28 67 35 -62 -23 -9 5 25 -42 -21 -16 -117 -24 0 -113 -17 -33 -101 -82 -51
3308 -51 2 92 76 -175 -3 12 27 206 -186 110 118 -114 -5 115 -171 86 -12 95 37 76 -82 150 31 157
$$ packed form
3126D6n9K12l46K26j47J63m6J1j40J27Q4j05J2O2k65K07rp5j67K07K4K8J3p0Q2
3151G5L5o3J0j23n4Q2n4J00Lm7j31R3m5Qo8J34M1n2K7R8k43K78r1J58k34L2m1
3178g2l6J82r1O6j58J26J1nO7j11K9L2o1q3J33O0j22J73q8j08J30J6n8n3Q6P2
3204A37k03J2N8k4K09j66j29J03M7J76m00K23l7M6K18k01l19L03p6M9l2J0J1m4
3228b9P8l5j09qJ33O4j12m7pJ18n2J6L6o3P8q1L0J61j78J16j60R5Q1k31K15o4
3254D5l8j14P9j7J45k4N8k08l1K17k30J35p0J21pO3p4j47L5M2J10j50J75p7J25
3279A63j8j57j36P3rJ52j21pQ7JL9l2r7L9J4J4K0o7K1Nj01R3K4j13R6j6o8J9L1
3308e1N3R0j6k51J72J5J5J79l92K96Qk32J09J20k86K57r8J07n8L9j58K32j19J26
$$ plain form
3332 157 131 146 -53 70 -80 11 62 77 192 -30 -142 -40 101 58 130 -118 9 84 32 5 24 51 25 -64 -27
3357 -27 -18 18 43 89 -117 -59 137 -72 -42 -15 69 -19 -162 -60 -26 167 80 82 33 -210 16 -38 175 -53 -46 154
3383 154 8 -10 -103 -60 -137 -53 47 -138 -131 101 71 25 -9 -152 -14 45 -17 36 -9 -38 -70 -6 -27 -90 -55 -34 90
3410 90 148 -12 61 160 119 -25 110 -41 -48 68 -56 168 -1 54 -50 -63 1 87 -229 180 66 33 131 81 -88
3435 -88 -90 133 37 0 -54 -68 -23 0 74 -22 70 76 -42 -19 20 14 -116 -21 -40 28 0 48 105 61 115 -91 140 -74 103
3464 103 26 -25 -23 -153 257 205 -62 -42 -65 -37 -50 -19 20 43 151 -125 157 22 153 91 57 -135 114 -43 37
3489 37 106 18 39 -12 44 -18 47 242 58 -9 -116 88 -10 2 112 9 141 -42 263 -65 -107 35 120 24 -44
3514 -44 -114 74 113 -56 -212 -69 51 149 -23 163 -56 -65 -123 -111 10 32 58 29 40 101 132 -49 17 49 -78
$$ packed form
3332A57k6J5j99J23j50R1N1J5J15k22j12J02J41m3P2k48J27P5n2k7J9K7k6q9L7
3357b7RL6K5M6k06N8J96k09L0K7Q4q8j43J02L4J93q7Km9k43K26n4K13k28PK00
3383A54j46j8r3M3p7Q4J00j85PK32l0m6l4j43J38N9o2N3m5k9l2O4k1o3L5K1J24
3410I0N8j60P3R9m1j44J35j51pJ16j24K24j69N5j04j3O4Q6l16M09j14l3R8n0j69
3435h8kK23r6l7n4j4M5K3P4r6R2Oj18K3L9oj30R5j9O8k8M8N7m4N4k06K31k14J77
3464A03p7n1Kj30M10n2k67K0k3K8j3L1L9K3J08k76K82j35J31o2l4j92K49j57Q0
3489C7O9q8K1n1N6o2O5J95j84o7j07K04r8J2J10j03J32j83L05l28m2J42Q5r6o8
3514d4p0J88L9j69j56J43J20R8j72J86k19rn8J2J21K2K6k9J1O1L1j81O6L2j27
$$ plain form
3539 -78 -98 3 -94 78 41 152 -169 207 163 -100 -42 70 -45 -20 -122 -108 -52 -7 81 -24 33 32 46 16 -63 95
3565 95 23 36 -158 201 11 -103 -6 -40 79 -115 -54 62 116 5 115 -144 70 5 -41 39 -140 9 -54 12
3589 12 92 34 -39 41 9 25 34 15 143 -53 -109 -36 104 167 -16 132 152 13 -137 15 171 193 19 -67 -72 37
3615 37 -28 59 7 148 31 97 -75 73 -121 -128 67 -33 86 -63 -78 36 53 173 57 110 -72 -63 3 41 -30
3640 -30 -14 -74 95 -1 -70 22 58 -101 73 -114 145 -1 20 -123 86 79 -47 18 -54 4 -23 -106 -20 61 7 19
3666 19 90 77 -103 139 -123 -13 -29 -172 -90 26 -26 69 47 -58 -15 -123 30 130 146 135 -55 68 -124 14
3690 14 -21 80 156 48 -8 33 -167 2 72 24 48 80 156 119 -75 -111 -216 -22 -37 106 26 52 84 15 -132 -178
3716 -178 102 0 138 35 -2 116 -5 59 -13 53 -40 -81 258 6 40 -31 6 1 -1 -12 -35 -111 -175 -2 93 243
$$ packed form
3539g8k0J01r7J72l7J11l21L76m4k63N8J12j15K5j02J4N6M5Q8j05N7jJ4l0p9J58
3565I5p2J3j94L59j90j14R7l4J19j94O1J16N4j11J10k59K14o5m6Q0j79J49o3O6
3589A2Q0n8p3Q0l2J6Rj9J28j96n6P3J40O3j83J48K0j39j50J52J56K2j74q6nJ09
3615C7o5Q7n2J41j17O6j72J48j94pJ95j00J19j49j5J14J7J20j16N3j82RO6L8p1
3640c0J6o0J69r6o9R2L6j59J74j87K59j46K1j43K09pj26O5p2N8k7q3Q6Q1n4J2
3666A9P1j3j80K42k62J10j6j43Q2J16n2R5k2j05M3j08J53J00J6j1j90J23j92J38
3690A4l5J01P6j08n6M1k00J69P0m8K4L2P6l7j94l6j05J94j5J43q0K6L2o9j47m6
3716a78K80j02J38j03l7J18j21O4p2O6r3m1L39k52L4p1L7nkj1k3p6o4J73R5J50
$$ plain form
3742 243 -163 -160 78 -73 -28 230 86 129 -33 -119 64 76 123 0 38 -8 40 73 4 134 -36 -20 146 73 1
3767 1 -8 49 36 -131 104 -102 5 98 60 -72 54 60 -5 247 -18 6 23 59 -61 -114 -72 37 -25 0 -20 19 66
3794 66 -68 174 -17 -105 -127 18 3 89 44 -99 -65 37 166 23 34 -8 73 60 191 91 99 87 -14 -88 125
3819 125 138 -40 114 -14 76 211 -206 15 72 -94 -48 51 37 -155 132 41 -47 26 110 32 -2 -186 34 -111
3843 -111 34 -28 18 136 61 30 116 -103 -166 -6 30 112 63 29 18 22 99 96 -149 -20 141 27 -18 102 -106 -14
3869 -14 -167 108 -43 127 19 26 -69 5 136 19 -57 -92 44 62 -12 -49 77 -98 37 81 -82 -24 12 -120
3893 -120 2 6 124 185 -101 165 -34 11 72 -21 52 -82 0 66 30 -134 34 -105 110 74 62 60 -138 39 63
3918 63 -46 -253 94 8 -134 44 -33 75 160 -164 -149 -6 65 57 -126 266 -38 -40 -25 -33 19 56 79 4 -107 -21
$$ packed form
3742B43m06LK38j51M5K58j44M3j62q6J83J2M7j23L8m6M8L3o9J30j70J6J66p3p2
3767ArN7j3j67K35k06J07R3l8j32J26Oo5K52k65K4J7L6j20n3M2J09o2K5k0L9M7
3794F6j34K42j91q8k2J45j5Q6m5j43L4J02J29j43J1m2Q1j3J31j00Qj2j01p4K13
3819A25J3j78J54j28R0J35m17K21N7j66M6R9j4j92K87r1q8P3Q4p8l4j84K20j45
3843a11J45o2M6J18p5l1Q6k19o3J60L6Q2m9l4j1MP7lk45J29J61j14m5J20k08R2
3869a4j53K75j51J70j08Pr5P4J31j17p6l5J36J8p4l7J26j75J35M4j63N8L6j32
3893a20J22MJ18O1k86K66j99M5O1r3P3j34Q2O6l6j64J68j39K15l6j2kj98J77K4
3918F3j09k07L47q6j42J78p7J08Q5l24J5J43P1qj83L92l04kJ5qN2L7K3p5j11Q6
$$ plain form
3944 -21 -33 -110 49 61 40 9 -32 74 8 163 93 68 -17 -3 -43 24 -22 21 0 60 116 86 -6 31 135 -85 101
3971 101 -146 -95 26 -10 -203 -174 -19 -1 -43 37 -25 -51 1 55 94 98 158 61 -90 126 66 -219 2 -141 60
3996 60 -149 -81 107 178 24 -74 52 77 -68 -15 77 121 -60 69 -8 41 147 145 -122 114 83 26 87 43 3 -4
4022 -4 37 -38 218 -135 -105 101 -20 79 11 -86 -113 -62 77 66 19 80 155 50 186 -105 48 115 -31 61 -112
4047 -112 -161 -14 -5 -122 -189 144 184 68 18 -76 -28 -31 33 23 50 -36 106 163 -17 30 78 -5 227 108 26 -41 -29
4074 -29 -29 179 138 50 31 31 -106 56 51 29 118 99 109 84 0 78 -43 -36 11 -60 -12 -128 -3 -136 -111 -38 -49 -43 -86
4103 -86 -79 86 -20 91 80 -168 -271 124 -84 -94 53 -91 -9 -51 132 -23 -24 -7 -15 201 -40 -270 5 162
4127 162 19 7 -54 16 -16 -3 -91 137 9 -77 51 -119 61 -41 10 72 74 57 -187 -19 -121 -115 -116 -102 -59 84
$$ packed form
3944b1j2p7J59J2k1l1m1J06o6J55p0k5q5J4m0O7m6M3k1O0N6l0r2L7J04k20J86
3971A01k47N1J21l6j93K9J55J8m2Q0o2k6N2N4L9MO0r7j51K16o0k85K21j43K01
3996F0k09O8J88P1j54r8J26K5j45N3R2M4j81J29p7M9J06kk67K36l1n7O1m4m0p
4022dM1p5K56l53L0K06j21R9o8r7k7N1J39j1m7O1P5j05J36k91J53O7j46R2j73
4047a12m9J47Rj17o7L33M0j16n0r4M8lO4j0K7q6J42N7j80M7M8q3K32j19q2o7J2
4074b9%K08m1q8j9%j37J62nk2Q9j9J0k5q4P8j21PM7p1M8j16J25j33K5P3j1Om3
4103h6PJ65j06J11j1k48j03L95k08j0J47j44Q2m2J83j55jJ7qK16k41k30K75J57
4127A62j43j2o1P0l2J3q8K28j28q6J28j70J80j02N1O2Kj7k44J68j02OjJ4M3J43
$$ plain form
4153 84 -77 22 71 84 97 10 21 -2 56 -185 -15 -195 -61 -52 -15 24 -127 79 111 -46 -78 31 -42 -101 91 -34
4179 -34 -61 8 59 -177 -91 -64 -57 -54 2 -2 124 118 -18 -46 -154 83 -105 -60 30 -10 -27 73 37 153 -136 -101 87
4206 87 -144 -2 6 -58 187 -14 -44 -51 -236 254 67 108 1 232 -242 -17 60 -54 217 173 130 11 17 -244
4230 -244 -22 1 -57 -87 -148 2 8 -110 -120 143 -121 32 -16 -188 115 127 71 37 10 38 -11 138 82 -3 22 101
4256 101 -81 -42 -85 -1 -109 -121 23 -80 -65 -80 -140 47 8 3 67 10 -19 117 43 21 -76 164 -55 -54 -4 -103 61
4283 61 -203 -229 224 158 -121 127 -180 101 -59 105 -89 26 20 179 -243 -28 95 -3 103 -95 109 -58
4305 -58 -2 13 4 -126 106 -55 43 -44 -5 23 -95 -84 -80 -85 -34 -9 133 -63 201 98 41 -54 30 146 132 108 -60
4332 -60 -77 296 11 -21 -95 -53 -5 52 108 -22 99 36 -17 22 11 -240 67 176 -32 171 -1 130 164 -116
$$ packed form
4153H4j61R9M9J3J3q7J1k3N8k41J70j80J34RL7L9j51K06L2j57l2J09p3n9J92j25
4179c4k7O9N1k36Q6K7PLN6mJ26oj36k8j08K37j88M5R0m0j7J00l6J16k89L5J88
4206H7k31J42Qo4K45k01l0pj85M90j87M1j07K31m74K25P7j14K71m4m3j19Ok61
4230b44K22K3n8l0o1J50Oj18j0K63k64J53m8j72L03J2n6l4k7K8m9J49n6q5K5P9
4256A01j82L9m3Q4j08j2J44j03J5j5o0J87l9nO4n7k9J36p4k2r7K40k19JN0r9J64
4283F1k64k6M53o6k79K48l07K81j60J64j94J15oJ59m22K15J23r8J06j98K04j67
4305e8N6J5rj30K32j61R8q7L9K8j18J1MnN1K5J42j96K64j03n7r5Q4J16j4k4j68
4332f0j7L73k85l2p4M2M8N7N6j30J21o3n3L9j1k51L07J09k08K03j72J31L4k80
$$ plain form
4356 -116 -13 -33 114 -23 -156 -132 105 -40 176 -110 -160 -120 -86 -58 31 -23 -37 143 138 -13 46 129 63 -189 -71
4381 -71 65 -197 59 -182 -30 -21 33 -29 -51 33 -52 -201 167 -29 86 -88 -79 57 104 65 8 7 -33 98 9 61
4407 61 72 -7 172 94 212 -57 -48 -19 -233 -14 -47 96 -211 -178 -91 -32 169 -49 -37 90 62 7 12 -245 -88
4432 -88 -127 32 8 -200 60 27 89 159 -2 -44 -134 77 119 47 89 9 0 12 -20 44 153 12 -63 20 61 -119 79
4459 79 121 -18 -79 -229 82 29 -85 -320 -36 -224 -40 82 19 45 16 83 32 -7 -74 14 -218 -101 -26 -93 54
4484 54 -64 -68 6 55 37 83 -150 175 -110 -119 -59 -66 -78 -145 -12 -43 144 -149 44 -38 14 90 -60 141 85 26 -92
4511 -92 -115 190 -26 -27 -111 -101 -210 -38 -5 102 58 230 120 -53 74 -126 75 71 -181 -41 2 23 3 201
4535 201 134 4 114 1 11 -118 -53 -115 0 -116 44 -2 121 -99 63 -165 -32 -58 77 -37 -61 -28 -72
$$ packed form
4356a16J03k0J47j37j33K4K37j45K16k86n0M0L4K8Q9n4j4J80nj51N9Q3o6k52J18
4381g1J36k62K56k41J52RN4o2k2Q4q5j49L68j96J15j74RJ36M7l9n7jm0J31q9N2
4407F1J1p9J79p8J18k69RK9k14K19l3J43l07L3Q7N9K01k18J2J27k8n5Nk57J57
4432h8l9J59k4k08K60l3O2P0j61m2r0K11M2p2M2q0rJ2l2O4J09j41p5Q3M1j80J98
4459G9M2j39o1j50L11n3j14k35K84j88J84J22o3K6k9O7n1l9o7Q8k32J17P5o7J47
4484E4j18mP4M9j8M6k33L25k85rO0pj2o7J33l1J87k93J93q2N2P6j50K01n6n9j18
4511i2k3L05k16jq4J0j09J72L3J07m4J72j10j73J27k00K01mk52J40M3K1k0J98
4535B01o7j30J10j13J0j29O5o2J15j16J60m6J23k20J62k28J33k6J35j14k4L3m4
$$ plain form
4558 -72 -2 -24 6 -2 58 -11 26 87 -83 100 -230 149 142 33 22 1 82 20 -36 -116 4 -25 114 -42 -30 139 127
4585 127 131 -68 19 9 -22 206 32 29 35 83 -29 73 0 32 -102 -70 271 63 -195 -16 21 -152 -102 -27 128
4610 128 15 -103 59 82 6 -8 16 70 -101 60 -170 169 -168 32 146 57 163 -29 -31 -122 135 -145 -27
4633 -27 20 20 45 -56 -24 43 -113 15 -150 138 -89 38 -51 182 -62 -71 -58 55 113 -127 -21 -7 14 14 35 220
4659 220 80 -50 -25 95 -7 -56 127 198 -36 53 51 20 185 -40 71 43 61 9 -104 4 129 -38 -32 -5
4683 -5 50 198 -80 -204 6 33 -55 173 -50 -105 53 78 -109 149 -149 -9 -151 5 -68 -138 14 8 -20 -184
4707 -184 -60 64 12 -103 46 -154 10 76 158 -38 47 -73 102 104 -217 76 66 57 66 -55 34 -164 29 122
4731 122 64 -93 149 90 -2 109 59 114 -56 -300 -163 -85 -96 24 -143 80 -85 -13 132 1 115 -90 -138
$$ packed form
4558g2P0k2L0qO0o9L7O1j70J83l30L79pj09j1k1Q1o2n6q0J20k9J39j56J2J69j2
4585A27Mj99Q7j0l1K28j74lOM8j12J02p3L2j34L2L41k08k58J79L7j73N0P5J55
4610A28j13j18J62K3p6j4K4N4j71J61k30L39l37K00J14q9J06j92kr1K57k80J18
4633b7M7%K5j01L2O7j56J28j65K88k27J27q9K33k44rJ3J13N8k40J06J4K1%K1J85
4659B20j40j30K5J20j02m9J83P1k34Q9kl1J65k25J11k8J8n2j13J08J25j67OK7
4683eN5J48k78j24K10K7q8K28k23n5J58K5j87K58k98J40j42J56p3p0J52ok8j64
4707a84J24J24n2j15J49k00J64O6Q2j96Q5j20J75Kl21K93j0rRj21Q9j98J93R3
4731A22n8j57K42n9r2J11n0N5j70k44J37P8j1J20j67K23j65P2J45j31J14k05m8
$$ plain form
4754 -138 -23 -115 84 2 11 -3 -63 -176 -15 23 -106 -15 -258 -58 -17 30 -1 -93 29 15 -41 4 95 -229 49
4779 49 -14 -53 -123 -3 258 -4 92 37 150 6 73 34 -137 234 -70 -91 -41 38 -113 11 9 -20 -69 27 7 99
4805 99 71 -156 216 66 -24 47 96 29 -48 25 143 16 47 17 -63 96 -92 137 56 21 -60 -27 66 122 70 86
4831 86 164 62 117 117 -52 12 249 92 -101 175 62 93 -28 30 -34 -113 38 -17 7 24 -11 67 -113 -64 22 27
4857 27 -30 16 54 -91 98 138 16 -24 62 -168 -28 -69 8 -39 79 -12 -112 -68 -27 -19 63 -4 39 -35 53 -20 206
4884 206 -20 18 -149 99 65 81 276 78 7 46 1 50 -215 -80 -94 -62 -70 26 -8 -85 -130 68 -238 -42 -97
4909 -97 7 -77 -89 -54 96 -95 129 62 67 -21 46 138 -61 57 33 -4 65 163 -181 115 33 78 100 6 -77 -38 43
4936 43 -142 79 2 -164 -91 78 -63 -76 65 -32 73 42 -51 102 -51 -20 21 -37 221 -23 -51 81 140 -36
$$ packed form
4754a38J15r2J99q2Rj4o0j13J61L8j29R1k43K00M1M7l1r2J22j4n6M5R1l24K78
4779D9o3l9p0J20K61k62R6n5J13j44O7l9j71L71l04k1N0P9j51J24kk9m9R6k0R2
4805I9k8k27L72j50r0P1M9o7p7P3J18j27L1l0q0J59j88K29q1l5q1L3R3N6n2J6
4831H6P8j02N5%j69O4K37j57j93K76j13L1j21N8o4p9J51n5K4J7l5P8j80M9Q6N
4857B7n7M6L8j45J89M0j22m0Q6k30J40m1P7m7J18r1j00M4M1QQ2o7M3p4Q8p3K26
4884B06k26L8j67K48l4J6J95j98p1L9m5M9k65J35j4L2qR6l4p7m5J98l06J96n5
4909i7J04q4j2L5J50j91K24o7Nq8O7R2j99J18k4l7O9R8l44K96q2M5K2r4q3L9Q1
4936D3j85K21p7j66P3J69j41j3J41r7J05l1r3J53j53L1M1n8K58k44k8J32N9j76
$$ plain form
4960 -36 -26 -55 -144 -13 131 39 -108 -8 71 101 156 -60 55 -73 -118 -16 -15 -178 -56 96 -53 -46 26 -3 95
4985 95 -63 62 -72 -2 53 -11 72 -18 104 24 65 112 54 29 49 124 227 -33 -17 26 -83 -26 84 -77 -78 130
5011 130 74 35 -101 -53 -107 -93 86 -35 123 110 84 144 5 -96 -19 -19 105 24 -8 136 41 -17 148 -102 -74
5036 -74 90 -134 -92 -56 39 -168 36 -113 -107 -50 -69 -45 1 13 -14 81 11 -31 -11 -181 -40 -27 38 22 58 -128 36
5063 36 -26 -106 -17 96 5 34 -54 4 -28 20 159 14 -210 -162 118 -89 87 -90 12 -55 55 -87 123 -15
5087 -15 -33 96 -2 145 -42 83 17 -179 -137 -166 82 76 57 -37 -111 -39 43 145 -88 14 -97 -108 -141 150 11
5112 11 -59 -26 -27 -205 -41 60 126 -148 69 -61 61 20 97 -92 -46 154 -101 141 -46 -6 182 79 113 201
5136 201 -92 84 32 19 -50 -6 24 40 21 12 19 -11 -37 47 51 11 -85 103 -21 111 -10 -25 -124 -29 35 -226 -4
$$ packed form
4960c6J0k9q9J31J44r2j47J00P9L0N5k16J15j28m5J02Jj63J22J52j49PP2k9R8
4985I5j58J25j34P0N5o4Q3r0J22q0M1M7n8k5K0P5J03k60J6M3j09N7J10j61jK08
5011A30n6l9j36M8n4J4J79j21J58j3k6O0j39j01P7%J24q1l2J44r5n8J65k50K8
5036g4J64k24M2L6R5k07K04j49ON7j9K4M6J2k7R5p0m2K0j70J41J3O5j6L6j86J64
5063C6o2q0Q9J13r1K9q8N8l2M8J39j45k24M8K80k07J76j77J02o7J10j42K10j38
5087a5j8J29r8J47j87J25o6j96M2k9K48oj9r4p4P2Q2J02k33J02j11j1l3K91j39
5112A1p0L3jj78J64J01O6k74K17j30J22m1P7j89M6K00k55K42j87M0J88j03L4Q8
5136B01k93J76n2j3o9M4L0J6j9rPl0k6Q4Mm0r6J88j24J32j21j5r9R5O4k61K22
$$ plain form
5163 -4 -88 20 -4 158 91 72 -21 35 29 -48 58 25 179 95 1 -86 18 -1 -127 77 57 107 -78 33 62 -141
5189 -141 -64 -37 -38 -79 73 85 101 81 -91 -58 37 35 178 -22 7 29 67 99 -94 -69 -110 -58 -87 -30 46 235 -25
5216 -25 -42 -70 19 102 99 30 -85 25 163 -110 -103 36 -62 49 66 7 133 -77 36 43 -37 76 -41 -11 -55 12
5242 12 -36 -142 75 -63 18 25 219 -46 43 69 -106 -104 55 55 -57 2 -67 28 222 68 -112 32 -37 51 -40 -47
5268 -47 53 61 -154 185 -19 -11 -66 -91 -12 10 -85 110 -32 -8 -142 145 -24 -115 98 -67 -27 6 16 -141 -19
5293 -19 -81 67 47 139 -13 -26 -63 -96 -1 58 83 37 -76 -187 -108 41 -40 95 30 52 -144 -1 31 -2 -138 -143
5319 -143 35 163 -105 -76 67 130 -35 173 -236 -12 45 -89 202 95 133 23 -12 -73 -237 6 -60 -78 119
5342 119 -63 -69 5 102 111 -64 -64 -59 87 21 77 12 33 58 -3 -70 75 99 56 -58 9 -184 10 1 268 166 60
$$ packed form
5163dq4J08k4J62o7j9r3N6op7J06l3J54q4r4q7J04j9j26K04k0N0j85J11K9k03
5189a41P7K7jm1J52J2J6k0j72L3R5kJ43k00K9K2L8L2j93K5m1N2k9N7P6J89k60
5216b5j7k8Q9Q3lo9j15J10J38k73PJ39r8J11J7n9J26k10J13Pq0J13j17L0m4O7
5242A2m8j06K17j38Q1PJ94k65Q9K6j75KJ59%j12N9o9R5J94j54j80J44o9Q8r1p
5268d7J00Qk15L39k04Qn5k5P9K2r5J95j42K4j34K87j69r1K13j65M0L3J0j57J22
5293a9o2J48k0R2j52j3l7l3R5N9K5m6j13j11P9J49q1J35o5K2j96J43L2l3j36n
5319a43J78J28k68K9J43O3j65K08m09K24N7j34K91j07L8j10l5o1j64K43o6j8J97
5342A19j82oP4R7Rj75%NJ46o6N6o5K1K5o1o7J45K4m3j14O7j93J94rK67j02j06
$$ plain form
5369 60 93 70 145 140 -62 27 46 37 58 83 -118 -240 -21 -173 0 30 18 -68 -95 66 62 -54 129 -51 -171 -67
5395 -67 114 -45 -26 -39 -35 -76 -29 7 54 -102 -26 23 -62 -74 1 -176 26 93 -61 -114 -61 56 19 -84 -133 58
5421 58 77 31 61 -178 100 -35 15 12 -102 133 12 -176 138 -2 227 36 35 -134 43 36 -84 -142 -31 -178
5445 -178 -47 -110 -134 -117 -23 16 102 81 -52 32 17 110 31 37 -112 145 -71 -86 -68 -11 -31 -47 -93 -72 20 -53 -45 0
5473 0 68 -72 -7 -18 -70 -17 -41 -9 -30 -1 -29 -212 -91 52 -131 77 -11 142 -72 1 -99 -17 -72 37 -187
5498 -187 98 32 -8 42 14 3 -71 87 41 256 165 115 -97 -55 -52 -23 153 97 98 -290 89 117 39 213 14 55
5524 55 18 -98 -14 -52 -79 46 -105 11 7 -37 46 -82 87 34 78 225 9 195 -2 45 51 -43 58 -59 64
5549 64 84 20 -212 -20 69 1 6 109 -67 -184 -34 58 -42 10 173 58 -119 98 -6 114 -191 -65 41
$$ packed form
5369F0L3k3P5nk02Q9J9rK1K5k01j22K19j52J73L0j2q6k7J61mj16J83j80j20J04
5395f7J81j59J9j3Mm1M7L6M7j56P6M9q5j2P5j77K02O7j54n3N3J17l7j03m9J91
5421E8J9m6L0k39K78j35N0lj14K35j21j88L14j40K29j91jj69J77pj20n8J11j47
5445a78J31o3k4J7R4L9Q6k1j33Q4j5R3p9Oj49K57k16j5J8N7k0j6m6K1R2p3QM5
5473@O8j40O5j1n2N3k4L2k1K9k8j83J21J43j83K08q8J53k14P3j00Q2n5J09k24
5498a87K85o6m0N0k8j1p4J58m6K15r1n0k12M2LK9J76n6Jl88L79K8p8J74j99M1
5524E5l7j16Q4l8k7J25j51J16mm4Q3j28J69n3M4J47k16J86j97M7Or4J01j17J23
5549F4K0o4k32J92Q9o8NJ03j76j17J50R2j00N2J63j15j77K17j04J20l05J26J06
$$ plain form
5572 41 -197 118 -25 74 -39 28 -126 -43 -34 117 152 -2 106 -103 34 -74 -105 22 -59 -130 -180 59 -76 -35
5596 -35 41 -27 -82 21 40 147 36 4 39 -16 17 147 174 -54 29 105 -105 -18 -18 21 42 -11 -143 133 -141 -48
5622 -48 -124 58 -89 69 -92 43 108 -49 -8 -13 -56 21 -15 156 56 60 68 -145 76 -81 -21 28 55 19 -95 120
5648 120 -192 24 22 23 -22 -64 122 3 83 -34 -122 7 -6 48 121 -26 63 54 -98 49 -164 -32 96 37 -101
5673 -101 17 -37 106 106 -65 19 -128 -7 192 -96 23 -172 -25 151 -22 53 33 -66 -134 -5 -145 -74 -167
5696 -167 57 38 -6 21 -44 -50 -190 14 54 23 27 -9 219 58 -143 82 -162 51 -88 43 -110 155 54 -144
5720 -144 95 116 -44 76 -26 -3 -28 -21 -10 -18 7 -122 124 2 -28 -122 -71 -58 -1 -19 -145 -91 -133 -65 -11 -230
5746 -230 83 -8 -59 28 138 -91 -51 38 -3 -140 85 -9 27 32 68 -24 99 94 96 -173 81 176 -48 -62 195 -68
$$ packed form
5572D1k38L15j43R9j13O7j54Q3RJ51L5j54J08k09J37j08l1J27q1p1n0K39j35M1
5596c5P6o8n5J03J9J07j11l2L5n5L3J30K7k28Q3P6k10Q7%L9K1n3j32K76k74R3
5622d8p6J82j47J58j61J35O5j57M1nm3P7l6J71j00MQk13K21j57O0M9K7l6j14K15
5648A20l12K16kJm5m2J86j19Q0j17q8J29j3N4P3j47Q9rj52J47k13J32J28n9j38
5673a01J18n4J43%j71Q4j47J21J99k88J19j95J47J76j73P5k0r9o8J29j40P1r3
5696a67K24j9m4K7o5oj40K04M0l1Ml6K28j61k01K25k44K13j39J31j53K65j01j98
5720a44K39K1j60J20j02K3k5PJ1qK5j29K46j22l0r4N1J3N7j8j26N4m2O8N4k19
5746b30L13r1n1Q7J10k29M0Q9m1j37K25r4L6NL6r2J23nKk69K54R5k24j4K57k63
$$ plain form
5772 -68 26 -83 89 172 -50 39 -49 -2 45 12 26 -20 98 39 128 27 -50 -60 7 -175 10 -139 73 152 -23
5797 -23 -118 13 90 -38 39 -13 205 -98 100 21 72 133 16 146 -189 -69 104 -81 40 -56 -138 76 134 70
5821 70 -148 -21 117 80 56 11 69 34 -48 -25 100 60 -65 169 -27 50 -29 -103 -160 -86 -65 -77 17 -14 18 -49 -69
5848 -69 -25 41 92 -3 -80 -126 -110 39 -166 -237 73 -134 -205 -47 124 14 -133 -139 -75 86 -7 70 -92 34 83
5873 83 54 91 -33 20 -151 23 40 19 19 49 -187 51 11 100 -125 2 -16 62 -85 -207 -8 -94 70 33 -33
5898 -33 -167 -44 173 -7 19 -119 -102 135 -70 215 15 -14 162 -138 -54 41 161 -47 94 -40 -306 153
5920 153 -1 -14 -105 74 33 -3 101 -24 -55 67 5 183 73 58 103 46 104 -35 -49 128 14 27 36 -101 -37
5945 -37 -155 196 -4 91 -113 72 22 -128 -109 25 97 80 -10 111 50 62 -146 -16 97 11 -67 88 42 -150
$$ packed form
5772f8R4j09J72Q3k22Q9q8M7M7l3J4m6J18n9Q9j01p7j0O7j82J85j49K12P9j75
5797b3r5J31P7j28P7n2K18l03J98p9N1O1j17J30l35J20J73j85J21r6q2K14N8o4
5821G0k18J27J38l7k4m5N8l5q2K3J25m0j25K34j96P7p9p4n7P4K1j2R4l1L2o7k0
5848f9M4O6N1r5p7m6J6J49k05p1L10k07p1J58J71j10j47oO4J61r3P7j62J26M9
5873H3k9L7j24N3j71J74J7k1%L0k36K38m0Q9k25J27j8P8j47j22J99q6J64l7o6
5898c3j34J23K17j80K6j38J7K37k05K85k00k9J76l00Q4R5J20k08J41j34k66M59
5920A53j54j3r1J79m1l6J04j25l1J22o2J78j10j5M5n7N8j39j4J77j14J3Rj37O4
5945c7j18L51k00R5k04J85n0j50J9J34P2j7r0J21o1J2k08J30J13q6p8J55m6j92
$$ plain form
5969 -150 -80 126 68 140 131 -13 17 -64 106 -117 61 -21 19 -85 178 -133 26 -70 -91 -119 175 -10 67 79 -58
5994 -58 30 -169 100 -69 0 -45 10 83 43 130 26 -6 70 -5 74 111 127 -157 92 -27 69 45 48 -61 53 -33
6020 -33 -52 -26 96 84 129 113 -111 -54 -38 66 97 105 55 17 38 -147 11 37 -95 46 -14 146 -89 -49 55 -22
6046 -22 9 -71 22 2 14 145 -66 -31 0 134 9 -18 85 -61 95 -104 97 -73 25 -84 -205 -44 49 10
6070 10 32 136 -2 142 76 3 -85 100 41 -75 -108 74 138 191 33 -121 111 78 60 66 135 -24 120 -146 86
6095 86 -45 -230 102 5 266 -21 148 101 122 222 67 22 2 29 -241 84 37 -80 -88 -70 211 45 61 -101
6119 -101 -42 -63 5 -139 -134 -35 -27 -64 135 -22 31 204 -203 106 119 117 137 -80 -233 -21 -21 9 1 -29 57 -68 -215
6146 -215 36 -191 19 202 77 0 83 -132 -8 212 48 63 82 -58 -60 -23 -60 -11 66 75 73 95 61 32 -22 138
$$ packed form
5969a50P0K06n8P2rj44L0q1J70k23J78q2M0j04K63l11J59r6k1k8K94j85P7J2j37
5994e8Q8j99K69j69O9m5N5P3m0Q7j04l2P6p5P9L7J6k84K49j19R6k4Lj09J14q6
6020c3j9K6J22j2M5j6k24N7J6J04L1Qn0l8K1j85J58K6j32J41o0J60k35M0J04p7
6046b2L1q0R3k0J2J31k11L5L1J34j25k7J03j46J56j99K01j70R8j09j21J61R3l9
6070A0K2J04j38J44o6p3q8J85n9j16l3J82O4N3j58j54K32l3j8OO9j59J44k66K32
6095H6j31j85L32r7K61k87J69m7K1J00j55m5k0K7k70L25m7j17qJ8K81j66J6j62
6119a01N9k1O8j44NR9Ql7J99j57N3J73m07L09J3kK0k17j53K12%L0ql0Q6j25j47
6146b15K51k27K10J83j25p7Q3k15J24K20j64J5J9j40kL7l7M9P7RkK2l4k9n4J60
$$ plain form
6172 138 71 93 -70 -63 -52 -59 95 -39 -48 45 272 23 -17 -130 56 1 136 41 7 0 -45 -42 -63 -27 16 19 106 -135
6200 -135 -110 -240 -3 77 -36 211 -46 -84 -30 18 -21 136 82 22 129 66 74 84 -19 104 77 33 110 -11 -62
6225 -62 239 132 -153 42 -51 58 88 61 -86 10 -59 -27 -63 35 150 -40 147 -38 -146 189 71 79 -97 129
6249 129 -71 128 -4 -68 128 9 27 3 120 -34 25 54 44 88 130 -146 85 50 -122 41 -95 7 64
6272 64 75 84 74 -90 8 61 -220 39 76 59 167 -81 62 69 -135 -29 -5 -99 237 29 -42 -21 -189 -58 -190
6297 -190 18 31 154 71 12 -109 19 57 -19 -43 32 13 -104 -36 -29 55 -10 88 -46 69 -196 14 -92 -68 -141
6322 -141 -46 103 34 38 -107 -54 4 -196 152 -56 18 33 13 -15 -1 10 -123 71 -33 -156 106 -109 18 67
6346 67 -56 -60 -3 20 77 -88 -79 38 -55 30 60 68 -51 149 154 -78 -16 -123 141 -101 17 29 10 -116 -8 17
$$ packed form
6172A38o7K2j63PJ1pJ54j34rR3K27k49m0j13J86n5J35r5l4pm5Lk1L6M3LQ7k41
6200a35K5j30K37Q0j13K47k57l8N4M8l9J57n4o0J07o3QJ0j03J23k7m4P7j21n1
6225f2L01j07k85J95r3J09L0k7j47R6o9L2l6R8J15j90J87j85j08L35j18Qj76K26
6249A29k00J99j32o4J96j19J8k4J17j54N9K9j0M4M2k76K31l5j72J63j36J02N7
6272F4J1Rj0j64R8N3k81K59L7j7J08k48J43Pk04J06K4r4L36k08p1K1j68J31j32
6297a90K08J3J23q3n9j21J28L8p6k4P5j9j17O8PQ4o5R8j34J15k65K10j06K4p3
6322a41R5J49o9Mj45N3N8k00L48k08P4J5k0k8J4J1j33J94j04j23K62k15J27M9
6346F7j23mN7K3N7j65RJ17r3Q5L0Qj19K00Nk32O2j07K64k42J18J2j9j26J08K5
$$ plain form
6372 17 -92 116 112 -26 22 67 -41 -8 20 71 2 -27 133 -43 -22 172 82 -158 -12 -5 -98 -29 -32 156 -35 -129
6398 -129 47 -90 46 34 133 2 46 -37 96 26 145 150 -27 -4 -121 18 -8 -143 -79 124 -53 -5 34 -28
6422 -28 -104 132 80 -78 81 -82 75 100 30 -21 10 -35 66 28 -113 168 15 -10 173 9 -24 -69 104 153
6446 153 74 -26 15 30 110 -54 109 -8 -210 176 -111 -71 36 27 99 -30 -26 -9 178 51 -27 105 135 93 98
6471 98 20 -38 -111 242 -39 38 -17 49 -88 89 136 138 -59 -112 -17 6 25 47 -138 29 63 17 -140 49 -89 -11
6497 -11 -69 -56 -154 -96 -74 -108 103 -87 111 75 -17 122 35 58 9 135 39 -161 -142 -51 -158 -178 -85 43 -122 -96
6523 -96 -11 -109 78 -30 -49 34 -13 56 104 15 80 -38 -226 23 104 146 79 101 -2 207 -28 -30 -5 58 102 -198
6549 -198 73 146 -171 -165 -115 -109 -92 -106 -41 70 -99 35 -211 -51 129 11 -96 61 136 -71 49 17 -33 27
$$ packed form
6372A7j09K08mj38M8M5j08L3K8N1o9k9J60j76K1J94r0k40J46Pr3O9lJ88j91r4
6398a29J76j37J36j2R9j31M4q3J33p0J19Nj77K3j17J39k6j35O4K03j77M8L9o2
6422b8p6K36n2j58J59j63J57K5p0n1L1m5J01l8j41K81j53k5J83j64l3m5J73M9
6446A53p9j00M1J5Q0j64J63j17k02L86k87M0J07rP2j29MJ7J87j27p8J32L0m2N
6471I8p8n8p3L53k81P7n5O6j37J77M7Kj97n3R5K3J9K2j85J67L4m6j57J89j38P8
6497a1n8J3r8N8K2l4K11j90J98l6r2J39q7K3m9J26r6k00J9R1j07k0R3J28j65K6
6523i6Q5r8J87j08j9Q3m7O9M8q9O5j18j88K49Q1M2o7K2j03K09k35kK5O3M4l00
6549a98K71P3l17ON0OJ7j4O5J11j69J34k46J60J80j18j07J57P5k07J20l2n0O0
$$ plain form
6573 27 -110 97 -80 131 20 111 -34 136 57 91 -61 41 -133 -3 49 161 73 54 -65 -30 -26 -98 284 -137
6597 -137 86 -8 -84 -190 65 13 -21 66 -33 2 12 -116 7 86 -64 51 114 23 7 158 195 -23 -101 -203 -84
6622 -84 114 25 -46 45 -62 14 90 -85 21 -26 121 11 19 154 -30 21 -67 73 -93 -133 -16 -35 -57 34 -153
6647 -153 -22 21 0 38 109 -115 9 -38 36 -31 -36 136 -85 9 72 56 -54 94 20 -40 -3 106 -118 -89 -4 76
6673 76 -87 -9 -64 -201 138 33 -13 -13 119 35 -6 -59 -8 -28 14 -12 72 74 45 -9 196 -101 -158 -180 -99 114 -145
6700 -145 -251 164 126 -8 40 -113 12 -29 -124 -23 -115 -183 -86 -61 92 0 -17 -64 -19 105 -109 53 -32 22 14
6725 14 217 117 -95 5 157 -71 60 -3 179 -6 62 81 -17 -78 2 112 -59 -29 129 30 40 -102 74
6748 74 -56 88 -15 104 18 57 54 -16 129 95 -170 -59 -71 -17 -22 43 59 125 -69 -10 -37 -35 -43 90 -16 -104 -162
$$ packed form
6573B7j37K07j77K11j11R1j45J70p9L4j52J02j74J30N2J12q8j9j19L5Mp2L82m21
6597a37K23r4p6j06K55n2l4Q7r9L5J0j28J23P9j50J15O3r1j6J51L7k18p8j02J19
6622h4J98q9p1R1j07P6P6j75J06m7J47j10QJ35j84N1q8J40j66m0J17j9k2R1j87
6647a53J31M3k1L8P1k24J24m7P4o7nJ72k21R4O3j6j10J48p4o0L7J09k24K9Q5Q0
6673G6j63P8n5j37L39j05m6%J32q4m1n3N1k0M2k6Q4Kk9n4K05k97n7k2Q1K13k59
6700a45j06M15l8j34M8j53J25m1r5J01r2o8R7K5J53r2j7m7M5J24k14J62q5N4q
6725A4K03j00k12J00J52k28J31o3J82j85O8J9r8o1Q0J10j71L0J58r9J0j42J76
6748G4j30J44j03J19q6L9lp0J45l4k65J11j2N4nO5J6O6j94N9k7KqJ33j06q8n8
$$ plain form
6775 -162 -112 8 36 -170 -28 123 -78 -15 -5 -80 -48 -42 72 -23 48 31 111 36 -12 -82 -14 109 28 -11 60 -26 -165
6802 -165 -88 55 12 72 -44 -58 -53 241 19 5 -42 -44 -39 -21 102 -131 -7 -89 38 0 96 -9 -81 36 164 87
$$ packed form
6775a62N0J20K8k06J42J51k01O3J0p5L2OJ14r5P1j7Q0p5m8p0O8J23q1l9P1q6j39
6802a65P7J43m3O0j16j4NK94k22j4m7kNJ8J23k33J24q2J27l8R6j05p2J17J28p7
$$ [...]
8191g1
##END NTUPLES=NMR FID
##END=
