##TITLE=1H_DE-80H_X3
 200.13MHz, d2o
 8 sc
 
 19ns.26.2.2025
##JCAMPDX= 6.0         $$ Bruker NMR JCAMP-DX V2.0
##DATA TYPE= NMR FID
##DATA CLASS= NTUPLES
##ORIGIN= UXNMR, Bruker Analytische Messtechnik GmbH
##OWNER= pz
$$ XWIN-NMR		Version 3.5
$$ Fri Mar 28 11:30:28 2025 Russian Standard Time (UT+4h)  Yarkov@DPX200
##.OBSERVE FREQUENCY= 200.1313
##.OBSERVE NUCLEUS= ^1H
##.DELAY= (6, 6)
##.ACQUISITION MODE= SIMULTANEOUS
##.ACQUISITION SCHEME= undefined
##.AVERAGES= 8
##.DIGITISER RES= 18
##SPECTROMETER/DATA SYSTEM= spect
##.PULSE SEQUENCE= zg30
##.SOLVENT NAME= CDCl3
##.SHIFT REFERENCE= (INTERNAL, CDCl3, 0, 14.3821)
##AUDIT TRAIL= $$ (NUMBER, WHEN, WHO, WHERE, WHAT)
$$ ##TITLE= Audit trail, XWIN-NMR		Version 3.5
$$ ##JCAMPDX= 5.01
$$ ##ORIGIN= Bruker BioSpin GmbH
$$ ##OWNER= Yarkov
$$ C:/Bruker/XWIN-NMR/data/yarkov2/nmr/H-C/1/audita.txt
$$ ##AUDIT TRAIL=  $$ (NUMBER, WHEN, WHO, WHERE, WHAT)
(   1,<2025-03-28 11:28:26.65 +0400>,<Yarkov>,<DPX200>,
      <created by zg, POWCHK disabled, PULCHK disabled
       configuration hash MD5:
       00 E9 B6 7A A2 85 ED C7 34 08 36 98 17 FE 4E 26
       data hash MD5: 16K
       A9 F9 33 3A 72 44 E2 28 71 9A 5F 86 51 B5 F3 C6>)
$$ ##END=
$$ 
$$ hash MD5
$$ 4C 21 B5 91 62 70 E7 12 14 8C 85 12 2D D1 AE C3
##$RELAX= 
##$RELAX= 
##$RELAX= 
##$RELAX= 
##$RELAX= 
##$RELAX= 
$$ Bruker specific parameters
$$ --------------------------
##$DU= <C:/Bruker/XWIN-NMR>
##$EXPNO= 1
##$NAME= <H-C>
##$PROCNO= 1
##$TYPE= <nmr>
##$USER= <yarkov2>
##$AMP= (0..31)
100 100 100 100 100 100 100 100 100 100 100 100 100 100 100 100 100 100 
100 100 100 100 100 100 100 100 100 100 100 100 100 100 
##$AQSEQ= 0
##$AQ_mod= 1
##$AUNM= <au_zg>
##$AUTOPOS= <>
##$BF1= 200.13
##$BF2= 200.13
##$BF3= 200.13
##$BF4= 200.13
##$BF5= 200.13
##$BF6= 200.13
##$BF7= 200.13
##$BF8= 200.13
##$BYTORDA= 1
##$CFDGTYP= 0
##$CFRGTYP= 5
##$CHEMSTR= <none>
##$CNST= (0..31)
1 1 145 1 1 1 1 1 1 1 1 1 1 1 1 1 1 1 1 1 1 1 1 1 1 1 1 1 1 1 1 1 
##$CPDPRG= <>
##$CPDPRG1= <>
##$CPDPRG2= <>
##$CPDPRG3= <>
##$CPDPRG4= <mlev>
##$CPDPRG5= <mlev>
##$CPDPRG6= <mlev>
##$CPDPRG7= <mlev>
##$CPDPRG8= <mlev>
##$CPDPRGB= <>
##$CPDPRGT= <>
##$D= (0..31)
0 0.7 0 0 0 0 0 0 0 0 0 0.03 0 0 0 0 0 0 0 0 0 0 0 0 0 0 0 0 0 0 0 0 
##$DATE= 1743146906
##$DBL= (0..7)
120 120 120 120 120 120 120 120 
##$DBP= (0..7)
150 150 150 150 150 150 150 150 
##$DBP07= 0
##$DBPNAM0= <>
##$DBPNAM1= <>
##$DBPNAM2= <>
##$DBPNAM3= <>
##$DBPNAM4= <>
##$DBPNAM5= <>
##$DBPNAM6= <>
##$DBPNAM7= <>
##$DBPOAL= (0..7)
0.5 0.5 0.5 0.5 0.5 0.5 0.5 0.5 
##$DBPOFFS= (0..7)
0 0 0 0 0 0 0 0 
##$DE= 6
##$DECBNUC= <off>
##$DECIM= 32
##$DECNUC= <off>
##$DECSTAT= 4
##$DIGMOD= 1
##$DIGTYP= 9
##$DL= (0..7)
0 120 120 120 120 120 120 120 
##$DP= (0..7)
150 150 150 150 150 150 150 150 
##$DP07= 0
##$DPNAME0= <>
##$DPNAME1= <>
##$DPNAME2= <>
##$DPNAME3= <>
##$DPNAME4= <>
##$DPNAME5= <>
##$DPNAME6= <>
##$DPNAME7= <>
##$DPOAL= (0..7)
0.5 0.5 0.5 0.5 0.5 0.5 0.5 0.5 
##$DPOFFS= (0..7)
0 0 0 0 0 0 0 0 
##$DQDMODE= 0
##$DR= 18
##$DS= 0
$$ [...]
##$SUBNAM2= <"">
##$SUBNAM3= <"">
##$SUBNAM4= <"">
##$SUBNAM5= <"">
##$SUBNAM6= <"">
##$SUBNAM7= <"">
##$SUBNAM8= <"">
##$SUBNAM9= <"">
##$SW= 18.0517328524113
##$SWIBOX= (0..15)
0 0 2 0 0 0 0 0 0 0 0 0 0 0 0 0 
##$SW_h= 3612.71676300578
##$TD= 16384
##$TD0= 1
##$TE= 0
##$TE2= 300
##$TE3= 300
##$TEG= 300
##$TL= (0..7)
0 120 120 120 120 120 120 120 
##$TP= (0..7)
150 150 150 150 150 150 150 150 
##$TP07= 0
##$TPNAME0= <>
##$TPNAME1= <>
##$TPNAME2= <>
##$TPNAME3= <>
##$TPNAME4= <>
##$TPNAME5= <>
##$TPNAME6= <>
##$TPNAME7= <>
##$TPOAL= (0..7)
0.5 0.5 0.5 0.5 0.5 0.5 0.5 0.5 
##$TPOFFS= (0..7)
0 0 0 0 0 0 0 0 
##$TUNHIN= 0
##$TUNHOUT= 0
##$TUNXOUT= 0
##$USERA1= <user>
##$USERA2= <user>
##$USERA3= <user>
##$USERA4= <user>
##$USERA5= <user>
##$V9= 5
##$VALIST= <valist>
##$VCLIST= <CCCCCCCCCCCCCCC>
##$VD= 0
##$VDLIST= <DDDDDDDDDDDDDDD>
##$VPLIST= <PPPPPPPPPPPPPPP>
##$VTLIST= <TTTTTTTTTTTTTTT>
##$WBST= 1024
##$WBSW= 4
##$XGAIN= (0..3)
0 0 0 0 
##$XL= 0
##$YL= 0
##$YMAX_a= 52529
##$YMIN_a= -66340
##$ZGOPTNS= <>
##$ZL1= 120
##$ZL2= 120
##$ZL3= 120
##$ZL4= 120
##$ABSF1= 10
##$ABSF2= 0
##$ABSG= 5
##$ABSL= 3
##$ALPHA= 0
##$AQORDER= 0
##$ASSFAC= 0
##$ASSFACI= 0
##$ASSFACX= 0
##$ASSWID= 0
##$AUNMP= <proc_1d>
##$AZFE= 0.1
##$AZFW= 0.1
##$BCFW= 1
##$BC_mod= 2
##$BYTORDP= 1
##$COROFFS= 0
##$CY= 83.5205535888672
##$DATMOD= 1
##$DC= 2
##$DFILT= <>
##$DTYPP= 0
##$F1P= 10.8118882576601
##$F2P= -7.23987719738617
##$FCOR= 0.5
##$FTSIZE= 0
##$FT_mod= 4
##$GAMMA= 1
##$GB= 0.15
##$INTBC= 1
##$INTSCL= 1
##$ISEN= 128
##$LB= 0.25
##$LEV0= 0
##$LPBIN= 0
##$MAXI= 10000
##$MC2= 0
##$MEAN= 0
##$ME_mod= 0
##$MI= 1.114404
##$NCOEF= 0
##$NC_proc= 0
##$NLEV= 6
##$NOISF1= 3.799351
##$NOISF2= 2.8
##$NSP= 1
##$NTH_PI= 0
##$NZP= 0
##$OFFSET= 14.38212
##$PC= 1
##$PHC0= -1193.497
##$PHC1= 18.39225
##$PH_mod= 1
##$PKNL= yes
##$PPARMOD= 0
##$PSCAL= 0
##$PSIGN= 0
##$REVERSE= no
##$SF= 200.129724274929
##$SI= 16384
##$SIGF1= 3
##$SIGF2= 2
##$SINO= 400
##$SIOLD= 16384
##$SREGLST= <1H.CDCl3>
##$SSB= 0
##$STSI= 0
##$STSR= 0
##$SW_p= 3205.1282051282
##$SYMM= 0
##$S_DEV= 0
##$TDeff= 0
##$TDoff= 0
##$TI= <>
##$TILT= no
##$TM1= 0
##$TM2= 0
##$TOPLEV= 0
##$USERP1= <user>
##$USERP2= <user>
##$USERP3= <user>
##$USERP4= <user>
##$USERP5= <user>
##$WDW= 1
##$XDIM= 8192
##$YMAX_p= 0
##$YMIN_p= 0
$$ End of Bruker specific parameters
$$ ---------------------------------
##NTUPLES= NMR FID
##VAR_NAME=  TIME,          FID/REAL,        FID/IMAG
##SYMBOL=    X,             R,               I
##VAR_TYPE=  INDEPENDENT,   DEPENDENT,       DEPENDENT
##VAR_FORM=  AFFN,          ASDF,            ASDF
##VAR_DIM=   8192,          8192,            8192
##UNITS=     SECONDS,       ARBITRARY UNITS, ARBITRARY UNITS
##FACTOR=    0.0002768,     1,               1
##FIRST=     0,             0,               0
##LAST=      2.2672688,     0,               0
##MIN=       0,             -66340,          0
##MAX=       2.2672688,     52529,           0
$$ Real data points
##PAGE= N=1
##DATA TABLE= (X++(R..R)), XYDATA
0 0 0 0 0 0 0 0 0 0 0 0 0 0 0 0 0 0 0 0 0 0 0 0 4 -6 8 -8 8 -8 8 -8 13 -14 16 -16 21 -21 24 -29 29 -35 37 -41 46 -51
44 -51 56 -61 68 -75 83 -90 100 -110 122 -134 148 -167 185 -206 235 -267 307 -356 424 -514 647
65 647 -852 1203 -1929 3955 -21372 -58544 24834 21920 -23474 1101 10941 4916 17134 32148
79 32148 26935 -22240 -13038 25620 -33124 -41117 32568 15149 -8644 12004 -11760 -20149 600
92 600 5981 7469 -3092 22579 47951 -8580 -19060 24070 -5963 -12433 19172 -1128 -3271
105 -3271 14405 1960 -17447 -35645 -13505 1932 -45521 -31261 18282 -6528 2592 33332
117 33332 595 -1827 19372 998 -13866 -12590 10311 17894 -14505 206 19066 -15158 -2304
130 -2304 11400 -20543 4010 29239 2971 -342 2649 2422 3062 -15034 -3589 10210 -3326
143 -3326 17642 21511 -7807 11922 15094 -16968 -13952 -11595 -11261 -1277 -12634 -5391 4273 -10426
157 -10426 1236 -1101 -23225 756 9709 -5621 8619 10711 6860 11772 -3143 -2705 2716 -6695
171 -6695 6893 3676 -11101 10520 6646 -13883 -1490 -5501 -9931 5643 462 2721 11813 5882
185 5882 11271 2984 -8885 6154 -1346 -11383 6660 -442 -2883 10647 -4475 -8612 -756 -9527
199 -9527 -4149 -2610 -7017 7678 3612 -2166 8231 -3389 -5026 6219 -6363 -2551 8687 -252
213 -252 4632 4738 -4273 2832 -2712 -7249 2899 -4580 -2020 9351 -2949 -1391 5140 -6585 -2104
228 -2104 485 -4546 5484 3319 2113 9997 -110 151 5735 -7933 -4459 3371 -6537 353 3362
243 3362 -4480 1247 -2116 -5714 504 -5395 -1206 6643 -2690 4155 8848 -3229 2644 3373 -5643
258 -5643 1787 487 -2515 4043 -2039 -875 3036 -6887 -1765 1910 -6615 1893 4913 -1999 5224
273 5224 2720 -1764 3086 -3126 -2467 2374 -4682 1196 4643 -4067 2624 2679 -4949 1562 38 -3142
289 -3142 3240 -1032 152 3733 -3888 -483 1214 -6848 500 1902 -3356 5210 4112 626 6211
304 6211 628 -329 2755 -4562 -768 817 -6649 -511 -223 -6551 1056 -473 -3080 4097 854 1976
320 1976 5845 -311 2205 2902 -4879 -2 -995 -5754 1365 -212 -2183 3883 79 -292 2923 -3023
336 -3023 -379 1383 -4713 1075 1212 -3883 2961 1152 -1901 3991 509 -120 4031 -1156 1084 1873
352 1873 -4184 314 -750 -5550 1383 -658 -3160 3465 246 -444 3378 -1217 595 2152 -2654
367 -2654 2375 1674 -1994 4259 1046 -2248 3594 -1096 -2949 1188 -3606 -1648 192 -3878 457
382 457 412 -2738 3246 286 -1367 4769 431 -829 3551 -1540 -331 2041 -2984 450 486 -2584
398 -2584 1958 -1349 -3133 2779 -2350 -2664 2399 -2301 -193 3391 -529 2617 3444 962 3972 156
414 156 -1110 3596 -2416 -2502 1298 -4258 -1694 1954 -3454 -769 1312 -1218 1764 -826 -891 3397
430 3397 -2098 -1050 2847 -3079 642 3707 -2789 -226 2376 -1553 663 -1187 -1999 1262 -2990
445 -2990 -1012 1222 -4270 1177 4170 -3445 1296 4189 122 2354 1407 503 3223 -63 1338 1869
461 1869 -3549 2146 2821 -5725 -615 1092 -4656 -1210 -1506 -2781 1169 -109 1596 1652 -1465 4816
477 4816 3476 -4842 1819 2252 -4115 378 -428 -4197 111 -631 -690 -856 -2453 3953 1815 -4624 3537
494 3537 2552 -3174 3017 868 -2705 2916 2571 1026 1103 -80 4859 1049 -4279 2081 -687 -4521
510 -4521 2242 -1446 -4693 2691 814 -2120 -913 -723 3365 147 -2456 3484 165 -2414 4508
525 4508 -1753 -4815 3378 98 -3330 -844 -720 804 -1466 -3022 1616 -1762 -1957 4356 -2402 -2225
541 -2225 6789 1837 -1042 3038 1140 1534 628 -823 1897 -1590 -442 3956 -4193 -3001 4469 -2578
557 -2578 -3059 1880 -877 804 1438 -717 800 -1082 690 3013 -4113 -1603 4790 -2499 -2017 2226
573 2226 -2302 -732 474 -2505 -1059 -1592 662 1900 -4253 6 4782 -3224 -679 2965 -2254
588 -2254 1401 3525 -450 1054 1451 1490 844 -3537 522 2582 -3643 301 2101 -3520 1430 2053
604 2053 -3472 -392 595 415 1473 -1699 1237 3078 -2134 1529 1244 -3928 1643 1045 -3841 365
620 365 435 -1539 164 -2584 -1028 693 -2787 1328 1247 -2483 3349 1970 -2773 1831 800 -999
636 -999 1230 -342 932 1539 -1158 1494 -152 -3140 2131 -174 -3761 1742 718 -1159 1989 -178
652 -178 -225 898 -982 923 122 -1777 2857 110 -2308 2331 -565 -2080 1303 -1828 -1485 860
668 860 -1608 179 -551 -1795 1615 -902 -2109 2505 -107 -138 3439 -32 347 2309 -901 699
684 699 196 -1533 1727 -669 -1478 2393 -1078 -1343 1870 -1604 -978 1215 -795 412 398 -993 1785
701 1785 -368 -1389 1753 -1101 -590 1939 -1513 -491 1086 -1935 -183 108 -1627 861 -486 -860
717 -860 2117 -908 308 2334 -1421 175 1753 -1268 1425 1119 -842 1659 365 -738 1127 -1357
733 -1357 -1009 1022 -2154 -387 627 -2028 170 -47 -1407 1015 -253 -633 1851 -560 360 1560
749 1560 -1395 212 676 -1864 614 480 -1396 1188 -196 -828 1435 -993 -81 1206 -1667 801
765 801 1168 -983 1677 849 -945 1428 -89 -740 1237 -1401 -390 988 -1695 295 293 -1871 525
782 525 -473 -1645 1318 -98 -705 1534 -890 105 1191 -974 552 941 -1013 1273 652 -1214 1302
799 1302 -680 -846 943 -1398 -586 708 -1479 780 752 -1332 1289 336 -985 1234 -299 -532 1705
816 1705 -692 -120 1205 -1392 684 98 -1615 1104 -285 -1216 1361 -693 -1002 1177 -1249 -285
832 -285 1343 -745 922 875 -680 1382 140 -837 1056 -1197 -915 988 -1121 -334 701 -1297 417
849 417 17 -1298 939 -480 -829 1500 -122 -248 2029 -774 65 1274 -1114 557 632 -886 1259
866 1259 -457 -972 971 -1121 -722 1444 -1392 -145 1370 -1003 577 1006 -981 860 258 -630
882 -630 1216 -614 78 1088 -1412 -258 850 -1892 54 222 -1720 417 79 -762 788 -718
898 -718 -56 1448 -1167 138 1419 -960 1079 940 -1124 976 270 -1093 323 -615 -297 563 -1665
915 -1665 217 685 -1482 975 803 -1299 1302 603 -710 992 -46 307 811 -1025 526 561 -1426
932 -1426 947 474 -1445 893 290 -1618 488 -460 -434 761 -711 836 365 -1204 1103 206 -1539
949 -1539 1571 132 -1484 1022 -412 -673 692 -725 132 -17 -1372 1179 -453 -1407 1956 27
965 27 -1072 1434 -33 -137 1234 -90 196 273 -736 1345 -494 -1146 1466 -816 -1389 1067 -1072
982 -1072 -633 1054 -569 -456 123 -279 1028 -632 -765 1549 -570 -870 1633 -819 -587 1627 -698
999 -698 -425 215 -493 403 -760 -606 1098 -948 -649 1619 -830 345 2048 -536 -105 1178 42
1016 42 459 66 -446 822 -808 -246 915 -1655 -161 1228 -1655 -237 380 -987 289 -157 -499
1033 -499 871 -114 50 814 -1249 467 1215 -1506 4 952 -870 87 98 -740 540 -487 -131 589
1051 589 -1280 645 1095 -1342 811 905 -631 988 689 -336 665 179 163 468 -969 539 623 -1889
1069 -1889 467 235 -1402 396 68 -871 727 208 111 218 -610 689 460 -1123 1060 446 -1127
1086 -1127 1318 -95 -1038 990 -411 -477 190 -889 411 105 -1045 927 216 -930 1132 104
1102 104 -1044 1163 -3 -357 750 -606 335 66 -1031 328 -70 -940 1011 -639 -1065 989 -547
1119 -547 -574 909 -582 -53 380 -580 933 280 -495 1399 -377 -622 1202 -618 -700 708 -1036 -245
1137 -245 578 -1228 474 -93 -482 1202 -831 -639 1250 -582 -43 787 -456 449 569 -691 439
1154 439 -375 -784 553 -918 -778 1081 -1049 -350 872 -1136 364 426 -594 623 148 -456 956
1171 956 -399 -167 1088 -744 197 784 -880 349 518 -993 172 180 -682 642 -299 -55 687 -484
1189 -484 33 956 -838 392 732 -835 531 269 -724 689 -292 -550 788 -836 -50 394 -1211
1206 -1211 -160 329 -947 663 263 -588 1052 -269 39 978 -388 341 521 -736 87 384 -743
1223 -743 462 -137 -814 557 -335 -67 554 -602 204 649 -492 728 145 -736 896 161 -278 802
1241 802 -184 -208 696 -604 -72 197 -658 31 -169 -932 467 -350 -898 528 -447 -229 783 -328 293
1260 293 744 -369 693 371 -762 718 -229 -491 939 -713 -138 886 -729 -104 263 -843 498
1277 498 -48 -684 978 34 -520 903 11 -363 757 -542 188 450 -707 649 -114 -895 626 -849
1295 -849 -577 586 -660 -291 328 -645 288 566 -582 711 421 -494 1177 -232 -95 975 -775
1312 -775 -48 850 -655 -4 354 -716 425 -141 -562 644 -440 -361 746 -372 168 942 -630 390
1330 390 402 -686 270 -66 -684 413 -261 -223 770 -640 82 331 -838 389 457 -570 461 -19 -205
1349 -205 693 209 208 729 -663 359 600 -722 136 87 -1146 362 -317 -815 278 -426 -315 404 -530
1368 -530 35 334 -844 575 377 -854 1062 145 -558 805 -225 -424 391 -601 152 151 -1026 618
1386 618 62 -628 649 59 -413 975 19 -163 630 -259 475 563 -477 789 -110 -849 560 -288 -833
1405 -833 677 -635 -474 291 -244 23 85 -345 832 -50 -414 901 -317 -446 1113 -204 -392 656
1423 656 -670 -232 347 -390 240 -138 -610 546 -482 -482 730 -402 -328 862 -580 316 821 -497
1441 -497 505 -119 -148 451 -689 43 694 -965 -551 565 -728 7 503 -507 372 -116 -95 649 -232
1460 -232 111 1054 -678 187 952 -768 3 459 -666 -44 -338 -413 -17 -628 -183 467 -713 80 537
1479 537 -532 374 612 -513 517 259 -149 463 -131 44 621 -683 360 392 -890 263 220 -806
1497 -806 312 343 -906 204 -229 31 346 -318 525 549 -525 652 243 -888 420 127 -654 215
1515 215 -72 -117 343 -513 -89 52 -689 615 173 -919 840 478 -622 915 -211 75 512 -273
1533 -273 382 138 -467 714 -348 -680 694 -221 -458 441 -174 -225 502 -310 196 163 -157 775 -148 -498
1553 -498 914 -156 -292 598 -350 -307 384 -244 10 -52 -183 419 -324 -194 685 -296 -505 795 -393
1572 -393 -266 388 -255 154 551 -400 124 -89 -411 387 -557 -63 180 -761 -336 585 -253 171 468 -269
1592 -269 68 124 -472 635 -231 -333 454 -695 -100 432 -437 124 351 -502 260 -259 -386 380 -432 -236
1612 -236 518 -606 416 634 -207 147 468 -293 499 -178 -325 351 -116 -6 255 -736 29 521 -430
1631 -430 48 174 -604 287 104 -176 648 -487 98 521 -217 265 445 -600 379 134 -343 270 89
1650 89 -495 322 -275 -85 184 -371 48 72 -577 259 89 -135 302 -182 -91 427 -599 -37 350 -518 -201
1671 -201 109 -812 187 -146 -380 308 -102 -498 383 -176 -129 663 -250 275 259 -397 181 37 -331 219 58
1692 58 -233 -55 -165 -232 291 -298 -89 20 -381 395 84 -585 406 147 -343 583 -196 192 379 -270 -23
1713 -23 -61 -449 58 94 -366 258 -375 -486 255 -215 -67 462 -411 52 50 -157 232 430 -218 663 117 -396
1735 -396 355 -151 -398 -57 -209 -175 60 -644 286 6 -429 452 26 -292 643 -116 82 572 -78 261
1755 261 200 -296 277 17 -290 126 -131 -166 136 -375 -48 485 -349 -59 515 -202 283 7 -98 374 171
1776 171 117 452 -362 -83 346 -628 -211 64 -602 25 -1 -439 358 -18 -236 336 -174 -3 394 -104 78
1797 78 194 -683 193 182 -288 221 -179 -561 149 -349 -22 135 -582 302 168 -469 137 330 -207 582 -23
1818 -23 -413 385 -234 -191 322 -250 284 102 -489 355 148 -579 255 -126 -371 475 5 -54 561 -90 377
1839 377 215 -519 561 -104 -93 702 -69 -193 179 -242 -218 180 -159 -17 -63 -326 390 13 -503 405 -384
1860 -384 -150 529 -215 106 462 -165 107 79 -186 282 -38 -312 369 -421 -314 353 -310 -33 -135 -453
1880 -453 37 -142 -117 465 -207 -136 516 48 -332 473 -200 56 588 -3 97 163 -483 227 -154 -359 446
1901 446 -540 -255 635 -202 394 370 -328 362 -188 6 60 -168 -124 370 -329 -145 714 -582 -67 283 -347
1922 -347 196 65 -313 269 -187 207 283 -251 171 494 -258 414 386 -232 79 -10 -349 123 -215 -272 310
1943 310 -335 -217 15 -732 88 450 -426 336 125 -338 473 122 -83 248 55 30 258 -617 198 105 -486
1964 -486 325 41 -264 277 -97 -364 198 -134 -26 204 -348 458 67 -367 531 101 -310 604 -101 -488
1984 -488 -37 -328 115 -25 -71 116 -57 -629 202 -124 -264 722 32 -455 558 -242 -167 321 -222 44
2004 44 33 -468 251 -150 -482 576 -464 -255 406 -219 0 -27 -496 236 -48 142 256 -150 -27 236
2024 236 -12 101 236 -496 -27 264 -89 259 -117 -520 497 -125 61 436 -285 152 198 90 80 559
2044 559 -189 208 152 -264 212 -189 -209 65 -527 -169 243 -503 97 265 -361 205 284 34 196 67 321
2065 321 376 -329 158 98 -327 -154 208 -341 297 58 -440 301 83 -78 -2 -289 140 141 -287 -44 454 -101
2087 -101 298 -134 76 364 -13 33 286 -285 48 107 -559 143 154 -268 156 -144 -172 609 -375 -63 10 -165
2109 -165 -122 -11 -293 422 187 -214 112 78 -600 392 -16 65 447 -229 -6 -167 -180 537 9 -110 327
2130 327 -74 -24 394 -242 -108 249 -398 162 -28 -176 -95 -43 -446 297 3 -163 6 127 -75 174 -140
2151 -140 -151 213 -127 724 72 -9 412 -126 -32 400 -134 -119 -101 -353 -12 335 -247 287 -242 -232 308 -135
2173 -135 -33 424 -91 7 337 -378 64 198 -308 -53 -22 -327 -22 -292 -170 43 168 -151 44 -280 11
2194 11 255 -25 195 306 105 332 55 -219 218 -287 24 15 -118 232 118 -95 -164 80 -126 84 218
2215 218 -339 172 -104 -18 366 -326 62 306 -276 168 -49 -45 47 66 -148 88 -242 84 107 -564 218 38
2237 38 -106 193 4 -10 316 55 -86 318 -319 -105 308 -504 94 -34 -342 236 93 -420 108 -223 5
2258 5 324 -16 0 92 -7 36 207 -327 161 186 -121 105 -58 -170 201 -326 -185 374 -236 147 9 -338
2280 -338 509 156 -415 190 72 -96 354 -197 5 24 19 179 1 -86 39 -130 -234 209 -17 -179 281
2301 281 -161 50 -95 -263 13 -6 -4 58 -343 80 335 -11 -72 2 -267 -14 139 -306 66 -17 -197 272
2323 272 58 -125 189 23 -73 379 -149 153 505 37 -164 7 -59 160 -242 -122 162 -315 -22 68 -181
2344 -181 -190 73 -120 -27 81 -329 296 346 126 403 -220 -125 272 -63 -135 253 -67 167 88 -327 31 38 59
2367 59 70 5 -107 -21 -299 -75 297 -253 356 112 -179 218 -211 -309 8 -295 97 -82 -250 261 335 -305
2389 -305 239 265 17 286 28 -126 267 -145 -72 168 -142 -134 161 -483 280 -75 -156 331 -58 -23 -211 -201
2411 -201 260 257 -160 -63 175 -336 172 95 -171 458 112 -219 129 61 47 131 -208 224 157 -84 72 -308 -296
2434 -296 -28 -290 -167 47 -326 107 260 -19 357 135 -31 154 130 -321 259 112 0 346 -151 -26
2454 -26 342 -114 169 -176 -197 81 -130 -121 118 -149 165 266 -57 -219 126 -301 -158 -49 25 167 -143 21
2476 21 452 -25 -226 173 30 -24 320 -262 73 -150 -247 354 -103 -82 130 -17 74 258 -385 -99 85 -165
2498 -165 118 -35 -447 -22 -188 -162 317 -195 -93 112 146 310 254 -178 -361 245 -279 -124 158 -55 282
2519 282 -123 -106 110 -419 -311 316 -80 130 382 -141 -26 80 -252 160 13 -13 158 -18 118 -159 -72
2540 -72 -189 -131 -106 161 154 -306 -37 -53 -172 301 -393 66 269 -79 203 119 -53 11 -133 14 247 -204 -257
2563 -257 -1 -24 -138 -7 -26 32 -204 -237 121 -235 -174 333 28 -103 140 -46 -107 -16 100 92 28 -178 -55
2586 -55 -40 -158 236 68 147 44 -254 67 179 100 -24 -145 -123 136 -80 391 -42 -113 -157 421 -256 59
2608 59 5 -199 158 12 -81 233 185 199 166 301 -184 112 -147 -280 6 -117 347 -46 66 0 78 -359 294
2631 294 -163 -10 145 -120 -195 -216 -496 186 -334 -209 -137 53 92 7 64 45 395 -197 130 261 -242 118
2653 118 -67 -170 73 -68 -106 175 -158 -159 109 -128 203 233 19 187 9 -130 106 5 -34 174 -20 124
2675 124 203 -310 321 -102 -257 216 -56 82 153 -68 -49 300 -57 100 7 -102 173 111 69 36 16 -239 -10
2698 -10 107 -241 68 -110 -120 -158 -121 -19 129 -178 -5 281 -228 71 -51 -42 113 -186 15 79 -437 149
2720 149 13 -285 206 30 -212 83 -93 -293 218 -76 191 89 -125 107 13 -297 -120 -71 13 117 -11
2741 -11 264 -44 -92 -2 -157 -146 -76 -59 -177 280 -15 -235 121 -71 29 278 -37 -97 127 -222 127 -37
2763 -37 -259 144 54 -155 -97 -170 -236 394 -19 93 -62 -127 313 -135 -20 315 97 102 321 -311 49 15 -280
2786 -280 -256 112 -443 -194 -2 -79 257 -94 -126 -22 -264 -9 443 -35 9 179 -343 128 -149 -142 266 107
2808 107 42 269 -191 -125 306 -200 127 233 -255 69 -11 -122 237 228 -78 91 -42 -28 257 -97 -272 -39
2830 -39 -118 171 -170 -72 -115 -26 81 217 73 221 76 -99 32 124 -241 180 234 -217 164 48 -50 -88 -57
2853 -57 -58 139 -317 77 112 -90 -77 70 -528 288 -79 144 325 -234 82 248 -86 214 29 -69 207 -257
2875 -257 118 -48 -250 -49 138 -161 -119 -173 -363 319 -5 -266 137 -204 -25 210 -140 26 229 -99 254
2896 254 174 -103 79 -87 -241 -20 140 -182 261 -190 -85 117 -300 254 -117 -87 96 -259 -77 20 74
2917 74 -19 81 -106 75 27 -302 -270 157 -169 -64 16 -50 -67 -146 -169 171 -94 214 24 -50 221 -266 -158
2940 -158 -109 207 -30 26 -144 -129 335 -275 146 91 -41 281 26 -252 191 -153 -3 59 -12 174 -51 -67
2962 -67 -50 376 212 331 63 -116 -50 -338 -165 -101 -165 143 121 -255 169 257 -102 -45 -120 -289 143 -92 341
2985 341 -189 72 -76 234 -223 -276 174 -148 53 -128 -215 -10 84 -93 106 -166 370 155 -202 -78 280
3006 280 -40 281 99 -48 -52 -129 -286 125 -196 -38 -192 238 -81 144 297 -1 -194 0 -49 -74 -123 65
3028 65 -99 85 163 -366 98 -115 -71 -248 219 -547 -50 76 -192 212 -343 47 -11 -76 243 3 -322 119
3050 119 66 -206 94 -22 111 92 -47 -327 129 167 143 316 97 240 52 -74 -35 -101 -11 99 49 132 42
3073 42 -135 52 58 259 64 74 -101 96 -126 -81 40 -229 68 -12 4 -62 -248 103 373 30 143 163 -197
3096 -197 61 36 -107 -121 -229 -226 89 45 -222 -148 97 -101 -30 -9 57 29 -49 -45 95 -198 245 294 21 51 -162
3121 -162 128 69 -94 -28 91 -259 109 -125 -102 225 21 -11 92 -226 -363 39 119 -89 -30 -113 219 -170
3143 -170 35 33 -80 -161 11 -74 -177 140 -211 -187 -9 -256 -68 85 -164 270 16 64 246 -92 -279 113
3165 113 -83 -136 18 -66 -68 -150 -298 -40 85 23 125 122 -170 -59 133 -76 108 -63 125 78 -75 112 52
3188 52 -174 59 30 -13 67 -108 80 155 -37 218 -237 -409 140 118 335 269 -38 8 111 -278 256 89 -9
3211 -9 164 22 -6 178 124 -28 294 -65 154 196 -130 -19 32 -23 -102 -54 -142 -16 -88 -61 45 -123 95 278
3235 278 -358 -179 43 -211 20 3 -101 66 -70 -188 -9 -148 40 283 -241 -42 198 76 215 127 -54
3256 -54 236 20 120 189 -103 138 -25 -198 54 -130 -248 -188 -68 -213 172 225 -120 125 -13 -4 42 -115
3278 -115 -74 101 -196 38 -86 -22 66 -116 -107 165 -30 -40 30 -50 47 1 -44 24 82 -77 46 -156 48 184
3302 184 -168 81 41 -191 -147 71 -38 1 -242 -439 77 -314 -251 238 -446 -318 165 -146 113 174 72 42
3324 42 122 -158 304 -84 -100 92 -186 -73 246 -173 67 64 -178 178 -28 151 161 33 66 256 -248 -60
3346 -60 30 -26 106 -233 -88 21 33 -233 -162 -75 269 227 197 104 -68 -151 90 158 109 108 -2 -118 95 57 -3
3371 -3 62 -270 195 -122 182 191 15 -253 127 -50 -138 46 -202 -66 140 -39 136 247 -103 -9 -227 65
3393 65 266 -108 -97 -137 -105 -187 -160 -331 -198 88 -174 107 -122 57 123 -256 13 14 66 210 46 -253 371
3416 371 -35 -131 299 -82 -40 174 -68 -159 -15 232 270 247 57 72 -150 -68 256 -191 -22 204 -199 -3
3438 -3 63 -132 242 -104 31 80 -141 -61 147 24 104 387 -34 238 287 -243 -67 -24 48 -15 58 -324 167 -98
3462 -98 72 -125 -292 -195 315 -310 -152 229 -102 413 21 -1 31 91 -129 -100 163 128 109 22 252 -130 -66
3485 -66 381 258 99 149 24 -167 247 -287 96 150 -21 152 109 131 -39 107 -49 235 -175 -66 56 30
3507 30 -110 -113 4 44 262 -97 235 -101 -55 296 -90 93 78 -177 2 285 -283 113 44 -108 95 -68
3529 -68 108 447 -108 -12 86 -245 78 122 -239 269 -41 -158 -23 -69 -114 -105 -244 121 38 -37 -139 31 -377
3552 -377 -9 145 48 37 -223 1 204 108 -241 233 157 -208 101 -200 -104 -180 -202 171 -129 -282 87 -171
3574 -171 -26 116 -625 109 -1 -63 125 -24 -204 -114 -68 63 -72 -25 -71 89 43 124 63 -116 32 0 -27
3597 -27 -182 -57 -241 20 205 44 -26 75 275 -89 -205 49 -182 -192 152 164 -89 -149 -190 -52 -25 -128
3619 -128 209 168 -143 236 16 36 114 -98 169 59 -7 17 17 -28 88 126 -65 -145 -82 221 82 28 -62 -136 -38
3644 -38 -118 47 530 30 -190 -117 -49 212 346 54 33 -27 -113 -190 164 20 16 108 237 -293 -137 58 -63 270
3668 270 8 208 30 -13 146 -138 -141 229 159 62 158 121 102 238 93 232 -56 -37 63 83 -112 348 -208
3691 -208 -181 144 -110 29 -94 -34 21 -19 47 -124 3 49 114 -2 -33 -2 -249 -109 109 339 -286 -50 -227
3714 -227 -20 -173 -46 159 38 -127 108 67 -66 2 -413 -129 301 -186 -313 -50 -84 30 -14 68 151 41
3736 41 -217 285 69 80 218 -124 -230 118 -12 -123 -106 126 287 -32 180 100 -340 -31 107 -111 84
3757 84 -157 -470 71 -167 -331 -49 -89 42 -92 -242 -56 54 -266 25 42 -7 -160 159 -157 -185 -9 12
3779 12 -38 -174 228 195 78 -50 373 -86 94 -122 -258 209 116 -214 273 -203 -109 -110 41 -86 -87 -24 -64 153
3803 153 -109 103 133 107 68 -251 107 198 299 -190 125 23 269 149 -4 92 -205 -198 -208 20 -64 44 -155
3826 -155 -367 -117 -27 226 -89 -35 -64 -106 350 93 53 17 -161 195 -73 -20 -17 -116 -263 16 -296 97 -18
3849 -18 -55 93 -80 156 -14 54 144 -19 171 -56 126 111 -83 -138 237 -14 234 -272 65 -24 -129 -35 -50
3872 -50 -78 137 -18 88 -144 278 16 -13 43 55 74 -87 -181 -130 6 -137 130 -64 212 41 -328 -30 158
3895 158 -221 234 -135 45 110 -122 -175 38 -150 -201 234 -208 71 -37 2 203 48 143 -24 -199 157 124
3917 124 -100 -218 -227 -5 -182 16 102 102 111 -70 72 -15 242 -30 -33 145 150 -104 -268 -214 43 206 -105 -110 70
3942 70 -230 13 363 -15 158 -10 -241 478 -181 -4 203 -151 145 165 -400 -188 124 7 -12 -465 -79
3963 -79 66 97 285 196 -265 -79 237 -29 122 33 283 275 26 -56 -1 -159 -247 443 -326 121 87 47 -163 36
3987 36 200 -15 51 64 130 -295 -117 222 71 89 75 86 114 -48 -113 -115 13 -92 -75 205 -41 50 219 -106
4011 -106 -212 153 -43 276 -12 -19 -189 -77 -153 -2 188 10 -120 9 -61 31 52 -72 -13 216 -91 -121 1
4034 1 -72 143 -119 1 -194 142 -267 -32 40 -218 317 6 150 98 -260 161 80 30 -359 154 156 207 84
4057 84 61 106 60 -155 71 129 -99 16 -135 165 13 -148 94 -28 73 207 -82 -127 47 -148 -304 229
4079 229 88 -68 234 439 83 -314 -151 -150 28 76 138 60 -106 21 -155 11 103 -152 132 220 38 241
4101 241 18 191 -128 2 298 -76 -328 38 -254 -134 -16 169 98 -315 -57 -139 -21 -231 -21 65 -78
4122 -78 136 23 -193 265 -221 174 110 -41 -244 27 95 -94 90 114 -107 26 22 -28 40 86 173 -248 -135
4145 -135 131 -13 -72 324 -375 -186 35 -195 230 -198 19 246 -496 113 184 -193 48 -11 -83 -69 116 291
4167 291 -117 43 61 397 269 262 138 -10 12 -90 -151 -108 33 -202 97 17 61 35 41 -34 110 119 -175 -45 -160
4192 -160 7 -189 133 76 1 -147 -104 34 -201 163 136 -149 80 -187 -293 88 36 89 192 144 -1 -79 -297
4215 -297 76 432 99 -88 -116 21 94 37 274 200 196 168 -237 -265 157 41 138 318 -47 92 94 -232 293 94
4239 94 18 -104 -395 -126 -48 -230 -89 15 -16 -228 -184 -84 88 -80 -200 -57 -173 -159 -104 115 -59 261
4261 261 -150 152 118 -109 202 -70 -26 -5 -55 -111 405 -81 -202 -89 -156 -185 214 -296 -102 135 27 -74
4283 -74 -172 4 -95 62 10 -56 -275 246 145 -132 8 -238 -145 43 76 -46 -14 -251 326 351 -76 18 73 -225
4307 -225 -64 -133 108 -45 -177 164 0 -118 95 -107 -119 239 69 -151 80 -80 -223 67 -61 -59 73
4328 73 21 -164 116 17 80 -116 -336 -136 67 -197 -280 26 116 245 -39 69 28 -20 189 125 -189 40 102
4351 102 53 127 -65 156 46 9 -168 96 -55 -99 -122 -161 151 -133 35 36 -86 -165 210 42 189 326 102
4374 102 77 -109 118 100 -37 -244 249 133 136 -167 8 -112 -84 -234 -141 -235 -151 159 103 -96 59 106 247
4397 247 -167 73 147 103 -209 145 -160 136 3 -64 222 -226 98 113 378 -28 -47 179 -55 84 -64 -139
4419 -139 -147 -39 -46 -84 -245 -115 -241 -75 221 48 57 42 30 -2 396 150 256 -9 -86 65 299 -172 -254 -138
4443 -138 -242 -55 -31 179 143 -194 -9 148 -163 6 121 -176 -15 122 61 60 -135 -13 67 -157 213 41
4465 41 -78 49 69 -79 79 -150 -116 184 -486 -186 206 -91 -113 188 -26 227 106 -196 -150 -173 -11 -128
4487 -128 -202 -90 25 116 -63 49 95 143 154 -117 -79 117 107 -118 47 -9 -39 -110 139 178 8 157 152 -87
4511 -87 83 54 -23 119 -362 104 87 -249 225 187 -69 42 249 7 69 -134 -64 32 -131 -20 117 101 -30
4534 -30 150 -53 -104 -120 -59 152 -112 -17 115 -33 6 -69 -131 111 -76 225 28 -15 -132 183 60 192 160
4557 160 -232 -298 290 -79 -2 -19 65 260 -248 -29 17 -128 -141 8 -72 -103 224 101 14 -153 144 273 69
4580 69 -112 -97 89 54 12 101 -78 121 -41 9 123 63 -59 47 -231 -123 85 21 -129 -211 266 -152 -27
4603 -27 89 -34 -57 159 -45 -134 121 105 17 91 6 182 101 57 -137 -20 -152 -148 -50 52 -356 75 -129 73
4627 73 -248 148 14 -33 285 -155 12 -20 139 -120 -126 -340 -98 134 -217 121 95 -227 258 100 183 118 -2
4650 -2 -98 -124 5 146 222 -395 -126 116 106 -44 232 -32 75 -99 95 167 61 -49 197 -336 168 88 -142
4673 -142 36 42 -175 86 161 -52 83 -302 -273 223 -69 -120 -5 2 -370 -70 5 -74 130 -178 -6 -231 109
4696 109 143 28 -39 -107 -88 25 38 -40 9 77 -184 199 -220 -348 3 -235 -12 -41 -127 143 277 14 163
4719 163 -30 174 329 191 -27 -61 77 -233 26 -37 -90 138 -127 282 -130 -177 -96 -50 -6 150 -71 94
4741 94 131 -80 26 -69 91 126 -34 6 52 -16 119 -23 -169 179 -78 -175 43 -35 -158 90 -232 -53 -156
4764 -156 -92 32 90 46 -27 -240 -173 290 67 2 50 -7 -29 279 259 -19 108 45 11 -21 93 218 120 -138 -95
4789 -95 31 113 24 -108 24 161 -45 -57 50 -91 140 -340 -64 42 -220 26 -155 -53 76 1 -223 100
4811 100 -71 -167 6 184 -69 3 -76 222 -61 -105 234 -120 -147 -221 222 -84 -165 11 -193 -63 -153 -64 -18
4834 -18 -236 202 -279 -99 -27 -50 -229 243 -37 -285 276 135 103 21 -80 31 110 97 -139 -192 -122 130 -150
4857 -150 74 119 -1 0 31 -36 59 21 -3 20 67 -25 -284 -100 -61 75 -296 -356 -332 -173 160 -247 -353 -25 226
4882 226 -230 69 -53 106 32 -55 151 -172 -36 390 -14 105 -73 11 -37 162 10 -180 46 -148 -170 88
4904 88 -6 -42 230 3 115 45 221 241 128 -173 165 74 65 -35 40 3 59 41 200 -87 128 -21 -101 58
4928 58 -32 -407 268 14 -116 92 144 -43 -14 -167 -344 12 173 26 -14 167 -190 35 -93 -33 -152 -7
4950 -7 86 -5 -104 147 148 -1 127 -95 -239 132 83 347 -36 -138 -1 -22 -246 -29 -41 -74 -28 42 5 -49 -48 -104
4976 -104 122 -117 -96 -18 -136 74 -29 -170 -63 -362 163 151 -282 76 25 -1 -63 -176 204 81 -69 -66 246
4999 246 -41 115 -149 -225 -21 10 -15 182 96 33 143 -25 162 -100 -3 333 -115 -19 195 113 -87 316 -20
5022 -20 -24 -132 170 170 13 -127 106 144 -268 -282 215 153 69 -119 53 113 -162 15 -58 -91 -15 -115 196 -4
5046 -4 -279 -274 6 -53 -246 114 -206 -223 181 89 -119 -8 -170 36 -131 -107 -122 -15 -11 144 -84 -82 -109 23 -164
5071 -164 366 -22 -79 -149 60 84 -164 -88 93 -211 -194 234 -151 -46 -291 -220 54 -12 188 262 -50 -130 -43
5094 -43 290 -10 81 -57 32 99 -192 139 25 -14 136 -194 11 99 -9 -54 191 63 176 27 -231 21
5116 21 -74 264 299 17 -10 163 -140 51 65 197 -464 -114 1 73 206 -73 228 21 163 100 -45 25 -282
5139 -282 -114 60 -95 -286 -6 -5 -92 252 119 -99 -191 -149 30 185 94 265 -67 59 62 2 75 327 96
5162 96 -221 88 -121 -336 -94 97 -128 -14 215 372 -256 183 -82 -35 85 95 298 30 174 -48 289
5183 289 -46 -38 -23 -265 134 -102 9 132 -246 -297 -14 47 -37 121 -158 -307 -228 -164 -139 132 304 97 98 -385
5207 -385 176 47 -298 189 110 -114 160 266 -213 141 -8 144 -132 40 102 232 129 17 -200 123 122
5228 122 -274 -80 -308 114 79 -153 -244 -192 -75 -12 -2 -82 -245 177 107 37 89 -102 132 103 -38 162 61
5251 61 -191 53 -158 39 -231 77 11 -190 62 286 61 30 -251 130 -187 133 86 -112 222 -145 6
5272 6 280 -179 -35 110 116 47 11 -77 -216 -151 -239 177 184 51 364 -189 -17 63 324 105 -101 221 248 -124
5296 -124 -48 -118 -29 55 -81 18 -11 88 -27 220 76 49 131 95 -93 -73 -169 109 260 -197 -96 -26 -42 -65 107
5321 107 58 31 70 32 51 -1 8 222 113 -45 -7 62 76 253 -122 101 -50 279 114 -145 23 110 -203 -215
5345 -215 5 162 -42 43 -60 145 -211 -87 31 50 27 -165 32 10 -31 -286 269 -221 16 136 -6 63
5367 63 43 48 -62 237 -226 165 57 -26 -36 -27 -209 57 67 -223 99 -72 129 -42 44 -37 131 -72 -99 -62
5391 -62 -233 -244 52 64 -32 94 19 -82 -210 -36 163 24 -80 -124 -85 164 -81 128 239 -33 49 119 -76
5414 -76 -102 -415 -303 224 59 -123 61 -311 276 112 -126 -243 -78 -58 -97 -56 50 54 -252 -93 52 -190
5436 -190 262 23 -65 133 42 -56 50 -58 205 109 269 58 114 -167 -131 204 -127 59 -36 -226 257 18
5458 18 93 50 -68 124 -109 157 56 55 -39 -266 -46 108 257 -40 -126 168 -87 -64 -247 -205 -49 -261 -60
5481 -60 20 109 -35 -107 164 -81 -93 -56 132 -156 -283 -58 -39 -131 41 -72 -170 43 -134 69 -102 -22 -84 -85
5505 -85 -20 -91 -116 149 -121 -22 73 78 77 -138 232 -315 -113 245 -191 211 95 -47 -4 -368 39 121 -62 -305
5529 -305 -60 -283 -159 80 71 -254 -40 17 -126 -102 1 277 -361 -67 30 2 42 -97 -261 178 -121 82
5551 82 -59 -305 174 199 91 -96 -155 242 132 291 38 -311 212 65 250 14 92 126 92 215 263 63
5573 63 24 103 -188 -88 88 33 28 -246 -219 184 -34 -68 -201 75 227 -229 115 35 -115 164 149 -41 66
5596 66 49 188 -134 87 -121 111 -140 93 -33 52 -79 299 66 -146 122 114 169 -69 -154 -78 -208 -83 -257
5619 -257 8 -15 237 -271 -31 234 31 99 -71 -171 148 -216 138 -184 -26 -256 -24 152 -75 36 -196
5640 -196 340 -135 -70 -66 -35 -59 291 47 131 124 -139 15 -13 308 -102 34 -72 -60 -82 35 -150 133 -106 24
5664 24 -179 -108 116 68 23 -74 101 -120 -262 -13 177 1 -128 -59 272 34 171 262 -37 -381 -247 -137
5686 -137 -25 -61 378 -97 -176 76 132 11 -278 188 102 286 20 48 -408 112 -144 -2 89 85 88 183 162 -17
5710 -17 -66 -15 111 -178 110 -208 -74 -4 0 315 -155 65 5 -244 -92 32 -308 -138 30 -79 -76 42 -73
5733 -73 28 51 113 38 46 -72 -134 67 24 29 31 -74 -99 -227 139 -6 354 153 56 238 91 131 497 -287 -20
5758 -20 -9 -143 -8 -149 -86 -156 -65 -132 -135 -27 145 51 117 -147 -147 -102 9 21 -54 -132 180 -92 -139 162 114 -46
5784 -46 58 62 -107 75 -70 -254 -113 213 64 -236 13 -10 -175 -139 188 77 -54 -48 -68 37 0 45 92 162
5808 162 197 -143 141 -46 -59 -11 -74 113 -158 60 -21 -88 -144 -51 90 -301 126 104 67 104 7 -77 -149 -74 187
5833 187 -37 107 195 -53 -159 193 10 -46 -44 62 64 2 -110 -17 -48 188 -228 -292 53 -245 -36 59 -7 278
5857 278 -57 -182 -113 273 -13 -46 -44 34 -141 -15 11 218 164 -30 11 284 -14 -69 -52 -159 -189 -2 -5 -291
5881 -291 -278 -33 -166 -133 21 -88 -24 -105 7 29 -75 205 -350 27 -17 92 58 -44 79 183 39 -92
5903 -92 -104 -242 -78 3 -149 -6 -101 2 -131 105 73 4 -173 10 7 -178 32 266 -48 -147 10 57 -124
5926 -124 64 -31 126 -54 -117 45 21 38 -60 -247 -3 97 143 148 113 170 20 178 35 81 58 -192 363 68
5950 68 76 -97 115 -154 -12 -49 -36 78 27 82 11 -26 -53 -73 230 4 98 13 -158 268 -181 -116 -60 171 -50
5975 -50 -73 73 8 -19 107 141 -18 418 -85 -69 1 -53 7 -20 -85 63 -123 -268 -24 240 -79 5 89 -9 -173
6000 -173 161 108 -242 37 146 -189 -333 54 42 -38 25 147 84 200 84 81 227 -118 213 -103 -390 54
6022 54 224 -21 -178 46 -80 -93 65 -14 -142 -49 125 -93 19 -25 -24 -169 -334 242 24 0 -82 -248 -85
6045 -85 98 172 316 150 4 42 25 185 -241 224 41 37 11 17 -116 210 -175 -235 7 17 -106 -37 -102 253
6069 253 183 28 145 106 260 194 -222 48 113 -223 -135 4 221 -181 -43 63 100 8 2 -151 -2 97 -11
6092 -11 -13 37 2 -49 109 -214 -75 -8 -107 -179 123 209 -308 298 139 -8 102 4 -38 -141 13 -121 122 -23
6116 -23 24 -149 126 -29 -63 -223 243 -1 -333 -157 -29 346 7 45 -30 -43 -111 44 -54 -74 -211 87 212
6139 212 -48 -287 -7 38 -50 -190 -222 -52 229 120 28 -17 -50 -258 66 56 -327 -50 -52 199 -253 -318 256
6162 256 -10 -152 158 -287 222 -40 146 -3 -126 18 152 73 181 404 79 -75 218 -111 14 315
6182 315 -112 -31 -169 -79 228 149 123 30 -155 49 189 -131 150 218 0 161 18 33 185 -49 -130 171 -109
6205 -109 -34 41 -16 -32 -71 -184 -115 31 -247 -155 -197 154 175 -77 -186 -35 -10 65 -77 -63 112 -53 127 260
6229 260 -270 13 290 26 109 -15 -35 -221 139 -287 -21 -261 -323 -210 135 -231 105 37 -56 48 196 30
6251 30 -59 210 31 212 -360 -105 -162 50 -145 -60 153 -29 131 61 -61 -161 237 127 -95 -126 -42 145
6273 145 22 25 159 159 10 97 -173 -7 67 -62 284 274 -61 -28 -48 -131 -28 -140 -161 -157 -64 -171 159 -98 -130
6298 -130 17 242 146 -9 -92 0 236 -210 -41 -223 77 162 -145 -212 -124 134 8 -125 -1 45 -366 173
6320 173 62 63 109 126 126 -11 182 -153 -39 -6 -61 -9 -123 -187 -156 -216 503 76 -91 81 -127 131 93 80 464
6345 464 -13 -96 41 -66 9 -224 122 -205 313 43 27 -226 -180 135 -51 -66 -36 18 -88 26 -71 70 -132
6368 -132 -52 220 -23 -91 -207 -53 -106 -145 81 -8 155 -44 90 293 -14 -72 51 227 266 33 -172 219
6390 219 180 4 -131 202 -87 52 -8 68 383 42 -146 136 -82 108 45 -232 55 38 -80 166 -44 -73
6412 -73 -39 9 -312 -112 77 267 86 180 42 167 52 -122 24 -94 -56 58 -38 81 -95 50 134 6
6434 6 159 69 -204 -281 248 121 -54 -5 -55 161 43 -11 -464 7 104 -325 68 152 95 -283 9 77 -56 248
6458 248 -220 -85 -159 69 197 -12 129 -3 -216 -166 19 163 69 38 99 41 25 54 99 169 -440 -25 35 143
6482 143 62 -37 -8 48 15 231 -98 87 -180 -268 -55 81 -11 120 -100 94 -263 -23 -225 -77 282 55
6504 55 30 113 -16 -126 -290 -190 -132 125 29 -245 -82 15 -88 50 158 141 -85 171 95 44 -7 -3 42 92 84
6529 84 -203 211 -263 -102 -301 187 -188 390 -42 21 330 51 -97 120 -29 -160 -76 -64 272 -140 -110 -139
6551 -139 -208 193 77 4 51 31 -124 -2 -164 -36 1 -45 106 59 16 21 -11 -50 91 157 29 -172 -113 205 166
6576 166 119 140 -8 347 -108 -18 -22 -76 -8 -40 135 -45 -12 -62 42 165 -40 -173 42 214 -16 -158 -238 -329
6600 -329 247 -219 -144 41 -19 112 117 31 -134 4 -313 13 61 325 16 348 -139 110 89 18 -88 -90 -261
6623 -261 -270 292 70 142 -240 -97 21 105 -41 -60 -160 87 -97 2 52 -88 86 -42 45 -126 -108 -506 -219
6646 -219 24 36 -70 83 -197 -167 47 -116 160 103 -95 -157 36 134 120 64 89 -13 -18 -13 90 180 86 186 -244
6671 -244 24 -132 -154 352 -62 -113 -103 115 77 246 -7 -282 222 54 -31 -176 -263 -136 95 131 11 376
6693 376 51 158 -3 159 28 120 67 -21 234 -174 -152 58 -37 -47 210 -68 -76 109 125 -9 -17 93 37 33 -203
6718 -203 203 -83 27 101 181 -66 8 296 -30 -110 -155 119 170 -52 129 -48 39 -94 135 -53 57 -147
6740 -147 31 152 46 -168 -128 80 -143 -100 -79 -146 9 13 -79 -221 109 163 -32 -120 -44 -90 -215 32 -40 91
6764 91 -119 0 -480 -200 -329 82 209 154 -37 142 -151 20 167 120 19 -230 -69 -113 87 -18 60 138
6786 138 -112 54 -187 -78 47 102 4 -18 270 -127 -13 44 47 84 285 -74 -124 -84 65 -335 -55 -185 -169
6809 -169 -115 211 -168 -85 145 -66 208 9 182 277 143 -81 291 107 187 -30 -47 -81 79 77 -135 -147 198
6832 198 -6 22 48 108 -57 -63 142 -19 208 -112 -132 -105 41 -104 -65 1 211 -135 -41 -47 9 20 153 -242 380
6857 380 -137 -173 -178 161 -261 -42 197 -207 -37 -74 -194 2 55 141 474 -64 1 24 117 193 118 -177 91 291
6881 291 99 21 26 239 -113 -86 -155 4 98 -255 -29 225 236 99 -78 -62 -13 -110 55 -115 166 148 196 242
6905 242 -55 72 113 -211 -13 -102 71 124 -118 -102 -402 -220 2 5 -2 102 87 4 35 124 25 -114 18 -156
6929 -156 -53 -69 173 -42 8 130 -3 -100 236 134 -25 -100 -11 -40 -32 -19 72 -115 0 -50 -7 -141 -44 9 12
6954 12 119 39 190 -28 24 17 144 -114 -139 97 -40 -258 -209 -156 -5 -334 -92 -225 -47 -35 -111 388 -81
6977 -81 8 184 185 51 -84 77 -166 -201 44 -85 -164 -135 -241 -39 -125 -69 -46 163 -168 -8 151 214 -103 -140
7001 -140 -39 -316 45 -84 91 -97 89 184 -61 6 -164 -240 -118 27 241 -152 -59 -174 -14 96 56 9
7023 9 -179 -251 23 168 -52 -19 13 -106 137 216 103 -124 -129 -312 24 46 -19 -190 251 203 161 79 114 48 294
7048 294 358 81 115 199 28 76 -52 -67 -45 -63 -9 124 64 -85 -46 184 118 132 -65 86 29 -25 258 326 -33
7073 -33 236 37 -17 123 142 -30 305 65 -48 160 218 260 -174 64 -104 -286 -193 102 -190 -107 -70 -198 40
7096 40 163 64 207 297 -156 -42 12 -90 -67 -138 73 -207 48 -33 103 227 238 -31 -97 -206 -160 60 -154
7119 -154 -133 204 -42 91 197 3 102 -213 92 -321 98 207 121 47 -82 -331 -152 101 53 111 -148 -97
7141 -97 283 5 30 -40 -387 -41 -128 26 22 95 113 283 -174 -26 36 -239 -32 -36 -25 164 39 113 -83 65
7165 65 77 146 234 -129 -142 94 233 -169 152 194 176 -72 -142 -241 154 28 89 -70 107 97 70 191 228 142 -342
7190 -342 107 143 187 -8 -15 -6 216 433 -79 22 287 -4 171 200 -145 -302 -25 -237 46 -108 -35 201 -76
7213 -76 -22 119 -24 84 -127 -105 72 -114 -21 -363 -83 134 35 196 -80 153 -344 -179 -133 39 2 -87 222
7236 222 76 -9 199 -61 290 44 -32 85 65 181 137 -110 -17 -50 -90 70 195 -9 -16 -261 34 29 -50 58
7260 58 -12 52 212 -136 -32 -66 -176 245 -298 -49 76 95 152 -100 278 73 -118 214 -120 -36 -171 69
7282 69 143 151 63 -129 -92 -37 121 8 239 70 103 -274 -103 108 -118 -67 -78 -26 -27 -151 527 68 250 -146
7306 -146 129 -55 -57 19 256 75 43 24 -94 132 322 123 -219 -70 124 -159 -54 -180 198 -127 -253 153
7328 153 -202 -176 -227 -117 -22 -19 -177 18 -111 -33 -316 264 -170 64 -64 -137 -154 -125 273 -161 -208 228 -129
7351 -129 -9 107 126 140 -76 -141 144 -71 -206 -138 -43 35 100 -225 303 138 -19 65 240 -37 25 17 153 -66
7375 -66 5 171 79 -184 -240 7 246 -53 8 88 -74 -272 -182 -1 57 -160 -383 -358 71 -141 -211 45 -59
7398 -59 -61 -108 103 -111 102 -113 3 10 119 199 -131 65 159 59 -33 53 23 -89 -186 40 131 163 77 66 72 116
7424 116 16 -23 -56 244 69 -64 -152 -116 66 -207 40 -76 -450 114 115 92 -113 -22 -87 -32 22 -371 15 99
7448 99 36 -20 52 99 -77 24 -128 160 15 123 213 -27 82 112 135 -41 -89 -88 -82 224 30 -171 29 77 -16
7473 -16 -166 4 -136 171 -119 9 -31 -201 124 30 -152 -129 -79 100 -64 -30 16 -288 36 -6 113 -138 129
7496 129 26 121 -42 -285 176 65 -106 -134 -3 -148 178 -128 20 14 7 17 13 -83 45 -177 16 187 -119
7519 -119 -59 56 66 152 -5 213 237 102 11 64 -303 -396 62 -63 3 145 -99 26 -66 -225 17 -74 39
7542 39 142 24 77 -70 47 -67 254 32 -113 -125 -283 63 -192 72 158 93 -51 -109 21 39 208 -264
7564 -264 -59 -307 29 -104 -47 -102 -74 213 203 89 51 25 5 177 148 219 -202 -79 -32 -111 6 15 6 -183 -56
7589 -56 30 -86 14 -83 111 -149 -88 -221 -273 -185 173 32 163 45 2 119 -74 1 -201 -168 190 -131 108
7612 108 182 361 -30 -95 157 -90 55 -286 290 276 -9 168 83 -365 69 31 -308 76 265 144 -30 -146
7634 -146 -54 113 -6 -29 -48 -31 292 -46 -25 45 -257 117 81 -216 112 101 -39 9 71 -61 -114 -228 99 254
7658 254 201 -138 -119 -98 -90 -21 59 -57 44 11 -208 -130 109 127 -106 217 -92 127 -134 -227 -284 -57 -95 -213
7682 -213 56 57 248 98 271 180 158 -11 142 16 124 92 -181 1 -45 85 -14 2 -94 -73 95 -89 32
7705 32 26 -166 -17 65 -113 -9 104 -243 -110 26 0 -50 -41 -83 61 23 195 220 20 183 -7 -183 -123 -88
7729 -88 129 37 -243 -125 -138 -128 172 -79 -82 120 6 5 112 17 -87 100 71 36 12 119 91 3 62 329 55
7754 55 -157 234 -82 67 -193 -457 17 42 -25 -91 21 -2 -68 -5 207 -71 -282 -15 49 -97 34 -23 -30 181
7778 181 224 169 228 -26 86 1 -339 11 -149 4 30 116 -161 -55 -39 1 149 25 293 50 -432 -151 -163
7801 -163 -99 -97 -261 -155 13 -3 -15 -31 22 -45 159 71 -98 237 -176 228 -165 14 -143 -80 -71 -16 -189 21
7825 21 182 -227 -99 -40 -14 188 -155 263 -78 2 22 144 65 -53 103 -180 102 154 271 32 26 -77 -254
7848 -254 224 33 190 -50 -229 -51 -55 87 -47 -159 130 -59 185 -12 -141 54 -48 278 -7 106 179
7869 179 89 121 -38 54 161 125 -5 -167 -45 -380 -8 318 -22 -18 -60 -187 -32 -353 17 289 -47 -129 66
7892 66 -54 -7 22 87 106 257 260 108 -34 52 -32 -131 41 165 88 -127 -34 197 212 73 -149 -267 -81 21
7916 21 -104 -47 -69 49 188 34 213 -70 -8 38 65 -12 -47 -237 -156 209 89 137 199 -258 6 100 -169 -10
7940 -10 14 -11 5 -171 86 -53 -108 146 154 -111 27 175 -158 164 68 -95 -75 22 50 -4 10 -37 -133 49 69
7965 69 -29 -78 -61 -6 92 210 143 99 -39 -72 33 -151 -114 -138 154 54 -66 -94 -68 105 52 125 -159 -81 177
7990 177 333 -13 20 114 -174 300 278 136 14 -99 62 -161 -71 324 -48 -184 -128 95 15 133 38 -89
8012 -89 -70 243 -151 -69 -107 50 56 -88 -198 -131 -71 32 178 25 127 -80 18 -110 -114 12 100 137 201 26 -206
8037 -206 -6 281 27 -42 111 -147 22 61 -44 -54 -288 229 -38 123 -358 193 -90 10 -305 -68 34
8058 34 -297 -78 -127 -169 -19 134 -314 75 -34 -77 -161 -250 24 42 -98 -72 -50 -149 318 -60 -145 130 120 49
8082 49 -100 223 151 -26 -13 8 119 -137 95 -48 -76 31 -37 -70 111 -182 -87 -108 -132 -80 193 28 281 -71
8106 -71 49 -15 -276 -160 120 -393 -12 56 -349 130 120 215 -21 40 -257 119 -49 301 -128 -197 -21 39 97
8129 97 39 -98 263 -71 -88 10 216 -36 321 225 -124 -42 93 -166 -191 -167 61 178 -95 -45 155 -49 63
8152 63 74 -88 69 -143 253 179 -22 -23 24 -107 -66 -201 -118 -86 183 -25 -89 -113 -61 -170 -17 35 42 10 -75 -66
8178 -66 -183 252 229 227 175 -176 -406 -135 -209 160 20 -339 -161
8191a61
$$ Imaginary data points
##PAGE= N=2
##DATA TABLE= (X++(I..I)), XYDATA
0 0 0 0 0 0 0 0 0 0 0 0 0 0 0 0 8 -8 8 -8 8 -14 16 -16 24 -24 32 -32 40 -48 54 -62 70 -80 88 -102 115 -129
36 -129 145 -163 182 -202 226 -250 278 -307 341 -376 416 -457 505 -556 614 -676 742 -821 906
55 906 -1003 1113 -1239 1387 -1561 1768 -2022 2342 -2759 3328 -4152 5459 -7865 13808 -66340
70 -66340 -53603 14601 -39222 8576 28343 8416 -2330 5112 1544 -11797 -537 52529 6548
83 6548 -33048 26284 18027 -29834 6581 9546 -3013 18426 15274 1791 -2751 8870 35547
96 35547 -7142 -32465 16032 -565 -26942 15402 14052 4112 27645 14439 -10603 -19869 -7231
109 -7231 13256 -21156 -23324 28759 1333 -26452 1825 -23812 -36973 268 -4755 -15484 -252
122 -252 17583 25706 -2489 -903 28930 -896 -7760 17634 -11950 -6970 25132 -4629 -17394
135 -17394 -2353 -4958 -3583 -12599 -6719 16378 4389 9486 20990 -9602 -2214 15347 -13806
148 -13806 -9571 10992 8094 15262 6539 -297 9392 -8371 -10172 -2694 -23496 -8501 10473 -10526
162 -10526 -3898 6732 -3735 1714 -4234 -7029 6651 305 5159 10732 -7385 4758 9991 -16570
176 -16570 -6755 1883 -8762 5401 5162 -2772 6356 -380 -2816 -2109 -13015 2207 7761 -5828
190 -5828 11336 13167 31 12024 2983 -9196 3510 -1875 -3081 3584 -3832 3692 4076 -9202
204 -9202 -1038 -4801 -12436 2620 -3323 -6933 9018 1385 -1442 5112 -4439 935 4200 -3901 6255
219 6255 4526 -1384 8262 -2356 -9496 517 -8335 -8740 1374 -3828 3310 7192 221 7208 2756
234 2756 -2936 6650 -2499 -4416 7821 -1392 -2139 5008 -4774 -2573 480 -5466 1909 736 -529
249 -529 8742 -168 -1798 5968 -6573 -6310 1012 -7572 -1786 4017 -1144 5267 3658 57 6145
264 6145 -1125 -1640 5849 -3480 -1634 4394 -6027 -3032 -320 -7701 -1743 -1456 -3067 5625 1454
279 1454 2366 8674 -988 65 4743 -5097 -1124 2133 -3679 2355 1500 -2252 3789 -2314 -3169 2951
295 2951 -4528 -1241 4042 -3353 1246 3610 -3197 1674 984 -2748 3339 -356 -355 5307 -1996 88
311 88 3416 -4752 -1035 1740 -4372 1408 1252 -2135 3156 -1586 -2153 2316 -4263 -1437 3524 -3039
327 -3039 2385 4898 -1282 3456 2219 -2106 2469 -1499 -2067 2451 -3562 -1080 2650 -4405 -331
342 -331 1277 -4494 1032 751 -2167 3350 637 -101 4139 -1471 429 3618 -3025 1387 2460 -4198
358 -4198 936 -3 -4724 324 -2283 -2970 1830 -1817 747 4321 -1236 2925 3499 -2479 2417 1278
374 1278 -3197 2162 -221 -1693 2494 -1599 -310 1891 -2905 589 435 -4533 1319 -44 -4255
389 -4255 1893 -354 -1839 3543 -174 582 3848 -729 2014 1100 -3682 1804 -912 -5062 1061 -1533
405 -1533 -3038 2292 -1632 -1203 2478 -1296 559 829 -2294 2840 985 -2211 4135 1030 65 5482
421 5482 27 -1058 2845 -1280 -1100 -1118 -3916 850 -1959 -3826 2653 -1067 -851 5410 -666 -867
437 -867 4874 -18 -81 761 -1851 1496 -1056 -2784 1432 -3144 -2121 2947 -4058 -2989 2953 -2275
453 -2275 -1356 378 -1233 2049 1256 570 3895 -287 2162 5982 -2687 -1053 4500 -2596 -1766 1133
469 1133 -2149 516 477 -983 977 -1992 1402 3657 -4714 -555 4487 -3035 -213 2406 -2457 1164
485 1164 2255 -644 376 -1416 1299 1796 -6120 -901 1875 -6006 -1714 69 -4752 774 2852
500 2852 -797 949 853 3480 3058 -2639 2846 3966 -2810 2492 2274 -4077 1757 1942 -3664 -1791
516 -1791 -564 1417 567 -3292 2739 2736 -2411 3764 1262 -4287 3601 2819 -3166 -79 787 73 -904
533 -904 -3116 908 -461 -3527 2603 -1386 -5289 3884 957 -5591 -73 146 -1038 992 -474 2466
549 2466 1751 332 4796 -290 -2670 5432 521 -4635 1945 546 -1386 896 -1818 -648 24 -560
565 -560 3119 -1646 -1683 6249 549 -2862 3728 -284 -1737 1536 -1397 -850 257 186 1433 -3564 -2613
582 -2613 3482 -2949 -3975 2391 -2124 -1887 3094 -1607 -821 1562 608 1340 -1643 512 4611 -1325
598 -1325 -919 3945 -2528 -605 3052 -3384 -1653 1928 -488 547 -410 -32 3009 -1864 -362 2800
614 2800 -2510 1054 3451 -2380 412 2899 -1335 120 -690 -987 1370 -1926 -372 1766 -3218 319
630 319 1661 -4206 -474 1889 -1778 814 640 48 2510 -552 461 1685 -2394 1464 1929 -3297
646 -3297 989 2185 -2643 453 -101 -2234 752 -1069 -657 652 -1861 2073 1877 -2665 1964 1899
662 1899 -2083 1822 805 -1210 1856 -371 -798 300 -1924 196 72 -2826 1981 1104 -1701 2254
678 2254 18 -1786 1567 -918 -809 1096 -885 1380 1284 -1778 2163 375 -2270 1361 -642 -1909
694 -1909 1416 -1039 -1329 741 -1772 166 -42 -1728 1684 211 -1210 2699 259 -510 2654 -594
710 -594 -513 1444 -848 490 635 -1235 1260 -245 -1639 1341 -1544 -1524 1992 -912 -68 1685 -758
727 -758 784 1088 -1338 913 -282 -1331 1458 -851 -854 1668 -1760 -735 751 -1822 -82 430 -1461
744 -1461 838 -76 -1133 1926 -472 -491 1919 -670 581 2089 -852 1333 929 -1177 926 -297
760 -297 -1678 1380 -1138 -965 1072 -1459 105 1112 -1670 508 715 -1247 1147 293 -556 1589
776 1589 -623 -464 1481 -1216 236 998 -1408 581 261 -1956 635 -493 -1402 1198 -569 -487 1592
793 1592 -856 781 1580 -876 862 376 -1479 1275 -79 -1120 1116 -933 -728 753 -1694 -104
809 -104 778 -1587 830 487 -848 1237 10 -880 1514 -529 247 1382 -943 551 760 -1503 518
826 518 269 -1654 730 -537 -1512 1072 -764 -345 910 -1145 162 809 -1231 1005 501 -1275 1596
843 1596 117 -938 1907 -520 -418 874 -1063 -20 41 -1376 646 -66 -1053 1361 -247 -872 1522
860 1522 -330 35 1393 -521 407 809 -1258 842 -133 -970 1191 -663 -924 1223 -1028 -788 901
877 901 -1021 -71 332 -1062 953 61 -743 1879 -223 -698 1877 -597 -156 1509 -1115 39 722
894 722 -1310 83 -255 -811 1064 -811 -556 1633 -1163 -275 1519 -899 262 1363 -972 492
910 492 322 -453 1029 -720 -336 1151 -1519 -290 974 -1654 34 1066 -1276 99 448 -444 952
927 952 -532 79 1499 -475 343 1511 -1624 842 1107 -1541 234 539 -781 341 -544 -544 632
944 632 -1331 557 815 -1752 825 1102 -1275 942 1110 -936 1097 -159 -258 792 -845 332 161
961 161 -1555 930 618 -2231 312 259 -957 796 -128 -272 811 -311 477 552 -701 1379 920 -1637
979 -1637 888 471 -1043 843 -57 -871 457 -689 33 -439 -1211 1307 88 -1222 1428 120 -1137
996 -1137 1590 216 -782 1058 -211 -295 122 -704 791 -148 -1352 902 -857 -1279 1412 -1060 -1338
1013 -1338 1152 109 -349 545 -393 1170 138 -398 1463 -370 -432 1914 -780 -809 1294 -710 -524
1030 -524 295 -532 294 -279 -956 390 -779 -136 1546 -907 -484 1137 -549 -286 740 -528 431
1047 431 -123 -429 884 -704 -271 933 -1659 -566 1380 -1016 117 764 -782 569 587 15 647
1064 647 -382 189 1394 -1074 266 1179 -1414 487 844 -1205 249 437 -760 489 -573 -153
1080 -153 692 -1275 419 1036 -1097 684 981 -1089 887 797 -848 428 -356 -428 310 -1301 167
1097 167 688 -1576 560 518 -1501 733 494 -765 601 92 48 595 -616 595 854 -859 613
1114 613 432 -1428 1066 67 -1285 846 -178 -621 484 -755 81 260 -783 919 631 -852 1228
1131 1228 349 -585 1000 -304 -307 930 -587 83 369 -1126 638 -89 -1032 630 28 -863 675 -581
1149 -581 -255 866 -501 289 598 -270 727 256 -832 1201 -48 -1081 915 -944 -648 557 -615
1166 -615 -115 573 -719 453 98 -630 1134 -150 -418 1155 -411 -199 1114 -301 74 693 -862
1183 -862 416 -229 -982 887 -223 -495 979 -524 -82 704 -840 -168 679 -882 545 343 -391
1200 -391 826 141 -168 766 -784 -161 839 -707 -135 440 -1064 212 107 -716 620 -368 -505 572
1218 572 -416 193 960 -665 272 991 -833 328 226 -634 485 -196 -434 424 -772 -252 650 -746
1236 -746 291 582 -708 458 366 -525 699 -21 -316 693 -301 323 675 -773 420 321 -1224 381
1254 381 -130 -912 582 -383 -161 715 -761 -10 642 -433 478 428 -707 689 -160 -397 601 -207 -202
1273 -202 542 -846 -148 471 -948 205 190 -724 671 -11 -394 523 -368 -223 717 -309 99 700 -749
1292 -749 571 269 -828 613 -131 -863 550 -540 -288 581 -750 -145 358 -459 455 347 -380 845
1310 845 -93 -569 650 -291 -305 575 -694 -161 242 -752 349 -67 -824 546 -251 -487 753 -391
1328 -391 -129 991 -229 435 434 -408 696 198 -696 662 -260 -235 557 -564 -238 934 -806 -1 612
1347 612 -621 310 -25 -598 795 -220 11 859 -772 88 825 -684 384 515 -760 50 14 -707
1365 -707 252 -630 -344 573 -634 -181 482 -820 547 667 -356 610 413 -611 474 -263 -35 527
1383 527 -575 -29 672 -884 217 447 -1037 433 -29 -463 447 131 -294 630 -321 206 585 -557
1401 -557 494 685 -908 719 97 -729 443 -116 -691 235 -461 -13 71 -591 394 -105 -830 784 11
1420 11 -615 969 -11 -405 535 -306 -42 220 -716 509 90 -920 457 -177 -860 775 -182 -272 559
1439 559 -153 -40 627 -210 828 443 -424 799 114 -301 1086 -207 -446 662 -497 -347 131 -240
1457 -240 44 -202 -768 688 -371 -374 897 -349 40 926 -590 -27 727 -93 136 49 -291 696 -402
1476 -402 -441 776 -822 -288 579 -811 -258 720 -691 180 155 1 815 -39 17 771 -524 26 740
1495 740 -545 -194 543 -488 8 -53 -345 334 -352 42 366 -304 331 636 -281 199 794 -558 391
1514 391 361 -290 687 -103 -171 504 -318 328 295 -1005 201 264 -759 98 101 -460 393 7 242 598 -179
1535 -179 258 204 -804 494 253 -601 523 -149 -442 315 -217 -343 18 -603 330 422 -483 612 332
1554 332 -447 689 113 -499 858 54 -367 553 -327 202 193 -716 290 358 -698 179 21 -324 678
1573 678 -28 -220 444 184 138 218 -333 531 12 -488 498 -66 -412 663 -412 -371 257 -202 26 95 -456
1594 -456 123 274 -385 583 -203 -93 520 -252 -230 435 -518 -42 302 -380 -44 -151 -403 214 -397 -657
1614 -657 596 -372 -403 377 -134 206 353 -71 210 328 -284 264 -132 -291 717 -494 -205 449 -447
1633 -447 -102 399 -507 -42 201 -484 456 -163 -48 457 -378 177 559 -218 247 539 -489 361 178 -435
1653 -435 491 -396 -246 40 -426 -177 456 -397 17 134 -457 218 -83 -72 317 33 -89 487 -363 215
1673 215 499 -450 -29 119 -628 347 -262 -503 248 -288 -292 361 -561 -61 434 -449 241 332 -190 225 21
1694 21 -246 468 -19 -257 510 -239 -22 405 -499 113 91 -571 282 142 -187 318 296 -233 326 -429 -203
1715 -203 660 -530 401 -40 -433 139 -50 -322 530 -281 -182 308 -444 38 315 -424 313 199 -316 668
1735 668 72 -456 80 171 -226 257 -281 -216 227 -573 113 -45 -579 135 -33 -488 452 16 -43 185 -281
1756 -281 -31 404 -173 73 171 -369 230 47 -250 211 -428 -479 353 -360 -93 335 -393 221 146 -380 310
1777 310 -158 -210 383 -240 -110 605 -189 93 160 -339 125 -101 -574 327 131 -368 47 -199 -140 433 -241
1798 -241 -6 302 -258 351 173 -396 402 80 -268 152 -39 -152 409 -554 -138 192 -551 252 -75 -438
1818 -438 405 -219 -166 526 -194 265 500 -431 28 420 -357 378 78 -260 330 154 -432 -113 -179 -76 14
1839 14 -668 414 339 -492 383 124 -500 289 290 -90 400 84 -53 537 -433 147 37 -686 387 -102 -446
1860 -446 134 -196 -3 210 -148 -13 529 86 385 62 -84 304 -84 -190 364 -320 -478 295 -177 -275
1880 -275 81 -543 -148 -243 -367 486 61 -372 745 -34 -255 649 -181 -225 462 -299 226 -54 -378 129
1900 129 -9 -373 466 -217 -399 175 -431 -48 263 -458 150 153 -257 224 54 -73 276 -267 -314 231 -500
1921 -500 -132 267 -472 -16 -21 -226 155 -139 -296 284 -383 -281 525 -424 -89 322 -280 198 114 -107 434
1942 434 -107 -202 398 -252 -180 389 -462 -95 151 -512 104 71 -64 376 -181 -251 282 -36 165 535 -352
1963 -352 160 419 -305 114 21 -705 187 -183 -196 119 -111 249 424 -231 684 399 -506 71 188 -125 236
1984 236 4 -534 325 -302 -124 314 -384 370 144 -588 144 -71 -416 584 97 -286 437 -258 188 369
2004 369 -185 133 496 -376 153 183 -406 447 -205 -518 108 -463 -125 195 -282 492 260 -325 294 -186
2024 -186 -366 377 -229 121 448 37 -272 247 -201 247 -127 -438 363 -100 -105 495 -205 -348 263 -166 -70
2045 -70 201 -287 136 257 -329 467 62 -226 534 -56 -319 440 -369 -95 271 -280 134 4 -157 220
2065 220 148 119 480 -46 303 400 -289 43 200 -567 164 161 -216 195 -126 -171 281 -211 33 356 -202 271
2087 271 -8 21 444 96 -267 415 38 -71 564 -259 -73 299 -338 31 -67 -398 152 102 -98 261 -217
2108 -217 -327 287 -335 177 73 -493 -23 117 -125 99 78 -90 33 143 -20 184 -500 51 180 -163
2128 -163 123 274 -224 180 136 -211 62 -36 180 84 -102 41 255 -145 53 239 -155 -68 104 -350 289
2149 289 74 -565 -81 -291 -50 -90 -277 -3 461 -424 276 133 -253 275 84 -18 92 -259 53 57 -465
2170 -465 87 243 -264 310 -111 -75 72 -40 24 132 -106 -110 165 -126 38 -88 -148 395 -187 -329 332 -330
2192 -330 -82 78 -348 -67 182 -312 148 -2 -155 361 -410 -1 300 -230 144 154 -206 -58 93 -100
2212 -100 -257 -20 -271 283 117 -557 263 -228 65 337 -184 -146 109 63 358 169 -172 150 -172 -150 7
2233 7 -53 -42 102 -205 91 100 -454 208 51 -141 87 -118 -110 251 -90 -326 354 -214 211 406 -156 168 135
2256 135 -66 -64 -46 -473 82 -194 -148 51 -69 5 405 -476 42 257 -27 174 116 -30 345 -116 50 320
2278 320 -447 4 -90 -371 387 -119 -37 156 -132 -89 44 11 -16 422 -274 44 183 -229 192 -43 -234 285
2300 285 16 -90 119 -163 -42 122 -344 57 88 -309 -76 163 -28 167 118 148 305 -217 -39 35 -105
2321 -105 -230 81 -171 69 -173 -358 45 -50 -456 363 -42 -82 341 -68 59 260 -48 60 424 -62 171
2342 171 -212 -275 334 -189 -100 113 -288 -6 111 -2 102 -17 111 295 -27 -104 306 -175 -212 435 -36
2363 -36 -255 75 -300 64 183 -119 247 115 -99 236 -217 -115 129 -350 170 115 -200 259 -122 136 241
2384 241 -190 -181 428 -98 37 241 -288 131 -56 -308 17 19 -76 -261 56 -39 160 -77 161 67 -150 330
2406 330 50 -136 228 -106 144 203 -162 -192 -37 -307 -6 123 -302 65 -93 -108 319 -22 -250 11 -178
2427 -178 -67 135 -145 -24 50 -200 -111 -69 -154 280 -466 -6 -7 -11 -358 -61 -331 43 68 -218 138 195 20
2450 20 226 227 -388 344 -404 17 10 78 -89 -29 -367 -137 -179 -292 280 -176 -54 190 76 108 407 -98 32
2473 32 156 62 79 147 -129 195 -18 -160 158 2 27 300 -2 -26 95 -259 136 115 -510 172 -33 -89 51
2496 51 -190 72 -72 97 -130 45 -121 100 -175 -348 -179 -377 -16 -357 -193 131 87 33 -49 164 -251
2517 -251 88 61 -63 230 -33 -196 209 126 -39 289 -250 -221 169 -277 -56 -180 -349 164 -278 -48 166
2538 166 22 16 459 140 29 263 -187 257 -209 13 196 -58 -109 89 -84 -120 209 -213 -21 76 -357 312
2560 312 327 -54 165 -258 210 313 21 331 -17 -194 -208 67 -387 40 44 -174 -21 -43 -3 162 -267 52
2582 52 191 -172 15 37 -310 -103 -46 -137 31 152 -119 59 259 -17 188 -125 5 25 -15 397 143 55
2604 55 380 7 -246 12 -38 -10 527 -163 145 125 19 247 -227 -108 102 -119 15 280 -289 67 399
2625 399 -225 98 106 -85 261 53 12 88 -136 -97 209 -20 32 158 -289 12 199 -93 247 16 -255 -19
2647 -19 -4 -6 257 19 136 256 -51 290 122 -265 -259 57 -333 -13 -210 -243 288 -252 -139 287 -254 69
2669 69 -204 135 -32 109 -51 158 -91 -331 164 -97 -32 79 -8 148 114 -98 359 -53 -337 199 -199
2690 -199 -97 320 166 290 323 -15 -107 -123 -146 -70 95 -147 15 34 -41 170 -214 83 -124 -139 89 61 -10
2713 -10 249 -107 8 431 275 250 326 -157 -31 310 -52 50 -127 32 -85 157 223 165 158 79 33 -172 7
2736 7 -22 -131 -15 -43 -12 48 -214 148 139 -324 116 139 -21 25 8 -490 40 -176 -158 8 -184 101 107 31 14
2761 14 25 -331 401 84 -92 278 -86 -150 64 -171 66 224 -92 -152 90 -161 104 -87 116 183 -121 -70
2783 -70 181 128 225 140 -103 -110 225 24 81 -220 46 30 -254 -90 -53 -220 -12 148 -86 -113 17 64 144 74
2807 74 1 48 -153 29 -184 -151 92 37 -325 -243 111 -403 -83 -83 60 194 66 80 -12 108 -156 397 -189
2830 -189 144 180 -15 128 232 -191 211 99 84 0 -104 79 74 -100 204 65 -153 295 -48 -34 27 26 41
2853 41 -25 -41 151 198 -186 -73 229 -143 -27 105 40 187 178 -261 96 -54 96 148 -33 35 -109 -200 -39
2876 -39 4 -127 43 -135 145 -97 -344 -129 70 50 210 333 -155 48 101 172 243 -101 -309 175 130 -94
2898 -94 -140 -116 190 18 -277 26 114 -185 123 -131 -129 34 -31 -41 -223 77 -36 -20 -107 352 158 -223 68
2921 68 -49 -146 268 -188 244 -178 -200 252 24 -183 90 -124 -49 335 161 -172 148 -71 114 173 -83 -145
2943 -145 36 28 127 -16 -243 413 85 103 134 -152 80 -150 -128 7 -65 -21 92 -67 -78 74 -151 87 133
2966 133 -242 160 -126 -157 -123 133 -71 215 33 -182 302 20 -148 -90 -293 52 74 -103 292 -23 -65 200
2988 200 -74 -102 327 52 222 57 -221 -63 -109 55 62 51 -30 297 35 -106 156 -54 239 167 -172 95
3010 95 -191 -24 239 95 20 -103 118 189 16 23 39 500 1 59 -403 -392 215 171 -21 -86 -174 -29 196 -245
3034 -245 -126 -189 94 360 -55 -190 29 -136 -224 53 -172 -108 123 -225 8 -169 -10 32 76 -424 383 120
3056 120 -102 419 -344 -8 -22 -22 -76 50 -87 61 -118 -398 274 -70 187 -44 -147 -260 106 -43 15 -83
3078 -83 -19 317 355 -226 202 29 54 308 -180 -66 2 341 170 140 73 38 -168 -32 21 -114 -142 111 11
3101 11 -3 213 -194 118 17 -299 140 111 -38 164 248 20 240 -54 -294 297 -112 246 102 -57 108
3122 108 -83 106 475 -131 -219 70 -112 14 54 -117 176 168 -146 115 -25 -12 131 70 190 -40 -254 -339
3144 -339 -41 -21 -210 -213 -120 211 -169 -390 74 76 29 71 -106 -208 258 -57 138 250 -127 96 -8 161 145
3167 145 49 -164 165 231 74 138 -162 31 83 -92 86 93 178 104 -26 7 -9 -5 48 204 -214 -137 261 -119 83
3192 83 100 6 57 154 -37 -110 -323 -40 219 -49 197 -40 -301 83 -71 -189 221 -137 91 310 -361 25
3214 25 224 -125 127 -286 -194 165 38 71 97 -256 -8 -149 -35 -36 267 39 132 -156 -99 133 -263 -172 222
3237 222 -99 -136 -92 15 -123 60 -325 23 -270 -248 -65 -70 -167 319 -247 -13 205 -134 37 19 -204 331
3259 331 24 -60 201 172 238 109 33 -192 44 -160 8 -104 -136 -55 -146 -159 -7 48 54 61 -87 207 74 47 5
3284 5 -107 -143 34 -190 -190 197 -174 -90 -67 161 96 80 -341 84 167 -305 -88 44 -45 296 -134 -9 114 -234
3308 -234 5 -228 -103 286 -44 -146 99 -21 12 214 -165 120 -59 4 236 105 3 154 377 -344 138
3329 138 -18 -208 95 -7 149 107 -499 -166 33 -243 62 169 73 79 -338 -142 299 -24 142 -102 -81 123
3351 123 120 -277 137 -387 -135 144 -40 91 159 -117 261 141 -190 6 -63 -257 220 93 -102 138 77 32
3373 32 60 -262 -188 113 -188 46 133 -121 340 -2 -47 42 -63 90 -2 -115 35 -108 188 18 -156 -139 215
3396 215 -81 -312 -48 -118 -37 239 -80 -214 182 -126 -40 -196 6 259 -96 -225 -43 -147 -112 313 -90
3417 -90 81 -25 -62 281 -228 -94 -85 171 166 -89 -162 -7 -230 78 172 80 -182 231 82 11 89 -94 37 -51
3441 -51 96 -83 -19 -31 254 71 198 125 -41 -286 110 -102 94 158 -270 281 6 -150 32 34 -86 178
3463 178 -102 146 311 -128 -106 31 -245 -73 0 -316 193 51 -181 405 -66 199 -158 38 -317 0 -48
3484 -48 52 148 -254 184 97 -127 -24 -212 40 422 16 165 56 -209 93 370 -6 -149 84 -174 179
3505 179 154 -128 262 -388 -121 -140 131 189 -185 -267 30 154 166 306 -194 8 383 -136 64 427 142 58
3527 58 182 -208 231 11 -24 113 -227 163 -37 -44 82 -69 68 47 -137 16 -72 -229 -25 210 99 39
3549 39 238 -173 -51 124 -280 -31 30 -64 58 309 -343 127 -13 24 76 -28 -167 -58 -194 7 -159 -151
3571 -151 261 32 -178 245 154 -22 157 203 112 -99 169 183 -26 -101 83 -16 131 -9 -342 95 224 -61
3593 -61 142 -137 -21 -6 -42 1 6 -173 -393 42 -76 -62 -152 -53 297 -35 -21 -121 -111 -175 -175 67 -135 123 15
3618 15 -161 147 134 170 87 24 362 112 -232 428 -274 178 81 -207 21 -91 134 296 194 -125 206 118
3640 118 -31 -15 48 -197 8 -149 121 90 -9 -146 37 -110 125 260 -58 2 -132 76 165 -95 64 -27
3662 -27 -58 142 -150 -202 -288 139 197 120 11 28 160 -4 72 361 156 199 -35 16 -74 281 91 47 -13 -196
3686 -196 38 -53 137 -60 -219 -144 -181 15 85 -21 -152 -29 -180 -230 -252 -172 -96 -80 156 190 143 19 -80 -48
3710 -48 45 -16 -197 -330 122 -389 185 67 -301 36 -381 152 28 121 100 64 61 -38 24 -191 -206 54 -274 -8
3734 -8 -52 -105 -32 -99 167 19 -108 -86 188 -229 2 113 23 -95 218 -50 99 -13 -260 61 -74 18 14 -72
3758 -72 2 280 -84 108 -99 98 193 68 27 -181 -195 62 153 -260 -119 79 -92 -167 -19 -124 186 -236
3780 -236 310 79 -298 -35 -177 83 146 72 -301 73 -264 28 136 20 188 251 26 -100 304 -125 94
3801 94 -268 -81 -54 136 22 17 -84 64 278 -57 -46 186 -246 -59 -73 -55 61 -24 -236 -108 168 -211 162
3824 162 -226 174 164 -80 181 265 -44 -94 146 54 -7 -133 142 62 -93 -69 168 10 106 135 -68 -67 54 -22
3848 -22 -74 215 115 358 138 -221 262 -119 -1 47 -99 -55 175 147 448 73 -10 124 215 -176 -52 -31 -82
3871 -82 -9 -185 -71 -24 32 -197 -45 104 -222 191 -10 20 44 -14 215 -183 52 -65 -3 -2 36 42 -155 -191 -165
3896 -165 104 28 4 -86 177 126 379 177 -20 -75 33 48 -60 181 -7 -206 224 154 -196 117 145 209 189
3919 189 -164 31 29 -203 9 -191 126 -76 53 -224 125 -48 171 105 -45 74 10 -184 255 165 -240 173
3941 173 -91 77 -122 -31 142 -240 61 123 50 -73 152 -290 130 196 -44 284 223 5 -200 10 82 45
3963 45 -206 -146 80 191 148 201 -94 19 -77 42 77 114 -115 -28 77 123 129 -91 -191 -24 -8 -234 93 78
3987 78 414 148 -179 -87 -97 -87 -5 36 29 -10 -28 -155 12 -119 183 -108 -34 -36 -76 -28 -59 -23 206 132 -111 -27
4013 -27 19 104 -97 -249 22 -26 -127 -431 -173 187 50 -65 -149 -191 153 266 -41 -74 -62 89 -58 -222 137
4036 137 71 -221 -94 -100 260 448 49 27 294 -413 -38 -57 -189 -44 22 -262 -150 -16 -98 36 -85 -46 -3
4059 -3 99 -201 -189 134 327 87 43 -58 -222 -220 98 -84 -102 274 62 157 -120 -180 -127 6 -97 60 -120
4082 -120 -81 424 -127 -65 138 25 130 -21 74 188 -35 243 47 61 298 -338 -114 -14 -119 4 -143
4103 -143 -38 25 -121 -54 150 -192 -185 -126 268 27 -8 155 -83 -65 -149 -233 52 -167 110 -11 92 -44 158
4126 158 94 29 187 -135 56 -85 155 139 -55 65 332 -106 306 54 -62 158 -38 -140 88 28 -242
4147 -242 -111 150 -50 198 -31 280 146 130 217 79 -164 -30 -63 -86 95 180 95 285 -39 179 140 -223
4169 -223 185 112 -127 60 -182 -79 122 -212 -184 -52 -164 261 -70 -215 61 205 -123 26 147 105 129
4190 129 -276 16 6 206 107 102 -16 -37 -19 95 285 233 55 135 144 -5 -10 -228 225 35 140 -112 -22 45 226
4215 226 189 173 213 229 227 58 104 -95 -328 -260 -167 -62 95 6 -281 -113 196 63 102 155 -116 -296 -173 362
4239 362 -226 225 84 155 -86 -103 145 -1 -166 182 211 -160 97 -131 54 -132 16 238 -147 168 -57
4260 -57 -8 52 148 115 177 178 -330 227 -27 -150 71 -366 7 63 -324 -226 -26 -185 -194 30 -203 4 141 -55
4284 -55 14 -257 -134 31 -55 110 -73 42 -91 -79 5 -42 -145 149 92 -217 -121 198 142 128 -31 3 144 133
4308 133 23 76 169 205 76 -91 -25 171 11 -65 -1 31 212 -16 -165 1 -50 -20 -106 143 -283 10 -141
4331 -141 -100 4 -183 13 19 -33 -37 241 -230 27 52 168 266 -155 -184 171 -107 120 29 87 -81 -182 19 -8
4355 -8 67 -60 265 -206 126 -345 198 44 196 -99 180 -29 -146 62 -144 -9 254 181 101 -2 -18 183
4377 183 -107 -139 33 92 56 259 81 -86 60 -282 18 144 -169 76 -26 -163 40 -256 179 112 74 -29
4399 -29 -165 -13 43 24 83 295 174 -372 26 -54 -103 124 -66 221 -187 -89 165 24 -38 108 -55 -206 16
4422 16 -99 272 125 -175 -177 105 273 19 16 -222 29 -305 -102 165 -26 -74 125 52 -161 -59 -23 167 32
4445 32 -167 16 125 -32 -54 33 21 205 -26 169 -74 17 83 121 -91 -83 -96 -11 51 -130 395 293 82 -84
4469 -84 4 -92 191 -133 -173 -171 -116 -204 -328 23 -196 96 90 -84 46 -29 -243 199 -5 79 -7 -131 64 -13 215
4494 215 -187 -50 -2 125 -446 -18 -25 -80 -147 -329 84 161 -118 -42 -85 113 -125 80 86 142 -71 205 65 -14
4518 -14 71 424 -27 -49 -24 -231 46 -95 -30 84 263 99 -111 -131 227 138 -23 43 119 144 -167 85 297
4541 297 50 -225 221 20 -133 92 8 -106 -137 156 1 73 225 -114 252 91 58 -11 -127 196 69 -136
4563 -136 -114 -195 8 -42 -216 91 -43 -45 -257 37 23 -142 2 356 -45 9 19 388 -42 -258 201 160 -136
4586 -136 347 201 -185 -34 -200 10 120 -298 142 -92 28 94 32 66 -38 -35 183 -77 -139 61 -59 46
4608 46 -307 -138 -46 10 118 468 251 -94 10 252 -125 -49 145 -26 365 -167 -88 224 -184 -73 -30 -58
4630 -58 -139 151 1 71 -53 -74 5 -77 -27 -177 50 -9 47 -245 -90 123 -62 -40 43 18 -231 68 -239 27
4654 27 -125 -9 -118 226 22 180 82 -135 59 78 118 -35 -93 14 197 176 181 -177 -109 -39 -134 264 160 -219
4678 -219 71 -131 -47 -16 -167 143 298 -212 -219 -69 235 80 101 -13 -141 -194 71 51 -87 59 264 83
4700 83 -133 -134 -198 112 -179 -161 177 66 28 51 -42 45 29 -219 -45 212 -10 -168 228 -184 -163 59 -139 -54
4724 -54 7 -168 205 -8 234 79 -95 368 151 -277 202 9 -221 94 52 126 258 -103 209 106 62 -6
4746 -6 62 153 134 -34 -77 45 -352 -22 -157 -306 -35 366 13 -154 72 205 61 14 -39 -56 -76 -157 6 -177
4770 -177 -9 -180 133 -101 -13 -114 23 -183 -81 119 -54 -144 -172 -314 1 -122 -279 15 141 112 -42
4791 -42 180 -149 167 2 241 -3 90 113 -188 -133 91 -27 120 233 -78 -1 71 -150 -193 -41 -61 69 226
4814 226 257 -134 -210 -256 158 -74 -142 161 152 80 255 -315 83 164 -30 5 -41 -12 143 36 -446 -209 34 -25
4838 -25 46 -379 -52 -10 -482 383 -111 73 296 -5 -55 118 -96 10 50 2 130 -204 -68 -9 -190 -164 -207
4861 -207 54 63 -35 -128 -145 77 -302 24 -25 -45 167 -125 143 178 105 -266 26 -21 99 -202 -255 -129 245 -86
4885 -86 -55 162 -40 332 -422 119 -108 -20 41 63 39 76 32 -76 -306 -17 -13 -49 -134 -71 -87 -297 -25 86 -341
4910 -341 209 23 -14 -65 -24 -189 -7 -109 -133 73 -30 228 204 -52 -216 78 136 122 29 -56 -45 -127 250 188
4934 188 46 77 -307 -138 158 -36 148 -39 -41 -41 228 -58 6 121 -195 -49 -73 -152 217 -93 3 43 -9 -248
4958 -248 7 -133 -93 246 -26 -122 -88 242 -106 -56 17 213 -77 -58 181 -231 21 110 -136 163 -316 176
4980 176 -41 45 -91 361 -9 181 191 -1 19 -8 101 -18 -138 -363 415 55 -117 193 -14 35 64 -84
5002 -84 -22 25 -290 248 413 16 -138 -93 -271 219 -87 -70 189 -227 204 64 -86 90 -76 88 52 -100
5024 -100 108 -47 68 69 111 20 -144 -118 -37 69 -120 -360 -83 -52 54 -258 84 92 87 -21 -57 -81 17 -81 18
5049 18 -30 61 -71 -94 -6 -38 -232 32 44 310 209 22 -80 112 149 105 67 88 337 -59 -125 299 81 55
5073 55 66 101 170 -203 -112 -74 -46 94 45 356 55 -42 -212 87 91 -15 -203 -68 162 12 19 103 -74 -192 -4
5098 -4 66 240 21 -88 -74 -40 -112 69 -97 63 -19 -21 -32 -267 -70 -71 213 31 35 125 -4 -48 54 76 21 -53
5124 -53 66 15 347 -223 1 -343 -148 -90 7 -103 190 -425 -30 158 17 158 -99 121 191 -40 -46 -219
5146 -219 -187 -122 260 -38 -207 79 -145 128 -16 48 219 -159 -26 263 56 -169 -71 -219 67 -31 -150 -155
5168 -155 2 -2 -195 90 76 -255 -89 164 -173 60 15 180 -45 151 56 -124 -34 -151 82 -50 -44 105 501
5191 501 -20 -71 35 -208 -235 187 12 52 177 140 231 69 145 -4 -196 66 80 -213 -184 -81 71 46 78
5214 78 -293 127 131 -408 124 172 -191 -124 -220 55 -6 212 62 216 -245 59 -60 -147 -21 146 162 -53 17
5237 17 77 -293 -83 159 -28 -52 20 -165 -109 -28 -193 167 178 85 -157 294 211 222 -55 203 -118 -249 -93
5260 -93 -368 11 -74 -94 103 -13 -110 -150 -103 -11 -7 3 287 0 96 124 96 66 104 -138 -106 -55 209 169 106 -147
5286 -147 -114 -186 24 -140 -18 133 26 23 98 -263 194 -144 34 317 49 -92 214 -118 -51 240 -176 74
5308 74 -194 61 185 -106 19 -58 -57 110 100 68 50 -100 28 209 116 -165 -1 65 213 -72 -394 319 45
5331 45 -175 -96 11 -349 -111 12 108 -136 193 -132 -73 15 -8 -42 42 -325 255 20 -88 21 100 -122 204
5354 204 -46 47 -63 -70 -59 -139 186 -191 -209 -90 88 49 0 -205 -147 -118 -263 147 378 138 74 -98 -149 -141 -104
5379 -104 -66 -189 98 -75 189 -80 -58 0 -154 9 4 44 21 179 -130 332 -6 188 -111 -334 -161 -21
5401 -21 -77 120 2 63 -73 2 -93 5 225 -154 -181 43 -106 -112 -134 5 66 5 29 288 -8 193 217 -91 128
5426 128 -53 -155 -181 -13 -84 154 16 0 -428 137 118 54 -68 -36 28 155 143 80 0 15 -2 183 181 189 45
5451 45 -94 148 -7 20 -78 -111 261 -57 -119 -23 90 -39 -134 -289 -416 -29 -196 29 -217 105 -78 119
5473 119 23 42 -70 -22 43 19 -146 -170 8 83 25 228 -112 -321 -99 -236 -60 131 -104 38 23 -192 91
5496 91 -61 -105 147 254 -12 78 -176 -18 85 -246 144 225 -8 -379 61 -42 -139 53 79 -8 -102 -31 166
5519 166 -1 63 234 13 17 -515 -5 -193 -91 52 123 -24 297 175 -27 74 -46 8 -70 -66 -10 145 217
5542 217 69 -114 -115 -75 -164 255 28 -196 11 -81 24 188 104 174 210 141 68 -22 82 -229 318 -8 -92 -26
5566 -26 -258 308 -83 85 -77 -60 -134 38 -13 -45 192 -17 138 -190 -38 211 23 -127 -69 -7 -188 87
5588 87 -24 140 338 115 99 -36 154 104 -2 141 -306 211 -140 -156 252 95 18 -66 59 56 204 139 -128
5611 -128 -91 -20 -251 -253 33 -110 6 142 -152 -12 -62 72 235 -133 59 -85 -111 -17 -128 -65 -112 -282 -30
5634 -30 117 54 32 172 -235 -76 159 135 -182 122 9 -293 152 -60 5 -48 123 -235 -136 -354 53 -189
5656 -189 -133 15 -180 157 119 223 33 -76 27 85 13 -70 91 233 148 -115 -2 -94 76 -92 101 -277
5678 -277 16 -215 -106 -84 58 -8 -373 -10 17 152 -118 -179 -13 -84 -27 133 64 143 36 52 139 -270 26
5701 26 38 -25 216 -33 -75 173 -115 -55 -127 -128 -11 206 135 -79 -101 -31 -359 22 -45 6 52 -79 3 -40 21 -327
5727 -327 -97 -193 116 0 -94 -59 -23 -183 21 202 -30 -50 69 -248 -57 92 45 -142 -134 7 -223 97 149
5750 149 101 37 -55 -89 -74 151 40 271 -45 -34 -77 197 25 32 11 -142 -59 128 343 80 -68 173 6 -99
5774 -99 228 -8 492 -121 20 -73 35 70 64 101 -190 171 60 290 49 120 -236 26 -113 251 14 279
5796 279 -285 0 -42 365 -22 -139 -39 -164 2 -104 -94 -42 -86 238 276 -133 146 -63 -22 -241 141 60
5818 60 -81 136 194 -5 187 -268 -195 -4 -35 73 175 -238 -120 -140 -61 -150 -188 -139 -135 -194 -60 -83 -125 39 39
5843 39 103 253 71 174 392 248 -202 -107 155 250 47 -125 216 207 -143 242 -5 -4 362 67 244 368 -21
5866 -21 57 28 118 -104 -57 191 271 -525 -3 -100 -98 -246 -254 -110 -3 143 123 247 -60 -373 -112 46 77 53 -89
5891 -89 -27 -185 -285 139 19 173 72 20 185 21 -266 -24 -52 35 -111 -6 -192 190 46 -78 281 -295
5913 -295 -8 44 14 81 196 -142 74 -73 38 -105 165 54 -175 41 -236 199 101 79 152 -127 118 231
5935 231 -44 -257 -233 93 -9 110 170 51 -81 243 170 55 -69 6 -206 -34 241 -74 -62 46 51 0 150
5958 150 56 -26 114 191 18 -237 253 -70 134 291 43 -68 -19 -155 107 -3 142 -64 -203 42 -135
5979 -135 -64 -100 45 26 -47 220 -275 -128 1 252 243 189 -127 100 -45 100 -4 58 12 94 -2 3 195 -132
6003 -132 139 236 -24 -28 92 -100 -85 -34 -48 -28 12 19 -169 142 134 133 -195 99 9 -14 40 29 5 150 47 57 -140
6030 -140 -76 -127 -374 -105 67 117 -185 288 -133 -45 110 -16 83 92 -47 2 85 45 56 25 126 -88 -28 192
6054 192 -147 -84 170 273 -29 182 -2 18 -19 71 -153 3 112 -185 -242 111 16 -88 -70 135 114 138 14
6077 14 4 -215 72 -95 79 59 229 -32 167 -20 17 -85 53 89 -351 127 -220 -153 -141 129 47 52 -181
6100 -181 -36 -105 92 49 -73 -120 -130 -130 90 271 208 257 167 131 -147 -352 -34 26 -156 177 -133 40 126 56
6124 56 -115 58 11 20 0 -199 -138 110 -27 -95 119 -60 169 29 53 23 59 46 -93 -3 -48 96 -60 230
6148 230 144 -144 83 -79 124 77 85 -165 -288 255 126 -80 85 -136 -117 15 1 165 75 45 51 272 -4
6171 -4 89 -103 -419 -377 -73 173 -79 -292 27 385 57 -183 101 -316 64 -200 -144 24 174 -22 -246 -7
6193 -7 67 85 169 184 134 18 -186 -202 40 -54 125 137 -58 232 -3 -251 201 -131 406 -114 227 161 -100 165
6217 165 307 256 98 352 -61 248 -21 -108 18 129 166 83 -106 169 35 -131 -42 49 -46 -10 179 -113 17
6240 17 -180 10 -88 291 -11 -83 64 -94 -150 99 124 20 150 27 22 114 -61 193 125 154 88 164 51 147
6264 147 325 18 102 -217 67 -2 -342 -45 356 -34 179 55 263 216 -399 -181 -56 170 -66 45 -225
6285 -225 -248 14 -1 176 -28 -203 186 -1 131 273 -76 -92 -73 -51 -77 4 -36 -3 -98 -16 60 253 92 53
6309 53 241 71 273 -68 -153 104 89 129 -37 -298 140 96 -112 -41 -57 -21 -146 31 -43 -58 -13 138 -198 -413
6333 -413 163 -166 71 -134 -130 -45 111 -174 -64 2 -148 72 366 162 137 -131 -228 -50 -16 -237 13 -81 16
6356 16 192 -174 -206 156 -44 -100 77 -184 -198 3 -32 153 57 -74 124 -124 -67 71 -125 -150 106 54 4
6379 4 -88 -17 34 51 -41 3 71 46 157 159 -62 23 -148 -60 7 -1 -1 -73 -203 253 -108 -57 -109 -217 82 -7 -114 -319
6407 -319 389 82 33 -101 78 92 -386 116 -5 152 -111 125 188 -1 208 -265 52 110 75 -121 116 87
6429 87 -78 -136 52 -179 -96 -60 32 -124 -30 -208 14 -97 14 101 -192 -13 7 36 11 -172 123 261 162 -306
6453 -306 -16 219 -13 -35 -91 -82 -125 141 -19 174 58 196 -114 -109 327 186 -45 -170 17 126 67 290 -251
6476 -251 35 85 -111 -95 -14 -200 -36 146 95 8 15 108 -123 -2 173 -41 -61 -7 185 19 85 34 -126 -81
6500 -81 -33 -204 -282 50 144 12 58 29 -14 139 -58 -143 213 -42 107 55 23 184 347 -258 -234 -178 106 -128
6524 -128 77 48 244 -6 -98 44 160 66 89 81 -3 177 -20 -21 -6 -118 203 198 104 -145 -106 -1 277 -172 339
6549 339 144 58 87 -35 -65 -36 170 49 64 156 -68 -3 169 -145 -240 119 92 217 114 48 -165 -81 -44 -80
6573 -80 236 -69 10 12 -79 -40 30 58 15 -35 -287 91 -141 -94 254 -2 -102 108 52 2 75 428 64 -15 121
6598 121 20 98 -159 -122 -97 27 73 -59 -258 79 -67 -276 -39 -13 103 -1 -68 85 374 -221 -76 -85 -126
6621 -126 79 -2 220 -107 89 -44 -74 -98 -81 -161 115 258 -52 -148 -123 198 155 -66 -355 174 53 -187 -276
6644 -276 -124 -318 11 -135 -253 107 -113 -138 154 202 -24 232 257 169 7 32 -131 36 -205 117 -7 153
6666 153 -41 -245 -126 191 101 44 20 -159 170 -68 285 136 -199 26 52 101 67 -9 93 -155 244 83
6688 83 155 -330 20 137 -148 -37 143 92 -97 26 61 36 -87 193 -112 54 88 13 -55 303 47 -181 68
6711 68 -57 -26 158 171 29 99 -14 212 197 124 -60 113 42 118 -18 199 377 318 -187 -303 100 80 -19 -4
6735 -4 -292 135 -243 -96 -67 193 -28 138 258 -313 -147 82 -4 96 -149 165 -220 -115 -305 -311 14 154
6757 154 -100 -113 -79 -354 10 87 90 -53 33 -28 89 213 19 -3 -18 -45 -12 83 -209 0 122 -131 162 51
6781 51 -171 152 19 157 21 -206 -94 -95 -71 178 226 22 -11 -3 254 6 11 -74 -57 -232 -12 135 60 -19 -41
6806 -41 -3 -9 -55 -98 84 65 223 -33 -60 -267 161 45 -9 -69 -91 116 112 12 25 -89 148 33 -152 -69 -91
6831 -91 28 86 -135 126 64 -29 201 -145 -41 312 -247 124 287 70 -24 73 53 -29 -153 -246 -172 -5 -97 -108
6855 -108 -186 55 28 84 -79 -167 50 -259 156 -202 65 286 -156 -10 87 -49 -166 -87 8 129 44 -106 -13
6878 -13 171 -165 79 178 15 98 -58 138 -103 261 -148 223 80 -161 91 163 -10 -277 169 -73 -96 116
6900 116 47 -37 60 -32 6 -117 333 -65 103 -69 38 40 -213 -272 1 8 -105 66 -87 33 158 -46 -186
6923 -186 -40 23 226 125 201 97 50 -70 218 -113 -135 222 58 149 -59 10 -68 -183 8 -232 155 141 -69
6946 -69 8 243 -165 11 -547 400 82 -353 196 70 -106 -106 -1 -108 195 76 43 0 -15 -259 210 -140
6968 -140 -345 244 15 -3 92 10 -124 -122 -68 -114 -70 150 -43 -115 174 138 17 -193 -251 -48 51 15 -208 53
6992 53 -153 54 115 35 -71 14 -109 33 102 -68 113 -180 103 180 -59 -20 393 128 51 116 222 41 -182
7015 -182 32 47 7 113 -74 106 77 59 -219 56 -91 -86 133 69 -36 22 173 -20 12 267 76 -49 -46 24
7039 24 -226 32 151 148 169 -180 174 -151 147 49 -316 -184 18 -231 -48 299 -29 75 98 -36 36 131 -394
7062 -394 -2 53 -42 -217 -57 -71 -179 4 -61 1 160 164 -306 -181 -2 -37 46 -279 88 41 117 -52 86 11
7086 11 -90 35 0 37 9 -92 -232 -1 123 -26 34 12 -97 -69 190 -219 -174 -48 146 -247 58 -42 -135
7109 -135 -97 53 390 -100 -70 -57 81 -159 100 105 -139 -149 69 -205 124 -296 85 46 -124 -19 -12 -155 197
7132 197 -127 -256 -202 62 166 99 70 -151 105 -94 -7 108 -60 33 15 16 16 156 -21 35 206 0 194 201
7156 201 11 109 -191 -204 -76 157 -268 -196 3 -195 106 -90 -33 158 -108 32 6 -57 282 1 -132 228
7178 228 120 0 -1 144 68 230 199 -29 21 236 14 198 -158 175 -33 -237 -313 143 131 -100 -63 -69 46
7201 46 16 48 -199 -102 -85 127 -60 -48 -2 230 -110 131 153 -103 310 90 231 164 16 -186 -3 -305 53
7224 53 -38 -32 138 106 -406 38 -21 44 -262 -46 -82 -161 -100 146 99 41 62 138 155 124 209 -53 -234 -73 70 -8
7250 -8 178 -20 -60 124 -52 -86 158 -146 -207 334 92 -49 120 -205 217 -151 -196 -301 80 -46 -15 128
7272 128 -97 63 29 -218 144 -153 -37 172 101 -79 -122 111 -60 -24 -75 173 8 100 -288 24 24 20 -200
7295 -200 70 -200 26 -73 380 101 -205 -157 -57 -135 149 149 18 171 -46 -6 283 105 94 212 196 -14 -158
7318 -158 -92 -6 -43 -162 -2 395 163 113 -239 96 -89 -171 -106 -49 56 -211 145 -251 71 -87 148 -189
7340 -189 242 10 160 155 -70 78 -166 -28 -104 85 -145 87 236 142 137 -111 322 49 -72 54 260 66
7362 66 114 -233 -45 277 178 -33 -7 -229 -59 246 -178 -170 190 48 101 189 -43 79 78 155 -120 -2 31 -222
7386 -222 -146 -57 -8 297 -66 163 -64 146 218 197 -83 32 -8 10 57 22 123 156 65 184 -88 -155 -113 -89 -74
7411 -74 -22 3 -46 117 -67 -192 -196 -83 91 -40 -4 -98 39 -298 -48 161 147 191 42 226 -185 76 44 -13
7435 -13 115 14 -177 37 -43 54 4 -21 113 27 -2 -129 -65 110 -350 217 -191 -82 -189 -260 303 -269 30
7458 30 105 106 227 -260 -116 -93 -160 -93 -68 215 -8 59 54 308 44 -94 -65 -248 -41 -106 -290 -2 100 265
7482 265 -202 -82 -139 -10 144 200 -33 97 -113 184 57 -166 142 26 9 -111 -180 213 -32 -49 331 -62
7504 -62 -75 -10 36 -51 96 -53 -70 446 -31 -96 -194 4 -74 -35 50 -268 -46 -57 -69 -130 -66 25 -83 -15 289 -378
7530 -378 23 -121 -76 157 236 -103 47 -156 -37 -34 -195 184 -71 -124 127 -167 -152 54 47 -138 -368 130 2
7553 2 -291 -2 59 -197 -230 32 -10 109 227 -226 172 381 25 141 185 149 201 -121 116 39 125 -216 -92
7576 -92 -11 -22 57 -66 -81 -14 49 227 33 -66 79 -221 -136 107 -108 -121 54 -94 23 -176 169 -212 38
7599 38 148 -139 -130 -70 175 67 -231 158 180 28 -105 82 -192 56 -3 -168 150 -17 8 -50 -60 53 93
7622 93 179 75 -117 102 21 82 -72 14 38 -161 -88 -16 416 -140 259 54 -231 -75 -105 43 -94 112 54
7645 54 23 210 -29 -66 -59 -119 83 -82 150 26 -171 135 105 -169 168 -125 -51 402 -19 -145 66 -106 -30
7668 -30 55 20 96 -290 -156 -86 22 43 47 -220 144 -104 83 -28 64 4 248 -20 109 -50 25 134 5 14
7692 14 35 -165 -10 -18 -74 213 64 39 -2 170 -4 -39 -216 -58 79 19 -193 25 -169 -109 74 -10 -22 -34
7716 -34 -260 115 331 85 -42 -164 -203 85 16 18 491 -232 208 -285 53 -39 -8 346 -149 27 82 106 101 183
7740 183 51 155 -235 133 116 -42 -27 69 -154 68 -77 -258 32 -76 -67 -118 44 81 -23 89 -8 68 -265
7763 -265 3 34 162 -106 47 -52 -123 152 333 62 -28 117 -225 -99 123 1 -94 -161 -114 232 167 -22 -65
7786 -65 24 -31 35 189 150 54 -112 -31 54 80 118 -236 -41 -72 9 -50 121 -289 58 -150 -14 -30 -85 80 -142
7811 -142 138 -270 -51 -123 58 -136 -38 -37 -39 -28 21 -4 13 80 -84 93 48 -125 278 104 -118 99 27 107 -363
7836 -363 134 78 38 6 11 144 -164 -22 63 -250 92 -70 199 225 41 -131 1 -82 30 -97 -18 255 112
7859 112 251 -13 -262 22 94 51 -18 -108 4 -116 22 18 92 -3 3 -13 -170 11 -201 139 -209 -126 -44 -5 58
7884 58 -96 -109 -154 212 166 -15 235 235 -142 60 -134 -39 -31 151 31 80 86 -33 133 -87 138 137 77 -90 132
7909 132 55 -146 -17 4 -197 212 -88 -131 -244 -191 -189 79 -54 92 -225 86 93 -23 51 -115 -114 17 -195 -204
7933 -204 56 -329 114 -13 -215 -26 -154 -15 23 32 126 94 -169 -184 -2 26 118 -286 -226 167 -140 150 0
7956 0 163 -163 225 -185 96 11 -171 57 128 -54 177 -28 136 152 116 -35 -353 -9 286 -376 -177 67
7978 67 42 -56 82 -87 232 -27 -107 -108 100 86 35 -175 80 -117 -165 40 63 -29 65 31 -235 170 158 16 -66
8003 -66 75 94 315 -1 -6 -43 336 254 120 112 -133 98 -240 30 5 -133 -62 -43 -43 -39 98 33 242 -266 -149
8028 -149 97 213 164 13 -96 22 -114 -174 -58 12 -2 329 -159 -47 153 176 -304 -46 16 78 -234 -261 -88
8051 -88 -195 -100 -6 -227 -197 205 -226 -95 -79 -408 -7 277 -44 264 110 -309 175 23 1 159 -149 49
8073 49 244 67 220 -143 -109 -30 84 -34 -64 -120 -116 54 213 87 205 159 -35 194 -262 18 -27 -95 33
8096 33 191 -40 307 -17 -115 -139 59 187 -262 90 -202 52 107 143 -21 -198 148 -100 106 36 -156 169
8118 169 28 -9 181 136 -116 -185 -163 -155 -118 -302 -144 -243 -56 471 -4 -180 -44 -45 -136 211 46 -109 -165 -56
8142 -56 -9 13 -73 -221 26 -46 -99 -2 -51 -68 49 -280 197 7 -32 -81 81 27 -66 -92 86 54 62 -84 -91 190
8168 190 -167 32 -118 107 330 37 64 -293 -130 -150 419 -85 -64 166 -185 118 111 -195 110 -154 183 -72
8190 -72 -3
8191c
##END NTUPLES=NMR FID
##END=
