##TITLE=1H_DE-80H_X3
 200.13MHz, d2o
 8 sc
 
 19ns.26.2.2025
##JCAMPDX= 6.0         $$ Bruker NMR JCAMP-DX V2.0
##DATA TYPE= NMR FID
##DATA CLASS= NTUPLES
##ORIGIN= UXNMR, Bruker Analytische Messtechnik GmbH
##OWNER= pz
$$ XWIN-NMR		Version 3.5
$$ Fri Mar 28 11:43:43 2025 Russian Standard Time (UT+4h)  Yarkov@DPX200
##.OBSERVE FREQUENCY= 200.1313
##.OBSERVE NUCLEUS= ^1H
##.DELAY= (6, 6)
##.ACQUISITION MODE= SIMULTANEOUS
##.ACQUISITION SCHEME= undefined
##.AVERAGES= 8
##.DIGITISER RES= 18
##SPECTROMETER/DATA SYSTEM= spect
##.PULSE SEQUENCE= zg30
##.SOLVENT NAME= CDCl3
##.SHIFT REFERENCE= (INTERNAL, CDCl3, 0, 14.3821)
##AUDIT TRAIL= $$ (NUMBER, WHEN, WHO, WHERE, WHAT)
$$ ##TITLE= Audit trail, XWIN-NMR		Version 3.5
$$ ##JCAMPDX= 5.01
$$ ##ORIGIN= Bruker BioSpin GmbH
$$ ##OWNER= Yarkov
$$ C:/Bruker/XWIN-NMR/data/yarkov2/nmr/H-C/1/audita.txt
$$ ##AUDIT TRAIL=  $$ (NUMBER, WHEN, WHO, WHERE, WHAT)
(   1,<2025-03-28 11:42:26.76 +0400>,<Yarkov>,<DPX200>,
      <created by zg, POWCHK disabled, PULCHK disabled
       configuration hash MD5:
       00 E9 B6 7A A2 85 ED C7 34 08 36 98 17 FE 4E 26
       data hash MD5: 16K
       F8 D7 4D 9C 67 4D 8D D4 78 D0 F4 86 E3 90 40 37>)
$$ ##END=
$$ 
$$ hash MD5
$$ 23 B3 D3 1B 79 3E 91 16 5A AF 82 9D 7D CB 60 DE
##$RELAX= 
##$RELAX= 
##$RELAX= 
##$RELAX= 
##$RELAX= 
##$RELAX= 
$$ Bruker specific parameters
$$ --------------------------
##$DU= <C:/Bruker/XWIN-NMR>
##$EXPNO= 1
##$NAME= <H-C>
##$PROCNO= 1
##$TYPE= <nmr>
##$USER= <yarkov2>
##$AMP= (0..31)
100 100 100 100 100 100 100 100 100 100 100 100 100 100 100 100 100 100 
100 100 100 100 100 100 100 100 100 100 100 100 100 100 
##$AQSEQ= 0
##$AQ_mod= 1
##$AUNM= <au_zg>
##$AUTOPOS= <>
##$BF1= 200.13
##$BF2= 200.13
##$BF3= 200.13
##$BF4= 200.13
##$BF5= 200.13
##$BF6= 200.13
##$BF7= 200.13
##$BF8= 200.13
##$BYTORDA= 1
##$CFDGTYP= 0
##$CFRGTYP= 5
##$CHEMSTR= <none>
##$CNST= (0..31)
1 1 145 1 1 1 1 1 1 1 1 1 1 1 1 1 1 1 1 1 1 1 1 1 1 1 1 1 1 1 1 1 
##$CPDPRG= <>
##$CPDPRG1= <>
##$CPDPRG2= <>
##$CPDPRG3= <>
##$CPDPRG4= <mlev>
##$CPDPRG5= <mlev>
##$CPDPRG6= <mlev>
##$CPDPRG7= <mlev>
##$CPDPRG8= <mlev>
##$CPDPRGB= <>
##$CPDPRGT= <>
##$D= (0..31)
0 0.7 0 0 0 0 0 0 0 0 0 0.03 0 0 0 0 0 0 0 0 0 0 0 0 0 0 0 0 0 0 0 0 
##$DATE= 1743147746
##$DBL= (0..7)
120 120 120 120 120 120 120 120 
##$DBP= (0..7)
150 150 150 150 150 150 150 150 
##$DBP07= 0
##$DBPNAM0= <>
##$DBPNAM1= <>
##$DBPNAM2= <>
##$DBPNAM3= <>
##$DBPNAM4= <>
##$DBPNAM5= <>
##$DBPNAM6= <>
##$DBPNAM7= <>
##$DBPOAL= (0..7)
0.5 0.5 0.5 0.5 0.5 0.5 0.5 0.5 
##$DBPOFFS= (0..7)
0 0 0 0 0 0 0 0 
##$DE= 6
##$DECBNUC= <off>
##$DECIM= 32
##$DECNUC= <off>
##$DECSTAT= 4
##$DIGMOD= 1
##$DIGTYP= 9
##$DL= (0..7)
0 120 120 120 120 120 120 120 
##$DP= (0..7)
150 150 150 150 150 150 150 150 
##$DP07= 0
##$DPNAME0= <>
##$DPNAME1= <>
##$DPNAME2= <>
##$DPNAME3= <>
##$DPNAME4= <>
##$DPNAME5= <>
##$DPNAME6= <>
##$DPNAME7= <>
##$DPOAL= (0..7)
0.5 0.5 0.5 0.5 0.5 0.5 0.5 0.5 
##$DPOFFS= (0..7)
0 0 0 0 0 0 0 0 
##$DQDMODE= 0
##$DR= 18
##$DS= 0
$$ [...]
##$SUBNAM2= <"">
##$SUBNAM3= <"">
##$SUBNAM4= <"">
##$SUBNAM5= <"">
##$SUBNAM6= <"">
##$SUBNAM7= <"">
##$SUBNAM8= <"">
##$SUBNAM9= <"">
##$SW= 18.0517328524113
##$SWIBOX= (0..15)
0 0 2 0 0 0 0 0 0 0 0 0 0 0 0 0 
##$SW_h= 3612.71676300578
##$TD= 16384
##$TD0= 1
##$TE= 0
##$TE2= 300
##$TE3= 300
##$TEG= 300
##$TL= (0..7)
0 120 120 120 120 120 120 120 
##$TP= (0..7)
150 150 150 150 150 150 150 150 
##$TP07= 0
##$TPNAME0= <>
##$TPNAME1= <>
##$TPNAME2= <>
##$TPNAME3= <>
##$TPNAME4= <>
##$TPNAME5= <>
##$TPNAME6= <>
##$TPNAME7= <>
##$TPOAL= (0..7)
0.5 0.5 0.5 0.5 0.5 0.5 0.5 0.5 
##$TPOFFS= (0..7)
0 0 0 0 0 0 0 0 
##$TUNHIN= 0
##$TUNHOUT= 0
##$TUNXOUT= 0
##$USERA1= <user>
##$USERA2= <user>
##$USERA3= <user>
##$USERA4= <user>
##$USERA5= <user>
##$V9= 5
##$VALIST= <valist>
##$VCLIST= <CCCCCCCCCCCCCCC>
##$VD= 0
##$VDLIST= <DDDDDDDDDDDDDDD>
##$VPLIST= <PPPPPPPPPPPPPPP>
##$VTLIST= <TTTTTTTTTTTTTTT>
##$WBST= 1024
##$WBSW= 4
##$XGAIN= (0..3)
0 0 0 0 
##$XL= 0
##$YL= 0
##$YMAX_a= 206711
##$YMIN_a= -240214
##$ZGOPTNS= <>
##$ZL1= 120
##$ZL2= 120
##$ZL3= 120
##$ZL4= 120
##$ABSF1= 10
##$ABSF2= 0
##$ABSG= 5
##$ABSL= 3
##$ALPHA= 0
##$AQORDER= 0
##$ASSFAC= 0
##$ASSFACI= 0
##$ASSFACX= 0
##$ASSWID= 0
##$AUNMP= <proc_1d>
##$AZFE= 0.1
##$AZFW= 0.1
##$BCFW= 1
##$BC_mod= 2
##$BYTORDP= 1
##$COROFFS= 0
##$CY= 83.5205535888672
##$DATMOD= 1
##$DC= 2
##$DFILT= <>
##$DTYPP= 0
##$F1P= 10.8118882576601
##$F2P= -7.23987719738617
##$FCOR= 0.5
##$FTSIZE= 0
##$FT_mod= 4
##$GAMMA= 1
##$GB= 0.15
##$INTBC= 1
##$INTSCL= 1
##$ISEN= 128
##$LB= 0.25
##$LEV0= 0
##$LPBIN= 0
##$MAXI= 10000
##$MC2= 0
##$MEAN= 0
##$ME_mod= 0
##$MI= 1.114404
##$NCOEF= 0
##$NC_proc= 0
##$NLEV= 6
##$NOISF1= 3.799351
##$NOISF2= 2.8
##$NSP= 1
##$NTH_PI= 0
##$NZP= 0
##$OFFSET= 14.38212
##$PC= 1
##$PHC0= -1348.925
##$PHC1= 14.79224
##$PH_mod= 1
##$PKNL= yes
##$PPARMOD= 0
##$PSCAL= 0
##$PSIGN= 0
##$REVERSE= no
##$SF= 200.129724274929
##$SI= 16384
##$SIGF1= 3
##$SIGF2= 2
##$SINO= 400
##$SIOLD= 16384
##$SREGLST= <1H.CDCl3>
##$SSB= 0
##$STSI= 0
##$STSR= 0
##$SW_p= 3205.1282051282
##$SYMM= 0
##$S_DEV= 0
##$TDeff= 0
##$TDoff= 0
##$TI= <>
##$TILT= no
##$TM1= 0
##$TM2= 0
##$TOPLEV= 0
##$USERP1= <user>
##$USERP2= <user>
##$USERP3= <user>
##$USERP4= <user>
##$USERP5= <user>
##$WDW= 1
##$XDIM= 8192
##$YMAX_p= 0
##$YMIN_p= 0
$$ End of Bruker specific parameters
$$ ---------------------------------
##NTUPLES= NMR FID
##VAR_NAME=  TIME,          FID/REAL,        FID/IMAG
##SYMBOL=    X,             R,               I
##VAR_TYPE=  INDEPENDENT,   DEPENDENT,       DEPENDENT
##VAR_FORM=  AFFN,          ASDF,            ASDF
##VAR_DIM=   8192,          8192,            8192
##UNITS=     SECONDS,       ARBITRARY UNITS, ARBITRARY UNITS
##FACTOR=    0.0002768,     1,               1
##FIRST=     0,             0,               0
##LAST=      2.2672688,     0,               0
##MIN=       0,             -240214,         0
##MAX=       2.2672688,     206711,          0
$$ Real data points
##PAGE= N=1
##DATA TABLE= (X++(R..R)), XYDATA
$$ [...]
763d2J00l4r2J46j1o0q8PM1K9P7k9j03P5n0j03J02OJ08q8L1n5L1pL3q9J11M3J0
792I9j07po2O6P1r1N0M0q7O7p5N4j04Q5M6j55J24k4J70k78L7K0K8j6N9o5M1M3
820B9q8R5k0q7P7m8Q1r2O7j9n6J54j72N4M9O0p3n2K4J18m8k9Jk6k1J21j21O8r8
849e2M1Q5j63J49J9p8L5m0K3l2j5R5j47PJ52Rm0q8J2J0M2k4J05j27N0j9J9j6l0
878a8J17j17J5M4J9n5P7j08J09n7n9J7k2l2L0N3J6n1j12J30Jq3J05MoP5j03QK0
907A7n7K2M4j5q8O2q4J07J3q0M6O6k3M6N9k26O0L7m7jQ2j46O5J5OM3n7l3N2nm7
938f7J3J00r3Q4j24J46k3k6p7J97j49L0r5R1L5q7K23j62j9NJ34k21J47o4k3j02
964a27K2J45j01J00j1O3k14J29j29J69j3o1N1n9R6l5nj58R0o1J21J0o6L9l8J38
$$ y = [-42, 58, 24, -68, 78, 67, 7, -81, -74, -33, -4, 73, 44, -59, 16, -34, -137, -35, -29, 79, -9, 22, -33, -2, -9, 24, -65, 46, 89, 99, -8, -15, -77, -11, 60, -31, 19, 59, -28, 39, -36, 18, -86, -1, 45, -110, 14, -10, 160, -118, -81, -61, -33, -49, 10, -55, -14, 29, -59, 36, 16, -71, 6, -42, 39, -53, 14, -5, -61, 93, -79, -25, 24, 84, 11, -41, -17, 101, 53, 24, 25, -1, -22, 99, -22, 46, -52, -11, 74, -89, 60, 79, 1, 36, -4, 19, -13, -28, 67, -80, -73, 79, 88, 48, -40, -28, -18, 24, 0, 105, -22, 28, 9, 28, 12, -18, 99, -18, -3, 41, 60, 5, 82, -26, 83, 26, -33, -16, -38, -70, -40, 13, 29, -22, -134, -4, -3, -86, 19, 23, 17, 92, -11, -3, 17, -40, -18, 26, 11, -77, -15, -99, 8, 21, -59, -13, 53, 30, 76, 135, -91, -31, 6, -41, -42, 40, -106, -41, -26, -20, 23, -34, -67, -15, -20, -67, -54, 46, -47, 37, -87, 59, 36, 10, -67, 130, -19, 11, -84, 7, 42, -45, 178, 16, -3, 2, 136, -85, 62, -2, -25, -127, -105, 40, -61, 39, 28, 91, -123, 6, -123, 46, 33, -28, 23, -36, 60, 25, 20, -138, -48, -109, 12, 22, -44, -5, -43, 95]
990I5q8k4K3l3P2J9n1r4%N4J38k5j27J27j69J29n4K0p7N4j07R0K5K4q8M8R1j23
1018e1J6p2J64j45P1J7J6J33q7o1q5P9k6P0j63J07j1j05J32j0lMj09R2pj0j0J36
1046H2p8N2p7N8n5Q6j20l1J51n1r0O6o0Mpk7M6N6l7J6J02m1rj32O5L5Q9k0j01
1075b8rL4o2J1M5j6J08j7j22R2j7N7j90J16J27j62R6j02P7M6o3M0j24J05L9j55
1101g4J60m0j9n6nL2n8J14n1K0j2l4J2J5N6m2n8P4m0Rk0L8J04j50M8j8K7j71J48
1130Ij3kqJ08j1m6j7j5q0J36n2K0J5n9M2m8m8O0P4j56n4K45j08%J45j93kL0O8
1159D0O8j27J0L8j37K01m9j40P6J1O7j10J03j35J36j08Q6K6o5n1J23o8J05n3J3
1184F0q3m5M6o2N0J4M1n9M0M2n7p8rL6J81j84J13m8p4L6M1k4O4J02k04K6N7LP5
$$ y = [95, 7, -17, 6, -27, 45, 64, 13, -81, -81, -27, 111, 86, -41, 86, -83, 46, -8, 12, -65, -11, -118, -28, -3, 21, -67, -19, 72, -51, -35, -107, 57, -88, -17, 0, 16, 149, 62, 1, -84, -5, -31, 39, -124, -17, -28, -133, -1, -11, -14, -10, -119, -27, -34, -44, -54, 82, 4, 56, -21, 37, -18, 68, -52, -83, 68, 17, -73, -7, -67, -63, -70, -97, -51, 5, -32, -16, 86, 45, 36, -96, -31, 4, 93, 73, -28, -37, -3, -65, -54, -9, -25, 83, 66, -56, 36, 19, 76, -114, 2, 129, -33, 63, -39, 38, 84, 21, 61, -63, 42, 81, -74, 86, 46, 27, -29, -34, -2, -60, 54, 3, 23, 11, -23, -11, 4, 60, 18, -40, 34, -6, 3, -17, 21, 125, -25, 23, 5, 32, -139, 9, -4, -6, -14, 94, 83, 37, 20, 5, -75, 61, 9, 29, 44, -15, 27, -21, -69, -9, 65, -91, -145, 100, -8, -8, 137, -56, -58, -28, 40, 108, -19, -9, 29, -108, 93, 44, -96, -20, -9, 58, -52, 51, -84, 52, -56, 30, 56, -9, -60, 63, -5, 100, 47, 60, -23, -68, -22, -84, -34, -20, 21, -38, 2, 44, -13, -91, -100, -64, 117, -67, 46, -2, -76, -40, 1, -23, 41, 143, -61, -35, 22, 25, 100]
1213A00j38k3ql6J24M7k7j1p9J4k5l4J76k0m1jP2j10N2L7n5k6l4J15p0%LL8o1
1242b1j8nJ21q0k2R3K5q4j61J91J7L9j11L2o2QJ7k6MN2M0J05j93K2K8PR6p9m4
1271im6O5k7Q7m2j16J2L7j0MK4K6qj25L8J34or1J5L4p6K9L6J4l0PRn2p2J31N9
1302E1K5m7n6r0P6M2o3J00J08p0q5j8j3M4jj29J7J04P3j10J32j64J59p9j40J23
1328a1N1l4p4J16j08j04J96Ol3np9J45o9l6n5M6k4Q5l0O4L8n3j56J20N1r9n5J10
1356Cj0m4j2J8J2Q9J7r7q7J87p3M3o6Q7q0N2P2j13K3j43J42r4M5O9N3k01K9J14
1384C5m6m2L3Q3j18J30j34M2K4l7L4N8j77J62P9j31M5q4L0k9J22r7K4j16K7J38
1410E5q2N7K3r3J3P4r7N9n3n5J05J55j79O8m9Q5r2J82k00j20J76J42k80M0J19
$$ y = [100, -38, -61, -69, -105, 19, 66, 39, 28, -51, -37, -62, -96, 80, 60, 19, 18, 90, -20, 32, 69, 14, -12, -46, 69, -1, -1, 2, 40, -21, -39, -44, 77, -3, -25, 68, 93, 9, -152, 39, 56, 95, -16, 16, -46, -38, -21, -47, -43, 9, 49, 154, -39, -17, 11, 18, 114, 35, -9, -55, 10, -17, 70, 28, -88, -76, -39, -49, -45, -21, 5, -3, -128, -90, 44, 38, -53, -38, -4, -80, -51, -15, -1, -31, -24, -15, -67, -139, -8, 51, 76, 29, -27, -117, -41, 1, -62, 38, 146, 76, -9, -27, -40, 4, 3, -126, -109, -5, 68, -42, 90, -74, 85, 6, -134, -11, 40, 6, -68, 48, -60, -164, 32, 38, 5, 0, -79, 66, -3, -39, -94, -48, -72, 13, -17, 47, 85, 32, -124, -4, 47, -52, -107, 3, -7, -51, -63, -45, -33, 56, 73, -24, -111, 76, 3, 46, -20, 67, -13, 39, 111, -2, 21, -122, 20, -74, -29, 40, 93, -108, -79, 35, -11, -53, -20, 63, -55, 75, -59, -17, 7, -30, 4, 62, -115, 47, 126, -5, 40, -44, -14, -43, 79, -18, 6, -110, -83, 55, -27, 30, 53, -40, -27, 47, -50, 9, -44, -99, 6, 161, -18, 50, 1, 86, -6, 176, -24, -144, 32, 174, -106, -66, 53]
1435E3q3rp4J95j00oJ13Ro1J9o5J01k19Q9pM4M3j2Nr0N2n0m8L6O0p4j1M7PK0M4
1466B8p7N5r0J31m0lJ5j38J76J6p5L2o3q9K5J73k2p0Q8j32L7k7O2pK7l8M4m0Q5
1495H3m1o2R5r1j4Q4Nj2j53O1R3k8J2j14P7p5k2K4J05on4O3mk0o1R7m8J25k08
1524h9J6P5l6Q8j4j15j9J07n1k4J60j03R0j08K2L7p3n6P4k8K5jM9j7k0Jk7q7L8
1553h6J82k13J45L6r7j0j9M9L9j18P5k7J47j22R6j19J3L7Ql2O6J5j44J26k0j3
1579A4J7p8m0P5m8K8O5L5j41J35Ok3o4p0J87j04%l0R2N9q8j20K0OK6m3M3J08J4
1608H1j02l9J26P0j82J28l8m4Q8N0q9J13k85J99n0K0j8K0pr2P6j9j8J2P8j4n6
1635HL5O0j96J14J4j54J40o3Nm1J58k52J29O5L7l9p2k1O7P0j11J25q2jkLK7j44
$$ y = [53, -30, -39, -113, 82, -18, -24, 89, 98, 37, 56, -9, 92, -127, -38, -45, -1, 42, 30, 35, -55, -3, -53, -101, -65, -5, -79, -90, -43, -36, -16, 28, -49, 6, -84, 47, 7, 4, 19, -119, 57, 73, -2, 30, -33, -122, -97, 76, 54, -16, 72, -60, -23, -50, 12, 5, 32, -6, 38, -2, 83, 42, -20, 75, -16, -30, 54, 59, 47, -106, -45, 48, 20, 32, -82, -5, -80, -102, -78, 27, 21, -33, 30, 26, 6, -55, 42, -6, 119, -89, -73, 2, -34, 54, 40, -75, -94, 13, -38, -62, 98, -5, 85, -23, -1, 36, -37, -93, -19, -47, -22, -23, 26, 9, -11, -10, -37, -124, -86, 96, -117, 28, 64, -33, -43, -62, -13, 26, -92, -17, -44, 103, -19, 77, -42, -29, 8, 16, -16, 50, 65, -79, 47, 27, 14, 31, -47, -87, -12, -60, -32, 33, 68, -73, 62, 68, 45, -19, -89, 98, -6, -6, -36, 56, 115, 27, -93, -73, -67, -41, -84, -41, 67, 81, -21, -60, 66, 136, -46, 82, 44, 0, 88, 138, 49, 162, -123, 76, 26, 46, 28, 48, 41, -51, 25, 6, -12, 0, 78, 64, 8, 43, 103, -93, 21, 35, -119, 21, -42, -37, -78, 80, -172, -43, 22, 59, 20, -52, -73, -6, 64, -47, 78, -4, -5, -7, -4, 23, -121]
1663a21R2J36j15M4O6n0n8O2j71J12%MP4j36J03j04M8L4J7J9j80J45o1Q9n2J43
1689A40j45J4m0N5l3O2n5J45j33j2L3p5j1Q6nN8l2m5mJ9p6K5M5n4P8j46R4K0J6
1718B4j9R2q3r1J27q1m7L9L5n3L6l2N6r2Q2qK6L1k4p1l3o7J19j2O3o8J0p9J26
1747FM8p2k9MK6J4Pj81J91j29mJ25J39j76j9L9k7M1KM0q4P6k3j2j09J29l5J5J4
1776A6K6k2Q4j14mm7R1r3Q3K2j8k6j17K20j23O5jOj50J1J70q1n4J60o5r0J26r6
1804b1J03j50R4m4L8N5j42J71j07R5j14J0L7J1o3rR1n1r3Q4J9n7K1l8J8P8o3n5
1832h2Q9l6Q8k8p7Q2m0M3r6K4N4l2o9K5KJ37q8p2k2J62L8q8j55J66m6O1R1j01
1860C0m6k2R6j19J81o6j4n1Q7m5l1k5jP4j17R9KM5k5M8j81J01l1K9l0R8j77O8
$$ y = [-121, -29, 107, -8, 36, 102, 52, -6, 56, -115, -3, -3, 1, 75, -61, 42, -62, -14, 20, 37, 56, -124, 21, -40, 49, -3, 140, -5, 9, -31, 24, -9, 53, -2, 143, 10, -2, 31, -44, -55, 31, 26, 84, 52, 7, 3, 22, -54, -29, 16, -38, 40, -106, -12, 8, 24, 5, 97, 14, -77, 50, -31, -78, -39, -4, -57, -21, -53, 3, -89, -7, -15, 11, 42, 18, -53, -86, -153, -34, -46, 17, -51, -41, -120, 6, 54, -18, -47, -43, -17, -3, 4, -177, 14, -115, -119, 6, 145, -31, -50, -11, -38, 3, 5, 45, -39, 37, 14, 2, -107, 22, -13, 2, 16, 42, 20, 104, -10, -14, -61, 30, -63, 20, 42, 24, -2, -119, 101, -22, 43, 42, 48, -102, -91, 79, -2, -56, 104, 39, -51, 75, -21, 82, -68, 26, -18, 20, 75, -67, 104, -3, 92, -22, -12, 25, 36, -27, -36, 55, 4, -89, -5, 14, -43, -22, -60, -42, 36, -27, -82, 7, -29, 59, 31, -46, 36, -4, 39, -57, -33, 21, -11, -80, -55, -53, 84, -4, -76, -98, 64, 102, 14, -141, 25, -21, 40, 131, 30, -16, -38, 58, -61, 120, 54, 40, -11, 76, 31, 0, -25, -26, 48, -69, 30, 32, 77, 52, 100, -81, 20, -11, 18, -12, 86, -91, -23]
1888b3K6L6j00P6kk8k9j9R6J1N9l3P8j87M3M0j83K47m3m2j6n1M1JQ8m2r4N5L2
1917C7Pm8k7K8mP5r1n8k1K2P2p1J10j51K25m2j01N9r0J06n6r2J08kL0L0q4p8O4
1946d3J3J10j6j49O4l1J23l0j10J8M8n3J52j8j59P1j9KQ4l1j4l2oJ1l6J22m9M
1974B6q1J00Rm8L0j11J44l4l5O4j02O4m8qN4j35M6K8J66j22m1J9m2J35j87J46
2000C7j13K6J1j01M9K0LQ0o3qO6j8L0KJ23k01J10K1m5o9Q0j10m4O9R5r6O6OKP
2030C5K5Mj35Q2k3j27K32m2qj23m6J67r5J65m6J15j59L6l8n0p1K02j46N1OO9r1
2057a1OP4q3p4J43r2J1L9n0R0K9n9p4O6M7r3K5q3N0J61j74P8N5k8o5K4L0q0O7
2086B9j15Q6q1L8J09m4Lr3K4M6j3j2J52j22j5J1N5j24J9N5l1L4o1J27L3j57O2
$$ y = [-23, 3, 39, -61, 15, 13, -15, -44, -63, 33, 44, 103, 70, 148, -39, 4, 44, -139, 108, 65, 23, 7, -44, -3, -2, 86, 44, -50, 5, 37, 44, -4, -31, -3, -7, 68, -23, -81, -102, -80, -8, -79, 31, -120, 105, 63, -38, 21, -69, 37, -19, -111, -3, -5, 25, 55, -29, -107, -43, -30, 80, 64, -85, -21, -52, 71, 41, -69, -51, -3, -56, 96, 78, -81, -10, -29, -27, 57, 26, 12, -20, -26, -15, -51, 71, 22, 26, -55, 45, 54, 6, 36, -75, 69, 35, 0, 64, -38, 26, -22, -30, 24, -111, -65, -37, 129, 7, -34, -15, -57, 78, -109, 37, -76, -50, -39, -140, -91, -71, -68, 12, -51, -59, 7, -11, 19, 21, 144, -57, 53, 74, 29, -40, 40, -70, -114, -45, 50, -46, 20, 26, 28, 35, 60, 64, -71, 11, -12, -139, 93, 51, 43, -80, -126, 41, -54, 111, 65, 180, 21, 57, 19, -31, -102, 100, -46, 5, 11, 80, -11, -5, 69, -14, -88, 55, -37, -26, 13, -37, 53, 82, 23, -51, 15, 62, -31, -6, -89, -39, 122, -52, 26, 81, 53, -12, 12, 42, -38, 29, -86, 0, -81, -43, 66, 22, 25, -68, -44, 2, -11, -23, 129, 7, -8, 3, 58, -66, -47, 8, -23, 11, -50, 77, 110, -47, 15]
2113A5rO6m5Rj31P0n3J21kq1J27j11L0n5K4P6l3m7M0n9J64o5j0n3mJ5NM6r8o8
2143a16J31J6j05K06n7r3p8J23l5M1o5L8r1P3qKL6k4J5K6j13J07m8Q6P2j55o3
2170g9k1K17r5K8j37J24n9r0N8Q9pn7p1j16J09J21P9o1l3kJ5M2l4j2L4k5k7R3
2198H3l3J5j71J18R6k00R7o9P9k0O5j07N3n8n0J15j8n2j4j7J06nMK9Jl5j1NL7
2227D3r9J00kj17J37q0P8j09n7J09L7k3K6l8K8m2k5o0P1k9R0J0r8O3m6j1l5J36
2255E7n9P1r6K7M0q3L2p1L4K0M7p7K01k30J56k00J70P1o3J3K4r7O0oJ6m3O2j41
2283f5O4p0K3J36j22Q6njl1On3J37j42R3p5K1NO1q0J13or8J6J3l8R5j8r2m3J01
2313C1n1n8J2L3pL3K2K7j10N6P0r6k0Q5Q1j35L7l4N9mqj4l5K4J03J5l4p9O0o2
$$ y = [15, 6, 72, 27, 36, -95, -25, -78, 43, 41, -40, 87, -24, 6, -49, -25, 51, 18, -29, 11, -48, 116, 51, 41, -12, -16, -1, 4, 50, -48, -116, 15, 31, -74, 132, 75, -18, -96, 27, -8, 33, -32, 6, -85, -12, -20, -18, 18, -6, 9, 35, -78, 29, -19, 67, 139, -16, -79, -100, 117, 22, 50, -87, 37, -22, -112, -54, 35, 28, -29, -100, -216, -107, 14, 93, 32, -1, -3, 12, 54, 20, 8, 42, 17, -10, 83, 50, 65, -106, 12, 108, -92, 5, -64, 15, -5, 60, -47, 6, -52, -102, 13, -5, -57, -71, -88, 18, 13, 17, 46, 47, 12, 1, 6, 43, -56, 44, 42, -75, 62, -18, 60, -49, -106, 3, 40, 17, 43, 5, 33, -9, -34, -94, -23, -52, 38, 48, -50, 13, -33, -44, -79, 57, -2, 69, -27, 0, 40, -43, -11, -82, -48, -28, 19, -58, 143, -87, 69, -131, 39, 110, 47, 60, 84, -13, 47, 41, 57, 14, 76, -65, -1, -71, -48, 88, -34, 52, 47, 46, 15, 21, -32, 105, -37, 56, -19, 2, 7, 68, -12, 101, 95, -3, 13, 26, -12, 83, 65, -27, -70, 31, -20, -78, -66, -33, -40, -7, 15, 42, -68, -12, 58, -38, -58, 27, 108, -27, 10, -24, 35, 31, 23, 9, -26, -2, 101, 116, 82, 3, 63, 1]
2343Am6n9J79j26N4M0r8NJ3N1o1R5j82J16j13K01j04Q7r0NQ4p4R0k8Pj20O4p4
2371h3J03rl6N5k9J12j07J38j29M7j24J37m8q9O1l0L2j6p1J18j7L1m0M4j54O8
2397c6n8J90j65K2Q0K8Lk5l2m1jr2J05O9J02k14J43j3j4j06Q6L9j14J43j12o6
2423g9O2k9K2L1mL5o8K15k10K6O2k8r5%mP6p2Q7on2J87j52o0K2N5L1r2k9M3LL0
2454Gj5L2r1M7q2Q7n3M1kK7O5j12J7K7j6M1k8R8l8j60J27M6j49J65j22Q0j8k1
2482@Lk7Nj0J09j44L6M6j1r7J37K9j01p1M3Rn6Q6RJ07m9p1K1o4r7J10Q1j5M4j1
2512E1o1M3J2o4r0J03j6J48o8n4j20l2J20O2j69J19qMm0J68j43J36j27J8oK2j7
2539iJ5L7Q3j15m8P6q3J9l6M7O0q0K3K1K8m8J2n2L1k3MN3O3r2o3P4n1l4J30p0
$$ y = [1, -45, -104, 75, -51, 3, 43, -55, -50, -37, 14, -47, 48, -134, -18, -131, 70, -34, 53, -37, -32, 52, -22, 68, 40, 47, -73, -9, -83, 20, 11, -25, 30, 1, 113, 6, 144, 15, 62, -62, 75, 27, -62, -1, -31, 1, -15, -86, 32, 15, 46, 6, 50, -104, -36, -94, 96, -69, -47, 33, 61, 64, 39, 7, -34, -35, -127, -22, 47, 149, -65, 78, 65, 51, -55, 31, 70, -44, 99, -13, -79, -17, -46, -24, 7, 3, 38, -30, 185, -25, 1, 63, 35, -60, -60, -64, 12, -60, 27, 21, -31, 156, 4, -56, -34, 21, 52, -40, -69, -26, -23, 7, -8, 24, -67, -20, -102, -15, -68, -27, -29, -2, 63, -49, -32, -5, -21, 20, -8, 90, 52, -108, 19, 65, -84, 81, -41, 39, 21, 0, 3, -24, -19, -29, 80, -64, -28, 18, 7, -90, 47, 76, -25, -96, -53, -44, -100, -14, -5, 102, 53, -18, 3, -61, -158, -48, 33, 18, 62, 51, -10, 33, 45, -19, -109, -6, -22, 126, 58, 4, -116, -148, -28, 34, -135, -16, -24, -20, -60, 108, -35, 101, -26, -8, -14, 8, -9, 6, 43, 126, 11, -37, 39, -44, -25, -61, -14, 46, -34, -11, 10, 38, -10, 2, -50, -19, -42, -38, 15, 78, -14, -77, -3, -54, -88, 42, -28]
2569b8J21j34r2J37L8j26M9J24L7K9j44j8K1k0Ml3nQ4q0L9qk2mo6K48j11rj4l7
2598b0N7j19J24q0j5R4j8j20J53K5j00P0j27K6M7Nj0o8J28op1m0mN4Ok2L4l0R5
2627F8L5j80L0O6k6RO4j48K15j52k9J18N5j31N8j49O8O4j1o1J5K7J23j78J05J0
2653F5r3ljK6r5P4l6J7J1J29j9j8n0K6kj8l4Pr3L2Q4OO4rJq9J86k02M9pJ4l4l8
2686e0K5O9j59J35o4m7J07l0l5m6J58Q7p2j16l7J9K08k52R5P5p1M4j09J05M9p7
2712A1o5K5l9PJ20L6j99K28q7m9r4J16j9J02q8K7j5m8O3o8o7R7pj4K7l6L6pj00
2741a07P1N3r7k2Q3k4N1l5J8kK3l1m5M2J09l4o9j5pj5P3o9O6o8N5j4OJJ2k3M3
2772B9j8K9o2o3J12Q8m1k56O3J06j7K0j13P1n7K7Q7L6N9j09k9J37j02p2J79p9
$$ y = [-28, 93, -41, -133, 4, 42, -84, -35, 89, 126, 155, 11, -7, 14, -6, -2, -35, -40, 44, -36, 3, -5, -27, -31, -97, 151, 40, 31, 17, -20, 37, -82, 42, -38, -53, 41, 23, -97, 56, 81, -19, 51, -76, -50, -3, 2, -8, -76, 52, 46, -25, -65, -69, -15, -9, -31, 3, -27, 68, 103, -77, -47, 19, -7, 2, 66, -82, 133, -19, -48, 70, 125, -6, 52, -97, -29, 35, 24, -37, -22, 5, 128, -50, 55, 65, -28, -31, -32, -6, -101, -27, -63, -46, -35, 94, 75, 57, 7, 33, 31, 13, -21, -14, -107, -75, 9, 15, 79, 70, 71, -18, 168, -34, 15, 8, 22, -12, -50, -25, 44, -115, 20, -44, -91, 16, -14, -49, -95, 63, 150, 78, -38, -75, -56, 152, -100, -5, 70, -1, 43, -66, 39, 88, 11, -54, -29, -68, -61, 59, 95, -104, 124, 37, -12, -106, 10, -9, 93, 5, 32, 17, -31, 32, -36, -103, -6, -13, -27, 0, -36, 0, -7, -107, -36, 17, -80, -102, -19, -43, 8, -27, -9, -11, 12, -19, -64, -22, 87, 53, -16, -31, -38, -53, 20, -49, 17, -51, 4, -10, -4, -3, 9, -14, 29, 11, 40, -22, -85, 27, 115, 74, -182, -119, -13, -30, -10, -123, -52, -109, -82, 5, 41, 100, -9, -38, 99, -3, -75, 104, 25]
2798B5m2P8j17R7l9JJ04j49k6R7j9M4k2p3qn7J68j3o3P8j65K05p7l6o3J18opj08
2827g5J29Pjn9J17o9j5l3O3l0k4o2R2O3j91J47m8P6q7P4n6l9Q8o7n1P5o5K9k0
2856c2R4p6O1j07O7q0M3j29R5P6o0J5q0J40n4Qk5J96j42P2n0k9N4M9p0kj8Qn5
2885c1M5n4M3N4on9nL3NJ7Ll4kom9k4O0K08j70n6P7q7N3m9o3J65p3R6j69M5P3
2916D0o2n2J12j02J08j8Q4n6k4o5O0j94J02j5L4l9M3M6R1p2m7N2M1l0lMj00Q9
2944B7l1pJ0o5J39r7J44l0j38K07k67J33j13J03M0p2m1J54n7r7j09R2jQP2k6J39
2971A17k18J38m0n3oM4K8k5K9mj0P1j51J53R2j46m6K1J1l9j6J33j8j76J31p6P8
2998B2K4j73Q3J7L7J03k8j46M0o6J15k3L0n1P6p8J1j9N9lp8L5j3O0n5P5o4PR1
$$ y = [25, -17, 61, -56, 41, 2, 3, 107, -42, -68, 29, 10, 54, 32, -41, -49, -106, 62, 49, -14, 64, -101, 104, 27, -9, -72, 46, 40, 33, -75, 54, 61, 60, 1, 118, 49, 34, 1, 64, 34, 10, -52, 40, 103, -88, 59, 11, 87, 0, 74, 18, -21, 67, 0, -51, 24, -41, -12, -32, 62, -14, 47, -60, 7, -73, -30, -159, -64, 12, -48, -33, -113, 27, -27, -19, -44, 152, 10, 82, 32, 3, 57, 106, 36, 34, 16, 24, -31, 14, -40, 3, 57, 51, -8, -13, 20, 25, 42, 45, 11, 9, 3, -46, -70, -10, 198, 28, -28, 49, -38, 15, -34, -97, 68, -5, 91, -78, -33, 40, -22, -74, 38, -64, 44, 26, 110, 54, 30, -35, 25, -169, -67, -82, -48, -87, -44, 2, 93, 21, -26, 26, 67, 37, 34, 38, -62, 27, -4, -11, -1, -66, 73, -24, 120, 90, -48, 159, -108, 25, -88, 15, 55, -17, -58, 96, 39, -58, -167, -75, -76, -68, 4, -22, 117, -101, 37, -3, -56, -62, -18, 10, -15, 14, 10, 0, 71, -80, 73, 165, 19, -27, -6, 5, -34, -50, 83, 65, -111, 20, -56, 22, 46, -127, -44, -27, 10, 113, 85, -61, -21, -87, 28, 5, 35, -16, 60, -18, -7, -26, 33, 30, -48, -13, -26, 34, -21, 54, -10, -3, 88]
3027H8j18R3k9p0R3j83J62m5J6Mo7J2l0KK5R7k5lk5N7j26J50m5q7R9J9K7j31J53
3056A13j39J13j31m3M8N0J00j65J01j20Q4M4l0n6M9j14M1M4o5Q5J3l0O6om3N5
3082F4K3j8j30J37o3n6NN9j16J24MR6j0j37J12j05NM5p5qO7K0O3r3j9N3l1mk8
3111a6O5Pk12J13O0J20p5r2mk8R9p6m2M7o4J5Q8N1n1RN0q5J8k2K3L8j3M8p7O7
3141F1m2l5p8N4%R5n5p3K2J25m9q9O0L5n1N4R6j84J26r5J4j16K28q3lj28J7J7
3169g7J86j42RP6k7l1q5O6RN5r8J12Mn5NK4O1p0J6o4lJ30j52J10q8m2J29l1m8
3198b1n3j17K29m3j49K01j84K0R0J0K7PJ5M7j32J18q1mpk2p5J68l7N8q6L2m2J08
3226G7q2p4Q8p1J52q1J37qj12M4n3j23L9Q7p4j0J08j4N7j81K28o1j14J8r6J99
$$ y = [88, -30, 63, 34, -36, 57, -126, 36, -9, 7, 11, -56, -44, -74, -72, -47, 50, 25, 22, -3, 54, -72, 78, 33, -54, 45, 64, 91, -40, 113, -26, 87, -44, -87, -39, 11, 111, -54, 47, -73, 11, 55, 25, -31, 18, -96, -55, -11, -76, 9, 22, -8, 58, 52, 9, 64, 87, 69, -61, 76, 13, -43, -38, 21, -95, 29, 33, 129, 119, -18, 94, -11, -6, 39, -36, -44, 23, 43, 106, 13, -6, 47, 16, 12, -16, 49, 56, -156, -43, 17, 137, 62, -30, -34, -62, 37, -39, -81, -34, -98, -83, 5, 56, 5, 14, 64, -21, -3, -25, -2, 36, 23, 71, -6, 61, 19, -16, -94, -40, -40, 55, 0, -73, -51, 74, 25, -64, -4, 31, -20, 34, 130, -54, 72, -23, -9, -125, 103, 20, 17, -111, -94, -77, 109, -33, -24, 52, 25, -6, -91, -25, -16, 39, -59, 53, 57, 2, 7, 31, 92, 22, 38, -26, -29, 101, -51, 59, -29, -71, 58, 27, -21, -74, -191, 38, -5, -154, 47, -137, -117, -27, -17, 10, 17, 32, 79, -53, 65, -16, -20, -27, -49, -124, 44, 7, 65, -21, 11, -31, 77, -5, -79, 9, -62, 90, 9, 146, 138, 26, 70, 17, -106, -67, 20, -54, -64, 44, 30, 87, -94, 134, 73, -41, -23, -119, 80]
3252H0j15N3M6n9p0J47Ll1p1J23j28qQ6k9p8P0o1MJ89k04N5qJ01k28K32j77M9
3279b9j0N2L0r1N5k3L5J5l6L7m9lr4J96l2n5L9J1jj2l4N5r8J08r0N3L6j19R2r0
3309e2k3J59l2l1O3j5o8j20Q4K1M6l7k7KM7J5o2N7n0l7P0j5L1O8j54M6P3m7J9
3338C1j4J17k26LJ73O4j23N5n3j37J82l0p2kJ29L7j51L2l5no5O8o0J32r2M0j46
3365a48P3J31j66J98j99P9J04np3nJ49k90K18J4p5N8o1M8nj28j5K78j69pO7P3
3391A44j11j27O8M4K9N3o1Qj09J10l1j6J06j53kK9N3K0K4q8J8o5O8j7J7L6j51
3418a04J30l6k9L4J4j7j7P4O1n3r5nP6l2R3r6K6J41k56MJ53j32J55j7J4j18R5
3445F3j01K1M9m6JN0N0n6N4p4j7m7OJ06o9j08N3J11l3q9R9N3j1L7j41P4p0J05
$$ y = [80, -35, 18, 64, 5, -65, 82, 85, 54, -17, 106, -22, -30, 56, 27, -51, 19, -42, -38, 151, -53, 2, -6, 95, -133, 99, -78, -29, -39, 13, 43, -48, 7, -16, 19, 34, -2, 35, -14, -17, -111, 85, 53, -2, 37, 48, 47, 35, 1, 56, -42, 66, -24, 29, 65, -54, 38, -52, -75, 84, 52, 21, 84, 69, 1, -119, -35, -14, 32, -5, -32, -30, 17, 32, -30, 27, -23, -60, 10, -5, 26, 94, -60, -14, 59, 12, 31, 17, 134, -92, -89, 84, 148, 25, 80, 27, -110, 72, 42, -30, -32, 97, 134, -17, 15, -20, -25, -90, -22, -82, 50, -42, -2, -148, -75, 56, -110, 88, -111, -32, 72, 67, -6, -11, 138, -152, 66, 80, 5, 63, 2, 50, 45, -83, -98, 180, 11, 4, 71, 144, 33, -94, -26, 18, 47, 100, 39, 47, -62, 48, 17, 1, 107, -46, -48, -19, 34, 54, 78, -10, 8, -57, 11, -6, 11, 47, -104, 26, -10, -39, -5, 9, -8, -25, 49, 110, 57, -38, -43, 33, 1, 94, -2, 24, 165, -91, -87, 66, -66, 89, 72, 86, -32, 63, -38, -17, 32, -14, -13, 37, 87, 31, 85, 11, -6, -53, -47, 59, -10, -118, -65, 46, 13, -76, 23, 76, 65, 102, -39, 35, -35, 70]
3473G0q1O5q4M1%L9j15J32q3J57j16m7L6O4j56J04j7K6J8j11J11j57L8J38m2N1
3499H1k5j24J7P9OJq4P6r3O3mo0P4k3J03r5Ron9P7j13J8M1m7m5Q1o2P0K0m3J52
3530H5J0j24%j0oJ27k1r3r0J86j78R4J23o8j11R2j4M7m0p9R3j4k5M5m2J5j4j6
3558b8l6L0N6K4m8j3J5M3j9l9k2j7J48j85J46j26N2l6M6j6J6J3k0JO2j1q6L3K5
3587HM6k5j12J24K1p0m8K9pL8n1P9j3j1R8o6j2nQ5j58J35j90O5L1n6J02j10J2
3615f1Q4J9j19J06j62R7L0j03OJ38J7l5q0M5K7O2l9p6J03j00M8n7O6k0m2J6N5
3642B5r8J28p9P8N6j76Q6J8p2m7R9ML1j29M2R4Mj56J12m3J14j24j3K6K1K4p3P7
3670B9p9R0o6O9O8j11N2j5N2m3j28N1jJ27r7J6r4J24o9Jj7Pm3J45o4n2L4o0M8
$$ y = [70, -11, 54, -30, 11, 11, 50, -65, 67, -16, 141, 25, -22, 14, 78, -78, 26, 9, 35, 53, -58, 53, -104, -66, 72, 30, 81, 56, -68, -51, 28, 34, 35, -49, 27, -66, -3, -7, -67, 7, -16, 87, -8, 1, -5, -64, 13, -100, -82, -41, -88, -133, -52, -114, -44, -24, -67, 85, 95, -29, -29, -39, -45, 82, 61, -32, -122, 64, -114, -20, 103, 35, -76, 16, 2, 49, 9, -70, 23, 9, -16, 29, -13, 2, -12, -28, -64, -34, 22, 46, -2, -15, 0, 43, 24, -15, -37, -54, 94, -91, 55, -71, -19, -55, -9, -25, -9, 4, -16, -15, 47, 36, -50, -17, 8, 54, 29, -83, 41, 62, -8, -56, -27, -34, 4, -47, 32, 19, 8, 106, 40, 28, 23, 108, -50, 85, -105, -40, -9, -65, 37, -73, -61, 23, 42, -77, 29, -133, -36, -6, -109, -103, 35, 52, 17, -63, -18, 9, 71, 32, -44, 59, -41, 7, -50, 16, -4, -46, -30, 25, -73, 55, -24, 54, 110, -66, 20, 38, -34, -81, 18, 22, 53, -76, -34, 60, 64, -92, 20, -23, 91, -33, -46, -20, 1, 25, -48, 29, -50, 40, -26, 43, 111, 0, 52, 37, 89, 46, -82, -31, -32, 95, -2, 14, -80, 44, -25, -24, -41, -34, -77, 68, 4, -48, -14, -74, -26]
3699b6R7j04KJ3k1J5P9j88J49j40K03j81L8J22o5N4q2L0J02j09p9N2j5J67m0p1
3725Bk5J75k18LJ78o3k9o1LR5j13L2J33q7L6n4r2pJ37L8j65J12m3nR7j26L9p1
3753g9N9k2O0O0k9p5R0q4k0J03j44J55o9L5nkn5p5J27m1K8j4o5n8J44%j95K03
3781C2L0m1o1K7O3l1m2J27j42NJ17j13r2J12J15j73J39j21lJ45m0j00J1Q0o9m0
3807f5L6L3o0P2l8m6K6Q3j9p8J12L1l0K6j34L2J53j43r3J70j00r0J20n9R7o6l
3834c3n4J51l9m8J63k02M1m2R0q1R9O4j78J11jkn2k0lN4m8J5P0r6Q2j54J01O5
3862E3j06jl3pQ1P4j01J30r4M1J5j10J33p3Q0k3KKM4j0j10L1oP9j01j0R8j65O5
3891b2l7Q1p9J36j72N4N6%%J7P5o1o3jl1J10qj19m3J27r0R8l2m1J25k6K4j81R8
$$ y = [-26, 71, -33, -31, -18, -39, -24, 55, -133, 16, -124, 79, -102, -64, 58, -7, 47, -35, -5, 97, -12, -91, -39, -54, 113, 73, 2, -23, 152, -66, -63, 115, 52, 23, -38, -35, 60, -53, -21, 112, 25, 61, 7, -85, -92, 45, 83, -82, 30, -13, -18, 79, -47, -8, -79, -20, -42, 18, 78, 49, -26, 64, -20, -40, 63, -81, 74, 5, 40, 35, 33, -22, -97, 30, -11, 17, 3, -62, -120, 24, 24, -171, 32, 62, 21, -40, -13, 50, 19, -23, 104, -38, -33, 84, -29, -121, -9, 106, -67, 72, -49, -52, 93, 53, -47, -36, 44, -25, -65, -29, 4, -56, 16, -22, -68, -42, 41, 22, -56, 56, 87, 57, 83, -51, -19, 134, -9, -102, 68, -32, -122, -2, -61, 36, -30, -33, -87, 64, 25, -23, 140, -62, -21, -63, 27, -54, 45, 109, -69, 42, 41, 39, -13, -33, -36, 18, -30, -15, 55, -41, 41, -113, -12, 53, -53, -54, -87, -94, -13, 61, -40, 90, -4, 37, 52, -58, 75, 2, 82, 59, 61, 63, 107, 97, -13, 18, 12, 91, -10, -20, 78, -87, -22, -59, 22, -57, 79, -93, -39, 17, 17, 17, 34, 109, 48, -15, -16, -47, 63, 55, -64, -107, 20, -70, 28, -4, -45, 80, 54, 78, -103, -5]
3920eJ02M9j30o8O6j03P7N6n8J07j7q2j2LK5o2l6J34rN5j75P7l0J13j03k1ql0
3948h5J11M3k06J61M5j4r8l7M5j8M4k5J11q5j18J9J60j51J22lp6K7K6J2Q8n7P5
3975A16q1O4j84J03%pl7N3m9Q3N7k01J65j72J30q4N0K8k2N6j29Q5k2J9K1n1J37
4002A28k28P4j42J72M0n9M5j04R6l9J17q0k7n2J60omr0l1n4Q2N6k3p8LN1P6r2
4030ik4l1K2Q7P5j86nM1n3Q1n0Q6j0O3j50j04J28j6jP2k2m6J04Pp1j03J11j17
4058a21J25j5k8O5q9N7l0l1R2Ll3m4J23qq5Mj21K11p1M9j4n0j0N8mp7L7k2J5M5
4088C1j18J48j38J45m1o1lkJ15j49J09j29J19l0N4K0j33J52l3p2j5K0J4L5mR8
4114A32j69J3K0l0M3J0k3N7j21P4P2k20R0R6p2l1O0L1k1N6qp3oJ6n7O0p9J15P4
$$ y = [-5, 97, 146, 16, -52, 14, -89, -12, 44, -14, 93, 76, -6, -18, -15, 10, -52, -88, 46, 37, 92, -83, -6, -36, 77, -26, -47, -55, -85, 26, 69, -137, 24, 69, 55, -43, -80, -35, -53, -9, -34, 77, -8, -126, -107, 53, -98, 24, 21, -55, -28, -2, 10, 98, 41, 116, 35, 99, -85, 18, 18, 11, -26, 27, -22, 61, 118, -83, 82, -90, 40, -44, 6, 34, 12, 68, -61, 24, 2, 21, 42, -9, 128, -100, -26, -168, 4, 44, -15, 30, -74, 22, -17, 100, 20, -7, -59, 101, 95, 91, 1, -30, -84, -2, 54, 31, -47, -44, 7, 83, -9, -33, -64, -42, 45, 120, -66, -71, -30, -83, -2, -52, 34, 24, 87, -63, -167, -39, -55, -56, 16, -6, -52, 52, 59, -12, -115, -4, -121, 4, -11, -39, 26, -63, -6, -36, -67, 25, 28, -5, -49, 74, 66, -19, -15, -136, 75, 4, 53, 39, -11, -21, 37, 33, -44, -7, -29, -14, 31, -87, 61, -77, 68, 27, -34, -37, -39, 76, -73, 36, -93, 26, -4, 50, 70, -63, 89, 56, -16, -31, -11, 3, 38, 34, 132, -37, -24, -4, -34, 9, 19, -4, 53, -68, 6, 78, -142, -52, 44, -28, -59, 1, 32, 11, 67, 59, -14, -20, -4, -61, -1, -80, 35, 109]
4143A09q6Q4l8N3k98J55R1o4j7r1O5K7qj9k0M0N9k9M1j80O1J95j43Ml0M9r2N1
4171c1K3O1K2j53J35m5j2j9r1J19M4q0J6P2m3m7N7j06J19m0nL8j6r6J02Q6j46
4198c6LJ40k34J18j13J85j27J37j40L8J16j14P4j05NL2R5r1j8q3J28J2l0l9M1
4223fLj10J47j14J15L3j17L3K5k3P1K0r4o1Q8m8j1J3K0k1l8M1NJK8O6j39l0M8
4252e5N4N5l8o8P1l4P8n1pN2r0L1j69J03J49m8j08O1J18j59J13j25j5K5J10q2
4278b9J03k12K0J43j33R3R1j03L6M8l6P8k8o3K4o8M5J0O9l1q0n7M7J00j33J3O9
4305A6k7m6P7j2L7o9N0L8o6q8J81r6o3Q9j3j18N1J00m7o8Q6q7J02j8k8J9j3L5
4333B2j3j6N2Kj5k9o2Jk4J17L5j3r7N8m6J01j02N0L7j31J26j1l5N6n0J3o9l4J22
$$ y = [109, 23, 107, 69, 122, -176, -21, 70, 6, -11, -102, -37, -10, -18, -37, -57, -17, 42, 13, 54, -126, -65, 130, -13, -9, -39, 10, -82, -31, -8, 53, 75, -78, 57, 12, 0, -19, -110, 9, 53, -27, -11, 61, 18, -29, 28, -78, 41, 1, -4, 34, 18, -78, 24, 110, -36, -33, 107, -127, -9, -122, 63, -64, 73, -67, -29, 87, -27, 47, -58, -53, -21, 74, -17, -35, -118, 10, 22, -8, -47, -6, -3, -113, 34, -80, 35, 68, -49, -16, 9, -14, 57, 77, -17, -78, 10, -38, -49, -36, -16, -37, -75, -34, -29, -28, 0, 66, -73, -103, -55, -1, 54, 16, -52, 19, -15, 63, 12, 5, 57, -33, -2, -171, -68, 81, 33, -75, -14, 104, -55, 58, -67, -82, -57, 53, -29, 74, -138, -118, 25, -108, -15, 76, -27, 9, 57, 21, 99, 71, 8, 32, -36, 9, 19, 88, 57, -23, -80, -33, 67, -66, -53, 16, -11, -57, 20, 8, 45, -24, 26, 64, -2, -90, 91, -5, -68, 21, 8, -110, -59, 41, -6, -74, 12, -75, 27, 9, -19, 0, -13, 22, 9, -7, 45, 47, 32, 3, -59, -58, -82, 35, 70, 57, -40, 18, -28, 73, -29, 21, 58, -73, 53, 42, 7, 63, 13, 26, -43, -77, 45]
4362D5o9m4J30omn2j8J49j23JJ01k20J19n1M7rJ7j6N4j25M0n7J88q3m9J57k24
4389a02K4K11j51L9l7j2l7P8p3J13j35O6P2j25M7n1J9R0K6j39J5M3L9j77J36P8
4415E7k5J0j7rL0L8m9J9N0j26%mp8LJ20j04N6P6m5l6q6R0P6r7M1K5o3j3L5K9%
4446Co9J22m6J6K4j65L9J03j18O5m4N8MlK7Kr4QJ12j21j3N2j4M6ml3J16j16m7
4475i0N3N6j7l4M3kj68R2J46j16Q8p8K3Q1j44j06K12l8L2r2J64j86J08J1n9Ml7
4502e4P3N9m8p4LL8%K6Oq6R8Q1j01M5j08Q1R6k07J07n6Q1j84J82qj2r1o0R9jo8
4532h3J56p5P0j01K2L7j8QO2r5j6LL8P6l0n4m5l5J66J9k44P6R0j09J19l8J04j22
4560a9%K1L2r0M7lq9J69Jr2l0N9K4m1K5q3N0k0K8K5P3m1p4Q4j07M4j6Mk2k6K8
$$ y = [45, -24, -68, 62, 56, 52, 0, -18, 131, 8, 9, 110, -110, 9, -42, 5, -4, 13, -3, 51, -74, -34, -91, 97, 14, -35, 122, -102, -78, 133, -18, 21, -16, -28, -65, 13, -60, 53, -82, -16, 56, -69, -22, -73, -54, 36, 62, -77, -62, -19, 20, -157, -21, 57, 32, 42, 25, 16, 46, 84, 35, 54, 104, -22, -22, -26, -104, -101, 19, -85, -29, 47, 2, -34, -120, -30, 46, -51, -10, 15, -48, -61, -26, 3, 3, -66, 56, 10, 26, 50, -115, -76, 27, -91, -26, -70, -12, -8, -11, 16, 18, -76, -68, 44, -77, -90, -38, -52, -6, -10, -43, 73, -43, -90, -37, 19, 2, -32, 11, 9, -159, -67, 79, -37, 51, -27, -4, 77, -67, -173, 39, 1, 33, -59, 105, -81, 27, 38, -21, -17, -54, 19, 78, 30, -44, -41, -3, -3, 23, 29, -57, 41, 122, 21, 66, -42, 39, 135, -72, 35, -21, 60, -124, 58, 50, 38, -53, -113, -14, -15, -83, 73, -2, 68, -33, -11, 26, 8, 16, 78, -17, -33, -30, 8, 84, 54, 0, -45, -80, 86, 105, -139, -63, 27, -82, 37, -1, 103, -19, -19, 2, 34, -56, -9, -12, -101, 68, 69, -23, -53, 6, 30, -11, 14, -69, -19, -39, -11, 14, 87, 46, -28, 56, -51, -7, -23, -19, -41, -67, -39]
4591c9M4j5K4L7op3M5k2Q2j06j20J50Jll9R9l3m6L1P5p6J4k9j00J85o8l3M6l2
4620gk5M2o0M1M1j1P6k3rj8N4j83J52o9o8R0k1O9N0j30J02j19L7k9J30j11oKr
4649a2J86j94J9n5J25J1j43J13L8j05k7Q3O7m7j14OM2R5p0j25L4J20r4M0MO1q5
4676b7K3M0j64J53nj18J30k1j9M9J6mj35Q3N2l8m3J04k0q3L6n4K1P1n5L0n1J16
4704H7o5j21J98p0q9M9k4M8l2m3J52O2j39qq4K23k14R0p0o3L8j9J35p0Rm1j05
4731a66Q7J70M5j64K5P6p9P5r4N4n9P4O6j48J01j86J43r0K6J04Jl3M8l8q0m7Q3
4758fp9J07l7J04j06J20p0q3O7k7N5j92J34M8p1m9l4N1J04P4l3j11M8K3m2RL7
4785D1j14O6J04m9j07J16m0M6m7Nk1r5R4J1N1op1L5K8j16J5j0J61n6j40P8J31
$$ y = [-39, 5, -10, 14, 51, 45, -28, 17, -5, 77, -29, -149, 1, 2, -1, -40, 59, 26, -20, 11, 86, 10, 24, -5, -105, 80, 12, -21, 25, -7, -32, 10, -50, -9, 32, 21, 97, 74, 65, 47, 101, -82, 70, 1, -67, 23, 2, 71, 121, -9, 93, -26, 11, -18, 112, 1, -5, -3, -12, 174, -20, -1, -56, 69, 80, -63, 50, 88, -17, -44, 39, 106, 59, -55, -49, -7, 88, 18, -107, -73, 47, -47, -7, -3, 58, -27, -4, 36, -128, 25, 20, -98, 32, 11, -8, 41, 57, 53, -82, 1, 53, 15, -28, 76, 56, -27, 9, -45, -24, 47, -8, 22, -29, 87, 22, -99, 99, 29, -60, -11, -35, 13, -19, -62, 90, 152, 13, 5, -79, 144, -70, 20, -50, -113, -75, -94, 41, -29, -20, -61, -166, -79, 91, 136, -28, -3, 73, -6, 69, -25, 29, -30, 44, 110, -38, 63, -123, 20, -70, -44, 60, 61, 28, 76, 38, -42, -89, -6, -85, 22, -15, 89, -17, 103, 33, -50, 17, -10, 45, -147, -13, 35, -36, -85, -119, -68, 36, 110, 77, -34, 14, 37, -5, 4, 41, -73, -7, 97, 48, -59, 57, 17, 63, 16, 21, 0, -95, -1, 10, 61, 55, -16, 19, 47, -69, -54, -64, 97, 41, -99, -21, 110]
4812A10j62L6l5k5L8Q4J10k51M5K2j1p3J25o1k4J23j80O8J51n0o0J04j3j56M0
4837d5J05m2O0p6L7o9N4o3Q5K2q2M0MO6j02n8L2m2J8r1N3J10Rj9j48J56J25j33
4865Fp1klk6J30o3P5J8j75J14l8K8N3pLj00J02K4k32R8J57r9l9J14j17R1K1q8
4893b6o6K84j61j03R0k1L3q3L0R8j25N8n0J10l9J4k2kk8K1L0j11P6Ll1O1k2L3
4921E1l8P7j01J02o1j3j06J3P7p3J31j27lJ3k7MJ00p2MQ7N9j37MJ34r9L4j2M9
4949G0q6M3q0J7M8J5M5LM0j26M7J01j19j03J18RNj10M5O7oJ2mk3m7K6JO1n5pj21
4980a14j5J56Rj8J7l5k5n4N4n1O0n1N8J30m0j20M3O0j67J05q5J38q6l2J00j37
5006a00J01q9N2L5OM5n8K8n5o2L9PO7j41J69Lj01R1p8q4J07P5p8M0K9L8p4Nmk1
$$ y = [110, -52, -16, -51, -76, -38, 46, 156, -95, -50, -28, -39, -112, 13, -48, -72, 51, -129, -61, 90, 40, -20, 84, 71, -85, -45, 60, 18, 78, 2, 39, -30, 24, -39, 46, 68, -14, 26, 30, 96, -6, -64, -32, -74, -56, -147, -94, 16, 25, 6, -142, 14, 139, 6, -65, -67, -70, -96, 34, -29, 46, 64, -111, 3, -35, -7, 46, 39, 42, -58, 44, 68, -164, -66, 91, -8, -47, 67, -50, 41, 62, -26, -92, 192, 31, -72, 18, -3, 30, -53, -23, 75, -50, 8, -42, 68, 29, 43, 21, 19, -9, 12, 42, -69, 7, 10, -21, 40, 18, 51, 13, 90, -11, 91, 30, 17, -89, -76, 1, -72, 59, -68, -71, -58, -85, -81, 19, -53, -49, 38, 97, -40, -36, 98, -1, 33, 21, 70, -16, 27, -53, -36, 12, 27, 72, 75, 115, -11, 36, 137, 18, -85, 33, 42, 47, -63, -18, 49, 43, 55, 51, 28, -19, 7, 8, 69, 14, 7, -114, -129, 27, 36, 18, 35, 0, -25, -79, -25, -76, -16, -67, -9, 121, 81, -39, 4, 64, -103, 2, -83, 55, -31, -63, 37, -100, 1, -88, -36, -1, 5, 50, -8, 20, -35, -97, -58, -51, 16, -125, 44, 47, -54, 37, -41, -125, -18, 57, -21, 19, 48, 86, 12, 17, 13, -8]
5036hk8N1J4P7p9O9j77P4J5Ok9jL3j1l8j22J60Q1p2j3O9j21J40n9m5j3J3M8o2
5065b8J60j19J04o2m2k5m1R5l9J41j66K5Q2p2r3J04n7J3k8P9o7J6j01M1Q3nJ8
5092A6P5j41R0m0l9o2J58r6jkM8M2m6R0k3k2j06L3JJ6k6J08r4K0p7J5J12l6MK1
5122C8K8m6k2m9J7Q5r4l8Q6l9J48j84J02R7p8l0o1J5MN2k7j4N4j23N8K7N0j02
5150d6J8J8m5L4J7K8j13J49l2o6J53j41n2J73j45M3O9o%j63P2jK6o0M6J25j38
5177c7N3l8M1n1J4k3pM7R4j65NJ37k8l5Q4j0o3r4J2LO8K3r4Q4K4j04jJ7K1J22
5207I9j01O0o1j05J62m0L8r3o8R9K3q1%Q0j09R8l0m3J71k7j26R0j3l2J0LL9nj31
5236i3J98j05m5K4K1P7r3N9L7j15m4J52j41O3j5K6j66K55r7k4J03r0K1OQ6o5o9
$$ y = [-8, -36, 15, 29, 106, 27, 96, -81, -7, 8, 14, -15, -16, 17, 6, -32, -154, 6, 87, 15, 2, 71, -50, 90, 31, -14, -27, -14, 34, -28, 132, 13, 117, 55, 13, -12, -53, 42, 3, 144, -22, 3, 85, 13, -80, 24, -33, -20, -48, 31, -36, -20, -121, -80, 3, -2, 16, 91, -50, 40, 0, -39, -101, 57, -39, -40, -42, 6, 48, 2, 92, 69, 47, -59, -26, -25, -9, -35, 73, -21, -1, -78, -63, 49, 13, 17, 38, 66, 20, -2, -51, -34, 51, -43, -81, 5, -34, 114, -70, 32, 129, 51, 21, -40, -25, -21, 31, 4, -10, 44, -79, -21, 6, 56, -46, -28, -10, -55, -21, -4, 24, -89, 60, 28, -38, 115, -26, -78, 95, -50, -7, 62, 56, 56, -107, -35, -36, -10, -70, -24, 101, -37, 16, -22, 19, -32, -18, -41, -48, -1, 93, -72, -67, 70, 42, 7, 91, 81, 18, -76, -64, -61, 7, 30, -64, 20, 44, -60, -61, -44, -23, 99, -2, 58, -3, -108, 54, 14, 52, -41, -109, -10, 13, -68, -68, 12, -97, 1, -29, -72, 99, 72, -54, 36, 23, -9, 1, 4, 43, 38, -93, 105, 0, -45, -21, 0, 77, -16, 43, 80, -35, -79, 73, -68, -5, -20, 6, -160, 95, -2, -26, 77, -13, 8, 14, 100, 35, -34]
5263c4N1j23J64K4j10K3J7M0n3L7j5Jj7q4J16J27j56k2N1j89K8J03j6J17m1J7
5289E6q4p9J75j97K1J02j3RL0L9j21N5Q2n5J1n0p4K17j8j10p1k9R1J68k14l2l7
5316a28J03J3JK6l4N9M7j59Q1o9J02J9r1P3k8M1j39J16j29O7J50k27J00k4j16
5341a46P5Q3j08J04j62K06J1q8o0J37j81R1N3k0j0L9J01j05p1QJ74k19J33l1j8
5366dk6P0m8l7J13j24J69q3j14J10n9n4P8R0n7j00K01k11J3KJ0j1Q2K2o7k1n8
5393a14J60Ko4n2P8J7K6K7o1n1J37n1j11P2j2k2qj6J18n8j44J65m1k7P5j5nn4
5421b9QR4j4j38J58n7p0J64q1oJ14k61R4p4J72j34K3J57p6m7L1m8L0l6j1P6q8
5448d9L6N8Q9j44p9J26m9K2N6r4L0Ojo4O5P1m8K7j15J07lj3j8p4J76r5m6M9j06
$$ y = [-34, 17, -106, 58, 82, -28, -5, 12, 52, -1, 36, 21, 22, 5, -79, 37, 164, 8, -14, 37, -152, -124, -21, -37, 80, 39, 56, -28, -107, 68, -129, -108, -6, -19, -10, 20, 59, -62, -7, 75, 20, 31, -19, -93, 124, 106, -4, -75, -104, -13, 155, -59, -91, -128, -25, -12, -11, 15, -19, 40, 87, -72, 9, -60, 42, 61, -30, 43, 15, 56, -83, 33, -96, -29, 121, -106, -6, -30, -146, -71, 12, -96, 8, -154, 52, 63, -25, -85, 52, -129, -38, 15, -5, -15, 24, 125, 20, -51, -43, 131, -88, 45, 14, -4, -30, 40, -8, -45, 68, -56, 113, 30, -84, 26, -33, -87, -9, 81, 24, -76, 125, -86, -73, -71, -61, -72, 10, 32, -35, -56, -114, 46, 48, -16, -68, 10, 27, 53, 80, 19, -32, 105, 54, -57, 15, 3, -19, -27, -43, 75, 17, -127, 38, -3, -30, 45, 30, 25, -29, -21, 73, 59, -79, 79, 22, -48, 116, 35, 29, 143, -118, -24, -98, 74, -60, -37, 120, 44, -3, 28, -20, 10, -26, -37, 39, -49, -13, 45, 134, -10, -89, 37, -12, 10, 66, -28, 2, 8, 7, -57, 8, 79, 31, 58, -57, 50, 47, 34, 16, -58, 118, 23, -23, 26, -80]
5477h0O8lL1m4J6kn9M1K8j20K53q9Jj39J16J9m1OJ9q4N6M8n9q7J88o3j63Q1Oj6
5507g2L3n4K5Q5P3j48lJ34p3K3K4J4Jj13J6J26j01k1m6J29j86J25o0P4m4O8k1
5534Hq5k1J43p3n9J48J30k99J52L4j62J49J6r6J7o0R5m4k0L5Jk8j7j0J41l0p6
5561a1M5J8l3L7j25K1L0O3k6n6O2p1N6L0p1N7j40J47m9n9l0J18j70J82k7O1qo6
5589a5Q0j11rM7j7Q2j04O5J9j80K75r9L3M0o6K1n1k2P7j6j20K1J8R7j28L6O3M6
5617H2j05j7J9J18n1J3r0nk2J02j74J61p6L8L6K9J8k7j25k7J57o3J68j09m1J12
5643A21j22M2mj25M9K00j80n5P5J03j54J52j85J30j80J53Rm3L7J6Jm6L3k2L9J92
5669B36k50mj2ON0rJ4j21K14j35l2K3k7k6Q3l3n0J01Lr6O5M8j82Q7M3rJ00j37
$$ y = [-80, -12, -15, 16, -28, -12, -14, -73, -32, -4, -124, 129, 40, 41, -98, 18, 37, -4, 2, 21, -63, -7, 41, -18, -105, 83, 20, -143, -62, -56, -72, -39, -93, -68, 17, 90, -58, -61, 73, 0, 23, 47, 61, 62, -51, -35, 91, -10, -31, -77, 52, -134, -9, -69, 5, -39, 29, 8, -77, -98, 45, -28, -87, 61, 191, -108, 44, 78, -84, 65, 81, -15, 2, -58, 37, -7, -27, 8, 9, -19, -36, -46, 95, 65, -11, 34, 52, 19, 56, -69, -48, -18, 45, 19, -37, 25, -46, 10, 40, -31, 26, -114, 33, -16, -75, -105, 13, -157, 25, -2, 59, 51, -15, 65, -46, -55, -8, -25, 57, -47, 18, 37, -143, 132, 33, 66, 106, 40, 61, 10, -12, 65, 49, -71, -50, -32, 65, -63, -27, 36, 82, -23, -40, -21, 97, 46, 59, -31, -36, -58, 44, -130, 31, -45, -7, 29, 58, 76, 49, -76, -103, 54, -9, 159, 50, 9, 121, -1, 41, 37, -88, -39, 161, -19, -74, 1, 104, -50, 102, -83, 47, -133, 20, 29, -14, 23, 39, 40, -6, 27, 5, 44, 236, -14, -18, -30, -24, 26, 17, 31, -90, 124, -11, -43, -20, -47, -73, 10, -23, -73, 28, 31, -65, 0, 48, -134, -47, -4, -13, 87, -50]
5697e0J15J6j22P3j5O7L8j31p4J04o7J43j29P8K3r6k0jJ06n7jK0l1M3k0R3j8j96
5725a09J79r6n8Q1j3M0L2p3p0J12rqq2K8J50m0n6J9k1J05r6n7l4J02q6J40o6%
5753A4K9k2K8n1l7R8q2O7j6l2q4Q8Q0q4r2J11k4Kn2Q8m3L6L3n3j3N1j0J8r3N5
5783A0J3k2l4o7O6k1NK5O5Qn2K3j4p2J06l5n9J34r8j0M8o9O7l4PR3l0l0n3O9j03
5814f4K7qm7O3K2K2j09Q6q0Q8Jr8J53j71Q1O2l4j4N9J7k8n8L7qq6J81o0p3M2J1
5844A4J44k48N5R9j35K26j16J38j79NO4m4Lj15K5P0K1j02P8Q2o1n2L2M6o3m6L
5871e6Q4l2k5O6k0j83J12M4j1Q7o1nn7R3m7rl2O1no0L5K3k3pO2P8j21J3o3o2J11
5902a0L1J3p5q7J39K9n4K0kK9j24J26J2j3k6M1M6l2K1j2j78P4J07rr4l6N6J01
$$ y = [-50, 65, 81, -41, 32, 17, 84, 122, -9, -83, 21, -46, 97, -32, 46, 69, -27, -47, -48, 58, 1, 0, 20, -11, 32, 12, 105, 87, -109, 70, -26, -84, -3, -16, 24, 56, -17, -87, 25, 16, 8, -74, -46, 104, 64, 8, 27, 6, 111, 15, -42, -76, 26, -60, 80, 14, 14, 43, 21, 49, -2, -39, 59, -23, 44, 28, -4, -88, 0, 80, -4, -96, 15, -9, -7, -59, 29, -14, 22, 55, 2, -11, 40, 30, 48, -45, 10, 23, 1, -33, -100, -34, -55, -50, -25, 40, 48, -4, 19, 5, -67, 39, 4, -55, 79, -19, -29, 19, -50, 17, -17, -10, 83, 53, 23, -30, 39, -64, -37, -45, -92, -29, -7, 15, -94, -8, -88, 0, 1, -97, 56, -115, -34, 28, -6, -20, 39, 56, 28, -30, 7, -1, -87, 94, 34, -39, 3, 14, 158, -90, -35, 64, -71, 155, 39, 177, -2, 3, 67, 23, 26, -89, -64, 6, 27, -75, 3, 85, 24, -28, 4, 50, -13, -59, -56, 28, -4, -29, 37, 17, -166, -54, -10, -21, 66, 5, 0, -57, 36, -11, -20, -52, 9, 4, -56, -21, 2, -21, -28, 34, 112, -9, 4, -59, -121, -10, 21, 34, -41, -128, 11, 40, -14, 6, 4, 33, -91, 35, 47, 34, 8, 49, 95, 63, 84, 72, -106, -32, 75, 66, -28, -64, -8, 93]
5930I3l9j6KJ2l2m3p1JL1K4J9k5%N1m0K9M2Nq7R9Mk6N2L7j18Q2j59N8jJ31j36
5961b1P8p5j00rQ0L9p7Q2J45j23m1N9k3o1Q8n2Qn7R5O3j08K3NPl5jK3k5q6l5J21
5992a3j05NO8l4J06l4J9o3pJ54r8Ol1l6L1J2Ol4Q3j18J6P4o6R7q7P0P4o2p8M9
6022DQ7o0n5J06M3q0Lj23J13j5lM0o9M6n2l3K4o7J70j18M0O3j14P1p1J40j09k7
6050d6O9O6o5o6nN0j9L3qL3j24Q0j58J98m0J3N2j24k6J01qNJ4Pk5j3mO7J3j3j19
6081f2j4K7P7K5o5O1j27J09K0q4O7n9J16q8l5k5k5P8J4J2k6l2J10j10j8R2mo2
6109b8kJ32j29n8J10m2qR5k9p7K0mJ01l9p7Q5m2K0N6j30J25Rj08n6l1J22j91K29
6137E3q2O5j26l7J23m7J37q8o2MP6k9j5j5R3L7o0j6K4j9Mn3K1n3L0J03j24j0J
$$ y = [93, 54, 38, 40, 52, 20, -23, -94, -93, -62, -38, -19, -44, -44, 7, -33, -4, 38, 43, -44, 55, 59, 33, 85, 122, 4, 86, -73, -15, -16, 115, -21, 57, -18, -118, -127, -47, -8, -85, -3, 142, 19, -22, 37, 14, -47, 41, -11, -3, -60, 35, 98, -10, 13, 18, 25, -10, -11, 12, -13, -99, -134, -13, -118, -113, -45, -79, 27, -7, 12, -51, -58, 96, -2, 4, -27, -63, -32, -20, -14, -48, 35, -83, -67, 7, -59, 38, -49, 21, 95, 33, -45, 4, 91, 31, -24, 82, 125, 45, 48, -75, 38, 23, 20, 60, -9, 37, -15, -48, -24, -91, 79, -39, 1, 64, -50, 21, -50, 90, -19, -46, 23, 89, 24, -42, -47, 3, -16, 17, 9, 42, -82, -2, -160, 38, -2, 11, 63, -61, -87, 14, 6, 11, 25, 32, 7, -6, -10, 57, 70, 57, -62, -76, -49, 28, 53, -12, 49, -78, 31, 51, -33, 34, -25, 91, 3, -32, -57, -82, -4, 10, 22, -4, -36, 74, -36, -54, 38, 34, -28, -30, 102, -27, -85, 25, -17, -25, 70, 41, -36, -16, -20, 81, 42, -35, 50, 8, 28, 84, -46, 79, 88, -20, -76, -107, 15, -176, 53, -29, 36, -90, -127, -4, -51, 86, -2, -64, -60, 16, -13, -28, -43, 50, 87, 27, 11, 35, 16, 20, -33, -12, -65, -35, 68, -56, -66, -65]
6166f5Q7J39k37M1O8j54J64rk4Kj04J2QJ52j15Q4R4j09l3Q9j01k3O2o2n8P9r0
6193a03%L0J26j46J49m8P3m1o1%K3Pp4O5P3k9k7K3o2j4O9q2P1NK9o3m5K8L8m8
6223c4P2j26KR3o6R2m2l9J33j33M4j5QN6j4pn0p7J18n3M5K7K5j80J23N6j47kq2
6252a73J17j09J17m8o0R6k0J20m2k7j7JJ3M9p6j7J21J8j51J42q8J39j41m0j5L2
6278e9O2J4n7n4J00l6J00n0o3mL0nOM7q0J9J64r3p0N1l1N4q9J2rk0OK3L0K5n2
6309b9O5m5j1N0p6Q8k3L6K6q8nl7J4Q5q3M3m1J16j30L6q6J43oj06R3j00R8j21
6337i4Q4n6kR1j9L8K6j08j33K49j64N5n9L3K0P8Lk53K00J7L4m9N7l8m1l1N2m4
6365e4N6pj05O3Q6k0J7K9n0j6Pj3Pm6J31K3q6N2Mj48Q7j36K9K2J02n6K8O5n6j
$$ y = [-65, 22, 161, -76, -35, 33, -121, 43, 34, 10, 12, -92, -80, -72, 80, -35, 49, 143, 34, 1, 90, -11, -34, 28, -34, -92, -13, -103, -103, -73, 53, -93, 56, 8, 81, 40, -21, -21, 2, 9, -65, 0, 73, 44, 17, 40, -22, -36, 33, -49, 22, 27, 56, -7, -52, -24, 14, -34, 38, -88, -86, 7, -59, 33, -9, -48, 85, -48, -4, -19, -11, 45, 31, 24, -26, -103, 15, -38, 7, 34, 59, -121, 2, 58, -89, -91, -173, -56, -165, -48, -96, -156, -60, -80, 40, -2, -29, -46, -45, -32, 17, -59, -76, 45, 63, -88, 54, -34, 105, -36, -76, -91, -59, 3, 17, -40, -94, 6, -30, 70, 20, -43, -47, -17, -22, -16, 31, -49, -30, 134, 41, -29, 22, -9, 45, -44, -32, -41, -61, -55, -32, -2, 23, -29, 36, -9, -20, 30, -46, 42, 19, 55, 81, -7, -12, -49, -35, 50, -33, 10, -31, 85, -45, -9, -95, 48, 42, -64, 29, -71, 27, -94, -10, -66, -68, 23, 4, 42, 68, -40, -173, 76, -88, -33, -92, -59, -39, 39, 42, -211, -11, 6, 40, -9, 48, 10, -31, -62, -10, -54, 2, -5, -110, -47, 39, 19, 36, 65, 15, -1, 6, -7, 0, -46, 85, 108, 22, 74, 78, -70, 17, -119, -90, -68, 34, -22, 6, 71, 15, 14]
6395A4k2j3Q3j7j19R2j12J74j33kM0O4q4Q2J2p3l6M9J3J5j25N1k1N3R4j96J88
6422G1Om3j5o4l4J45j60J05L6L8j14J05p6l4R4p9O0k1K8k7l2J9N7m8o9J7J20m0
6450D5r9J44k83K31K0J8o1l7j4O6r6M7M4O6k3p8m1j7Q6Qo0pM3m2N1k2q0J16N2
6479G7L1m1r5J19J7m6j53J23o4O5r8N1J07m4l0p0LJ1P8r9J11j29O2j0K8O0R2j78
6507b2QM9m6M9ll2J0j28P9K7J00r4l9j9R3J2r2R5R8j68l3P0J4n9L5p2O7M9J9J
6537F8j10J09m3O2r2Q2j39N8J6j3L4N3j36MP8o9M5L7K0j12J40l3J2j07J4Lo5M3
6565d1r0J77q2R7n1L1l6P5j8j72J75k8n0j0n9M6J3l1J13m8L0n4K3r6J63r6O0l6
6593Ek1j3O4o9J3On3j9K01q2l9k6K3Q3p9O6j6j18O4m5J39j62J22r4Q9nk4j5L5
$$ y = [14, -8, -21, 62, 45, -74, 18, -94, 80, -53, -55, -15, 49, -35, 47, 59, -14, -50, -1, 12, 27, -98, -47, -68, -15, 79, -117, 71, 77, 34, 19, -45, -79, 66, -94, 11, 47, 85, -29, 76, 0, -34, 60, -19, 41, 20, 48, 21, -11, 8, 65, 17, -52, -35, 85, 45, -54, 90, -193, 38, 58, 76, 15, -22, -36, 30, -66, -19, 25, 91, 68, -10, -51, -68, 18, 26, -34, -41, 2, -40, 11, -11, -91, 25, 77, 108, 67, -28, 91, 108, 62, -91, 32, -32, 33, -65, -14, 93, 49, 19, -51, -48, -37, 41, -58, 53, -76, -14, -24, 4, 64, 156, -22, -14, 35, -11, 38, 35, 3, 13, -115, -36, -9, 91, -3, -42, -61, 32, 44, -48, 47, 145, -23, -56, 14, 28, -31, 4, -68, -1, 48, 67, 68, -42, 67, 24, 86, -6, 76, -63, -5, 11, -2, 32, 85, -51, -47, 31, -38, 7, 44, 64, -48, 92, 59, 71, -36, -22, -19, -84, -41, -131, 46, -36, 61, 10, 41, 5, 80, 62, -110, 65, 37, -13, -23, -82, -36, -23, -54, 59, 11, 41, -13, 10, -86, 77, -19, 41, 5, -16, -29, 35, -34, -21, -15, -68, -87, 114, 32, -7, -33, -10, 73, -6, 60, 44, -74, -10, -55, 84, -78, 44, -50, 39, 34, 10, -5, 30]
6622C0on6K5k1j8K4k7k5P6LN9j73J29q1J54j88J07N3L0r4K7k4k0m4N9r3N7j2J4
6651c5J39j53P7p0k6k7P0n8M4J7Lj9j03N4j1J95j68J57q8j03M6J17m4R2j26K4
6677Dn8L6m2O7j6n6N3k0k4Q8MP5n6j33O5j0J41j46J20J8j62L7m4O4l7M9mp6L7
6706b6P0k9p1JKk3L2P9J6j78N6M0P2r4P6kJ0k1M7L5q2o5L6k6R1j06M4l4J3L5P6
6737G4L8q3L8j28l6Q0J0P9Q4n9j37O9l3J14Qj14k4J22j68m3l2J90o7p0J57j03
6763c4Q7q8J3p4P6j5oK8l1Q5j37N1J0J14j77P4j9J9p0L0L7L6NK2q8J41k3n3J45
6792A58k02J12m8ol2j31K98m6j28J5L4J5N2r6p8J27k7J5K1m7O1j02K5J1r4J73
6818H0l4Nj40K8J68j02%j8k5Q5j19N2L2J23j37p0j9O9M2M0K6j24M2M8mm6M4m4
$$ y = [30, 24, -32, -7, -28, -46, -22, -49, -74, 2, 5, 64, -109, 20, -61, 93, -95, 12, 65, 95, 1, 28, 4, -16, -60, -1, -94, -37, -49, -35, 104, -49, 28, -42, -68, -95, -25, -83, -39, -22, -19, -38, -141, -87, -98, 97, -71, 86, -2, -105, -59, 58, 14, 106, -20, 4, -54, -18, -60, 7, -9, -65, -12, -32, -56, 32, 36, 111, 55, -78, -13, -23, 118, -28, 92, 110, -52, -15, -59, 5, -32, 17, 13, -63, -26, 44, 15, -56, -55, -53, -76, -44, 35, 51, -127, -71, -31, 41, -53, 23, 21, 31, 10, 57, 92, 10, -55, -19, -45, 46, -60, -16, -50, -37, -2, 74, 112, 29, 67, -61, -97, -17, -7, 72, 156, 97, -40, 29, -4, 110, 118, 4, -20, 102, -66, -109, -141, 49, -18, -88, 69, -34, 53, -35, -22, -96, -20, -35, -41, -13, -44, 41, -96, -45, -35, 79, -98, -24, -43, -24, -94, -64, -27, 9, 14, 36, -52, 89, 66, 13, 158, -44, 68, 20, 14, -18, -149, 149, 103, -25, -10, 24, 39, 91, -5, -83, 44, 17, 32, 53, 6, 67, -35, -10, 1, -93, 80, 46, 51, -89, -61, 107, 5, 5, -13, -38, 47, -72, -20, 12, 135, -2, -72, -91, -22, 20, 60, 86, -38, 4, 52, 48, 2, 46, 2]
6846Bm2m9P3q8Q0L8n4J15m3o5K2j3M4j32O7MO7k1j3rk9Q4k5jJ9m2O5j3o7M0m8
6877c4R5rK2j00N7n8M0j18M7J5p6l2J51M5j5M3M9j73J81j64J01r6O3m4OP0j71
6904a05J5O6J6M0m0L2n5Q6R6j99M1J1N1j2j22L9J6q2J09j6ONm3N4j3j9O0j3j35
6933a11J87r4KN9j05j5K3N8n9P6m3R3j74M6J02m2J6M0j22M3J75j45pP8q7O9k42
6960a79O8M1P7J11j04j7L6m2Ol4JL7j9J22j06k6o1J62m4LL8r0L1p3R4j9p6J19
6988E6j38R5l0J30j72N5M1L5p4P0j3j29J7P2KO1j08q8K6L2JM6o5N0l5J32m6J5
7016C8J4j34N5j27Q7J0r2O6P1n0P2M2n2NL5j59R5q%m0N6j4j08K60m3q5O2j03k1
7045f8Q9q7J42J03j61M9qm0K7o8N2k0l4P6m9m9L8p0J29M9q0q0J61l5j09R5j52
$$ y = [2, -40, -89, -16, -104, -24, 14, -40, 75, 32, -33, -11, -24, 20, -112, -45, -41, 26, 5, -8, -17, -46, 38, 13, 12, 31, -11, 54, 41, -26, 14, -34, 61, 52, 74, -26, 31, -27, 13, -105, -58, -43, -119, -151, 0, 45, 30, 73, 122, -51, 130, -34, 67, -29, 34, -10, -4, 66, -105, -90, -24, -8, 32, -8, 24, -31, 55, 151, -48, -7, 4, 55, 43, -79, -40, -24, -106, 3, -13, -7, -2, -45, 9, -4, -23, 37, 24, -111, 76, -18, -16, 43, -62, -77, -54, 4, -55, 21, -22, 71, -103, -57, 45, 3, 19, 59, -63, -20, 155, 10, 3, 81, -6, 63, -179, -111, -70, 7, 118, 14, -3, 33, -9, -3, -37, -36, 1, -18, 104, -2, -28, -89, 73, 29, 32, 70, -20, 11, -62, 32, 13, -63, 56, -82, 13, -17, 113, -59, -4, 37, 72, -2, 68, 55, -74, -57, 15, 17, 78, -30, -118, -92, -60, -59, -13, -78, -28, -63, 69, 23, 38, 52, -82, -27, -154, -67, -57, -149, -83, -12, -62, 10, 52, 0, 5, 40, -119, -24, -32, -32, -72, -16, -30, -138, 122, 79, -6, 56, -47, -68, 21, -66, 76, 179, 18, 67, 59, 19, 46, -22, 30, 10, -24, 52, 3, -46, -8, -78, 51, 100, 20, -60, 101, 66, -43, 52, -100]
7072a00M2J09q7%K1M4nj9k9J7Lm3R4p3j0J26r0R8q7j3R4j52J60j16n6M2l6J22
7100E6j16O0o9O2m6R7k9N9N6p2q3R8l2pK4l9J00j95J50m9k2M0K9j16J25n5J8%
7128D4K2l1j10Q6N4K7k4J0j60M6R1M1L7j47j8k5M7Q7k7o0KQ7p3oO6m9o2Q7n9K3
7158Fm2OM1J02o7J26j60J52j36r2QPP3n3m8Q1KM2j20L1PP2pj9M4o1J0M6j8Rl8
7189DQ3k1N6n4j06k7K7q4J06M8n2j30J21K9m9q4J06R4j03P8O2q3J02k39J40l5
7215a1J13j28MN7p8k5RJ48m3r9J06o4Q0j2j44P2N4q1M2o8k00K74ko1O3j15P5%
7243c4M3m1L9k6J27jq0m7n7QL4N4kp9J8j1P0L5o3K2j7kp3J48R9j76j39P8J42j42
7273g3o2L9R0q4J96r2j46J88K4n9r2L3l3J64l8n8M6n6L9K9p7L5p7R6k7o8J22O8
$$ y = [-100, -58, 51, -36, -36, -15, 29, 24, 5, -24, -7, -4, -47, 47, -26, -36, 90, 0, 98, 11, -2, 92, -60, 100, -16, -72, -30, -66, 56, -60, 0, -69, -7, -53, 44, 15, 74, 130, 58, -25, 73, 41, 34, 58, 19, 119, -76, 74, 25, 3, 43, 72, -44, 81, 26, 44, 44, 66, 35, -75, 11, 65, 92, 68, 78, -82, -36, 55, 96, 133, -14, -32, -57, -10, 77, 50, -10, -8, 79, 6, 0, 66, 17, -45, 42, -17, 6, -36, -30, 11, 113, 46, 172, 12, 164, 28, -64, -56, -49, 24, -29, -77, 4, 6, 48, -72, -41, -34, 38, 31, 12, 56, -5, 5, 51, 33, 42, 4, 87, 66, 122, 68, -38, -65, -38, -122, -16, 32, -20, -150, -29, 0, -49, -133, -27, 67, -36, 42, 104, 21, 123, -116, 24, -11, 102, -26, -22, 35, -43, -68, -59, 89, 46, -53, 53, -11, 69, 57, -87, -15, 39, -42, 0, -68, -268, 6, 4, -57, 6, -109, -34, -34, 9, -32, 7, -19, 108, 107, 27, -20, -77, -69, -35, 19, 17, -62, -44, -55, 15, 50, -13, 9, -8, -10, -83, 65, 164, -12, -151, -73, 69, -73, -135, -96, -6, -90, 106, 14, -132, 56, 80, 21, -71, -38, -71, 93, 55, -3, 43, -13, 26, 55, -22, 13, -64, 32, 5, -63, 59, 127]
7301A27j18o6R3p7R8lj45K03j59mL9k0J00o2p0J70k52K00j55O5J34k2k7j90J69
7326B8M7j9j03J80j10p6N7O4m3O8N7j61nM2k7o1k6K95j39j28M9O5m7j6k9J7o2
7353h3PJ44p8M1m8RJ19j92J83j35J08q9m8Q7q4Q1n1M8m2j3N3j00J1NJ9R3m9j7
7381b1O7o0L1MQ4j06M7L1p8k3Q2q5J07k8p8J2J5r6Q6n5L6o4J57j10J3R9j51R8
7409A4K6n4L3M4j11p6L2J6K6J23J9k0J7l8N3j7j06K0j08K06j98P6n6N9j08J11
7435a7P1j57J35k9N8j12j3o8J44P8o3n1N2lJ0n9L5m3J01l9j70R2K3J7M6r3P7m8
7463b6N7o9jL8m6J6j30J51r9J0J82o5q8P2J58j74l0K6p6N1K4O9j14l9O9J5K9P1
7491H1o0j54J18P5m3M5j20N1J5K2J1n5mN1KM2m6K5K3K0j96P0m5P7P6n6m5n5J47
$$ y = [127, 9, -57, 36, -41, 57, 54, -91, 112, -47, -51, -12, -32, 68, 6, -64, 106, -146, 54, -101, -36, 98, 76, 49, -141, 28, 75, 56, -47, 133, 23, -53, 4, 68, 25, 93, 150, -11, -16, 26, -1, -62, -88, 207, 68, -60, -11, 54, 7, -9, -38, -21, -83, -76, 68, -10, 31, -17, -8, 111, -81, 102, -33, 75, -14, -62, 25, -59, 22, -29, 19, -23, -36, 17, -83, -72, -67, -48, 45, -4, -21, 46, -14, 17, 21, 105, -1, 46, 77, -1, -24, 58, -27, 80, 52, -26, -14, 1, -95, -9, -64, -28, -92, 65, -45, -32, 67, -84, 14, 40, -14, 19, 63, -48, -124, -92, -76, -50, 73, 92, 72, 89, 51, 104, 87, -19, 1, -107, 99, -99, -23, -79, -20, -128, -17, 54, -103, 32, 3, 61, -51, -64, -132, 12, 90, 27, -24, 28, 25, 35, -24, 11, -32, 69, 30, -140, -48, -25, -8, 38, -55, 22, -26, 31, -38, -39, -1, -47, -31, -161, -10, -109, -99, 83, 18, -70, 2, 160, -14, -44, -18, -94, -43, -19, 50, -64, -103, -34, -19, 10, 81, 21, -133, -15, 60, 17, 62, -58, -7, 8, 30, 41, -14, -18, 33, 35, 77, 31, 56, 79, 99, -97, -27, -72, 5, 81, 25, -20, -75, 72]
7520G2k4k4j30J72j21J3K9N7r2J0j0P4Q7l0r1L3l7L6N6l9p6k1Q1p2J32n5m3MQ8
7549G9j18P5q1l4P9j4P4L9j53J39m6j22J35p4N4m6j2P3m8N1j31L3N2m9l4R9n7
7576c7l9J54m7p8Q1rj52J39k2K6J7j21J10oL0q0Nq1N0N4K3p1J06j22P7J01O5k03
7604c0L7O3o0j53J39N7p5J17j85J52oo6K6j01P1l2k7M0M8Nj05J20j25R4O4n9P9
7631H8q3k3P1j10O2Kq0P2kl7Q8r1MM1l0L2r8J28L1j98J34l8P6k8p2l5J29mNj4
7661B0j7q7Qj0J03K0j5p2R6p3J10p5q1L2J33K0k58oJ29J14j41l0J11P2n0o7j14
7688a28J34J4k2Lk6O6p2M1j0l6rO0Jn5M9j62J97mL1rp6o1J13n6q7K0J37N2l1J2
7718H6K5j4j07M7j05K02o8m7ln4mn1M4P3j7J22j65J36j55M6k8MM1l7N6j4qM1l5
$$ y = [72, 48, 24, -106, 66, -55, -42, -13, 44, -48, -38, -48, 26, 113, 83, -8, 25, -12, 24, 80, 41, -35, -56, 25, -47, 85, 30, -13, -9, 79, -39, 36, -45, -79, 0, -14, 60, 99, -54, 85, 39, -83, 52, -22, 32, -14, -26, 47, -1, 50, -81, -48, 4, -45, -79, 20, -37, -76, 78, 31, -47, 34, 25, -127, 12, -10, 16, 33, -88, 22, 16, 46, -34, -29, -110, -60, -6, 17, -54, 52, -70, 7, 108, 173, -30, 7, 70, 10, -143, -4, 53, -22, 95, -90, 62, 56, -10, 16, -85, -14, -46, -73, -33, 15, 20, -85, 35, -90, 4, 68, 9, 88, 5, -18, 53, -57, 5, 7, -73, -1, -3, -40, 48, -43, -39, 2, -28, 4, -94, 34, 65, -133, 1, -37, 39, 11, -61, -96, 33, 29, 34, 20, 3, -84, -76, -86, 17, 37, 22, -50, 46, -27, 83, 8, -73, -41, 92, 112, -146, -152, -23, 91, -50, -80, 31, 103, 53, -14, -128, 6, 20, -2, 1, -25, 41, -31, 10, 0, -36, -45, 15, 16, -39, 10, -152, 45, 41, 72, 63, -13, -74, 39, -17, -104, -84, 53, 105, 74, 86, 111, 97, -10, 37, -68, 134, 66, 19, 16, -38, -42, -93, -49, 24, 7, 129, -36, 100, -55, -9, -37, -33, 8, -29, 27, 13, 5, 46, 11]
7747A1L7p5R3j14K4PjO2j51oJ41j0k0L9r6k2L9OO7R3j06J34k14O3q1J09K8n4J53
7776A56j44j3l5j9Q1Ro0r8Q9l0Q8r7L4m8n1J04N4l1J37j69J51j2j46PN7k9j5N6
7804B6j19J26k9K4n5p3J2L8L4n1O6N0j15Q1p6j2Q4l6J14j08O2q2J28j93J17k2
7830il3K2R3j26J25j7q8P4J11l7r7j03M7J25Kjl8l3Q1K4k42P8O0n5J16k3q2rM4
7859Ij3N2K9r3j1R8j29k0k5qN3O7j45L7n3K11j02J24j09J10j00N5n3N3p7R2J2
7886F4J8q6M1m9M9o9M5kOR5j62J1p6J06n5J05m1pPm3P1j01P3K7n3J2m2R1q7jP0
7917A7m2k2O0L1KOq1pL1pl7O8p9J35r1R3j02l9J69p7L3l9KQ2j39j7kJ05p6Pl4
7948e0j2rP7n9J37j34Q5r0R4j30L1N4Pk9J63j52NP1m8k3J23j11j8R4r2m2M0K6
$$ y = [11, 48, -27, 66, -48, -24, -17, -18, 44, -107, -113, 28, 18, -2, 37, -59, -81, -42, -36, 31, 124, 18, 152, -62, 1, -80, 29, 57, 3, 156, 12, -1, -36, -55, 26, 35, -25, -123, -34, -64, 24, -73, -39, -87, -138, -34, 20, -11, 126, -43, 108, 96, -50, -43, 14, -15, -30, 26, -93, 33, 4, 28, -27, -100, -88, -50, -16, -67, -1, 49, -66, 15, -61, -73, 11, -25, 89, -19, 43, -39, 89, -104, 13, -9, -42, -20, 73, -53, 72, 55, -33, 41, 152, 115, 18, -85, -38, 87, 89, 88, 50, 17, 98, 122, -120, -42, 18, -37, 79, 56, -26, -35, 9, -4, 48, 77, -16, -27, 71, -58, -78, -103, -111, -58, 9, -136, -99, -152, 59, -43, 81, -28, 82, -18, 37, -16, 37, -40, 52, 64, 82, -4, 37, -12, 37, -32, 13, 11, 17, 112, -50, -39, -115, -9, -64, 41, 0, -7, 0, -43, 28, -73, 0, 27, -26, -14, -56, 35, -52, -53, 17, -25, -47, 13, 44, 46, 52, -29, -36, -5, -12, -49, 19, -60, 75, -16, 77, -25, -64, 105, 28, 61, 22, 24, 106, -33, -50, -52, 53, -23, -16, -50, -62, -71, 6, -53, 84, -50, 35, -55, 39, -91, -60, -6, 1, -28, 135, -17, -12, 59, 11, -12, 111, 0, -18, 76, -16, -58, -18, 8]
7976HlO6r4jN8j4l4O0m0q1J40l4n3N5o9K7m9N0m4O3j34K31j05m7oL4k2L8qJ4p0
8007f4L1N0K4l4M6j1q9N9jRR6j19m1n9R0k4J00p7j06K23j46m1J71o1M9q0Mn3J36
8036H2l5j82K35k26J11J00j45K5mQ3l0oj29J02l0j9J50j5n3l7O5q2J1mn5J22p6
8063d2QL0J28j65K7O6p9JJ00j64J68p8j11J13K9o5p5J07k4J1j7JL1mN9l9r7O9
8091a2J40r7j38R5K5J4qm5l2P9k7M9%J10j48M0j7k4M9q5P7m7m7pR0L9q3R8j49
8120f1j24J67j48J60j5n5J43k0q3J04k7n2p7J05O2j46J85j35JM6j32J48o3Q4L6
8145A03j47P5o6m8L9J38j81M0Kl1Q7J0q4J30j38R3k6l6o0K8J32j03M9%P8k73K70
8172H1j81K37j16N9qm1q3R3pO6Pj69N0J00k9j87L4J16j1
$$ y = [8, 5, 71, -23, -24, 34, 20, -14, 46, 6, -75, 65, 31, -22, 33, -36, -9, -58, -8, -52, 11, -123, 108, 3, -44, -50, -16, -38, 0, -8, 6, -64, -33, 17, 41, 7, 53, 42, -47, 12, 11, 20, 116, -3, -44, -103, -13, -37, 63, -14, -120, 103, -43, -84, 87, 26, 75, -5, -1, -54, 82, 47, -135, 100, -126, -15, 85, -60, -35, -39, 44, 14, 8, -121, -19, -49, -68, 82, 67, 14, -23, 42, -40, -29, -33, -88, 34, -42, -34, -4, 124, -41, -14, 52, -27, -26, 74, -90, 78, 0, -111, 2, 31, -34, -109, -2, -26, -15, -32, -31, 0, -4, 55, 16, -81, -12, 128, 31, -107, -12, 13, 27, 19, -26, -58, 21, -6, 43, 43, 153, 5, 45, 28, 4, 53, -32, 45, -2, -49, -56, 34, 73, -10, 88, -61, -185, -18, -166, -6, -21, -76, 67, 47, -36, 68, 41, -11, -88, 17, 79, -67, 118, -17, -16, 30, -102, 46, -17, 67, 103, -44, 31, -35, -83, -44, 94, -87, -47, -45, -76, 11, 21, -63, 67, -71, 22, -4, -40, -100, -72, 60, -43, 6, 6, 84, -189, 81, -100, 137, 21, 80, 72, 31, -52, 41, 34, 100, 107, -62, -12, 88, 59, -128, -94, 22, 11]
8191A1
$$ Imaginary data points
##PAGE= N=2
##DATA TABLE= (X++(I..I)), XYDATA
0@%%%%%%%%%%qJ6j6J6k4L2m0M8n6P2q8J04j20J36j60J92k24K56k96L42l90M43
32B35n02N72o49P30q20R18j025J145j277J421j576J746j933K136k358K601k866
49a502L158l481L835m225M660n147N693o313P024p845Q808r957J1352j3093J5337
64H304j8351K2635k9246M0886o7314K35110J4687l69530K00638j9057k58976Q7371
76a52843L46769r2504j71770J43227L5604k86668J4623K44915n3550j38583J56668
87D5888M6878k04772j8495K00732j3151j02552J20601O8454k00108o0861J43335
98B5949j8281p7839J38511R2425j38459p3481Q3129m5078j04704J02549J12058
109I6779r2868l8849Q2729n1798j06049O9200R0793n2854k0991Q2259k5578j08683
$$ y = [0, 0, 0, 0, 0, 0, 0, 0, 0, 0, 0, -8, 8, -8, 8, -16, 16, -24, 24, -32, 40, -48, 56, -64, 72, -88, 104, -120, 136, -160, 182, -208, 235, -267, 305, -344, 386, -434, 484, -541, 604, -673, 748, -828, 918, -1015, 1121, -1237, 1364, -1502, 1656, -1825, 2010, -2215, 2445, -2702, 2991, -3322, 3702, -4143, 4665, -5292, 6060, -7033, 8304, -10047, 12588, -16658, 24228, -43086, 192024, 206711, -162819, 37819, 18762, -240214, -152843, 193926, 101422, -70348, 72879, 108483, -178185, -163562, 81353, 27803, -110780, 45888, 92766, -112006, -130501, 70231, 57080, -45472, 75129, 143583, -56525, -117386, 25949, 7668, -70171, 68340, 160765, 22306, -51175, 31954, -13124, -117828, -15279, 96779, 3911, -34938, 47791, -4007, -110056, -40856, 49937, -2917, -23908, 58351, 32773, -75910]
121g5910L4859P7791m9650j3548Q9952n996r0040J4394N6944m6013l2289P7730
133C8224J4781q5148N989N6208m6647l1819P3434K2738o5360k857M2767m2081
145a9771m5894N9951L7602m5682J0819N1012l6079m8695L3989K2167l9512K894
157a7199N2001j2469m3248K8582K3783m3287o901M1108j3488l8556K0957K5266
169A6549k9532q307M1741k635l8591J5613K1123l2426r186L6522K254k4592J4565
182C098K1242k5269j7073K6186J693k5660J3497K2215j8718j1235J9647L57k1941
195a1961M752J7877j2828j2459J9462M584j9199N783J5204j2157j0714J2866L705
208D915j3943K942J6030o391j0142J2217K701j4969J633J0683n827o097R359N014
$$ y = [-75910, -41051, 36740, -12910, -26458, 63494, 57498, -32542, -18148, 38796, -7217, -39506, 38224, 53005, -32143, -26154, 30054, -16593, -48412, 25022, 47760, -17600, -20457, 22310, -19771, -65665, -5714, 31888, -13794, -2975, 48037, 11958, -36737, -2748, 19419, -20093, -17199, 34802, 22333, -20915, 7667, 31450, -11837, -18738, 22370, 8882, -29674, -8717, 16549, -12983, -21290, 20451, 17816, -20775, -5162, 15961, -16465, -25651, 10871, 13125, -11467, 3098, 24340, -929, -18002, 8184, 9877, -15783, -2286, 19929, 1211, -10024, 9623, 9980, -11961, -7209, 10668, -2160, -14619, 4843, 9427, -9772, -3989, 11215, -942, -11656, 1210, 4915, -9028, -6086, 9944, 3553, -6589, 5628, 8329, -6640, -5007, 5676, -151, -6248, 3111, 8125]
222H125r829j025R240n257q667P505L573q137R68P472k393n384M081L702o455
237b481j903O981j720n381N141L203m855k45M034r78l952J833L022l666j484M282
253A831p89l419K397J749k570m68K072J52k079K70K104j532j116K267r0j466J020
270C33P09j044l81L91L80j018k23J442o32n87J232j54p02L01n8p0q3n4N95l15
290F2k28P22l68l90L52k08J5J51l77K84Rl53M02q7k89M58m8M3L9k92K80j79l02
313c04L99j49k92N13N7j88J60l2k58r8j87K36J43k69M91ok72M56l53p1k5j26J37
336c8PLK41k19l6M24l35k91K69j25j66L88j06k4J9M4M9l39M0L32k49j03N39l26
360bq9K20j68j52J15M9J05k60L17K71m82l2K19k63j34K95P5j65L5K86Q3n80k9
$$ y = [8125, -1704, -2729, 6511, 1254, -7413, 92, 3665, -4472, -3504, 3968, 1575, -3809, 272, 3974, -2481, -4384, 2597, 877, -4504, 637, 3840, -1015, -1260, 2774, 1796, -2156, -323, 2699, -967, -2451, 1831, 1042, -2377, 20, 1769, -801, -1269, 803, 955, -1124, -854, 1250, -282, -1398, 869, 779, -687, 333, 1042, -2, -383, 8, 388, -630, -853, 589, -43, -630, 602, 448, -254, 47, -11, -81, -164, -218, 377, 62, -166, 556, 188, -202, 150, -58, -43, 108, -269, 15, 24, -329, 73, -14, -303, 155, 107, 150, 189, -103, 177, -2, -304, 95, -54, -346, 167, 224, 36, 196, 164, -94, -192, -379, -143, 0, -269, 222, 216, -56, 400, 47, -24, -49, -175, -38, -31, -28, 213, -6, -42, 382, 47, -244, 25, -100, -266, 122, 16, -8, 11, 55, 104, -235, -195, 137, -112, -215, 324, -2, -91, 129, -39, -191, -76, -27, 78, -182, 135, 406, -76, -108, 111, -152, -286, 9, 84, -81, -46, 240, 323, -257, -286]
383b86M11n46J5O38j60q8K77J08k19l39K00j5m49K97M35j83k08O20j96m08n4K26
405G6k85j64M14K08m73J82M48m91l35M43O6l80L6M95q9l26K26M35n30j04M40l60
427f8l15L39L20k18j57M96k22n98K73K97l95Q6N47r7m39J04K06m60j64N58J98
448B91m93L11L58n72k45N12J26m80J61L84m07l95N68J34l35R5M56n61l57L02K24
469G7m29J88N37k00m77K79K26o29J32N77p9l22L62jn97R5N33j29l54J98L35n81
491b59k8M41l6m60M22K28l77k99N04l1k69K83K67l93k18L15j17k95K10L48k28
512Hj37L65j84l96K02K26%m3J28J32n90J16K98j39k04L97m3l51K23J71l02j37
534b60K71J35k52r7K47m4j92K45J28k23J3J47j75j13l8M64k36jJ61j69j80J06
$$ y = [-286, 125, -421, -406, 232, 72, -16, 261, 369, 150, -189, 11, -4, -453, -156, 279, 96, -112, 508, 312, -96, -150, 76, -209, -373, 41, 249, -224, -42, 406, -85, -420, 23, 89, -291, -255, 240, 151, -175, 51, 486, -44, -148, 292, -68, -383, -44, 276, 58, -99, 397, 175, -423, -150, 147, -248, -162, 385, 288, -151, -47, 159, -301, -465, 93, 291, -202, 109, 467, -105, -350, 162, 288, -192, -31, 353, -54, -449, 119, 253, -82, 13, 469, -92, -449, -147, 77, -352, -164, 373, 173, -304, -25, 201, -428, -296, 281, 202, -120, 242, 241, -356, -261, 272, 143, -211, -13, 322, -259, -287, 154, 118, -342, 80, 308, -69, -368, 136, 105, -164, 119, 386, -7, -225, 90, -27, -322, -112, 236, 8, -129, 236, 52, -344, -142, 84, 84, 41, 169, 301, -289, -173, 125, -14, -218, 179, 136, -215, 8, 179, -123, -260, 11, 146, -106, -203, 44, 0, -192, 53, 181, -42, -29, 118, -57, -170, -208, 256, 20, 19, 180, 11, -169, -63]
556f3K18j72o7J53P2j94j04J58k05J44J65j41n2l2K34k49QK56k5j40qQ7p2o6K4
581g1R5j40O5J64j32Ok1J27k14J13K9Jj04J02P4j97M3J37j21J26l5n3j39Q6J21
606F2n0m9j6J12o7q3Q4j8l2p7J28o0m3J35N5n7j2Q7r1qJ6K8j23j6J87j43o7P3
634d5L0M8p0J54q3o4O9m7N1j24J61r9L9m2p9J02K5j17J99n9m3M6j66J11O1p3p0
661h5J15j4M6p9J0n9P3m9N4L2n7P8q3O0rPJ3j41J44j24K14j44J5n0k3R3j07Q7
689A7m7j6l2O6rl4j3k1O4N3M3j46L7r3L1Q5L8JJ1l7jp3LkJ16j13R8k4L1Nj19R
721g2jJ18j49O2O0r0O8p7nQ0jK1J2r1J09K1o2l1j30J37N5J6j45J06m3l8L9j7K1
750b7K6k2lK9R7l9r9K7M2ln8J5Rk7P0k1Lj09O3oK6R0q6J37n8l7q0K9J27r4J15
$$ y = [-63, 155, -17, -84, 69, 141, -53, -157, 1, -204, -60, 105, -36, -88, -120, 114, -135, -127, 129, 104, -36, -44, 43, -29, -95, -71, 24, -116, -51, 113, -19, -13, -34, 93, -121, -8, 21, 22, -82, 20, 94, -103, -60, 77, -44, 82, 47, -6, -145, -59, 62, 12, -37, -53, 59, -8, -91, -7, -25, -57, -134, -6, -66, -109, 26, 81, 24, 12, 99, 8, 0, 16, 44, -79, -95, 92, -51, -118, -45, -15, 33, -37, 117, 34, -30, 39, -8, 43, -81, 80, -19, 20, -22, -101, 1, 26, -91, 108, 49, 6, 52, -114, -3, 58, -15, -85, 30, 16, 62, -17, -7, -66, 7, -42, 12, 44, -13, 65, -18, 42, 33, 40, 53, -88, 56, -68, 146, 2, 17, -33, -56, 37, -70, 17, -30, -46, -78, -12, -21, -55, -68, -89, -25, 28, 71, -75, -38, -131, -100, -15, 23, 24, 35, -2, -3, -76, -73, -75, 41, -72, 26, 2, 33, 38, -81, -72, -73, 45, -104, -42, 18, -72, -4, -81, -86, -6, -7, 14, 26, -65, 44, 65, 3, -28, -158, -21, 34, 50, -95, 11, -32, -70, -31, -48, -27, -1, -23, -26, 3, 100, 61, -38, -11, 31, 28, -30, -15, -6, -33, 37, 16, 19, -90, -27, -33, -7, 83, -3, 134, 76, 39, -41, -12, 115, 21, 136]
781A36j74k4p3J21pm7lM7K8m7J10j25J29j14L9o0l0P1j7J24j50P4mJ7j7j51J59
808A2q1R0m9K0K5l9NQ0j05l1l7J23M7m5M6o5%q3K2l6O9P2m9o4QR3m5Oml7O4m5
840c3K6J8n3j4N5m7J17j5j37J36m1j4l0O9l9j8J66n9o3J18p4j21M5O7op0N2M0
868G5j20O5k5O5N2o3m0rj10J21M0J2K1q6L7p0l8N9j3O8p2J9j4Q0j3j08J25j15
896e7j8k6R4K4q3MR4j6l1L7j09J28o7M1J0k9rM4r1L9J6j06J29k6lL0n0J9o5L7
926d0J02m8n8J96p0j5j19J09J6p4p5K1M4l0J01j04J09j01jN9p9Q0m0K5knK3%n4
955c0j53K65j35J19p1l7k7J7O5Q4j79J5m1J37O2r7M4jk0J1j3KL5j36k5Q2MP0n
984D2j38l0M5J9J39m8k1j20K1J46p3l8J57p5k3R%j7n3n7K06j37Q0p2oN2N0r5K1
$$ y = [136, -38, -62, -135, -14, -21, -68, -71, -24, 4, -43, 67, -58, 71, -43, -4, -64, -94, -23, -40, 84, -66, 8, 4, 21, 4, -147, 12, -69, 21, -28, -8, 17, -22, -17, 63, -42, -73, -110, 13, 60, 15, 61, -4, -4, -87, -65, -101, -32, 40, -9, -73, -65, 28, -17, -11, -15, -52, 12, -33, -7, 11, -42, -56, -1, -48, 69, 54, -83, 53, 12, -2, -32, 37, -2, -20, 146, 87, 24, 142, 68, -53, -8, 59, 53, -17, 35, 75, -45, 20, -5, 60, 112, 49, 9, 0, -110, 11, 51, 63, 84, -2, 35, -35, -73, -14, -27, 41, -31, -12, -26, 54, 41, -67, 58, -57, -75, -101, -7, 17, -66, -62, 32, 16, -15, 22, -87, 41, -26, 15, 25, -4, -13, 31, -60, -21, -5, -111, 18, -8, -11, 19, -31, -12, -77, -40, 62, 14, -44, 152, 82, 67, -52, 57, 73, -1, -76, -55, -11, -41, 60, -44, 65, -36, -37, 22, -57, 23, -17, 8, 6, 1, 24, 24, -30, -183, 82, -53, 66, -5, -42, -69, -52, 13, 97, -82, -67, -108, 29, 91, -6, 38, 37, 17, 28, 15, 17, 52, -84, -109, -27, -23, 47, 42, -96, -126, -81, -62, 77, 29, 8, -112, -91, 55, -18, -56, 101, 26, 3, 12, 12, -5, -58, -115, 91, -46, 34, -38, -44, 8, 58, -37, -16]
1013a6J01r0Qp6K6M2J3M1j07J38k0j00R4j6Pn7P9j18K9l8J2P7o3r4Q0l2O9LM2
1042C4K6j15J23q4O1o8O7q4j76K01m7J36q7j2Q3r3J6R5n9K5k7l0r4%J07M3mQ4
1070A21j01LN9r0m0M0j01J96m1r4O9l7P3K3M5j02m2nJ2k4p7N0L4J0P7n8o7Q7K1
1099D1q6O8J4q5L4L5j07O4K7N4k4j8j14J06k0J11j08K8Ol5R3kj25J13L3j24J1
1126a0p6J32ok3jNM7j32p5K05r9L5m4O9j5K2o2J40j32O8K7k0M1k12J11j20J27
1153BN2j80Q7Q8q4N7j45J30O0q0k6RrK8j9O2j84O9Q4j74J88O1r2M0j0k6Pj31K16
1182H0o3j1Jo6Q3nP6j63J89j22R5o2p0%Q3m9j24J05J7J01j70O2j1Q9j18J28j94
1209a19J26Q1j27J11j52Q8k5J6n4L6L6k8k4J5Q5O3p5m6p7N2JrR7j67O9k3J5J6
$$ y = [-16, 85, -5, 3, -73, -47, -5, 8, 49, -58, 80, 60, -40, 54, 38, 45, -12, 67, -51, -22, -60, -48, 29, -34, -128, -48, -80, -11, -8, 34, 60, -55, 68, -16, 45, -23, 44, -40, -216, -15, -62, 74, -13, -25, 58, -35, -19, 76, 17, 42, 15, -15, -109, -109, -2, 41, 37, 121, 20, 23, 82, -8, -48, -8, -109, 87, 46, -48, 21, -16, 57, 80, 125, 23, -19, -24, -12, -36, -113, -63, -29, -19, 58, 0, -67, 20, 41, -45, 23, 37, -48, -14, 21, -86, -22, 5, 59, 35, 17, -97, 9, -11, 100, -8, 20, 26, -9, 84, 82, -43, 70, 103, -21, -10, -86, 46, 40, 17, 16, 21, 68, -64, -139, 66, -33, 2, -42, 27, 12, 34, -28, 112, -20, 48, 75, 55, 96, -116, -5, -125, 2, 54, -126, -39, 49, -35, 22, -123, 7, 67, -13, -39, -30, -39, -11, -30, 32, -152, -83, 1, -173, 15, 76, -16, 24, 14, -12, -5, -136, 80, 17, 6, 7, -59, 24, 19, 95, -68, 121, -1, 94, 32, -38, -38, 45, -4, -128, -23, -6, 95, -75, -13, -24, 65, -53, 75, -119, 7, 88, -39, 72, -80, 8, -17, -1, -55, -19, 17, -11, -35, -20, 65, 128, 53, 7, -70, -18, -17, -26, 71, -96, -27, -50, -35, -19]
1237a9J3Jq8J22j49J74p8l1J44J2o2j02K0rJ43j88J84n0l3MM1j30J05J3N2l8r8
1264d7m0JJ71r6N1l0n7K3R0p3M2o6mk5MJ12K5K4j26nj0R1n8j54J29M3K8o9J4L
1294iP1j33Q5j22J24l9m5J04p4k5M5l8J77j50Q5o4j26J62j83J29J14j01J8Ml3
1319b4O0j71J69nj03j0J36j57%R8K4k8Q0J1j43OO5k6o0R1K7m5R7k19J88No0m0
1347c4L1NL1Mqp7j8J03k02K61Jj61J43q4K9K9j13R9p7J7lM4l9M8j2J18o8j11L0
1376a4K8L3j73J56j72R0N1nk0M4P9j55J0Q8o4N5p6kR1l3j5k2K6j62J40N9pM8P
1405H5R5j98Q4K9j20N5r5J18rj19O9J6k1O0L8j23JLO8j3N7j02o3j1K12j16k0k7
1433d7j55K41K3j63L4J35j12O3j45J65K4kj51L5J60k29J8O5m1O1K4N2Jj25M0M8
$$ y = [-19, -6, -5, -93, 29, -120, 54, -24, -55, 89, 101, 39, -63, -43, -52, 91, -97, 87, 37, 4, 8, 49, -81, 24, 37, 89, 51, -47, -87, -86, 85, -11, 40, 10, -47, -24, 66, -7, 35, -31, -35, -60, -56, 56, 81, 105, -21, -26, -36, 55, -3, -157, -28, 15, 43, -26, -12, -9, 62, -71, 14, -108, 16, -23, -68, 36, -38, -63, -18, -56, 121, -29, 56, -8, -134, 28, -155, -26, 88, -13, 5, 9, -24, 36, -135, 34, 29, -74, -84, 52, -105, -105, -7, 17, -11, 69, 80, -63, -57, 8, -18, -78, 13, 40, -5, 92, -127, 61, 66, 6, -34, -3, 2, 33, 37, 29, -48, -66, 37, -165, 96, 97, -64, 79, -5, 24, 53, -60, 39, -38, -21, -24, 20, -19, 29, 17, 135, 67, -44, -14, 14, 47, -126, 30, -142, -52, -1, -6, -26, 18, 97, -58, -48, 40, -24, 31, -45, -47, 44, 11, -4, -26, 0, -162, -22, 37, 30, 78, 85, 180, -18, 66, 95, -25, 30, -65, 53, 44, -75, -6, 10, -11, 49, 87, -36, -35, -32, 36, 23, 80, -22, -85, -96, 116, 0, -20, -47, -202, 39, 62, -101, -67, 68, -44, 19, -126, 39, 63, 61, -90, -55, 105, -124, -106, -41, -82, -21, 3, 55, 56, -69, -29, 19]
1459A9J9om5Kj2K3M4Qp5j5R8m5j4p5J24j79J55R4j45nj0P3nRo0K2k4PJ7O1j07
1490d7M4n4rJ26Q2j08j4j10N6L5p9K38j45L6K5j36J4l4J86q5J17j57k4J82j44
1515eM7q1O2j7m6l7J00J1j07M0P0r4r2J09O9m1Qk6J8n8P2m3j4m6J25qn8P3j72
1544a41J14J3J5K1n0j4q0R7%j7n3O6m2Q6j28J03J9l2k0R2R3j37M1l5N3j1k6n9
1572c2oo6L4N7L9l2k2k2J2p6J21j3oJ46p4l8po5J33p5L3K8p2q8P1L6j2j55Q2J10
1602D1p4rqp7O0J49Lj11m4RO7O5j62Q3n6J48o3j26J30l3M8p3n8J05o1q6J67mp9
1631d9N1M0k5o5M8l8N3N3n0j36J48Oj55K0O7RP9j35J24j06mK6L9Q2k4kn8M6N7
1660A01n1j6p7N2mm0J15L1k32K03j17o8Q7npM8l8P1m6j35J42j79P4J00Jmr2K3
$$ y = [19, 38, 32, -13, -11, -23, 0, 44, 52, -23, -38, 60, 15, 1, -74, 50, -129, 26, 120, -25, -30, -40, 33, 28, 37, -23, -1, -25, -18, -1, 60, -47, -3, -57, -66, 60, 142, 34, 20, -90, -34, 1, -78, 160, 15, 51, 76, -60, -46, -80, 106, 21, 138, -19, -43, 139, -5, 42, -39, 23, 6, -40, -77, 23, 34, -73, -33, 37, -57, -149, -40, 29, -12, -4, -30, -12, -70, 2, -41, -55, -101, 24, 16, -42, 31, -141, -27, -14, 1, 22, -28, -42, -122, -25, -25, -42, -95, -29, -71, 15, -113, -10, 9, -23, -43, 49, 142, 5, 46, 11, 64, 53, 27, -32, -38, -104, -70, -13, 26, -6, -28, -50, -38, -114, 7, -6, -12, 134, 60, 22, 15, -50, 83, 8, 41, 69, -3, -91, -20, 16, 4, -151, -69, 41, -33, -42, -50, -127, -67, 82, 85, -26, -70, -61, 6, 71, -91, -8, -64, 84, 21, -105, 25, -8, 40, -33, -91, 14, -47, -133, 34, 30, -49, 2, 42, 17, -48, 0, -38, 15, 68, 18, -118, 30, 36, -119, -99, -32, -23, 56, -79, 45, -61, -65, -39, 0, 82, 58, 56, -2, 44, 101, 50, 34, -43, 9, 5, -35, 80, 111, -121, 82, -35, -103, -16, -21, -28, 20, -18, 53, 7, -128, 14, -165, -91, 9, 10, 6, -86, -63]
1688f3n9J49j34J42l4k5J75k69J54m2J60k76J39m0J4j01J33q2J02o0L2%j29O7
1712d7M0n9P9m5O0K5r2lk8L0L8k8j60K72m7q8R0J6m3N0q1Q7l2r7J10o1J6J4N8
1741G4o7k4j8QN1n0r3J59m8O0j21N2J7l0J36j56J24M3p9p1J29j07p6j7J11oo8
1768f7n1J93j90PR6P7N3q0j8q8Q3q0N3j34J37jm1P4Q6p7n4n0O1J9J6o7J3L9K4
1797C3n6QK8M3l8j62N7J05M2j26Q9n4N6j01P0J4l1J12q9J2m5oKK6M4n0J13m9m2
1826Eq2J89j06p0O7r7O6M5n4Q4n1l3L9rl6M7M8O7j10N7m1K6j48J49j2l4l9rL7
1855eJ00m9o6J06q0jJ17j02N5j00qO4l6o1Q0Km9J9RO5r0j3P5m0mr5J8J56q9J8
1885dk01J66Kj11J66j1N5m7n9L8j59m4K03r7j6m5P1J42o7m9M6K8p3K01j22q5L9
$$ y = [-63, -122, 27, -107, 35, 1, -24, 151, -118, 36, -6, 154, -122, 17, -23, -9, -110, 23, -59, 43, -17, 15, 15, -114, -47, -7, -66, 13, -32, 28, 53, -39, -42, -70, -40, -2, -30, -190, 82, 35, -53, 37, 53, 10, 60, -21, 66, 34, -63, 47, -14, 2, 16, 74, 7, -17, -35, -27, 24, -26, -119, 40, -8, 52, -69, -17, 0, -30, 106, -50, 74, 117, 38, -33, 96, -11, -87, -104, 7, 1, -67, -118, 75, -115, -108, -12, 65, 118, 38, 20, -68, 15, -65, -12, -146, -9, -10, -51, 23, 109, 32, -22, -72, -11, 8, 24, -43, -30, 9, 33, -23, -15, 13, 56, 18, -144, -87, 18, 60, -66, 23, -31, 25, -76, -6, 8, -23, 89, 0, 12, -33, -39, -37, -11, 33, -17, 96, 47, 5, -77, 112, 6, -64, 3, -94, -28, 17, -37, 47, -4, -37, 2, -7, -43, 4, 52, 119, 9, 66, 25, 51, -97, 52, 40, 6, -33, -42, -5, 95, 46, -20, 86, 6, 5, 122, 20, 75, -25, -33, 31, -5, -66, 14, 16, -33, -14, -5, 60, -30, -43, 32, -8, -12, -107, -89, 67, -22, -4, -205, -39, -37, -148, 18, 7, 62, 15, -44, -6, -165, -209, -6, -103, -119, -164, -93, 49, -18, -67, -21, 7, -66, 135, 13, -72, -33]
1912c3k2J56j17q0K0N1R3o3M9m2n9L0j7O2o3L4n1J42p1j01J18j41K7M8j04L0Q5
1939a9K2n0J9J30p5K9K8N3j89P5k7o9L7L7K3l4j16J99j64m1P1jJ08n0m1P3kk6
1967@nj3k1R4m2o1P4Jm6l1K4L6m9M1J1p9P1m9J3Q7j28R6M8j11m1O8%J35o5p4N4
1998C8n8J5M1j66N6J69j7j10j53J61M7l8J16r1r6M5J9K3m9N3l2L7K8j05Nm2R4
2025a0L1n1L1O1j02Q8r1N1P1j45N5J36n3J8n5j89J91M2p4j5P5q7J03q9K8J15j21
2052A4m6K0K0n6N4J15j63J43q6n8O8j00j1Q1k9Q0k3k4K4L0M0j09jJ0j3M3j2j41
2080a30J14m8J20j36J44Pq8P2j26J43q2q3J6Q5Q0j66Q5j6M0L1j11kL6p5O6O3J22
2107A61k4j53M0j5O5Lo2Omo6nj4K0Q8p8J3k7K6l6l3J62m2j94J67k9o2P8n4O3J37
$$ y = [-33, -55, 101, -16, -96, -76, -25, 68, 5, 54, 12, -47, -17, -34, 28, -35, -1, -52, 90, 19, -82, 36, -105, -78, -30, -134, -104, -19, 3, -47, -28, 102, 27, 56, 84, 137, -52, 23, -4, -73, -36, 1, 24, -10, -126, 73, -91, -132, -61, -62, 46, -4, -45, 28, 26, 0, -5, -18, -39, 55, 13, -48, 26, 27, -19, -50, -26, 10, -39, 2, 13, -66, 5, -44, -31, 56, -72, 24, 72, -39, -80, -12, -12, 123, 58, -16, 38, -20, -5, 36, -130, -74, 95, 78, -32, -185, -24, 23, -15, 101, 10, -86, -41, -22, 1, -48, 5, -27, 10, 38, -67, -62, -104, -10, 21, -30, 1, 62, -40, 48, -43, 8, 79, -66, -11, 125, 72, 90, 35, -154, 37, 79, 5, -10, 65, -22, 81, -8, 20, 135, 14, -32, -12, 8, -48, 6, 121, -42, 101, 15, -43, 25, -75, -86, -5, -34, 46, 23, -1, 23, 53, 93, -16, -17, -7, -20, 23, 11, -130, -16, -64, 56, -80, 64, 71, -17, 55, -71, 72, -10, -93, -77, 8, 88, -78, 7, -9, 31, 62, -49, -51, -15, -90, -24, 39, 161, 137, -16, 24, 9, 74, 77, 15, 21, 17, -49, -54, -68, -48, 40, -38, -25, -52, -26, -62, -95, 67, 25, -169, -2, -31, -93, -15, -69, -6, 131]
2137A31j46m2O5N1l3r8K1J18j18R4r5M4Lp7J95j80J12q8m6qJ15j10J04k7P3n4
2163DK0J20j24m4N6N5l7l7N1l2m1O7q1Q1N0k18M5O0o0P2K0J43k05O4o6P1n8rj5
2192d8L4o1Q4kN5j22KJ34j19N6q4K9m4R7l8R2J2j27L0l8N8J04j21K9Qo2Q6m1K4
2221B7m6M5q5L3J28j11N4M5pj2p9L1o1O0j9j3J5P8m8J4j77o7J40J00m2n6M7q9
2249i5J01o6J8O0m9L8p4m5J60j2j5L7m2q2n3J70k0q6O7r0J0O0j4l6N5n7O0Qr2
2278h4P1l8m6L2Q6K0O8j09M2j06QJ02j3k0o7J00J5q2J4p2j00L01j19j4J29j66
2304d8j71K45j37J74n3j22O3P4p6N3L2q5Q9j9k3Q2q3o1J37j09k7P5K3J68k00k1
2330b0K0%jk3jJ12r8k8k0JR2r5O0R4m0q0Q1j29L3M5l3P9K4p4M7k9mJ10j35P3j83
$$ y = [131, -15, -57, 8, 59, 26, -72, -51, 67, -51, 43, -52, -8, -5, -82, 113, -67, 45, -43, -89, -97, 18, -92, 12, -15, 58, 4, 24, 144, 20, -24, 32, 87, 50, 13, 64, 32, -9, 58, -23, 58, 108, -110, -65, -5, -65, 7, 27, 170, -35, 29, -37, 34, -24, -33, -48, -14, -75, 9, 7, 62, -60, -58, 76, -43, 13, -71, -42, -86, 11, -27, 65, 77, -50, -20, -58, 0, 104, -17, 12, 20, -42, 44, 3, 27, -19, 26, -59, -26, 102, -9, 45, 90, 83, 71, -8, 23, -38, 22, 3, -10, 5, 83, 35, 49, -128, -195, -55, 45, 3, -53, -6, -95, 6, -60, -42, 18, -31, 7, -67, -112, 48, 36, 21, 58, 16, -66, -119, 51, 31, -55, 12, -78, -68, -8, -22, -58, -3, -60, 0, 8, -84, -13, -51, -97, -65, 21, 41, 109, 0, 42, -64, -56, 46, 33, 13, -54, 46, 61, -21, -7, -79, -179, 122, 3, -11, 118, -48, -219, 26, -111, 63, 10, -112, -49, 25, -51, 2, 34, -51, 38, 19, -4, 78, -5, -66, 71, -38, -65, 10, 33, 201, 1, -20, 0, 0, -1, -24, -25, 87, -11, -39, -59, -58, 34, -61, -1, 93, 53, -27, 54, -75, -42, 3, -30, 49, 73, -1, 46, 17, 13, 123, -12, 61, -122]
2361a22M1J45k6ko6J6Pp3R8j17J9j6J01k2j0m3P0N9l6J1n3m3j0J9J19j10J43j44
2389d5J27k6m4p9J8R4K4l4L7j40J26l2j46Q9R3q8L6On8K9P7n2j6J6Q6j71Q1j22
2417a14M9O8m7l7J32p6k1K6p6J39j3j36j4K53j67P7k0j4J4P3p1M8k19J51j34J76
2443D7j04J01j37K0Q2p4k5J57k4l5j15J70p3N3r6J48j26O9k6qj0l9J23j86J63
2468E5n9k5j0J4P4L1r1M7j07J8J14j49J04P9j17L3mkP1n6l4l1K8j04P2K1L5o2
2496e5Q1j06L3M2O8pm6N3Jp0J3j16P6k3RL3l6n0P2o3J44j22m0K47j96k3J24l8
2524Er0J61n6J8lq0Oj3P4J6j5m1o1P2J08r2O4j06OO6o7l5n8J49p8L0q5K7Q6q3
2554g5J31p2q8J38qj09P0j25K08j86J01n6N6p7j6KJ36k9Qn5N6p7Q0o5J20l6m4
$$ y = [-122, -81, 64, 38, 36, -30, -14, -7, -80, 18, -99, -80, -96, 5, -17, -27, -70, 0, 59, 23, 34, -19, -62, -72, -53, 66, -44, 99, -45, 82, 56, 12, -67, -49, 45, 69, 35, 72, -68, 58, 26, -120, -31, 62, -26, 10, 16, -42, -13, 64, 12, -4, 12, 98, -73, 8, -114, -65, 3, -44, -81, 51, -25, -46, -20, -96, 43, 30, -106, -120, 133, -34, 43, 23, 9, 23, 96, 25, 73, -146, 5, -129, 47, -57, 44, -93, -73, 9, -65, -90, 67, 43, 8, -107, 63, -10, 43, -53, 95, -31, 38, 12, 4, -6, -45, 78, -108, 55, -4, -29, -39, -25, 49, 80, -11, 36, -71, -53, 61, -88, 16, 95, -22, 11, 7, 5, 76, 20, -14, -45, -17, -121, -49, -28, 7, -55, 26, -80, -47, -5, 63, 56, 10, 63, 64, -6, 7, -109, -33, -56, -47, -14, -50, -100, -28, -91, 53, -69, -109, 138, -58, -81, 43, 5, -85, 76, 20, 38, 35, -45, -39, -52, 22, 38, 23, -18, -79, -7, 101, 9, 73, -33, -27, 39, -28, -63, -121, 28, -50, -20, -105, -78, 8, -75, 56, -16, -104, 34, 26, -83, -13, -138, 70, -116, -15, -71, -15, -92, -108, -106, 30, 1, 9, -46, 10, -67, 13, -52, 68, 32, -12]
2581a2O1Ln1j46J40RMJ8j7n3N6Ql2O2n4L7n4R0n7p2J7O7l8p4L9M2q3m3P0Q6j5
2612Hn4R7j22R2l4m5J6R8k7p5R8j19R6m9K2r2R9m9J01Q8k1k48J43q0jRP8J6n2
2641gq6J22l3QL3l7M2q5O3m6Q9k3k9m0P3r9L5K3o1N2L6r5P7o4J11j44J03R5k01
2670h8N9LJ5J53o9m4Kj10K7N2j7LN4k4J5o9J13l9L8m1K8j54K6J1K5O3M9r7l1j00
2700a47P8J41J5j17K0J2N8j07L8L1p6J12o4O2K2l8K9k6L9Km7j28J94Jn9j40J43
2727D8jJ4m1p4Q5q2M8Ll8L7k5Q4j1N1j58J08M0n2n9l8J05K4k5o6j0j8Q5k15O8
2756a13J21N6o4J28k16J7L9R0o9l6m2J17l9qN5n4L8M5q4L6n9J16J0j04K1K1o4
2783d2L5m9L9l4P0J6N0j09P4j03K0mJ33j77K06j32m8n3O5J46p3L4j00L0%K6QL0
$$ y = [-12, 49, 52, 1, -145, -5, 4, 8, 26, 9, -44, 12, 20, -12, 50, -4, 33, -21, 69, 12, -60, -43, 24, -14, -88, -49, -7, -90, -133, -63, 23, 8, -46, 51, -71, 21, -13, -58, -42, 56, 29, -46, 52, -67, 29, -20, 2, -90, 9, -40, 61, 149, 128, -120, 23, -57, -58, -49, 29, 45, -7, -93, 29, -4, 4, 37, 0, 42, -43, 20, -26, 63, 40, 11, -29, 44, -55, -20, 3, -58, -6, 30, -65, 12, -52, 59, -85, 18, 113, -88, -29, -26, -11, 142, 73, 29, 31, -79, -52, 0, -17, -14, 40, 16, 31, -38, 75, 36, 74, 33, 61, -93, -67, -56, -31, 32, 81, -16, -47, -147, -69, 72, 87, -30, -10, 2, 60, -47, -9, 22, -54, 58, -6, 56, 78, 40, 69, 43, 82, 84, 37, -91, 103, 104, 45, -95, 48, 47, 61, 20, -54, 31, -51, -3, 0, -38, -1, -26, 58, 47, 98, -60, 48, 88, 36, -23, -61, 44, 68, 43, -23, -33, -51, 34, -181, -113, 8, 64, 0, 128, -88, -71, -32, 58, -11, -47, -89, 28, -11, -19, 36, -18, 20, 65, -19, 17, -42, 74, 84, -20, 1, 22, -42, -7, -56, -17, -51, 19, 35, 85, -24, 50, -53, -33, -37, 96, -81, 125, -7, -55, -108, -43, 103, 30, 64, -36, -6, -6, 20, 28, 58]
2811E8j4LJ6j0j39J27m7l3m6MJ66p6O8j01l6L9j9J30j9r4n2J09nn4n0K36j75N3
2839C9P3m3m4l9N7j16R2n7J01M9j44m0P5J0O0j27L1J22j63K17j24mq2J36r6PJ10
2866A00m3j23J30q4l5R1rk6M9JN6j67M1l9J06P3o6nj08P2m1J41j28K0M1%r4J63
2894A16j35P3N2q3j25J30q4J0L6m3Q2nj23O8N4Jk3k0RK6k1kPQK9j01L9Q5j13J54
2924A01K0j19j02J04j9m3N3K3j25J84N5k07J80j65K4O9L3j1j11K9P6o4m7P3r4
2949h3L8q4N6Q8Ll1L9K2nj96R6KJ1J05j29J08J0k9o9L2%J0J3r2nJ09M8pm9j15
2979a04J4P5L1j40J55J4k9PK8k8r1J64q7K1j26K36k25K08q7p4J4O3Jn0N7p4J9
3006hR4j19M8N0M9j19R7k23J87jj45P9n4J70j07M6j02M5J12o8o5lM7P4j13K0L0
$$ y = [58, 44, 47, 63, 53, -86, 41, -6, -39, -85, -81, 85, 9, 77, -24, -60, -21, -40, 90, 71, -23, -75, 34, 29, -25, -75, 161, -14, 39, 112, 69, 25, -14, 43, -73, 19, -38, 63, 112, -32, -72, 3, 13, 73, -54, -23, 99, -64, 153, 29, 25, -57, 79, -17, -10, 100, 57, -66, 64, -20, -55, 36, 27, 1, 50, 51, 107, -60, -19, -58, 48, 121, 55, 50, -58, 14, -27, 114, -14, 6, 47, 47, -47, 116, -19, 54, 106, 23, -102, 28, -56, -46, -10, -53, 29, 24, -99, -31, 23, 24, 1, -19, -10, 16, -5, -7, 0, 8, 37, -64, -25, 60, -53, 101, 121, 2, -100, 4, -15, -58, -5, 18, -107, 77, 132, -75, 105, -60, -36, 33, 66, 55, -56, -27, 49, -15, -62, 11, -83, -45, -129, -73, 15, 18, -13, 26, 48, 43, -153, -57, -55, -44, 61, -68, 40, 50, 21, -48, -16, -16, -6, 7, -85, -90, 19, 67, 60, 11, -104, -90, -15, 16, -124, 31, 45, 16, 23, 51, 23, -68, 96, 9, 30, -96, 140, -85, 123, 36, -38, -24, 39, 40, -10, 47, -27, -8, 86, -33, 15, 65, 114, -5, 92, -131, 56, 55, -90, -11, -65, 105, -2, 44, -58, -13, 99, 31, -34, -37, 10, 84, -29, -9, 21]
3033B1N1n8l9m1J34K6Qq7J2p4K2N3jm7Ql9K9n1J04J17j79L1%m3L9o2L9J04o5m2
3063c0K5L4k1M4j03j9R8k2q1Q0J8p0M1M9Mm4p6pOM9J23j36Q7r4m3P9M7l4%KKj10
3095a02J01Lj09P0J2L3q6j7K15r4J2p9P2j9j2O2o0Q8J9j57k5J20q2R4PKp6n3R3
3124C2r2M6O7Qk7nk5J42j47N1p8l2NJ42p0K0m3QJ3qQ9j06N1q3J9O1k8M0j24P7
3154Co2P4m3K3p2J60k01R9R8p7J03j03L8p4M4r3P1M%Oj49J06j8N0Q2r6L7K3O8
3183A01j85M1j23K04n6L6Q7j16k6J21j23L1j1j5J34r2r4pP4M9Jq4J6O5J0p6J57
3210A19q6p1j00K06nq2l5lM9pJ6P9q5P6o3j17R5Ko9j7KJ82j13j0K2m1Q0p0J24
3239G8q0L4r5J22mln8M4r9M9k2J91j03oK5j19J28j10L1mj14O9J01j14%N0qmkM
$$ y = [21, 72, 14, -25, -66, 68, 94, 102, 15, 27, -47, -25, 28, 27, -20, -12, -51, -22, -73, 31, 148, -31, 0, 0, -43, -4, -66, -27, 77, 12, -30, -5, 29, 8, 52, -51, -70, 28, 6, -75, 5, 23, -47, -6, 43, 47, 3, -73, -80, -74, -25, 98, -38, 49, -45, -88, -9, 38, 4, 4, 6, 8, -102, -1, 2, -107, -37, -25, 8, -78, -95, 120, 26, 38, -41, 31, 12, 0, 62, 2, 90, 109, -48, -73, 47, -35, 59, 66, 68, -8, -61, 32, -60, -14, 53, 61, 34, 29, 4, 146, -1, 50, -28, -60, -55, 87, 17, 37, -6, 2, 15, 7, 96, -10, 41, -42, -23, 38, 10, 50, -74, 3, -59, 15, -28, -5, -77, 83, -118, -19, 79, 2, 105, 2, 40, -34, 10, -83, -12, -8, -8, -2, -151, -45, -63, -13, 69, -27, 10, 33, 101, -84, -43, -166, 38, -18, 18, 105, -11, -37, 84, -39, -8, -19, -34, 100, 8, -86, -93, -19, 30, 31, -53, -37, 28, 38, -38, 119, 33, -38, -138, 68, 63, -19, -54, -57, -8, -15, 1, 80, -5, 71, 8, -109, -14, -12, -81, -98, -96, 86, -27, -37, -15, -56, 24, -46, 78, -2, 32, -63, 59, 55, 52, -6, 38, -61, -12, -34, 157, 54, 48, 73, -46, 82, -28, 3, -1, -115, -46, 55, -59, -59, -9, -17, -21, -23, -19]
3269a9m2L5J3L1o4J00r1n8J8J27o4N6m3M5J1j55J51L9j54oO0p5N6q8J6K1O1j5
3297c4L3J14j26Q8r8J5r1O4k6K7R4j44M4M0k4L8k2p9J15k4J5J1j43N5M8J2qJ4
3325Ho7J25l2p0O4Jj4l5M3n2n5P3L8k7O1j52J2J11j02MK7M4lL9q1m1J29q9M4k6
3355b3N8o0J7N7q4N3j10J40l3NM7l5K3m8P2n2j19J68l3K0l8Q3j28o2J03l6J48
3382A33j13p3m1J38j17M8qm6O8l8Q4n8M5k2m3k4L1O3p1J63l0q6%j50J91j11J30
3409F3j24J21j52K1L2K1o2P2l5jJ29m8L0K5Mj29J06j63N3l9K5L9o3J11R1j69J
3436d1J20j20R4J0n0R5j99J43l9p0J17j46J06j29N9J10j27J02j34N4M8Jp0J45
3460G9o2k2K3p2O4Kp6J16m7j7Q0m6r8J22l6q9J27nj98J02J06j1j38J27l3L9k1
$$ y = [-19, -61, -26, -13, 18, -46, 54, -37, -95, -77, 50, -14, 42, -1, 44, 55, -100, 51, 90, -64, -70, -10, -85, -29, -117, -101, -80, -19, -34, -1, 113, -13, 75, -23, -8, -99, -35, -61, -34, 60, -84, -40, 0, -24, 14, -8, -87, 28, 4, 19, 30, -113, -58, -10, 2, -6, 8, -59, 66, 34, -36, 28, 29, 15, -20, 23, -29, -84, -11, 27, 0, 61, -91, -79, 32, -70, -66, -39, 5, 2, 41, -40, -81, 48, -41, 3, -23, 35, -25, -8, 49, -35, 18, -92, 48, 15, 20, 67, 32, 55, 7, 79, 27, -92, 76, 43, 63, 25, 108, -20, -82, 21, -15, 133, 20, -53, -94, 44, -73, -25, -33, -79, -11, -49, 35, -23, 22, 0, -43, -67, -36, 27, -44, 119, 89, 3, 3, -147, 44, -67, 63, -61, 60, -92, -71, -39, -18, -80, -8, -43, -44, 85, 37, 67, 92, 96, -33, 73, -90, -37, -76, -51, -12, -75, 36, 127, -42, -41, 79, -41, 53, 63, 13, 108, -91, 52, 13, -57, 60, -86, 20, -109, -50, 60, -67, 35, -99, -45, 3, 4, -66, 79, 17, -5, 18, -54, 10, 12, -64, 52, 5, -12, 68, 22, -76, 46, 10, -79, 48, 43, -155, -53, 53, 42, -96, 31, -2, 37, 16]
3487A6J9r8O5Q8j8j63J08N3j1J6j14J01n7Kj9J09o6k5j6N9j04L1P3j59P2R0r8
3514d6J37N0j42L5O6j03J44j39L1J06j18j56M5L4O8j3P5j17K5R6j16m4J60o6m3
3539c1J38q0j27Q8J05j26K2R2O2j61j67K56j05M5k0m2N7j27J50Qj5L6j02J49j52
3564d7Q7j08J31j32L7o0j9R7P5j75Q1L1p3J14n2pO8n0J5O2r4n7J26o4K4j16K8
3591g8J62j13J1PJ82q6K0k3r7J8K9k01K13m8m2K2J00j57J46m0M3j11P7r5pP2K6
3618C0j05JJ40j23J87o1l0k16K37m6Mm8k2J51j01N8q5K9Q8j33M5Qk03J16Q8Q3
3644I2k34Q6J42l4j50J89j32j5P2j5K3ql3k4O5O8r2N1q7J2Q7pj49M2Q8%j09O4
3672hP1j51P1N6n9J49j36j22J11N9q5J7M1k0k1M0j1L4m9m4J00Qq2NJ17J1j38L
$$ y = [16, 35, -63, 2, 90, 72, -91, 17, 70, 59, 75, -39, 62, 5, 7, -12, 97, 31, 6, -10, 49, -55, -24, 49, -110, -38, 52, -46, 91, 141, -1, 34, 100, -3, 141, 2, 33, 139, 21, -135, -90, -56, 12, -1, 74, -43, -18, 78, -38, -82, 78, 12, -31, 107, 27, -100, -12, 93, -33, -11, 81, 143, -18, -185, 71, -34, 11, -9, -51, 6, -121, 29, 37, 22, 58, -44, 105, -47, 40, -68, 63, -69, -32, -92, -111, -14, 61, -114, -33, -2, -75, 39, -13, -20, 48, -2, 13, 75, -19, -76, 50, -14, 10, -106, -78, 84, -29, -18, -11, 171, 85, 105, 82, -15, 3, 32, -169, 44, -4, -46, -24, 76, -81, 65, 25, 68, -43, 34, -61, -68, 4, 30, -75, -74, 66, -57, 130, 69, 39, -177, 60, 14, 18, -30, -52, 99, -2, 56, -29, 0, 88, -45, 0, 8, -195, -79, 9, 92, -142, -56, 86, 52, -98, 91, -41, -56, 16, 1, 24, 16, -17, -41, 24, 92, 0, 51, -36, -24, 63, 56, -93, -51, 37, 37, -72, -8, 63, -88, -17, 39, -20, 129, -7, -129, -18, 41, -44, -27, 14, -6, -27, 13, 2, 36, -13, -57, 43, 51, -31, -26, 91, 102, -36, -33]
3700c3J15r7LK7kj4L3r6O8J21p2o2m0J47m2j14J16nk2J9l3r9N8L2m1L7k0J32J7
3729A33k17O5J01j55Q1M6M1j38J20j46N1q7J57M3j16k5O6N7l0l9j16P1J02p2q0
3754h7mJ26P5j44j17K32k0o9K8j14k3J55q6R5K4o8j36M3K01p6j18Q5n0L6M4m4
3780a2N5j04R8O4k8n3j0k0k3J5J0R4p5j60M3J73J9m1m4j0O8k3l4K6n3K8o2J21
3808F2k1n6j0l3L1K7K5k0K7j11K8l8R9j18M0J11m0k6j4K4QK5O3n3j64R1O2o6R2
3837D5j8l1q3K39j71m7J93j35j27P8J30j46J37l3r8Q3o5L3L4n3J81j66M6n6J3
3862a7K0n5L7lj12J36J1m3L6%m9qJ17K7j16J00q8k6N1p4J50p9M6o3%n1ml5O3J03
3892G4m3MQ1o4p4n5N1j19J34q2L3K8J1J05k59K18k1L4j48NR1j88K30j33KKR2q
$$ y = [-33, 82, -15, -12, 15, 13, -1, 32, -64, 4, 125, 53, -9, -49, 98, 56, -58, 58, 53, 31, 50, 17, -82, -24, 8, -33, 4, -16, 116, 133, -84, -19, 82, -73, 8, 54, 95, -43, 77, -69, -18, -105, 52, 95, -21, -46, 20, 77, 47, 8, -108, -37, 65, -7, -87, -91, 35, 110, -34, -151, 81, 61, -8, 20, -94, -117, 38, -48, 47, 71, 3, -133, -90, 111, 35, -83, 2, -48, -12, 32, -12, 43, -61, 37, 101, 73, 20, 10, -10, -33, -18, -8, 86, 11, -149, -106, 67, 86, 45, 1, -9, 59, 36, 2, 28, -25, 3, -59, 62, 41, -15, -25, -58, -27, 0, 25, 5, 32, -79, -51, -89, 10, -108, -68, 43, 3, -23, -37, -13, -5, 20, 83, 30, -134, -43, 19, -47, 45, 27, -4, -87, 152, -19, -66, 127, -8, -135, -57, 73, -73, 64, 31, -67, 16, -49, -16, 18, -35, 146, -20, 26, -30, -17, 3, -52, -15, -18, -130, 6, 17, -26, 10, 10, -39, -47, 70, 97, -19, 81, -7, -33, 18, -56, 94, 15, 61, -2, -2, -53, -57, -92, -29, 74, 31, 35, 116, 52, -22, -77, -26, -145, -11, -93, -60, -32, -21, 84, -175, 43, 22, 56, -92, -87, 4, -184, 46, -87, -85, -83, 9, 1]
3920Aj05J75p7Ql7L9O0r5p8K09j56J06L2l8O1k07P1n6J47j02J0N9J2r5P1N5o3
3947GK2j05k7K1J53m1q5J10q1O4n9m4J27k7n6R4p8j9P2o8l3M5P2r9m1J39l3%q3
3976e3J8O0q4K0N8l6J40j35J5k6M8k6J9o7J43j2j02K6J08j16J6km1R0r4n5J35
4003D7j03J26p7Mpl2Kn8K04p4l3J9k1ll7qj3O3L9n5kP9k5Lr4NqJ22j36J1J19j0
4035D7n3M9j5LM6j00K6m8pP9M6r6P3Nj87J03J1J08j08q2J46j72J0J52j86J56J4
4062B0k0j4Q5j8P6l6j03M7pJ3mm8q3J33O7j45p7J25l0P8q8L5ok2r1J34o8K0P5
4091D8n2J1n1OJ39m2n2M3r6K22j71oR4k07J49K2q9R4j54M6M3j13Q2R8o1K5p9%
4119e1O4L7o4m8O6l3k4k5P1r4J22j1j8P7O3j11j72J53Q9n7n5J16j38K6jn9n6M8
$$ y = [1, -104, 71, -6, 2, -35, 4, 64, -31, -109, 100, -56, 50, 82, 44, 105, -102, -31, -87, 60, -42, -32, 27, 39, -56, 15, 70, 7, 29, -76, -103, -82, 71, 30, -55, 55, -26, 38, -21, -65, 62, 35, -21, 73, -5, -24, 48, -20, -53, -8, 64, -35, -76, 63, 30, 30, -53, -35, 25, -59, -39, 19, -17, 123, -12, 3, -23, 25, -1, 18, -49, 94, 82, -20, 6, 114, -2, 14, 12, -29, 61, -33, -88, 47, -56, 70, -7, -3, -10, -42, -40, -98, 106, 32, -1, 18, -3, -6, -43, -51, -64, -1, 38, -17, -19, 60, 35, 38, -56, -51, -59, 63, -73, -62, 57, 47, -6, 43, 28, 31, 77, -23, 3, -45, -52, 27, 73, -23, 50, 55, -132, -29, -18, 90, -18, -100, 46, -126, -116, 36, -150, 6, 20, 0, -14, 71, 53, 129, 93, -10, 37, 30, 43, 39, -9, -92, 41, 108, -37, -114, 11, -19, 59, -29, 6, 0, -22, -113, 21, -47, -27, 48, -4, 7, -44, -38, 101, 59, 7, 50, -46, 176, 5, -1, 93, -114, 35, 57, -32, 62, -92, -46, -3, -116, -34, 64, 3, 28, -51, -51, 13, 50, -14, -62, 4, -29, -53, -78, -7, -101, 21, 10, -8, 69, 132, 21, -151, 2, 91, 34, -21, 95, -43, -17, -18, -77, -133, -85]
4147h5J3O6o0J37mo6N6r9qk2j0Q4j7j41N5J61O0m1j23mQ0q4K8n6J43j71O2k1K6
4176d1j3l9J90j23N3J2L4o9k9N4Ml1J3O8p9m3J47j23OJ12j64P0k7O1k3o1J06m5
4204B0j8O5J8j89J12O8q5q4J18N4l0l3Mr7P4O2p5k7R7k1p4M7o4Q1o2R9kq2N0q8
4234f2K3K0K0n9N5J6K3n2J5N7r6L6o8K8l5M0Q1j57Q3k1J19j33O3ql9J17j6N2r0
4263A2R9n4o2k2P0j86J54M6j26P7j11J4J21l5J1Q1n5j20L5O8Rj24R5M3l9Q8j26
4290c7ll2K4R2p5J9p9L6rN7l0LMJ02Mr7J9N3kj31L4Q7o4j09K15l0j16P5p3L9J
4321b3n7N0L2m6P6J1r7M1rj16J58l5K1l9lk1j1P0q7J33q8Q3j6o1l3L7J0r3P1O1
4351A9L0j18M9l9NJ36p2K0j5J0o0K9N9l7m2L4l6O3l4K7j09%P5R4o4m4J9o3o9Q5
$$ y = [-85, -72, -6, -66, 71, 67, 1, 57, -42, -50, -72, -82, 2, -15, -156, -101, 60, 120, 79, -44, -48, 32, -52, -24, -80, 63, -108, -46, -67, -41, -54, -93, 97, -26, 27, 39, 73, 4, -25, 29, 33, 2, 15, 83, 4, -39, 108, -15, -9, 103, -61, 9, -18, 43, 20, -41, 65, 20, 2, 67, 85, -104, 8, 76, -9, -93, 25, 79, 49, 16, 20, -77, -3, 59, -16, -43, 54, 33, -41, 6, -58, 23, -39, 60, 58, -24, 26, -62, -39, -19, 1, -58, -3, 13, 36, -16, -1, 56, -40, -4, -72, -44, -79, -39, 42, -115, -32, -53, 66, -67, -4, -12, -51, 66, 50, 102, 12, 111, 57, -5, -27, 43, -143, 11, 57, -69, 8, -103, -89, 32, -3, 8, 89, 34, -86, -51, 17, 26, -98, -3, 40, 1, 89, -37, -40, -72, -48, 44, -31, -12, -91, -55, -64, -7, -37, -34, -30, 72, 76, -21, -2, 51, 49, -82, -48, 39, -25, -134, 81, 51, -65, 10, -63, -24, -23, -80, -30, 2, -44, 32, 43, -54, -13, -22, -138, 20, -15, 6, -33, -36, -57, -68, 2, -85, 48, -40, 43, 27, -34, -67, -30, -20, -113, -42, 19, 49, -69, -20, -59, -54, 82, 10, 30, 15, 25, -35, -6, 53, 16, -26, 8, -28, 35, 1, 28, -81, -81, -6, 88, 24, -20, -1, -64, -133, -48]
4381d8J40j67j4J57P9j98J34j43N4o4NJ10k9L1j78J07qL7p3Q2l6j9k3J4n7j0J48
4408C1j3No0k3R0l3K4o9J6J66j71N5L1j13J0L4M0J0l9j5MM0Jp9P1K6j70J48j12
4437i5R5l7L6j6N6L2j93J30M6O1k78L25j19k5rJ6j25N3KJ19l6q3P6L8p8N1k2n
4465A5l6K8J03q0l7J3m1K8r2M7r9K43m7k2l2n4J20j51J09k7J48j90L7r4Q9J12
4491I0q3j7k4N2R3j20l7M0j4N1Mnn3r5P2o0N3K2N0n1L9k0M3J2J2j36P8l7L9Q8
4521H6K5n0o6noj2j8PL8N3j25Q4L5j03K3%P4pJ47k22j7Q9j38J46J5o0K4k1k2l2
4551e8j5N2L1l5q5K01j20k7J11o9P1j00MJ19j18N7lj6n1p1J9J02Nl6Q8j52P6Q9
4579F9j71P9k5kK7O1L8Oj14m4mP4R4p1orm7n2J22j53R2N2j28R7J04p0P8j80ll6
$$ y = [-48, 92, -75, -89, 68, 147, -51, 83, -60, -6, -70, -65, 45, 16, 47, -131, -24, -32, 5, -68, 14, -22, -41, -64, -50, -107, -117, 31, 18, 23, -37, -60, 30, -3, 21, -48, -32, 134, -37, 18, 49, -64, -54, -20, 20, 30, -9, -24, -20, 20, 21, -58, 13, 39, -131, 17, -95, 0, -37, -1, -17, 39, 71, -122, 8, 54, 115, -163, 162, 43, 18, 9, 25, -100, -47, -45, 74, 38, -45, 31, 69, -9, 42, 20, 15, -21, 7, 110, 30, -7, 6, -35, -7, -99, -52, -151, 92, 45, 23, -9, -63, 57, -94, 15, -12, 136, -54, -17, -111, -22, 90, 7, -10, -34, 18, 111, -9, -46, -6, -20, 31, 35, 30, -23, -118, -46, -106, -53, -31, 19, -32, 7, -13, 30, 42, 54, -82, -4, -41, -2, 86, 111, 61, -5, -10, -16, -28, -46, -39, -1, 52, -73, 11, 46, -57, -34, -34, 40, 33, 180, -42, -59, 30, -108, 38, 53, -7, 17, -4, -26, -58, -73, -21, 10, -25, -110, 91, -29, -56, 55, -14, 57, -43, -39, 80, -38, 19, 16, 0, -51, -122, -103, -1, 4, -32, 56, -96, -20, 69, -102, -23, -48, -50, -23, 38, 76, 82, -32, -76, -80, -6, 88, 17, 11, 2, -45, -97, 25, -128, -36, 16, -112, -15, 89, 19, 97, -83, -86, -122]
4609a22J30J1R8j3m6k8O9k07Q0J10o7nq6L2M3qj20J20J2p7J60n7j20O6l0J50n7
4636C8q6O9j7r5J50r9P5k5k38L57q7m3L1k3l4N7j8Rm4J6qj3O2O3q7p4J22lj4l
4666C8R4j84M2J03o1J11j29L2M0n8K0q4K9M2k1n7o4K7J05o2j8N7m7Q4Ok3K7Lr
4695D3L3j23NJ20o4j20J27K3l1L8k9j00N5k5J11r7r8R5p6R9K0rK4L8P0j76N2J5
4723B0O8k17K05j21J06m9k8M6q2pO9J32j63m3J03q2J20q4r4M7P4r7J02j02QL2
4749c7q8O2P5n0P0nk8r1nJ99J1j50l3P7k9J3m5J08o7j16R7J8k2J03ro1j1l5K2
4778b7j0jqJ16n4K4r7K4M7l0o0O0j2J03j31K6K9o1Rm7J78l2m9j00J85o9o7k1R7
4807B2m4O2j21P9O7o4j1J06j79J18K2o6O0j1O3o5j13j8R9R6j23O4o7K9n0N3j5
$$ y = [-122, 8, 19, 117, 104, 58, 30, 99, -108, -28, 82, 15, 10, -76, -44, -1, -9, -129, -9, 3, -74, 86, 29, -91, -25, -55, 95, 38, -48, 21, 4, -91, 59, -40, 35, 10, -228, 129, 42, -1, 30, 7, -27, 30, 12, 21, -23, -7, -15, -28, 34, 97, 10, -64, 58, 55, 41, 38, 132, -52, -10, 93, 32, 143, 14, 46, 86, 28, 48, -36, -7, 35, 14, -43, -107, -80, 25, -37, -55, 2, -45, 39, 45, 22, 49, 52, 43, 76, -47, -42, 78, 14, -106, 21, 44, 13, 51, 22, -78, -23, -48, 63, -34, -132, -37, -113, -14, 6, -3, 21, 59, 129, -47, 5, 20, 88, -129, 76, -45, 61, 12, -16, 30, -52, -59, 10, 142, -21, -64, 39, -43, 77, -7, -101, -54, 20, -77, 25, -77, -69, -37, -125, -63, 12, -38, 32, 27, -1, -92, -97, 102, 113, -37, -70, 7, -22, -9, -54, 54, -13, -129, -32, -14, -36, 67, 58, -3, -14, -49, -27, -37, -38, -46, 70, 16, 40, -57, -33, 14, -16, -76, -16, -28, 75, -56, -30, -1, -62, -53, -100, 78, 46, -3, -103, 82, 13, -54, -75, 22, -22, 40, -81, -2, 65, 1, -10, 96, -83, 35, 57, -9, 51, 40, 103, 38, -75, -93, 6, 102, -21, 43, -24, 5, -45, 8, -7]
4834gj5L4m6N4N7k6j65J12l2J3j7l7J23m8p1O7l6p3J56j04KJ37j73P3J22o9j65
4861a34J47m3M6P5p4o6J33j3j07Q6L2j05K1l8OP6l6l8L2J10j85J52p4N6l9q5K8
4888c7k3O1r4K10j82P4J47j88m2Q0j4M8lj9J3K5j01j8l4P8k3L2L2n7J20r8K3L5
4916D5j5mQ7j42K5J24j04K1Rq0R9p7L4rjR2j56j7J11J3Pq8L3l9o5J04r4J3R1p8
4946f1J08p9k4oJ08j49J87L1o5j14J36qr6J13q6P9k00P5P3l0o0J15p4m4L8J2M9
4973B8o4j8J43j38l0J71j90K8n7N7K0J80q5p5O7j00Q0JN9j28J10M1k12J04M6n9
4999b1k2k0J47o3p8J49j32OO6rK2q7J58mj88J55q4o5J26n2k8Jj34K21r3Q1l9L3
5027D6o6M7o2L2np9R8k0k7J67j68J3J0j03J38p1K5j02J76K3J5m9m8J7N8k7r3Q3
$$ y = [-7, -22, 12, -34, 20, 77, 51, -114, -2, -34, -21, -38, -75, 48, 0, -71, -4, -40, -113, 43, -61, -59, 78, -95, -22, 100, 31, -134, 13, -30, 16, 91, 17, -49, 84, 71, -36, 50, 82, -23, -2, -40, -34, 42, 6, -32, 0, 110, -75, 77, 3, 59, 20, -65, -37, -60, 1, -93, 117, -65, 9, 156, -32, -74, 6, -8, 40, 37, 18, 31, 56, -45, -63, -97, -19, -42, -10, 22, -35, 85, -13, 10, 45, 30, 26, 113, -29, -4, 120, 16, 37, 46, -34, 65, -12, 22, 13, 12, 104, -52, -69, 42, 55, 62, -26, 7, -32, -97, 7, -87, -74, 17, -61, 47, -32, -56, -62, 46, -103, 84, 115, 50, -64, 72, 64, -32, 81, -5, 74, -126, -51, 22, -8, -68, 47, -27, -71, -33, -21, 28, -36, -54, 89, -49, -79, 92, -98, -70, -127, -70, -50, 130, 45, -30, 37, -63, 17, 18, 77, -51, 59, 100, -112, -8, 38, -21, -43, -63, 84, 21, -57, 92, -40, -34, 32, 23, 45, -42, 116, 112, -76, 79, -5, -70, 56, 4, -24, -23, -157, 64, -29, 52, 13, 46, -20, 27, -35, -3, -8, -87, 11, -9, -36, 131, -37, -24, -14, -117, 21, -50, -25, -127, 49, 72, 87, 38, -10, 7, 65, 38, -55, 28]
5055B8n7M6L3L7j8n0k6J00j68J01n5J1N3j09M3L0K6q0J67k8j21K9j8J01M4j73
5081e4L8J1%o1J20Kr2P6q9O2P2j46L9qK0O3j07M0M5qM1p0k5kJ6mm1oJ36p4R7n
5113H6p1J4Q9k6o4Lq5N9L6l8n2K1P4n3j3Nj5ML5K7l1j42K6J67k4m9J22j40l2J29
5143F2r1L9j48Q3N6n7N9Q3o1m5JK6L4p4QJ5P0o4nP1p6n6Q6J1k4K9o1J01j33J13
5173E2On1m2K3m0J8O8o8mL2J0j9j5n7J17o1K3M0JK5j02R4r3P9N0j30N7R6r8r9
5203h8J76l2n5M8l5n5J41r9N5N2n6q3n0K7l4J53j41J29j21O1L7j74J36J28j58
5228c8Q1l4mm2P5o0N3M5J9j55r5M4J79n7m8l2N8j1K9L6j15J10m7m8Rj5R3l7j22
5257a29M3J19j4M4l6n4l8Q9O4k5l7j29J40%L5j14Q0j08M9K5j9l6K9J07o4J4J7
$$ y = [28, -29, 17, 50, 87, 69, 19, -7, 93, -75, 26, -29, -18, 35, -74, -31, -1, 25, -55, 112, 84, -37, -8, -26, 75, 119, -54, -16, -5, -5, -66, 54, 56, -36, 40, -49, 13, 85, -61, -22, -30, -10, 53, -54, -14, 31, 23, 64, -6, -31, -33, -17, -21, -62, -68, 68, -6, 91, 86, 15, 29, 118, 92, 28, 31, -54, 5, 41, 3, -49, -28, 46, -7, -20, -15, -30, -26, 9, 36, 5, -137, -111, 56, 32, -17, 105, -35, -67, 62, -29, 10, -138, -55, 1, -56, 3, 86, 25, -20, -19, 7, 41, -33, -25, -10, 60, -4, -9, 62, -14, -70, 16, 27, 3, 32, -29, 72, -61, 52, 58, 7, -35, -12, -52, -34, 34, -34, -38, -6, 4, -15, -30, -87, 30, -31, -8, 32, 33, 58, -44, 50, -43, 36, 86, -44, 13, 109, 11, -88, 88, 56, 1, 49, 14, -41, 100, 1, 56, 108, 52, -31, -81, -54, -88, 65, -76, 53, -68, -7, 30, -144, -8, 120, -38, 43, 9, 5, -37, 38, -22, 31, 76, 95, -60, -155, -111, 68, 11, -37, -69, -11, -22, 7, 43, -72, 38, -9, -57, -48, -63, 30, -7, -129, -86, 33, 19, 63, 27, -27, -65, 24, 88, 63, 26, -103, 37, 37, 72, -42, 38, -70, -21, 4, -15, -51, -22, 85, 21, 35, 52]
5284E2q2M4n3J15n3q5O4J3q4M9l5J2JO9mP1n9j13J47j03J03k7o7N0J3l2J19j34
5312iQ8p2k0P0rq1L4J2J07j44j27K55k32J39o2J08K5j06J59j84O0J1pR8j19K4
5338A8o0L7k2J41k03J33O0m6q2p7M9m4m5O2M0Q7p2O9r6Q0r7p5J62P2o0J5j9j55
5366a28J71K7k05K71l4j29M7j18P4MJ12j19M9p6L6pJ06j37N5M1K6n1M6r2N3m9
5392b7J35n7k7o0K7Q9q8K5l4L4o3R8n6O0q5n0P4l4LQ0k5j2qnJ07n8N1j22k9K03
5422A46k17M9N1n8K5jkL0p5M7pQ8j21M1n4J00n7n4M6K6Qk2J09j00O3j7M5m5Qj07
5452e5K5Pl1O5L9o9n4K6L3n4J93j50K5L1mj07Q7P9m1j58J81p0jM2j11Q1K6R6p6
5481E5PNn0j8j61L61k30M9J2P2j39L4j20J39J12j48O4j79J11M7k8RJ62j82j5j3
$$ y = [52, -30, 14, -39, 76, 23, -62, 2, 15, -69, -20, -55, -43, -42, 27, 23, 94, 35, -78, 69, -34, 69, 42, -25, 25, 38, 6, 125, -9, 79, 7, -13, 57, 48, -33, 1, 13, 120, -24, -151, 104, -128, 11, -51, 57, 82, -24, 135, -49, 11, 22, 15, 113, -6, 18, -42, -5, -27, 114, -89, 44, 104, 58, -24, -101, -52, -96, -141, -79, -39, 48, -24, 45, -51, 29, -68, -143, 19, 91, 31, 46, 27, -128, 43, 70, -135, 136, 102, -27, 20, -98, -24, -20, 92, -27, 22, -54, -18, -25, 81, -56, -1, 40, 66, 15, 61, -31, 22, -27, 108, 51, 24, -36, -9, 80, -8, 17, -17, 17, -46, 52, -4, 56, -29, -79, -5, -39, -36, 44, 19, 7, -1, -6, 101, 43, 94, -28, -57, 146, -71, -22, 29, -29, -4, -5, -7, 23, -52, -5, -12, 76, -45, -4, -58, 42, -15, -69, -23, 3, 11, -11, 98, -2, 61, 44, 89, 44, 52, -55, -30, -23, -54, 11, 50, -19, -73, -47, -14, -68, 125, -25, 0, 31, 27, -80, 7, 86, 45, -113, 68, -2, -3, 39, -72, 9, 35, 131, 55, 62, 67, 17, -1, -162, 199, -31, 18, 30, 102, -37, -3, -123, 16, 128, -20, 44, -135, -24, 23, -5, 4, 166, -16, -31, -44]
5507d4P8j23J10q8Q9j07K7K0K9l5P0P3p0on3N6j24MO2P4j56J42m2Kj54K52j68
5534h2P2ko6J51p5N6o%j09N1o0J4jQ3Oo6M7l5p7K1J5R1OK5j48R7n8J08p7K6k6
5565a9k5pJ48o7M3k5n8oJ58j31L0K9j77O0LJ02n6J08m7q1j3k8K4Q9pj55J70j49
5593h7K9J34j37Q9o3j9L6L6p4k7l8Q9Q6r2K8kl9M1m8J28m5j07P4N2l0J9n4Q8n5
5622A2P0r8K5m5O5j03J91r5J8j3Q4j39Q0Q6j02n6L2m9J3pO6J01j68o5O9N9r0M7
5650a2O0L0l4n5K0M2j48O7R7k0j25m2R4M7J2l4k42J95J04n9R1j69R6p8R8rn2J17
5678I1j25KM3L2j38J00l3o2J76q2K8p8Q5j5J8n1j36L05k04J22o0J19j54l3k1J84
5704A13N8o3j37lK9L3p6J11p7P1n5n9J08n3j12J12p9J41m1Qn1P5K1j47J7M2J07
$$ y = [-44, 34, -89, 21, -67, 22, -85, -58, -38, -9, -44, 26, 99, 29, 23, -30, 26, -98, -94, -32, 42, -114, 28, -14, -12, -166, 86, -82, -10, -12, -78, 73, -2, 54, 48, 48, -61, -10, -70, -56, -57, 26, 32, -34, 13, -22, -99, -78, -63, 28, 34, 59, -89, 8, -50, 58, -19, 7, -19, -44, -51, 97, 30, 73, 48, -10, -16, 142, 11, 41, 70, -107, -47, -44, 58, 2, 110, 63, -18, -31, -59, -35, 54, 47, -108, 62, -87, -58, 76, -61, 28, -35, -54, -18, 18, -56, -83, -121, -32, 54, -38, -10, -12, -51, -10, -58, 70, 25, -82, -8, 44, 14, 33, -21, 67, 12, 82, -16, 9, -36, 29, -74, 117, 22, 40, 27, 111, -28, 52, 138, 36, -20, 12, -37, -24, -31, 35, 136, -32, -97, -28, 31, -59, -12, 48, 78, 44, -11, 9, 51, -97, -30, 67, 47, -78, -120, -26, 21, 33, -1, -243, -48, 56, -3, 88, -81, 15, -63, 35, 26, -26, 91, -34, -32, 11, 43, -95, 5, -28, -90, 86, 4, 32, -46, 39, 24, 42, -9, -145, 160, -44, 78, 18, 137, -17, -50, -71, 113, 171, 108, -29, -32, -3, 30, -46, 65, -12, 59, 4, -55, 53, 0, -112, 0, -79, 62, 21, 29, -22, 53, 74, -73, -56, -14, 93]
5731I3j75K61j04j10J05n5q9M9O7q7P9j32K03j8m5r1j1O8r5J9MK2k1P2P8q3n0
5758d6N5M5q9K22j02j36K3L2P2l0Q4l0j17q6J40k5NL0j09O5J6R7m2j93J30p9O2
5785fj15K03j73K39j04J09j40l2Q2p3O5m3K0j10JO3r7P8N6n6O9k3j09J42j16P5
5811EL1j23J69J6o4j7k0k7L0O9K4k6j15L4o4J09O5l0L5j48P6r7J18k8LQ5j54m7
5839i1J42o6O3rm7j6J08r4j3n2P0J7N1K3j14l0lq9J64J6q2Q1K0j9j0j6k3M4Op0
5869c9L7p2N9Q7q5j0m2R4N4j10N9O9o8n8l0l2P7o1Q5J28j93J7R4n4k8P9J4j73
5897a02J31m4J80j31j28J06J01r8nq5M9R4rqj7p3M7Kl9R7J2j20J3L4q0R6p0O6
5925A9qnp4Q4m3K1nP3j29N3K5J7p5J05j8j87J49j40K6R7J1M8Lk2m5O5K2j10L1
$$ y = [93, -82, 179, 75, -35, 70, 15, -74, -25, 42, -45, 34, -98, 105, 87, 42, -49, -60, 8, -87, -68, -64, -42, -63, 9, 87, 4, -46, 9, 54, -35, 187, 85, -51, -28, 4, 76, 46, 130, 100, -17, -103, 37, 12, 17, 47, -62, 3, 19, 116, 74, -119, 11, -68, -6, -121, 82, -91, 148, 44, 153, 13, -19, 63, -10, 55, 12, 32, -78, -77, -14, -111, -33, 23, -33, 36, 13, -96, 46, -70, 5, 36, -87, 82, 98, 34, 17, -3, -30, 0, 69, 93, 67, -48, -14, -78, 31, 96, 66, 101, -47, 29, -68, 50, 22, 25, 110, -44, -91, 51, -15, 48, 39, -8, -24, 84, -10, -23, -75, -5, 12, 63, 86, -28, -58, -61, -150, 14, 30, -52, 29, 49, 30, 20, 4, -19, 25, 31, -39, -2, -74, -15, 72, -13, -23, -65, 29, 83, -27, 32, 101, 33, -25, -55, -87, -10, -71, 14, 142, -51, -34, 60, 6, -22, 57, 71, -102, 29, -15, 165, 34, -94, 12, 113, 15, 10, -75, -26, 68, 59, 51, 34, -39, 8, 10, -29, 68, 80, -40, -27, 7, -73, 23, -47, 19, 11, 6, -68, 16, -27, -6, -11, 62, -67, -14, 11, 28, -47, 58, 40, -147, 2, -138, -112, -15, -4, 44, 47, 25, -20, 45, 67, -43, -12]
5954a2J16j27M5j7n1O9k8j9l0Q2l5j06K4Q8l5R3j69J17J21m1Nj15k7j1P8j9R4
5981I0j54J84q6n2J3J3j9j6kK8N3J6j70R5J34j28Rr9N0M8m5k8j4J10m1R2p4l5
6009b8Q7q9p5J85m6M2j16N0J70k30J23L4j26lk2N8K4Q7k97K06m9%M2k4m1j9Q0
6036B3p5M7L6qr8J06p9L9K7K6j8%m7k9O7q0J07N0r9j7M0m3M8M3r6k4J0L7M6n2
6066a3j18J50j15J34l0lp9J54j9j0p7J03j51p2Q6j7M0K4J0l5p1K02j57M6l5l2
6092h5P2k2J2j0J50j50k5P7kj4Ln1P1J8j7o2o0k7K08j06N4K9kj59R0KO4r3J5M8
6122B8pm9J23j98J25N5o0rNP3j43R3n9m8J03m5j10J61r5k5K8N3j9o0N0P2r7L1
6150b4q8J00p7R8o0P3j4j42N9O9K6r9J23m3q5Q5J42j09rMK8r1K8M1L9o6R2j79
$$ y = [-12, 104, -23, 22, 5, -46, 23, -5, -24, -54, 28, -7, -113, -89, -1, -36, 57, -112, 5, 126, 85, 90, -25, -52, -63, 15, -4, 90, -64, 120, 34, -18, -5, 8, -11, -27, -29, -1, 52, 68, -102, -7, 127, -1, 8, -91, -41, 7, -38, -66, -80, 30, -11, 81, 7, -28, 59, -30, -105, 80, 34, 76, -40, 10, 180, -50, 73, 107, -19, -22, -44, 14, 38, 125, -172, 34, -15, -15, 27, 3, -38, -57, 23, -52, -5, 31, 23, -75, 31, -48, -9, 18, 44, 26, 26, -21, -50, 17, -63, 44, 94, -5, -22, 18, -25, 23, 66, -30, -54, -44, -7, 39, -13, -131, 19, -96, 38, 8, 5, -74, 80, 61, 51, -26, 77, -74, -146, -60, -77, -37, -13, -3, -38, -109, 93, -64, -18, -53, -85, -13, -35, -23, -33, 117, -33, -58, 19, 17, 3, 6, -45, 26, 44, 27, -35, -95, -122, 86, -20, 34, 63, 61, -98, -8, -6, 58, -35, -20, 28, 21, -28, 95, -103, 22, 77, 17, 8, 13, 86, -57, 36, -23, -71, 32, -13, -123, 38, -57, -82, -54, -1, -20, -80, -30, 42, -55, -24, -112, -12, -89, 9, -51, 22, 8, -134, -75, -6, 20, -79, 44, 1, -84, 1, 143, 34, 25, 29, 57, -34, -6, 35, 74, 8, 100, -79]
6178g9R9k1o1j6R5Q6K1j06j58J44k5k8K9J51j62j22J70n0l6J8Rl1N8j5l6O6jN4
6206E3j19N7m2M6K5K8p9J7l5J05j71J24J1mk4O7j3j7r3l6J14Rp5J00p6J18j63
6233g3N5N2Mo7R6p0J35r6p1M7j73J19J25j12L2k9P3q2j02K45j95k3J81q4Q4j31
6259f0J2J21j95M8R3J15k24Q2p4KM6R1j66K31r7j17L2RP6n0rJ3O7j19J65j12J22
6286A02j86J30r9M5L5o6Pn4R8j2J58j14O0j10j55R4O9r3J38j12K6P2Rj40j7j4
6312a29O6J11m7j30J03LoQ9j26J34n2K6r5k2R6R4j13rL0J0on2K8J1N4n4K1m4k0
6341b9L0j5k3j07R8Q0m5K8l5P1J0n1J34j71J41r4k8M9M1kq1L7o4R5p4o1L3o1J3
6370h1k1J21J8j41Q2m3P8J7j73J68r5Q6nLm0L7k5j0l4K5K4J03j70N8N3j3O1j19
$$ y = [-79, 20, -1, -62, -78, 17, 103, 124, 18, -140, 4, -21, -49, -20, 131, -31, -153, 17, -33, -69, -51, -42, -73, -15, -30, -66, 0, -1, 53, -66, -9, -51, -5, 20, 48, -31, -14, -49, 56, -115, 9, 20, 16, -8, 59, 46, 29, -64, -100, 14, 23, -52, 48, -28, 90, -73, -18, 34, 38, -29, 67, -3, 132, 36, -35, 12, -161, -42, 83, -29, 3, -26, 47, -35, -137, 108, -87, -110, 71, -13, 71, -60, -48, 73, -122, -74, 19, 134, -90, -8, -82, -80, -34, 57, -109, 122, 25, -92, -60, -51, 25, -25, -34, -21, 46, -73, 92, -20, 102, -84, 46, -53, -8, 27, -39, -32, -86, 12, 0, 158, 44, 104, -6, -161, -67, 2, -91, 47, -65, -39, 33, 42, -98, -115, -129, -63, 48, 1, -129, -26, -23, -29, 60, -66, 68, 16, 42, -53, -75, 21, 115, 2, -7, 23, 33, 27, -25, 3, 14, 68, 14, 35, -9, -29, 1, -14, -37, -144, -46, 34, -11, 17, -18, 53, 63, 12, 146, -25, 116, 22, -6, 43, 84, 82, 1, 38, -26, 69, -5, -66, -33, -94, -81, -102, 19, 37, -104, -22, -65, 13, 30, -143, 25, -70, 16, 11, 14, -26, 11, -14, -24, -58, -33, -9, 94, -76, -18, 35, 22, 83, -36]
6398c6j7J58j65J37l3o7J3p9K7o7R2q4R6j7O1n1m9O6J5L6j04m2R0M0J0K3Rp2n1
6427f1R3K4K4r5J32q0%n0j0p1O5R5k3o8n1J08L0m2k9P8j07M4k3J3n4J22j31O0
6455gj2m2OP6M6p1m5kJ07l1j0O0o6j08J92p1K4j7Mj10O6Rj22J57L4k5om4J1P7
6485H0r3R7o6oJ4j7k1P9k3L6p4j2R9Mn6q8J24r9O6J9o5Q6j9q7O4l3N6l7j01J10
6515C7K5j10J29j27N2J41j16N3j06M3K8JJ4j20l7J09l7J1j0n3J34r1r9R9Mk9O2
6542Go4j2RN5J50k08Q5Ol6pkj04J54L0q9MP7j09pJ00%q8J22P7r8l5l2l4J00o7
6572a6QP3n2l5O9p5OP3q6l8M3k4P6L5p3N3k10J69qJ11p9l0N8j09J18N3j79P9j
6601Ijl5lJ01j47K3mN7J9j1R5j04j33J63j9M3j09J77p0o5O8p3O9n5K2n1j9J71
$$ y = [-36, -53, 105, -60, 77, 44, -23, -10, -89, -62, -129, -37, -121, -25, -42, 19, -32, -81, -15, 0, 36, -68, -110, -20, 20, 30, 53, 62, -10, -61, 32, 56, 80, -15, 117, 37, 37, -13, -23, -94, -29, 66, 43, -25, -76, 32, 62, 20, -9, 69, -38, 6, -17, -4, -58, 64, -67, -7, -19, -61, -55, 21, 67, -4, -49, -51, 56, 25, 15, 75, 9, -99, 93, 22, 46, 29, 33, -77, -11, -2, -124, 33, 67, 42, 36, -8, 3, 80, -13, 84, 18, 12, 26, 9, -12, 67, 44, 80, 6, -6, 93, 97, 41, -47, 77, -22, 44, 63, -2, 84, 65, -22, 42, 9, 65, 28, -73, 37, 62, -48, 81, -46, 6, 147, 31, 84, -22, 21, 49, 50, 64, -56, -93, 16, -21, -10, -20, -73, 61, -30, -129, -30, -26, -55, 7, -57, -69, -60, -5, 145, -63, 22, 28, -8, -15, -17, -121, 33, 63, -26, -22, 55, -54, -61, 39, 39, -49, 73, 150, 52, 17, -15, -49, 51, -16, -8, 65, 13, -22, 47, -28, -22, 51, -35, -73, -30, -54, 22, 57, -16, 37, -173, -4, -12, 99, 20, -10, 48, -61, 57, 110, -69, 10, 9, 8, -27, -30, 71, -76, -53, -57, 0, 19, 8, 103, -1, -134, 29, 10, 53, -56, 121, 51, -14, 54, -19, 50, -5, 17, -34, -53, 118]
6629A18j30L5j47P5L6r1J01qL6o0m3O7J01j18qJ7P2m7k7O1q1J23j15K3j5K6K9
6656C0j10lN8L9L3Kn2L2j48K4Q0j5l6Q6k5j2N9k2p6J61k12O9Q4NK0m0n4Q5j09
6685d7K0J7j03R1J04n6o7L0J6n3N3O1o7J4j8o7kJ33r7mRR9m4m0KK4l0L5j2J8l9
6716b0K8O3j26j9M3O8kKj06LK9J09j13j2PJ4l0J55o2j23L7Q9l4O6m8j8q9R4KQ2
6746H9l8j18LL4O1o0ro6J61j72J12M0k71K12P4P1j03Ml4M6Ml4k9J8O4k13Q6j7
6774h5O0J5K1J9j3r5O4J1j26N5O6o3Q4J7O0n0p1J29q5j2J5k4n5J10J2n9Rn3MP3
6804C3K2j27k6lM5M5lN7k9l6kL1NR3k5k9n1q3L1QK0Q1o6J47j92j1J40j8k9j7k6
6835a5j0P7K2O3k66J91o7K3o7j6J15R7j10Pj30L8jK3R0q4P5k0j26O9L8O5q2m0
$$ y = [118, -12, 23, -124, -49, -13, -104, -3, -11, 25, -35, -78, -11, 90, -28, -36, -19, 53, 6, -21, 40, -41, 82, -33, -10, -25, 1, 30, -80, -83, -25, 14, 47, 49, -3, 29, -119, -95, -15, -30, -66, 20, -5, -17, 42, 20, -56, 105, -107, -38, 46, 51, 71, 31, -23, 62, -47, -27, -10, -113, -22, 82, 26, -41, -11, 5, -48, 5, 66, -1, 13, -5, -72, -74, 59, -38, -42, -33, 66, 22, -18, -16, 8, -22, 13, 1, 19, -20, 8, 71, -55, -74, -31, 37, 35, 37, -69, -66, -37, 72, -41, -53, -46, -32, -62, 93, 31, -92, -55, 34, 0, 66, 18, 0, -89, 5, 7, 89, 51, -67, -64, -30, 31, -29, -38, -104, 57, -115, -3, 37, -234, -22, 52, 123, 20, 24, -10, 36, 40, 6, -23, -5, 59, -154, -68, -85, -25, -10, 11, 30, 17, -78, -14, -3, -129, -74, -8, -71, 13, 30, 90, 40, -31, 98, 13, 1, 16, -8, -63, 47, 59, 0, 9, -44, -40, 33, 55, -72, -98, -101, -56, -11, -14, 43, 14, -22, -24, 7, 12, 105, 80, 51, 0, -83, -52, -44, -24, 57, -9, 138, -54, -65, 75, 57, 28, 11, -15, -25, 52, 74, 137, -129, 62, -5, 18, -49, -65, 50, 147, 37, 44, -86, -48, -49, -26, 64, -20, 55, 35, -91, -22, 16, 81, -1, -41]
6863d1N8k4N3K8m2p2J07o9k3n2J43j94J14J17j72J6J0K6L9n3l2J17J48k30J06
6888G8K7j28Q1k7K5j12R5O8j84m5K28q6%m0K0j13J21k1q1P8J0P2m2p0J17p6j13
6915a18J52Q8j02o3K3R3L3j44L6m0J26p6kOk9M6j93R3K5O1rK4O2o6j5j4J02r3
6943FrJ50j86K5mK0J00r8oO9j44k2P6NJ56o1j69J29M2j51N4N2j74P9l3J16K3J33
6971A78j24L5j74K0J01k8j17Q7J26j68j5N0M9m3K6K7k2M2j20j3P3O3n9j1M3kL
6998B7KrR8j47p0J19p5P6l8o9K27j64j0J54j35l5J3k1N0Ql4l7J85j67O1k3q7J44
7026D3p7L0M2N8j14l2N7m7n0J97j28o3P6M9j09J17j81J89p0r7J75j10M1L9n0M9
7052C4J4Jm2L6j3k8R1p2j58K9J69n2mj6j7N5Rn2n8P8r2m8K15j96P4n9L9N1J6n1
$$ y = [-41, 17, -7, 46, 74, 32, -40, 67, -2, -25, -77, 66, -128, -14, 103, -69, -53, -43, -17, 22, -31, -63, 54, 202, -28, 78, 105, -23, 58, 31, 56, -56, 39, 107, -77, -122, 106, 20, 20, -20, 0, -113, 8, -13, -94, -16, -6, 66, 24, -46, 71, -5, -118, 34, 122, 20, -43, -20, 73, 106, -38, -2, -42, 84, 8, 6, 12, -17, 29, -164, -71, -46, 15, 6, 30, 92, 26, 11, -3, 99, 6, -3, 147, -39, -14, -18, 2, 102, 4, -2, 67, -77, -99, -23, -18, 138, 77, -92, 37, 79, -72, -18, 34, -140, -61, -94, 22, 45, 178, 54, 89, -85, -65, 36, 8, -109, -22, 104, -64, -79, -29, 20, -23, 3, 30, 8, 50, -70, -83, -10, 53, -6, -17, 26, 24, 27, 29, 20, 118, -29, -99, 20, -55, 21, -17, -86, 141, -23, -33, 121, -14, -49, -36, -57, -7, 1, -33, -70, 115, -52, 9, -14, -101, 43, -34, -4, 38, 96, -18, -50, 7, -40, -90, 107, -21, -84, -8, 41, -68, 49, -132, 57, -13, -110, 65, -45, -4, 35, -15, 34, 48, 49, 7, 43, 30, 2, 93, 21, -137, -108, 61, 9, 5, -11, -28, 27, 36, -16, -74, 4, -88, -136, 79, -117, -43, -102, -63, -12, 4, -47]
7082d7M7r6R2j11N9Q3P4p7K8j02M5Q3n1j8j4M5JK5n5o6N4q3K7O2rn0J08q4j07
7111a37K23j09O2o2J00L0n3Pj09J7J06m1j1j50K24j34R0r7L0P4q1K1M7r5Q4n6
7137b0P6l8K4k0m8J02j13O2o2K4Q7j15j5k3rM6oO5j2j78J52M5p8J40QLj87J55
7165F5Jj25R9J6p1j1Q2r9N4p5N5M0NJ9p4k7J01mK3m6p6L9j1J27J18j98p9j6R9
7194C1J08p0q7O7l3P6j99L9k6O0J32j39K9J04j86O6J6K6j39J98p8j7o4JJ02l2
7220a5k0J08n1m5QM1%j19P2Q4r2L4P1J5p5L0n7MP6p4L4M8m3m0r7M5N6N3J6j46
7250g9R6r3P5M3o0N3j49K05l1k8n7l5L3j5J04j61J32r7R8l8P2r3j11J10K1p0R7
7277B2k3L3M2r6Q0q1J05j12l2o8J36n8P1p6J78n9r7j06K17M0j24P8p9M7N0j19
$$ y = [-47, 0, -96, -4, -115, -56, 27, 101, 24, 52, -50, -5, 78, 27, 9, -5, 40, 41, 66, 11, -55, -1, -84, -57, 5, -4, -54, 54, -30, -137, 86, -23, 39, -23, 77, 107, 54, 61, -48, -31, 75, 34, 23, -127, 97, -37, 53, -44, -14, 60, -21, 0, 47, -48, 36, -20, 56, 18, 42, 22, -26, 76, -37, 25, -37, -13, 74, -41, -56, -79, -88, -42, -48, 17, 5, -173, -21, 24, -54, 86, 94, 97, -90, 65, 66, -59, 40, 56, -15, -26, 56, -43, 11, -64, -9, 31, 36, 55, -19, -46, 55, 51, 74, 28, -48, -9, -20, 107, 225, 27, -52, -68, 31, 139, 69, -18, 49, 16, 92, -107, -68, -94, -34, 98, -41, -12, 92, -94, -28, -12, 14, -125, 73, -5, -22, -86, -85, 17, -15, -35, 73, 22, -23, -15, 26, 26, -93, -21, 63, -29, 5, 76, 91, 16, 46, -11, -7, 69, -5, 29, 77, 34, -6, -103, -58, -2, 51, 67, -79, 17, -76, -1, 42, -18, 35, -114, 91, 60, 32, -25, -60, -27, -42, 62, -99, 33, -64, 34, -4, 68, -25, -136, -26, -5, -75, 22, -1, 32, 74, -22, 58, -23, 82, -30, -62, -130, 6, -52, 19, -57, 121, 62, -35, -141, 76, 116, -8, 70, -9, 38, 88, -31]
7303c1j5K4N8K3l5q5R5J1r0J3K7j9j4P7Jj3j4o6J3j5M6m7M1O5J5J2M0k3j33l7
7333g6N8K2Q8l3nj05L9Q3j14M7k7J0j7R8m7K4m0p1k2m1J91J8m5n5j0N0O1j2j90
7362a21J80p8m0J64o7K3m9J9o1K6M6p3mQJ37j79l9P7K6K6J0l4R5J5k75J51m7K9
7390c5J06L7j33m7J42PQj09J8k6j9M3K0k7M3L4j46J17q0K1K0Mk3On4R0P0q5On8
7420e0J34p4m0M1M4j40M9kK09j70J2m4kJ8n5J16Qn7n3P0L4j48L6L9M3lk2rK6k8
7450a8O4mp5%P7Mj27O1P3j82O5O2j64J06N0k1j16J81r8Q7q5R1k5m2R2n9o7Q4p3
$$ y = [-31, -46, -22, 36, 59, 24, -61, 34, 45, -45, -32, -5, -24, -38, 39, 40, 27, 13, -53, -40, -55, -9, -56, -15, 50, 65, 77, 117, 94, -39, -76, -18, 4, 92, 59, 54, -51, -12, 71, -43, 4, -23, -13, -30, 68, 21, 45, 5, -66, -88, -129, 62, 80, 35, -20, -30, 20, 81, 69, -121, 59, -19, -59, 105, 38, 61, 12, 31, -30, -4, 42, -31, -35, -27, 110, -69, -108, -31, -5, 21, 31, -3, 92, 107, -168, -17, -64, -35, 71, 108, -25, -72, 70, 77, 85, -24, -6, -32, -51, -8, 12, -15, 28, 62, -84, 33, -47, -26, -6, -2, -25, -19, -73, 17, 87, 2, 8, -50, 84, 10, -30, 11, 55, -85, -36, -38, 171, 1, 13, -31, -33, -15, -70, 46, 54, -3, -56, 14, 48, -100, -64, -25, 18, 15, -7, -16, 10, -18, 46, 42, -33, -33, 44, 48, -79, -18, 55, -127, -62, 0, -164, -58, -8, -29, -145, 36, -62, 25, -60, 31, 6, -36, 56, -3, -70, 14, -59]
$$ [...]
8191b8
##END NTUPLES=NMR FID
##END=
