##TITLE=1H_DE-80H_X3
 200.13MHz, d2o
 8 sc
 
 19ns.26.2.2025
##JCAMPDX= 6.0         $$ Bruker NMR JCAMP-DX V2.0
##DATA TYPE= NMR FID
##DATA CLASS= NTUPLES
##ORIGIN= UXNMR, Bruker Analytische Messtechnik GmbH
##OWNER= pz
$$ XWIN-NMR		Version 3.5
$$ Thu Apr  2 10:45:46 2026 Russian Standard Time (UT+4h)  Yarkov@DPX200
##.OBSERVE FREQUENCY= 200.1313
##.OBSERVE NUCLEUS= ^1H
##.DELAY= (6, 6)
##.ACQUISITION MODE= SIMULTANEOUS
##.ACQUISITION SCHEME= undefined
##.AVERAGES= 8
##.DIGITISER RES= 18
##SPECTROMETER/DATA SYSTEM= spect
##.PULSE SEQUENCE= zg30
##.SOLVENT NAME= CDCl3
##.SHIFT REFERENCE= (INTERNAL, CDCl3, 0, 14.3821)
##AUDIT TRAIL= $$ (NUMBER, WHEN, WHO, WHERE, WHAT)
$$ ##TITLE= Audit trail, XWIN-NMR		Version 3.5
$$ ##JCAMPDX= 5.01
$$ ##ORIGIN= Bruker BioSpin GmbH
$$ ##OWNER= Yarkov
$$ C:/Bruker/XWIN-NMR/data/yarkov2/nmr/H-C/1/audita.txt
$$ ##AUDIT TRAIL=  $$ (NUMBER, WHEN, WHO, WHERE, WHAT)
(   1,<2026-04-02 10:45:06.71 +0400>,<Yarkov>,<DPX200>,
      <created by zg, POWCHK disabled, PULCHK disabled
       configuration hash MD5:
       00 E9 B6 7A A2 85 ED C7 34 08 36 98 17 FE 4E 26
       data hash MD5: 16K
       47 50 52 07 DC 11 19 A0 E2 79 06 3B CC 48 C5 B7>)
$$ ##END=
$$ 
$$ hash MD5
$$ 1E 44 13 34 50 3E 48 9E A0 C6 2B 9B FD CE C5 2C
##$RELAX= 
##$RELAX= 
##$RELAX= 
##$RELAX= 
##$RELAX= 
##$RELAX= 
$$ Bruker specific parameters
$$ --------------------------
##$DU= <C:/Bruker/XWIN-NMR>
##$EXPNO= 1
##$NAME= <H-C>
##$PROCNO= 1
##$TYPE= <nmr>
##$USER= <yarkov2>
##$AMP= (0..31)
100 100 100 100 100 100 100 100 100 100 100 100 100 100 100 100 100 100 
100 100 100 100 100 100 100 100 100 100 100 100 100 100 
##$AQSEQ= 0
##$AQ_mod= 1
##$AUNM= <au_zg>
##$AUTOPOS= <>
##$BF1= 200.13
##$BF2= 200.13
##$BF3= 200.13
##$BF4= 200.13
##$BF5= 200.13
##$BF6= 200.13
##$BF7= 200.13
##$BF8= 200.13
##$BYTORDA= 1
##$CFDGTYP= 0
##$CFRGTYP= 5
##$CHEMSTR= <none>
##$CNST= (0..31)
1 1 145 1 1 1 1 1 1 1 1 1 1 1 1 1 1 1 1 1 1 1 1 1 1 1 1 1 1 1 1 1 
##$CPDPRG= <>
##$CPDPRG1= <>
##$CPDPRG2= <>
##$CPDPRG3= <>
##$CPDPRG4= <mlev>
##$CPDPRG5= <mlev>
##$CPDPRG6= <mlev>
##$CPDPRG7= <mlev>
##$CPDPRG8= <mlev>
##$CPDPRGB= <>
##$CPDPRGT= <>
##$D= (0..31)
0 0.7 0 0 0 0 0 0 0 0 0 0.03 0 0 0 0 0 0 0 0 0 0 0 0 0 0 0 0 0 0 0 0 
##$DATE= 1775112306
##$DBL= (0..7)
120 120 120 120 120 120 120 120 
##$DBP= (0..7)
150 150 150 150 150 150 150 150 
##$DBP07= 0
##$DBPNAM0= <>
##$DBPNAM1= <>
##$DBPNAM2= <>
##$DBPNAM3= <>
##$DBPNAM4= <>
##$DBPNAM5= <>
##$DBPNAM6= <>
##$DBPNAM7= <>
##$DBPOAL= (0..7)
0.5 0.5 0.5 0.5 0.5 0.5 0.5 0.5 
##$DBPOFFS= (0..7)
0 0 0 0 0 0 0 0 
##$DE= 6
##$DECBNUC= <off>
##$DECIM= 32
##$DECNUC= <off>
##$DECSTAT= 4
##$DIGMOD= 1
##$DIGTYP= 9
##$DL= (0..7)
0 120 120 120 120 120 120 120 
##$DP= (0..7)
150 150 150 150 150 150 150 150 
##$DP07= 0
##$DPNAME0= <>
##$DPNAME1= <>
##$DPNAME2= <>
##$DPNAME3= <>
##$DPNAME4= <>
##$DPNAME5= <>
##$DPNAME6= <>
##$DPNAME7= <>
##$DPOAL= (0..7)
0.5 0.5 0.5 0.5 0.5 0.5 0.5 0.5 
##$DPOFFS= (0..7)
0 0 0 0 0 0 0 0 
##$DQDMODE= 0
##$DR= 18
##$DS= 0
$$ [...]
##$SUBNAM2= <"">
##$SUBNAM3= <"">
##$SUBNAM4= <"">
##$SUBNAM5= <"">
##$SUBNAM6= <"">
##$SUBNAM7= <"">
##$SUBNAM8= <"">
##$SUBNAM9= <"">
##$SW= 18.0517328524113
##$SWIBOX= (0..15)
0 0 2 0 0 0 0 0 0 0 0 0 0 0 0 0 
##$SW_h= 3612.71676300578
##$TD= 16384
##$TD0= 1
##$TE= 0
##$TE2= 300
##$TE3= 300
##$TEG= 300
##$TL= (0..7)
0 120 120 120 120 120 120 120 
##$TP= (0..7)
150 150 150 150 150 150 150 150 
##$TP07= 0
##$TPNAME0= <>
##$TPNAME1= <>
##$TPNAME2= <>
##$TPNAME3= <>
##$TPNAME4= <>
##$TPNAME5= <>
##$TPNAME6= <>
##$TPNAME7= <>
##$TPOAL= (0..7)
0.5 0.5 0.5 0.5 0.5 0.5 0.5 0.5 
##$TPOFFS= (0..7)
0 0 0 0 0 0 0 0 
##$TUNHIN= 0
##$TUNHOUT= 0
##$TUNXOUT= 0
##$USERA1= <user>
##$USERA2= <user>
##$USERA3= <user>
##$USERA4= <user>
##$USERA5= <user>
##$V9= 5
##$VALIST= <valist>
##$VCLIST= <CCCCCCCCCCCCCCC>
##$VD= 0
##$VDLIST= <DDDDDDDDDDDDDDD>
##$VPLIST= <PPPPPPPPPPPPPPP>
##$VTLIST= <TTTTTTTTTTTTTTT>
##$WBST= 1024
##$WBSW= 4
##$XGAIN= (0..3)
0 0 0 0 
##$XL= 0
##$YL= 0
##$YMAX_a= 406759
##$YMIN_a= -405688
##$ZGOPTNS= <>
##$ZL1= 120
##$ZL2= 120
##$ZL3= 120
##$ZL4= 120
##$ABSF1= 10
##$ABSF2= 0
##$ABSG= 5
##$ABSL= 3
##$ALPHA= 0
##$AQORDER= 0
##$ASSFAC= 0
##$ASSFACI= 0
##$ASSFACX= 0
##$ASSWID= 0
##$AUNMP= <proc_1d>
##$AZFE= 0.1
##$AZFW= 0.1
##$BCFW= 1
##$BC_mod= 2
##$BYTORDP= 1
##$COROFFS= 0
##$CY= 83.5205535888672
##$DATMOD= 1
##$DC= 2
##$DFILT= <>
##$DTYPP= 0
##$F1P= 10.8118882576601
##$F2P= -7.23987719738617
##$FCOR= 0.5
##$FTSIZE= 0
##$FT_mod= 4
##$GAMMA= 1
##$GB= 0.15
##$INTBC= 1
##$INTSCL= 1
##$ISEN= 128
##$LB= 0.25
##$LEV0= 0
##$LPBIN= 0
##$MAXI= 10000
##$MC2= 0
##$MEAN= 0
##$ME_mod= 0
##$MI= 1.114404
##$NCOEF= 0
##$NC_proc= 0
##$NLEV= 6
##$NOISF1= 3.799351
##$NOISF2= 2.8
##$NSP= 1
##$NTH_PI= 0
##$NZP= 0
##$OFFSET= 14.38212
##$PC= 1
##$PHC0= -5301.748
##$PHC1= 6.821927
##$PH_mod= 1
##$PKNL= yes
##$PPARMOD= 0
##$PSCAL= 0
##$PSIGN= 0
##$REVERSE= no
##$SF= 200.129724274929
##$SI= 16384
##$SIGF1= 3
##$SIGF2= 2
##$SINO= 400
##$SIOLD= 16384
##$SREGLST= <1H.CDCl3>
##$SSB= 0
##$STSI= 0
##$STSR= 0
##$SW_p= 3205.1282051282
##$SYMM= 0
##$S_DEV= 0
##$TDeff= 0
##$TDoff= 0
##$TI= <>
##$TILT= no
##$TM1= 0
##$TM2= 0
##$TOPLEV= 0
##$USERP1= <user>
##$USERP2= <user>
##$USERP3= <user>
##$USERP4= <user>
##$USERP5= <user>
##$WDW= 1
##$XDIM= 8192
##$YMAX_p= 0
##$YMIN_p= 0
$$ End of Bruker specific parameters
$$ ---------------------------------
##NTUPLES= NMR FID
##VAR_NAME=  TIME,          FID/REAL,        FID/IMAG
##SYMBOL=    X,             R,               I
##VAR_TYPE=  INDEPENDENT,   DEPENDENT,       DEPENDENT
##VAR_FORM=  AFFN,          ASDF,            ASDF
##VAR_DIM=   8192,          8192,            8192
##UNITS=     SECONDS,       ARBITRARY UNITS, ARBITRARY UNITS
##FACTOR=    0.0002768,     1,               1
##FIRST=     0,             0,               0
##LAST=      2.2672688,     0,               0
##MIN=       0,             -405688,         0
##MAX=       2.2672688,     406759,          0
$$ Real data points
##PAGE= N=1
##DATA TABLE= (X++(R..R)), XYDATA
$$ [...]
1372b401m28K227J454Q39Q22j711j583l44o90J346K052L15M86j275k060l74o31
1389a956O11J854K63M39l72j924n64j9K67J949Q83RJ54j484j031K51k64J384J175
1408A625j76j51j333j439K05r4O93J419q6j09l87j715K86N09M61J481K84l52k42
1427H79j104m72L53l7J160N78q15k36r26p88L62J7P82J127o38o5l28j038N22O62
1447eK30J226l09l19q0j209k00Q08o15J195K42j341L19r74q58J228LN99J184q90
1467B34n6p5j141R70P30k60J411m86j092K26j413j88J211m22P02L63j462J7l15
1486a046q71J444O88L90J065r24o39J18r57P51J005k04Q25m62j714k56o70k2J297
1505a82J05L79L83j303n25Lk08J433J112M50N71j475j131R8o00Q19J169j13K86
$$ plain form
1372 -2401 -2829 -602 852 1691 2513 802 -781 -1125 -1815 -469 1583 1898 2384 1109 -951 -1325 -1956
1389 -1956 -1345 509 772 1211 839 -1085 -1649 -1668 -1401 548 1431 1440 1594 110 -921 -670 -934 450 1625
1408 1625 1449 1298 -35 -1474 -1269 -1363 -670 749 663 554 167 -1548 -1262 -753 -292 1189 1473 1121 879
1427 879 -225 -697 -344 -381 779 1357 542 306 -620 -1408 -1046 -1029 -247 880 242 177 -151 -1189 -667 -5
1447 -5 225 1451 1142 823 743 -466 -666 142 -473 722 964 -377 -58 -1032 -1890 -662 -659 -60 1124 234
1467 234 178 103 -1038 -68 662 402 1813 1327 235 461 -952 -1140 71 -351 351 714 -748 -731 -1046
1486 -1046 -1917 -473 215 605 1670 746 107 225 -732 19 1024 820 1645 1183 -531 -787 -1457 -1479 -182
1505 -182 -77 302 685 -618 -1143 -1140 -1348 85 1197 1647 2218 743 -388 -290 -890 -71 1098 985 1271
1524A271r36j845l66j47N69J706M52L59j98j645k47K8N80J807P88j78k57j713
1542B8j220M4j84J232J257k89k68j337j397r4M40J466J661K07r3p70j380l23N12
1561e08P44J695M39p66j164j776o83L27O03J488O36m08n84j580o10O91Q19J727
1579A090J223m68l84j366j411N80O91Q04J259n80j038j074j713K18R08N91J677
1596A007L31j178m47r60m61J523Q45J050R29j413p35q70j309R49R63L32R15r68
1614E03j413m33r05N89J587L63J008J41j694n8l94j90J692N91NM26j488j012k29
1633i11o94J167R28j51L66q34j231K40j57N41J709q9K39j08j366nJ95kJ052J88
1653A077l30q3j161n70Q2o1R19O04l78J94o48p43O66J7N23J027k58j52j80j014
$$ plain form
1524 1271 335 -1510 -1876 -2023 -1454 252 704 1063 865 -780 -1027 -999 -419 1388 2176 1998 1741 28
1542 28 -1192 -1148 -1332 -100 1157 868 600 -737 -2134 -2228 -1788 -322 1339 1546 1453 683 -697 -1020 -508
1561 -508 236 1931 2370 1604 440 -1336 -2019 -1692 -1089 399 1035 627 43 -1537 -2147 -1456 -637 1090
1579 1090 2313 1845 1461 95 -1316 -736 -45 759 2018 1438 400 -674 -2387 -2169 -1261 -670 1007
1596 1007 1338 160 -287 -1247 -1708 -185 660 1710 2639 1226 491 -379 -1688 -739 224 556 1471 503
1614 503 -910 -1343 -2248 -1659 -72 291 1299 1440 -254 -312 -706 -896 796 1387 1392 1818 330 -682 -911
1633 -911 -1605 -438 490 339 705 -129 -1360 -1120 -1277 -736 973 884 1123 1015 -351 -356 -161 -163 889 1077
1653 1077 747 664 -497 -1067 -985 -1046 -127 477 99 293 -355 -1098 -432 -415 108 1135 877 725 545 -469
1673d69K26K43r2P57o3o52L9q74j89M77o6R01K51p49L27j63o68O20K58K93O64
1694A071n54j00k11p17N08K05k95N11l01l81kn99K6N67m1M73K46m61J35k15j14
1715b49N88k9L68K47p18N0l97n84O14R2j72O96n59m08J45p84M71N29k3O29J09
1736F15o82M01o83K3Q72j51L16M03j042j22k70q07P24M70l02P40n18p93L39n59
1756a026O06J005k23N78J10j087J77m50j96J274n4n1K92j214n65o2o04R39R37
1775C86l52M69o00q75N21j39M18J264J6K54n2j610j59K08k21J242R6n82j1j205
1795i32o36M13JJ104R06k76J26p97q90O32K61M34J284k73l05o10j440p7M94K32
1815c49Q95J44p02l71j076k14Q70L28J096Q40n47m44o03o82P73O33M37N36m65
$$ plain form
1673 -469 -243 0 -92 665 602 -50 -11 -885 -1074 -597 -663 238 489 -260 67 -96 -764 -144 114 407 1071
1694 1071 517 417 206 -511 -3 202 -93 418 117 -264 -266 -865 -839 -272 -313 160 406 -55 80 -135 -249
1715 -249 339 310 678 925 207 257 -140 -724 -110 -18 -190 506 -53 -461 -316 -1100 -629 -100 -123 506 615
1736 615 -67 334 -349 -326 546 395 711 1114 72 -50 -320 -1127 -403 67 -235 505 -13 -806 -467 -1026
1756 -1026 -420 585 362 940 1050 -37 140 -310 -506 768 714 663 955 -259 -824 -886 -1490 -551 386
1775 386 34 503 -97 -972 -451 -590 -172 1092 1108 1362 1310 -300 -459 -251 -472 770 866 284 273 -932
1795 -932 -1568 -1155 -1154 -50 856 580 706 -91 -981 -349 -88 346 1630 1357 1052 442 -998 -1075 -581 -349
1815 -349 546 690 -12 -383 -1459 -1673 -803 -475 621 1461 914 470 -133 -815 -42 591 1028 1564 1099
1834A099q87p46r90K16P25M37P13j72n76n29n71J42J011P37P51K23o96n92p90
1853d95q3O99M49K43mq22o29n90m03P84N49M72N15n53n08jl93P24Q75L92K89m40
1875A070r07j70n09r3R45k13L66k29j193j75O3j41J224L41NM55o82l62L61l36
1895a80O05O59m19L82p49r70L14k95l1Q77l73p0J93q10J38M53j92R84K90n33N15
1916G88n14m72O41j88J41M57q77J96l83p43M73O0k42P20j08l95M67m22M6Q51l25
1937A71M14K29p36M29l51m35N81k50l0L81q82J48L2n63N30J22k91O90j23k60N33
1958C39m87J69N71l50K87R6o40K99k42m24L42l8j49L96o10m0K01k81L36K89k15
1979a51M56p2k14K52k30J5M91l32L26j73m77J11l19j49J89J18P8K26n82K5J18
$$ plain form
1834 1099 212 -534 -1524 -1308 -583 -146 567 395 -181 -710 -1281 -1139 -128 609 1360 1583 887 295 -495
1853 -495 -578 121 570 813 809 -13 -642 -1232 -1635 -851 -302 170 685 132 -376 -377 -770 -46 829 1221 1510 1070
1875 1070 163 -7 -516 -609 336 123 489 260 -933 -1108 -1045 -1186 38 379 384 839 157 -205 156 -180
1895 -180 425 1084 665 1047 298 -672 -358 -653 -684 193 -180 -250 -57 -867 -729 -276 -468 516 806 273 788
1916 788 274 -198 443 255 396 853 -24 172 -211 -954 -481 -421 -663 57 -51 -446 21 -401 -355 496 171
1937 171 585 814 78 507 156 -279 302 52 22 403 -479 -331 -299 -862 -332 -210 -501 189 66 -194 339
1958 339 -148 21 592 242 529 625 -15 284 42 -382 -40 -78 -227 169 -441 -481 -280 -561 -225 64 -151
1979 -151 305 233 19 271 41 56 547 215 541 368 -109 2 -317 -466 -277 -159 -81 145 -437 -412 -294
2000b94k40M90J76J69N25m94j65R0n56L90L75k88N25l31p56J4k28j97Q32j27P6
2021a4L54q48J94J27m33R26L33k08M10n92n56N22o23L20P77n32K91m17q92J95
2041f66m7j2J126j56j14J99p86n1L06n6J010M07n82K16p19p51N74j98L68O14m15
2062B67j49n00r76O16K95J05J045j12m41J25o76J4O65O5N61L44q29j03o23o45
2082i52N24J86L39M23n61n37k28m16O63O19J77P09j05o99Lm70J37P66J41J57O
2103H82j044l05l38l99P76L02R3K20m30m35K18r0N34O16J76J76k79n22j77j30
2123a56K54K34lO8n05n92k6k54K94M90J06L83j16m50J10J35L3O88O3pK12q48k61
2146a48k8k00M03J27n02L08n23l94M68k10L92P34k98J50J74o76N19J16j08N17
$$ plain form
2000 -294 -534 -44 132 301 826 332 167 257 -299 91 466 178 703 372 -384 -370 -598 -795 37 -90 -14
2021 -14 340 -508 -314 -187 -620 306 639 431 841 249 -307 215 -408 -88 689 157 448 31 -861 -666
2041 -666 -713 -725 401 245 131 330 -456 -507 -201 -257 753 1160 578 794 75 -676 -102 -300 68 682 267
2062 267 118 -382 -1358 -742 -447 -342 703 591 150 275 -401 -387 278 343 904 1248 419 316 -307 -952
2082 -952 -428 -242 97 520 -41 -578 -806 -1222 -559 60 237 946 841 142 145 -325 -188 578 719 876 882
2103 882 -162 -467 -805 -1204 -428 -126 -33 187 -243 -678 -460 -550 -16 600 776 952 673 151 -26 -156
2123 -156 98 332 329 397 -108 -700 -726 -980 -686 -196 -90 293 177 -273 -163 -28 5 693 756 749 961 113 -148
2146 -148 -176 -376 27 154 -348 -40 -563 -957 -489 -699 -307 427 129 279 453 -223 296 412 304 821
2166H21l42m08J62o30j17L47m68L11L33o87L83N5m87Q23Q2q4N47k20k57L16m60
2187B0L67J39n72L85j78o26L00l26k45N97l66J46L92n43M56J52l78O88l0j78M35
2208F35j73m25M67m59O5L3n33L42j13n19L08J5k53O36k43J32L41l41K87J76l89
2229a1M23O7j70K68l34l84L85n65j0K55l44J93J7l54L38r5J05L12O4l1L81l94
2251A16J22J24m36K92N5j92K85l08l95J52l24J10K45j57K29L6l47J58j5J86L63
2272B99L6J51J26m47j50k0k40M31n2p3J25m60k79J61k36L84M11k18K83k17m67
2293d52L45r3K12O28k57J26r7p68J35J41k01P56j49l29J20p01j56K97j6N86L64
2314D91n09K93k31o22P22q8J80N84l62k44M8r10K55L86j27L99N7p04K53n76j08
$$ plain form
2166 821 479 71 233 -397 -514 -167 -635 -324 9 -678 -295 -240 -727 96 178 94 641 421 164 480 20
2187 20 387 526 -46 339 161 -465 -165 -491 -736 -139 -505 -359 33 -510 -54 98 -280 408 378 200 635
2208 635 462 37 504 45 110 143 -390 -48 -161 -680 -372 -357 -610 26 -217 -85 256 -85 202 378 -11
2229 -11 412 479 309 577 243 -141 244 -321 -331 -76 -420 -227 -210 -564 -226 -321 -216 96 160 129 510 116
2251 116 238 362 -74 218 273 81 366 58 -337 -185 -509 -399 -154 -311 -82 -46 -393 -235 -250 -64 299
2272 299 335 486 612 165 15 -5 -245 186 134 61 186 -274 -553 -392 -628 -244 167 -51 232 15 -452
2293 -452 -107 -200 12 640 383 509 412 -356 -221 -80 -281 475 326 -3 117 -584 -740 -443 -459 127 491
2314 491 -18 275 44 -578 144 56 236 820 458 214 262 -648 -393 -7 -134 265 322 -382 -129 -705 -813
2335h13O89j54N36M20n31j32j1l52N01K63q0N39n58l57j71n02L13L73j75L90p3
2356A15o25K21j75q0Q21KJ80L30o12j64N0l21O14J49k43K70n99m90J84k73K99
2377c47M53k81J26j4m89L18J02n2Q31j12j08J53m53j03L5j23L60j90j73J8m83
2398e32j32K49p1J97L56k15K52o0j35K60J40N0J98j07j97o6k12qJ46l09J12j23
2420b07j67L1j51J7L22J8K53J35p9Q5j21rK24L2j7J31m75j3k23k14L07j32k10
2443d63K94l59Q4L84k97L15L90l44K07J52k64L84k33m7L94m50j52J45n92P9L62
2464a1o83L94J97l21L47o1n5M29j95J63L18l58O4L97n72K87j22l88L73l40j73
2485c10L16m49Q1K10l30L10K28l30M28P6j25L17k59M8L41m60P9K51o41J68pl88
$$ plain form
2335 -813 -124 -278 258 678 147 15 4 -348 153 416 336 875 317 -40 -211 -713 -400 -27 -202 188 115
2356 115 -510 -289 -464 -544 277 279 459 789 177 13 63 -258 356 505 262 532 -67 -557 -373 -646 -347
2377 -347 106 -175 -49 -63 -552 -234 -132 -184 647 535 427 580 127 24 59 -64 296 106 -67 -49 -532
2398 -532 -664 -415 -486 -289 67 -148 104 44 -91 169 309 359 557 450 253 187 -25 -33 113 -196 -84 -207
2420 -207 -374 -343 -494 -477 -155 -137 116 251 172 257 136 127 351 383 366 497 22 9 -214 -428 -121 -253 -463
2443 -463 -169 -528 -444 -60 -357 -42 348 4 211 363 99 483 250 203 597 147 -5 140 -452 -373 -11
2464 -11 -694 -300 -103 -424 -77 -138 -193 236 41 204 522 164 228 625 53 340 218 -170 203 -137 -310
2485 -310 6 -443 -362 -152 -482 -172 56 -274 154 230 105 422 163 211 552 92 171 422 -219 -51 -58 -446
2507d46K77r4p1K57j89q7K10lL9M33k30L23J8m22K02j03j20M57l64j01J43m73
2529c44l3R4k95M68K7j41L08k54OK15k1K17L86k95M3n3m88J48J3p1L62l09j50
2552a67J5l33M8l3J67M18Q5j89K53m14N0K00j02M76J85n00k4j24l32R1%J39L44
2575B53l99m1l0m54L88K44j52O03j80j24R9l21j9L97j37K43J37m23m3j58k24L59
2597A8j76N5L27n22J10O3l62L96L67k41M27k81l34L74l96R9L78j05R5M7o24P1
2619b14n9j71M10o9m0L13l89j41L60k38M19K91k46K36q7m52K32j40K4K89k50j45
2641f7O6m14J48J20j54K68kn7R5j72rL69n1J63J88l24J43j08l20K50p6n6J43l07
2665a64j61K07k60J02R3K4J59P6l01L51k2J3K94j76Q5j38j75K06k20j05J47k55
$$ plain form
2507 -446 -169 -263 -334 -77 -266 -353 -143 -146 -107 326 96 419 437 15 217 114 -6 451 87 -14 129 -344
2529 -344 -377 -283 -578 -110 -83 -224 84 -170 -164 51 30 247 633 338 381 328 -160 -12 1 -70 292 -17 -167
2552 -167 -152 -485 -437 -470 -303 115 200 11 264 -150 -100 100 -2 474 659 159 135 11 -321 -230 -230 -91 253
2575 253 -146 -187 -217 -671 -283 -39 -191 412 232 108 207 -114 -133 264 127 370 507 84 41 -117 -341 18
2597 18 -158 -103 224 -298 -188 -125 -487 -91 276 35 462 181 -153 221 -175 -76 302 197 292 339 -285 -214
2619 -214 -273 -444 -34 -103 -143 170 -219 -360 0 -238 181 472 226 462 375 -77 155 15 39 328 78 -67
2641 -67 -1 -415 -267 -147 -301 -33 -35 -92 3 -169 -178 191 140 303 491 167 310 202 -118 132 56 0 143 -164
2665 -164 -325 -118 -378 -276 -183 -159 0 76 -225 126 104 117 411 235 320 182 7 213 -7 -112 35 -220
2687b20l5J42l13J33N5j49K44R8R3J05L1n6J17l8J57mk68K05k50k32J35j92o5
2710c07K51l68J15Q1j85K00K56j28J95O0j23L54j66k0K36k19j25Q8l37J39k34
2731b37j63K75j88p4L56l07J53K29j68L11N2k47M07q9k36L18k38j27K96m28k4
2752a29J08m40K67J03m48L66l9j90M11l4Q8L13k77J67J40l04J99L7k05J67k14
2773H6l37J14j86p4L08j94K41J7k11Q8J21j08N16kk07K22k34n3J74l45J55J76
2795B67m45P7q1k44J94m9r2M78j59J7J97l20M9K88mK73J01l82J23k54k04K82k74
2818a62L9K34k96m9m2j81J56J86J03K54j44%N7j71K15O3j00K39j11q6j80l00O5
2841b11J04jJ94m9k59j29P0N7K07M7K28J69l79J47L7l48K74J9p3K17m00q2k9j64
$$ plain form
2687 -220 -255 -113 -426 -293 -238 -387 -143 -45 48 153 184 128 245 207 364 360 92 297 47 -185 -50 -242 -307
2710 -307 -56 -424 -309 -228 -413 -213 43 -85 110 170 47 401 235 215 451 232 107 195 -142 -3 -237
2731 -237 -400 -125 -313 -387 -31 -338 -185 44 -124 187 239 -8 399 310 74 392 154 27 323 -105 -129
2752 -129 -21 -461 -194 -91 -539 -173 -212 -402 9 -25 63 376 99 266 406 102 301 338 133 300 86
2773 86 -251 -137 -323 -397 -89 -283 -42 -25 -236 -148 -27 -135 381 379 172 394 160 107 281 -64 91 267
2795 267 -178 -101 -182 -426 -232 -281 -373 105 -54 -37 160 -160 -111 177 173 446 547 165 288 34 -170 112 -162
2818 -162 -123 111 -185 -234 -276 -457 -301 -115 -12 242 98 98 155 -16 199 262 162 401 290 204 24 -276 -211
2841 -211 -107 -108 86 37 -222 -351 -281 -224 -17 30 258 427 48 195 232 -116 158 177 104 321 -79 -161 -190 -354
2865c54K05K49l01K10lk87J53k2K0L16O1l1qj82k4K23l21K51%j64J49l19j42J76
2889a45j99J61L09l21J30M2k60L33n5M9L30k13l8J6k19M2J79j00J60q1k47J06
2911b1k35j22L40p5JK75k41O3J05j91K87Q1k03K34k07j60L14k25j0J40l54J89
2933a5Jk69J52l9j13K89O2k00K61j87J09R7r8O4K46l27J02q3j72J73q2j74J53
2956e0k38J08M9k21J33J35L3K09n4k3M1j1J55k9p1K4m3k18qk6KJ96l71J18o4o9
2982b93R3P9k7J57Q5%J47j62K9J52j12L3L7j98J53l05j6n%o4J17k29LK84j19K14
3008E3J19j83K71r2N2J22j58M5%j85p7R5l60J99n6o4J17j92J32J90j77N6K35j24
3032A8J70R1k78L87j83k58J97Nj19J83m81J35l7k37L23j01lQ9j2j81L64r7J28
$$ plain form
2865 -354 -149 100 -201 9 6 -281 -128 -150 -130 186 247 216 208 26 2 225 -96 155 155 -9 140 -179 -321 -145
2889 -145 -344 -183 126 -195 -65 -23 -283 50 -5 44 374 161 123 139 -80 -38 141 41 201 120 -127 -21
2911 -21 -256 -378 -38 -113 -112 163 -78 -15 90 -101 186 267 64 298 91 -69 245 20 10 150 -204 -15
2933 -15 -14 -283 -131 -170 -283 6 68 -132 129 -58 51 148 50 114 360 33 135 52 -120 53 -29 -203 -50
2956 -50 -288 -180 -131 -352 -219 -84 -51 158 104 81 122 111 266 237 166 190 147 -71 -79 -105 -103 93 -278 -160 -224 -293
2982 -293 -200 -121 -148 9 94 94 241 79 108 260 148 181 218 20 173 -132 -148 -153 -153 -217 -100 -329 -326 -42 -161 53
3008 53 172 -11 260 168 220 342 184 229 229 44 -33 62 -298 -99 -155 -219 -102 -294 -162 28 -149 -93 142 18
3032 18 188 279 1 388 205 -53 144 149 30 213 -268 -133 -170 -407 -84 -185 -188 -99 -111 -292 72 -25 103
3055A03L53k43j1J89m38J91o3r3J69j43k50K61l96K5J94j30K96Q9k50K12%r0K45
3078B20n7L8J95k59j09O3k11Q0L1j70R4j17j34J41j54J49K68j95J51J05n6J39
3100B12r5L6O8l9n6Pj38j11%r4K04r3m6J00j06j06K50j7m1L46j48J6K0j83J75
3125A61o0K8P3p0m2j48j07Q2n1j07J92P4j00P3n8Q6lK1P6J50k92J83lj90J18p3
3151A3MJ43k71L6J35k62J03k8p5K53q0l0J33n5OR1j04J62Q6l69K48j33p6J58j80
3176i2q6J40j06j11K36j73J46Q0j90L08jj75J47N5r8J74j13r4L2j15M3p3J8J21
3200G3q8j50J87n8k17K95j90J44J24j70J58j3j43J82N9j54J58j38r6Q7k06J55
3222aL8j86J08r3o5J79j19K9K71k24M0K24k05K33o0j14J45q5o3l0l7n3L8j08K0
$$ plain form
3055 103 456 213 202 391 -47 144 81 -12 157 14 -236 25 -371 -346 -152 -282 14 103 -147 65 65 -25 220
3078 220 163 201 396 137 28 91 -120 -40 -9 -179 -85 -202 -336 -195 -349 -200 68 -127 24 129 73 212
3100 212 117 153 221 182 126 133 -5 -116 -116 -210 -6 -99 -145 -45 -151 -257 -7 -24 -65 281 133 149 169 -14 161
3125 161 101 129 202 132 90 -58 -165 -83 -134 -241 -49 25 -75 -2 -60 26 23 44 120 270 -22 161 158 -32 86 13
3151 13 17 160 -111 -75 60 -202 -99 -127 -202 51 -29 -59 74 19 25 116 12 174 260 -109 139 6 -70 88 -92
3176 -92 -178 -38 -144 -255 -19 -192 -46 34 -156 152 151 -24 123 178 80 254 141 47 79 -36 7 -66 -48 73
3200 73 -15 -165 22 -36 -253 42 -148 -4 120 -50 108 95 -48 134 193 39 197 59 -37 50 -156 -1
3222 -1 37 -149 -41 -134 -199 -20 -139 -110 161 -63 -23 201 -4 229 169 55 200 115 52 22 -15 -68 -30 -138 -118
3247a18l3j57J63m5K8J61L3jJ39j96J22J17j56K8K2L7lj53j02O2j07j0R9r0M5
3272a15j51J17J73r8L7J72n8N2M1j24K41l3j14K8k36n0K13j93j05K24k82K36L6
3295A1l63L39O0r8K61j83L4K26l59J61J41l08J69R0k82J73r7k69J65r6QL04k84
3318a97L5K15k01K35J19j78K40L0k27J19r5r7J12j72MQ9j92Qnj89K45J07j32K92
3342A65j71L2L6r4K58n3L9R3j09k10Q3m4j72J96j65n9J29k48J72k7NK54M1o8J98
3367B81j79p9J69j09j8J88j04m2j19j85J32o0r4J61k4o2J36j43J32j5K3Q4J45
3390B18l5P4p6j08P2j52N3M6j50o8l9j12J40J7M2Q0j76J64Mm5J58Mj0J46j45n8
3416D4P8l3j5K4m1Q6k14j98K20p8j10J18R1n5J20p5P6J03j1o9J35j73K01j63r7
$$ plain form
3247 -118 -151 -308 -145 -190 -162 -1 32 31 170 -26 96 213 57 85 107 144 141 -12 -114 -52 -159 -169 -70 -160 -115
3272 -115 -266 -149 24 -74 -37 135 77 129 170 46 287 254 140 168 -68 -118 95 -98 -203 21 -261 -25 11
3295 11 -352 -13 47 -51 210 27 61 287 -72 89 230 -78 91 181 -101 72 -25 -294 -129 -225 -217 87 -197
3318 -197 -162 53 -148 87 206 28 268 298 71 190 95 -2 110 -62 -58 31 -161 -153 -158 -347 -102 5 -127 165
3342 165 -6 26 62 -32 226 173 212 305 196 -14 69 25 -147 49 -116 -175 -46 -294 -122 -149 -144 110 151 83 281
3367 281 102 23 192 83 65 253 149 107 -12 -197 -65 -125 -219 -58 -82 -144 -8 -151 -19 -34 -11 73 218
3390 218 183 257 181 73 145 -7 46 92 -58 -126 -165 -277 -137 -120 -78 2 -174 -10 -6 -51 107 111 101 247 102 44
3416 44 122 89 74 98 57 143 -71 -269 -49 -127 -237 -119 -28 -83 37 -38 38 141 130 61 196 23 224 61 -36
3441c6J87p4j47P2k45N4K9q4J99O1k14L35j23j19K70p4j15K21j29M7P5j94P4q2
3465a2j51Q3N6j0L3k34J39J2o1R9K7r6K11k7j58L78j63n4J65j41R6k44M9K1j32
3490a14J05n0On2J19k15J50J66j65N7O5j4P6L2j19J06o9k8M3k8q6k1j16NJ45k42
3516b44K72m3j41P4P0r5J56q2N3J23j28M2J04n3j0o6m1J09k41n9J64k31K67q8
3540h8q4J25j41J71j1r2K18K2q9R2n3J7O8j31N5j0j08j34R0l1J78k58M1J91j43
3565a05k7M8R2M5J72j03k3jk1L3n6l9J78j89p6m5l0n8J67n4L7J12p4P4p2J8J39
3592A42m1N3J03k33Q8M4j74J11k27J56m2j1j96J76j51m4K59j30J37J44j52R3J5
3615A20q0K48k08K5J08k02p3O7j43J44Rj68J9j5l6J20M6j4J30rj02J69q6j6J07
$$ plain form
3441 -36 151 77 -70 2 -243 -189 -160 -244 -45 16 -198 137 14 -105 165 91 -24 197 68 115 190 -4 70 -12
3465 -12 -163 -80 -24 -34 -1 -235 -96 -84 -145 -46 -19 -115 96 69 -89 289 126 72 237 96 192 -52 -3 18 -114
3490 -114 -9 -59 -53 -105 14 -201 -51 115 -50 7 72 58 134 166 47 153 84 56 99 71 -15 -36 -152 -147 -2 -244
3516 -244 28 -15 -156 -82 -12 -107 49 -33 20 143 15 57 161 108 98 32 -9 100 -141 -200 -36 -267 0 -88
3540 -88 -172 -47 -188 -17 -28 -120 98 120 31 123 70 87 155 24 79 69 -39 -173 -83 -114 64 -194 -153 38 -105
3565 -105 -132 -84 8 53 225 122 99 98 77 110 54 15 193 4 -72 -117 -147 -205 -38 -92 -55 57 -17 57 -15 3 142
3592 142 101 154 257 24 112 156 -18 93 -134 22 -20 -31 -227 -51 -202 -246 13 -117 20 164 12 105 120
3615 120 40 288 80 105 213 11 -62 5 -138 6 15 -153 -134 -149 -185 -65 -19 -33 97 88 -14 155 69 53 160
3640A60j22Q4n7q5L6j44n1J98k81R6K45k78R2J5%J88j05P1P6pl6ol8K7N5l3n3
3667D7M5k16RJ4q3J18q2O8J69k56K51o4j15K37N4j24P2p5%n3j55J32J2j49O6j51
3693b29m4K03j53J3J76k1P9k2O0P5P2j46MN5j35j4K9j08K53k60N2p1m3M9lm9J02
3720g6J03K6R4q3P0r9M3K1j01Q1M8j33PM7k27Q2J5j52P4Q1q6J56m6NR0q0J16k5
3748E1K4p9K64k08Q5j10m0K8K3j83K9J54j43J12j41Q6J7m0P9m1J8K13q6RK0j46
3774eJ4J00j05R6n2j37jOL6R5j78J1P0o2NO8LP3O8j35L5Q5r2J36m1j41J14j61
3802i5K7k7N6j06K23k11J32m8J0N0n9J07o4J14j52Q0%M5mj02J45j36Qj04N8J6
3828c7o0o2L23k44PK6q1J61M5K6k8KP1l2m4j80K46j21o2M8k07O8J16j65N4J57
$$ plain form
3640 160 38 122 65 -20 16 -128 -179 19 -262 -166 79 -199 -107 -92 -92 96 -9 62 138 131 95 89 51 78 133 100 47
3667 47 92 -124 -115 -101 -184 -66 -148 -80 89 -167 84 20 -95 142 196 72 144 69 69 16 -139 -7 5 -144 -78 -229
3693 -229 -273 -70 -223 -210 -34 -55 24 2 62 137 209 63 67 122 -13 -27 2 -106 147 -113 -61 -132 -175 -126 -129 -178 -76
3720 -76 27 53 147 64 134 35 78 99 -2 79 127 -6 1 48 -179 -97 -82 -234 -160 -79 -165 -9 -55 -50 40 -40 76 51
3748 51 75 -4 260 52 137 27 -13 15 38 -145 -116 38 -105 7 -134 -48 -31 -71 8 -33 -15 198 112 121 141 -5
3774 -5 9 109 4 100 48 -89 -90 -84 -48 47 -131 -120 -50 -112 -107 -39 -36 37 105 -30 5 90 -2 134 93 -48 66 -95
3802 -95 -68 -95 -39 -145 78 -133 -1 -49 -39 11 -48 59 -5 109 -43 37 37 82 78 -24 121 -15 -7 -111 -53 -37
3828 -37 -97 -159 164 -80 -73 -47 -128 33 78 104 76 78 149 117 73 -107 139 18 -44 4 -203 -135 -19 -184 -130 27
3854B7j03J49j67J9J29m7N8J54j72J51k7j81J3M4j22J73j46NJ13k53M9O0r4K12
3878D4K5j04J31l5j1R9p5Q3q8l8J02K5l19J76rj92J77j28m0O8r3J89j4jJ70r0
3904E2j06J39o4R5L5k2j15M7m9m5M1j53L9J5k7m8R8N4P4r9N9l8M3NN5%N8l7o2
3933D4P4m4r4n8RM5m0n6Q7j43O6K08j31l9K08r1l2K50j24Rp3J23k2j12j05L2p0
3960g9l8K0r8O5J09j06J24k0PN5N2q3oJ86r4L9k22rJ55j68O3J5O2p2j22P5M4k2
3988f8MO8j26K55k11J87Q7l6j55Q0L2j19R3j85J43n0m4k8K5j32J40l8J19Lj37
4013i3J72j31N6Q1O5j05J06l3j41O5p8K4j2pL0k6j46L2j4Q7L9l7K1J03l8J53j03
4040G0q0J37Nq1K3j9o1J17k11N2j8k4m8K47k19JQ4o7J78l2j20K14j90P8N9j43
$$ plain form
3854 27 -76 73 -94 -75 54 7 65 219 47 198 171 -10 3 47 -75 98 -48 -43 70 -183 -134 -74 -168 44
3878 44 69 -35 96 61 50 149 74 157 69 31 133 158 -161 15 6 -186 -9 -137 -177 -109 -202 -13 -27 -28 142 52
3904 52 -54 85 21 116 151 129 14 61 12 -33 8 -145 -106 -91 -118 -166 -68 -14 60 -39 20 -18 25 30 85 85 143 106 44
3933 44 118 74 -20 -78 -69 -24 -64 -120 -33 -176 -110 98 -33 -72 136 45 13 263 139 148 75 198 176 64 -41 -9 -79
3960 -79 -117 -97 -195 -130 -21 -127 -3 -23 -16 39 91 8 2 188 94 133 -89 -98 57 -111 -48 -33 29 -43 -165 -90 -46 -68
3988 -68 -64 4 -122 133 -78 109 196 160 5 85 117 -2 91 -94 49 -1 -45 -73 -48 -180 -40 -78 41 44 -93
4013 -93 79 -52 4 85 150 45 151 118 -23 42 -36 -12 -24 -31 -1 -27 -173 -141 -155 -68 -29 -66 -45 58 20 173 70
4040 70 -10 127 132 51 74 55 -6 111 -100 -48 -66 -90 -138 109 -110 -109 -25 -92 86 54 -66 148 -42 36 95 -48
4066d8L0J67j39Rn8p9J35j15J16k5r1N8M2r8J12p9Q3Ml5N1K2n3O3L8j50P3j3j60
4094a40L7p2J40j14J17O2j13L7N0l1O7M1k6JN7l4j17J20o4N2l2r7K2j4r1M1m5
4121a46N4J54j54M1J31n0J11o5j15J21j16Q6K4q7p8K02j63K8m5L5j0J2O9q0l0
4146g1J40N8j72J80l7o3J0R5j61J94j35K2O6j47q5N0o6LJ22n9O1p5L3O2j3J4K8
4173E4o8J19K5j21J32m0j39K31j54m6P7j45nM0n7O8j5p6J29O3j67J19L6%%r4J2
4200b2Q4o2J4R4j33Jj7o2k7K9l2J87j70J35N8j03N2J27m6p2Q5p6k6mrK1q6o4O4
4229f0n1j2P9p4J24o4l1M7O9j3J2J5K4j25rM3J19j83J13Q1j49M7o9q8M9J16J6
4256B6j00j1L1M7K0J0l1K5J24k17K01n4q4J19r3p5K10j99PP1j40m0J31k8P3R7
$$ plain form
4066 -48 -18 149 10 19 -39 -118 17 -98 18 -7 -98 -40 2 -96 16 -63 20 24 -11 40 62 9 72 110 -40 33 20 -140
4094 -140 -103 -175 -35 -149 -32 30 -83 -46 4 -27 40 81 55 56 113 79 -38 82 18 70 38 -59 -37 -51 -142 -101 -146
4121 -146 -92 62 -92 -51 80 30 141 76 -39 82 -34 52 76 -11 -89 113 -50 -22 -67 -32 -42 -30 39 -41 -71
4146 -71 69 127 -45 135 98 35 45 140 -21 173 38 60 126 -21 -106 -56 -122 -119 3 -56 5 -70 -37 25 12 26 54
4173 54 -14 105 130 9 141 101 -38 193 39 -7 70 -75 -80 -40 -97 -29 -44 -120 9 72 -95 24 60 60 60 -34 -22
4200 -22 62 0 14 108 -25 -24 -41 -103 -130 -101 -133 54 -116 19 77 -26 26 153 107 35 120 44 18 14 5 26 -60 -124 -60
4229 -60 -111 -123 -44 -118 6 -58 -89 -42 27 14 26 41 65 -60 -69 -26 93 -90 23 104 -45 2 -67 -155 -106 10 26
4256 26 -74 -85 -54 -7 13 23 -8 17 141 -76 125 71 -13 106 13 -62 148 -51 -44 27 -113 -153 -22 -50 23 120
4282A20no4P5oN2j49O0Nj78J41p9J3Q6j30K0K3m6k4J55j73R4N6l6J03q9q6J22
4309F0Om2J31r3R5j20pl2n9o1J04mk4L1m2k7J63q6P2L7p2mrP0K9j21NP0k6l1o3
4340e0l7J15r4K5l9R1n1j3J8O4l1O9j0K0j10J08lj38M0K4P6q6j11O8O6j53J5J02
4368b5J30k07P6JP2P5j54J18K7l1rj08N2M6r2J37Q0k71O4q4P5j5n4P8N9j15J29
4395E4m7j0Q5p6k0J34l6po7l5l7R4l7l0j07Q0K03k44N6O7J6rkqJ35j37O5N7j72
4424c5J11k6l2m7K6nk0lo1OJ9j65K25j1Ml4N2k8M7k7PP2j85P3J3R4n8j44nJ35
4454bo4j6LP1J4m6j0J34j65P0M1n4pJ81j03L4M4j54P7q9L2l0r4J69m3p1l4J33
4482B1j9O4j14N6J69j91Q4n5rK2M8m4m9L4Qq5m6KM2J5r1J70n3L1R3j05KK08j58
$$ plain form
4282 120 115 51 126 120 172 23 83 88 -90 51 -28 -15 71 -59 -39 -16 -62 -86 69 -104 -10 46 10 113 24 -62 60
4309 60 66 24 155 62 157 37 30 -2 -61 -122 -18 -22 -46 -15 -57 -84 79 -7 65 102 30 26 17 87 116 -5 0 70 44 13 -50
4340 -50 -87 28 -66 -41 -80 11 -40 -53 -35 29 -2 67 57 77 -33 75 72 -66 -26 -2 74 -12 -123 -55 11 -142 -127 -25
4368 -25 105 -102 -26 -25 47 122 -32 86 113 82 73 -35 17 63 -29 108 188 -83 -19 -103 -28 -43 -97 -19 40 -75 54
4395 54 7 -3 82 6 -14 120 84 77 10 -25 -62 32 -5 -35 -142 -62 141 -103 -47 20 36 27 25 17 152 15 80 137 -35
4424 -35 76 50 18 -29 -3 -8 -28 -31 -92 -86 -67 -232 -7 -18 -14 -48 4 -24 23 -4 3 75 -110 -37 -24 70 12 -132 -137 -2
4454 -2 -66 -82 -79 -8 6 -40 -50 84 -81 -11 30 -24 -31 150 47 81 125 -29 48 -41 -9 -39 -133 36 -7 -78 -112 21
4482 21 2 66 -48 8 177 -14 70 15 6 28 76 32 -17 17 25 -60 -106 -104 -62 -47 -138 32 -21 10 103 -2 0 208 50
4511E0J0l3O6k1q4q1K32k58L5P7r8N4J5j37R4R6p7P9mK5M6kJ01j54J10Lj61l5
4539e2N6j38J00N6j48J08j02r9J23j3K17j4j37J66j48J77j5l8O7lj85L1j7o7J9
4564e6j8oO6M5j56O4Q5r1K49j58O1k3j70J27J09j61K25j07j46j9N1j06J73n2m6
4589f0J17j73J05p9M2j8K0J5K4J6p5P3Q7j00J34j46l3J25j25m3N5P2o0j29O9J33
4615D6J8j12j1L4L6J30j60Q2k0o5J24j17M3q0L3J1M9k55N1K02j68M1J1jO3J61
4641A46j79J8OJM0Qm0o9JK32j69o6PK4P1j38l5J32L6O4Mj56K8J25j63Q9O8m7J07
4670A45j38j7l6j02K06L0k30K5J6OJ09j11P1J8Q7j7j27J15j04J42l5O8m7p2O1
4695F3j3r4M0k6J2Qj76J44P2mN1r3M2J00m4pn1n1M9k7Q9N5k03J11k0m9l1Q6j0
$$ plain form
4511 50 60 27 93 72 -12 -93 139 -119 -84 -7 -105 -51 -36 -173 -79 17 -60 19 15 40 86 84 185 31 141 144 -17 -52
4539 -52 4 -134 -34 22 -126 -18 -120 -219 -96 -109 108 94 -43 123 -25 152 137 99 166 163 -22 9 -8 -75 -56
4564 -56 -74 -80 -14 31 -125 -61 24 -67 182 24 85 62 -108 19 128 -33 192 85 -61 -80 -29 -135 38 -14 -60
4589 -60 57 -116 -11 -90 -48 -66 -46 -31 -7 9 -66 7 94 -6 128 -18 -51 74 -51 -94 -39 33 -27 -156 -87 46
4615 46 64 -48 -59 -25 11 141 -19 63 43 -22 102 -15 28 -52 -19 -8 41 -214 -163 39 -129 -88 -77 -78 -15 146
4641 146 -33 -15 -9 -8 32 40 0 -69 -68 164 -5 -71 -64 -40 31 -107 -142 -10 26 90 94 -62 -34 91 -72 17 85 38 145
4670 145 7 -10 -46 -148 58 88 -142 -117 -101 -95 14 -97 -26 -8 79 62 -65 50 -54 88 53 121 74 2 63
4695 63 50 -44 -4 -30 -18 -10 -186 -42 30 26 77 -16 26 126 82 75 24 -27 22 -5 84 139 -64 47 27 -22 -53 33 23
4724B3KKj90J10J97k05K21j36q7J02M3j28R2j00j1J27j34N6J10j36k0M4QoM4j41
4750a13M3M1OJ3n3J75p8Pn1K1NO5j61J17Q4k03l7P7O5o1L9n5l5Q9j09J23l2J48
4778A30J5k33Q4J45q9M2l3m4l0L5j25J43j61m7R7K0Q6mj35L9J12q6J93l1O9j35
4804E7n8L8l9n8J17j42l4O4rm1J6N0R2n0On2N1k5N9jQ7j0n4K1o5m7J5p8l9J51
4834B2j26k5J56j58K0J14M5r2NJ28j6O5j88J26l8k2k2K4j27J12j09P3n8m3J62
4859B8k1m9R3p4j6M0Q4Oo3J26j11J7j39N9lJ5Nj16M0J76k04P7j55J63l1k4P9K0
4887B2m9K4J40j18o6R9p9R2L6p5R1k10l0J95j61L9O2o0K5R5%m0km7J09k2j14M0
4915dJ4j15J26l0m5P4j53M7J26k11LJ30K3o8P7j3O5J3K2m4K5m6MM1ok6l9M4q1
$$ plain form
4724 23 25 27 -163 -53 144 -61 160 24 -63 39 82 -46 46 -54 -65 62 -72 -16 94 -42 -62 -18 -10 -16 28 -113
4750 -113 -70 -29 -23 -10 -63 112 34 41 -10 11 16 81 -80 37 121 -82 -119 -42 23 -38 1 -54 -89 0 -109 14 -18 130
4778 130 145 -88 -4 141 52 94 61 17 -13 22 -103 40 -121 -168 -71 -51 35 31 -104 -65 47 -39 154 123 192 57
4804 57 -1 37 -2 -60 57 -85 -119 -55 -64 -105 -89 -39 53 3 9 -43 8 -17 42 41 128 118 64 85 20 -27 -12 -90 -129 22
4834 22 -104 -129 27 -131 -111 3 48 -44 -39 89 73 138 -50 76 38 16 -6 18 -109 3 -106 -33 -91 -134 28
4859 28 7 -42 51 -23 -39 1 85 91 28 154 43 60 -79 -20 -23 -8 -3 -119 -79 97 -107 -30 -185 -22 -53 -77 2 22
4887 22 -27 -3 137 19 -47 52 -27 65 101 26 117 -93 -123 72 -89 -50 12 -48 -23 72 72 32 30 -17 92 70 -44 -4
4915 -4 10 -105 21 -9 -54 20 -133 -86 40 -171 -168 -38 -15 -83 -6 -19 46 59 81 37 62 16 20 61 55 29 -10 34 -47
4944d7Q6j01M6K3j3L6j47M3jJ73l5r3R7n9R2o8k5r1J64q3J8o6L2J9j1qQ9r3j3
4973c6P2o1P8n3r3Q8n4N2J05o5J3r8N3no5Q4O1j32j17J71j37q5J37K9m6Q8K3K8
5001C5N0p0K1n4J33j5j39j7J26k30J98j58J81j7q0pL4j38J70k5p5J42m1p5J75
5026A24j09L5J01j34RP1j20j1j0L6o4oj9J36j0p7K52k00m4J3K8NL4J0p6K2j8N1
5054B9m9PJ39j90%r4mK42j52nj1K1L6NN8k8Q8K1o6M3j15J64j03n3O0l8q2K00j78
5083e5N9J60j52l2K2k4M7J5K0kn8L6n8K5qj6l4J6k7K9kl1M7K5j3L9KM8o3K8n7
5114a4N4l5J35p6k3o6Mm1J33l4k1L0o6n8M0n3J97j16o7J65o9mj4J01j98J00N1
5141E5j6k1Jp6m1nJ08lk1N9r%J5pn4J72j27J09K6j13p0N3K2n2l4K7J0p6N1P2k
$$ plain form
4944 -47 39 -62 -16 7 -6 30 -117 -74 -75 98 63 -30 67 8 100 32 7 -84 80 -3 15 -51 -19 0 -11 -19 70 -23 -36
4973 -36 36 -25 53 0 -93 -5 -59 -7 98 33 46 -52 1 -4 -69 15 76 -56 -173 -2 -139 -224 -87 -58 -104 -16 7 35
5001 35 85 15 36 -18 115 100 -39 -56 70 -160 38 -120 61 44 -36 -43 -9 -147 23 -2 -77 65 24 -51 124
5026 124 15 50 151 17 26 97 -23 -34 -44 -8 -72 -78 -97 39 29 -48 204 4 -40 -27 1 6 40 50 -26 -4 -22 29
5054 29 -20 -13 126 -64 -64 -158 -162 80 -72 -77 -88 -67 -31 -26 32 4 92 113 47 90 -25 139 36 -17 43 5 -77 123 -55
5083 -55 4 164 12 -20 2 -22 25 40 60 58 0 36 -22 3 -5 -21 -55 -39 -66 -37 -39 -70 -23 2 -11 28 30 78 15 43 -14
5114 -14 40 5 140 64 41 -25 -21 -62 71 37 16 46 -20 -78 -38 -91 106 -10 -77 88 19 15 1 102 -96 4 55
5141 55 39 18 19 -57 -98 -103 5 2 -19 40 31 31 46 39 -15 157 30 139 165 52 -18 35 57 5 -29 -2 8 -68 -17 55 53
5172E3J1n6j05J03k6P6KL0k8J33j35K9Pl2mj00L0m3J25q7J9j15R8O2N1j18L2P1
5200H3o2k1j0J86k45J86k37J76q9k2M3J3J02j76mJ53j63O8N4k9o4RJ28P2Lk06
5226e2M6K4n0M9k9Q4j41J11j4n4N0k3q0R1j2j3K4o1K8P4j19P5J41j89J8j0R8j2
5254E4r6J9L1q5J18n9j28J22m7j5J05m2J33j66M9L5M7L8j76J89r9MJ13k00lj11
5280a70K03r8J44m4j11O1J3k0j5Q6p8oO9o1k1N5J3J5j3l9N0r8%K32l25J76J9j91
5308a54OK23j51Q9l1j6J35j50M3J7l8L8J09j27J4P1k76J29J72j26j04R5K0p4O6
5333b0m6J70j81P2N1l1R1j47K2k4K8pK7qMp3M0p7R4lj8J32j35K5l0N8J19j43J60
5362A50j1r8kL2l3j12kK2K8n2Q2J7j2qR5k17J55n2l9J27o9N9m5n0L6rJ07j27J
$$ plain form
5172 53 64 8 -97 6 -20 56 58 88 60 193 58 87 94 62 58 -42 -12 -55 70 -17 2 -113 -15 47 98 -20 12 83
5200 83 21 0 -10 176 -69 117 -120 56 -33 -55 -12 1 103 -73 -77 76 -87 -19 35 6 -58 -49 79 151 154 -52
5226 -52 -6 18 -32 17 -12 72 -69 42 28 -26 24 1 -79 12 0 -13 11 -50 -22 52 -67 8 149 -40 -22 -32 66 54
5254 54 -42 -23 8 -77 41 -18 -146 -24 -71 -86 19 -23 110 -56 -7 28 75 113 -63 126 27 31 144 -56 -59 -170
5280 -170 33 -65 79 35 -76 -15 -2 -22 -37 49 -29 -35 34 -27 -48 7 20 35 22 -17 33 -65 -65 167 -158 18 37 -154
5308 -154 -148 75 -76 13 -18 -34 101 -49 -6 11 -27 11 120 -7 7 78 -198 -69 103 -23 -127 -32 -12 -86 -20
5333 -20 -66 104 -77 -5 46 15 106 -41 -19 -43 -15 -22 5 -3 1 -72 -32 -109 -15 -18 -36 96 -39 -14 -44 14 133 -10 150
5362 150 139 41 39 71 38 -74 -76 -54 -26 -78 4 21 9 1 96 -121 34 -18 -57 70 1 60 15 -35 1 -8 99 -28 -27
5391b7O7q8J2m5J08j61N9N2Lk5J01m8J99j78R8l7q1O8k05J09J2M0OKo0N6j63M4
5419h2j3J53r7j9K8R4k9L0k0j0N1j8O9q2mj9j47J43n0j83K80o9o3M7j3Q9P7k80
5447a37J82K4l6k4J26j85N8p9J00N7j35M1j06k2K05l0r0P9m1j7O8J9l9O4j17Q0
5473D5P4j13J13j01K3K8q1K5k0m9k1L3Q2j98J88m4P6nl3O1j00m2R7j61K10n6j38
5500a07J43n3NM8q9M1m0M4L0Ll4J2l0J20p9L5q7M1j08J25Q1j43L8Pm8K6J3j39
5528a45J89j25M4L3m3K3R1j87J27J8j06J91j51JM3p8N3J13k66R1K6J32J5j59K7
5553d3R2j02Q3r6K8J30rJ5j63J22Rl4J13j45K8j0o2J13j61P7no8L3J12j23J07
5579D1l1o7J48qo1N7j4p5O6j15Q6j9j2N9o1p9J31p4N3k6m3QL4J2K0nq4J10Q8j32
$$ plain form
5391 -27 40 -48 -36 -81 27 -134 -75 -23 -20 -45 56 8 207 29 127 90 9 77 -128 -19 -7 33 39 41 -19 37 -126 -82
5419 -82 -95 58 -39 -58 -30 64 35 65 45 35 86 68 137 55 51 32 -115 28 -22 -205 75 6 -57 -10 -23 66 143 -137
5447 -137 45 69 33 9 135 -50 8 -71 29 86 -49 -8 -114 -136 69 39 -51 28 -13 -30 38 57 18 82 -35 45
5473 45 119 6 119 18 41 69 -12 13 -7 -56 -77 -44 38 -160 28 -16 60 55 22 83 -17 -59 38 -123 87 31 -107
5500 -107 36 -17 -12 36 -53 -12 -52 -8 22 25 -9 3 -27 93 14 49 -38 3 -105 20 101 -42 -4 3 -45 -19 -6 -145
5528 -145 44 -81 -37 -4 -47 -24 67 -120 7 25 -81 110 -41 -40 3 -75 -22 91 -175 -84 -58 74 89 -70 -43
5553 -43 49 -53 30 -66 -38 92 83 98 -65 57 66 32 145 0 28 18 -44 69 -92 -15 -20 -88 -55 57 -66 41
5579 41 10 -57 91 83 22 79 65 -10 56 -59 27 8 -4 55 -6 -85 46 -28 25 -1 -44 -36 -2 10 30 25 -59 51 139 7
5609GQ0r3L5l8J5J5l1K2N2j26L1J3L7q6J11Q7j48O3j00q6K29J7r5k2K5j9J0m8
5637d3Q1j0r7p4R1J05j04J02lj59Q4P1k2n7Q4p6L8Nj07J85j5j17q2N7J03j13L6
5664c7k5j6N8okRM2L6l6L8j24J19K1p8r6J46j34J35oj20Q5m6o0k0J17MJ4j9K5
5693B4P7q8K4q4j3J49kmr2m2J09j57L1q9J35oj6k6J13j5q7M3pRJ06n2k2R5j35
5722b2J36o2n5QK7j7m9K8j27Q0l3N7m2M4ON5j07J93p3j43J42j11J38j5j22j19
5748a83J37K5K3m3L6l4j4J07L5j73J85m0q3R6nn4Q7q7r5J02M2n2J04k27K6J59
5774G4q0j26P8P6mm7M4M5J16j61l4J55j51J2P4m2P4j33Q0r4mj6L1J4R5j97J21
5801@R4j16N9M2L1j02M4o1R0n6P9k2p4l7l6R3m2Mr4J50k6o5J6j8L6L6qj2J09j29
$$ plain form
5609 7 87 -6 29 -9 6 21 -10 12 64 -62 -31 -18 19 -67 44 131 -17 46 -54 -140 89 106 11 -11 14 -5 5 -43
5637 -43 38 28 -69 -143 -52 53 -51 51 48 -111 -27 44 22 -35 49 -27 11 16 -91 94 79 -38 -120 -63 40 -73 -37
5664 -37 -62 -78 -20 -26 -28 -19 23 59 23 61 -63 56 77 -1 -97 49 -85 50 44 -76 9 -37 -97 -117 0 4 18 -1 24
5693 24 101 13 37 -47 -60 89 87 83 -9 -51 58 -99 -68 -157 -22 -28 -44 -70 43 28 -59 -16 -23 -14 92 40 18 113 -22
5722 -22 114 52 -3 5 32 15 -34 -6 -133 -53 -86 -29 -71 -27 -21 34 -73 120 47 -96 46 -65 73 58 -64 -183
5748 -183 -46 -21 2 -41 -5 -39 -53 54 89 -84 101 61 -22 74 69 15 102 15 -80 22 64 12 116 -111 -85 74
5774 74 -6 -132 -54 22 18 -29 15 60 176 15 -19 136 -15 -3 71 29 103 -30 50 -44 -48 -64 -33 -19 76 -121 0
5801 0 94 -22 37 79 110 8 52 -9 81 25 104 82 8 -29 -65 28 -14 -10 -104 46 20 -45 -29 -47 -11 25 17 5 114 -15
5831a5L3K2j21M9l8K27q8j41m1O7K7lm3NMJ67n0q1j6J05l1Kk9N1r8R0l4k8N1q5
5861d2J41j34p9J36n5N0P7n6jm6N7k4pj8K3n9m2J89m7qkj22J61j35Mo9J29n1P1
5890D1Kr6O5P9j59J67n9j02J22q6P5j21Q4j3L5j35J32p8Jn2J60j20kJ15m2j67
5916a54J39m2L8n1M4N1M5M8j41lK8J00p8k5mn2q3L8J13j08M8J1JJ27r8N1j8p5
5944e0m8K07j02N0l6p9PR7j39K6nN6l8J6Mm5mQ3R8j26M7m4m6M7P1Ql1n4QO8m7
5975aJ8j72J47o8O6Q1m2l8JOJ71j18K0J1q9R1k1l4O0n0j5pn5J01j13On2jJ55k7
6005C1M5j14J50j00Q3n3p4R0j3k7oqj21K2J43j04nQ9o2J22j35J50r1J11lj10J32
6032A42q6p1J2P2j25L7o7J18M2j24m2N2j5N5j28J20k6J49j29O4o8P6L5r2N2J21
$$ plain form
5831 -15 18 40 -81 -32 -70 157 69 -72 -113 -46 -19 -22 -65 -60 -56 111 61 -20 -36 69 38 40 11 62 -36 54 20 -8 43 -42
5861 -42 99 -35 -114 22 -33 17 94 38 37 -9 48 24 17 -1 22 -37 -79 110 63 55 53 -69 92 -43 -39 -108 21 -30 41
5890 41 43 -53 12 91 -68 99 40 -62 60 -26 49 -72 12 -1 34 -101 31 -47 -46 -98 62 -58 -60 55 13 -154
5916 -154 -15 -57 -19 -70 -26 25 70 118 -23 -26 2 102 24 -1 -5 -57 -140 -102 11 -97 -49 -38 -37 90 -8 43 25 -50
5944 -50 -98 109 7 57 21 -58 -51 46 -93 -67 -72 -16 -54 -38 -34 -79 -83 0 98 -28 19 -25 -71 -24 47 55 24 -30 -22 46 -1
5975 -1 17 -155 -8 -76 -10 71 29 -9 -8 -2 169 51 71 82 -7 84 63 29 89 39 24 17 -38 63 -50 -44 -96 -97 58 31
6005 31 76 -38 112 12 95 42 -32 58 45 18 12 4 -117 -95 48 -56 -61 28 -34 88 -47 103 12 123 120 10 142
6032 142 56 -15 -3 69 -56 -19 -86 32 74 -50 -92 -40 -55 0 -128 -8 -34 115 -14 50 -18 58 93 1 53 174
6058A74n4o5p0j51J05O0N0r2j9N7M7p4K3L9J3j26N7J07l2J0qnp5Q2O3k47J26K4
6086A9j7K4n8N8oK1n4Q2j36J36j22Q3L2Rn4Q8j32O8l9k1k2J9j15J74Po4M9j2j24
6115a07Q3M7J7j40J35r1N0p7J30k1m7J76j05j08J07j30O1J5m2J26j81M1M1n4J32
6140E8m8q9R8M7j18J11L0k10J71p8j9%K5N5M3j09P3j81J99j22Q6Q8j10Q2o7J59
6166A74k26M1P5M8p5j04P2k1m7QJ46j34k8pJ0Q8J35j65p0J09J9P3Lj36J73r9o1
6193Am3qM0O1r1jK3NQ3r0J1r6P4R5Jp1OM6m5L3j01J8j2Q0N1m8J1j8J25k7r7j11
6225i5J7R4m3j0J66j94P2J5p2J5R2m0J34l4j47J23j39K1l1J5N9N1j59Q4j20J60
6251C4%jJ0Q5k03J19RP2J0j83J30j12P6p7JM9n9N7M3pj62P4O7K2n7J4L3J6L4q1
$$ plain form
6058 174 120 55 -15 -166 -61 -1 49 -43 -62 -5 42 -32 -9 30 43 -83 -26 81 49 59 51 46 -29 53 116 -131 -5 19
6086 19 2 26 -32 26 20 41 -13 69 -67 69 -53 30 62 71 17 105 -27 41 2 -19 -41 -22 -137 37 44 -20 29 17 -107
6115 -107 -24 23 40 -100 35 -56 -6 -83 47 26 -21 155 50 -58 49 -81 -20 -5 -47 79 -102 -61 -20 -74 58
6140 58 10 -79 19 66 -52 59 89 -121 50 -28 -47 -47 -22 33 76 -33 40 -141 58 -64 22 110 0 82 15 174
6166 174 -52 -11 64 112 37 -67 5 -16 -63 -55 91 -43 -71 -78 -68 20 155 -10 -80 29 48 121 124 -12 161 62 1
6193 1 -42 -50 -10 51 -40 -41 -18 -13 70 -20 -9 -105 -31 64 65 -6 0 46 1 34 -67 -49 -61 19 70 22 33 15 140 113 16 -95
6225 -95 -78 16 -27 -37 129 -65 7 22 -50 -35 57 17 151 117 -30 93 -46 -25 -56 -41 18 69 -90 -6 -126 34
6251 34 34 33 43 128 -75 44 53 125 135 -48 82 -30 46 -31 -30 19 -40 17 60 53 -109 -35 32 54 -3 11 44 60 94 13
6281A3Q0r4lN5j20J29j88P8M7n1rL9R4r6K1R2J5L9p5j9%q9O3p4j9N3J17j42J02
6310E8o3n9J15j37MJ48m1k4K3n1P9m2k0JK2k9L2j31J04M1k9n9qL0J10r4p6j1K02
6339I5j23K1O0K5K0j02M8k4k5Q3p5o0K7J8j8J07%n9j07Q7O1m5J4p5L1k8J12K9
6367I7k18J58m0J26J7m2n1j56M9m5J07j21O5j3NK18j08o3K7p1J61j13p4J43o7
6392i%J6L2Ll6o2%PJ2N6r6Q7l4K7K3n7jJ19o2p8O0o2JO7k3K5n6M7l7k4M0mj05
6425a24L6Q4o0M3nM7O7l8n8q4P2k2O3p5J26j01M9j83J22L2K8l3k5L4m2O1k4R1
6453H1kJ4r7j00J31J4k2n2j2j8L9K1J8P0j12M2j8r7J22L5k8Qm1L9j4j20J63k5
6481C9j27J99j40k0K5O5o1N0o9JO1n7n3J44J3p3K0j02J02l2L6J11j86J26M9j0
$$ plain form
6281 13 93 -1 -4 51 -69 60 -128 -50 -3 -54 -63 -24 70 -26 -5 87 102 141 66 47 47 -42 21 -53 -72 -19 98 -44 58
6310 58 -5 -64 51 -86 -82 66 25 1 24 -27 52 10 -10 -9 13 -16 16 -115 -11 30 1 -58 -66 -36 74 -20 -96 -107 95
6339 95 -28 -7 53 78 98 -4 44 20 -5 78 3 -57 -30 -12 -30 77 77 18 -89 -2 59 14 28 -47 -16 -44 68 97
6367 97 -121 37 -3 123 140 98 47 -109 -60 -105 2 -119 -54 -67 -62 156 48 -15 12 -59 102 -11 -85 58 -9
6392 -9 -9 7 39 42 6 -56 -56 -49 -37 19 -77 10 -24 3 26 -31 -32 87 25 -53 7 -55 -54 13 -10 15 -41 6 -31 -55 -15 -19 -124
6425 -124 -88 -4 -64 -21 -26 21 88 50 -8 -92 -20 -42 21 -54 72 -29 20 -163 -41 -9 19 -14 -39 -5 -47 14 -10 81
6453 81 79 93 -4 -104 27 41 19 -33 -45 -63 -24 -3 15 85 -27 15 -3 -100 22 57 29 37 -4 35 21 -99 64 39
6481 39 -88 111 -29 -49 -24 41 -20 30 -39 -38 23 -34 -87 57 70 -3 17 -85 17 -15 21 132 -54 72 121 111
6507A11j38p1J41k9m1N7O0j10M0n2M8n1M8Pj9L5J4l4M6M0j23Q8M1j62M2J9j74
6534a67J17k0j3MJ58p4p2N7n0J91l3j38J33J0j11Q5l6N8p6j12J10j30P7K4q1R5
6560FJ1j47J61L3q9O8k17J99M5m3k0J5O6j04k5k4K6R4j09j3K4M8L9Jj30J27j83
6587a41K01N5j27L3NK0K8j07R4J7m8j29k2j02J16Q3M2j29M7J23o6J5q6J04r0P0
6613FJ04j06J19j53L4k1K7M9j35R5R2j03j13O2J38n2KK4k0QJ9j52J91j18K1r2
6639g4L2N7N7r2l3m6RK7O9nk4n9J07PKm5J2QO8o6o7J19qj02J04k87K93m6j10J26
6669C3j93R0J16n1M6km1J0K5M7j11J00j37J66o9j60J10lL7l2j5k9k1K3ML8M3k
6697B2m8Q8ml2R2n4P3j08qK8K0j33Q8j12R7n5J14j31L5N5Qo0l1L1Q8j43O4l7Q3
$$ plain form
6507 111 -27 -98 43 14 -27 30 90 -20 20 -32 16 -35 13 20 1 36 50 16 62 102 -21 67 108 -54 -12 7 -167
6534 -167 -50 -70 -83 -79 79 5 -67 -10 -60 131 98 -40 93 103 -8 77 41 99 23 -89 21 -109 -32 -8 -89 6
6560 6 17 -130 31 64 -25 43 -174 25 70 27 7 22 88 -16 -41 -65 -39 55 -54 -67 -43 5 44 45 -85 42 -141
6587 -141 60 115 -12 21 26 46 74 -33 61 78 30 -99 -121 -223 -107 -24 18 -111 -64 59 -7 8 -78 26 -64 6
6613 6 110 4 123 -30 4 -17 10 59 -76 19 111 8 -105 -43 95 43 45 69 49 57 76 -76 115 -3 18 -74
6639 -74 -42 15 72 -20 -53 -99 -90 -63 6 1 -23 -82 25 32 34 -11 1 9 77 11 -56 63 55 -47 57 -230 63 17 -93 33
6669 33 -160 -70 46 -5 41 39 -2 8 33 80 -31 69 -68 98 29 -131 -21 -24 13 -19 -34 -63 -84 -61 -57 -19 24 22
6697 22 -26 62 58 26 118 64 137 29 21 49 69 -64 24 -88 9 -46 68 -63 -28 27 35 -25 -56 -25 63 -80 -16 -53 30
6726C0o8O5r6Q0m7O4N8j62J84j33j9J46j03pL5n4R9k08N1O3J04j08J33q0m1K8
6752A4K4k4N2j65P3N9m6jK5p3L1L6K9Jl9O4Lq3OL7M6n5N8j8j31J10k5j04J73j35
6782e8J07j03R9p2m4O4oM4n7P7l8p7O6J3Q0j05Rj0Ol8M5k4L9No5L2P6r5n2MP4
6813dj33J44R1k6k1n3L6rr3N6L5k9rj4M8j7K0o1P7L0m6mK4j17J75q4N5l9p7P3
6843B8L6j47J58q2n3J53j65K0M1K6o4Q3Nq3J28q3j5MK7M4j06J36j15L9j0K4p0
6870d1R0j69M0J30m0o3Q2N2j66O5M7J00p1r8N6j6mJ17l6j10N5r0jJ2m5J30m4J3
6898el6p5J35R4j76J86j09L1k7k0l2o7J87r7j4M8k3m2L5M8o0O8p5R0Lp1K8j51
6926a27J06n1K06j34q4K27j56n4j7J18Pj07P9j32P1J09j07R6l4N8qOp5JQK1k1
$$ plain form
6726 30 -38 27 -69 11 -36 28 86 -76 108 -25 -44 102 -1 -8 27 -27 72 -136 -85 -22 82 -26 107 27 -14 14
6752 14 38 14 66 -99 -26 33 -13 -14 11 -62 -31 5 34 35 -4 60 63 -20 -14 23 69 14 72 54 -77 33 8 -96 77 -58
6782 -58 49 -54 45 -27 -71 -7 -13 31 -26 51 13 -64 2 15 95 -10 -1 -11 -5 -43 2 -22 17 22 -43 -11 65 -30 -82 -78 -4
6813 -4 -137 7 98 72 51 -2 34 25 -68 -12 23 -6 -15 -29 19 2 22 -39 38 68 22 18 42 -75 100 16 71 32 -45 28
6843 28 64 -83 75 -7 -60 93 -72 -52 -11 15 -49 34 39 -44 84 1 -14 -10 17 61 -45 91 -24 15 5 29 -41
6870 -41 49 -120 -80 50 10 -53 29 81 -85 -20 27 127 56 -42 14 -2 -6 111 75 -35 20 -70 -71 -59 -104 26 -18 -5
6898 -5 -41 -116 19 113 -63 123 14 45 18 -2 -34 -101 86 -11 -25 23 0 -42 -7 41 -19 49 -26 64 67 -4 24 -127
6926 -127 -21 -72 134 0 -84 143 -13 -67 -84 34 41 -66 13 -119 -48 61 -46 50 16 74 66 72 -3 -2 6 27 6
6953Fl8P9L7j11M0o9m0k1O7O3J2r5M0l5J46j70J28m4l9R1l4P9r9M4l5J2m9mjO8
6983B8j43J07k9J7j0l9N9J21m6k7m1k7J82j09l3j07J58j72J56j61J08n2K2Q8j49
7008i9J42p4J12p3o7K0M5r0r4J93Mk0K8Lm7k0O8l7p1M7L9P6l6n7m7n1J44l2J2
7037A8R1j37M5j6J5m5N1K0k5n4m8m8J04m7J3J20M9j07o5J42r4Q0J0j68Q1Q0o1
7064Do%m1N6n3Q2j6n0j6L9K9j14N3J08j70J10mR4k8p6ONQN0j50J01o2J3k7K6J2
7095a7m1MM4J9j0mM2jL4k8P4k14N8N9N5n8M1K1n6m8j3N8j67Q9J39p4l6M5o3P8
7125C0j16O1lN0N2q8L8L4j0o5o2N3p5k0J15k6P8k8K1j3J04j62l0K32k88J21N2
7152E5j42J14l9KN6j57Q1R8j53J03j24J90k1m8p9lL8k7J06j69J09J1k2o4J38R1
$$ plain form
6953 6 -32 47 84 -27 13 -56 -96 -117 -50 13 25 -70 -30 -65 81 -89 39 -5 -44 47 13 92 -7 37 2 14 -35 -39 -40 28
6983 28 -115 -8 -37 -20 -30 -69 -10 111 65 38 -3 -30 152 43 10 -97 61 -111 45 -116 -8 -60 -38 50 -99
7008 -99 43 -31 81 8 -59 -39 6 -84 -178 15 19 -1 27 30 -17 -37 31 -6 -77 -30 9 85 49 -8 -55 -106 38 6 18
7037 18 109 -28 17 1 16 -29 22 42 17 -37 -85 -133 -29 -76 -63 57 106 -1 -66 76 -18 62 72 -96 -15 65 4
7064 4 -2 -2 -43 13 -40 42 26 -24 -40 -1 28 -86 -33 75 -95 15 11 105 77 1 7 12 20 70 -80 21 -41 -28 -55 -29 -17
7095 -17 -58 -54 -10 9 -1 -5 37 36 70 42 116 -98 -40 19 74 16 57 78 22 -26 -39 19 -148 -59 80 6 -30 15 -48 30
7125 30 -86 -25 -28 22 74 -14 24 58 48 -17 -79 -26 -101 -121 -6 -32 46 18 39 26 130 -32 -62 170 -118 3 55
7152 55 -87 27 -12 -10 46 -111 -30 68 -85 18 -106 84 63 15 -64 -67 -29 -56 50 -119 -10 1 -21 -85 53 144
7178A44k00L8L1p9J25n7j9P1j00J42j9o5l5Q7l6P1k5l7o9Q0j58Q8L8n7j3J6M6
7205Hnk9O7o5N1J6o2J06j22K6jKl3J24q8J3O2j19J19l2Ql6p7O2L1M7j00J7o1r8
7235a69J62Q7p6Q8r6L5R3r4J5j40q5J04L8k2P5q0r6K2J70o2J26p1R6n0j12K4L7
7262A9l8k8Q6k6m2l7M8N3kK0j15M5mpo5R6L8j37K52k15J07mj27J23j6j29Q6j26
7290a45J26n9J35J1q7L7l6M1m0P9n0k4l5J20r8l5P6l1mj3O7rL3q0J7K3n8J16k7
7319E0p0l8Q0J3K5k0k2J8K4n1J0m3P5o5J65j86L1Np4J20p2O2j61QQ7J5J9k8n8
7348h1qQ6M9K2MJ0m7k5jj10J37N8kp7rm8JJ72j37oM5n2O5OM7j87P5L0j7k5o0Q8
7380CO5j04K7l1OO4JJ4j3m2j4J48k24P3Q4o5r8J42j07J62j34R0q7J05q7N6l5q7
$$ plain form
7178 144 -56 -18 13 -66 59 2 -17 54 -46 96 77 12 -23 64 28 99 74 37 -32 48 -110 -22 16 -41 -54 -38 8
7205 8 3 -26 41 -24 27 43 -19 87 -35 -9 -10 -8 -41 83 -5 8 70 -49 70 38 46 10 -67 -5 26 73 -27 -10 -71 -169
7235 -169 -7 80 4 92 -4 31 124 30 45 -95 -180 -76 -38 -60 15 -65 -161 -139 31 -31 95 24 120 70 -42 -18 19
7262 19 -19 -47 39 13 -29 -66 -18 35 33 53 -62 -17 -21 -28 -93 3 41 -96 156 -59 48 44 -83 40 24 -105 -19 -145
7290 -145 -19 -78 57 68 -19 18 -18 23 -17 62 12 -12 -47 73 -25 -60 16 -15 -19 -32 35 26 59 -21 -4 19 -39 77 50
7319 50 -20 -58 22 35 60 40 18 36 60 9 19 -24 51 -14 151 -35 -4 1 -73 47 -25 37 -124 -116 -29 -14 5 -23 -81
7348 -81 -89 -3 46 68 72 82 35 10 9 -101 36 94 92 15 6 -42 -41 131 -6 -12 33 -19 46 52 99 -88 -13 17 0 -25 -85 3
7380 3 68 -36 -9 -40 -34 30 31 45 32 -10 -24 124 -100 -27 57 -8 -106 36 -71 91 -43 47 -40 65 -22 34 -1 -88
7408h8J25o1L8j47P5J57j17nJ06j95J19K5R9j09pN5j31J2O5l9jQ4j44M6N1N4n2
7435A5Oo0N1q9N6M5j5r1J14m4J2k7o1P6J2O0j79K15q6m3L4jP2j18K9l3J39Mm9
7464D4k8O0j0L7j81J72j09J89j38r3J49j11Q2n3K4j77K16j18J13K4p3Q0k19J77
7488E7m1M6n1l1l4R4o6K7jl0J8R2j18N3Q3j26Oo0J30j72K34jr3K7q0P3K7j34Q9
7517A8l9J6n0P7k2j13J59rN5r1K2o4R7q5O2O2j26J9J0nM0mp6p6J50n1J19j49O1
7546GM1rO1k00J44J2o2Q9p9Q1o1%j26J01O8r6N9Qp9K3O2n6P2j5m1K5L4j09J41
7575I5k0o0Lk5R4p6n6M5J6j07J01K0j41J54p4J87l24K07M1J5j20N3m8K4Q0n7M1
7602F8j01R1P5j29q2J03N9o6q7M5L8k2r0K44k15J00j16M3R9n1M3p3N1J2n9P8j15
$$ plain form
7408 -88 37 -24 14 -133 -58 99 -18 -23 83 -112 7 32 131 22 15 70 -61 -49 16 -23 -24 60 -84 -38 13 67 15
7435 15 21 -39 12 -77 -21 24 9 -82 32 -12 0 -27 -88 -12 0 60 -119 96 10 -33 1 0 72 -46 -17 -50 89 93 44
7464 44 16 76 66 103 -78 94 -15 174 36 -57 92 -19 63 10 34 -143 73 -45 68 92 19 99 -120 57
7488 57 16 62 11 -20 -54 40 -26 1 0 -30 -12 80 -38 15 98 -28 -22 -82 48 -124 110 109 16 43 -37 36 63 -71 18
7517 18 -21 -5 -55 22 0 -113 46 37 92 1 23 -41 56 -29 33 95 -31 -12 -2 -7 33 29 -47 -123 27 -24 95 -54 7
7546 7 48 39 100 -100 44 56 -6 83 4 85 24 24 -102 -1 67 -29 30 38 -41 -18 44 -12 60 45 4 29 63 -46 95
7575 95 75 15 18 -7 87 11 -45 0 16 -91 10 30 -111 43 -31 156 -168 39 80 95 -25 28 -20 4 84 27 68
7602 68 -33 58 133 4 -78 25 84 18 -69 -24 14 -8 -98 146 -69 31 -85 -42 57 6 49 -24 27 39 -20 58 -57
7629e7J64j37j5J3R5j20J04o0O1l9m6J02k7KN6n4k2j1l8M1J1k0l2k8P6j7n3R8
7657D7m7P1j20M0J17p7rj3m1L4O0j46K43k04R8k7k9o8M6Q8p8l6J34K6J5q9r4J35
7685G6j7k0J4jOL1k9K0j29P5R8j76J12n0jM1r7o0R2M2L0j02J6M0j06J25J0OM2
7714H8j4q8J6j01P8P6m0MM9r9O8M5N3k12N2LL3m9l8J2RLJ24j12l7P2J2r6J25k4
7744A2L3j67N4N9J2J04j9m7j21J12M8j9n6M9k1r2J49p9k6n3N5j9KM9j23J72j6
7771E2o7k4J55j26OJ09j53J45j42L9m9r0J57o8J19k5j83R7P1k5Q9k15K54m1o3
7796B2O3l1J14j25L8j38k7M7j9J23q9J00m8j10R4Ro1J7q1M5R4J4j51K11q0p3P7
7823C5M9j6K5o2j0P5p9K2pj22L1Q2q6O3J5p6k9q3J13N0J38j22R1j52J59j15R2
$$ plain form
7629 -57 107 -30 -45 -32 63 -57 47 -13 48 9 -37 65 38 40 96 42 20 9 -29 12 23 3 -29 -57 19 2 -51 47
7657 47 0 71 -49 -9 108 31 22 9 -32 2 62 -84 159 -45 53 26 -3 -71 -25 63 -15 -51 83 109 124 35 -59 76
7685 76 59 39 53 52 58 89 60 80 -49 26 124 -52 60 10 9 50 -47 -107 -15 27 57 -45 -29 11 -95 30 40 46 88
7714 88 74 -14 2 -99 -21 55 15 19 68 -31 37 82 135 -77 -25 -22 11 -38 -76 -64 -55 -52 72 -40 -77 -5 7 -89 36 12
7744 12 45 -122 -68 -9 3 107 88 41 -80 32 80 61 5 54 33 -59 90 11 -15 -68 -13 -32 -30 19 -104 68 52
7771 52 -15 -39 116 -10 -4 105 -48 97 -45 -6 -55 -145 12 -56 63 38 -145 -48 23 -2 87 -128 126 85 22
7796 22 85 54 168 43 81 -57 -84 -37 -56 67 -22 78 30 -80 14 23 -38 -21 -102 -57 37 51 -100 111 31 -42 35
7823 35 84 68 93 31 21 96 17 39 32 -90 -59 23 -63 0 15 -61 -90 -173 -60 -10 128 6 97 -55 104 -11 81
7850H1j42k1O3N9p7Q3oj12J00k2k3rJ06q6K3P2j46J12O4j53M3k5J5Jo5l6J38j1
7878B6n8l3K47k76K9J15r9J6J73j37jll2J08j87P1J10p8J8o1O2%p7K5J69j02j21
7905i6O5l1J26l0l6q0J48n0O3n8Lm3N8qm1oK5p6LJ31L1j51P1j63Q7J28j45J38
7933F3K0j06k4J02p5Q4j52J49j22J01l8J39j00P5j11JJ07j31N4oJ06j53K9J5L
7958C0K1m5J3j18R6%q2J10K7k1j06N7m4O2J12n7n9P0L9p3R6n7k6j18L4Nj11J42
7986cQ6j28K4m1LL7N5n3L1L8m9k0nk0poj7Q6n8J16k0Om8j17J45KK2k12J28m8P2
8017aM6J2j3Mj5r5J61m6K0j85J31np3m2J03j5k9j5R1K8j07K17l7j13k1j4O7oo9
8046b1rR4m8J4m8l3R2p5L7%KJ09j01J4j5R4j18J09j32J9J4k0J4J07j58L5R1k9
$$ plain form
7850 81 -61 -82 -19 40 -37 46 40 -72 28 6 -17 -26 80 -6 17 89 -57 55 119 -34 9 -16 -1 0 -65 -101 37 26
7878 26 -32 -65 182 -94 -65 50 -49 -33 140 3 2 -1 -33 75 -112 -41 69 -9 9 -52 10 10 -67 -42 127 25 -96
7905 -96 -31 -62 64 34 -2 -82 66 16 79 21 24 -19 39 31 -10 -16 9 -67 -64 67 98 -53 18 -145 -58 70 -75 63
7933 63 83 -23 -47 55 -20 64 -88 61 -61 40 2 141 41 116 5 6 113 -18 36 30 136 -17 12 27 30
7958 30 51 6 19 -99 -3 -3 -85 25 52 31 -75 -18 -62 0 112 55 -4 66 105 32 128 71 45 -73 -39 -34 -145 -3
7986 -3 83 -45 -21 -62 -59 -22 33 -20 11 49 0 -20 -25 -45 -52 -58 -75 11 -47 69 49 55 7 -110 35 37 59 -153 -25 -73 -1
8017 -1 45 57 44 48 33 -62 99 53 73 -112 19 14 -59 -101 2 -13 -42 -57 34 62 -45 172 135 22 1 -13 54 48 -21
8046 -21 -30 64 16 30 -18 -51 41 -34 3 3 5 114 13 27 12 106 -12 97 -35 -16 -2 -22 -8 99 -59 -24 67 38
8074C8l6J8L3r7N6L6q1l7J19L6j10R5j72Q7oo4k9J31L3o8J18j96P3L5k6P1Q9j96
8102e0L3m1J8L7l1J26m9l9j10P5N5M4j78l6J03J43j76R6o1R4j5p3PJ35j64P3o
8129A0O4j4m0j13R1PJ2M9o1J3n2O7l3Nm8j2n0N7J05k3K8o5N1J3j21K6M2J4O0k0
8159F2l1L7k7q1R9r1r7J00q1J02k0J15k9Lj82J14k6J38j25J6R0j53J33r7M4o3
8185e0R9L2l7o3L9K
$$ plain form
8074 38 2 20 53 -44 12 48 -33 -70 49 85 -25 70 -102 -15 -21 -85 -114 17 50 -18 100 -96 -23 12 -14 57 146 -50
8102 -50 -17 -58 -40 -3 -34 92 43 4 -106 -31 24 68 -110 -146 -43 100 -76 20 -41 53 38 -35 -28 107 -57 16 10
8129 10 74 60 20 -93 -2 5 17 66 5 18 -34 33 0 5 -43 -55 -105 -48 57 34 62 -3 48 61 -60 -34 8 22 82 62
8159 62 31 68 41 -40 59 -32 -129 -29 -110 -8 -28 87 58 61 -121 -7 -33 105 -20 -4 86 -67 66 -31 13 -50
8185 -50 49 81 44 -19 20 22
8191B2
$$ Imaginary data points
##PAGE= N=2
##DATA TABLE= (X++(I..I)), XYDATA
0@%%%%%%%%%%qJ6j6K4l2M0m8N6p2Q8j04J20j44J68j92K31k71L12l60M13m72N39
32B88o16O96p84Q86r98J119j250J394j553J726j917K124k349K596k866L162l486
49a828L841m232M662n135N662o255O923p676Q538r537J0711j2108J3807j5931
63h558J8666k2340K7561l5613M9746q1540K75093o6508n62195M22587K40516l91185
75a33770r5462M38747p2950l21751J62529K26801k78356j27862K53472O6968j79003
86f0637M5432J21570p4127j33432K4499J00276M7470n8841m6229O3146M9097j26190
98d7966p9071J41116P9457j26273j3094J23965l1245j18297K6967N1404l5798
109b8835K6863R3367l6666j09666P220N8333q627j6725J2632K3186K5228k7218
$$ plain form
0 0 0 0 0 0 0 0 0 0 0 0 -8 8 -8 16 -16 24 -24 32 -40 48 -56 64 -80 88 -104 127 -144 168 -192 221 -251 288
32 288 -328 368 -416 470 -528 591 -659 735 -818 908 -1009 1115 -1234 1362 -1504 1658 -1828
49 -1828 2013 -2219 2443 -2692 2970 -3285 3638 -4038 4500 -5037 5674 -6434 7373 -8558
63 -8558 10108 -12232 15329 -20284 29462 -52078 223015 156507 -405688 16899 257415 -133770
75 -133770 -229232 209515 136565 -185186 -22657 204144 -74212 -202074 51398 118366 -60637
86 -60637 -15205 106365 32238 -101194 -76695 23581 71051 12210 -34019 29127 78224 -47966
98 -47966 -127037 14079 93536 -32737 -45831 78134 46889 -71408 -44441 6963 -28835
109 -28835 -1972 91395 54729 -54937 -47717 10616 1989 -14736 -2104 21082 46310 19092
121A9092o7257J1941N4559l7598l4169J01009N5453j23928o3438R7349J0511q2356
133e8832N3325R0628o5155o4972O2950Q973q8974J7092R6828j9082n7905M1595
145A6471K1645p0753k8195N1135L0529k633N598r368k7677j306O478j1984J5570
158d490L3792r166j7515J1468j3469l9174O494M2458R963j1477R380m985l6518
171b3239r987K4313J3458K461N781O193k429k4421k2769J5030K3941l665j112
184C555K4483j686m8450j4143L6032o66j7111L6507K1993m2257k3411K1729p54
197d179k1480K0873L8371j1479k5160O656p162k3313J0861K4716P293Q55m434
210A2418j3344j3607n766N198J2025J6733Q611j3534j0328j993j7207k982K8149
$$ plain form
121 19092 -48165 -36224 18335 -19263 -53432 47577 103030 -20898 -84336 13013 23524 -58832
133 -58832 -5507 85121 19966 -45006 17944 26917 -62057 -44965 51863 32781 -25124 16471
145 16471 38116 -32637 -60832 -9697 20832 18199 23797 14429 -13248 -14554 -8076 -20060 -4490
158 -4490 29302 20136 2621 14089 620 -38554 -32060 10398 20361 8884 18264 13279 -23239
171 -23239 -33226 -8913 4545 7006 12787 18980 16551 -7870 -30639 -15609 8332 4667 3555
184 3555 28038 26352 -22098 -36241 -209 -875 -17986 18521 40514 -1743 -25154 -3425 -4179
197 -4179 -25659 -4786 33585 22106 -3054 3602 -3560 -26873 -16012 8704 15997 16852 12418
210 12418 -926 -14533 -20299 -15101 -3076 13657 22268 8734 -1594 -3587 -20794 -23776 4373
223D373J3446n728L626k786k3572j5793J3735J5724m39J0992J2578k1219k3044
236a8107L169Q64Q9J8958J7394m144j4527q944p974p526J0472J9977P899J819
250A9419n781j9087j1722Q22L565J2765J7893L792j3371j3863o026q967j711K3703
264A431K1280n185q575l610j3939j5752M838K5122J4711n500j696j402k1308k0182
278b9767R146K5172P417n420J1363K340l7717k0960K9395J7387j2763J3182L0192
291C8967k1944m7654J0155K9074k0782n317M8040R935m5796j4711J8590j2718
303a4161j9579L4045L8429k1353k6050J0423m643k5524N449L4420J5657j3815
315A3298o652N210j8103k4860J1253K8672R354n575k77k790k5084j8159J9663
$$ plain form
223 4373 17819 12091 15717 12931 -10641 -26434 -12699 3025 2586 13578 26156 4937 -18107
236 -18107 -14938 -14074 -13985 4973 22367 18223 3696 -5248 -13222 -20748 -10276 9701 17600 19419
250 19419 13638 -5449 -17171 -16349 -12784 -19 17874 21666 8295 -5568 -11594 -20561 -22272 1431
264 1431 22711 17526 8951 5341 -8598 -24350 -19512 5610 20321 14821 13125 11723 -9585 -29767
278 -29767 -20621 4551 11968 6548 17911 20251 -17466 -38426 -9031 8356 -4407 8775 38967
291 38967 17023 -30631 -20476 8598 -12184 -17501 30539 40474 -5322 -20033 -1443 -14161
303 -14161 -33740 305 38734 17381 -8669 1754 -2889 -28413 -22964 11456 27113 13298
315 13298 6646 11856 -6247 -31107 -19854 8818 18172 12597 12320 9530 -15554 -33713 -14050
328a4050J9509k51Q917Q334j6220k2695l036J1353M842O625J9348K139k0490j2608
342h283q377n524J5098J9044K671l137l129j2896j9850K550K4170K825l728K2161
356B3595J39l6241q839J8622l601m842K9666J8155l4018k2739K0229p425k4711
369c2010L0175L3059k2850j5959J7553r614l0873J2682L3198n973o937K2495j0534
382A4412l8064N237K2113p240J661K2869k359k6585m920Q738j0190j232K5559
395I999P945j3526r54j727j5212l787J4899J3606J604k263k029j0325j1258L23
409a2705P655R441N022k444p46o003j5070j374J2527N516K805Q677L52j5907j1630
424a3884P536M770k308J2268J0780j2658j2022J263l077n736Q240J4826K6p390
$$ plain form
328 -14050 5459 5208 14125 22459 6239 -16456 -19492 -8139 -3297 3328 22676 24815 4325 -8283
342 -8283 -16660 -22184 -7086 11958 14629 11492 8363 -4533 -24383 -21833 2337 5162 1434 23595
356 23595 23734 -12507 -21346 -2724 -6325 -11167 18499 36654 2636 -20103 126 -7299 -32010
369 -32010 -1835 31224 8374 -7585 9968 354 -30519 -17837 15361 9388 2451 24946 14412
382 14412 -23652 -18415 3698 -3542 -1881 20988 18629 -7956 -12876 -4138 -14328 -15560 9999
395 9999 17944 4418 3464 1737 -13475 -17262 -2363 11243 12847 10584 8555 -1770 -13028 -12705
409 -12705 -5050 4391 9413 6969 6223 220 -14850 -16224 -3697 1819 4624 13301 13653 -2254 -13884
424 -13884 -6348 -1578 -3886 8382 19162 6504 -5518 -4255 -7332 -13068 -4828 9998 10024 2634
438B634J09o579j2032N628J2578L215L326K868p228j0603k869L375K364O400R491
453A2677l311r106k584o644n464R445R971J662J107j328q799r691J964R076K767
468A742N117Q080p714j1680j020k302q29R121R440O03n973o081n034o701L379
483i852J1886L842K469J906r851r112jJ507N440R402M947l030q543n379m146m116
499a2631R245J2432p89j218j278j1743q060L739P443O516N129L528n649j2645
513e981m038J903J781R958R520j812n304p535r264j682N597Q855P108J499k977
528G628r733j0178O65M448N607J1335M627o344q166p086l997K254Q469J0680K849
543A3058m801n551r911p578M824P925P205O397j232q838r099m651J875O136J0272
$$ plain form
438 2634 2743 -3836 -15868 -10240 2338 5553 8879 11747 4519 -6084 -8953 -5578 -3214 3186 12677
453 12677 9366 260 -2324 -8968 -14432 -4987 4984 6646 7753 6425 -2374 -12065 -10101 -1025 1742
468 1742 6859 14939 7225 -4455 -5475 -7777 -8606 515 9955 10558 4585 -1496 -6530 -13231 -9852
483 -9852 2034 5876 8345 10251 400 -8712 -8713 -7206 -1766 7636 12583 9553 1010 -4369 -8515 -12631
499 -12631 -3386 9046 8257 7039 5761 -5982 -14042 -10303 -2860 3656 8785 12313 6664 -5981
513 -5981 -10019 -8116 -6335 3623 13143 11331 6027 -1508 -10772 -12454 -6857 1998 9106 10605 7628
528 7628 -2105 -12283 -11618 -7170 -1563 9772 14399 8055 -111 -7197 -11194 -8940 -471 10209 13058
543 13058 8257 2706 -7205 -14783 -9959 -2034 5171 11568 10336 1498 -7601 -12252 -10377 -4241 6031
558F031Q515l284p462o301q481j433R271R090N052M56n674j0239q602J16O993
573e952P431P976K947p122q343o304l052N616J0049P524K547m767q316q264m145
588a2175N424P851N541N095l318j0143p221l419K522Q223P621N406k289q649n565
603e096m259q8R370P901K944J67p685q843l923l08O324P722L560J072o508q922
619f572k685j073M517J0841L995l50k133q569n627M78L275P814M787j4k281q948
635b545o285Q24Q79N861Q126l04k668m528o813p58K910N513P711P32k707k884
651C064p298l083L539K959N266L335k872m351o377l439K976L099M991N592k574
666D827l864k890m459J016N098M072M037m43m028m268n274k78M392L046L676R27
$$ plain form
558 6031 14546 11262 3800 -2501 -10982 -12415 -3144 5946 10998 11454 5780 -4459 -13061 -12945 -5952
573 -5952 1479 9455 12402 5280 -3063 -9367 -12419 -6803 3246 10770 13317 8550 234 -8030 -12175
588 -12175 -6751 1100 6641 11736 8418 -1725 -8946 -12365 -9843 -1620 6001 11407 9118 469 -5096
603 -5096 -9355 -9443 -73 7828 10772 10939 3254 -5589 -9512 -9820 -3496 4226 7786 8858 2350 -6572
619 -6572 -9257 -10330 -5813 5028 9023 8673 6540 -2029 -7656 -7178 -3903 3911 8698 8684 6403 -2545
635 -2545 -8830 -8006 -7127 -1266 6860 6556 3888 -640 -7453 -8211 -5301 212 7923 8655 5948 3064
651 3064 -4234 -7317 -3778 -819 4447 7782 4910 559 -5818 -9257 -6281 -3182 1809 7401 4827
666 4827 963 -1927 -6386 -5370 -272 3800 7837 7394 3366 -902 -6176 -6454 -2062 984 4660 5587
682E587m828l810k914j691L860M596L574K311k831m127k783j922K762M424K891
697E099J923k287n335l555k205J160M302L385K105j399m471k762j640L87M962
712c31M435K176l56l518m258k790L41M154L616J858j61m021m669k748n83L824
728c031M667K118J232k370m949k668n13L314N087K946J763k983o474k210o91O07
744d155N096L698N57j530n402l833j232L94O083N704N2n41l966n411r82R74M602
761A08N827Q25p71l500p226k202J725K455O179K978j842k787o132l719J873L323
777b886O097M530j654k577n002n613J668L408M133N526k11m121m760n777m68L749
793c958L910N983J492m364m419m936j866L986M887N236K742l757m550m576l555
$$ plain form
682 5587 759 -3051 -5965 -7656 -3796 800 4374 6685 3854 -273 -3056 -4978 -2216 2208 5099
697 5099 7022 4735 -600 -4155 -6360 -5200 -898 2487 4592 3193 -1278 -4040 -5680 -5293 -331
712 -331 4104 6280 5924 2406 -1852 -4642 -4301 -147 3469 5327 5166 1145 -3524 -6272 -6855 -3031
728 -3031 1636 3754 4986 2616 -2333 -5001 -5514 -2200 2887 5833 7596 4613 -1861 -4071 -4762 -4155
744 -4155 941 4639 5196 3666 -1736 -5569 -6801 -6407 -324 5380 5432 4891 925 -4486 -5468 -4494 108
761 108 5935 6760 5989 2489 -4737 -6939 -5214 -2759 3420 6398 4556 1769 -4363 -8082 -6209 -2886
777 -2886 3211 7741 6087 3510 -1492 -7105 -5437 -2029 2104 7630 7419 3298 -1462 -7239 -7707 -3958
793 -3958 -48 5935 7427 3063 -1356 -6292 -8158 -4172 715 5951 8693 4936 386 -4190 -7745
808g745L060N245M494L366k835n894m498l721J725N717M681L588j209n444m587
823d057l490P44N979N048L429K13n505n196l282q84N143N570K772K58m338n685
839c281l563j187M304N941K748J480k609o232l420n27L088N670L389J665k071
854E395o354l950q88J370N025M208J059j975n539l743j009M25N196N194R95n15
870D894l997m901q70Q49L863N123J227p94l521n337j609J31K473N581J401j578
886B935j764m463k665J207K286M795K839j134o49l873m014J617K059K456L416
901E048q34j894l043m630N81K199J223M258Q52l041j550k838p69K779K022L449
917C812J928k996j540k466k666K524K114R11K416j698l469j716k136J046K764
$$ plain form
808 -7745 -4685 560 5054 8420 5585 -309 -4807 -8528 -6803 -1086 3595 7183 5974 530 -4057
823 -4057 -7547 -6803 -824 4224 7653 7866 2361 -2835 -6117 -7001 -1858 3712 6484 6742 2404 -3281
839 -3281 -6844 -8031 -3727 2214 4962 6442 3833 -2399 -5819 -6346 -3258 2412 5801 7466 5395
854 5395 -959 -4909 -5797 -4427 598 4806 5865 3890 -1649 -5392 -6401 -5976 -780 4414 5409 4894
870 4894 897 -4004 -4874 -4025 -162 4961 6188 5394 1873 -3464 -5073 -4942 -2469 3112 4513 2935
886 2935 1171 -3292 -5957 -4750 -2464 2331 5170 4036 3387 -486 -4500 -2883 -824 1632 5048
901 5048 4214 2320 -723 -5353 -4772 -2573 -1350 2908 3760 719 -831 -3669 -4438 -1659 363 3812
917 3812 5740 2744 1204 -1262 -3928 -1404 710 1621 4037 2339 -1130 -2846 -4982 -3936 -1172
932a172J668L055o89l568l27j159p89L531K475J023Qk671j778j828j719K859K232
949A151M2J170j782l211j025m76K094L049R33J220l00l104j316j73O94K637J600
966C203P45q65l889j842o84j68K868K279J71m02k064k176l86L65K634L129O37
983C555M09k019l061r64j78J882K951N23n22j711l770j453O57J155K811K343L08
1000B916j284l496j181M88Q40L806K876q10j253k813l030n16R64L011K916q34
1016B600j320k125l693j24J457K389L745J133r19j926m093j056K175K046L588
1031C877J470k099k006l825k496J740J840K730K722j216k411k840k961J408K724
1046a343K955L906p49l294j989l100k25L419K064K630P10l459k737l149j337L114
$$ plain form
932 -1172 496 3551 2862 -706 -1033 -2192 -2981 550 3025 4048 4056 1385 -393 -2221 -3940 -1081 1151
949 1151 1193 2363 581 -2630 -3655 -4131 -2037 1012 1945 3165 2865 -239 -1555 -1728 -1034 1603 3203
966 3203 3948 3083 -806 -2648 -3332 -3500 -632 1647 1818 1416 -648 -2824 -3210 -2845 -211 2918 3555
983 3555 3964 1945 -1116 -2080 -2258 -376 2575 3098 2576 865 -2905 -4358 -3701 -2546 265 2608 2916
1000 2916 1632 -1864 -3045 -2557 -1717 2089 4965 4155 2902 89 -2941 -3457 -2493 518 3434 2600
1016 2600 1280 -845 -4538 -4662 -3205 -816 2929 4062 3143 1217 -2876 -3932 -1757 289 3877
1031 3877 5347 3248 1242 -2583 -5079 -3339 -1499 1231 3953 2737 326 -2514 -5475 -4067 -1343
1046 -1343 1612 5518 4769 1475 -514 -3614 -3839 -420 1644 4274 4984 1525 -1212 -4361 -5698 -2584
1062b584K847K764J906l226l304j782j805K644M033K258J844j892m337j661j993
1077d288Q32M356K289R94o63m084k936j500K99M326K902J012M10l483l490n52
1093c576l6L187L801P91J91k524l893j423q1J961L600J413l9k031l976j633K63
1110d005J513L974K001m97p05l236k399M20J303L069K641l17j185k999k788J55
1126c055Q76K078K735J41j101k318k902J16R04J777L433O77j387j085k513r59
1142b583J077J582K623Q71j422j265k662j472J469N24J945J932j315j377j258
1157a331j878J006J465J709K100p54j352n62k110OJ826P55J731l28j947p82j910
1174b356q54K310N05J007J416j864r96l82j195J835J609O38J317j273j512j49
$$ plain form
1062 -2584 263 3027 4933 1707 -1597 -3379 -5184 -2540 1493 3751 5595 3703 -634 -2295 -4288
1077 -4288 -3456 900 3189 4183 3520 -564 -3500 -5000 -4701 -375 2527 3539 3949 466 -3024 -3576
1093 -3576 -3612 -425 3376 4167 4358 1834 -2059 -3482 -3563 -1602 1998 3411 3372 1341 -2635 -4268 -4005
1110 -4005 -2492 1482 3483 2986 2281 -955 -3354 -2934 -1631 1438 4079 3762 2577 -422 -3210 -3055
1126 -3055 -2179 -101 2634 2775 1674 -644 -3546 -3430 -2526 -749 2684 3361 1974 889 -1624 -2583
1142 -2583 -1506 76 2699 3570 2148 883 -1779 -3251 -1782 -1258 687 2619 1304 -73 -1331
1157 -1331 -3209 -2203 -738 971 3071 2317 965 403 -1707 -1701 125 880 2611 2283 336 -446 -2356
1174 -2356 -3210 -900 -395 612 2028 164 -832 -1214 -2409 -574 1035 1673 2990 1717 205 56
1190E6j817O04K188n52J063j28k701l35n10n82K281Q46M06J071j970r49N64r39
1208a404J841J801n32R31j294k407N07j155P4K636m64Rj2k388m04M78m3K299J173
1227A646n4M76k122j118R54m34J397K021j017l11j025k500N6q1Q74K084o8m48
1245C30j95k261j73J240N66K169J448q33p03j826j199N96K38J660J371r85j169
1262B74j549k100K72J478J454J726J14q60j292j624L83J369J416K232J28j587
1278A834j505j960q72J183J215J679M41j226j485k324o43J553J703K044J420r97
1294B060j371j694j168J094J392J952J616j427k070j621k096M18J874J563J599
1309B121l51k002j278j808K51K745J522J916O25k446j634j235j015K115J875R96
$$ plain form
1190 56 -1761 -1157 1031 479 1542 1414 -1287 -1622 -2132 -2714 -433 413 819 1890 -80 -1029 -465 -1404
1208 -1404 437 2238 1706 2637 1343 -1064 -557 -1712 -1638 998 534 543 531 -1857 -2261 -1783 -1826 473 1646
1227 1646 1592 2068 -54 -1172 -218 -652 745 2766 1749 1438 413 -2087 -2031 -2112 -1238 846 778 330
1245 330 135 -2126 -2299 -1059 -493 1676 3124 2291 1588 -238 -1437 -841 -603 1057 2428 1443 274
1262 274 -1275 -3375 -3103 -1625 -171 1555 1669 809 -483 -2107 -1724 -355 1061 3293 3421 1834
1278 1834 329 -1631 -2503 -1320 -105 1574 2015 789 -696 -3020 -3663 -2110 -407 1637 3057 2060
1294 2060 689 -1005 -2173 -1079 313 2265 3881 2454 384 -1237 -3333 -2915 -1041 522 2121
1309 2121 1770 -232 -1510 -3318 -3067 -322 1200 3116 3741 1295 -339 -1574 -2589 -474 1401 2397
1325B397R10k293k565r97j160J458K722P93J291r28k873p22o48P10L139J442L98
1342C074j90k851j591l53l06K502J830l37R4k195k441K07j45J624K885J70M5j207
1360H15k515j04N26P75K778O43q72o17k629j112O07M45K061J309j166m50j803
1377a309j507J005P66J383K008n78q52q86j698M32J028P23J698j72j219p46j855
1394a779l88J323N45J309N72j519m71r21p27J163R22J051J036r85j027m16j027
1411a339R39Q12K91J185q96j139m54j163L08J236L11P56r6j209k86l76M7J142
1429F9O53N10N38j309o21j90m87R30N96j7M26q95r35j06q43O34J176k36P63k36
1449D20r55K78l90J57J453k13M97L23j652q5j28o49J159L19l66N64j249r75N77
$$ plain form
1325 2397 3307 1014 -1551 -2548 -3708 -2250 472 1265 2556 1628 -1245 -1967 -2615 -1905 1234 2676 3074
1342 3074 2884 33 -1558 -1911 -2217 285 2115 1778 1872 -323 -2764 -2557 -2702 -1078 1807 1977 2022 815
1360 815 -1700 -1804 -1278 -503 2275 2918 2046 1429 -1200 -2312 -1705 -1260 801 2110 944 494 -1309
1377 -1309 -2816 -1811 -1045 338 2346 1768 916 30 -1668 -1236 -208 515 2213 2041 822 76 -1779
1394 -1779 -2167 -844 -299 1010 1582 63 -408 -1329 -2056 -893 29 1080 2116 1131 104 -312 -1339
1411 -1339 -400 412 703 1888 992 -147 -601 -1764 -1456 -220 91 847 751 -458 -744 -1120 -1073 69
1429 69 722 1232 1770 461 -160 -350 -837 93 689 672 1098 203 -732 -838 -1681 -1047 129 -107 656 420
1449 420 -535 -257 -647 -490 963 750 1247 1570 -82 -167 -295 -944 215 534 168 732 -517 -1492 -915
1468i15n46O39J572o02O78k16j318N97L4k43J969k51m60M57j875m68L94n86J040
1487a00P61q15L95j090r06Q49N2N39J727m11k3l7j459R6M71N2J460r9r09k18j447
1508a112r06Q00J89J053Q46o51k24j048p74J152O39Q46J486n75o52p56j309J13
1526h83P70O63R22k48j408p65j201j99J215O62J297O94j001n95q73m14J426Q25
1544H87Q79R50j163j480q89r16M30J073R31O06q59j342o23r04N89J614J050J209
1562B042j69j357r34o07K49J404R08N54k08j596j300r28k68J319R33Q90J71j295
1580a92j063l13l35J440J833M04N32q42j640n10n24O14J712J65J30o52k121o17
1598a979j11Q7J898R67N8K73j561j011N46q5J529J686m43j84q65j954K02kN08
$$ plain form
1468 -915 -1461 -822 750 148 826 610 -708 -111 -77 -320 1649 1398 938 1395 -480 -948 -554 -1140 -100
1487 -100 661 -154 241 -849 -1755 -906 -854 -315 1412 1001 978 941 -518 -422 49 101 1561 1462 553 335 -1112
1508 -1112 -2018 -1218 -1029 24 870 219 -5 -1053 -1827 -675 -36 810 2296 1721 1069 313 -996 -883
1526 -883 -113 550 1472 1224 -184 -949 -2150 -2349 -1134 -472 825 1519 518 -77 -950 -1364 62 887
1544 887 1766 2716 1553 73 -816 -1732 -1302 -229 702 1308 449 -893 -1516 -2420 -1831 -217 833 2042
1562 2042 1873 516 -418 -1025 -776 628 1536 2090 1882 286 -1014 -1942 -2210 -891 42 932 1103 -192
1580 -192 -1255 -1568 -1903 -463 1370 1774 2306 1464 -176 -686 -1210 -596 1116 1281 1411 759 -1362 -1979
1598 -1979 -2090 -2003 -105 862 920 1193 -368 -1379 -833 -918 611 2297 1854 1670 805 -1149 -947 -949 -441
1617d41J556k95n41l40j781k15Q77K50J646P31p98O0j019p71Q80L33Q72J170j099
1636A075n86o22j394M40M54L21J167m09r15o7j113K65J260L15Q20L23q39k41m59
1655b05l28Q31K32L22L54j106m37k98p33P70N14Q7O19n06n86L4l38L73J121k10
1675E10N84k29p74Kk92k13R33j45m7J29j084q4O8l61N22O69j29L71m62m67L28
1696a71j53N16N76j96M6L6o95oj40j07O24k74p5Q8o72k13K87k78P80K48j03M34
1718E52o12k25K58k56P35M62m22L49n01q19K72j16r2P24l06m4J2r36K75J35j89
1739g44J210O9j44M40q39k92N25l18N67P33o73J21n08j148L89M8q9J127m65k16
1759b07J53j185K79O67L9J205L20p74K78p62p05R02j78M88P82r79m44m02j060
$$ plain form
1617 -441 1115 820 279 -61 -1842 -2057 -1180 -930 716 1447 649 709 -310 -1081 -201 132 1004 2174 1075
1636 1075 489 -133 -1527 -1087 -633 -312 855 446 -469 -536 -1649 -1384 -124 191 1011 1334 495 254 -205
1655 -205 -533 298 530 852 1206 100 -337 -635 -1368 -598 -84 3 622 116 -470 -436 -774 -401 720 510
1675 510 1094 865 91 93 -199 -412 521 376 329 458 -626 -710 -642 -1003 -481 188 59 430 -32 -499 -171
1696 -171 -324 192 768 572 618 654 -41 -47 -187 -294 330 56 -19 69 -603 -816 -529 -807 -27 221 118 552
1718 552 -60 -285 -27 -283 452 914 492 841 340 -479 -207 -323 -415 309 3 -41 -29 -965 -690 -555 -744
1739 -744 466 535 391 831 -8 -300 225 -93 474 1207 534 655 147 -1001 -612 -564 -653 474 9 -207
1759 -207 -54 -1239 -960 -293 -254 951 1271 497 775 13 -692 210 32 520 1302 323 -121 -523 -1583
1778a583O59M47K66J105m38o94J27q45Q6J170J63R32K90j266j12n73o64R23J76
1797A69K02N53j057o70m41n66R22Q44L63P70m60p71K5n61L54J326L31K29k26j430
1817i4n25m99K9R25L95N2J20j067o48j3lJ106J185P5K67n84r54l7j81O71J020
1838A240O8l05p52j104m05n9L79Q91L23J40l29q97j99J43M29J238P03j15l26p97
1858B66p06J39J05N90M60m15k31q48r34L05K30O41J014k66Kj49q96L11M77J79
1878B74J130l9n52j81j097k00L78k11P23J67p91J13o01o17R03K35M42Q26m78j57
1898B67J12r31P12M26j30N48j75q55Rp31l85R74l21L53L89q73L2J30l67R13K38
1919C35J3P81p64k34L59p26M69N03o35K51k10p93K34l50PO76j82L7M22o30J19
$$ plain form
1778 -1583 -924 -477 -211 894 456 -238 -111 -956 -870 300 463 1395 1685 419 307 -266 -930 -7 169
1797 169 371 924 -133 -803 -1244 -1810 -888 -44 319 1089 629 -142 -117 -678 -324 1002 1333 1562 1336 -94
1817 -94 -619 -1118 -1089 -164 231 283 403 -664 -1312 -1325 -1328 -222 963 1038 1305 721 -233 -270 -451 220 1240
1838 1240 1308 1003 251 -853 -1258 -1317 -938 -47 276 416 87 -810 -1009 -866 -437 801 1504 1389 1063 266
1858 266 -440 -301 -196 394 854 439 208 -640 -1574 -1269 -1039 -398 616 350 352 203 -693 -382 95 274
1878 274 1404 1365 813 632 -465 -665 -287 -498 225 392 -399 -286 -887 -1504 -601 -366 76 902 424 267
1898 267 379 -552 160 586 456 1004 829 -26 -17 -748 -1133 -159 -480 -127 262 -611 -579 -449 -816 97 335
1919 335 348 1129 365 131 490 -236 233 736 101 352 142 -651 -417 -767 -760 -84 -266 -229 193 -437 -318
1940c18L73k34O63J90l16L76n88k61L81m84K40L66o86J47o4n92K89Q8o0O33j92
1961d9N4L18m98L08K80l26M73O1l67J61m15k85L08j68j22M13m71J55K7m73K56
1982c60J57j28P02m3j09K82n18L8J68j42N57r3m03K67o26k43L16k45K67K45l54
2003b65J26o5m70M83r8K90O20k08j7M0p79L31J71k46P06p3n20J64q46j58M47j44
2025e11N52M78p46K40k88o46R03J51K37P36n02l87J12p81K50M46j55P44l93p63
2045c23M4n34k24P89Q0L13N67j026O0K6m40Q64N31q8N65o34p49ko40N88P19l64
2067A22K58k62r64J41k71JJ077J37L50K44r76j03K31k51P85M36k58J81q12o26
2087e60M2k68L86P46l17O8k14q53K38J46L81R79O1p9Mq39j80K79K4N63J92l67
$$ plain form
1940 -318 55 -179 484 674 358 734 146 -115 266 -218 22 388 -298 -151 -215 -807 -518 -430 -490 143 -49
1961 -49 5 323 -175 133 413 87 560 621 254 415 0 -285 23 -145 -267 146 -325 -170 -143 -616 -360
1982 -360 -203 -331 371 328 219 501 -17 21 189 47 604 511 108 375 -251 -494 -178 -423 -156 89 -265
2003 -265 -139 -204 -674 -191 -289 1 621 413 396 436 -343 -12 159 -87 619 546 26 190 -656 -814 -367 -511
2025 -511 41 519 -227 13 -275 -921 -18 133 370 1106 604 217 329 -452 -202 244 89 833 440 -323
2045 -323 -279 -813 -1037 -248 -168 145 712 -314 -254 -228 -668 196 727 639 1204 570 -179 -181 -821 -233 486 122
2067 122 380 118 -846 -705 -976 -975 102 239 589 833 -143 -246 -15 -266 519 955 697 878 66 -560
2087 -560 -518 -786 -400 346 29 97 -117 -970 -732 -586 -205 774 835 756 760 -79 -259 20 44 607 799 432
2109D32k46n89p26L62J6N32N46l23q9k08m01L78L34L74O16r2k53l76n03L2L76
2130A92j17K89o8n83n8o97J88L48J26M47J65k52O8k19j40O91j4K77L13m88j63
2151C05l23n32M60M8l78N95m30n42L62m14L64N35j64N89R4n06L38j06k31O54k12
2172E06k68M12p89j76J47o67N73J4l60N07j92l48N48j92K95M89k69J59L40p01
2192B8L87lm68N43l63k71K47n28k38M75m51K37L27m22N27N0l83O61j31ON94n98
2214B26J43K10n76J06J34o28M21q4m03L54m47P9L42l40L11M51l88L62Mk79N26
2235E24k20j13M35m72p2K18n53J27K5l56K64J60l94K46n8k34M32m0J96L31j30
2256C16J01m8l76J73O3r7K01j94j48j06l32J05L6q5M83j30o0K4k68N3L68l0M33
$$ plain form
2109 432 186 -403 -1129 -767 -751 -219 327 4 -85 -293 -694 -316 18 392 1008 916 663 287 -216 -184 192
2130 192 75 364 296 -287 -345 -1042 -854 -506 -380 67 232 -20 48 -171 -311 380 366 643 956 468 305
2151 305 -18 -550 -90 -42 -420 175 -255 -797 -435 -849 -485 50 -114 475 569 63 401 295 64 718 506
2172 506 238 650 -139 -315 -168 -835 -262 -248 -608 -101 -293 -641 -93 -285 10 499 230 389 729 28
2192 28 415 412 -56 487 124 -147 100 -428 -666 -191 -642 -405 -78 -500 27 77 -306 355 224 230 824 226
2214 226 369 579 3 109 243 -385 36 -48 -451 -97 -544 -465 -123 -463 -152 299 -89 273 277 -2 524
2235 524 304 191 626 154 82 300 -253 -126 -101 -457 -193 -33 -427 -181 -239 -473 -41 -81 115 446 316
2256 316 417 369 -7 166 229 132 333 139 -9 -115 -447 -342 -306 -391 92 -38 -98 -74 -342 -289 79 49 482
2279D82J87m51M9k20l15K75K0J02L19n82j27j39l37M02J33LO02j87m00K06m90
2300d68K57N76j67L92K00p36M8l37k83N41J7Q5K87o93k83J88m39O12M23j55M08
2321D73k64m77K22l41L34O79j61J49j7q79j0r4k54P87M6k17L89q62k36L20k21
2342f34O14N57m26M73k40p26L08O9J29P71m99k67J73q87J54L8j84P07n3l46K16
2363e3m45j34N43P0K89M68m07O4j45m99L83J39o5N16n97m12J32n77J47L41j12
2384c54M19N2m27K01k13J22L42J75J22K66m15m2j73j53J07O0j48O1l21k03N7k14
2406f79K76K28J13K02j33j32L27j00J35K08p7J27j02l88Pj28j00J3k6j30J72m01
2428e88J66J87m4L57M7j12L56j11k03N18l62K30n8l06J84k12m77M00l42p4K88
$$ plain form
2279 482 669 218 267 47 -268 7 27 129 448 -134 -261 -400 -737 -335 -202 -199 403 216 -184 22 -468
2300 -468 -211 365 198 590 790 54 102 -235 -518 23 40 125 412 -281 -564 -376 -815 -203 220 65 473
2321 473 209 -268 -46 -387 -53 626 465 614 597 -282 -292 -386 -640 147 193 -24 365 -497 -733 -413 -634
2342 -634 -20 537 111 584 344 -382 -74 -5 124 895 396 129 302 -585 -431 -393 -577 130 77 -269 -53
2363 -53 -498 -632 -89 -19 270 738 331 395 250 -249 134 273 208 724 127 -285 -153 -730 -583 -242 -354
2384 -354 65 117 -310 -109 -322 -200 142 317 439 705 290 248 75 -78 29 89 -59 2 -319 -522 -465 -679
2406 -679 -403 -175 -62 140 7 -125 202 102 237 445 368 495 393 5 12 -116 -216 -203 -229 -359 -187 -588
2428 -588 -422 -235 -279 78 125 13 369 258 55 573 211 441 383 77 261 49 -428 -28 -370 -444 -156
2449a56k84r6L95l22L10K83k03N39N5m09M13j79j40L68m53r9J72m52l3O9l65L25
2471b62j5j51N08l96J51M78l75K53K92l18K35J69n23L43j86k87K82n75l2M22m68
2492d55O5J55l02L14J97l69N01Qj30M76k04n4K66k79J00P9l52R1n6m69L46l26
2514c98o9M86k90J0J98m07K08M98k13L96J7l23J96k98pJ24J1J3J11l95k01%k85
2537f18L20L9L8L69k24k6P0k24L33L00j91M05j73m63J99k72r7L11j50K29k3n66
2559d14J50o6j74N40OJ97l5j60n8L8j76K54K96j01K16l34l69K15k73O3L98l53
2581a40J66j90l14J99j14Q1N29K2o3K18m46l6N7n8M95J02l28J3k45l31K86k50
2603c47J56M66m40J35j52l88L43O2j4N75o7k03J48l96j1N02l17K87k6m03J21k33
$$ plain form
2449 -156 -440 -536 -141 -463 -153 130 -73 466 521 112 525 346 206 574 121 22 194 -258 -291 -222 -587 -262
2471 -262 -277 -428 80 -316 -165 313 -62 191 483 165 400 569 46 389 203 -84 198 -377 -409 13 -455
2492 -455 -390 -235 -537 -223 -26 -395 106 114 -16 460 256 202 468 189 289 368 16 107 51 -418 -72 -398
2514 -398 -467 19 -271 -261 -63 -470 -262 236 23 419 436 113 309 11 4 128 139 152 263 -132 -333 -333 -618
2537 -618 -298 -259 -221 148 -76 -102 -32 -256 77 377 186 591 418 -45 154 -118 -215 96 -54 175 152 -414
2559 -414 -264 -330 -504 36 42 239 204 44 -14 24 -152 102 398 297 513 179 -190 25 -248 -185 213 -140
2581 -140 26 -164 -478 -279 -393 -312 217 239 176 394 -52 -88 -31 -89 406 508 180 193 -52 -383 -97 -347
2603 -347 -191 275 -165 -30 -182 -570 -227 -165 -179 396 329 126 274 -122 -133 369 52 339 313 -90 31 -202
2625b02k25K88k6n8L81l75j3K51k66J84K43j19M35k19j93J96m39J44L00j99L7
2646A25J22m94k9L0j83L33M7o0J75k67R4J22jL19R1k65J90j17k36J63k01P0J01
2669A29k40j19m7j63J21J19j78M03j28M8K08j25k3K65j20K75n9k50J04j71k51
2690b02J76k37Q4L9r0j7j94O9K50J4J5K25j72J93J25j82K09Q7k36P2j53k13J98
2713F0k66o1J51k84R9Q5j89M16k3k39N07m6j20L26k50P1K29k85O1J18m56J37j49
2736a08l06M18m59k1M04l26Q1L49j34J75J95l52M52r8j64M48l57q4K35l69j30
2757a51J79l53R4Q0k30L27n6k51M73k52J56L21k31J49J27l33K67k9k23L86l04
2778A46k87J85l06j17L08k77K16R8m03L17J2j78O30j84R5K44l73L6J80l34O5L4
$$ plain form
2625 -202 -427 -139 -165 -223 158 -217 -230 21 -245 -61 182 63 498 279 86 282 -157 -13 287 88 125
2646 125 247 -247 -276 -246 -429 -96 -49 -109 66 -201 -107 15 14 333 424 159 349 232 -4 159 -42 28 129
2669 129 -111 -230 -277 -440 -319 -200 -378 25 -103 -55 153 28 5 270 150 425 366 116 220 49 -202
2690 -202 -26 -263 -179 -140 -230 -247 -441 -372 -122 -108 -93 132 -40 153 278 96 305 392 156 228 75 -138 60
2713 60 -206 -267 -116 -400 -301 -216 -405 11 -12 -251 256 210 90 416 166 237 466 181 242 360 -96 41 -108
2736 -108 -414 4 -455 -476 -72 -398 -317 32 -102 73 268 -84 368 270 106 554 197 113 348 -21 -151
2757 -151 28 -325 -231 -151 -381 -54 -110 -361 112 -140 16 337 106 255 382 49 316 287 64 450 146
2778 146 -141 44 -262 -379 -71 -348 -132 -34 -437 -120 -108 -286 344 160 255 499 126 162 342 8 73 107
2800A07j45M9l6l86J56j80O7K88q0K70O5j62n2J04p2L08Q0j8J13l85j08M3k32
2823b06M8Q4l6P1k21k74L04j23K12L39n4J08o9k22K21o7m9K30%j29j6l94m2Q2
2847b03o1K24O0j72J23j89p4L45j78K41K41k12P9j49n6R4r6R4K77k38j38nl16
2870c09J03m4L5K66q2j90R4m2M6L13q4J90k7k12J73j70j88K93n8r1P9j53k03K08
2894e3k58R6Q6l5K43p6j42J48l6J8K26j16J50Q2k97n9K87l60P4K05k48J43k17
2917a39j59K74j32p2K48j54J50O6k19K21k4j31L20q5o2J46j82r2J45k10R7M6k90
2940b38R9q1j74M01j09p9L63l29J87M5k1K39Qk59J74j50j36J98k17L5L3j80m0
2963b31P5k3l5MQK82j32K4J70j5m9R4l5J90k06l9N1k39PJ15k05J07j37M8rj18
$$ plain form
2800 107 -38 11 -25 -411 -255 -435 -368 -80 -160 110 175 13 -39 65 -7 301 381 363 476 91 -17 26 -206
2823 -206 -158 -74 -110 -39 -260 -534 -230 -353 -141 198 144 252 183 -39 182 115 66 296 296 167 151 -243 -285 -203
2847 -203 -264 -40 20 -152 -29 -218 -292 53 -125 116 357 145 224 75 19 113 17 111 388 150 12 7 -309
2870 -309 -206 -250 -215 51 -31 -221 -127 -169 -123 190 106 296 269 57 230 60 -128 165 107 16 95 -58 -261 -53
2894 -53 -311 -215 -129 -164 79 3 -139 9 -27 -9 217 101 251 333 36 -23 264 -96 -22 183 -65 78 -139
2917 -139 -298 -24 -156 -228 20 -134 16 82 -137 84 60 -71 249 164 102 248 66 -26 119 -91 6 52 -238
2940 -238 -139 -220 -394 7 -102 -181 182 -147 40 85 64 303 311 52 226 76 -60 138 -79 -44 -11 -191 -231
2963 -231 -156 -179 -214 -210 -202 80 -52 -28 142 127 78 172 137 327 121 82 133 -106 -99 16 -189 -82 -219 -171 -180 -298
2989b98J25J50K1J59K6j08J06J94k46J25q5j25J75k68q8J72l68P5J62k70K37j5
3011a44p2J85Q3O1M4r2L1J82k65K80J05m21J80j86k37K29j54j66L10k72N3K33
3033c3k79K68K09j38K94j47L2lj63m9K73j70k4K2k76M0m7o5L6L3j47L42k01o6
3057b59L21p9J21L20k78J67lk52J51k18j38K81j53K4O6l94J8Q9j56K93Q5m2K28
3080A92j35j98M43k33K61N9k02J5k0l87R9l3j42K87j01m4M0q4j85K05L0Q4K69
3103B20j60J56j09q6L09j35j63L20k30j32kj69J6n4K8K32j74J7N7k30J84J57p6
3126b4K72k6q0Jj08J3K00k12m3P2l26K68k47j17K04NK7P2j6L2M7r3J74L2j51L11
3152B87k8k39Q9r4j00K35j99Q5L0l72J58k4m0J88r8p5K51r9n3K76j20J33Q0k12
$$ plain form
2989 -298 -173 -23 -2 157 183 75 181 375 129 254 169 44 219 -49 -137 35 -333 -258 -96 -366 -129 -144
3011 -144 -216 -31 52 113 157 65 96 278 13 293 398 -23 157 -29 -266 -37 -191 -357 -47 -319 -266 -33
3033 -33 -312 -44 165 27 321 174 206 203 40 -9 264 94 70 92 -184 -144 -191 -256 -220 -187 -334 8 -193 -259
3057 -259 62 -17 104 424 146 313 310 58 209 -9 -147 134 -19 5 71 -323 -305 -216 -372 -79 6 -36 192
3080 192 57 -141 302 69 330 389 187 202 182 -205 -106 -139 -281 6 -95 -139 -99 -183 -368 -163 -133 -49 220
3103 220 60 216 107 21 330 195 32 352 122 -10 -12 -181 -165 -219 -191 41 -133 -116 -59 -289 -105 52 -24
3126 -24 248 222 142 143 35 48 248 36 -7 65 -261 7 -240 -357 -153 -148 -121 -49 -65 -33 14 -79 95 127 -24 287
3152 287 259 20 109 15 -85 150 -49 36 66 -306 -148 -172 -212 -24 -122 -197 54 -45 -98 178 58 191 271 59
3176E9L2L8l26L53k02n9J64k57N1J50j87J04J5o0L06p5j84K46j89J45Q8k30O9
3199E1R4j39J6Q5j47R3j37m4R2j52j3J39j18K01P1j66K15j39m8K77o9j57K43k00
3223D8N8oj90L9L1j00O3j1q5J03j18M6J45m8K0J57k09J03P1j11K9M6Q1l2j36r2
3249i8m1pN8K1n9on6R2Q1j57J23J76j67P0O8m5J12j02P8O3j51r4J36k72J47q6
3275a16j81L57k41o3K35p1R1K33k14J89o6j24K53q9j05J30m2k81J92k62O5P9j81
3298b12K1J28j12J77j47l4L39q4qL02j49j62J63k24J15L6j40J01k55j28L00l56
3320c29J29J26q4O0L3j8k1J51L2J16j0j70K92j53q3P6j65m6K01k40j4m9j15P6
3344b05k1N7L39k74P9J97l80L32P5j47K87j61j62J68k03o7Pq3O0J14k11J36o2
$$ plain form
3176 59 91 129 -197 156 -46 -105 59 -198 -147 3 -184 -80 -65 -125 181 106 -78 168 -21 124 212 -18 51
3199 51 145 6 22 107 -40 53 -84 -128 -36 -188 -201 -62 -180 21 92 -74 141 2 -46 231 162 5 248 48
3223 48 106 100 -90 -51 -20 -120 -57 -68 -153 -50 -168 -122 23 -25 -5 152 -57 46 117 6 35 81 162 130 -6 -98
3249 -98 -139 -146 -88 -67 -126 -132 -188 -96 -15 -172 -49 127 -40 30 98 53 165 63 141 204 53 -41 95 -177 -30 -116
3275 -116 -297 60 -181 -244 -9 -80 11 244 30 219 153 29 282 193 88 218 176 -105 87 -175 -110 -31 -212
3298 -212 -191 -63 -175 2 -145 -179 160 76 68 370 221 59 222 -2 113 149 9 110 -145 -273 27 -329
3320 -329 -200 -74 -158 -98 -65 -83 -104 47 79 195 185 15 307 154 71 147 -18 -64 137 -103 -117 -166 -281 -205
3344 -205 -226 -169 170 -104 -25 172 -208 124 199 52 339 178 16 184 -19 -86 -79 -162 -102 12 -199 -63 -125
3367a25j02J75N8r6K03L1J4O2j47J2J15j01l3o8l8N6j79n6R7K0k1R1j05J5J34
3392A2j42J89Q6j17J67Nn5K0j04p3J29j58J03j49j9J8k7m0J35o2R3J3n6K1Q3j7
3418E5J15Mo3j3Pr7Q2j31K33j93k10J43j16j2J73o4m3J46j67J29J39j60J76M1
3442A74p4P4j66nL7r6O2K3r6j65K49k43K21j5j34J64q4J3K29j89J40P6n5m2P5
3467A73j53O3n7k42K11l6O0p7p0L4mq1K07K0q5K11r9n2R8j38J58Q0j37k3J74l55
3493a20J40Or8J22j93K0J08j24J39p9m0J63N8k32J98P2k08K04p9J5l1l4J0j0l5
3518b8rL3j28Q4k2p0N5m9J01J17o9M2O3q8J13p0l3N5r1K8m4j34J44o7J4N3j41
3545a41L4J23k32J69Q3n8N8N7l7J30r9K1N4p7m5n5p1L5l3omO8k4lp0o6J02RJ63
$$ plain form
3367 -125 -227 -52 6 -90 113 144 158 220 73 85 200 99 66 -2 -40 16 -163 -219 -122 -102 -123 -32 -137 -122 12
3392 12 -130 59 145 28 195 200 145 165 61 -12 117 -41 62 -87 -106 -88 -115 -155 -20 -82 11 24 -32 -11 72 55
3418 55 170 174 111 98 105 8 90 -41 192 -1 -211 -68 -184 -196 -23 -87 -130 16 -151 -22 117 -43 133 174
3442 174 100 174 8 3 40 -56 6 29 -67 -232 17 -226 -5 -20 -154 10 -74 -61 168 -21 119 195 140 98 173
3467 173 20 83 26 -216 -5 -41 19 -58 -128 -94 -98 -179 28 48 -37 174 75 23 121 -17 141 221 84 61 235 -120
3493 -120 20 26 -72 50 -143 -123 -15 -139 0 -79 -119 44 102 -130 68 140 -68 136 57 72 41 7 17 7 -28
3518 -28 -37 -4 -132 -48 -70 -140 -85 -134 -33 84 15 57 120 32 145 75 42 97 6 34 -10 -144 0 -67 -53 0 -141
3545 -141 -107 16 -216 -47 36 -22 36 93 56 186 87 108 162 85 40 -15 -86 -51 -84 -90 -94 -26 -50 -53 -123 -189 -87 -78 85
3574H5P3l9N0J03k58J66j33Q5r4qp5P4k07M3l5j09K33J08j84M2R8j49K78o7L3
3599A13J19p1j4l8l2q7R6j56J54j00j18R3k20N4J13j1J40Q3k29L18j65p0K73j31
3623A14mJ31k62L3qj79J60k1j98K90j04n0P6n6m8K83j82J03O8k00J09J74j58R4
3647A65r4r0L1r0J8qo4pM8j06J36n8l4J57p2J95LN2j02N3L9mo4p3K2n3j01m3j8
3676a62j1O5n7J14m2O1O7J9M2J36k29Q6J34k08J00nk10K36j91J1o5r0j3J98j16
3701a30R7M0j21J26K3m0K12j45L4J82l24L6K12k98Q7J76k51J07o4j23R6q3k9J70
3725a0k0N3M0j03R7L9j90J89Q0j43Q5l2j26R0j34j9M2J0M7j4j97K14j04J93J5
3750A02j45ON6K9k6Q1j32O4J7p1Q9j66l9J31p3j31K59j96j1K1m9K59p9p0J10k5
$$ plain form
3574 85 158 119 169 272 14 180 47 132 38 30 -45 29 -178 -135 -170 -279 -46 62 -122 -80 18 -131 147 80 113
3599 113 232 161 147 109 77 -10 86 -70 84 -16 -134 -41 -261 -207 -94 -105 35 118 -111 207 42 -28 245 114
3623 114 110 241 -21 12 4 -175 -15 -36 -234 56 -48 -98 -22 -78 -126 157 -25 78 146 -54 55 229 71 165
3647 165 71 -19 12 -78 -60 -68 -132 -139 -91 -197 -61 -119 -153 4 -68 127 130 182 80 133 172 168 104 31 53 0 -101 -144 -162
3676 -162 -173 -108 -165 -51 -93 -32 35 54 96 232 3 89 223 15 115 110 -100 136 -55 -44 -109 -199 -212 -14 -130
3701 -130 -33 7 -114 12 35 -5 207 62 96 278 -46 -10 202 -96 -9 167 -84 23 -41 -164 -68 -151 -180 -10
3725 -10 -30 23 63 -40 57 96 -94 95 175 32 117 85 -41 49 -85 -104 -62 -52 -5 -19 -216 -2 -106 87 102
3750 102 -43 -37 19 48 22 103 -29 35 52 -19 70 -96 -135 -4 -77 -208 51 -145 -156 -135 -184 75 -4 -74 36 11
3776A1Q6n9k3K8K9k9o4l2l9rq9Q9N9o9nJ27r0R9P8j33K31q6j04J20j82R1J40j11
3804F4m7P6m0J29p9j49m1lOl3P9m7N7m2L3P1lM1m0KJ17j25k0o1J63k1j64pR7j59
3834a46L2Q4n5QJ26j38R4k5q4K14k3j04L41k15p4Q7n0p9Lj30J58j45q5J25K9n8
3860a10J0R3J06q5j29J51R1r5R1rjm7qp5Q2j98J66j01M1rj65J37OLM6R1J0M0j01
3889C1K1O6J02k26O5p5q5Q9j06J5J17n4j08L1j01J06J33j33J67J2p7J75j38MJ42
3914A73q9l9p4k0R3l8j15J61j58l1NJ18j27O4rK50m6j85P4J22m1N2j64J18m1j32
3940g9M5K3j16KJ16j50J14j10J0L4J60k2J07n1kj5p4J17q8l8J6L4j21O3k7k4M9
3967b7j02K2N0K3p3J17j67R3J8J72m4jO7k3j07j9L3n9o0m7J44j38K2O8j38J51
$$ plain form
3776 11 97 38 15 43 72 43 -21 -53 -92 -101 -190 -101 -42 -111 -116 11 -79 20 98 -35 196 110 6 126 -56 35 175 64
3804 64 17 93 53 182 103 -46 -87 -90 -84 -117 -38 -85 -28 -70 -37 34 31 72 32 34 151 26 6 -55 108 87 -77 -84 13 -146
3834 -146 -114 -30 -85 -77 49 -89 5 -20 -104 110 87 -17 324 109 35 122 72 -7 -4 -134 24 -121 -206 -81 -52 -110
3860 -110 -100 -7 99 14 -115 36 127 32 123 114 113 66 58 -17 65 -133 33 -68 -27 -36 -201 -64 -58 -55 -9 82 92 132 31
3889 31 52 118 220 -6 59 -16 -101 -12 -118 -103 14 -40 -148 -117 -218 -112 21 -112 55 67 -10 165 27 31 173
3914 173 84 45 -29 -49 44 6 -109 52 -106 -137 -132 -14 -141 -77 -86 164 118 -67 7 129 88 140 -24 94 53 -79
3940 -79 -34 -11 -127 -125 -9 -159 -45 -155 -145 -111 49 27 134 83 81 66 -8 109 21 -17 -1 33 -88 -25 -52 -76 -27
3967 -27 -129 -107 -57 -34 -107 10 -157 -64 -46 126 82 81 148 125 18 -1 32 -27 -87 -134 10 -128 -106 -38 -176 -25
3993b5P0l7K3M0K2o9JO1l7J89j78J3K2q5qj3j23J41j87K35j04m8kP0j03P4M1M4
4021B7K0n4Q8j36R2l3P5j73J58J8j84L8j7j47K28K8n0rN1Jp9J34kJ3p1N1r6m7
4049g6J45j03K9j2L0n4o2R5J6K2k05J37K9r6R7j7J3%j0P4j9Nk0p1J1O9k5n9K9
4078b8r7J09l6J8Q7r9j52J83O8k85K23J80k7j55Q8N0k14J03J1r3ML7lr8J96j65
4104i5J04p3Q0m7%j6L8L6L9pl3l4P4mj6p7J34j13J01k04NKmJ37q6L2N7l4O9n6
4134IlJ34q0n1J2R1r0N7rl4n3q6O2l4N6N4j10O2N7o7M5J25j61J70o0l2J22j24
4162F2o9R8r8k9K1k12K27j09rO0K9j47J72P6j7P0j17J8N5K9P8j64m0L9L3j26J48
4189G8q0j94J88j28O1J16k31L02r2k7M0J6j39J59j12J09l3q7M8O7r1m7R7j04l2
$$ plain form
3993 -25 45 8 31 71 93 24 25 86 49 238 60 73 95 10 2 -11 -134 7 -180 55 -49 -97 -99 -29 -132 -58 -17 27
4021 27 47 -7 81 -55 37 4 79 -94 64 82 -102 -64 -81 -228 0 28 -22 -31 20 21 -58 76 74 87 16 67 -29 -76
4049 -76 69 -34 -5 -17 13 -41 -103 -8 8 30 -175 -38 -9 -105 -8 -25 -12 -12 -22 52 33 38 18 -53 -42 27 2 -57 -28
4078 -28 -125 -16 -52 -34 53 -46 -198 -15 53 -232 -9 171 144 -11 77 127 -87 16 27 -66 -62 -25 -28 -126 70 -95
4104 -95 9 -64 16 -31 -31 -47 -9 27 66 59 26 -8 66 62 46 -31 103 -10 91 -113 -108 -106 -110 27 -59 -27 30 -4 65 9
4134 9 6 140 60 9 21 112 22 79 70 36 -17 -103 -41 -75 -19 35 -75 -13 44 -23 22 147 -14 156 96 64 186 62
4162 62 -7 91 -7 -36 -15 -227 0 -109 -118 -58 -29 -176 -4 72 55 125 8 26 81 110 188 24 -16 23 56 -70 78
4189 78 -2 -196 -8 -136 -75 41 -190 112 20 -7 33 49 -90 69 -43 66 33 -54 -6 61 -30 -77 20 -84 -116
4214a16M4n8M4J47j25m8J46j8J06j12J15K5j22J27j3q3j3o0N3jj06l1K0n2J3M1
4240g7NP4j08J56K5j29J65k6l3N4M2j53O4o2K8L4l22J96K0j5lJ3m6Q8J4J71j85
4267a0J16j3Pj01j13J36L0j27J31j58R8m6m8Km6P4j63J79Q5n2J33n3K5n2J29k10
4293d7R3Q0j09P8j64l3R2Nj09R9j0j4Jj15J44K20j51P8k4k10K42j25O3j6k1kj5
4320C0q9Q4j04rM9o4kO7j04J25%j28K37K9j75K14j04q8J20m2%P9j38k1J7k1L5
4347cJ8l6O8j2k6J22j95R9J0OKj3k4m1P5m1m0o5J41pK5r9j8pK9M7j12J8M5RJ22
4378I7j67P5J06j28J80j65N8K6j16p0J83j23K0R0j48j8M0jL5N3j69J44o3J3K12
4403A64j80M8O0j24Q8L6k06K3N7j2q3J9k3K7m4k0J42j02J43k1k7l7J19M3J16l19
$$ plain form
4214 -116 -72 -130 -86 61 -64 -112 34 16 122 10 125 150 28 155 142 59 46 -14 39 38 -68 -99 -79 -131 -118 -77
4240 -77 -72 2 -106 50 75 -54 111 85 52 106 148 -5 59 -3 25 59 -263 -67 -47 -62 -65 -52 -98 -10 4 175 -10
4267 -10 106 93 100 -1 -114 22 52 -75 56 -102 -4 -50 -98 -96 -142 -68 -231 -52 33 -19 114 61 86 34 163 -47
4293 -47 46 126 17 95 -69 -102 -10 -5 -114 -15 -25 -39 -38 -153 -9 211 60 138 114 -96 146 21 84 68 47 45 30
4320 30 -59 25 -79 -88 -39 -103 -105 -38 -142 -17 -17 -145 92 121 -54 160 56 -32 88 46 46 125 -13 -34 -17 -38 -3
4347 -3 15 -21 47 35 9 131 -64 35 45 51 53 40 16 -25 50 9 -31 -96 45 38 63 -36 -54 -61 -32 15 -97 -79 -34 -25 97
4378 97 -70 5 111 -17 163 -2 56 82 -34 -104 79 -44 -24 66 -82 -100 -60 -61 -26 27 -142 2 -61 -48 164
4403 164 -16 32 92 -32 56 92 -114 -91 -34 -46 -129 -110 -133 -106 -150 -170 -28 -130 13 -8 -35 -72 47 90 206 -113
4429a13J64q6l7K16j74n2J81n9k12K9J10j5N8r0O3k8J14%j47J25l2O4o8oj9J81
4455A67j55r2M1oj51K13pj23O4Q2j07J09j01J35Q4k54J4J07M5j04J79j15n4P5
4479D6j66M7L0n9J42q4J84j07q8l4J59r2J26j45J35J6j69p5K31r2O8k1j08R4q9
4504e1j37J06L3KR7j19O0K9Q2r3M9qO2n9O7j09o6J80j61m7J7L3o8J00k6o8k3J55
4532C7j04O0j2M4L5J0J21j26o2J05nj3r0N3k4k21N7K03k06J64j06P7j49R9M9M8
4558D4J14o5m0p3K25j59ok0Q8p0m3L3j91J08K3q4J41l1p8O6m0k2J10P5j00L0O8
4585A03k3j05M1jp8J50m4m7j89J19p0J46o7N3M6r7J52k7J00j22J7J7o5oN0m6j8
4612a1mn9J02J9j44N7j1j6j2J2N0J2J00n6p2K8Q9j04Q9k2j04P2rPJ23k33J3J5
$$ plain form
4429 -113 51 -35 -72 144 -30 -82 99 40 -172 -143 -33 -48 10 -80 -17 -45 69 69 -78 47 15 79 11 5 -14 167
4455 167 12 -80 -39 -45 -196 17 10 -113 -49 33 -74 35 -66 69 153 -101 -87 20 65 -39 140 25 -29 46
4479 46 -120 -73 -43 -102 40 -44 140 33 -55 -89 70 -22 104 -41 94 110 -59 -134 97 5 73 52 -56 38 -51
4504 -51 -188 -82 -49 -47 50 -69 -9 20 102 9 58 50 112 53 120 11 -55 125 -36 -83 -66 -33 -101 -1 -27 -95 -118 37
4532 37 -67 -7 -19 25 60 70 191 65 3 108 103 90 0 53 29 -192 -135 68 -138 26 -80 -3 -152 -53 -4 44
4558 44 158 93 53 -20 205 46 40 20 108 38 -5 28 -163 -55 -32 -116 25 -6 -84 -18 -58 -80 30 105 5 35 103
4585 103 80 -25 16 15 -63 87 43 -4 -193 -74 -144 2 -65 -12 34 -63 89 62 162 40 57 74 9 3 53 7 -11
4612 -11 -15 -74 28 47 -97 -40 -51 -67 -79 -67 -17 -5 95 39 -33 -5 84 -20 69 47 -57 15 6 13 136 -97 -84 -69
4640f9nJ09n4l9J25l2L2M9j19l0K0M3O2j54J45o8k0j3N2l1mj14RR4J6r4J19p1
4668d2J4P2n2k5QJ29p3J34j42j4o2N4P7k9j03M8L0o4N0J9N2o8qP0j28N3n0P8R1
4697A19l8j28J00j02n0K43k30P7O0o1k1O0j60M1M8mpNL7Jl8l9K54j71K7p1NL1
4725a2j50R2J12O0j17R6j66N7J2j02L0k0N5J38q8jJ06j%l4j14RL7j31J40o9k5
4752h6O4rj24K09j08JJ19n3J2L7k6O1r2n2L7Nq1K5J09m8N2k7j00M2j5L3J8M4J2
4781E9m0q8K43j33O6k50J89M3K6j53J6J09j64O0q6O1n1l9L9N4j6R0n9M2k7M4M0
4808G5rj66K22k6j63N6l9R3l7l5L1o5JL3j90K42o7P0MN6m2j3nJ58j34k4o5J09
4836G0q2q7J6l4N8O9j49J44J2j36M9P6o6J53N9j84J28n5J24r5o7m1ok2M8loj7
$$ plain form
4640 -69 -74 35 -19 -58 67 35 67 116 -3 -33 -13 30 92 -62 83 15 -5 -18 34 3 -1 -115 -106 -12 4 -90 29 -42
4668 -42 -28 44 -8 -33 -25 104 31 165 23 9 -53 1 78 49 -54 -6 24 -40 10 29 81 13 5 75 -53 0 -50 28 119
4697 119 81 -47 53 -49 -99 144 -86 -9 51 -10 -31 29 -131 -90 -42 -46 -53 -48 -11 -10 -48 -87 167 -4 23 -48 -43 -12
4725 -12 -162 -70 42 102 -15 81 -85 -28 -16 -118 -88 -108 -53 85 -3 -4 102 101 101 67 -47 -38 -1 -132 8 -61 -86
4752 -86 -22 -31 -155 54 -54 -53 66 13 25 62 36 97 5 -47 -10 -5 -86 -61 48 0 52 25 -75 -33 -48 -15 3 47 59
4781 59 19 -69 174 41 107 -143 46 89 115 -38 -22 87 -77 -17 -103 -42 -93 -132 -93 -39 -55 35 -24 18 -9 35 75
4808 75 66 -100 122 96 -67 -11 -50 43 6 -29 2 -63 -62 -29 -219 23 -44 26 30 86 44 31 26 184 50 26 -39 70
4836 70 -12 -99 -83 -117 -59 10 -139 5 17 -119 -70 6 -60 93 152 -32 96 41 165 70 3 -38 -44 -66 -18 -21 -27 -44
4864d4K8k2N6p1M7L5Q1r3L2j42J13k3n9Kp6J24O6j48N9j34J7J25nqk2J07k3N6
4892G8o9J10Lk21J74N7j72K8k5l1P5k3Lq4M3j05K11j88J50r2L1p1K60k46J41M5
4918H2j97J80l4Pj08R5j16m2Q2mj1L6N1j02J21r5J3KK8M9j9Mk7N8L0m8qo3m6J38
4948E6p5qn8n8J09J14j07J14j14J6L1nL7Pj30O9Jl2O7l6L0k2n5j4L7q1P4n8j8
4977a09J90j61o5J51l3J1P2j6j31J02P8j05J05q5Q5m3n5P0j15M1J06j43m0J27
5001C7j69K1M5n6J11mj04Q7N7o5M5j24J70r6J12o2k5j55K39j67NR5k4M7m3k8N3
5028BJ08j45kK8J37o0j9p3Q1p8q8L7l1J15q8mJ24m9r3R6m0N7j5l6m2J60k1oj27
5057g2M6o2N6J8j3o4Q4m8o4J99r0m6P8m8pJ85q2q7J12r7J5M8n6q1o2J26j06O7
$$ plain form
4864 -44 -16 -38 18 -53 -6 29 110 17 49 -93 20 -3 -62 -60 -136 -12 54 -94 -35 -169 -152 -27 -32 -40 -62 45 22 78
4892 78 9 119 122 -99 75 132 -40 -12 -37 -68 7 -16 -13 -97 -54 -159 52 -136 14 -78 -47 -118 142 -104 37 82
4918 82 -115 65 31 38 -70 25 -91 -133 -51 -55 -66 -30 21 -81 40 -55 -42 -40 -12 37 18 22 -5 53 83 35 27 -36 -82 56
4948 56 -19 -27 -85 -143 -34 80 -27 87 -27 -11 20 15 52 59 -71 -2 -1 -33 34 -2 28 6 -49 -63 -26 -107 -33 -91 -109
4977 -109 81 -80 -145 6 -27 -16 56 40 -91 11 89 -16 89 4 89 46 -9 61 -54 -13 93 -50 -90 37
5001 37 -132 -111 -66 -122 -11 -15 -119 -32 25 -40 5 -119 51 -45 67 5 -20 -175 64 -103 -98 -3 -27 20 -23 -51 2
5028 2 110 -35 -37 -9 128 68 49 -24 57 -21 -109 -72 -103 12 -76 -80 44 -5 -98 -2 -42 15 0 -36 -78 82 61 55 -72
5057 -72 -26 -88 -32 -14 -27 -91 -7 -55 -119 80 -10 -56 22 -26 -33 152 70 -17 95 -2 13 61 5 -76 -138 -12 -118 -51
5085e1Q6m2j15O1n5J02oM9m8J9L3m9K10j09l7l6o3R7m5PK1o2j50R7L3L5j11Q9
5113d0J42j31N7qjP3m6J31k5n9p3j3Q6r1l7j2j32J37m5P2n7j8J73m4j68J30K3
5140B4l8J45j59N3N9J8j42K2J6j00O8J07j03j74J61k9K3j6J04K3o9J17n7N8j31
5165b0pKO4k9O3K4j27n5RJ14k2r9o1J81q7J33j56j3N9j21J08J57j67Q2Jj01M4
5192b4nNR4j53o5K00q5K2M3p0L8J43j40O8p1N9j4k2j7L5p8L2N2k9q7N9m4R9r6
5221e1k2P0j87J16J05n2o2K33j98J01q7R4k3n1j6n0j2J06p1j3J72j97R6l8O5K1
5247D9J5M0j20mJ2M9l0p6J96k4j79J52j26K2P2j06O4n1l1PR2j40J31rr6M5K9o1
5275g8J01l4L5K6p2J53r6k8l9L5J5p9o3J50n1l6R5n0qP1p4O6P3k8m6m3j22J61
$$ plain form
5085 -51 35 -7 -122 -61 -116 -14 -20 29 -19 0 33 -16 194 85 48 12 -51 46 1 8 29 -33 -183 -86 -53 -18 -129 -40
5113 -40 102 -29 28 20 19 92 46 177 152 93 20 7 93 2 -35 -47 -179 -42 -87 -15 -72 -90 83 39 -129 1 24
5140 24 -14 131 -28 25 84 102 -40 -18 -2 -102 -34 73 -30 -204 -43 -72 -49 -65 39 62 -7 110 53 111 -20
5165 -20 -27 -25 39 10 73 97 -30 -85 -76 38 16 -83 -144 37 -50 83 -73 -86 -27 -148 -40 117 -50 32 33 -68 -24
5192 -24 -29 -24 70 -83 -148 52 -33 -11 32 -38 0 143 3 71 0 59 45 23 6 41 -37 -5 47 18 -69 -10 -54 45 -51
5221 -51 -73 -3 -190 -74 31 -21 -83 150 -48 53 -34 60 37 -14 -30 -80 -92 14 -57 -70 102 -95 1 -37 28 49
5247 49 64 104 -16 -20 -8 41 11 -65 131 107 -72 80 -46 -24 48 -58 6 -45 -76 -69 23 -117 14 5 -91 -46 -17 -78
5275 -78 23 -11 24 50 -22 131 35 7 -32 3 18 -61 -124 26 -25 -61 34 -16 -24 47 -27 39 112 84 38 -5 -127 34
5303C4%o9Q3r1RJ06k30M7L7K2M4j79K04q0J22j30M3O5j12J74j15NR2j38R1M3n1
5330B6n5L2k8J04j26J04M3r4m9J20o4O9l3l4K6k9O3j5q5r7J51k32K23j0j87K07
5356C0q0K1r1L6J56On5K5M2o1pm9J08J05j64j3j8Rn5M1j37J28K7k12Q3J42K6r3
5384e0K6m5K42j99j3J28j78J07R0j14J30j44k5k4M9kl2l7o7J66k9p0P3L3K5P3
5410A13l0J4q9Q1r6j17J11l6J72j18m3l3J5o2J07Q7r4M4m4J27n7o1L6n2mJ4Q0
5437F5K5n9L2j05L8p8p1J61j9k8M5j06M1k5J01O4m6J36n4j48P9n4q4l5J18k2P
5464b2K6j0N2l8p0j6J19J9q5m6J38j6j00L6l0J12j23J51o5n2M2p0N2j22J08J9
5490In5l7N4j92K70p9K6j5J10n2L1l5J4j4K1l0Rm4r2O8J36j41k7K8n0J28kk2l1
$$ plain form
5303 34 34 -35 48 -43 -34 72 -158 -111 -74 -52 -8 -187 17 -63 59 -71 -28 37 -75 99 -16 -11 81 -57 34 77 26
5330 26 -29 3 -25 79 -47 57 100 6 -43 77 13 82 49 15 41 12 75 60 -25 -122 29 -203 20 10 -177 30
5356 30 -50 -29 -120 -84 72 78 23 48 90 29 22 -27 81 186 22 9 -9 0 -55 -14 -151 -23 4 -208 -125 17 43 -50
5384 -50 -24 -69 173 -26 -39 89 -89 18 108 -6 124 -20 -45 -69 -20 -22 -54 -91 -158 8 -21 -91 -18 15 40 113
5410 113 83 97 8 89 -7 -124 -13 -49 123 5 -38 -71 -56 -118 -11 76 -18 26 -18 109 52 -9 27 -25 -29 -15 65
5437 65 90 31 63 -42 -4 -82 -153 8 -11 -39 6 -100 -59 -84 17 81 35 171 117 -31 48 -6 -90 -125 -7 -29 -22
5464 -22 4 -6 46 8 -62 -78 41 60 -25 -71 67 51 -49 -13 -43 69 -54 97 32 -20 22 -48 4 -118 -10 9
5490 9 -46 -83 -29 -221 49 -30 -4 -19 91 39 70 35 49 35 56 26 35 -9 -101 -33 103 -38 -65 -37 -87 41 39 17 -14
5519a4NOr1P9N6JMm9J6J3n6J85j34j1j42J26o4k5O4qM2l8L7L1n8Q2o1J0J01j10
5549cJ2L1m4Jr0J0K5nK1J36k61J87lK3j8J01q2N4p2p7J4P6o4n7J81o1n7j6L4m5
5579d9O8nQj01J27k0k6j3j16J27j2k9q1J46J30r6J07j61q1J2L4k9L0k4J67j62
5605d9O6pJ1n0P8m2J18p2j7P3j46M6L2j52P2L8m2N6M5j22O4o1J04kq0J4J29j40
5633c6J52k0o8Kk0O6o5J8n1J09j40O2m8O5l5K4l5M0j16M3L5PJ47n5r5oP1j60K61
5662A52j40J9j32Q1J3N6p6M2lq9L0p6O0J84Lp2k1mp8jJ08j16J33jo7m6J56p8o6
5691b9oM2J7p2j01J60P3j2k6l3l9O0l1K3M0q3K7O1j8j5j09K6P6j24J32r4N3m4
5719d6J38q2m4J08j10J10l4k8L8o3j7k7m4J73j23m9j1J27j54R5m3J31ro1RO4M7
$$ plain form
5519 -14 -9 -3 -94 -15 41 42 46 -3 13 26 -30 155 21 10 -132 -6 -70 -95 -31 -39 3 -35 2 33 -25 57 -4 6 107 -3
5549 -3 9 40 -4 -3 -93 -83 -58 -63 -42 94 -167 20 17 40 22 123 41 95 23 -54 -40 36 -28 -85 96 35 -22 -38 -4 -49
5579 -49 19 14 22 -79 48 28 2 -11 -127 0 -12 -41 -122 24 154 58 165 4 -77 -65 -31 -60 -30 -54 113 -49
5605 -49 17 10 21 -29 49 7 125 53 36 109 -37 9 41 -111 -39 -1 -43 13 58 -64 0 -61 43 41 -39 -25 104 -36
5633 -36 116 96 28 30 10 76 11 29 -22 87 -53 9 -39 26 -9 15 -20 20 -96 -53 -18 -11 136 81 -14 -20 51 -109 152
5662 152 12 31 -101 -20 -7 49 -27 15 12 -77 -47 -123 -63 121 124 52 31 27 -51 -52 56 -60 73 72 5 -41 115 37 -29
5691 -29 -35 7 24 -48 -149 11 84 72 46 13 -26 34 3 26 66 -17 10 71 53 38 -71 -45 31 -93 39 -55 -2 -46
5719 -46 92 10 -34 74 -36 74 40 12 50 -13 -30 -57 -101 72 -51 -100 -111 16 -138 -43 -86 45 36 -25 -16 48 95
5746I5j12J29r8N8m0n5J3PJ5n5L2j17L3J09k6Oj8J3K9O6m9J43k05J6J6K7k7lj6
5775a4n1L8m8M8n2k3Q4j44J54O2p6K6o7P9N6p9M4po0J38o9l4K4j4Nm0r0J94q1
5804Cp7L2J4P0j7jq7P7n7m0J60j38J06j1N6J3m5j23L7R8j30M8L3n6J5o1J11o3
5832c3J57j65R5n8J40o1n5p1Q8J1L6p6l7K3p1L5O1j33N0L0R5j05L2j9PN9m8M6
5860C3q2J49j9j10j2N6j09J05Ok7j1m4M9rn4O3Q5j33J25n7Q9j61pM0O2k2n3J16
5888F8K8j65LO1j2m9N5O5j59O9oK9L9L0l2j4J4Q1j0j25O2o2L2o3p5J59nj21J77
5917G4j9r3J8j2M1j13J24p0QM1J25j42R0o2L0P6m5j63Q4OmO7j77Q6r7Q0O1p4Q7
5946B7j2J56k00l9Q5o5KJ31j02k9j0K1l5j2LK5M4On1j9J59m7k4p1N2M8K4k0r5
$$ plain form
5746 95 -17 112 14 72 32 -23 -10 -3 12 -43 -11 -128 -95 14 -12 -6 -24 -11 18 84 35 178 -27 -11 5 32 5 2 -14
5775 -14 -65 -27 -75 -27 -79 -102 -18 -162 -8 54 -22 4 -63 16 72 -7 37 30 -30 108 39 5 29 15 20 -20 -110 84 3
5804 3 -74 -42 -28 42 25 24 -63 14 -43 -83 77 -61 45 34 90 103 58 -65 -28 70 -60 -12 21 -35 -20 -81 30 -33
5832 -33 124 -41 54 -4 136 75 20 -51 37 48 84 8 -29 -6 -77 -42 19 -114 -64 -34 61 -44 -12 -31 -24 35 -13 33
5860 33 -49 100 81 -29 -41 15 -94 11 17 -10 -21 -65 -16 -25 -79 -16 69 -64 61 4 93 -68 -75 -35 27 5 -48 68
5888 68 96 -69 -66 -5 -17 -66 -11 54 -105 -36 -42 -13 26 56 24 10 24 105 95 -30 32 -30 2 -61 -136 23 18 -103 74
5917 74 55 -38 -20 -32 9 -104 20 -50 -42 -1 124 -18 72 10 40 116 71 -92 -8 -2 -6 61 -116 -30 -127 -47 14 -60 27
5946 27 15 171 -29 -68 17 -48 -46 85 -17 -46 -56 -35 -70 -82 -79 -54 -10 -4 -55 -74 85 38 14 -57 -5 43 67 47 -48
5975d8J42p1j48K07%j27nM2P1j55J08J9q2K1o1qM7L3o0P7j5P7l6q3J4P5j32N7
6003d1k4o0N2L8N9j2L4j1R7j37N4n5J3Q0j12o1k3O0M3rl6j3M6r5M2J0M8j10OJ05
$$ plain form
5975 -48 94 23 -125 82 82 -45 -50 -8 63 -92 16 35 -47 -26 -87 -95 -48 -15 -75 2 -13 64 28 -55 -41 34 -98 -41
6003 -41 -65 -125 -73 -35 24 12 46 35 132 -5 49 -6 7 87 -25 -86 -109 -49 -6 -15 -51 -64 -18 -113 -71 -61 -13 -123 -117 -12
$$ [...]
8191B6
##END NTUPLES=NMR FID
##END=
