##TITLE=1H_DE-80H_X3
 200.13MHz, d2o
 8 sc
 
 19ns.26.2.2025
##JCAMPDX= 6.0         $$ Bruker NMR JCAMP-DX V2.0
##DATA TYPE= NMR FID
##DATA CLASS= NTUPLES
##ORIGIN= UXNMR, Bruker Analytische Messtechnik GmbH
##OWNER= pz
$$ XWIN-NMR		Version 3.5
$$ Tue Mar 25 10:41:28 2025 Russian Standard Time (UT+4h)  Yarkov@DPX200
##.OBSERVE FREQUENCY= 200.1313
##.OBSERVE NUCLEUS= ^1H
##.DELAY= (6, 6)
##.ACQUISITION MODE= SIMULTANEOUS
##.ACQUISITION SCHEME= undefined
##.AVERAGES= 8
##.DIGITISER RES= 18
##SPECTROMETER/DATA SYSTEM= spect
##.PULSE SEQUENCE= zg30
##.SOLVENT NAME= CDCl3
##.SHIFT REFERENCE= (INTERNAL, CDCl3, 0, 14.3821)
##AUDIT TRAIL= $$ (NUMBER, WHEN, WHO, WHERE, WHAT)
$$ ##TITLE= Audit trail, XWIN-NMR		Version 3.5
$$ ##JCAMPDX= 5.01
$$ ##ORIGIN= Bruker BioSpin GmbH
$$ ##OWNER= Yarkov
$$ C:/Bruker/XWIN-NMR/data/yarkov2/nmr/H-C/1/audita.txt
$$ ##AUDIT TRAIL=  $$ (NUMBER, WHEN, WHO, WHERE, WHAT)
(   1,<2025-03-25 10:39:57.28 +0400>,<Yarkov>,<DPX200>,
      <created by zg, POWCHK disabled, PULCHK disabled
       configuration hash MD5:
       00 E9 B6 7A A2 85 ED C7 34 08 36 98 17 FE 4E 26
       data hash MD5: 16K
       39 B6 9C B7 30 77 29 0B 74 D6 EA 55 69 14 9D 50>)
$$ ##END=
$$ 
$$ hash MD5
$$ 78 11 DE 31 28 3C 98 65 E1 50 E7 C4 ED 29 FD F6
##$RELAX= 
##$RELAX= 
##$RELAX= 
##$RELAX= 
##$RELAX= 
##$RELAX= 
$$ Bruker specific parameters
$$ --------------------------
##$DU= <C:/Bruker/XWIN-NMR>
##$EXPNO= 1
##$NAME= <H-C>
##$PROCNO= 1
##$TYPE= <nmr>
##$USER= <yarkov2>
##$AMP= (0..31)
100 100 100 100 100 100 100 100 100 100 100 100 100 100 100 100 100 100 
100 100 100 100 100 100 100 100 100 100 100 100 100 100 
##$AQSEQ= 0
##$AQ_mod= 1
##$AUNM= <au_zg>
##$AUTOPOS= <>
##$BF1= 200.13
##$BF2= 200.13
##$BF3= 200.13
##$BF4= 200.13
##$BF5= 200.13
##$BF6= 200.13
##$BF7= 200.13
##$BF8= 200.13
##$BYTORDA= 1
##$CFDGTYP= 0
##$CFRGTYP= 5
##$CHEMSTR= <none>
##$CNST= (0..31)
1 1 145 1 1 1 1 1 1 1 1 1 1 1 1 1 1 1 1 1 1 1 1 1 1 1 1 1 1 1 1 1 
##$CPDPRG= <>
##$CPDPRG1= <>
##$CPDPRG2= <>
##$CPDPRG3= <>
##$CPDPRG4= <mlev>
##$CPDPRG5= <mlev>
##$CPDPRG6= <mlev>
##$CPDPRG7= <mlev>
##$CPDPRG8= <mlev>
##$CPDPRGB= <>
##$CPDPRGT= <>
##$D= (0..31)
0 0.7 0 0 0 0 0 0 0 0 0 0.03 0 0 0 0 0 0 0 0 0 0 0 0 0 0 0 0 0 0 0 0 
##$DATE= 1742884796
##$DBL= (0..7)
120 120 120 120 120 120 120 120 
##$DBP= (0..7)
150 150 150 150 150 150 150 150 
##$DBP07= 0
##$DBPNAM0= <>
##$DBPNAM1= <>
##$DBPNAM2= <>
##$DBPNAM3= <>
##$DBPNAM4= <>
##$DBPNAM5= <>
##$DBPNAM6= <>
##$DBPNAM7= <>
##$DBPOAL= (0..7)
0.5 0.5 0.5 0.5 0.5 0.5 0.5 0.5 
##$DBPOFFS= (0..7)
0 0 0 0 0 0 0 0 
##$DE= 6
##$DECBNUC= <off>
##$DECIM= 32
##$DECNUC= <off>
##$DECSTAT= 4
##$DIGMOD= 1
##$DIGTYP= 9
##$DL= (0..7)
0 120 120 120 120 120 120 120 
##$DP= (0..7)
150 150 150 150 150 150 150 150 
##$DP07= 0
##$DPNAME0= <>
##$DPNAME1= <>
##$DPNAME2= <>
##$DPNAME3= <>
##$DPNAME4= <>
##$DPNAME5= <>
##$DPNAME6= <>
##$DPNAME7= <>
##$DPOAL= (0..7)
0.5 0.5 0.5 0.5 0.5 0.5 0.5 0.5 
##$DPOFFS= (0..7)
0 0 0 0 0 0 0 0 
##$DQDMODE= 0
##$DR= 18
##$DS= 0
$$ [...]
##$SUBNAM2= <"">
##$SUBNAM3= <"">
##$SUBNAM4= <"">
##$SUBNAM5= <"">
##$SUBNAM6= <"">
##$SUBNAM7= <"">
##$SUBNAM8= <"">
##$SUBNAM9= <"">
##$SW= 18.0517328524113
##$SWIBOX= (0..15)
0 0 2 0 0 0 0 0 0 0 0 0 0 0 0 0 
##$SW_h= 3612.71676300578
##$TD= 16384
##$TD0= 1
##$TE= 0
##$TE2= 300
##$TE3= 300
##$TEG= 300
##$TL= (0..7)
0 120 120 120 120 120 120 120 
##$TP= (0..7)
150 150 150 150 150 150 150 150 
##$TP07= 0
##$TPNAME0= <>
##$TPNAME1= <>
##$TPNAME2= <>
##$TPNAME3= <>
##$TPNAME4= <>
##$TPNAME5= <>
##$TPNAME6= <>
##$TPNAME7= <>
##$TPOAL= (0..7)
0.5 0.5 0.5 0.5 0.5 0.5 0.5 0.5 
##$TPOFFS= (0..7)
0 0 0 0 0 0 0 0 
##$TUNHIN= 0
##$TUNHOUT= 0
##$TUNXOUT= 0
##$USERA1= <user>
##$USERA2= <user>
##$USERA3= <user>
##$USERA4= <user>
##$USERA5= <user>
##$V9= 5
##$VALIST= <valist>
##$VCLIST= <CCCCCCCCCCCCCCC>
##$VD= 0
##$VDLIST= <DDDDDDDDDDDDDDD>
##$VPLIST= <PPPPPPPPPPPPPPP>
##$VTLIST= <TTTTTTTTTTTTTTT>
##$WBST= 1024
##$WBSW= 4
##$XGAIN= (0..3)
0 0 0 0 
##$XL= 0
##$YL= 0
##$YMAX_a= 153232
##$YMIN_a= -196068
##$ZGOPTNS= <>
##$ZL1= 120
##$ZL2= 120
##$ZL3= 120
##$ZL4= 120
##$ABSF1= 10
##$ABSF2= 0
##$ABSG= 5
##$ABSL= 3
##$ALPHA= 0
##$AQORDER= 0
##$ASSFAC= 0
##$ASSFACI= 0
##$ASSFACX= 0
##$ASSWID= 0
##$AUNMP= <proc_1d>
##$AZFE= 0.1
##$AZFW= 0.1
##$BCFW= 1
##$BC_mod= 2
##$BYTORDP= 1
##$COROFFS= 0
##$CY= 83.5205535888672
##$DATMOD= 1
##$DC= 2
##$DFILT= <>
##$DTYPP= 0
##$F1P= 10.8118882576601
##$F2P= -7.23987719738617
##$FCOR= 0.5
##$FTSIZE= 0
##$FT_mod= 4
##$GAMMA= 1
##$GB= 0.15
##$INTBC= 1
##$INTSCL= 1
##$ISEN= 128
##$LB= 0.25
##$LEV0= 0
##$LPBIN= 0
##$MAXI= 10000
##$MC2= 0
##$MEAN= 0
##$ME_mod= 0
##$MI= 1.114404
##$NCOEF= 0
##$NC_proc= 0
##$NLEV= 6
##$NOISF1= 3.799351
##$NOISF2= 2.8
##$NSP= 1
##$NTH_PI= 0
##$NZP= 0
##$OFFSET= 14.38212
##$PC= 1
##$PHC0= -1174.125
##$PHC1= 6.592253
##$PH_mod= 1
##$PKNL= yes
##$PPARMOD= 0
##$PSCAL= 0
##$PSIGN= 0
##$REVERSE= no
##$SF= 200.129724274929
##$SI= 16384
##$SIGF1= 3
##$SIGF2= 2
##$SINO= 400
##$SIOLD= 16384
##$SREGLST= <1H.CDCl3>
##$SSB= 0
##$STSI= 0
##$STSR= 0
##$SW_p= 3205.1282051282
##$SYMM= 0
##$S_DEV= 0
##$TDeff= 0
##$TDoff= 0
##$TI= <>
##$TILT= no
##$TM1= 0
##$TM2= 0
##$TOPLEV= 0
##$USERP1= <user>
##$USERP2= <user>
##$USERP3= <user>
##$USERP4= <user>
##$USERP5= <user>
##$WDW= 1
##$XDIM= 8192
##$YMAX_p= 0
##$YMIN_p= 0
$$ End of Bruker specific parameters
$$ ---------------------------------
##NTUPLES= NMR FID
##VAR_NAME=  TIME,          FID/REAL,        FID/IMAG
##SYMBOL=    X,             R,               I
##VAR_TYPE=  INDEPENDENT,   DEPENDENT,       DEPENDENT
##VAR_FORM=  AFFN,          ASDF,            ASDF
##VAR_DIM=   8192,          8192,            8192
##UNITS=     SECONDS,       ARBITRARY UNITS, ARBITRARY UNITS
##FACTOR=    0.0002768,     1,               1
##FIRST=     0,             0,               0
##LAST=      2.2672688,     0,               0
##MIN=       0,             -196068,         0
##MAX=       2.2672688,     153232,          0
$$ Real data points
##PAGE= N=1
##DATA TABLE= (X++(R..R)), XYDATA
$$ plain form
0 0 0 0 0 0 0 0 0 0 0 0 0 0 0 0 0 0 0 0 0 -2 6 -8 8 -8 8 -8 8 -12 14 -16 16 -20 22 -23 29 -30 34 -37 41 -47 51 -57
42 -57 62 -69 76 -84 92 -100 109 -122 133 -147 163 -179 201 -224 250 -283 323 -371 431 -508 617
63 617 -764 991 -1353 2015 -3451 7773 -46190 -196068 -4608 64752 -83761 -9300 136484
76 136484 39000 -57575 32919 27850 -112332 -29633 134132 17962 -79335 48276 44978 -75265
88 -75265 -28356 50867 -3919 -37346 32264 18113 -91129 -28064 109307 30943 -43004 59426
100 59426 51778 -67473 -49884 21293 -2733 -13406 56627 39491 -79885 -59809 23142 -49214
112 -49214 -71927 49192 57919 -10734 8397 16988 -32110 -27333 31867 24494 -29668 10531 56552
125 56552 -16045 -41133 22761 18238 -14368 -4233 -4502 -16752 -13438 12208 24311 -2966 9038
$$ packed form
0@%%%%%%%%%%%%%%%%%%%kQj4J6j6J6j6J6k0K6l0L2l6M2m5N2n9O4p1P8q8R8j08
42e7J19j31J45j60J76j92K09k31K55k80L10l42L80m25M74n33O06o94Q02r39J125
63F17j381J755k344L368n466J1224n3963j49878J91460O9360j48513P4461J45784
76A36484r7484r6575R0494n069j40182Q2699J63765j16170r7297J27611l298j20243
88g5265M6909P9223n4786l3427O9610j4151j09242O3065J37371p8364p3947J02430
100E9426p648j19251J7589P1177k4026j0673P0033j7136j19376K0076Q2951p2356
112d9214k2713J21119Q727o8653J9131Q591m9098M777N9200p373n4162M0199M6021
125E6552p2597k5088O3894m523l2606J0135k69j2250L314K5646J2103k7277J2004
$$ plain form
138 9038 41561 -2307 -33322 4674 23088 18342 20622 21252 12572 -16012 -25058 -19619 -45010 -28528
152 -28528 21928 3350 -21145 1184 5322 -9319 -17044 -6557 12734 3609 4138 22078 -1851
165 -1851 -11685 18034 5345 -22910 -13308 5334 7176 -9342 752 28725 4801 -9535 13672
178 13672 -11649 -29568 11379 18163 -3996 9792 33039 20440 -13941 -6354 13728 -16551
190 -16551 -15457 23393 -1278 -20864 11408 1914 -31205 -22486 -59 -2182 -16920 2870 26890
203 26890 230 -2493 23655 -3791 -21129 8598 6009 -11773 256 17343 11248 -11641 -4639
216 -4639 7681 -21460 -19344 12750 -3528 -9161 21344 15823 -4390 -749 8016 3373 -10538
229 -10538 2804 19256 -2094 -1127 16082 -9562 -20178 -1492 -8238 -13534 -1912 8643 12457
$$ packed form
138I038L2523m3868l1015L7996J8414m746K280O30q680k8584r046N439k5391J6482
152b8528N0456j8578k4495K2329M138j4641p725J0487J9291r125N29J7940k3929
165a851r834K9719j2689k8255R602J8642J842j6518J0094K7973k3924j4336K3207
178A3672k5321j7919M0947O784k2159J3788K3247j2599l4381P587K0082l0279
190a6551J094L8850k4671j9586L2272r494l3119Q719K2427k123j4738J9790K4020
203B6890k6660k723K6148k7446j7338K9727k589j7782J2029J7087o095k2889P002
216d639J2320k9141K116L2094j6278n633L0505n521k0213L641Q765m643j3911
229a0538J3342J6452k1350R67J7209k5644j0616J8686o746n296J1622J0555L814
$$ plain form
242 12457 2586 6320 13370 -7952 -9597 5724 -8660 -8756 7621 2114 -1413 -1239 -3006 -302 -9765
257 -9765 -5408 9492 -626 1817 14622 1200 -4062 270 -8146 -6887 -4713 -2003 8877 3363
271 3363 3902 12481 -2084 -6338 1207 -8277 -5898 2174 329 6398 5028 2170 8363 -1615 -3931
286 -3931 6435 -2486 -2190 5910 -3232 -4484 -4967 -12590 -8342 -10205 -8301 6052 3958 7477 18646
301 18646 9049 6396 8517 -3373 -4277 -4306 -9013 -3022 -5934 -7406 783 -6248 -5845 4382 -1460
316 -1460 3247 11949 6320 9331 7709 33 2060 -5398 -8415 -684 -6364 -2494 7129 -360 1827
331 1827 5106 -3687 -2142 -3086 -7241 -1092 -4030 -3218 4111 -3353 -1264 6089 -1898 1753 7872 2788
347 2788 6407 5218 645 1759 -6776 -7991 -3222 -12173 -6604 3579 -3443 1625 9069 2898 4125
$$ packed form
242A2457r871L734P050k1322j645J5321j4384r6J6377n507l527J74j767K704r463
257i765M357J4900j0118K443J2805j3422n262M332q416J259K174K710J0880n514
271C363N39Q579j4565m254P545r484K379Q072j845O069j370k858O193r978k316
286c931J0366q921K96Q100r142j252m83p623M248j863J904J4353k094L519J1169
301A8646r597k653K121j1890r04k9m707N991k912j472Q189p031M03J0227n842
316a460M707Q702n629L011j622p676K027p458l017P731n680L870R623p489K187
331A827L279q793J545r44m155O149k938Q12P329p464K089P353p987L651O119n084
347B788L619j189m573J114q535j215M769q951N569J0183p022N068P444o171J227
$$ plain form
362 4125 3992 2245 3860 -2164 1502 5792 -6299 -1234 5385 -7938 -4712 3783 -1336 -68 2836
377 2836 3424 2825 -3968 1099 1527 -12091 -2566 5573 -8099 -2267 8547 2295 1077 3742 4486
392 4486 822 -4409 3743 1787 -12430 -564 4827 -13298 -8783 2198 -4680 -4681 2820 5999 3224
407 3224 1462 11233 5841 -8074 6484 10350 -8794 -2718 6449 -3360 -4498 941 1911 -794 -881
422 -881 8400 1713 -9458 6194 9100 -7467 -533 6426 -3279 -4055 -2461 -2274 -2147 -786 7472
437 7472 1199 -9144 3564 4033 -10615 -3891 2085 -2600 -2207 -5636 -6728 -4545 -3659 4526 3677
452 3677 -2271 8246 8590 -3259 -850 3508 6740 8630 -16 -725 1383 -5952 -2037 1467 -3056
467 -3056 5349 10149 562 -5702 -5102 4560 5457 -4842 3392 9289 -5651 -4049 1668 -7100 -1139
$$ packed form
362D125j33j747J615o024L666M290j2091N065O619j3323L226Q495n119J268K904
377B836N88n99o793N067M28j3618R525Q139j3672N832J0814o252j218K665P44
392D486l664n231Q152j956j4217J1866N391j8125M515J0981o878jP501L179k775
407C224j762R771n392j3915J4558L866j9144O076R167r809j138N439R70k705q7
422h81R281o687j1171J5652K906j6567O934O959r705p76J594J87J27J361Q258
437G472o273j0343J2708M69j4648O724N976m685L93l429j092K183Q86Q185q49
452C677n948J0517L44j1849K409M358L232J890q646p09K108p335L915L504m523
467c056Q405M800r587o264O00R662Q97j0299Q234N897j4940J602N717q768N961
$$ plain form
482 -1139 12289 6499 -7673 -8854 2817 -4255 -18571 -400 9307 -9426 -5391 1619 -14942
495 -14942 -11298 11614 12582 -1422 4118 19786 2099 -19588 2222 11360 -8709 2984 13789
508 13789 -12291 -15848 7982 4461 -12869 3270 28151 6536 -15796 8889 10856 -13598 6738
521 6738 21712 -8125 -11367 12101 -1449 -25882 -4383 23861 1025 -16637 9293 1283 -27418
534 -27418 -3352 12988 -13159 -5742 21056 2958 -25190 -6468 17144 -4005 -10806 20096
546 20096 10265 -18316 1908 8943 -18816 -7118 22066 6007 -17393 -198 16392 -6920
558 -6920 -10430 20662 12378 -10011 9946 9897 -19286 -7153 18965 5357 -11662 4216 13855
571 13855 -12008 -17097 9159 2581 -9646 12748 10147 -16846 -9433 7239 -4688 -14253 3069
$$ packed form
482a139J3428n790j4172j181J1671p072j4316J8171R707j8733M035P010j6561
495a4942L644K2912R68j4004N540J5668j7687k1687K1810R138k0069J1693J0805
508A3789k6080l557K3830l521j7330J6139K4881k1615k2332K4685J967k4454K0336
521F738J4974k9837l242K3468j3550k4433K1499K8244k2836j7662K5930q010k8701
534b7418K4066J6340k6147P417K6798j8098k8148J8722K3612k1149o801L0902
546B0096r831k8581K0224P035k7759J1698K9184j6059k3400J7195J6590k3312
558f920l510L1092q284k2389J9957m9k9183J2133K6118j3608j7019J5878R639
571A3855k5863n089K6256o578j2227K2394k601k6993P413J6672j1927r565J7322
$$ plain form
584 3069 14827 -3683 -10222 6155 -1834 -11060 8281 8337 -9425 -2931 7062 -2262 -11425 -181
598 -181 12864 1334 -6117 5888 -217 -9479 5115 8609 -1591 3028 9258 1896 -9765 -6265
612 -6265 7821 2835 -3224 9081 5796 -6362 -934 579 -6222 -2938 5378 6387 -5199 -7549
626 -7549 5511 -235 -10498 2528 5957 -5014 -1848 2497 -3495 -5929 2815 8671 -3740 -7092
640 -7092 7707 1274 -11628 2731 9127 -1524 602 6022 -1546 -9548 -1097 7231 -3547 -4761
654 -4761 12692 5426 -10154 1634 5717 -5666 -1751 7498 2439 -6347 68 6695 -7064 -9871
668 -9871 8169 1982 -10877 2196 6137 -5423 -1896 7357 2584 -5413 1281 7470 -5730 -6666
682 -6666 10515 3761 -7079 5618 6135 -6644 -3544 3741 -215 -5400 2301 7759 -4646 -6401
$$ packed form
584C069J1758j8510o539J6377p989r226J9341N6j7762O494R993r324r163J1244
598a81J3045j1530p451J2005o105r262J4594L494j0200M619O230p362j1661L500
612f265J4086m986o059J2305l285j2158N428J513o801L284Q316J009j1586k350
626g549J3060n746j0263J3026L429j0971L166M345n992k434Q744N856j2411l352
640g092J4799o433j2902J4359O396j0651K126N420p568q002Q451Q328j0778j214
654d761J7453p266j5580J1788M083j1383L915R249n059q786O415O627j3759k807
668i871J8040o187j2859J3073L941j1560L527R253m773p997O694O189j3200r36
682f666J7181o754j0840J2697N17j2779L100P285l956n185P701N458j2405j755
$$ plain form
696 -6401 6619 -956 -9448 3166 4568 -3816 -148 4455 231 -5358 -1028 3940 -5509 -5882 5655
711 5655 -80 -6059 3779 3518 -3115 -315 3046 1339 -2239 1326 6534 -526 -1455 6661 488 -4528
727 -4528 2882 1549 -2212 1136 2676 2099 -1180 -548 2800 -3495 -4545 2399 -1587 -3776 2118 308
743 308 -2027 -1183 -1392 -190 -2196 -1876 2920 -701 -1945 3415 -461 -2878 767 -1164 -1480 -440
759 -440 -412 1972 339 -401 3465 -392 -1710 2583 178 -764 2474 1120 1260 1358 -617 1298 -867
776 -867 -2200 1788 -592 -1533 2304 -407 -869 554 -2108 -473 -559 -2016 1670 300 -857 2782
792 2782 133 -1310 1580 -982 -628 615 -774 1163 460 -1493 1467 -1270 -2877 905 -1350 -1380
808 -1380 1690 -511 286 1257 -1207 655 -287 -1936 1535 53 -1186 2113 109 -671 1131 -1267
$$ packed form
696f401J3020p575q492J2614J402q384L668M603m224n589M330M968r449l73J1537
711E655n735n979R838k61o633K800L361j707l578L565N208p060r29Q116o173n016
727d528P410j333l761L348J540n77l279O32L348o295j050O944l986k189N894j810
743C08k335Q44k09J202k006L20M796l621j244N360l876k417L645j931l16J040
759d40K8K384j633p40L866l857j318M293k405r42L238j354J40R8j975J915k165
776h67j333L988k380r41L837k711m62J423k662J635q6j457L686j370j157L639
792B782k649j443K890k562L54J243j389J937p03j953K960k737j607L782k255l0
808a380L070k201P97R71k464J862r42j649L471j482j239L299k004p80J802k398
$$ plain form
824 -1267 -430 201 -941 1651 444 -746 2680 130 -1454 2027 -408 -769 1829 323 848 1424
840 1424 61 1487 -979 -1632 1468 -1876 -2014 1687 -1193 -1661 883 -1722 -1484 -332 -1006 391
856 391 -872 -106 2788 -1052 -814 2434 -1351 -1108 2154 -844 -647 1177 702 594 -1354 13 1927
873 1927 -2417 -431 2701 -1796 -45 3003 -897 -684 1527 696 -314 -1265 1100 2187 -2035 465
889 465 2322 -2697 -626 2325 -2459 -1347 1498 453 -369 -826 983 1309 -2248 412 1669 -2173
905 -2173 1631 3167 -2009 -344 1551 -623 -1097 -1318 59 769 -1975 139 333 -3108 690 1269
921 1269 -3079 -265 1306 -819 174 -575 60 1979 128 622 356 -1344 1717 732 -1664 1768 1191
938 1191 -479 1099 -1709 -1682 2079 636 -199 996 882 1652 -583 -930 1952 -494 324 3643 -2371
$$ packed form
824a267Q37O31j142K592j207j190L426k550j584L481k435l61K598j506N25N76
840A424j363J426k466o53L100l344j38L701k880m68K544k605K38J152o74J397
856C91j263P66K894l840K38L248l785K43L262k998J97J824m75j08j948J367J914
873A927m344J986L132m497J751L048l900K13K211q31j010r51K365J087m222K500
889D65J857n019K071K951m784J112K845j045q22m57J809L26l557K660J257l842
905b173L804J536n176J665J895k174m74k21J377P10k744K114J94l441L798N79
921A269m348K814J571k125R93p49O35J919j851M94k66j700L061r85k396L432n77
938A191j670J578k808K7L761j443q35J195j14P70k235l47K882k446Q18L319o014
$$ plain form
955 -2371 -2923 2288 -488 -3382 -324 1009 -416 -2659 -972 400 -4035 291 4636 -3571 -2513
970 -2513 4946 -524 -4969 773 3340 101 -1058 3054 661 -5500 1289 4757 -5083 -1886 7637
985 7637 -272 -5784 1515 2794 -2436 -35 6082 1727 -4692 3673 5237 -7226 -1520 9297 -390
1000 -390 -5310 2572 1189 -5677 -2160 4750 -644 -5247 4994 3623 -9886 -3016 7354 -2172
1014 -2172 -4041 5120 2196 -5853 -2031 3588 -2399 -4100 7632 5042 -8554 -1530 5348 -5107
1028 -5107 -4689 5606 2695 -3092 611 3294 -4008 -4710 7612 5729 -4813 2601 6697 -4952
1042 -4952 -4542 3942 1461 -1772 2593 3718 -4124 -6045 3123 1625 -5227 2952 6575 -3060 -4004
1057 -4004 434 -1808 -2649 2223 4356 -567 -3459 1880 -329 -6484 811 5656 -303 -962 248
$$ packed form
955b371n52N211k776k894L058J333j425k243J687J372m435M326M345q207J058
970b513P459n470m445N742K567l239j159M112k393o161O789L468r840L197R523
985G637p909n512P299J279n230K401O117m355o419Q365J564j2463N706J0817r687
1000c90m920P882j383o866L517O910n394m603J0241j371j3509O870J0370r526
1014b172j869R161k924q049L822N619n987j701J1732k590j3596P024O878j0455
1028e107M18J0295k911n787L703K683p302p02J2322j883j0542P414M096j1649
1042d952M10Q484k481l233M365J125p842j921R168j498o852Q179L623r635r44
1057d004M438k242q41M872K133m923k892N339k209o155P295M845n959o59J210
$$ plain form
1072 248 -2442 -3527 -1277 2454 1205 -776 3448 1842 -5078 -1315 3644 1333 1241 2471 1713 -1236
1088 -1236 -3184 336 459 -1840 3388 4229 -3450 -2998 630 -973 -1782 748 3599 1209 -3067 65
1104 65 -62 -5001 899 5241 -979 -1818 2132 -106 -3940 -2277 3161 1262 -2791 2541 1611 -6084
1120 -6084 -906 4208 -1891 -1426 4414 2322 -3337 -1598 3336 50 -3190 4184 3481 -4885 -193
1135 -193 3699 -3542 -3516 3419 2387 -2964 -1298 3009 -1418 -4813 3327 2935 -4435 1014 4800 -2850
1151 -2850 -3218 3124 1890 -2841 -334 4360 -648 -4295 2677 1914 -4894 1189 4698 -2479 -2206 2710
1167 2710 680 -3130 -716 3921 -490 -3087 3263 1706 -4441 776 3326 -2167 -1447 2389 559
1182 559 -2948 -1466 1958 -1371 -3303 2679 1152 -3628 646 2550 -2041 -760 2248 1399 -1105
$$ packed form
1072B48k690j085K250L731j249j981M224j606o920L763M959k311r2J230p58k949
1088a236j948L520J23k299N228Q41p679M52L628j603q09K530K851k390m276L132
1104F5j27m939N900M342o220q39L950k238l834J663N438j899m053N332r30p695
1120f084N178N114o099M65N840k092n659J739M934l286l240P374p03q366M692
1135a93L892p241K6O935j032n351J666M307m427l395Q140l92p370N449L786p650
1151b850l68O342j234m731K507M694n008l647O972p63o808O083L509p177K73M916
1167B710k030l810K414M637m411k597O350j557o147N217K550n493P20L836j830
1182E59l507J482L424l329j932N982j527m780M274J904m591J281L008q49k504
$$ plain form
1197 -1105 -634 2225 -706 -2913 2519 1726 -2499 1036 2018 -1673 -759 1275 926 -983 -535 1979
1213 1979 -321 -2387 1601 913 -2073 1170 1764 -725 -168 693 656 -552 -1162 1369 -524 -2667 434
1230 434 -212 -2650 -166 662 -727 -42 132 811 -149 -956 1808 319 -1719 1256 653 -1412 838
1247 838 801 11 108 -10 848 -266 -1075 1297 108 -1490 985 586 -1111 551 672 76 672 259
1265 259 1429 573 -735 1040 -15 -1549 281 -397 -1698 -473 -676 -427 -74 -903 887 370 -1225
1282 -1225 1212 475 -1110 724 269 -719 441 -325 -49 206 -719 707 378 -1073 651 180 -902
1299 -902 652 141 -512 504 -25 498 619 -163 1232 1044 -530 1448 433 -600 525 -255 -835
1316 -835 -368 -847 -300 -165 -988 141 -115 -1031 905 306 -798 1074 2 -340 245 -124 8 30 -390
$$ packed form
1197a105M71K859k931k207N432p93m225L535R82l691R14K034l49j909M48K514
1213A979k300k066L988o88k986L243N94k489N57Q61l7j208o10K531j893k143L101
1230D34o46k438K484Q28j389O85J74O79r60q07K764j489k038K975o03k065K250
1247H38l7p90R7j18Q58j114q09K372j189j598K475l99j697J662J21n96N96m13
1265B59J170q56j308J775j055j534J830o78j301J225k03K49L53q29J790n17j595
1282a225K437p37j585J834m55r88J160p66K76K55r25J426l29j451J724m71j082
1299i02J554n11o53J016n29N23J21p82J395j88j574J978j015j033J125p80n80
1316h35M67m79N47J35q23J129k56r16J936n99j104J872j072l42N85l69J32K2m20
$$ plain form
1335 -390 316 -362 -1000 972 -422 -838 986 -320 -496 606 -262 91 401 44 863 17 -4 1431
1353 1431 -292 -519 1368 10 -790 498 -640 -593 -115 -580 -121 -795 -365 981 -755 -564 1306
1370 1306 -577 -514 1075 -390 -162 612 329 65 -355 50 575 -1227 -375 689 -947 -395 816 -799
1388 -799 -267 621 198 -51 -215 417 592 -534 126 1064 -782 510 889 -1296 21 510 -645 -266
1406 -266 122 -162 14 -610 -52 -71 -949 635 617 -1163 850 1086 -488 361 783 -120 344 427 61 -306
1426 -306 -634 749 -646 -1752 961 472 -1786 286 380 -797 535 1050 140 -686 -44 814 -1115
1443 -1115 -1252 1784 288 -1436 1514 171 -1950 415 837 -529 -862 1129 1332 -1679 -1087 1930
1459 1930 -111 -926 2610 755 -1348 1030 1574 -1324 -685 1806 1032 -2001 -1070 1373 -2003 -1635
$$ packed form
1335c90P06o78o38J972j394m16J824j306j76J102q68L53L10l57Q19q46k1J435
1353A431j723k27J887j358q00J288j138M7M78m65M59o74M30J346j736J91J870
1370A306j883O3J589j465K28P74k83k64m20M05N25j802Q52J064j636N52J211j615
1388g99N32Q88m23k49j64O32J75j126O60R38j846J292L79k185J317M89j155L79
1406b66L88k84J76o24N58j9q78J584j8j780K013K36j574Q49M22r03M64Q3l66l67
1426c06l28J383j395j106K713m89k258K072R4j177J332N15r10q26O42Q58j929
1443a115j37L036j496j724K950j343k121K365M22j366l33J991K03l011N92L017
1459A930k041q15L536j855k103K378N44k898O39K491p74l033R31K443l376L68
$$ plain form
1475 -1635 2432 27 -1651 1414 999 -2377 -1186 1561 781 -1404 752 2013 -1982 -1646 2017 -951
1491 -951 -1366 2628 1803 -1710 -967 1020 -181 -1893 1130 2264 -1633 -635 1734 -1367 -1494 2537
1507 2537 1545 -914 156 1185 -955 -2510 553 1616 -1414 129 1401 -1942 -2315 755 360 -726
1523 -726 696 1717 57 -1783 -308 333 -1698 456 2393 -465 -702 982 -161 -1097 215 1626
1539 1626 1045 -495 130 662 -1473 -500 1330 -275 -324 668 -211 -1141 -655 361 1035 -209 412 1178
1557 1178 -1016 -1493 133 -647 -412 969 712 -102 -1371 -582 546 -1110 -398 1654 238 -755 612
1574 612 11 -641 -56 880 781 -878 418 1545 -1187 -936 1435 59 -1157 623 465 -1016 -1081 647
1592 647 617 -1123 824 1736 -1438 -1038 1502 -315 -970 1195 1552 -806 -943 667 -357 -2061 320
$$ packed form
1475a635M067k405j678L065m15l376J191K747p80k185K156J261l995L36L663k968
1491i51m15L994q25l513P43J987j201j712L023J134l897R98K369l101j27M031
1507B537r92k459J070J029k140j555L063J063l030J543J272l343l73L070l95j086
1523g26J422J021j660j840J475O41k031K154J937k858k37J684j143r36J312J411
1539A626n81j540O25N32k135R73J830j605m9R92q79r30M86J016O74j244O21P66
1557A178k194m77J626p80K35J381k57q14j269P89J128j656P12K052j416r93J367
1574F12o01o52N85R36r9j659J296J127k732K51K371j376j216J780j58j481o5J728
1592F47l0j740J947R12l174M00K540j817o55K165L57k358j37J610j024j704K381
$$ plain form
1609 320 1967 -1265 -885 1889 -554 -1797 564 893 -943 -318 1551 529 -1681 710 1782 -1593
1625 -1593 -778 2095 -442 -1466 784 707 -785 -605 1478 288 -1627 361 1392 -1266 -325 2162
1641 2162 67 -898 1010 306 -1076 -990 1309 503 -1439 718 1357 -1657 -876 793 -918 -988 599
1658 599 546 -650 -607 999 211 -1261 679 1238 -1266 -311 1136 -570 -815 711 218 -759 -516 671
1676 671 343 -1252 817 1369 -699 106 1317 -554 -774 272 393 -326 -91 666 603 -1135 147 645
1694 645 -1156 -416 747 -267 -489 118 95 -377 -655 395 124 -825 492 923 -496 53 777 -242
1712 -242 -428 -86 158 -220 -745 550 714 -616 383 754 -840 -219 497 -35 -245 98 460 72 -503
1731 -503 72 176 -852 239 1104 -24 160 633 -9 -79 8 118 -114 -745 -48 255 -999 -20 559
$$ packed form
1609C20J647l232L80K774k443j243K361L29j836O25J869j022k210K391J072l375
1625a593Q15K873k537j024K250p7j492J80K083j190j915J988J031k658R41K487
1641B162k095r65J908p04j382Q6K299q06j942K157O39l014P81J669j711p0J587
1658E99n3j196M3J606p88j472J940N59k504R55J447j706k45J526m93r77K43J187
1676F71l28j595K069N52k068Q05J211j871k20J046J21p19K35P57o3j738J282M98
1694F45j801P40J163j014k22O07k3m72k78J050k71r49J317M31j419N49P24j019
1712b42j86L42K44l78n25J295J64j330R99L71j594O21P16n32k10L43L62l88n75
1731e03N75J04j028J091Q65j128J84M73o42p0Q7J10k32o31O97L03j254R79N79
$$ plain form
1750 559 -506 -98 288 40 19 173 679 458 -362 120 339 -1083 -193 296 -725 16 48 -144 -77 -378
1770 -378 12 22 -798 144 666 -345 226 461 -56 -93 214 174 103 -129 457 181 -687 168 91 -721 -134
1791 -134 66 -332 190 176 318 545 140 244 182 -435 54 -254 -727 149 -64 -426 -4 6 -374 -202 -227
1812 -227 253 212 -331 625 321 -307 147 -39 -405 -105 73 53 162 -156 251 242 -236 221 -117 -479 513
1833 513 -82 -459 450 88 -508 76 -259 -94 -41 60 465 22 -174 598 -450 -278 413 -181 -305 214
1853 214 -111 -11 -118 -129 -4 -193 -182 486 -375 1 918 -107 -393 260 -246 -538 -103 -185 272 -295 84
1874 84 400 -465 221 657 -227 -285 378 -439 -100 420 -63 -156 -452 301 204 -448 164 615 -388 -2 634
1895 634 -339 38 278 -150 -212 278 375 -118 -168 400 218 -806 222 219 -658 -196 504 -415 -148 284 73
$$ packed form
1750E59j065M08L86k48k1J54N06k21q20M82K19j422Q90M89j021P41L2j92O7l01
1770c78L90J0q20R42N22j011N71K35n17l7L07m0p1k32N86k76q68Q55p7q12N87
1791a34K00l98N22j4J42K27m05J04o2o17M89l08m73Q76k13l62M22J0l80J72k5
1812b27M80m1n43R56l04o28M54j86l66L00J78k0J09l18M07rm78M57l38l62R92
1833E13n95l77R09l62n96N84l35J65N3J01M05m43j96P72j048J72O91n94j24N19
1853B14l25J00j07j1J25j89J1O68q61L76R17j025k86O53n06k92M35q2M57n67L79
1874H4L16q65O86M36q84n8O63q17L39N20m83r3k96P53r7o52O12M51j003L86O36
1895F34r73L77K40m28o2M90R7m93n0N68j82j024J028lq77M62P00r19K67M32k11
$$ plain form
1916 73 -140 -239 475 42 -180 931 317 -787 39 309 -784 -237 -38 -360 -303 -2 356 -117 -310 1086
1936 1086 148 -413 1149 552 -783 97 566 -492 -423 161 -14 -491 -82 744 -365 -563 906 336
1954 336 -624 608 698 -542 -274 326 143 -366 49 941 -474 -623 537 -417 -904 453 359 -448 -119
1973 -119 573 78 -474 407 977 -586 -289 878 -424 -760 303 87 -683 181 141 -373 -559 274 473
1992 473 -430 247 916 -441 -413 599 -285 -558 307 148 15 -405 123 216 -360 -104 779 -218 -95 619
2012 619 -265 -291 430 -7 -102 -110 51 27 -216 -60 429 -96 85 470 -208 -229 38 -149 287 238 98 284
2034 284 -60 -467 -164 -112 -303 -101 16 85 -240 -435 188 -246 -191 454 209 -238 435 251 -5 67 160 466
2056 466 -307 -504 219 -623 -676 696 58 -245 290 270 -130 -136 176 329 -147 17 912 -524 -334 595 -278
$$ packed form
1916G3k13r9P14m33k22J111o14j104Q26K70j093N47J99l22N7L01L58m73j93J396
1936A086r38n61J562n97j335Q80M69j058O9N84j75m77M09Q26j109j98J469n70
1954C36r60J232R0j240K68O00j83n09M15Q92j415j49J160r54m87J357r4q07L29
1973a19O92m95n52Q81N70j563K97J167j302l36J063k16p70Q64m0n14j86Q33J99
1992D73r03O77O69j357K8J012q84k73Q65j59j33m20N28R3n76K56Q83r97J23P14
2012F19q84k6P21m37r5qJ61k4k43J56M89n25J81L85o78k1K67j87M36m9j40J86
2034B84l44m07L03N2j91K02J17O9l25j95O23m34N5O45k45m47O73j84k56P2R3L06
2056D66p73j97P23q42n3J372o38l03N35k0m00oL12J53m76J64Q95j436J90R29q73
$$ plain form
2077 -278 -679 578 533 -44 -144 83 322 -633 -251 472 -598 -681 332 -149 -552 363 248 -113 -23 450
2097 450 201 -671 -70 648 -701 -414 438 -396 -790 151 184 -352 -130 750 752 -227 253 576 -710 -135
2117 -135 859 97 -359 416 208 -123 -287 212 -27 -683 89 601 -399 -447 650 -448 -454 266 287 -184
2137 -184 -316 68 146 -357 255 570 -388 -515 174 -686 -544 124 428 80 162 409 189 -542 135 865 -56
2158 -56 333 858 48 -243 131 -178 -222 -1 121 181 -450 99 594 -244 72 660 -6 -161 23 -181 -362
2179 -362 -21 193 71 -595 -304 -101 -566 -315 548 40 236 21 -67 -449 -380 -136 88 -221 179 547 -365
2200 -365 -101 274 -67 -114 110 176 414 -210 276 269 -144 -15 488 -140 -225 161 -82 150 -4 -26 138 -365
2222 -365 -105 47 -523 -67 544 175 -53 228 -9 -243 -181 147 211 -65 126 242 -603 19 155 -277 -188
$$ packed form
2077b78m01J257m5n77j00K27K39r55L82P23j070q3J013m81m03R15j15l61R0M73
2097D50k49q72O01P18j349K87Q52q34l94R41L3n36K22Q80Kr79M80L23j286N75
2117a35R94p62m56P75k08l31j64M99k39o56P72N12j000m8J097j098oP20K1m71
2137a84j32L84P8n03O12L15r58j27O89q60J42O68L04l48Q2K47k20p31O77P30r21
2158e6L89N25q10k91L74l09m4K21J22O0o31N49M95q38L16N88o66j55J84k04j81
2179c62L41K14j22o66K91K03m65K51Q63n08J96k15q8l82O9K44K24l09M00L68r12
2200c65K64L75l41m7K24O6K38o24M86pm13J29N03o28q5L86k43K32j54k2J64n03
2222c65K60J52n70M56O11l69k28K81k37k34O2L28O4k76J91J16q45O22J36m32Q9
$$ plain form
2243 -188 64 6 81 74 174 384 5 393 182 -318 -202 369 -443 -86 164 -70 -18 -406 -46 -52 -410 209
2265 209 275 -449 239 196 -215 -196 -163 108 129 78 376 105 55 57 75 -480 -69 -34 -503 -64 248 -235 48 -176
2289 -176 -88 29 -470 98 280 -80 510 10 70 -4 -15 -107 -168 -180 -34 211 96 175 -41 -298 196 -58 -364
2312 -364 251 68 54 233 34 68 156 -76 -89 -375 -167 -43 -137 -379 144 119 -405 113 -101 -109 166 113 304
2335 304 105 163 247 -83 -336 371 -168 -212 316 -101 12 228 -290 -33 -183 98 -41 -195 130 381 -146
2356 -146 -336 206 -280 -354 174 23 -54 346 10 96 -65 -93 236 -307 106 287 72 87 527 39 -140 145
2378 145 -140 -291 -282 182 267 -237 11 200 -586 -36 298 -181 -65 229 115 68 -95 -9 -402 -384 112 -39
2400 -39 -451 66 304 -276 6 253 -117 -172 186 489 59 171 291 -201 -395 98 106 -546 -19 9 -61 374
$$ packed form
2243a88K52n8P5pJ00K10l79L88k11n00J16N71q12L57K50k34N2l88L60ol58O19
2265B09O6p24O88m3m11J9L3K71K1n1K98k71n0KJ8n55M11L5m69M39L12m83K83k24
2289a76Q8J17m99N68J82l60N90n00O0p4j1r2o1j2J46K45j15P9k16k57M94k54l06
2312c64O15j83j4J79j99L4Q8k32j3k86K08J24r4k42N23k5n24N18k14qK75n3J91
2335C04j99N8Q4l30k53P07n39m4N28m17J13K16n18K57j50K81j39j54L25K51n27
2356a46j90N42m86p4N28j51p7M00l36Q6j61k8L29n43M13J81k15J5M40m88j79K85
2378A45k85j51RM64Q5n04K48J89p86N50L34m79J16K94j14m7j63Q6l93J8M96j51
2400c9m12N17K38n80K82K47l70n5L58L03m30J12J20m92j94M93Qo52N27K8p0M35
$$ plain form
2422 374 116 117 -142 50 144 -214 -97 89 64 -293 310 209 -483 -138 3 -46 53 -59 201 -129 -142 215
2444 215 -75 -439 328 -103 -330 140 51 176 53 -61 -33 -303 -150 36 -239 -353 468 -116 -266 150 -239
2465 -239 -159 -99 63 94 38 81 355 -279 -423 47 -370 -300 291 -181 5 253 -30 24 -233 36 91 -184 19
2488 19 225 -160 -5 90 -158 -54 206 -125 172 91 7 315 -150 220 111 -494 37 107 -368 -11 172 15
2510 15 202 154 90 81 -3 -15 340 -51 6 132 -182 67 85 -404 128 -76 48 234 -167 174 -24 47 62 -101
2534 -101 -84 266 -88 -81 277 75 -161 297 268 -167 204 -90 221 3 103 479 -265 -426 174 -70 -380
2555 -380 143 184 82 58 36 115 -204 -144 293 -143 -118 341 163 -256 379 73 -83 199 33 -27 -397 -393 5
2578 5 -5 -296 451 -205 -202 104 29 8 122 171 313 -18 103 357 -240 -162 294 29 -83 49 15 -289 -278 -115
$$ packed form
2422C74k58Jk59J92R4l58J17J86k5l57O03j01o92L45J41m9R9j12K60l30j3L57
2444B15k90l64P67m31k27M70q9J25j23j14K8k70J53J86k75j14Q21n84j50M16l89
2465b39Q0O0J62L1n6M3K74o34j44M70m17P0N91m72J86K48k83N4k57K69N5k75K03
2488A9K06l85J55R5k48J04K60l31K97q1q4L08m65L70j09o05N31P0m75L57J83j57
2510A5J87m8o4rq4j2L55l91N7J26l14K49J8m89N32k04J24J86m01L41j98P1J5j63
2534a01J7L50l54PL58k02k36M58k9m35L71k94L11k18J00L76p44j61O00k44l10
2555c80N23M1j02k4k2P9l19O0M37m36K5M59j78m19O35l06j56K82j66o0l70ML98
2578Ej0k91P47o56LL06p5k1J14M9J42l31J21K54n97P8M56k65j12J32l4l04J1J63
$$ plain form
2602 -115 -91 -61 107 250 -239 43 111 -231 -7 282 147 -290 -14 -156 -210 -238 -71 332 50 -1 97 -287
2624 -287 15 263 184 -16 53 -21 -27 -101 -174 345 81 296 297 -78 -160 -77 -126 236 -34 202 350 -82 -157 32
2648 32 -25 17 481 -34 -212 -17 -270 3 -4 -37 -8 -72 28 -48 -172 -69 219 198 40 68 -1 47 -92 -43 291
2673 291 -14 -21 224 -326 -11 15 56 -45 95 -203 97 29 -213 208 30 125 159 -99 21 -23 -66 106 32
2696 32 50 72 -110 -206 296 -119 -107 129 120 56 40 40 -308 -105 99 -181 -329 -173 -19 -186 -72 439 -24 -24
2720 -24 -25 -22 -130 11 -45 -119 105 81 87 107 -282 -43 -165 -63 23 -74 -96 -101 83 26 -168 -41 256 -280 88 191
2746 191 -188 25 308 128 183 110 129 -187 -209 -122 110 -26 -65 137 -399 5 -51 -76 119 39 138 -9 -130
2769 -130 42 -109 -97 183 202 -50 119 3 -58 -71 121 -168 -58 85 30 -81 3 32 123 -116 86 -27 40
$$ packed form
2602a15K4L0J68J43m89K82O8l42K24K89j35m37K76j42n4k8J67M03k82n1R8l84
2624b87L02K48p9k00O9p4op4p3N19k64K15Jl75q2Q3m9L62k70K36J48m32p5J89
2648C2n7M2M64n15j78J95k53K73pl3K9o4J00p6j24J03K88k1j58K8o9M8j39M9L34
2673B91l05pK45n50L15K6M1j01J40k98L00o8k42M21j78R5L4k58J20m4m3J72p4
2696C2J8K2j82r6N02m15J2K36ro4j6%l48K03K04k80j48J56J54j67J14N11m63%
2720b4jLj08J41n6p4K24k4OK0l89K39j22J02Q6r7k2nJ84n7j94J27K97n36L68J03
2746A91l79K13K83j80N5p3J9l16k2Q7K32j36l9K02n36M04n6k5J95q0R9j47j21
2769a30J72j51J2K80J9k52J69j16o1j3J92k89J10J43n5j11Q4K9R1k39K02j13O7
$$ plain form
2792 40 185 -23 -106 34 -38 54 -240 -231 113 -55 -9 110 -175 72 348 -83 22 -28 -210 133 480 -62 116
2815 116 -64 -167 56 161 -12 250 -127 -135 -47 -140 -174 154 263 186 -114 -231 88 -119 -233 186 -74 -189
2837 -189 254 -125 -106 -5 -80 -120 -188 84 86 -149 1 54 -212 -161 23 -77 -194 273 24 64 202 -46 201
2860 201 -270 120 313 -273 -146 495 33 -43 -59 138 50 -146 -67 95 -201 338 241 -177 166 -15 -234 -2
2882 -2 113 27 66 9 -86 32 -118 -20 -58 -252 207 254 -302 112 21 -366 -260 53 125 -67 -77 248 -179 -301
2906 -301 112 108 -186 82 -153 -281 85 9 -62 22 -21 319 -33 50 274 69 -273 64 148 -257 82 135 -77
2929 -77 -26 -75 -11 -171 -176 96 -101 -141 124 345 -421 133 -105 -170 261 -55 76 95 203 87 -59 20 -66 -132
2953 -132 -148 252 -146 4 103 -45 8 -229 117 107 -191 77 193 -220 44 165 -11 3 10 81 -281 -240 14
$$ packed form
2792D0J45k08q3J40p2R2k94RL44j68M6J19k85K47K76m31J05n0j82L43L47n42J78
2815A16j80j03K23J05j73K62l77qQ8r3l4L28J09p7l00j17L19k07j14M19k60j15
2837a89M43l79J9J01p5m0o8K72Kk35J50N3k66N1J84j00j17M67k49M0J38k48K47
2860B01m71L90J93n86J27O41m62p6j6J97q8j96P9J62k96N39r7m18L43j81k19K32
2882bJ15q6L9n7r5J18j50R8l8j94M59M7n56M14r1l87J06L13P2j92j0L25m27j22
2906c01M13mk94K68k35j28L66p6p1Q4m3L40l52Q3K24k05l42L37Q4m05L39N3k12
2929g7N1m9O4j60nK72j97m0K65K21p66N54k38o5M31l16J31J9J08j16j46P9q6o6
2953a32j6M00l98J50R9j48N3k37L46j0k98K68J16m13K64J21j76J4PP1l62M1K54
$$ plain form
2976 14 -76 -139 35 -41 5 44 -130 -262 -23 265 89 -113 242 -82 -20 -57 82 53 24 153 184 -168 -175 -150 25
3001 25 179 84 -162 82 91 13 175 -64 183 152 -45 80 159 -231 149 93 164 118 252 -4 190 -300 78
3024 78 -101 -121 84 8 -50 55 135 -106 -61 2 238 99 53 -14 -59 88 299 91 -158 217 -195 -52 187
3047 187 -123 -51 165 109 -39 -121 -74 -56 -74 174 172 -68 -149 88 -327 23 132 -315 38 -25 -77 27 -73 -163
3071 -163 309 -34 -209 278 -34 -162 -26 -30 -196 110 242 335 -89 -31 75 -97 -54 40 -144 -41 -86 -101 8
3094 8 -140 -162 -168 -37 -75 5 -221 -77 161 -81 -10 213 -58 -6 -55 32 125 168 -116 307 -168 -53 -48 -64 -59 291
3120 291 -99 216 59 -28 46 -124 -10 61 37 -22 72 -87 -146 65 138 11 -41 -161 98 -255 -257 -31 132 170
3144 170 34 -55 141 26 -130 -61 148 -9 177 -342 -17 373 17 -88 74 -112 75 -138 -118 -2 -185
$$ packed form
2976A4r0o3J74p6M6L9j74j32K39K88j76k02L55l24O2l7J39k9k9J29L1l52pK5J75
3001B5J54r5k46K44Rp8J62k39K47l1j97J25P9l90L80n6P1m6J34k56J94m90L78
3024G8j79k0K05p6n8J05Q0k41M5O3K36j39m6o7m5J47K11k08k49L75m12J43K39
3047A87l10P2K16n6j48q2M7J8j8K48kk40q1K37m15L50J09m47L53o3n2J04j00r0
3071a63M72l43j75M87l12j28J36mj66L06J32R3m24N8J06j72M3R4j84J03m5j5J09
3094Hj48k2oJ31l8Q0k26J44K38k42P1K23k71N2m9Q7R3M3k84M23m75J15Nj6NL50
3120B91l90L15j57q7P4j70J14P1k4n9R4j59n9K11P3j27n2j20K59l53kK26J63L8
3144A70j36q9J96j15j56O9K09j57J86n19L25L90l56j05J62j86J87k13K0J16j83
$$ plain form
3165 -185 -150 361 114 127 206 -192 -294 45 -109 -37 -143 -94 68 -108 -120 -50 67 -36 166 -23 228 -156
3187 -156 8 405 57 63 216 0 179 -70 94 -127 96 -10 -50 169 -273 -100 115 -70 -60 75 33 -8
3209 -8 -127 -14 365 -29 -155 216 -158 60 -110 -45 -17 -63 2 69 -74 26 -13 157 149 15 -69 87 -108 16
3233 16 22 -39 0 37 -66 -13 22 -59 -84 195 122 2 -13 -131 104 -155 67 110 -128 -126 34 -226 9 25 -336
3258 -336 -85 77 58 125 -37 152 -52 -145 178 83 -117 175 -44 -70 -7 -155 -140 116 49 33 -120 46 294
3281 294 118 -156 113 -94 -171 85 158 -86 -178 -101 36 -49 165 179 -118 -23 52 -33 -51 194 -73 -20 -62 -4
3305 -4 237 -133 -50 39 -27 23 315 118 -157 58 36 -59 -262 151 154 14 65 236 94 55 62 -102 39 85 -72
3330 -72 -16 199 -96 -147 64 24 103 -42 89 79 -31 -163 76 -180 -74 217 -232 90 220 55 -8 -78 67
$$ packed form
3165a85L5N11k47J3P9l98j02L39j54P2j06M9J62j76j2P0J17j03K02j89K51l84
3187a56J64L97l48OJ53k16J79k49J64k21K23j06m0K19m42J73K15j85J0J35m2m1
3209hj19J13L79l94j26L71l74K18j70O5K8m6O5O7j43J00l9J70qj34q4J56j95J24
3233A6Oo1L9L7j03N3L5q1k5K79p3j20j5j18K35k59K22M3k38KJ60k60K35J6l61
3258c36K51J62j9O7j62J89k04r3L23r5k00K92k19k6O3j48J5K56o7j6j53J66K48
3281B94j76k74K69k07p7K56P3k44r2P7J37q5K14J4k97R5P5q5j8K45k67N3m2N8
3305dK41l70Q3Q9o6N0K92j97k75K15k2r5k03M13Lj40N1J71j42l9Pj64J41M6j57
3330g2N6K15k95n1K11m0P9j45J31j0j10j32K39k56J06K91m49L22J30j65o3p0J45
$$ plain form
3353 67 179 -15 114 139 -133 -234 -64 -9 12 -37 0 -18 82 12 231 -213 67 197 -278 137 203 -76 60
3376 60 163 -98 171 -27 -109 74 -316 230 -2 -285 -67 198 -57 227 139 -106 20 -16 105 154 -20 158
3398 158 10 120 265 27 -127 -80 75 -257 -44 -86 -53 180 86 45 -202 -117 -51 41 -23 108 23 0 85 86 -24
3423 -24 78 -45 29 124 47 245 -133 -183 160 -59 -218 81 -109 -120 173 190 -15 32 25 209 -14 -130 528
3446 528 -175 -42 109 -79 -114 -76 16 -104 31 169 -90 -70 116 98 -205 -121 107 -164 -73 44 21 -26 -1
3469 -1 67 -96 -93 197 194 -224 -126 1 -95 -71 58 92 -29 143 144 -177 44 19 -59 59 382 59 -113 111 156
3494 156 -226 6 141 -160 271 -15 92 102 2 161 16 -75 126 65 -126 23 148 -119 26 -163 31
3515 31 -47 -64 18 -100 -87 151 -57 -174 137 191 1 155 29 -90 150 -37 133 -39 -274 332 -84 -11
$$ packed form
3353F7J12j94J29K5k72j01J70N5K1m9L7j8J00p0K19m44K80J30m75M15O6k79J36
3376F0J03k61K69j98q2J83l90N46k32k83K18K65k55K84q8k45J26l6J21M9j74J78
3398A58j48J10J45k38j54M7J55l32K13m2L3K33r4m1k47Q5O6R2o4J31q5k3Q5Jj10
3423b4J02j23P4R5p7J98l78n0L43k19j59K99j90j1K93J7k05M7pJ84k23j16O58
3446E28p03J33J51j88l5L8R2j20J35J38k59K0J86j8l03Q4K28k71R1J17k3m7K5
3469aO8j63LK90lm18R8J27r6K4J29L4j21J72Jl21K21k5p8J18L23l23j72K24M5
3494A56l82K32J35l01M31k86J07J0j00J59j45r1K01o1j91J49J25k67J45j89J94
3515C1p8j7Q2j18J3K38k08j17L11N4j90J54j26j19K40j87J70j72k35O06m16P3
$$ plain form
3537 -11 39 -104 -120 171 26 -56 -26 -114 172 -64 -129 -126 -32 -28 127 103 1 36 -28 -22 40 -94 -127 121 -204 -24
3563 -24 -209 210 24 361 137 339 88 -90 125 5 58 315 91 30 -127 -57 -118 82 -9 361 -20 -116
3585 -116 71 -218 85 -16 86 16 -122 -213 86 -33 226 188 -162 -14 75 -61 -25 93 -174 328 116 121
3607 121 -31 -291 -73 -47 -188 -169 169 128 0 -51 -258 -302 90 29 67 -155 -76 174 -198 -113 92 -181 139
3630 139 -423 -7 43 71 171 186 -209 -34 243 -248 96 113 95 119 6 84 -35 -72 72 -7 -103 -54 242 -170
3654 -170 -96 -83 -76 -94 -48 12 -178 -154 -154 -23 -57 58 120 -103 95 -109 -112 -190 36 189 40 -213 64 47 -208
3679 -208 174 -130 -125 27 -4 -67 -87 -76 -24 -21 77 -7 194 -230 -84 263 -81 23 -153 -114 48 12 -37 -112 120
3704 120 10 45 98 -45 6 44 40 197 180 96 -86 -165 -6 -14 -189 166 -108 -77 -72 -174 101 -102 51 193 -26
$$ packed form
3537a1N0j43j6K91j45q2L0q8K86k36o5LR4MJ55k4j02L5o4OO2j34l3K48l25J80
3563b4j85M19j86L37k24K02k51j78K15j20N3K57k24o1j57P0o1K00r1L70l81r6
3585a16J87k89L03j01J02p0j38r1K99j19K59l8l50J48Q9j36L6J18k67N02k12N
3607A21j52k60K18K6j41J9L38m1j28n1k07m4L92o1L8k22P9K50l72Q5K05k73L20
3630A39n62M16N0K8J00J5l95J75K77m91L44J7j8K4j13P8j19l7J44p9r6M9K96m12
3654a70P4J3Pj8M6O0j90K4%J31l4J15O2k23J98k04lp8K26J53j49k53K77j7k55
3679b08L82l04NJ52l1o3k0J1N2LR8q4K01m24J46L47l44J04j76L9J62l6m9p5K32
3704A20j10L5N3j43N1L8mJ57j7q4j82p9J59qj75L55k74L1Nj02K75k03J53J42k19
$$ plain form
3729 -26 -79 86 -129 140 20 -76 -58 -29 245 28 -98 62 43 -160 -145 117 -67 -13 5 -219 155 142 -83
3752 -83 -54 -64 174 -71 -3 147 180 -144 162 -81 -250 -33 77 137 56 47 103 232 193 -43 49 -45 75 244
3776 244 77 127 -35 -174 174 -14 122 97 135 73 134 -92 -51 -4 -260 -43 15 4 75 -86 168 190 -40 216
3800 216 -114 23 88 -24 -2 -28 -195 -97 22 143 13 -26 11 131 -4 -67 -153 -187 28 -13 206 5 349
3823 349 -35 51 99 -50 102 -18 -78 -100 -220 -94 61 -138 -235 175 -103 3 96 86 -129 -28 53 -57 -90
3846 -90 79 144 -127 -65 -72 -56 6 18 96 74 57 -139 46 -2 53 64 46 25 275 1 22 122 158 40 -10 -165
3872 -165 -191 133 32 226 23 -13 84 -159 64 -126 -84 183 -147 -49 42 -75 124 211 -196 251 20 -191
3894 -191 272 64 -236 22 157 -123 269 69 -100 -143 -160 107 308 -29 139 283 -45 -16 24 167 -91
$$ packed form
3729b6n3J65k15K69j20r6J8K9K74k17j26J60j9k03J5K62j84N4J8k24L74j3k25
3752h3K9j0K38k45O8J50L3l24L06k43j69K17J10O0q1rN6J29l9k36R2r4J20J69
3776B44j67N0j62j39L48j88J36k5L8o2O1k26M1M7k56K17N8j1P1j61K54K2k30K56
3800B16l30J37O5j12K2k6j67R8J19J21j30l9L7J20j35o3q6l4K15m1K19k01L44
3823C49l84Q6M8j49J52j20o0k2j20J26J55j99r7M10k78J06R3j0k15J01Q1j10l3
3846i0J69O5k71O2pJ6O2J2P8k2j7j96J85m8N5J1j8k1K50k74K1J00L6j18n0j55
3872a65k6L24j01J94k03l6R7k43K23j90M2K67l30R8R1j17J99Q7m07M47k31k11
3894a91M63k08l00K58J35k80L92k00j69m3j7K67K01l37J68J44l28K9M0J43k58
$$ plain form
3915 -91 -149 64 226 -222 125 29 63 67 -55 21 2 -84 -1 -101 84 71 47 125 139 -50 33 198 155 -8 24 -78
3941 -78 -241 44 -81 -144 -122 -84 84 -74 -15 143 -260 24 37 79 -4 61 159 -11 21 42 -72 -26 -99 -8 0 -46
3967 -46 243 58 19 138 52 60 210 197 116 -250 54 -87 -42 -131 18 33 -24 161 -156 -123 -118 -152 47 79 -169
3992 -169 23 -22 96 110 24 197 62 -23 -129 -103 -38 52 -47 -49 -149 -22 142 -158 2 6 191 -194 107 88
4016 88 -294 86 68 49 6 297 338 2 -112 161 36 -228 -52 -47 55 -140 66 -228 -111 221 49 102 20
4039 20 27 -153 208 242 31 -95 122 -240 99 -99 -51 -196 70 -124 48 -164 -50 -1 -210 38 114 114 19
4062 19 45 -62 -19 113 186 20 180 15 228 -192 -142 -90 -8 -70 -66 189 -164 -20 -14 -23 147 8 -60 -114 135
4087 135 128 224 -47 -4 -61 -47 -96 66 12 -382 -29 -135 -14 -141 -111 89 -82 -89 -108 59 40 -18 95 -77 -160
$$ packed form
3915i1n8K13J62m48L47r6L4Mj22P6j9q6Q3j00J85j3k4P8J4j89Q3J65m3j63L2j02
3941g8j63K85j25o3K2L8J68j58N9J58m03K84J3M2q3O5R8j70L2K1j14M6p3R1Qm6
3967d6K89j85l9J19q6QJ50j3q1l66L04j41M5q9J49J5n7J85l17L3Nl4J99L2k48
3992a69J92m5J18J4q6J73j35q5j06K6O5R0r9kj00J27J64l00J60MJ85l85L01j9
4016H8l82L80j8j9m3K91M1l36j14K73j25k64J76NJ02j95K06k94J17L32j72N3q2
4039B0Pj80L61L4k11j26K17l62L39j98M8j45K66j94J72k12J14M9k09K48P6%r5
4062A9K6j07M3J32P3j66J60j65K13m20N0N2Q2o2MK55l53J44OrJ70j39o8n4K49
4087A35pR6k71M3n7J4m9J62n4l94L53j06J21j27L0K00j71pj9J67j9n8J13j72q3
$$ plain form
4112 -160 45 -93 74 78 -319 -140 175 27 -43 -110 100 251 -32 -100 30 93 -164 176 62 32 36 12 -244
4135 -244 74 -175 -233 26 -13 171 -64 -122 214 -105 -198 112 14 -114 5 147 120 5 -86 -111 92 -199 -126
4158 -126 -54 -80 79 142 126 -127 -75 -151 -219 28 28 -21 112 -66 -22 -17 129 159 43 -330 -164 43 178 225 -75
4183 -75 176 -283 -186 106 -78 -46 140 56 46 -24 101 -122 -100 30 152 -22 -55 -33 -273 29 47 23 -38 -103
4207 -103 220 -260 41 65 -52 -142 -38 98 -91 68 -154 92 -59 54 78 -170 -10 -137 -224 -132 -73 17
4229 17 -6 -154 68 253 37 175 7 -280 -114 -43 -7 56 366 169 117 45 245 165 -72 -3 -50 -22 -74 139
4253 139 86 -96 2 -211 -120 -17 -34 65 76 14 -115 -191 185 55 -86 -84 -239 -26 -3 -83 -35 -179 -40 -190
4277 -190 -193 14 -56 14 -189 39 140 79 -123 -29 95 -103 -34 70 -46 -10 -68 176 -113 -36 -89 50 -116 -113
$$ packed form
4112a60K05j38J67Ml97J79L15j48p0o7K10J51k83o8J30O3k57L40j14l0Mk4k56
4135b44L18k49n8K59l9J84k35n8L36l19r3L10r8j28J19J42k7j15r1k5K03k91P3
4158a26P2k6J59O3j6k53N2p6o8K47%m9J33j78M4NJ46L0j16l73J66K07J35M7l00
4183g5K51m59R7K92j84L2J86q4j0p0J25k23K2J30J22j74l3K2k40L02J8k4o1o5
4207a03L23m80L01K4j17r0J04J36j89J59k22K46j51J13K4k48J60j27q7R2N9R0
4229A7k3j48K22J85k16J38j68k87J66P1L6O3L10j97n2p2K00q0k37O9m7K8n2K13
4253A39n3j82R8k13R1J03j7R9J1o2j29p6L76j30j41Kj55K13K3q0M8j44J39j50
4277a90lK07p0P0k03K28J01o1k02R4J24j98O9J04j16L6n8K44k89P7n3J39j66L
$$ plain form
4301 -113 3 164 10 95 61 -78 65 143 40 103 182 -53 124 -41 -146 125 -52 -40 82 -95 -163 -43
4323 -43 101 -87 154 68 121 2 -167 68 -125 -3 30 22 -31 61 -198 141 -34 -120 141 -66 -67 -44 112 91
4347 91 9 68 -234 1 -86 -109 -290 7 230 -39 -137 41 6 -122 69 -117 72 111 16 -60 -231 12 124
4370 124 -324 -6 48 -127 -249 -21 -36 -137 20 -27 68 -55 -103 -37 -210 126 93 -89 31 -59 -126 -326 33
4393 33 -2 -5 46 -55 167 -93 37 81 7 -170 -45 121 106 -113 0 29 62 123 185 -27 72 124 69 -38 88
4418 88 -70 -95 59 -151 -61 -21 -149 77 -150 140 -49 139 -30 179 49 -67 -62 -60 279 6 -16 161 2
4441 2 -24 211 -19 20 46 257 18 -177 -109 80 175 62 -65 -37 19 37 -113 -49 184 308 44 -17 209 49
4465 49 75 47 38 32 14 10 -108 -21 44 68 81 42 -30 -130 90 23 -73 -150 222 113 -77 145 25 9 -149 99 -275
$$ packed form
4301a13J16J61j54Q5l4j39J43P8j03O3P9k35J77j65j05K71j77J2J22j77o8J20
4323d3J44j88K41q6N3j19j69K35j93J22L3qn3R2k59L39j75q6K61k07jK3J56k1
4347I1q2N9l02K35q7k3j81K97K23k69r8J78l5j28J91j86J89L9r5p6j71K43J12
4370A24m48L18N4j75j22K28j5j01J57m7R5j23m8O6j73L36l3j82J20r0o7k00L59
4393C3l5lN1j01K22k60J30M4p4j77J25J66j5k19J13K9L3O1O2k12R9N2n5j07J26
4418H8j58k5J54k10R0M0j28K26k27K90j89J88j69K09j30j16NKL39k73k2J77j59
4441Bk6K35k30L9K6K11k39j95O8J89R5j13j27K8N6J8j50O4K33J24k64o1K26j60
4465D9K6k8roj8mj18Q7O5K4J3l9p2j00K20o7r6p7L72j09j90K22j20j6j58K48l74
$$ plain form
4492 -275 -1 11 174 69 -30 72 75 -24 -125 -186 158 113 -188 23 17 2 -162 208 -7 76 130 -287 -214 155
4516 155 -82 -1 -97 -57 56 26 -75 -61 -167 -28 105 198 -108 21 -98 -32 -101 -17 38 -30 -68 135 -62 1
4540 1 99 -7 -202 1 -11 -116 -170 111 -131 -63 -212 165 -76 -8 -12 59 -176 -287 107 -10 162 116 170 -203
4564 -203 -36 228 38 55 -64 -31 3 16 72 87 -4 96 121 -111 48 122 -22 92 79 -109 97 104 -2 29
4588 29 -3 130 165 -158 27 138 -229 -21 119 136 115 -181 -33 70 25 -152 144 112 67 48 -3 -125 -104 60
4612 60 -185 -79 93 159 99 157 168 -26 -107 64 -109 -151 -186 78 -48 -137 62 154 107 -132 41 105 59 -16 -87
4637 -87 -242 -43 -225 -63 -48 -152 -118 -169 109 50 -87 184 2 -70 8 -301 60 185 -92 127 -74 1 -89
4660 -89 142 44 -117 -158 -277 -19 -50 103 -21 -79 -29 93 -98 82 64 123 -194 191 -21 -342 12 -100 126
$$ packed form
4492b75K74J2J63j05r9J02Lr9j01o1L44m5l01K11oj5j64L70k15Q3N4m17P3L69
4516A55k37Q1r6M0J13l0j01J4j06J39J33R3l06J29j19O6o9Q4N5o8l8K03j97O3
4540AR8j06j95K03j2j05n4K81k42O8j49L77k41O8mP1k35j11L94j17J72m6N4l73
4564b03J67K64j90J7j19L3L4J3N6J5r1J00K5k32J59P4j44J14j3j88K06Pj06L1
4588B9l2J33L5l23J85J11l67K08J40J7k1k96J48J03m5j77K96l2m5j9n1j22K1J64
4612F0k45J06J72O6o0N8J1j94q1J71j73m2l5K64j26q9J99R2m7k39J73O4m6p5p1
4637h7j55J99j82J62J5j04L4n1K78n9j37K71j82p2P8l09L61J25k77K19k01P5r0
4660h9K31r8j61m1j19K58l1J53j24n8N0J22j91J80j8N9l17L85k12l21L54j12K26
$$ plain form
4683 126 -165 4 -87 -99 60 -46 -108 -12 -53 -126 -5 -4 -64 -3 106 109 -25 -156 -35 -72 -64 51 23 3 -77 -35
4709 -35 159 69 -72 -163 -107 -282 -97 121 -129 -90 145 -132 110 -13 25 131 -318 -133 -93 -31 122 95 -197
4732 -197 -25 -61 159 -53 108 87 324 -54 33 -153 20 54 256 -58 66 1 -17 -58 -18 23 57 -91 -5 -42
4756 -42 -20 -46 71 72 -28 67 -57 -44 -165 112 90 164 -113 -100 179 -151 17 -168 -163 31 -184 34 -32 22 -240
4781 -240 -212 -33 120 145 -46 63 -103 -7 -201 -84 -20 -24 -35 23 76 114 73 -281 -140 -61 69 103 240 98
4805 98 -60 -14 -186 -42 15 -56 -29 -116 -212 82 74 129 -41 95 -13 -38 178 66 33 83 -22 -11 256 -86 -34
4830 -34 197 -41 70 -306 180 -2 -76 -174 6 -180 67 86 -74 101 199 189 -19 21 -57 -218 11 -198 -96
4853 -96 108 76 125 116 -235 -215 77 120 106 131 -194 -165 -187 -94 -46 -152 129 128 -270 47 -40 -163 110 135 116 41
$$ packed form
4683A26k91J69r1j2J59j06o2R6m1p3J21Jo0O1J09Lj34j31J21l7QJ15k8k0q0M2
4709c5J94r0j41r1N6j75J85K18k50L9K35k77K42j23L8J06m49J85M0O2J53k7k92
4732a97J72l6K20k12J61k1K37l78Q7j86J73L4K02l14J24o5j8m1M0M1L4j48Q6l7
4756d2K2k6J17Jj00R5j24J3j21K77k2P4k77J3K79l30J68j85NJ94k15K18o6N4k62
4781b40K8J79J53K5j91J09j66R6j94J17O4mj1N8N3L8m1l54J41P9J30L4J37j42
4805I8j58M6j72J44N7p1K7q7r6K94qN5j70J36j08k5K16j12l3N0j05J1K67l42N2
4830c4K31k38J11l76M86j82p4r8J80j86K47J9j60J75R8j0k08M0p8j61K29k09J02
4853i6K04l2M9rl51K0K92M3j4K5l25K9k2R3M8j06K81jl98L17q7j23K73K5j9p5
$$ plain form
4879 41 44 -143 54 156 -30 -108 -61 -24 -50 267 -65 -31 -104 92 -34 201 256 126 57 -97 148 96 -173 38
4903 38 -3 -156 -41 -173 -129 263 68 -92 86 -86 -284 118 -100 -92 -84 24 169 69 -29 240 -121 -186 -79
4926 -79 46 -74 -36 12 93 57 -189 180 332 188 84 58 141 -45 -82 224 50 -32 -105 76 -150 156 -18
4949 -18 126 131 -63 259 -23 137 45 -85 26 19 89 -69 47 147 148 116 60 30 127 61 -22 -5 -86 46 -122 102
4975 102 143 51 -20 -32 -175 -219 214 9 7 -162 -10 -137 95 110 91 -118 -104 -197 -110 -327 -21 -111 19 -131
4999 -131 -113 -61 -161 -198 -4 -106 -229 50 -18 327 66 26 62 -37 -97 140 -131 -112 26 72 -224 -36 38 195
5023 195 277 -69 -55 -113 11 -30 4 26 -194 -142 -23 12 130 59 43 -168 54 -54 27 15 -274 105 80 91 10
5048 10 -148 41 -167 -47 235 206 -37 92 106 -262 120 181 237 133 65 -40 -40 176 -45 100 49 -51 -64
$$ packed form
4879D1Lj87J97J02j86p8M7L7k6L17l32L4p3J96j26K35N5j30o9j54K45n2k69K11
4903C8m1j53J15j32M4L92j95j60J78j72j98M02k18QQJ08J45j00r8K69l61o5J07
4926g9J25j20L8M8Q1l6k46L69J52j44j04k6Q3j86l7L06j74q2p3J81k26L06j74
4949a8J44Nj94L22k82J60r2j30J11pP0j58J16J00Jl2n6l0R7o6q3J7q1J32j68K24
4975A02M1r2p1j2j43m4M33k05kj69J52j27K32J5j9k09J4r3Q7k17L06r0J30j50
4999a31J8N2j00l7J94j02j23K79o8L45k61m0L6r9o0K37k71J9J38M6k96J88P4J57
5023A95Q2l46J4n8J24m1L4K2k20N2J19L5J18p1j6k11K22j08Q1j2k89L79k5J1q1
5048A0j58J89k08J20K82k9k43J29J4l68L82O1N6j04o8j05%K16k21J45n1j00j3
$$ plain form
5071 -64 -77 -102 22 -219 218 54 -212 -78 -213 104 -71 27 -144 -7 179 89 -10 18 -41 161 49 -11 -233
5094 -233 -94 -130 -114 144 78 54 -51 145 -67 -148 -230 5 154 -111 -82 -7 -222 63 130 -59 -16 19 -5 121
5118 121 -197 -85 -47 76 -114 241 76 -121 85 121 26 159 -148 3 33 124 45 156 56 96 -199 186
5140 186 -46 80 -150 -267 128 -45 -119 59 143 -103 28 25 45 16 95 -90 -227 30 176 83 -162 33 187
5163 187 -205 -148 -39 -10 -188 29 125 -60 63 82 -265 50 -83 -43 3 -99 -13 24 -355 -148 64 -27 193
5186 193 -68 195 -157 139 57 67 72 106 -260 -51 179 192 -18 -35 32 155 -127 -174 57 -10 63 126 -57 -276
5210 -276 -11 33 112 59 -7 -25 -87 -70 251 -186 36 143 -4 8 74 56 -109 -121 -16 -57 -12 218 66 161 20
5235 20 294 22 -240 125 53 -77 -56 71 115 75 -71 144 -123 139 184 27 150 4 -29 -57 38 -162 -77
$$ packed form
5071f4j3k5J24k41M37j64k66J34j35L17j75R8j71J37J86r0r9K8n9K02j12o0k22
5094b33J39l6J6K58o6k4j05J96k12q1q2K35J49k65K9P5k15K85O7j89M3L5k4J26
5118A21l18J12L8J23j90L55j65j97K06L6r5J33l07J51L0R1p9J11j00M0k95L85
5140A86k32J26k30j17L95j73p4J78Q4k46J31lK0k9P9j85j37K57J46r3k45J95J54
5163A87l92N7J09K9j78K17R6j85J23J9l47L15j33M0M6j02Q6L7l79K07K12r1K20
5186A93k61K63l52K96q2J0NL4l66K09K30J3k10j7O7J23k82m7K31o7P3O3j83k19
5210b76K65M4P9n3o6j8o2J7L21m37K22J07j47J2O6j8j65j2J05m1M5K30j52R5j41
5235B0K74k72k62L65p2j30K1J27M4m0j46K15k67K62M5j57J23j46l3k8R5k00Q5
$$ plain form
5258 -77 -221 -34 120 -36 33 275 -148 31 -8 103 76 -140 75 173 -151 -28 -3 -49 2 2 -86 -80 -50 24 139
5283 139 134 -209 -8 -276 -50 112 -22 -9 -51 192 -88 -135 120 89 119 -58 -60 -66 -7 146 -145 -126 52 65 -119
5308 -119 40 -18 22 -50 -3 -94 55 -181 -13 -201 -64 19 -1 -89 26 -151 82 83 -47 113 -180 134 120 -92
5332 -92 -64 83 -124 -95 -146 -95 -11 -70 102 -49 -246 141 -31 -71 61 -38 -229 -45 193 61 -130 36 36 131
5356 131 -26 -109 124 196 19 20 98 -78 -108 -47 -29 -178 -212 -5 -89 -37 -162 -2 33 79 208 216 22 91 52 31
5382 31 -80 -186 -7 -1 133 -125 30 -14 25 86 -128 -58 -23 -16 -95 50 73 -80 125 -67 -267 56 -128 -35
5406 -35 -26 -151 -98 179 -226 6 162 -36 9 102 -127 24 -9 -48 -50 -28 95 56 -151 -103 -91 -30 -81 -88 163 -109
5432 -109 20 -32 196 -3 54 49 60 121 -109 159 49 110 63 23 -134 141 -28 184 77 -4 -241 43 -151
$$ packed form
5258g7j44J87J54j56O9K42m23J79l9J11k7k16K15R8l24J23K5m6N1%q8OL0P4J15
5283A39nl43K01k68K26J62j34J3m2K43k80m7K55l1L0j77koN9J53k91J9J78J3j84
5308a19J59n8M0p2M7r1J49k36J68j88J37Q3k0q8J15j77K33Jj30J60k93L14j4k12
5332i2K8J47k07K9n1N1Q4n9J72j51j97L87j72m0J32r9j91J84K38j32j91J66%R5
5356A31j57q3K33P2j77JP8j76l0O1J8j49l4K07q4N2j25J60L5M6J29Qj94O9l9k1
5382C1j11j06J79OJ34k58J55m4L9O1k14P0L5Pp9J45K3j53K05j92k00L23j84R3
5406c5Rj25N3K77m05K32J56j98M5R3k29J51l3l9kK2J23l9k07M8J2O1n1pK51k72
5432a09J29n2K28j99N7nJ1O1k30K68j10O1m7m0j57K75j69K12j07q1k37K84j94
$$ plain form
5455 -151 137 45 22 -96 69 72 261 144 -58 117 59 32 134 -104 -54 -56 132 15 -66 -104 -20 -40 39 29 -154
5480 -154 -104 -132 -26 -159 132 189 -75 -4 -71 218 29 -56 -316 -146 36 -99 4 46 -108 -58 81 -182 -117
5503 -117 246 7 -51 -70 -168 -116 -196 51 -30 128 -168 -130 79 182 197 39 -29 11 -59 22 88 -191 32 -10 13
5528 13 10 -124 -12 163 41 -4 -258 -36 122 -61 91 129 104 52 -155 -126 16 64 63 -155 47 -51 81 -21
5552 -21 -45 -7 -114 185 -100 -97 -227 272 -216 -140 -102 47 110 101 31 39 -140 198 -10 -87 126 -34 -161 -78 40
5577 40 -21 -67 -159 -101 41 -42 -92 98 120 -100 148 175 46 130 23 25 337 -39 -35 -117 -59 36 -96 44 75 74 36
5604 36 72 98 -102 33 34 -5 -81 79 289 -23 152 -109 99 64 146 -38 -264 118 -24 97 257 -82 65
5627 65 -191 -49 208 -123 11 56 -87 109 -188 20 52 -101 -66 -64 59 132 203 96 40 63 -113 96 67 -43
$$ packed form
5455a51K88r2k3j18J65LJ89j17k02J75n8k7J02k38N0kJ88j17q1l8Q4k0P9j0j83
5480a54N0k8J06j33K91N7k64P1o7K89j89q5k60J70J82j35J03M2j54N0J39k63O5
5503a17L63k39n8j9r8N2q0K47q1J58k96L8K09J03J5j58o8M0p0Q1O6k79K23m2K3
5528A3lj34J12J75j22m5k54K22J58j83J52L8k5n2k07K9J42M8jk18K02r8J32j02
5552b1k4L8j07K99k85Lj30M99m88P6L8J49O3rp0Qj79L38k08p7K13j60j27Q3J18
5577D0o1m6r2N8J42q3n0J90K2k20K48K7j29Q4j07KL12l76Mq2N8R5j32J40L1jl8
5604C6L6K6k00J35Jl9p6J60K10l12J75k61K08l5Q2j84k26L82j42J21J60l39J47
5627F5k56J42K57l31J34M5j43J96k97K08L2j53L5KJ23P3P1j07n6K3j76K09k9j10
$$ plain form
5651 -43 234 58 -59 -105 89 110 139 100 48 50 62 -74 49 -120 65 0 48 -62 -180 230 -10 -54 88 -63
5675 -63 1 -40 -97 22 26 45 -88 126 103 21 129 37 118 79 62 -29 -111 3 -27 -230 29 18 67 325 -5 -8 44
5702 44 79 59 -25 164 -114 166 -40 -20 -113 -129 -74 -219 -205 135 137 -89 -111 183 -123 -50 32 45 21 -91 -177 37
5728 37 -7 11 -139 -156 -118 15 -15 -60 -126 102 -122 8 -8 122 111 -165 -9 8 -58 -250 42 83 106 52 -52
5753 -52 71 135 98 101 190 221 -171 -92 85 -41 -13 -100 84 112 -152 80 -109 -194 -141 102 239 -144 -43 -63 -82
5778 -82 160 -124 28 -53 47 171 14 174 -8 -178 31 -120 28 74 68 23 -10 154 38 -173 160 127 9
5801 9 -80 12 16 301 -18 113 237 -68 214 -123 -80 121 -74 -318 93 -66 28 164 -144 58 173 180 -274
5824 -274 55 58 30 39 39 -351 -198 -164 192 -45 157 143 47 299 -38 -71 73 -199 29 -4 8 -218 43 61 69
$$ packed form
5651d3K77j76j17m6J94K1K9l9n2KJ2j36J23j69J85o5M8j10j18M10k40m4J42j51
5675f3O4m1n7J19MJ9j33K14k3q2J08r2Q1l9j7r1q2J14l0k03K59j1M9K58l30lN2
5702D4L5k0q4J89k78K80k06K0r3j6N5j45J4L40Kk26k2K94l06P3Q2J3k4j12q6K14
5728C7m4J8j50j7L8J33l0m5o6K28k24J30j6J30j1k76J56J7o6j92K92M1K3n4j04
5753e2J23O4l7LQ9L1l92P9J77j26K8q7J84K8k64K32j89q5N3K43J37l83J01k0j9
5778h2K42k84J52q1J00J24j57J60j82j70K09j51J48M6om5l3J64j16k11L33l3j18
5801Iq9R2MK85l19J31J24l05K82l37M3K01j95k44M11j59R4J36l08K02J15Pm54
5824b74L29Lk8R%l90J53L4L56k37K02j4r6K52l37l3J44k72K28l3J2k26K61J8Q
$$ plain form
5849 69 19 -130 -8 99 152 17 -5 -88 -206 -103 -25 -107 149 55 88 -17 -31 -144 24 14 -58 -8 -227 1
5873 1 131 88 58 8 36 -30 -220 185 253 207 -121 21 26 -58 -32 97 28 -134 130 151 15 -8 146 37 -165
5898 -165 -152 -281 -194 -2 -74 64 -197 82 110 -23 -108 109 -68 -37 36 -8 -15 24 38 32 4 -2 87 211 -62 92
5924 92 25 -124 8 -94 84 -13 83 76 96 4 39 135 12 -53 163 65 -150 -105 -35 131 -10 27 155 96 103 -57
5950 -57 176 -37 -196 -34 112 203 -13 -60 -97 52 210 43 165 -269 -44 2 45 100 66 -154 -149 -149 56 31
5974 31 46 13 -118 -49 210 -20 -36 183 -90 22 208 38 -335 -51 -179 13 -80 -43 37 29 62 220 -160 31
5998 31 28 179 40 -234 -80 30 -137 3 -127 -101 24 53 -23 144 -56 -415 245 -102 168 149 -22 -20 119
6021 119 -188 54 -60 -35 -15 38 -101 277 277 -62 24 67 17 -73 -83 173 85 -159 49 23 38 63 259 -83 42
$$ packed form
5849F9n0j49J22J07N3j35k2q3j18J03P8q2K56r4L3j05j4j13J68j0p2N0k19K28
5873AJ30m3l0n0K8o6j90M05O8m6l28J42Nq4K6J29o9j62K64K1j36k3J54j09k02
5898a65J3j29Q7J92p2J38k61K79K8j33q5K17j77L1P3m4pL9J4ok8oQ9J24k73J54
5924I2o7j49J32j02J78r7R6pK0r2L5R6j23o5K16r8k15M5P0J66j41L7J28n9Pj60
5950e7K33k13j59J62J46R1k16m7l7J49J58j67J22m34K25M6M3N5l4k20N%K05k5
5974C1J5l3j31O9K59k30j6K19k73J12J86j70l73K84j28J92r3L7Q0qL3J58l80J91
5998C1lJ51j39k74J54J10j67J40j30K6J25K9p6J67k00l59O60l47K70j9j71KJ39
6021A19l07K42j14K5K0N3j39L78%l39Q6M3n0r0j0K56q8k44K08k6J5K5J96l42J25
$$ plain form
6046 42 129 -82 -214 -34 -19 -45 52 297 -4 23 38 -99 -5 104 157 -11 126 -35 -146 119 89 8 206 32
6070 32 -169 -49 4 -26 -35 103 -27 -132 245 -48 24 -41 5 -222 -5 -135 97 24 124 261 73 151 31
6093 31 105 64 52 -7 152 27 -70 -231 -12 16 26 136 -120 86 85 115 164 162 120 -67 77 -198 109 -8 61
6118 61 13 -222 142 56 -122 125 57 48 11 132 -136 101 34 -6 137 -100 109 -111 -113 237 246 -125 -128 7 -13
6143 -13 89 -18 86 69 -150 25 40 189 20 2 87 -48 54 -32 -58 -53 -45 108 165 13 6 -114 -93 -84 -48 19
6169 19 14 18 40 31 1 39 128 -149 126 -16 0 128 60 12 -5 79 -76 -59 -132 -83 19 -70 -96 -176 57 90 249 95
6197 95 168 -35 40 16 -150 149 -102 -8 -113 33 -62 -112 266 32 -8 17 101 -118 175 189 -222 -191 13 118
6221 118 120 101 -114 -42 -213 -143 90 89 91 -84 -141 -69 90 -48 67 -172 82 -63 -16 52 50 -52 37 146 -49
$$ packed form
6046D2Q7k11j32J80J5k6R7K45l01K7J5j37R4J09N3j68J37j61j11K65l0q1J98j74
6070C2k01J20N3l0rJ38j30j05L77k93P2o5M6k27K17j30K32p3J00J37j88P8j20
6093C1P4m1j2n9J59j25r7j61K19K8J0J10k56K06jL0M9km2j87J44k75L07j17O9
6118F1m8k35L64q6j78K47o8rl7J21k68K37o7m0J43k37K09k20kL50Rl71lJ35k0
6143a3J02j07J04j7k19J75J5J49j69j8Q5j35J02q6k6NQJ53N7j52pj20K1RL6O7
6169A9nMK2rl0L8Q9k77K75j42J6J28o8m8j7Q4j55J7p3M9J02q9k6q0K33L3J59j54
6197I5P3k03P5k4j66K99k51R4j05J46r5n0L78k34m0K5Q4k19K93J4m11L1K04J05
6221A18Kj9k15P2j71P0K33jKj75n7P2J59j38J15k39K54j45M7O8kj02Q9J09j95
$$ plain form
6246 -49 49 163 102 -72 13 136 -49 35 61 133 -131 -7 -60 -15 -92 -86 9 115 -65 137 96 3 74 -69 80
6271 80 -163 160 -11 -56 34 -187 26 3 -119 88 9 206 -44 -155 172 -43 170 -55 -131 58 11 27 -44
6294 -44 -85 -155 -13 44 170 84 -265 86 61 -28 20 -15 -44 54 19 -140 -118 -107 63 106 -68 -161 -163 29 -193 -199 -65
6321 -65 6 -141 22 62 -100 -83 -11 -63 -43 -118 131 191 83 159 -94 57 -36 71 -199 -54 -124 -77 -14 106 -92
6346 -92 -46 155 24 -4 249 -9 168 30 9 24 -15 174 -96 16 54 -58 27 -271 127 83 116 154 106 -106
6370 -106 -84 -134 35 18 -53 93 0 -117 -67 80 -22 -102 -95 -94 -52 -67 -57 169 -150 -255 -131 -160 0 -130 44
6395 44 152 6 163 27 127 -1 -71 -43 52 -51 77 -67 61 -68 -117 -89 49 215 -125 54 29 83 128
6418 128 185 -173 -176 -256 -100 270 125 115 -21 -167 24 132 -157 65 -104 -68 45 147 -80 31 202 67
$$ packed form
6246d9R8J14o1j74Q5J23j85Q4K6P2k64J24n3M5p7OR5J06j80K02m1r3P1j43J49
6271H0k43L23j71m5R0k21K13k3j22K07p9J97k50j11L27k15K13k25p6J89m7J6p1
6294d4m1p0J42N7J26q6l49L51k5q9M8l5k9R8l5j59K2J1J70M3j74r3kJ92k22oJ34
6321f5P1j47J63M0j62J7P2n2K0p5K49O0j08P6k53J51r3J07k70J45p0M7O3J20j98
6346i2M6K01j31k8K53k58J77j38k1J5l9J89k70J12L8j12Q5k98L98m4L3L8m8k12
6370a06K2n0J69j7p1J46r3j17N0J47j02q0PJM2j5J0K26l19j05J24k9J60j30J74
6395D4J08j46J57j36J00j28p0K8R5j03J28j44J28j29m9K8J38J66l40J79k5N4M5
6418A28N7l58lq0J56L70j45j0j36j46J91J08k89K22j69L6J13J02k27J11J71j35
$$ plain form
6440 67 -186 48 242 -5 54 -53 -4 101 181 123 -138 101 128 -60 5 119 -154 -254 22 -139 -107 -36 -32 -9
6464 -9 27 -56 -20 138 146 75 41 -58 -2 301 247 6 -91 -133 -197 73 -9 -82 -9 -48 -75 -68 -176 151 236 -155 52 85
6492 85 -1 150 -77 -116 -47 -16 -110 107 48 -60 290 45 -5 40 -128 70 -125 -84 163 161 88 -122 -167 -181 -133
6517 -133 -56 -136 -41 -16 -189 184 -54 14 94 -37 163 -55 32 106 -50 244 189 53 56 -44 96 -92 236 -200
6541 -200 -54 -102 104 74 143 61 63 -137 119 -9 -37 -70 139 103 -1 17 38 -65 -103 133 -128 -31 179 133 124
6566 124 -12 71 60 -85 207 -183 -22 80 -181 -93 -91 175 106 -56 -61 147 55 -129 30 1 -94 127 -10 -114
6590 -114 14 32 179 -76 -204 63 4 -168 61 1 179 -75 146 103 27 33 -33 104 -162 -4 106 130 65
6613 65 125 -273 37 111 109 -140 -159 6 -100 122 -2 45 21 -58 19 -83 -35 47 50 -23 -29 4 143 -204 -7 -70
$$ packed form
6440F7k53K34J94k47N9j07M9J05Q0n8k61K39K7j88O5J14k73j00K76j61L2P1MK3
6464iL6q3L6J58Qp1l4r9N6L03n4k41r7m2o4K70q2p3P3l9k7Pj08L27Q5l91K07L3
6492H5q6J51k27l9O9L1r4K17n9j08L50k45n0M5j68J98j95M1K47kp3k10m5j4M8
6517a33P7q0R5K5j73L73k38O8Q0j31K00k18Q7P4j56K94n5j36Lj00J40j88L28m36
6541b00J46m8K06l0O9q2Kk00K56j28k8l3K09l6j04J8K1j03l8K36k61R7K10m6r
6566A24j36Q3j1j45K92l90J61J02k61Q8KK66o9j62nK08r2j84J59k9r5K21j37j04
6590a14J28J8J47k55j28K67n9j72K29o0J78k54K21m3p6Oo6J37k66J58J10K4o5
6613F5O0l98L10P4kk49j9J65j06K22j24M7k4p9P7j02M8Q2Lp3oL3J39l47J97o3
$$ plain form
6639 -70 260 187 61 -39 29 130 55 87 -220 101 -132 172 -90 81 -24 -108 86 -8 111 52 -144 73 -13
6662 -13 95 -51 99 -159 94 126 156 -24 120 -18 10 255 -173 17 91 5 -93 -199 -49 -52 -236 287 -12
6685 -12 37 -24 72 13 -235 -212 130 -30 -14 56 -64 85 52 -108 -67 -53 151 31 34 -209 -43 -54 -46 -17 -167 175
6711 175 -275 -227 161 74 -25 34 -33 -77 48 24 104 37 -88 -21 -31 76 -3 28 -234 -58 4 156 14 -87 54
6736 54 -166 -214 -232 48 36 -99 171 -97 -133 104 -140 93 -78 -33 0 58 60 113 -24 73 173 -34 -18 -102 125
6761 125 172 172 21 -59 33 137 -165 -84 -212 -150 -19 -233 111 59 39 -120 102 152 42 142 80 77 81 -78 -53
6786 -53 -33 -10 226 84 -306 -225 102 175 -170 -92 -39 83 112 182 -53 -206 52 -95 72 -72 150 183 -1
6809 -1 20 163 37 -100 -189 -20 39 95 -62 158 176 -78 76 -150 -9 -177 -29 -133 144 -66 -25 -46 128
$$ packed form
6639g0L30p3j26j00O8J01p5L2l07L21k33L04k62J71j05q4J94r4J19n9j96K17q6
6662a3J08j46J50k58K53L2L0j80J44j38K8K45m28J90P4q6r8j06J50lj84N23k99
6685a2M9o1R6n9k48K3L42j60J6P0j20J49l3j60M1J4K04j20Lk43J66j1QK9j50L42
6711A75m50M8L88q7r9N9o7m4J25k4Q0o7j25O7j0J07p9L1k62J76O2J52j42j01J41
6736E4k20m8j8K80j2j35K70k68l6K37k44K33j71M5L3N8KN3j37R7J00k07J6q4K27
6761A25M7%j51q0R2J04l02Q1j28O2J31k14L44n2k0j59K22N0j10J00o2lMj59K5
6786e3K0K3K36j42l90Q1L27P3l45P8N3J22K9P0k35j53K58j47J67j44K22L3j84
6809aK1J43j26j37q9J69N9N6j57K20J8k54J54k26J41j68J48j04K77k10M1k1J74
$$ plain form
6832 128 93 76 64 91 -223 -20 -94 12 -290 -46 -63 122 -123 -38 122 220 109 53 -82 -100 228 -128 10
6855 10 31 102 30 8 -8 221 -56 -59 116 48 16 -71 143 19 74 3 -93 -13 -8 -145 -155 -165 -161 10 173 96 93 85 88
6884 88 106 6 30 39 -4 118 244 196 129 18 90 -8 -141 -108 220 -172 86 171 30 -12 96 174 -130 -181 -106
6909 -106 -149 -16 263 177 -31 172 219 28 -21 35 133 -84 84 123 -62 183 169 -129 151 28 108 -199 -57
6932 -57 90 -51 105 -144 190 -188 -9 43 -185 11 30 -75 -108 -188 180 -59 -100 -4 18 -186 -56 15 11 -132
6956 -132 61 117 61 24 -66 267 -267 44 84 125 -4 -2 149 333 170 37 -19 59 -84 29 -61 -30 -106 -10 -3
6981 -3 -81 173 -339 -65 137 -74 16 -95 -11 114 65 196 36 152 83 -173 -151 -163 163 8 107 196 21 -170
7005 -170 88 119 71 -96 78 158 116 25 -68 -140 -2 88 4 -41 181 18 10 133 2 7 -117 87 -45 -112 -75
$$ packed form
6832A28l5j7j2K7l14K03p4J06l02K44j7J85k45Q5J60R8j11n6j35j8L28l56J38
6855A0K1P1p2k2j6K29k77lJ75o8l2q7K14j24N5p1r6Q0Nj37j0j0MJ71J63p7lqL
6884H8J8j00K4Rm3J22J26m8o7j11P2r8j33L3L28l92K58Q5j41m2J08P8l04n1P5
6909a06m3J33K79q6k08K03M7j91m9N6R8k17J68L9j85K45j4k98K80j23Q0l07J42
6932e7J47j41J56k49L34l78J79N2k28J96J9j05l3q0L68k39m1R6K2k04J30P1mj43
6956a32J93N6n6l7r0L33n34L11M0M1j29KJ51J84j63j33n6P8j43J13r0L1p6R6P
6981cp8K54n12K74K02k11R0j11Q4J25m9J31j60J16o9k56K2j2L26j55R9Q9j75j91
7005a70K58L1m8j67J74Q0m2r1r3p2J38R0q4m5K22j63qJ23j31Nj24K04j32o7L7
$$ plain form
7030 -75 -52 113 -163 34 -45 -4 -22 90 -4 128 -82 -138 129 -167 -36 15 -150 26 63 -45 89 13 -5 135
7054 135 -105 -59 38 109 -25 -70 -82 140 5 33 -246 253 154 26 -64 -95 -7 -127 -266 143 -39 109 -218
7077 -218 -236 319 39 -178 -74 -32 -6 -64 -108 -2 -204 -148 -88 241 49 -17 149 -41 -221 20 25 213 66
7100 66 -59 -178 52 128 13 -48 71 -101 -209 -160 -7 -107 159 79 -96 -225 -114 -198 130 80 -69 -101 54
7123 54 255 -94 199 47 19 116 44 -14 -96 -9 67 151 -46 -29 -18 121 -121 -18 -226 -81 12 -104 182 130
7147 130 -80 79 127 61 34 53 112 39 -87 -134 -9 91 15 52 -99 -353 -94 7 9 -113 44 -15 -235 93
7171 93 -35 103 35 166 -169 15 -143 49 68 -105 -177 61 38 113 81 -7 -13 125 35 5 -29 10 53 -7 72 -23
7197 -23 187 -22 144 140 -56 176 -113 13 -115 133 136 -25 32 97 -103 53 121 14 65 -42 101 24 25 150
$$ packed form
7030g5K3J65k76J97p9M1j8J12r4J32k10n6K67k96J31N1j65J76L7j08J34p6j8J40
7054A35k40M6R7P1j34m5j2K22j35K8k79M99r9j28r0l1Q8j20j39M09j82J48l27
7077b18j8N55k80k17J04M2K6n8m4J06k02N6O0L29j92o6J66j90j80K41NJ88j47
7100F6j25j19K30P6j15o1J19j72j08M9J53j00K66q0j75j29J11q4L28n0j49l2J55
7123E4K01l49K93j52k8R7p2n8q2Q7P6Q4j97J7J1J39k42J03k08J45R3j16K86n2
7147A30k10J59M8o6k7J9N9p3j26m7J25J00p6L7j51k54K59J01Kj22J57n9k20L28
7171I3j28J38o8J31l35J84j58J92J9j73p2K38k3P5l2q8oJ38r0l0l4L9M3o0P9r5
7197b3K10k09J66mj96K32k89J26j28K48Lj61N7O5k00J56O8j07N1j07J43p7JJ25
$$ plain form
7221 150 10 -120 20 -91 93 -173 124 66 87 153 26 -109 -39 -78 41 99 -86 115 -166 -46 102 53
7243 53 15 91 203 13 69 -180 51 -35 -59 201 31 -75 91 26 -156 -82 67 22 16 193 -76 -309 -34 5
7267 5 48 -199 149 -86 -23 -33 109 11 55 150 -73 26 -153 -110 207 -55 -14 86 93 22 5 -45 77 225 -253
7292 -253 229 -105 -102 -139 -20 61 -19 -60 89 3 -167 -74 98 18 143 -31 97 32 -129 72 -60 -323 61
7315 61 -27 222 -62 -216 183 -75 179 -47 -140 100 20 111 -9 -146 39 -1 -55 44 149 -4 95 165 29
7338 29 153 -65 -292 -326 -139 178 143 -345 -46 176 57 -15 32 -144 22 43 226 -180 -86 133 -76 -67 61
7361 61 179 148 -81 -48 129 -1 -132 121 -54 -246 29 156 -239 135 -76 111 -116 116 -19 3 236
7382 236 -113 54 -83 113 -179 67 -228 59 -308 24 -67 -29 171 55 175 -219 -207 -72 103 153 15
$$ packed form
7221A50j40j30J40j11J84k66K97n8K1O6j27j35P0l9J19N8j85K01k81J20J48m9
7243E3l8P6J12j90N6k49K31q6k4K60j70j06J66o5j82P4J49m5oJ77k69k33K75L9
7267EM3k47L48k35O3j0J42r8M4R5k23R9j79M3L17k62M1J00Pp1j7n0J22J48m78
7292b53M82l34Ll7J19Q1q0m1J49q6j70R3J72q0J25j74J28o5j61K01j32k63L84
7315F1q8K49k84j54L99k58K54k26r3K40q0R1j20j37J85m0n4R9J05j53R9P0j36
7338B9J24k18k27l4J87L17l5m88K99K22j19p2M7j76J66K1J83m06R4K19k09RJ28
7361F1J18l1k29L3J77j30j31K53j75j92K75J27l95L74k11J87k27K32j35K2K33
7382B36l49J67j37J96k92K46k95K87l67L32r1L8K00j16J20l94J2J35J75N0j38
$$ plain form
7403 15 115 -99 6 -158 -59 25 -96 65 -91 118 -7 75 7 33 53 -13 43 45 93 -24 51 -37 27 -90 182
7428 182 40 -180 -183 83 -249 60 170 45 -36 215 33 48 -151 -36 242 -77 331 -111 58 -182 4
7449 4 -59 -140 -2 -4 90 61 -82 85 -40 -90 65 -194 -59 255 -64 6 99 65 -33 127 265 -62 109 -17
7473 -17 76 4 19 -81 -47 16 88 -24 97 -33 -62 -46 -97 64 36 40 30 -19 175 85 -79 113 46 -5 45 124 -161
7500 -161 -300 -71 63 61 -27 -9 -225 198 -131 -101 54 -136 -46 207 104 -15 11 -57 271 4 -65 145 -175
7523 -175 54 -45 102 4 227 -63 -161 -98 233 -142 151 199 165 -94 117 -40 -99 105 -5 49 48 -243 -134
7546 -134 -128 -33 -130 94 92 -87 115 21 174 -176 -26 106 8 245 -193 -194 -184 41 71 -12 19 90 -100 -148 -21
7571 -21 267 -102 -149 -24 -196 14 32 -260 41 -14 104 -85 44 101 5 8 -115 -72 -171 177 -89 5 -43 83
$$ packed form
7403A5J00k14J05j64R9Q4j21J61j56K09j25Q2o8K6K0o6N6KM8j17P5q8O4j17K72
7428A82j42k20lK66l32L09J10j25q1K51j82J5j99J15K78l19M08m42J69k40J86
7449Do3q1J38kR4k9j43J67j25n0J55k59J35L14l19P0R3l4r8J60J38l27J71j26
7473a7R3p2J5j00L4O3P2j12J21j30k9J6n1J61k8Mj0m9J94r0j64J92o7n1N0P9k85
7500a61j39K29J34kq8J8k16M23l29L0J55j90R0K53j03j19K6o8L28k67o9K10l20
7523a75K29r9J47r8K23k90r8O3L31l75K93M8l4k59K11j57n9K04j10N4jk91J09
7546a34OR5r7K24kj79K02r4J53l50J50J32r8K37m38jJ0K25L0q3L1P1j90m8J27
7571b1K88l69m7J25j72K10J8k92L01n5J18j89J29N7r6Lj23M3r9L48k66R4m8J26
$$ plain form
7595 83 162 168 -6 116 14 56 99 223 93 145 75 190 -79 52 -117 -21 -53 120 97 71 -105 -156 14 -145
7619 -145 75 -38 119 -205 17 -99 42 -88 61 133 -51 -16 -23 0 -43 -8 -236 -66 -143 9 -101 -91 -190
7642 -190 87 253 14 172 -14 84 162 60 -2 -61 -13 20 128 190 -46 27 9 -158 -100 -121 41 26 195 -100
7666 -100 107 220 -263 -41 -45 -1 100 100 -119 -124 -20 195 -119 -59 -37 -35 -214 -241 -120 -138 13 -39 -70 -229 -24
7691 -24 -12 52 -60 36 -101 30 -53 -50 -133 -8 -149 22 -44 -182 52 -209 -43 148 7 23 -56 -136 99 104 72
7716 72 49 73 -82 58 -27 -8 99 -86 -42 -89 186 -64 27 95 118 -125 8 -197 114 -73 -23 36 -9 220
7740 220 -57 168 -63 39 39 -5 -147 -32 -71 70 -34 188 10 -91 -40 -64 21 -25 -45 13 70 154 -147 26
7764 26 -110 14 -259 -7 291 2 41 -7 77 68 -164 69 -210 -43 149 -55 -218 -84 148 14 116 133
$$ packed form
7595H3P9Oj74J22j02M2M3J24j30N2p0J15k69J31j69R6l2J73k3k6j76n1J70j59
7619a45K20j13J57l24K22j16J41j30J49P2j84L5pK3m3L5k28J70p7J52j10J0r9
7642a90K77J66k39J58j86R8P8j02o2n9M8L3J08O2k36P3j8j67N8k1J62j5J69k95
7666a00K07J13m83K22mM4J01%k19nJ04K15l14O0K2Kj79k7J21j8J51n2l1j59K05
7691b4J2O4j12R6j37J31q3Lq3J25j41J71o6j38K34k61J66J91j41J6p9q0K35Nl2
7716G2k3K4j55J40q5J9J07j85M4m7K75k50R1O8K3k43J33k05L11j87N0N9m5K29
7740B20k77K25k31J02%m4j42J15l9J41j04K22j78j01N1k4Q5m6k0N8N7Q4l01J73
7764B6j36J24k73K52K98k89L9m8Q4rk32K33k79J67J92k04j63J34K32j34J02J7
$$ plain form
7786 133 159 193 78 299 81 -46 109 22 30 -78 108 -47 -195 -87 -45 -44 -25 117 171 127 249 -38 -34 -130 -31
7811 -31 -12 137 -355 87 198 91 -66 -229 -146 -126 31 -136 -21 -134 149 -28 190 -6 102 58 30 -98
7833 -98 -151 230 -20 -155 113 -39 -125 -20 125 279 -328 173 71 -145 254 65 62 94 94 -306 68 57 -81
7856 -81 -9 78 -168 225 76 67 -12 112 172 -83 -89 -51 236 -132 255 -90 26 68 62 161 -12 -42 56 -53 -79 -155
7882 -155 -118 -124 83 -158 13 40 54 182 -80 -250 -9 -39 14 36 32 -31 -22 -36 125 -4 29 167 -27 152 182
7907 182 71 -89 89 -53 12 -77 10 87 -75 -11 -131 73 -78 -35 340 -39 -109 1 141 146 32 -80 61
7930 61 -182 -70 -82 198 182 -78 -84 -108 92 -25 -45 130 140 -141 -39 232 148 -332 -70 0 -19 -4 -30 -122 132
7955 132 -126 -175 -107 100 -62 -172 40 -86 -10 13 204 85 1 -9 -62 -185 21 24 -12 -213 -7 58 -38 84
$$ packed form
7786A33K6L4j15K21k18j27J55q7Qj08J86j55j48J08M2JJ9J42N4m4J22k87Mr6R9
7811c1J9J49m92M42J11j07j57j63Q3K0J57j67J15j13K83j77K18j96J08m4k8j28
7833i8n3L81k50j35K68j52q6J05J45J54o07N01j02k16L99j89lL2%m00L74j1j38
7856h1P2Q7k46L93j49rp9J24O0k55oL8K87l68L87l45J16M2oR9j73l0R8j09k6p6
7882a55L7oK07k41J71K7J4J28k62j70K41l0N3K2mo3Rj4J61j29L3J38j94J79L0
7907A82j11j60J78j42O5q9Q7P7j62O4j20K04j51M3L75l79p0J10J40Nj14j12J41
7930F1k43J12j2K80j6k60ok4K00j17k0J75J0k81J02K71q4m80K62P0j9J5k6r2K54
7955A32k58m9O8K07j62j10K12j26P6K3J91j19q4j0n3j23K06Ll6k01K06O5r6J22
$$ plain form
7979 84 55 120 -118 -18 91 29 59 -32 -9 -93 94 -152 124 5 9 278 -256 44 192 -121 198 7 -183
8002 -183 -18 124 -16 75 -204 155 -37 12 -102 72 -147 -171 57 175 -150 8 -58 -204 2 -48 43 97
8024 97 23 157 63 -137 -15 -44 -62 330 29 -10 57 -8 -13 62 -7 -68 -137 -9 133 -28 27 -158 64 28 -100
8049 -100 -27 -36 194 67 60 -63 -79 118 59 -50 69 24 -174 -86 -119 176 -18 29 -116 144 -79 116 204 -157
8073 -157 132 18 172 28 -25 96 12 -241 118 -32 -145 -112 42 -22 19 -138 76 70 28 -28 -171 0 -46
8096 -46 97 3 -10 -80 223 37 -96 66 128 204 36 -60 -44 -39 -213 -123 90 -88 93 7 11 168 -72 -38 -173
8121 -173 0 8 13 -116 111 -102 -39 -51 -237 11 -19 37 -203 138 -63 -83 135 -24 65 -34 -8 98 76 2 -234
8146 -234 -9 66 -9 -27 132 -85 66 -42 103 52 43 89 -70 67 89 -206 -87 -53 -149 -34 34 -69 -133 -131 -95
$$ packed form
7979H4k9O5k38J00J09o2L0r1K3q4J87k46K76j19MK69n34L00J48l13L19j91j90
8002a83J65J42j40R1k79L59j92M9j14J74k19k4K28J18l25J58o6j46K06n0R1N4
8024I7p4J34r4k00J22k9j8L92l01l9O7o5nP5o9o1o9J28J42j61N5j85K22l6j28
8049a00P3rK30j27pj23j6J97n9j09J19m5j98Q8l3K95j94M7j45K60k23J95Q8l61
8073a57K89j14J54j44n3J21q4k53L59j50j13L3J54o4M1j57K14om2n6j43J71m6
8096d6J43r4j3p0L03j86j33J62O2P6j68r6J6Nj74R0K13j78J81q6MJ57k40L4j35
8121a73J73QNj29K27k13O3j2j86K48l0N6k40L41k01k0K18j59Q9r9K6J06k2p4k36
8146b34K25P5p5j8J59k17J51j08J45n1rM6j59J37K2k95J19L4r6J15O8j03o4KL6
$$ plain form
8171 -95 -232 179 -91 -37 -109 18 -115 -23 134 -160 -171 126 61 -42 -65 -227 -141 121 -133 114
$$ packed form
8171i5j37M11k70N4p2J27j33R2J57k94j1K97o5j03k3j62Q6K62k54K47
8191A14
$$ Imaginary data points
##PAGE= N=2
##DATA TABLE= (X++(I..I)), XYDATA
$$ plain form
0 0 0 0 0 0 0 0 0 0 0 0 0 -8 8 -8 8 -8 16 -16 24 -24 32 -40 47 -54 64 -72 83 -97 113 -129 145 -168 191
33 191 -215 243 -273 308 -344 384 -429 478 -531 589 -652 723 -797 879 -969 1068 -1178 1296
51 1296 -1428 1575 -1739 1919 -2125 2360 -2628 2940 -3308 3748 -4290 4971 -5859 7069 -8827
66 -8827 11620 -16753 29332 -129800 -96411 99095 -84341 -35970 108711 36746 -93963
77 -93963 11968 54667 -50106 -9366 153232 38291 -104094 11267 57273 -73017 -34588
88 -34588 68332 21716 -33001 31036 40694 -45691 -8137 122755 46340 -69647 16627 45348
100 45348 -69000 -44946 59980 46158 6429 46529 32113 -76401 -69248 33079 -15310
111 -15310 -69757 32626 43554 -59942 -52878 -12614 -39938 -28431 36221 38966 -14544 7134
$$ packed form
0@%%%%%%%%%%%qJ6j6J6j6K4l2M0m8N6p2Q7j01J18j36J55j80K10k42K74l13L59
33A91m06M58n16N81o52P28q13R07j009J120j241J375j520J676j848K037k246K474
51A296k724L003l314L658m044M485m988N568o248P056q038R261j0830J2928j5896
66h827K0447k8373M6085j59132L3389J95506j83436M8371J44681p1965j30709
77i3963J05931M2699j04773M0740J62598j14941j42385J15361M6006j30290L8429
88c4588J02920m6616n4717O4037R658q6385L7554J30892p6415j15987Q6274K8721
100D5348j14348K4054J04926j3822l9729M0100j4416j08514P153J02327m8389
111a5310n4447J02383J0928j03496P064M0264k7324J1507O4652K745n3510K1678
$$ plain form
123 7134 56669 -6884 -48620 20051 25291 -27483 -18604 -4043 -11926 -3111 18086 26552 1020
136 1020 -2477 28035 -3012 -36242 10699 37543 17310 9972 6957 -1295 -17082 -18535 3957
149 3957 -215 6620 47446 24994 -21683 -6046 1098 -21316 -25657 -13592 3652 -2188 -11399
162 -11399 6393 -4400 -19334 11329 9800 -19403 -5150 16865 12972 -3853 -3671 17520 -2781
175 -2781 -29999 -5200 -9574 -29541 10263 25660 -4747 1884 22178 7468 -21291 -12228 19190
188 19190 3492 -6301 31515 16907 -17355 10463 11350 -24643 -13457 14251 10708 -6114 2986
201 2986 23524 -1880 -19508 7422 -7152 -30313 2935 11156 -12066 -1472 15299 6176 -13696
214 -13696 -9398 10011 -7179 -12514 21656 11247 -10964 12188 8193 -20673 -16004 -2599 -4279
$$ packed form
123G134M9535o3553m1736O8671N240n2774Q879J4561p883Q815K1197Q466k5532
136A020l497L0512l1047l3230M6941K6844k0233p338l015q252j5787j453K2492
149C957m172O835M0826k2452m6677J5637P144k2414m341J2065J7244n840r211
162a1399J7792j0793j4934L0663j529k9203J4253K2015l893j6825J82K1191k0301
175b781k7218K4799m374j9967L9804J5397l0407O631K0294j4710k8759R063L1418
188A9190j5698r793L7816j4608l4262K7818Q87l5993J1186K7708l543j6822R100
201B986K0538k5404j7628K6930j4574k3161L3248Q221k3222J0594J6771r123j9872
214a3696M298J9409j7190n335L4170j0409k2211K3152l995k8866M669J3405j680
$$ plain form
227 -4279 -10916 294 19840 3169 -5960 14957 -703 -16858 6995 7338 -4222 7373 12885
240 12885 8568 -2286 -4866 4217 -8911 -14343 7676 995 -7012 9174 2559 -9031 -6345 -7477
254 -7477 -3674 -4813 -2139 15374 10965 4081 16971 5163 -7008 1126 -5215 -8424 -2917 -4226
268 -4226 1552 -2535 -9165 679 -5695 -10554 5237 3828 3104 14390 9934 7215 4814 -4768 -2208
283 -2208 -7033 -12499 681 -1623 -5221 6623 1013 -4244 569 -4982 -2520 833 -2296 7609 5684
298 5684 -765 7546 181 -7093 1453 -3196 -3064 4854 1209 4379 4604 -3200 1634 -3066 -8743 2712
314 2712 -246 -1789 8461 3133 855 3748 -4544 -3197 -3226 -7365 1427 34 -2901 7265 1157
329 1157 -2615 4522 -1836 -1619 4231 100 3987 3359 -2435 2326 -4267 -9243 -616 -6047 -6233 4769
$$ packed form
227d279o637J1210J9546j6671r129K0917j5660j6155K3853L43j1560J1595N512
240A2885m317j0854k580R083j3128n432K2019o681q007J6186o615j1590K686j132
254g477L803j139K674J7513m409o884J2890j1808j2171Q134o341l209N507j309
268d226N778m087o630R844o374m859J5791j409p24J1286m456k719k401r582K560
283b208m825n466J3180k304l598J1844n610n257M813n551K462L353l129R905j925
298E684o449Q311p365p274Q546m649J32P918l645L170K25p804M834m700n677J1455
314B712k958j543J0250n328k278K893q292J347k9m139Q792j393k935J0166o108
329A157l772P137o358K17N850m131L887o28n794M761o593m976Q627n431j86J1002
$$ plain form
345 4769 1263 1875 5842 1175 3017 461 -3187 3992 -1020 -2135 7917 -310 -3619 4292 -2793
360 -2793 -5639 -1695 -3656 -1091 -2404 -2100 4286 -4429 -4117 6893 -3141 -3872 9105 4760 2721
375 2721 7096 4964 3039 -2239 -2107 1258 -10203 -6610 5677 -6624 -7138 7337 1067 -3356 3000
390 3000 3915 2314 -319 5036 7664 -5616 -121 9373 -8188 -9458 5970 -1838 -6434 1093 2192
405 2192 -2426 -5598 107 -439 -12902 -2325 8753 -8557 -6045 10045 1730 -1456 6831 7099
419 7099 3968 2020 6369 2699 -10212 601 7988 -10458 -7898 4801 -3704 -5631 1718 3006
433 3006 4902 6059 10042 6677 -4800 4103 9622 -6348 -3177 6052 -1991 -5162 -5787 -7982 -3787
448 -3787 -3201 230 390 -8204 -1972 2448 -9229 -5373 4562 5165 5965 -267 -2947 3614 -1380 -676
$$ packed form
345D769l506O12L967m667J842k556l648P179n012j115J0052q227l309P911p085
360b793k846L944j961K565j313L04O386q715L12J1010j0034p31J2977m345k039
375B721M375k132j925n278J32L365j1461L593J2287j2301n14J4475o270m423O356
390C000R15j601k633N355K628j3280N495R494j7561j270J5428p808m596P527J099
405B192m618l172N705n46j2463J0577J1078j7310K512J6090q315l186Q287K68
419G099l131j948M349l670j2911J0813P387j8446K560J2699q505j927P349J288
433C006J896J157L983l365j1477Q903N519j5970L171R229q043l171o25k195M195
448c787N86L431J60q594O232M420j1677L856R935O03Q00o232k680O561m994P04
$$ plain form
464 -676 5775 -184 1580 5241 -6209 -11232 -5180 3653 6913 -2493 1491 11617 -1468 -3377 8493
479 8493 2925 3258 14344 5848 -9263 -8143 4246 2586 -10879 1856 14812 -6044 -10739 2190
493 2190 -9510 -9993 11970 10142 -8422 -7043 7041 -3268 -22305 -403 17840 -4043 -2771
506 -2771 12096 -10105 -17941 7925 7876 -11463 -1437 19512 1029 -23744 704 15607 -8675
519 -8675 2132 23059 -4925 -14615 12002 6649 -16051 2266 29258 6966 -18520 5348 10577
532 10577 -18417 -693 23147 -3936 -9487 15280 -968 -29385 -9687 17839 -463 -15822
544 -15822 11351 10412 -21420 -5154 13965 -10892 -7276 21447 5279 -22926 -7019 13243 -5800
557 -5800 -15788 13145 11509 -16679 -1249 10684 -14209 -5750 23601 9848 -12432 1126 13615
$$ packed form
464f76O451n959J764L661j1450n023O052Q833L260r406L984J0126j3085j909J1870
479H493n568L33J1086q496j5111J120J2389j660j3465J2735J2956k0856m695J2929
493B190j1700m83K1963j828j8564J379J4084j0309j9037K1902J8243k1883J272
506b771J4867k2201p836K5866m9j9339J0026K0949j8483k4773K4448J4903k4282
519h675J0807K0927k7984r690K6617n353k2700J8317K6992k2292k5486K3868N229
532A0577k8994J7724K3840k7083n551K4767j6248k8417J9698K7526j8302j5359
544a5822K7173r39l1832J6266J9119k4857L616K8723j6168k8205J5907K0262j9043
557e800r988K8933j636k8188J5430J1933k4893Q459K9351j3753k2280J3558J2489
$$ plain form
570 13615 -7293 -14605 13099 14157 -5990 8814 12722 -15063 -9710 12303 1998 -10508 3658
583 3658 13513 -5313 -15864 2378 2636 -9926 5586 10703 -8872 -5492 7960 -879 -9923 312
597 312 10876 -776 -13290 -885 218 -10431 2430 9388 -3310 -1928 5527 -1590 -9862 -4058
611 -4058 10244 7030 -4105 4717 5748 -7724 -2693 4478 -1094 1007 8537 7133 -3641 -6870
625 -6870 5265 4177 -8742 1272 8289 -4578 -4154 3458 -1188 -3821 3412 7992 -2511 -9084
639 -9084 4766 3836 -11090 306 10347 -3783 -5951 1735 -4420 -9937 -1595 7947 -474 -6169
653 -6169 8311 5452 -12550 -2070 8380 -3496 -2455 8125 3112 -5445 -523 6946 -2544 -7909
667 -7909 8723 7637 -9371 1337 9935 -3295 -2773 7336 2073 -6668 -1354 6092 -4134 -8406
$$ packed form
570A3615k0908p312K7704J058k0147J4804L908k7785N353K2013j0305j2506J4166
583C658R855j8826j0551J8242K58j2562J5512N117j9575L380J3452q839r044J0235
597C12J0564j1652j2514J2405J103j0649J2861O958j2698J382P455p117q272N804
611d058J4302l214j1135Q822J031j3472N031P171n572K101P530j404j0774l229
625f870J2135j088j2919J0014P017j2867M24P612m646k633P233M580j0503o573
639i084J3850r30j4926J1396J0041j4130k168P686o155n517Q342R542q421n695
653f169J4480k859j8002J0480J0450j1876J041J0580n013q557M922P469r490n365
667g909J6632j086j7008J0708Q598j3230N22J0109n263q741N314P446j0226m272
$$ plain form
681 -8406 8404 5775 -9655 432 6068 -7450 -5282 5043 1022 -4577 754 5978 -4805 -9720
695 -9720 3771 1089 -9638 1981 6906 -3558 -1637 4644 256 -4157 -77 5570 -868 -4269
709 -4269 7040 4644 -5058 3605 6067 -3074 -898 3517 962 -2358 51 4176 -1358 -5237 2829
724 2829 -227 -7416 542 2528 -2548 781 3015 892 -1246 -1755 1322 -2197 -4944 2277 711
739 711 -4415 970 968 -3038 -767 34 733 690 63 4444 2402 -1366 3595 1952 -2704 1393 1282 -924
757 -924 1089 971 1502 799 -1749 1318 -670 -4010 933 -35 -2821 976 -5 -1713 -182 -1831 -251
774 -251 -66 -2119 2002 1755 -1352 1991 396 -2328 93 -1283 -1351 485 -916 1384 1779 -1235 2040
791 2040 1219 -1797 1466 738 -632 2159 467 672 1372 -1759 169 277 -2786 794 313 -1485 1517
$$ packed form
681h406J6810k629j5430J0087N636j3518K168J0325m021n599N331N224j0783m915
695i720J3491k682j0727J1619M925j0464J921O281m388m413M080N647o438l401
709d269J1309k396r702Q663K462r141K176M415k555l320K409M125n534l879Q066
724B829l056p189P958J986n076L329K234k123k138n09L077l519k747P221j566
739G11n126N385km006K271Q01O99m3o27M381k042l768M961j643m656M097j11k206
757i24K013j18N31p03k548L067j988l340M943r68k786L797r81j708J531j649J580
774b51J85k053M121k47l107L343j595k724K421j376o8J836j401K300L95l014L275
791B040q21l016L263p28j370K791j692K05P00l131J928J08l063L580m81j798L002
$$ plain form
808 1517 -11 -1410 344 -1870 -1060 43 -2135 868 1397 -1247 1759 1190 -1433 1112 146 -495
824 -495 1403 -101 1082 1241 -1562 1134 153 -3067 662 -49 -2047 1506 535 -504 952 -459
840 -459 21 -334 -1930 1410 84 -2039 1961 255 -1897 998 -427 -1637 693 -128 437 383 -501
857 -501 2224 -191 -1763 2364 -93 -1481 2817 728 -310 2228 1018 253 -353 -398 1899 -1379
873 -1379 -1659 2526 -1158 -2427 1891 -1564 -2969 532 -370 -1496 -1043 -11 1818 -1625 -1091 2812
889 2812 -1685 -1542 2793 -1104 -1871 2592 767 -769 -333 321 964 -1891 -875 2468 -1097 292
905 292 3810 -1457 -1194 2525 444 -297 520 1137 1837 -703 -314 1097 -2236 -312 1788 -3029 -1518
922 -1518 1549 -1504 -1033 -451 -858 1239 -315 -1334 148 -1218 827 1492 -1488 973 1704 -1105
$$ packed form
808A517j528j399J754k214Q10J103k178L003N29k644L006n69k623K545r66o41
824d95J898j504J183J59k803K696r81l220L729p11j998L553r71j039J456j411
840d59M80l55j596L340j326k123M000j706k152K895j425j210K330q21N65n4q84
857e01K725k415j572M127k457j388M298k089j038K538j210p65o06m5K297l278
873a379k80M185l684j269M318l455j405L501r02j126M53J032J829l443N34L903
889B812m497J43M335l897p67M463j825j536M36O54O43k855J016L343l565J389
905B92L518n267K63L719k081p41Q17O17P00k540L89J411l333J924K100m817J511
922a518L067l053M71N82m07K097j554j019J482j366K045O65k980K461P31k809
$$ plain form
938 -1105 341 -773 -2135 1840 883 -1670 -54 64 -208 -958 -1445 2023 1160 -104 3297 -321 -2400
955 -2400 3706 2122 -2241 1063 2513 201 -1712 -515 1398 -1816 6 4496 -2107 -4259 4026
970 4026 601 -5584 613 3665 -681 -2395 1045 582 -4694 -109 5543 -3176 -3531 6670 -139
985 -139 -7980 -44 3158 -2727 -2160 3609 656 -6034 709 5471 -4931 -2038 10226 1879 -6080
1000 -6080 2741 4138 -3386 -461 5953 1764 -4880 2424 4368 -8009 -3506 9292 390 -5649
1014 -5649 3486 2238 -6529 -2822 3822 -240 -3859 4866 4790 -9040 -4051 6981 -2158 -5131 5666
1029 5666 3034 -5550 -2258 1852 -3526 -4833 5480 5698 -6323 -1377 6363 -3437 -4586 6192
1043 6192 4510 -1019 1845 2919 -3623 -5359 3970 4394 -4013 987 6088 -3717 -5716 1529 728
$$ packed form
938a105J446j114j362L975r57k553J616J18k72p50m87L468q63j264L401l618k079
955b400O106j584m363L304J450k312j913J197J913l214J822M490o603k152Q285
970D026l425o185O197L052m346j714L440m63n276M585N652q719l55J0201o809
985a39p841P936L202n885N67N769k953o690O743M762j0402K893J2264q347p959
1000f080Q821J397p524K925O414m189o644P304J944j2377M503J2798q902o039
1014e649R135j248q767L707O644m062l619Q725p6j3830M989J1032r139k973J0797
1029E666k632q584L292M110n378j307J0313K18j2021M946P740r800j149J0778
1043F192j682n529K864J074o542j736R329M24q407N000N101r805j999P245q01
$$ plain form
1058 728 -1032 2551 3512 -1613 -4725 349 1214 -4288 1130 6983 -197 -2970 46 -1537 -2272 258
1074 258 2884 1349 -2560 -4 246 -5747 -2327 4901 1691 -379 1457 293 -1371 -2125 1036 2912
1090 2912 -407 1840 3368 -3963 -4117 1680 833 -881 1279 2657 292 -3858 -1233 1392 -2685
1105 -2685 505 5748 -1076 -3704 1452 534 -3129 -399 4134 2456 -2770 418 2167 -4990 -1843
1120 -1843 5164 -464 -3227 2978 1265 -4159 -2726 3114 1574 -2987 2420 4099 -4486 -1948 4604
1135 4604 -1475 -3185 4105 3052 -3010 -2138 2762 -255 -4587 2114 4042 -4283 -1326 4585 -2464
1150 -2464 -4191 3143 2713 -2483 -1041 3827 30 -4476 2034 3614 -3879 -364 5184 -2065 -3373
1165 -3373 2338 1289 -2657 -794 3312 183 -3494 1786 2505 -4392 -318 4331 -1261 -1641 2855
$$ packed form
1058G28j760L583R61n125l112N074Q65n502N418N853p180k773L016j583p35K530
1074B58K626j535l909K556K50n993L420P228l210k070J836j164j664p54L161J876
1090B912l319K247J528p331j54N797q47j714K160J378k365m150K625K625m077
1105b685L190N243o824k628N156r18l663K730M533j678n226L188J749p157L147
1120a843P007n628k763O205j713n424J433N840j540m561N407J679q585K538O552
1135D604o079j710P290j053o062Q72M900l017m332O701J928q325K957N911p049
1150b464j727P334m30n196J442M868l797m506O510J580p493L515N548p249j308
1165c373N711j049l946J863M106l129l677N280P19o897M074M649n592l80M496
$$ plain form
1180 2855 1213 -2039 -606 2333 404 -3021 1676 1965 -4017 -964 2429 -2099 -1907 1960 629
1195 629 -1765 -886 1526 269 -2534 1672 2346 -2793 -91 2387 -1520 -1260 1616 809 -584 -625 1556
1212 1556 402 -2385 950 1819 -2200 9 2070 -968 -780 1169 1015 481 182 1813 1201 -1761
1228 -1761 724 1299 -2372 -408 941 -1346 -1370 -280 -196 -533 -1123 892 700 -1789 415 1286 -1800
1245 -1800 -307 1145 -753 -229 -99 267 277 -1057 847 996 -1379 158 1012 -1612 -193 416 -682
1262 -682 -147 82 375 650 -521 1202 1631 -373 1069 1623 -551 527 505 -427 -13 -799 -406 -7
1280 -7 -1492 -112 660 -1398 371 714 -804 116 316 -317 202 -674 57 537 -1027 175 889 -1290
1298 -1290 234 720 -875 42 -144 -580 -60 -817 -103 782 -1028 704 1270 -305 835 1299 -192
$$ packed form
1180B855j642l252J433K939j929l425M697K89n982L053L393m528J92L867j331
1195F29k394Q79K412j257k803M206O74n139K702K478l907K60K876q07j393m1K181
1212A556j154k787L335Q69m019K209K061l038J88J949j54n34k99J631o12k962
1228a761K485N75l671J964J349k287k4J090Q4l37n90K015j92k489K204Q71l086
1245a800J493J452j898N24J30L66J0j334J904J49k375J537Q54k624J419O09j098
1262f82N35K29K93K75j171J723M29k004J442N54k174J078k2r32M14p86L93L99
1280gj485J380P72k058J769L43j518R20K00o33N19q76P31M80j564J202P14k179
1298a290J524M86j595R17j86m36N20p57P14Q85j810J732N66j575J140M64j491
$$ plain form
1315 -192 785 490 114 539 -761 218 92 -1204 152 170 -1460 285 516 -816 458 223 32 418
1333 418 -281 349 389 -827 783 420 -950 694 298 -889 247 -91 -734 -126 -422 -124 -363 -838
1351 -838 598 -469 -1042 1047 486 -548 995 300 -294 487 124 34 -176 -364 593 -613 -1170 987
1369 987 -259 -1027 962 130 -591 951 658 420 328 287 978 -176 -168 1298 -288 -434 761 -602 -893
1388 -893 559 -384 -810 -323 -140 65 -561 -382 804 -425 -316 1030 -941 -594 1281 -141 -258 811
1406 811 -51 324 -548 -306 480 -684 103 392 -1183 48 819 -901 -340 764 -37 209 548 255
1424 255 355 60 1169 465 -1310 516 689 -1716 -227 971 -1122 -97 865 -55 -706 -79 1021
1441 1021 -502 -1035 1920 1147 -1570 625 708 -1834 -117 1610 12 -661 822 1034 -1903 -1485 1630
$$ packed form
1315a92R77k95l76M25j300R79j26j296J356J8j630J745K31j332J274k35j91L86
1333D18o99O30M0j216J610l63j370J644l96j187J136l38o43O08k96K98k39m75
1351h38J436j067n73K089n61j034J543o95n94P81l63r0k10j88R57j206n57K157
1369I87j246p68J989q32p21J542k93k38r2m1O91j154QJ466j586j46J195j363k91
1388h93J452r43m26M87J83K05o26J79J186j229J09J346j971L47J875j422j17J069
1406H11q62L75q72K42P86j164P87K89j575J231P71j720N61J104q01K46L39k93
1424B55J00k95J109p04j775J826J73k405J489J198k093J025R62r20o51O27J100
1441A021j523n33K955p73k717K195Q3k542J717J727j598o73J483K12k937M18L115
$$ plain form
1458 1630 -151 -2167 1077 456 -2581 36 1410 -1060 -651 1780 1374 -1562 -938 1904 -486 -1541
1474 -1541 2282 759 -2667 477 1112 -2247 -819 2247 1884 -1129 251 2248 -1459 -1865 2160 472
1490 472 -1787 1969 1576 -2238 -1208 1467 492 -1236 931 2288 -1651 -1842 1198 -1273 -2501 1540
1506 1540 1191 -2184 -1012 807 -330 -1307 815 2488 -450 -628 1967 -1465 -2280 1449 1315 -585
1522 -585 538 1412 -465 -1781 -205 1371 -351 499 2225 -339 -1702 735 -14 -1199 376 1315
1538 1315 654 -934 -443 592 -987 -715 1407 -226 -1244 290 -810 -1470 -525 552 1190 -35
1554 -35 -518 490 -745 -1078 850 772 160 852 300 -267 -1053 -773 826 -311 -207 1760 306 -1203
1572 -1203 282 15 -897 -121 662 830 -758 -172 1046 -861 -1229 1315 637 -1345 421 513 -800
$$ packed form
1458A630j781k016L244o21l037K617J374k470M09K431m06k936O24K842k390j055
1474a541L823j523l426L144O35l359J428L066l63l013J380J997l707m06M025j688
1490D72k259L756l93l814J030K675r75j728K167J357l939j91L040k471j228M041
1506A540l49l375J172J819j137r77K122J673k938j78K595l432q15L729j34j900
1522e85J123Q74j877j316J576J576j722Q50J726k564j363K437p49j185J575R39
1538A315o61j588M91J035j579K72K122j633j018J534j100o60R45J077O38j225
1554c5m83J008j235l33J928p8o12O92n52n67p86K80J599j137J04J967j454j509
1572a203J485k67r12P76P83J68j588N86J218j907l68K544o78j982J766R2j313
$$ plain form
1589 -800 -430 915 731 -1082 -110 1426 -1169 -1877 1749 795 -1072 1053 1525 -888 -1085 603 653
1606 653 -1510 347 2378 -863 -1444 1506 -249 -2148 562 1170 -894 -744 973 365 -1919 -267
1622 -267 1830 -1186 -1338 1941 144 -1857 584 1402 -936 -455 970 252 -1779 -5 1719 -846
1638 -846 -768 2132 109 -1606 673 636 -1091 -580 1515 854 -906 428 1534 -1252 -1251 1385 135
1655 135 -1049 850 982 -755 -858 389 299 -1362 180 1253 -958 -868 1558 -68 -1071 552 447
1672 447 -913 -711 407 287 -815 249 1323 -814 -838 362 -497 -1134 309 479 -427 -273 392 291
1690 291 -821 99 1219 -327 -232 1462 675 -264 543 255 -146 -336 437 559 -947 -119 758 -421
1708 -421 -415 685 -245 -470 353 310 40 -507 142 512 -987 -568 418 -994 -829 652 -257 -294 -184 40
$$ packed form
1589h00L70J345j84j813R72J536k595p08L626r54j867K125M72k413j97J688N0
1606F53k163J857K031l241n81K950j755j899K710O08k064J50J717o08k284J652
1622b67K097l016j52L279j797k001K441Q18k338M81J425p18k031J774J724k565
1638h46P8K900k023j715K279l7j727N11K095o61j760J334J106k786JK636j250
1655A35j184J899J32j737j03J247r0j661J542J073k211R0K426j626j003J623j05
1672D47j360K02J118j20j102J064J074k137k4J200q59o37J443J70r06J54O65j01
1690B91j112R20J120j546R5J694p87r39Q07k88m01j90P73J22j506Q28Q77j179
1708d21OJ100r30k25Q23m3k70n47O49L70j499M19R86j412J65J481r09l7J10K24
$$ plain form
1728 40 -199 -674 -206 523 -413 290 1256 206 51 857 249 74 62 445 326 -300 31 797 -592 -296
1748 -296 641 -396 -187 427 57 133 196 452 271 -390 -468 49 -956 -547 226 -373 -193 -81 -81 -150 -470
1769 -470 -329 159 -417 130 479 -418 -279 390 -387 -169 98 174 233 16 280 661 -134 273 422 -636
1789 -636 -248 482 -64 260 519 111 270 -280 107 207 -668 123 293 -522 52 481 -585 -292 181 -308
1809 -308 30 70 290 130 -220 181 102 -760 -98 66 -743 -84 200 -462 219 164 198 229 -140 270 164 -156
1831 -156 483 234 -491 131 86 -501 -204 -114 -80 161 71 340 91 -358 504 -205 -326 266 344 -458 411 101
1853 101 -133 68 134 181 -172 -244 488 -293 -423 525 -252 -640 -20 80 -413 3 147 -15 187 -31 579
1874 579 -135 -432 715 -254 -383 482 -129 -479 132 129 -177 -131 -105 196 -249 182 599 -117 -81 683 -177
$$ packed form
1728D0k39m75M68P29r36P03R66j050j55Q06o08j75j2L83j19o26L31P66j389K96
1748b96R37j037K09O14l70P6O3K56j81o61p8N17j005M09P73n99J80J12%o9l20
1769d70J41M88n76N47L49q97J39O69p77K18K67P6N9k17K64L81p95M07J49j058
1789f36L88P30n46L24K59m08J59n50L87J00q75P91J70q15N74M29j066K93M73m89
1809c08L38M0K20j60l50M01p9q62O62J64q09O59K84o62O81n5L4L1l69M10j06l20
1831a56O39k49p25O22m5n87K97R0L4K41r0K69k49m49Q62p09j21N92P8q02Q69l10
1853A01k34K01O6M7l53p2P32p81j30R48p77l88O20J00m93M16J44j62K02k18O10
1874E79p14k97J147r69j29Q65o11l50O11ll06M6K6L01m45M31M17p16L6P64q60
$$ plain form
1895 -177 -149 342 -142 -283 220 164 -6 -442 94 83 -586 46 566 -426 -304 634 -243 -41 441 151 -304
1916 -304 -296 401 133 -475 224 321 -826 -86 398 -733 -332 649 -165 -127 239 331 45 -485 582 310 -665
1937 -665 458 574 -746 -336 664 -429 -407 195 115 -521 -455 661 -7 -637 920 820 -804 43 747
1956 747 -609 -468 396 -111 -692 -22 376 -693 -773 706 273 -762 550 628 -531 -104 508 -51 -523
1975 -523 139 463 -631 -792 528 -166 -917 611 447 -486 364 633 48 -289 259 601 -394 -209 800
1994 800 -240 -870 259 26 -667 230 230 -493 -245 29 83 -318 -200 649 -174 -284 333 -64 -146 341 116
2015 116 -57 -17 -151 -131 -376 -265 343 -179 -305 180 -245 -396 212 -36 168 495 -35 218 -191 -339 -7
2036 -7 103 12 -123 -92 -6 -78 -309 234 -140 -110 205 473 -325 272 243 -241 -6 67 -70 -341 -553 264 -93
$$ packed form
1895a77K8M91m84j41N03n6j70m36N36j1o69O32N20r92J22R38q77K02M82k90m55
1916c04QO97k68o08O99R7j147P40M84j131M01R81q14L8L66R2k86n30J067k72r75
1937f65J123J16j320M10J000j093K2O02q0o36O6J116o68o30J557j00j624Q47P04
1956G47j356J41Q64n07n81O70L98j069q0J479m33j035J312P8j159M27O12n59m72
1975e23O62L24j094j61J320o94p51J528j64r33Q50K69n85l37N48L42r95J85J009
1994H00j040o30J129k33o93Q97%p23K48K74N4m01J18Q49q23j10O17l97q2M87k25
2015A16j73M0j34K0k45J11O08n22j26M85m25j51O08k48K04L27n30K53m09j48L32
2036gJ10r1j35L1Q6p2k31N43l74L0L15K68p98N97k9m84K35P3j37k71k12Q17l57
$$ plain form
2059 -93 -551 482 321 -191 -33 265 -426 -424 69 362 -82 -85 698 -148 -748 639 286 -380 632 579 -269
2080 -269 -111 -44 246 -575 -446 354 -286 -703 757 320 -701 358 825 -160 -163 418 78 -755 -158 704
2100 704 -250 -642 599 -187 -861 266 489 -190 9 757 412 -632 -402 506 -569 -549 933 253 -424
2119 -424 351 279 -481 -238 418 247 -235 59 779 -353 -564 591 45 -626 304 330 -386 -204 250 245 -116
2140 -116 51 676 -449 -629 334 -308 -332 613 584 -33 271 -265 118 -344 67 708 -152 -491 157 -199
2160 -199 -606 -84 -142 -71 15 340 425 -128 -67 697 -126 -198 286 -244 -528 -65 -187 -103 -175 111 153 -164 -345
2183 -345 431 118 35 988 523 -7 156 -184 -188 -472 -16 325 -158 -46 490 -402 -470 260 60 -144 10
2204 10 102 -80 -88 38 288 -318 -264 402 -339 -47 169 188 68 145 146 46 -386 -547 306 -36 132 681 125
$$ packed form
2059i3m58J033j61n12J58K98o91KM93K93m44lP83q46o00J387l53o66J012n3q48
2080b69J58O7K90q21J29Q00o40m17J460m37j021J059M67r85lN81l40q33N97Q62
2100G04r54l92J241p86o74J127K23o79J99P48l45j044K30R08j075K0J482o80o77
2119d24P75p2p60K43O56j71m82K94P20j132k11J155n46o71R30K6p16J82M54nl61
2140a16J67O25j125j80R63o42k4R45k9o17L04n36L83m62M11O41q60l39O48l56
2160a99m07N22n8P1Q6L25Q5n53O1P64q23p2M84n30k84M63j22Q4p2K86M2l17j81
2183c45P76l13q3R53m65n30J63l40mk84M56L41m83J12N36q92o8P30k00k04J54
2204A0R2j82qJ26K50o06N4O66p41K92K16J9j20P7Jj00m32j61Q53l42J68N49n56
$$ plain form
2227 125 -85 99 -74 -274 121 225 320 -135 -223 -65 -364 -277 99 -182 -133 183 72 -98 104 128 165 -467
2249 -467 -361 230 -606 -220 522 83 84 89 -85 -123 -183 96 3 14 341 563 -48 -347 -31 -128 -261 67 -22
2272 -22 120 112 167 71 -313 -236 374 -157 -13 307 -137 -106 316 -135 -19 -16 -137 -10 -190 -59 262 -150 186
2295 186 144 -331 -244 71 -287 21 190 265 -3 -35 -125 -107 -302 -116 169 -227 139 435 -104 163 -109 -205
2317 -205 -105 -420 101 136 -121 194 391 -165 124 108 -32 210 40 227 437 147 -8 -109 -443 -133 -229
2338 -229 -327 116 98 71 239 226 -293 59 -164 -162 94 117 398 -11 -90 163 -68 -210 137 -241 -217 -111 -55
2361 -55 -10 292 92 -38 -83 115 149 -118 130 612 -21 -23 252 -196 -306 -161 -291 -284 -233 24 -4 -439 11
2384 11 120 -335 -40 520 -56 -19 495 109 10 -187 -136 -296 -468 -144 237 -272 392 190 -30 -78 229 -17
$$ packed form
2227A25k10J84j73k00L95J04R5m55q8J58k99Q7L76k81M9L16j11j70K02K4L7o32
2249d67J06N91q36L86P42m39JNj74l8o0K79r3J1L27K22o11k99L16r7j33L28q9
2272b2J42qN5r6l84P7O10n31J44L20m44L1M22m51J16Lj21J27j80J31L21m12L36
2295A86m2m75Q7L15l58L08J69P5k68l2r0J8j95J86K85l96L66K96n39K67k72r6
2317b05J00l15N21L5k57L15J97n56K89j6j40K42j70J87K10k90j55j01l34L10r6
2338b29r8M43j8k7J68j3n19L52k23KK56K3K81m09p9K53k31j42L47l78K4J06N6
2361e5M5L02k00j30m5J98L4k67K48M82o33kK75m48j10J45j30PN1K57k8m35M50
2384A1J09m55K95N60n76L7N14l86r9j97N1j60j72L24L81n09O64k02k20m8L07k46
$$ plain form
2406 -17 -25 -57 120 -9 32 121 -132 -320 -150 149 -264 132 360 -234 -237 339 -43 -267 -323 83 103 -454 19
2429 19 36 -170 -81 38 -235 -39 332 56 -143 -198 271 -53 -59 136 -190 -290 113 163 -256 210 339 9
2451 9 61 -70 3 -81 -328 362 126 -375 416 97 -230 260 38 -384 40 238 263 36 -182 -19 -310 -341
2473 -341 103 -101 -198 339 149 -159 170 12 42 -85 -150 149 -26 -27 227 -223 -220 221 -121 -152 190 30 68
2496 68 -162 25 181 -244 199 271 -266 -298 193 188 69 229 -43 169 -85 -210 -141 208 -107 57 58 113 -312
2519 -312 -561 73 -7 97 292 438 14 173 166 -218 -50 35 -275 -187 -416 -155 -146 -286 28 -3 -241 -164 198
2542 198 -187 117 -291 208 236 147 231 42 -362 68 209 -199 365 187 246 -85 -81 111 -94 -104 251 -57
2564 -57 -139 266 -38 -464 216 118 -211 118 155 -29 -91 -282 242 11 -397 420 -33 -283 129 53 -255 42
$$ packed form
2406a7ql2J77j29M1Q9k53j88J70K99m13L96K28n94lN76l82k24n6M06K0n57M73
2429A9J7k06Q9J19k73J96L71k76j99n5M69l24oJ95l26j00M03N0m19M66J29l30
2451IN2j31P3q4k47O90k36n01P91l19l27M90k22m22M24J98K5k27k18J63k91l1
2473c41M44k04r7N37j90l08L29j58L0j27o5K99j75jK54m50LM41l42l1L42j60L8
2496F8k30J87J56m25M43P2n37l2M91nj19J60k72K12k54j25O9L49l15J64JN5m25
2519c12k49O34q0J04J95J46m24J59pl84J68Q5l10Q8k29K61Rj40L14l1k38P7L62
2542A98l85L04m08M99K8q9Q4j89m04M30J41m08N64j78N9l31MJ92k05j0L55l08
2564e7q2M05l04m26O80r8l29L29L7j84o2j91N24k31m08Q17m53k50M12p6l08K97
$$ plain form
2586 42 247 -78 -51 10 177 -297 -222 227 147 -159 340 -165 -181 31 74 194 158 60 392 -272 -118 301 -37
2609 -37 -112 34 1 -174 15 -30 195 8 121 118 20 -165 181 -196 -107 44 -19 -50 33 -127 -200 -129 -110 213 -10
2634 -10 170 332 -146 -369 220 210 210 155 252 48 -293 -251 270 -66 19 -12 -37 -89 -106 53 0 59 21 142 123
2659 123 -185 306 -97 -2 194 -44 60 65 42 -50 198 -41 90 -176 -277 32 39 -117 140 -97 45 63 89
2682 89 -20 -36 50 400 5 -183 196 -41 -190 -39 -119 35 217 -27 46 -142 54 164 78 -151 388 -65
2704 -65 -20 102 -90 37 100 -47 67 -178 49 -149 -46 -98 -5 -202 -122 56 -108 0 -114 30 -76 77
2726 77 103 205 66 -40 65 -23 -57 43 -33 -58 -52 -211 229 -61 246 74 -176 -137 107 31 -26 251 141 130
2750 130 72 -222 57 -162 162 24 -362 -82 35 -159 -41 306 -183 70 -13 -24 85 -138 35 99 -100
$$ packed form
2586D2K05l25K7O1J67m74P5M49q0l06M99n05j6K12M3J20l6r8L32o64J54M19l38
2609c7p5J46l3j75J89m5K25j87J13lr8j85L46l77Q9J51o3l1Q3j60p3P1J9L23k23
2634a0J80J62m78k23N89j0%n5R7k04l41M2N21l36Q5l1k5n2j7J59n3N9l8J21j9
2659A23l08M91m03R5J96k38J04Nk3r2K48k39J31k66j01L09Pj56K57k37J42J8K6
2682H9j09j6Q6L50l95j88L79k37j49J51q0J54J82k44P3j88J96J10q6k29N39m53
2704f5M5J22j92J27O3j47J14k45K27j98J03n2R3j97Q0J78j64J08j14J44j06J53
2726G7K6J02j39j06J05q8l4J00p6k5Oj59M40k90L07j72k50L9K44p6n7K77j10j1
2750A30n8k94K79k19L24j38l86K80J17j94J18L47m89K53q3j1J09k23J73O4j99
$$ plain form
2771 -100 67 188 -158 151 35 -135 26 139 267 -98 78 -74 129 -46 55 51 -354 -113 89 -29 -5
2792 -5 23 36 -56 19 120 47 -41 151 153 -114 71 238 -50 -11 123 -97 -65 24 31 51 -18 160 -48 -34 302 125
2818 125 -158 205 246 -19 193 -147 40 -217 -133 3 -63 -56 -62 53 -202 343 -16 -80 56 -16 -114 146 109 -159
2842 -159 -37 -23 -25 -164 -155 254 -79 -483 229 3 -286 65 109 -134 117 8 -23 -134 91 249 -332 -77
2864 -77 215 -222 -70 147 -218 -68 0 -62 45 -175 -130 96 -107 -131 271 -292 -38 104 -3 -120 -6 -16
2886 -16 24 -58 -53 -84 -130 134 127 -225 34 392 -77 35 161 116 -24 50 40 210 -183 20 215 -297 -87 76
2910 76 -203 85 73 99 -35 -143 19 -182 -39 125 -93 -29 252 340 89 -28 -4 -34 47 45 55 -267 25 181
2934 181 30 -117 361 17 -109 29 -41 -309 -52 57 -82 -125 -150 153 -176 -31 185 -108 -171 19 24 -68
$$ packed form
2771a00J67J21l46L09j16j70J61J13J28l65J76j52K03j75J01mm05K41K02j18K4
2792eK8J3r2P5J01p3q8J92Kk67J85J67k88L9J34k20L2Q9PK0o9J78k08J4L36j77
2818A25k83L63M1k65K12l40J87k57Q4J36o6PoJ15k55N45l59o4J36p2r8K60l7k68
2842a59J22J4kj39RM09l33m04P12k26k89L51M4k43K51j09l1j11K25J58n81K55
2864g7K92m37J52K17l65J50O8o2J07k20M5K26k03k4M02n63K54J42j07j17J14j0
2886a6M0q2Nl1m6K64pl52K59L58m69J12J26m5j40P4j0J70l93K03J95n12K10J63
2910G6k79K88j2K6j34j08J62k01J43J64k18O4K81Q8k51j17K4l0Q1kJ0l22K92J56
2934A81j51j47M78l44j26J38p0k68K57J09j39m3k5L03l29J45K16k93o3J90Nr2
$$ plain form
2956 -68 74 -38 -56 -221 270 103 62 -114 119 -135 -73 255 -65 -21 253 -82 -252 -107 -26 -103 70 150 -14
2979 -14 -11 -285 89 -264 109 48 -14 -48 -76 15 -128 7 18 -144 5 172 234 -38 -129 281 42 66 -3 34 -159
3004 -159 -126 -165 -379 225 -17 92 -339 -198 224 -279 22 155 -209 74 87 -180 -154 -171 143 109 -63 246
3026 246 219 -206 50 257 -25 -60 248 -157 120 13 90 100 -123 -125 127 -292 121 -72 -217 -37 19 -121
3048 -121 83 -73 13 -59 -245 -21 32 15 -100 83 -173 124 -4 -142 156 34 106 209 -183 46 -123 -129
3070 -129 268 179 -50 25 72 -280 64 122 -149 278 -96 113 167 -100 28 114 -75 247 -77 -189 111 -61
3092 -61 74 -10 -68 -144 -194 -41 -13 63 -16 31 205 -60 291 -63 54 148 -11 252 295 -99 5 73 -31 50
3116 50 -79 -115 172 -106 71 -133 -208 -253 185 -70 227 108 112 98 -152 50 109 33 191 70 -50 3 -55 71
$$ packed form
2956f8J42j12j8j65M91j67m1j76K33k54O2L28l20M4K74l35j70J45Q1p7J73Q0j64
2979a4Lk74L74l53L73o1o2l4k8R1j43J35J1j62J49J67O2k72r1M10k39K4o9L7j93
3004a59L3l9k14O04k42J09m31J41M22n03L01J33l64K83J3k67K6j7L14l4j72L09
3026B46k7m25K56K07k82l5L08m05K77j07P7J0k23kK52m19M13j93j45J80N6j40
3048a21K04j56Q6p2j86K24N3j7j15J83k56K97j28j38K98j22P2J03l92K29j69o
3070a29L97q9k29P5M7l52L44N8k71M27l74K09N4k67J28Q6j89L22l24j12L00j72
3092f1J35q4n8p6n0J53K8P6p9M7J74k65L51l54J17R4j59K63M3l94J04O8j04Q1
3116E0j29l6K87k78J77k04p5m5M38k55K97j19Mj4k50K02N9p6J58j21j20N3n8J26
$$ plain form
3140 71 -60 134 -57 217 -59 -81 240 -260 78 230 -374 100 -56 -284 100 -3 41 -116 -211 -5 -116
3161 -116 -296 -90 -85 162 48 218 -75 277 -224 -48 79 -25 161 161 -35 126 191 62 114 163 -67 164
3183 164 -269 -119 107 46 215 70 -141 101 -142 -70 101 102 79 131 -78 -123 136 20 84 -24 -156 104 -13
3206 -13 148 66 -34 -115 171 -189 61 -29 50 -93 -112 -54 229 274 -136 180 30 90 326 15 -131 144 -45
3229 -45 41 7 -103 -74 -97 70 -16 -85 -195 163 -160 -14 256 -230 59 185 165 -36 -44 82 111 85 149 -24
3253 -24 -238 179 98 -211 75 22 -127 120 33 7 26 -166 127 126 -281 100 -64 5 -62 236 -181 -46 -53 34
3277 34 51 -222 -116 188 -94 38 66 -194 -11 77 -119 60 179 15 99 69 202 -139 -170 32 -68 -15 -28
3300 -28 -33 -140 -89 96 -86 72 -178 142 157 -333 93 79 -150 -104 -143 -25 10 -59 -245 -168 158 7 46 50 -142
$$ packed form
3140G1j31J94j91K74k76k2L21n00L38J52o04M74j56k28L84j03M4j57r5K06j11
3161a16j80K06NK47j14J70k93L52n01J76J27j04J86%j96J61O5j29N2M9k30K31
3183A64m33J50K26o1J69j45k11K42k43P2J71Jk3N2k09m5K59j16O4j08j32K60j17
3206a3J61q2j00q1K86l60K50r0P9j43j9N8K83M5m10L16j50O0K36l11j46K75j89
3229d5Q6l4j10K9k3J67q6o9j10L58l23J46K70m86K89J26k0k01qJ26K9k6O4j73
3253b4k14M17q1l09K86n3j49K47q7k6J9j92K93jm07L81j64O9o7K98m17J35pQ7
3277C4J7k73J06L04k82J32K8k60J83Q8j96J79J19j64Q4l0J33l41l1K02j00N3j3
3300b8nj07N1J85j82J58k50L20J5m90M26j4k29M6l9J18L5o9j86P7L26j51L9Mj92
$$ plain form
3325 -142 -147 -174 94 -45 -66 55 109 -117 -19 -280 -130 60 -39 142 51 -69 -5 -216 174 13 155 118 108 -106
3349 -106 52 -23 -18 69 44 -63 -113 25 25 126 -161 -98 131 74 208 195 26 34 29 -14 126 -299 105 371 -134
$$ packed form
3325a42nk7K68j39k1J21N4k26R8k61J50J90r9J81r1j20O4k11L90j61J42l7j0k14
3349a06J58p5NQ7k5j07n0J38%J01k87O3K29n7J34j3j69Qnm3J40m25M04K66n05
$$ [...]
8191A20
##END NTUPLES=NMR FID
##END=
