##TITLE=1H_DE-80H_X3
 200.13MHz, d2o
 8 sc
 
 19ns.26.2.2025
##JCAMPDX= 6.0         $$ Bruker NMR JCAMP-DX V2.0
##DATA TYPE= NMR FID
##DATA CLASS= NTUPLES
##ORIGIN= UXNMR, Bruker Analytische Messtechnik GmbH
##OWNER= pz
$$ XWIN-NMR		Version 3.5
$$ Thu Apr  2 10:51:16 2026 Russian Standard Time (UT+4h)  Yarkov@DPX200
##.OBSERVE FREQUENCY= 200.1313
##.OBSERVE NUCLEUS= ^1H
##.DELAY= (6, 6)
##.ACQUISITION MODE= SIMULTANEOUS
##.ACQUISITION SCHEME= undefined
##.AVERAGES= 8
##.DIGITISER RES= 18
##SPECTROMETER/DATA SYSTEM= spect
##.PULSE SEQUENCE= zg30
##.SOLVENT NAME= CDCl3
##.SHIFT REFERENCE= (INTERNAL, CDCl3, 0, 14.3821)
##AUDIT TRAIL= $$ (NUMBER, WHEN, WHO, WHERE, WHAT)
$$ ##TITLE= Audit trail, XWIN-NMR		Version 3.5
$$ ##JCAMPDX= 5.01
$$ ##ORIGIN= Bruker BioSpin GmbH
$$ ##OWNER= Yarkov
$$ C:/Bruker/XWIN-NMR/data/yarkov2/nmr/H-C/1/audita.txt
$$ ##AUDIT TRAIL=  $$ (NUMBER, WHEN, WHO, WHERE, WHAT)
(   1,<2026-04-02 10:50:21.90 +0400>,<Yarkov>,<DPX200>,
      <created by zg, POWCHK disabled, PULCHK disabled
       configuration hash MD5:
       00 E9 B6 7A A2 85 ED C7 34 08 36 98 17 FE 4E 26
       data hash MD5: 16K
       96 5C 4C D8 D2 F3 1C 43 92 27 E5 1A 5B BF 63 A1>)
$$ ##END=
$$ 
$$ hash MD5
$$ 3A 2F 7A D4 C9 35 8C 25 E1 A3 7A F3 22 54 42 05
##$RELAX= 
##$RELAX= 
##$RELAX= 
##$RELAX= 
##$RELAX= 
##$RELAX= 
$$ Bruker specific parameters
$$ --------------------------
##$DU= <C:/Bruker/XWIN-NMR>
##$EXPNO= 1
##$NAME= <H-C>
##$PROCNO= 1
##$TYPE= <nmr>
##$USER= <yarkov2>
##$AMP= (0..31)
100 100 100 100 100 100 100 100 100 100 100 100 100 100 100 100 100 100 
100 100 100 100 100 100 100 100 100 100 100 100 100 100 
##$AQSEQ= 0
##$AQ_mod= 1
##$AUNM= <au_zg>
##$AUTOPOS= <>
##$BF1= 200.13
##$BF2= 200.13
##$BF3= 200.13
##$BF4= 200.13
##$BF5= 200.13
##$BF6= 200.13
##$BF7= 200.13
##$BF8= 200.13
##$BYTORDA= 1
##$CFDGTYP= 0
##$CFRGTYP= 5
##$CHEMSTR= <none>
##$CNST= (0..31)
1 1 145 1 1 1 1 1 1 1 1 1 1 1 1 1 1 1 1 1 1 1 1 1 1 1 1 1 1 1 1 1 
##$CPDPRG= <>
##$CPDPRG1= <>
##$CPDPRG2= <>
##$CPDPRG3= <>
##$CPDPRG4= <mlev>
##$CPDPRG5= <mlev>
##$CPDPRG6= <mlev>
##$CPDPRG7= <mlev>
##$CPDPRG8= <mlev>
##$CPDPRGB= <>
##$CPDPRGT= <>
##$D= (0..31)
0 0.7 0 0 0 0 0 0 0 0 0 0.03 0 0 0 0 0 0 0 0 0 0 0 0 0 0 0 0 0 0 0 0 
##$DATE= 1775112621
##$DBL= (0..7)
120 120 120 120 120 120 120 120 
##$DBP= (0..7)
150 150 150 150 150 150 150 150 
##$DBP07= 0
##$DBPNAM0= <>
##$DBPNAM1= <>
##$DBPNAM2= <>
##$DBPNAM3= <>
##$DBPNAM4= <>
##$DBPNAM5= <>
##$DBPNAM6= <>
##$DBPNAM7= <>
##$DBPOAL= (0..7)
0.5 0.5 0.5 0.5 0.5 0.5 0.5 0.5 
##$DBPOFFS= (0..7)
0 0 0 0 0 0 0 0 
##$DE= 6
##$DECBNUC= <off>
##$DECIM= 32
##$DECNUC= <off>
##$DECSTAT= 4
##$DIGMOD= 1
##$DIGTYP= 9
##$DL= (0..7)
0 120 120 120 120 120 120 120 
##$DP= (0..7)
150 150 150 150 150 150 150 150 
##$DP07= 0
##$DPNAME0= <>
##$DPNAME1= <>
##$DPNAME2= <>
##$DPNAME3= <>
##$DPNAME4= <>
##$DPNAME5= <>
##$DPNAME6= <>
##$DPNAME7= <>
##$DPOAL= (0..7)
0.5 0.5 0.5 0.5 0.5 0.5 0.5 0.5 
##$DPOFFS= (0..7)
0 0 0 0 0 0 0 0 
##$DQDMODE= 0
##$DR= 18
##$DS= 0
$$ [...]
##$SUBNAM2= <"">
##$SUBNAM3= <"">
##$SUBNAM4= <"">
##$SUBNAM5= <"">
##$SUBNAM6= <"">
##$SUBNAM7= <"">
##$SUBNAM8= <"">
##$SUBNAM9= <"">
##$SW= 18.0517328524113
##$SWIBOX= (0..15)
0 0 2 0 0 0 0 0 0 0 0 0 0 0 0 0 
##$SW_h= 3612.71676300578
##$TD= 16384
##$TD0= 1
##$TE= 0
##$TE2= 300
##$TE3= 300
##$TEG= 300
##$TL= (0..7)
0 120 120 120 120 120 120 120 
##$TP= (0..7)
150 150 150 150 150 150 150 150 
##$TP07= 0
##$TPNAME0= <>
##$TPNAME1= <>
##$TPNAME2= <>
##$TPNAME3= <>
##$TPNAME4= <>
##$TPNAME5= <>
##$TPNAME6= <>
##$TPNAME7= <>
##$TPOAL= (0..7)
0.5 0.5 0.5 0.5 0.5 0.5 0.5 0.5 
##$TPOFFS= (0..7)
0 0 0 0 0 0 0 0 
##$TUNHIN= 0
##$TUNHOUT= 0
##$TUNXOUT= 0
##$USERA1= <user>
##$USERA2= <user>
##$USERA3= <user>
##$USERA4= <user>
##$USERA5= <user>
##$V9= 5
##$VALIST= <valist>
##$VCLIST= <CCCCCCCCCCCCCCC>
##$VD= 0
##$VDLIST= <DDDDDDDDDDDDDDD>
##$VPLIST= <PPPPPPPPPPPPPPP>
##$VTLIST= <TTTTTTTTTTTTTTT>
##$WBST= 1024
##$WBSW= 4
##$XGAIN= (0..3)
0 0 0 0 
##$XL= 0
##$YL= 0
##$YMAX_a= 194681
##$YMIN_a= -189675
##$ZGOPTNS= <>
##$ZL1= 120
##$ZL2= 120
##$ZL3= 120
##$ZL4= 120
##$ABSF1= 10
##$ABSF2= 0
##$ABSG= 5
##$ABSL= 3
##$ALPHA= 0
##$AQORDER= 0
##$ASSFAC= 0
##$ASSFACI= 0
##$ASSFACX= 0
##$ASSWID= 0
##$AUNMP= <proc_1d>
##$AZFE= 0.1
##$AZFW= 0.1
##$BCFW= 1
##$BC_mod= 2
##$BYTORDP= 1
##$COROFFS= 0
##$CY= 83.5205535888672
##$DATMOD= 1
##$DC= 2
##$DFILT= <>
##$DTYPP= 0
##$F1P= 10.8118882576601
##$F2P= -7.23987719738617
##$FCOR= 0.5
##$FTSIZE= 0
##$FT_mod= 4
##$GAMMA= 1
##$GB= 0.15
##$INTBC= 1
##$INTSCL= 1
##$ISEN= 128
##$LB= 0.25
##$LEV0= 0
##$LPBIN= 0
##$MAXI= 10000
##$MC2= 0
##$MEAN= 0
##$ME_mod= 0
##$MI= 1.114404
##$NCOEF= 0
##$NC_proc= 0
##$NLEV= 6
##$NOISF1= 3.799351
##$NOISF2= 2.8
##$NSP= 1
##$NTH_PI= 0
##$NZP= 0
##$OFFSET= 14.38212
##$PC= 1
##$PHC0= -5306.548
##$PHC1= 6.821927
##$PH_mod= 1
##$PKNL= yes
##$PPARMOD= 0
##$PSCAL= 0
##$PSIGN= 0
##$REVERSE= no
##$SF= 200.129724274929
##$SI= 16384
##$SIGF1= 3
##$SIGF2= 2
##$SINO= 400
##$SIOLD= 16384
##$SREGLST= <1H.CDCl3>
##$SSB= 0
##$STSI= 0
##$STSR= 0
##$SW_p= 3205.1282051282
##$SYMM= 0
##$S_DEV= 0
##$TDeff= 0
##$TDoff= 0
##$TI= <>
##$TILT= no
##$TM1= 0
##$TM2= 0
##$TOPLEV= 0
##$USERP1= <user>
##$USERP2= <user>
##$USERP3= <user>
##$USERP4= <user>
##$USERP5= <user>
##$WDW= 1
##$XDIM= 8192
##$YMAX_p= 0
##$YMIN_p= 0
$$ End of Bruker specific parameters
$$ ---------------------------------
##NTUPLES= NMR FID
##VAR_NAME=  TIME,          FID/REAL,        FID/IMAG
##SYMBOL=    X,             R,               I
##VAR_TYPE=  INDEPENDENT,   DEPENDENT,       DEPENDENT
##VAR_FORM=  AFFN,          ASDF,            ASDF
##VAR_DIM=   8192,          8192,            8192
##UNITS=     SECONDS,       ARBITRARY UNITS, ARBITRARY UNITS
##FACTOR=    0.0002768,     1,               1
##FIRST=     0,             0,               0
##LAST=      2.2672688,     0,               0
##MIN=       0,             -189675,         0
##MAX=       2.2672688,     194681,          0
$$ Real data points
##PAGE= N=1
##DATA TABLE= (X++(R..R)), XYDATA
$$ [...]
1445G59R51o1M77O33p96p8o35j167o28j125q42l39n28Q07O89L79J487Q69N69J075
1465B496O7n29j32j260l16p43j040J69q1l38J403L23K20J258j70k01J53q05j68
1484C06m60j005K99k63k67J318pl13J319n46j99N31r61j62N0p90P85N7o7J319
1504I44l39j67J442p28o96M84j309m73R8q40M90j32j25J509O1J58J480q48k98
1523G11P96j333n02J68j130j95k1j24J023l43L53J382l96N87J217p88k8N21q91
1542A007nj77p77j61j052m18L13r27J73Q50q43R22J311J11Q87N61k58L18m15n4
1562A366k56j659k47J38j231O65P72n38Q53O00J84N71K3k7l94j105p3j95j045
1581a598N60n3n77J259R30K0O09J0K5Po71J27p59j190M60j60n99R89K2k3P94M56
$$ plain form
1445 759 1710 1649 2126 2759 1963 1885 1250 83 -545 -1670 -2512 -2851 -3379 -2572 -1883 -1504 -17 852 1421 2496
1465 2496 2563 2034 1902 642 326 -417 -1457 -1288 -1369 -1707 -304 19 239 1497 1327 1126 1279 474 306
1484 306 -154 -1159 -860 -1123 -1390 -72 -79 -392 927 381 182 713 -248 -410 -360 -1150 -365 -308 -375 944
1504 944 605 438 1880 1152 456 940 -369 -842 -744 -1584 -1094 -1226 -1351 158 219 377 1857 1009 711
1523 711 1507 174 -328 -160 -1290 -1485 -1506 -1630 -607 -950 -597 785 389 976 2193 1405 1377 1898 1007
1542 1007 1002 825 48 -113 -1165 -1583 -1270 -2197 -2024 -1174 -2017 -1095 216 327 1214 1775 1517 1835 1420 1366
1562 1366 1110 -549 -796 -658 -1889 -1224 -452 -990 -137 463 647 1218 1241 1214 820 -285 -358 -553 -1598
1581 -1598 -1038 -1091 -1668 -409 521 541 1150 1160 1185 1192 521 648 -111 -1301 -841 -1001 -1600 -611 -589 -612 182 638
1603F38M91mj42M06p84o11P99q75p00M11o05j76O94j41j8L7J04Q33k82N1Q42q39
1625A29j89J041p44k11Q47p94N8J65j22L99m56l20L75r95jP63j259j6Q58m66O69
1646b69Q52p9N11O2n1P33j030m70L31j773k27Q63j186M40O35k77J189O62J70O66
1666A752o85j73L00j495j80L40j469L26P04m84J087L46m2N53k92O4K78j129o6
1685b65K39j092P18P08p56P55N00l85N54o01m86k04r27J34K91o24J023O86j17
1704A51J328L79k01K66q59q76o15j076k84j87p17R84Q50K99J709O56j4N82l32
1723B043p77m86j219m99o01n06O26L71K06J380M25p8N60k30o04n85p84l19l17
1742a394k60O62L46N39J405K83L49L30m93p09p39j011o13o01l60M22j86P46J054
$$ plain form
1603 638 1129 1125 983 1389 605 -6 793 -82 -782 -371 -976 -1152 -458 -599 -617 -580 -476 357 75 126 968 129
1625 129 -60 981 237 26 873 79 137 302 180 579 123 -197 178 -817 -818 -55 -1314 -1330 -472 -938 -269
1646 -269 583 504 1015 1077 1026 1759 729 259 590 -1183 -1410 -547 -1733 -1293 -658 -935 254 916 1086 1752
1666 1752 1067 894 1194 -301 -481 -141 -1610 -1284 -580 -1064 23 369 327 880 588 652 930 -199 -265
1685 -265 -26 -1118 -400 308 -448 307 807 422 976 375 -111 -315 -1242 -1108 -817 -1441 -418 268 151
1704 151 1479 1858 1657 1923 1064 188 -427 -1503 -1787 -1974 -2691 -1707 -857 -558 1151 1807 1793 2375 2043
1723 2043 1266 780 -439 -938 -1539 -2045 -1419 -1048 -842 538 963 885 1445 1215 611 26 -758 -1077 -1394
1742 -1394 -1654 -992 -646 -107 1298 1581 1930 2260 1767 1058 319 -692 -1305 -1906 -2266 -1844 -2030 -1284 -230
1761b30J37Q74M04j57K71l8l73j6m71k9M14q07J99R0j131O6j39q93L31j95J0R86
1783f97L05Q51J306jO18L89j045j23p78j562k47p42o12O22rO86J140j5Q44M61
1803A391r00J68l83j202K84k41k71J245J71P64J317o3K41k11j449q58j114j813
1821b924m03n24k98J321R74J440K168Q66J165R07q99k83j166k036q09j596j151
1838c248K79m57M95J412N16J266J171j97O80k58o52q5o46p47L65m28J57N82k17
1857a2N79N42o55J39l53q49l5n23o05K25j05L73Q45R9R91Q10o5P36J04n04J26
1878A863q38p14m55j121n62M1p09L51L72J02J203N65N20J064J47K36K42p38m13
1897A156m65r64k22o22m36K27NK05Q64p3M78N01n41M17j80o02L84k48j53N30n
$$ plain form
1761 -230 -93 781 1185 1028 1299 1261 888 872 401 372 786 -21 178 268 -863 -797 -936 -1829 -1498 -1693 -1683 -697
1783 -697 -392 459 1765 1764 2382 2771 1726 1603 825 -737 -984 -1726 -2338 -1716 -1725 -1039 101 86 930 1391
1803 1391 491 659 276 -926 -642 -883 -1154 91 262 1026 2343 2280 2521 2310 861 3 -1111 -2924
1821 -2924 -3327 -3851 -4149 -2828 -1854 -414 1754 2620 3785 4692 3793 3510 2344 308 -501 -2097 -3248
1838 -3248 -2969 -3426 -2931 -1519 -1003 263 1434 1237 1917 1659 1007 922 276 -471 -106 -534 -377 205 -12
1857 -12 567 1109 454 593 240 -609 -644 -1167 -1772 -1547 -1652 -1279 -434 -335 656 1466 1401 2137 2241 1737 1863
1878 1863 1025 311 -144 -1265 -1827 -1786 -2495 -2144 -1772 -1670 -467 98 618 1682 1829 2065 2307 1569 1156
1897 1156 691 -273 -495 -1117 -1553 -1326 -1321 -1116 -252 -325 153 654 113 530 350 -252 132 -116 -269 261 256
1918B56J53M68l51L69J16q50N1l79q54M67l69m49P23m2K97P99l00O05K21q17N72
1939F86j89n73N02k75n21P95k09j00L79p36J19K1q56L26j93m89Q79J02j13J226
1959G81n4L61O52o26p7k04r56M4n04q38M99j47k39R43n8L74O81k27K26K48m20
1980D59K04k12o74N14m48l34P92m52l30M71n18J35J66k98L53L5JP13Q2P6P00o43
2002G92j90P2p23n73l25p68j01J65J75O46L63P88R94K39M66L88m95j95m44r97
2022B77n51q79o18k33n70L57O14M7Q31P94L43R36M97J43L0j81k2m57n57l70o33
2043b02r87j05m84n51K09l0N4O04O78R55Q91N89J029L94j58O52p19j473m25j565
2063f44j333n93j086l08J73J76J575J045J073K136N73L80J052n12o85n52j801
$$ plain form
1918 256 409 877 526 895 1011 161 212 -167 -1021 -554 -923 -1372 -649 -691 -394 405 105 710 931 114 686
1939 686 497 -76 426 151 -370 425 216 116 495 -241 -122 -101 -957 -631 -824 -1313 -434 -332 -445 781
1959 781 727 1088 1740 1114 1037 833 -123 -79 -583 -1421 -922 -1069 -1308 -365 -423 -49 632 405 631 879 459
1980 459 663 451 -223 291 -157 -491 301 -151 -481 -10 -528 -393 -227 -525 -172 -137 -136 577 659 735 1435 792
2002 792 602 674 -49 -622 -947 -1715 -1816 -1651 -1476 -830 -467 321 1315 1554 2020 2408 1913 1718 1274 277
2022 277 -274 -1153 -1771 -2004 -2574 -2217 -1603 -1556 -725 69 412 1348 1845 1988 2018 1837 1815 1358 801 431 -202
2043 -202 -1189 -1294 -1778 -2329 -2120 -2150 -2096 -1492 -814 141 1032 1621 2650 3044 2886 3538 2819 1346 921 -644
2063 -644 -1977 -2570 -3656 -3964 -3791 -3615 -2040 -995 78 2214 2787 3167 4219 3707 3022 2470 669
2080F69j031q65j136o6l88k81J222J77O19J621j37K45R53l78n4L88p82J06n26
2099C56j68M90o84j10N02j133k37O45q97o3L69m45O63M81J55Q90k18K38P29n98
2119I65o7M30j045q2K54p99k9j61m02J75l95K05M57o50L57O69k54O73Q05l03L77
2140A180M2k87J14m69l26l04q79j1K36l97N26M46n32P24M47j92J82l98l22%m05
2161f25K85K40m39Q16N00r2Q12Q1m33k51m79n66n18o46j63l86k53Q80N18J30J155
2182E66M31K76P27q8k67j86q55j74o66p73J14n42l20P07o8J49Q48J88M61M02l2
2203H98L06l58m06K23p67l41L92p33J43M46k18M60M67j97M37l40m15K46p98l49
2223i04K57o96K16R02p6O97Q23QL70P9m89j64j260p79Nq68J48N31j80P95R92K37
$$ plain form
2080 669 -362 -1227 -2363 -2429 -2817 -3098 -1876 -1699 -1080 541 404 649 1602 1224 1170 1558 776 882 356
2099 356 188 678 -6 -116 386 -747 -984 -339 -1236 -1299 -930 -1375 -712 -231 -76 814 596 834 1563 965
2119 965 898 1328 283 201 455 -344 -373 -534 -936 -761 -1156 -951 -494 -1144 -787 -118 -372 301 1106 803 1180
2140 1180 1222 935 1049 580 254 -50 -929 -940 -704 -1101 -575 -129 -661 63 510 318 500 102 -220 -220 -625
2161 -625 -340 -100 -539 277 777 685 1497 1578 1145 894 415 -151 -669 -1315 -1478 -1864 -2117 -1237 -719 -589 566
2182 566 997 1273 2000 1912 1645 1459 604 430 -236 -1009 -895 -1437 -1757 -1050 -1118 -969 -121 67 528 930 898
2203 898 1204 846 440 663 -104 -445 -53 -786 -643 -197 -415 45 512 315 752 412 -3 243 -555 -904
2223 -904 -647 -1343 -1127 -225 -301 396 1219 1227 1597 1676 1187 1023 -237 -1016 -1011 -1879 -1731 -1200 -1380 -585 407 644
2245F44O69J13j17m7r38m93k58p40Q5M21l19Q83Q53k08M72J55o31p2n88n77k22
2266i15m82J24N70P9R25P92j93N34m9o32l11q35n72p9n81M60O35J03R34N22m1
2287I88M75l10p60m20p14o16m3l74N49Q09M11J032M48M8M18m00p69m93j084m60
2307a265k78k06J74O07M41J164L57J15J38l21l30n54o42l34j41j68O23M72M32
2326B84Q74J5J95O4p52m96o12q72j45k24p5N63L72N82R82K21M73L86n47j46k52
2347H90p05j24m60m58L16m62N2M44k79P2N38l69L08M79k44P38K42n8M74k75k91
2368H28K53j049k44k69q46MQ6k62O74K32K33J086J08r0N14m61j75J07j009J10
2388a70K6m04M70M9j21P01k56r8J11o84n5j6n50J34N27m37Q94L68K4Q80k54k35
$$ plain form
2245 644 1313 1426 1309 1262 324 -169 -427 -1167 -1082 -661 -980 -97 756 548 1020 1175 544 472 -116 -693 -915
2266 -915 -1397 -1273 -703 -624 301 1093 900 1434 1385 753 442 -393 -965 -1044 -1625 -1165 -530 -427 507 1029 988
2287 988 1463 1153 393 -27 -741 -1357 -1400 -1774 -1225 -416 -5 1027 1475 1523 1941 1541 772 279 -805 -1265
2307 -1265 -1543 -1749 -1575 -968 -527 637 994 1109 1247 926 596 42 -600 -934 -1075 -1243 -620 -148 284
2326 284 1158 1173 1368 1432 680 184 -428 -1300 -1445 -1669 -1744 -1181 -809 -227 755 976 1449 1835 1288 1142 890
2347 890 185 61 -399 -857 -541 -1003 -951 -507 -786 -714 -176 -545 -237 242 -2 736 978 920 1394 1119 828
2368 828 1081 32 -212 -481 -1327 -1323 -1237 -1499 -825 -593 -360 726 834 744 1258 797 622 729 -280 -170
2388 -170 -144 -548 -78 -29 -150 551 295 197 308 -376 -431 -447 -997 -863 -336 -773 121 489 513 1393 1139 904
2410I04K27p79m19j48q89RL4l42P00L00J85Q58O5R4M79m92q4p6p25j61j73n90
2432a023K91N2k10O58j31K03O95j39K22K70l19J55p8m31kl59m30J81k49k36L68
2453e12j96J78M66j52L86L92j9L11Kl5rl88j99j51m20j74j31l27R3%J23L41M3
2476c78M83L73Q0L56L18k15J06j79l88k31m42n13l7o14P1J02l22O98M93J9O50
2497D30K39J35N60k59O2Mo88j97k69p36J99m94m59N20p2Q8O44J62L11O67o7M99
2519A279rl57J55m18o90J37n61m84J51j91k4M14J10M72J73m9N16K7r8L91l68m40
2541A36L57m15j66J1m83J87q6k19K38Qr6N73j01J52P96k01K5K42m19j46j81n11
2563b99k40m67k08K59l1L24P76r0N74N72l1J21j82n54l68n29l19o1o46J25N38
$$ plain form
2410 904 1131 352 -67 -215 -1104 -1095 -1061 -1403 -703 -403 -218 640 705 799 1278 786 702 626 -99 -260 -433 -1023
2432 -1023 -732 -680 -890 -232 -363 -160 535 396 618 888 569 724 646 215 213 -146 -576 -395 -644 -880 -512
2453 -512 -708 -530 -64 -216 170 562 543 854 856 821 812 424 225 74 -346 -520 -651 -978 -885 -885 -762 -421 -378
2476 -378 105 478 558 914 1232 1017 1123 944 556 325 -117 -630 -667 -1281 -1210 -1108 -1430 -732 -239 -220 430
2497 430 669 804 1364 1105 1167 1171 483 286 17 -719 -520 -1014 -1473 -953 -1025 -937 -293 -131 180 847 780 1279
2519 1279 1270 913 1068 650 -40 97 -464 -948 -797 -988 -1012 -598 -488 -16 157 108 624 651 553 944 576 136
2541 136 493 78 -88 -77 -560 -373 -459 -678 -440 -432 -528 45 -56 96 892 691 716 958 539 393 212 -299
2563 -299 -539 -1006 -1214 -955 -986 -662 114 24 598 1170 1139 1260 1078 524 156 -373 -692 -753 -1399 -1274 -736
2584g36o9M81P13K0K64K10j99J39j75k61o9n00P1K31l49P1J95m92k8J09k74N9
2606e89j5J58J91K38O61M27j23K91k3m54j49m98o06m24l17N8J47L1O96J82J92
2627G4Q44N6l43P4m53l89Lk98l1K19N2O09J89k6M06m94m68J00o18n01j64k62K56
2650a165M29K45J076M42N5O20k05m15K9j006o53Op78j41L51Q7M53M32K99O94p5
2671G80k33M02o47m08K90m92j72J75q9K64L91R4L97l26k96K47n10k45J97p11l9
2692i31L71j34K96N26K1L64rJ50L21l84k41J53o24q2J34n47k5Jk32L33M6K83K88
2715G8J3K71M70l23J77Q9o66O6j19m58Op2j09K70JK78L35k84L61J00m16J65n2
2738A81m89P7j32o6J58J24R8K87j25M64n4j67l1j54m32N8j37j86M9j71K37K97
$$ plain form
2584 -736 -805 -324 389 409 673 883 684 823 648 387 318 -182 -111 120 -229 -158 37 -455 -483 -374 -648 -589
2606 -589 -604 -446 -255 -17 644 1071 948 1239 1216 762 613 115 -491 -915 -1232 -1174 -1027 -996 -300 -118 74
2627 74 918 974 631 705 252 -137 -134 -432 -463 -244 -192 417 606 580 986 492 24 124 -494 -995 -1159 -1421 -1165
2650 -1165 -736 -491 585 1027 1082 1702 1497 1082 1111 105 -548 -542 -1320 -1461 -1110 -1023 -570 -138 161 855 780
2671 780 547 949 302 -106 184 -308 -480 -305 -394 -130 261 355 752 426 130 377 -133 -378 -181 -892 -931
2692 -931 -560 -694 -398 128 149 513 504 654 975 591 350 503 -121 -203 -69 -616 -641 -640 -872 -539 -493 -210 78
2715 78 91 362 832 509 686 775 109 175 56 -402 -396 -468 -577 -307 -306 -28 307 23 384 484 68 233 181
2738 181 -308 -231 -363 -429 -271 -147 -49 238 113 577 523 356 325 171 -261 -203 -340 -526 -477 -648 -411 -114
2760a14j21N75n2p5L13j54j42M3j71p3k9j26J30r2j51J30r1m5L77j98m4J88r5
2783a7O0J3n3K4k27j8K94k40J38K74j32O3L54k90J26j52m83J45k93k15J29k33
2805g33J05M03O0L61N09o9J78K62n19K7l30l43q5m07n9K93l06L09L32o9K38J78
2827C35j84J17r1j79L9j35j5L23k51K91K28j03P7l2m80J71l46l57%j26O8L06n6
2850d00M71L49k57L15R0j91O6j64l58M0k45P0J05j64J14J98k81K88P4m11M25k97
2872a63K9K12j23J45K77r3J03J06l05J59j86k72m4k21l47K74k50K61K12n4M57
2893A77L8o9L41j0k43O0q2j19L7k58J30J13j89J14K4p6R8j44K1lk55J66qJ9n7
2918a75O3N4J82k06O6K77j81J9J39j56L3m5j24J08n1j82J31q0j81L60k49J28K13
$$ plain form
2760 -114 -235 340 288 213 526 372 230 273 102 29 0 -126 4 -88 -239 -109 -200 -245 132 -66 -110 78 -17
2783 -17 43 56 3 27 -200 -218 76 -164 -26 248 116 179 533 243 369 217 -266 -121 -414 -629 -500 -733
2805 -733 -628 -225 -165 196 705 636 814 1076 557 584 254 -89 -174 -581 -640 -347 -653 -344 -12 -81 157 335
2827 335 151 268 177 -2 37 -98 -113 210 -41 250 478 375 452 420 -60 111 -235 -592 -592 -718 -650 -344 -400
2850 -400 71 420 163 478 568 377 443 279 -79 -39 -284 -214 -109 -273 -159 39 -242 46 120 -291 134 -163
2872 -163 -134 78 -45 100 377 284 387 493 188 347 161 -111 -155 -376 -723 -449 -699 -438 -226 -280 177
2893 177 215 146 487 477 234 294 212 93 130 -128 2 115 -74 40 64 -12 86 -58 -37 -40 -295 -129 -137 -118 -175
2918 -175 -112 -58 124 -82 -16 261 80 99 238 82 115 70 -54 54 3 -179 -48 -128 -309 51 -198 -70 143
2941A43l25L03N5k18L73k65j07K95l07p5K10l34N1K09l97K35M7j52J53N3j27K97
2963A17O9LJ74j64J10l1j36j1r4k16Pm5k02J41j01j4M13k43J29K43k03K75k4l52
2987a55L40k4l44L67j81k1K77j55L2K23k32l9N0l47L5J1k33L16j92k7K36n0O9
3010d4K29K4L4n8MK2j38j87P3k4k40L37j20q1J19J00k7o5L3J76k20M0j9J32j17
3035a7J28q2J01J18j60J16m3p2j16j69m7Rl27J50J44k25L53K56M0K66J20K10q
3058G45k07j60j73n01J16k08k91K3K93j33K92J08L34O2J2J59p1l17J93k22j70
3079a16O6j00j40K58m5P4pk5J87j84p1J87j97k42M15j22m9K99j29K4J16j26J09
3102A82j10k71J33j14j37L20j50r6M35j02J8J05j52J98j84k26J27Jk17L28j56
$$ plain form
2941 143 -182 121 176 -42 331 66 -41 254 -53 -128 82 -252 -201 8 -389 -154 -107 -259 -106 -53 -180 117
2963 117 186 189 363 199 309 278 142 131 37 -179 -172 -217 -419 -278 -379 -393 20 -223 -94 149 -54 221 197 -155
2987 -155 185 161 -183 184 3 -18 259 104 136 359 127 88 138 -209 -174 -163 -396 -80 -272 -299 -63 -113 -44
3010 -44 185 209 243 185 189 211 73 -114 -41 -65 -305 32 -88 -169 -50 50 23 -42 -9 167 -53 -13 -32 100 -17
3035 -17 111 29 130 248 88 204 161 89 -27 -196 -243 -234 -561 -411 -267 -492 -139 117 157 423 543 753 745
3058 745 538 378 205 -296 -180 -388 -679 -656 -363 -496 -204 -96 238 300 312 471 400 83 276 54 -116
3079 -116 -50 -150 -290 -32 -77 -3 -10 -35 152 -32 -103 84 -113 -355 60 -62 -111 188 59 83 199 73 182
3102 182 72 -199 -66 -180 -317 3 -147 -243 192 90 108 213 61 259 75 -151 -24 -23 -240 88 -68
3123f8q0L99k01j6J57m01J31J37j76J40L7j03K74j22k0K49l23l5P7k93J04j28
3145b61q2J04J43mM39l3j42M10k41j47J45l04j96Kk73J74n2P5J69J5J69K32k58
3168H4J26O0k77Q2Ko7j2Q9l7R1j03M8j6k18o7R9l60J64J27r6P8J91M2K66M6J21
3194D63O1k35O8r5l83J09j56j17N7qK10r7n9K69k6r5J44q2k24L60j73M4J63N7
3218B55k1J1k93Q3Nm15L10m40M2L06k16J06K70pJ41K89r6L0rj68m9k2m42K69k01
3243b62j49L44j24L9K47k81K37K6k01K92j13k44K21j42M5J79j86J82J63j21k3
3264A29k5k69J58j58n7J21j21j82L15j25J58J21j21K91l9j17J80l2j64K05k88
3285b0o4J58k78P9J94l22P1Q9o9P2P7o2J07r1J64kj26J7K15k66J32R3K4n3m1k73
$$ plain form
3123 -68 -148 251 50 34 191 -210 -79 58 -118 22 59 -44 230 108 88 337 14 -21 56 -237 -133 -261
3145 -261 -343 -239 -96 -100 339 306 164 574 333 186 331 27 -169 -167 -440 -266 -318 -243 -74 -59 110 342 84
3168 84 210 270 -7 75 77 10 -2 87 50 141 38 86 70 -148 -215 -116 -476 -312 -185 -281 -203 -12 30 296 342 463
3194 463 524 289 357 262 -121 -12 -168 -285 -228 -236 -26 -123 -182 87 61 -34 110 28 -196 164 -9 35 198 255
3218 255 234 245 -48 35 40 -375 -65 -505 -463 -157 -373 -267 3 -4 137 426 330 360 351 183 134 112 -330 -61 -262
3243 -262 -411 -67 -191 -152 95 -186 51 77 -124 168 55 -189 32 -110 -65 114 -72 110 273 152 129
3264 129 104 -165 -7 -165 -222 -101 -222 -404 -89 -214 -56 65 -56 235 196 79 259 227 63 268 -20
3285 -20 -84 74 -204 -125 69 -253 -182 -93 -162 -90 -13 -75 32 -59 105 103 -23 -6 209 -57 75 168 192 139 98 -175
3311a75J74j05j09J91k68K27L1j47J32J97j31J19m2L7O9p4mJ8q2m7r3o4R4p4K
3336a24OL5J9L4J3O9K1j85K05M6j65P0l3l8J12k13O8J6j72J32m2l9R8r2J9J04
3362c6r3J94J28p3J26Nj96K54k08k6J77k25j7M9l00K5J01j87K36Mj66K06O7j45
3386a00L37k50L7R5k09J32R0l31J86L4j72K69j10m0K32j52j02K20l13J15J25j26
3408c3rK3k18L78k08lJ20J4p6P8j18J41O9k72J38N2j45K49j54o3J79k15l8J21
3432A0j47O2P5j04J77m4n3K94q2k50K90j89K3Nk64L6rj45J59Jq6K60j13Q1K89
3457B76j98M1K21k60J09%j83R6K8k50J58j07j18J00j03q1Q5K9M8O2K7J57q4KJ83
3482B38j01p1R7p0L5o3j28n6P2j09O9n9J79J33k27K8K13j50J12K6k23K49j34q7
$$ plain form
3311 -175 -1 -106 -215 -24 -292 -65 -34 -181 -49 148 17 136 94 131 200 126 122 140 58 11 -82 -146 -52 -126 -124
3336 -124 -118 -83 -64 -30 -17 52 73 -112 93 139 -26 44 11 -27 85 -128 -60 -44 -216 -84 -126 -165 -67 -159 -140 -36
3362 -36 -129 65 193 120 246 251 55 309 101 75 252 27 10 59 -241 -216 -115 -302 -66 -62 -228 -22 45 -100
3386 -100 237 -13 24 119 -90 42 132 -199 -13 21 -151 118 8 -32 200 48 -54 166 -147 -32 93 -33
3408 -33 -42 -19 -237 141 -67 -70 50 64 -12 66 -52 89 158 -114 24 76 -69 180 26 -37 142 -73 -111 10
3432 10 -137 -75 0 -104 73 29 -24 270 188 -62 228 39 62 67 -197 -161 -170 -315 -156 -155 -241 19 -94 -13 276
3457 276 78 119 340 80 189 189 6 102 130 -120 38 -69 -187 -87 -190 -271 -186 -157 -109 -47 -20 137 53 55 238
3482 238 137 66 163 93 128 65 -63 -119 -47 -156 -87 -146 33 166 -61 -33 180 30 142 168 -55 194 60 -27
3506b7J73j82Mj2JO0r9J0RP4q8J39J01p1m2P3k3O1k20N2P7r9J45j12j39R0J21
3533G6j30J01j00L1o4L7N6O9k14K28l1j15N3J9j40J36KP5Nk02K04l1j54J20K7
3558E8k16K45j54l5Rj4q0J12p7J20J37j78M0K7KJ27j62N9k0O6o2J47j94J14r5
3583b4kJ2k55J91J34j17o7J66o7Q1P3k6q7M0k8J59j28n4j4Lr0N0j45P0k7j20J26
3610a46K4J07L2K1j12K69J8l1N0k12n3N7K3j30k06J50jkJ18n0L9N9R7k7O7r9j0
3637E2L5j32J28o6r3J32r7N9rK9k8O3l4q3M8j07L5L9j01K07J7q6K20mk90J46k7
3664E3j65L3O6q4q5J7K69J1j11P9j41N6J13j04j41J19k73J88R9k7L7Jk5K12j78
3689A9l9L15k13j31J39p5j23J69o7j59N4m2J52o2q8J63j33m5K94j34J82o3q6J66
$$ plain form
3506 -27 146 -36 -32 -44 -43 17 -82 -72 -63 11 -77 62 163 92 50 123 100 161 -59 -7 70 -29 116 4 -135 -45 76
3533 76 -54 47 -53 -22 -86 -49 7 76 -138 90 59 -56 -3 16 -124 12 14 89 94 -108 96 65 -89 31 58
3558 58 -158 87 -67 -102 -93 -107 -187 -75 -152 -32 105 -73 -33 -6 -4 123 -39 20 0 66 4 151 -43 71 -24
3583 -24 -26 -14 -269 -78 56 -61 -128 38 -29 52 125 99 12 52 24 183 55 1 -13 -10 -100 -50 -195 -125 -152 -272 -146
3610 -146 -122 -15 17 38 -74 195 213 182 232 20 -33 24 47 -83 -289 -139 -140 -142 -24 -74 -35 24 121 94 161 62 52
3637 52 87 -45 83 17 -76 56 -41 18 9 38 10 73 39 -44 4 -103 -68 -29 -130 77 94 8 228 224 -66 80 53
3664 53 -112 -79 -13 -97 -182 -165 104 115 4 83 -58 -2 111 7 -134 -15 -288 -100 -1 -28 9 10 -15 197 19
3689 19 -20 295 82 -49 90 15 -108 61 -6 -165 -111 -153 -1 -63 -151 12 -121 -166 128 -6 176 113 27 193
3713A93J4K1l3j77k20J81j3k70J78o0pK53j26J51J28j4K1j18l1M9j43j25J39j10
3737a19PJ72j89R0j6Qp3n1K06k4J7N3o5M8K9P8Ml8N3j40J40j69j66K2j33NJ19
3764a32j19J92J16j0J01l8n5J00M7j25Q8k00l1Om0N0J0p0j1J30j42J1P5l7L5Q5
3790C6J23jj12J33k7r2J08j77J4p1q6n4R4KON9J09K3l0l9O2Q4q9p2J7m5K6k49
3818b48L42m2q2J03o6Q9p6j4J9O3k29oJ18r1P6pj9N4QK2J42j3pj3o2Oq7NJ4j4
3848a5p1N8J6n7O2q8P6N1j45J51k2j19O1J23j35J07k5p4K45j47K4O3r1n5N1k7
3874A7k11J23j25J52j42K09J00j87J39M3mN1J15q8j01j30J08Jj07k5J4L8j1nj20
3899a46J76P1j37R4J2n0l5o2N7m4l2PR0j24J52N0l5k9l2K0j0j27JJ2p2J26J11
$$ plain form
3713 193 207 228 195 18 -202 -21 -34 -304 -126 -186 -193 60 -66 85 213 199 220 102 71 120 -23 -148 -9 -119
3737 -119 -112 60 -129 -39 -55 -47 -120 -171 35 11 28 81 16 64 93 171 175 137 190 50 190 21 -145 -123 -256 -251 -132
3764 -132 -251 -59 57 47 148 110 55 155 202 77 165 -35 -66 -60 -100 -50 -40 -110 -121 9 -133 -122 -47 -84 -49 36
3790 36 159 158 46 179 152 60 168 -9 5 -66 -152 -206 -112 -110 -104 -45 64 87 57 18 80 164 75 3 20 -25 1 -248
3818 -248 94 52 -30 73 7 96 20 6 25 88 -141 -147 -29 -120 -44 -51 -70 -16 -8 14 156 143 136 123 61 67 -20 -15 -1 -15
3848 -15 -86 -28 -12 -69 -7 -95 -19 32 -113 38 16 -103 -42 81 -54 53 28 -46 199 52 76 139 48 -7 44 17
3874 17 -194 -71 -196 -44 -186 23 123 -64 75 118 114 165 280 192 91 -39 69 70 -37 -62 -48 -10 -21 -26 -146
3899 -146 30 101 -36 58 70 20 -15 -77 -20 -64 -96 -89 1 -123 29 79 44 15 -17 3 -7 -134 -133 -121 -193 -67 44
3926D4j7O3R4p5P3n1Q9m9j57J4q4L7j6j23J9R4q1l6R3n3J10M8j54%J67PM7p9N5
3955G9k8On1L3l3o6R3j67Q2j6k4P2K5q4O0R5o2K0q5M0M2j17J38o8J03%K5j36R5
3984G1p3k08J95j53J93j26j36L36j18m3J53R9K7n5r6j18J24k45K01P6l53J21J64
4007C6o9R4r2p1J66j65R9k8Q0j34J10KqJ27l8L0jj38J00k4j78k4o5J47j25M0L6
4034i3N2JJ95j25j8L9PrL0m0L6j11K1P3r5OJ54k11Q4J22k04O0j9ll6RN9J13K5
4063A22m9Q7l3j4j28P0M4j48%k8L6j9k3q9J99p4kJ19j16K7L6M9j6j8j0L2p6r6
4091a18Q9L7o9J97j09q4k6J1N8J08j34rJ37j43J33p3j45K63Oj92K19Nr9J23k36
4116e1l1K3o2K5M6o3M8m8Q5k8M7J03L7j30O2K4o4n3J98j57R2p4k8P5m6j18J53
$$ plain form
3926 44 27 90 184 109 182 131 220 171 14 28 -56 -19 -35 -158 -139 -45 -126 -162 -69 -122 -12 36 -118 -118 49 56 103 24 79
3955 79 51 57 6 39 6 -60 33 -134 -52 -68 -92 -20 5 -79 -19 76 14 34 -51 -11 31 -86 52 -16 87 87 112 -24 71
3984 71 -2 -210 -15 -168 25 -101 -237 99 -19 -62 91 190 217 162 66 -52 72 -173 28 104 -249 -128 36
4007 36 -33 61 -31 -102 64 -101 -2 -30 50 -84 26 28 20 147 109 139 138 0 100 76 -102 -126 -191 -44 -169 -129 -93
4034 -93 -41 -40 155 30 12 51 58 49 79 39 75 -36 -15 58 -37 -31 123 -88 -4 118 -86 -26 -45 -48 -84 -75 -16 97 122
4063 122 73 160 127 113 -15 55 99 -49 -49 -77 -41 -60 -83 -172 27 -47 -49 70 -46 -19 17 66 50 32 22 54 -22 -118
4091 -118 -29 8 -61 136 27 -57 -83 -72 -14 94 -40 -49 88 -55 78 5 -140 123 129 -63 156 161 62 185 -51
4116 -51 -82 -59 -121 -96 -50 -113 -65 -113 -28 -56 -9 94 131 1 63 87 23 -30 168 11 103 29 1 76 30 -88 65
4143F5j95J51q0N9J3j59J42J03J8p2O7K7j17M0Q2j36O1p3j7m1L8m9j99J57L3K5
4169e7L8R0K1j23J22MN0j29M7j5l2rJ15j20k9l9k5J28o6p1P9o2J11o0mJ31j12
4196a7O6J0Q6o0j83J32m6L4q0l1O4J6m5M2R4k8nM7m8L7k21K77j08l8om8M4P5n6
4225DJ87j63nKK2k13J26M4j75J43j15J02J85j57PJ23n6R4j89l9J07j47J28o0N8
4250A3j18O2L4MNj5Q5o2QQ9j56M7m3R3n6Q4J12n7n7l8R8o5j3q8l2M1j31j2K32
4279F4j4j06J43q6Q0N2k03lJ43m8p4Q8p5R6q5J9K6Q0j5lj33l3k1N2P4j6j32K04
4307G4J07k32J43L8L9q0l7q6K3n7M5J45k23L2M1P5k6K8j11Q5j07L9O6p4M6J4L0
4334C7k0J29j12Q0Nm0j8r8O1m8j18O4L4K4j21J09k9R2L9j04J1M6J1Q3l5mn5nj5
$$ plain form
4143 65 -130 21 -59 0 13 -146 -4 99 117 45 112 139 22 62 144 8 69 -4 -21 -62 -24 -73 -272 -115 -82 -57
4169 -57 -19 71 92 -31 91 95 145 16 63 48 16 7 122 2 -27 -66 -91 37 -29 -100 -21 -83 28 -32 -36 95 -17
4196 -17 49 59 145 85 -98 34 -12 22 -58 -89 -25 -9 -54 -12 82 54 49 96 48 85 -136 141 33 -5 -11 -59 -15 60 4
4225 4 191 28 23 25 47 -166 -40 4 -171 -28 -143 -41 144 -13 -6 117 61 155 -34 -73 34 -113 15 -45 13
4250 13 -105 -43 -9 -5 0 -15 70 8 16 105 -51 -4 -47 46 -10 74 186 129 72 34 132 67 54 -34 -66 -25 -156 -168 64
4279 64 50 -56 87 1 81 133 -70 -73 70 22 -52 36 -39 57 -28 -9 17 97 82 79 -54 -87 -108 -56 18 2 -130 74
4307 74 181 -51 92 130 169 89 52 -34 -11 -68 -23 122 -101 -69 -28 47 21 49 -62 23 -84 -45 21 -53 -7 7 37
4334 37 17 146 34 114 119 79 61 -37 24 -24 -142 -78 -44 -20 -141 -32 -61 31 70 -34 -23 23 34 117 82 78 23 18 3
4363Cm8K5j05K7r6J35oNM5M5j8O0J2N1q1O0K7Rj82P3j41M0ol9L3J9o6R8nn8J17
4394C3k4l7K0J07QJ5pj6k1J14j15j22M8Lj96J25j09J14m7qQ3oL9K9N9j29J49n
4422A04j58N6n5O7q8N2k14J33L7j1R0N4O5j92P6m2J80j28M7q2j44J11M7o8J3J29
4448G9j60J33j33J67J08k00J44j35Pm9RM6j47jJ01j09J85M7j21O1L9J18j57rj8
4473Er6J92j25j10J52j8M8o9j8J57j05P7q2rqj8L4k4J30k11P4Q7j41J10m2Lr5
4500a02N0m3j7o3K24k50K46l8N8k3j8J10j03M1n2k8j6k8K6j1j12J02k9N8Q7l9
4526C0j53J69m9N6P0j66R9o7M3M7k6Mj19rnP3j69J52O0j60K5N7P8O1q3K1K2j85
4554a24J28O9j25j3J7mL1N4k5R3k09P5P8j98J55N6j09J26j36J9J02q6J20K0p9
$$ plain form
4363 3 -45 -20 -125 -98 -194 -59 -65 -60 -15 30 12 72 84 135 54 114 141 150 -32 41 -100 -60 -66 -105 -72 -53 -119 -21 -26 -84 33
4394 33 9 -28 -8 99 107 122 115 99 78 192 77 -45 3 6 -190 -65 -174 -60 -107 -115 -32 -38 1 30 89 -40 109 104
4422 104 -54 2 -53 14 -74 -22 -236 -103 -66 -77 13 67 132 -60 16 -26 154 26 73 -9 -153 -42 5 -63 -50 79
4448 79 -81 52 -81 86 194 -6 138 3 10 -39 -30 16 -131 -132 -31 -140 45 92 -29 32 71 189 32 23 5
4473 5 -91 101 -24 -134 18 0 48 -21 -39 118 13 90 8 -1 -9 -27 7 -17 113 -98 -24 63 -78 32 -10 -7 -102
4500 -102 -52 -95 -112 -175 49 -201 45 7 65 42 24 134 31 72 20 -8 -24 -52 -26 -37 -149 -47 -76 -18 69 30
4526 30 -123 46 -3 53 123 -43 56 -11 32 79 53 57 -62 -71 -76 -3 -172 -20 40 -120 -95 -38 40 101 18 39 61 -124
4554 -124 4 73 -52 -65 -48 -52 -21 33 8 101 -108 -33 45 -153 2 58 -51 75 -61 -42 60 -26 94 114 35
4579C5l7nK1j5L4j00J23m1N%L8m3qj6M6r6P4j04J14r1L0l3J11j4N7q0L8lj0J21
4609A51j84l3J39j05P3k2j34J05n6k7K07r4J5pm9Q5L6p7k2L7nN7k56K24n0o4R8
4636D2j14mJ06j2j05P3MJ4P0j27J94j21K0P5k4l2j9j16L8j0n3L3N3k17J44J9Q7
4663A8N1n7K4N9j38P3O1j39J39j16M1N5p2q6P6kJ3j3j51J85j03O1poJ07o3k6R1
4691G5J4n3l7M2q7L5pj5J5n2L7O1p8j61J09J12mM0P1K9m7o9m6R7k12J09Lo7m4
4720a30L0K3j6N9p1k4M6Q6L4J3k2KkQ0k4r2M4J5J18q5j77JO7q9J02K3j35J43q5
4749f6O5N6p3J02m3q9Q8Lq7q2K34j24J03j37J9q5J66j20J09r4Q0m2j44LR8J3N6
4776IL4L6l3m7N2J00j79J16l8o1N0m8r6m0J5M2R8j92K20o0M8j9l2L0Ol6j4kP7
$$ plain form
4579 35 -2 -7 14 -1 33 -67 56 15 20 20 58 15 7 -9 37 -59 15 -89 25 -66 -36 -69 42 28 85 5 43 40 30 151
4609 151 -33 -66 73 -32 41 19 -115 -10 -66 -93 114 20 35 28 -21 64 100 23 1 38 33 90 -166 58 8 -56 42
4636 42 -72 -76 30 18 -87 -14 -10 4 74 -53 141 20 40 115 91 59 40 -76 -38 -48 -101 -68 -15 -232 -88 -69 18
4663 18 69 12 36 95 -43 30 91 -48 91 -25 16 71 -1 -87 -11 -13 0 -13 -164 21 -82 -21 -28 -34 73 10 -16 75
4691 75 89 36 -1 41 -46 -11 -18 -33 -18 -70 -33 28 -50 -211 -102 10 6 46 117 146 99 30 -16 81 -131 -22 -19 -86 -130
4720 -130 -100 -77 -93 -34 -105 -129 -83 3 37 50 28 30 28 108 84 -8 36 51 169 84 -93 -92 -25 -114 -12 11 -124 19 -66
4749 -66 -1 55 -18 84 41 -48 40 43 -44 -126 108 -16 87 -50 -31 -116 50 -70 39 -55 25 -17 -161 -158 -60 -47 9
4776 9 43 79 46 -1 51 151 -28 88 50 -11 39 -9 -105 -145 -130 -88 10 -182 38 -22 26 7 -25 5 11 -25 -39 -41 36
4805C6l9K4R3Mj79N3q3L2k6R7r4m6K56j13J2J0M7R1j01O8n0r8J05J2j75M2j0q1
4833a13J31Q7l6j0MM7j29j8L9K1o1N1J4l1M4r1R9p6K1l1M9n6k0N3j16jJ1Q7N9
4862B8M0j28N3P5J7m7p2L1qL7r8Q4K4j40J46j51K06j10Q5q2l7L0j0Np5J47j37
4889h7K02p5k9M1n1Pk9p8p2K18j17K2m8J21L7j08J18j00L3j33O8L8Ol6Q2L8m9
4916A9k6RJ8J2o5J54j13npON4j19J9n4Q3J9K4q1P9k1J02j47N4l0M3RJ2k6j58J32
4946dm3MJ54j66Q0o6J46j22qO2p8P2J6J7N3j24J02j14N7k2J3M2j24O0n4k6L9O4
4974C0j35J38J1j45M3J43j48L9M7n1J13q3M9k3Pn0l3l0J54o2nk7J3K0r4Q8l8J03
5002G4L4l5q1Q0jj09J00j7K4k6n7l7R6N1j09K5k7o5L4M1r6p5J87l8l8R2K0O3j04
$$ plain form
4805 36 -3 21 114 118 -61 -8 -91 -59 -85 12 -82 -128 128 15 27 37 84 175 74 142 92 -6 99 111 -64 -22 -32 -113
4833 -113 18 105 69 59 63 110 -19 -37 2 23 -38 13 27 -4 40 -51 48 -28 -7 -38 11 -45 -65 -12 -128 -129 -118 -31 28
4862 28 68 -60 -7 68 85 38 -34 -3 -11 26 -72 12 36 -104 42 -109 97 -13 72 -10 -47 -17 -27 -22 -97 50 -87
4889 -87 115 40 11 52 1 8 -21 -99 -171 47 -70 -48 -96 25 62 -46 72 -28 5 -128 -60 -22 -16 -52 30 68 19
4916 19 -7 2 20 32 -33 121 8 3 -4 2 56 -63 -44 -98 -15 4 28 -53 26 5 107 -40 14 -16 27 36 48 22 -136 -4
4946 -4 -47 -43 111 -55 25 -41 105 -17 -25 37 -41 31 47 64 117 -7 95 -19 38 16 29 71 -53 7 -47 -73 -34 30
4974 30 -105 33 44 -101 -58 85 -63 -24 23 -28 85 2 51 28 35 -15 -48 -78 76 14 9 -18 -5 15 -79 9 -29 74
5002 74 108 73 -8 72 71 -38 62 45 69 43 -14 -51 45 96 -13 12 -15 -80 -46 -5 -101 -176 11 -27 -65 27 47 110 6
5031FQ8j35K1R7j46O0k5n4j00QQ4Q2OO5n1K0L8OK7j11L0o5QN3n8l8J36j04j10
5060a62P3M1J74p7L5l5o2r1K7k8O6J27p1k0J0P3k1j18K7L0J2q2Q6p1m0J84o5P2
5088I4K7k8m1L1mj51J11l5n8OJ43j02k8Q3K5r8M4j4J7K9j10J48q4L5l8O6l3J1
5116D6j7M7k9j14R2K4K6N9j19m4J12O1j76J16o0o4Q9j19J49m3r1J6O6J3M2j02
5142b0L3J25j34K0j1J1K0l6j23L7%Q8j17N6k1Q2P8p7l4J6MJ07j29O3r7J06Qj15
5170f0O9J31j44N1Kn7q3Q7lO1m2p7J37j7q7J00m7l1K1o7J05k7mL7p3K0q7J01r8
5199h2m4J57q9k0k5K13j14K2l8N2L8l9O8o8j02P7n4O8l4NJ3J7j23R3OL5p7jQ7
5228D1r3J61j32K7R6j16k2j1p0J06o5J12j32Lj1K14r6n4M6N6O1j5k4j13M3l5P
$$ plain form
5031 6 94 -41 -20 77 -69 -9 -34 -88 -188 -180 -96 -14 -8 57 6 26 64 70 97 -14 16 -49 -41 12 -46 -84 52 -52 -162
5060 -162 -89 -48 126 49 84 49 -13 -104 -77 -105 -39 88 17 -3 7 80 59 -59 -32 -2 10 -72 14 -57 -97 87 22 94
5088 94 121 93 52 83 79 -72 39 4 -54 -48 95 -7 -35 48 73 -25 19 5 22 51 -59 89 5 40 2 68 35 46
5116 46 29 76 47 -67 25 49 75 134 15 -29 83 144 -32 84 24 -40 49 -70 79 36 -55 -39 27 40 82 -20
5142 -20 13 138 4 24 13 24 44 8 -115 -78 -78 10 -107 -51 -72 10 88 11 -23 -7 -3 104 -25 38 -59 47 55 -60
5170 -60 9 140 -4 47 49 -8 -91 -4 -7 54 12 -65 72 55 -32 68 21 -10 11 -56 49 22 18 55 -18 2 -85 16 -82
5199 -82 -126 31 -58 -78 -103 110 -4 18 -20 32 70 31 99 31 -71 6 -48 20 -14 -9 4 21 -102 -9 -3 32 -45 -46 41
5228 41 -52 109 -23 4 100 -16 -38 -49 -119 -13 -78 34 -98 -95 -106 108 12 -42 4 60 121 106 82 -31 12 -23 -16
5255a6J5J0N6l7l5J2Nk6k7Qj2J52j42J30j56J19j14O2J15j27m3N4J31p0Rr5QL2
5283A8j01R6k7L7j14K69j67m5O3M8j7k1j7n9R7r9j1J05j19l0R1k3J00j20P2Ql0
5310Dj8j7P2q3R9j16M3jol5O0j1M3O3o5j59J16P9o8J18j18P1r7pr7J27kQQM3J8
5341G2Mn4K8M0k71K54m3J0n4L1r0lJ55l1M0n0L5K0L3l8J0p9j04J94j40J9RKRL0
5371C8j47J23k6n8L5J08j29k6J13n8O0j52M1K22o0j1j33J80j07k9N0p9M3j6J15
5396I7j68M5mN9K9m2N3p4q3J08j32N4Q6km9n5J66r3J07j16N0k4Q0j08K6J9l1o
5424hP0jj23L2J10L7j35L3o4N6q9lQ9l5M5mj07jP9j3Q6o8q5J20p7K5mj08R0J8
5454c5L9P9r0J03j88J78j04p2J27j41J0l6J70o4R9m5n8M2J41j78P5J6l3K7nj53
$$ plain form
5255 -16 -1 9 65 28 -7 5 10 -16 -43 -35 -47 105 -37 93 -63 56 -58 4 119 -8 -51 3 134 64 73 -22 -14 18
5283 18 -83 13 -14 23 -91 178 11 -34 29 77 60 39 22 -37 60 -39 -50 55 -64 -94 -3 -26 74 -46 26 34 4
5310 4 -14 -31 41 -42 57 -59 -16 -17 -23 -58 2 -9 34 97 32 -127 -11 68 0 118 0 71 -26 -33 -130 -3 -5 3 11 54 72
5341 72 76 22 50 90 -181 73 30 40 -14 17 -73 -76 79 48 88 38 73 93 126 88 98 19 -85 109 -31 -12 -3 -1 8 38
5371 38 -109 14 -12 -70 -35 73 -56 -82 31 -27 33 -119 -78 144 84 73 -60 120 13 -16 34 -45 -2 -18 97
5396 97 -71 -26 -30 29 58 16 69 -5 -88 20 -112 -58 28 26 -23 -78 88 -5 102 -14 36 12 92 -16 10 29 -2 -8
5424 -8 62 61 -62 -30 80 117 -18 15 -49 7 -82 -85 4 -31 14 10 -97 -98 -19 -32 54 -14 -99 21 -56 -31 -35 -143 -53 -35
5454 -35 4 83 -7 96 -92 86 -18 -90 37 -104 -94 -130 40 -24 75 30 -28 14 155 -23 52 68 35 62 57 -96
5480i6J44r3jN2n9J6J7Jm8j1R7N6l1l2QR6j21R9O6k1l4j85K6J04q7o7J92k06Q0
5509c8M4n3N2Jm8O8m6k5O8M9J0m8o5M3q0J06N1o8k1p7M6J4J05j37m7J58r7K9K4
5538A8l1P8o0r1J13l2M7j6K8j46J33o8m3J11j43J64M4o8j56M1R7n2R2K7j25O1
5564B3K7j26O9Q9j14J7L1k9J01q7m8N7l1j6n4R3J44j25jm7J37p0m3J7j5K6j07
5591h2Q1J32j73J07j05j7J00p5J47j48KJ23j15MP3m1J13j16m3j61K44l0M0n7m3
5616d0O2j09J8K0%M1j3Q6r2o1Q6L7M1j6O9j80N3j6k9O6k6l9J28M5O1k09J05o6
5644B2k9o5N0Q6k8mkkM0j2Pj90K05o7n3J1n8K14p4j06l7l1Q4k0L7n2O7j30J12
5673b5K0L7L5k8j0l0J05j32l6J87j3m0m9o9l7J38J4o7o4J07k5K8j11K9J23j8n8
$$ plain form
5480 -96 48 -45 -46 6 -53 -37 -20 -19 -67 -78 19 75 44 12 20 116 -5 94 160 139 105 -80 -54 50 -37 -104 88 -118 -38
5509 -38 6 -47 5 6 -42 26 -20 -45 23 72 82 34 -31 12 -68 38 89 21 0 -77 -31 -17 88 -49 -96 62 -35 -6 18
5538 18 -13 65 5 -86 27 -5 42 26 54 -92 41 -27 -70 41 -102 62 106 38 -118 -77 20 -32 60 87 -38 23
5564 23 50 -76 -7 82 -32 -15 16 -13 88 1 -47 10 -21 -37 -91 2 146 21 20 -27 110 40 -3 14 -1 25 -82
5591 -82 -1 131 -42 65 -40 -57 43 -32 115 -33 -31 92 -23 -19 54 13 126 10 -33 -194 50 20 60 3 -40
5616 -40 22 -87 -69 -49 -49 -8 -21 65 -27 -88 -2 35 76 60 129 -51 2 -14 -43 23 -3 -42 86 131 192 -17 88 22
5644 22 -7 -72 -22 64 36 32 30 28 68 56 63 -127 78 11 -42 -31 -89 125 51 -55 -92 -123 -39 -59 -22 -74 -7 -137 -25
5673 -25 -5 32 67 39 29 -1 104 -28 -64 123 110 70 21 -48 -85 53 67 0 -64 43 18 46 -65 -36 87 69 11
5700A1j06J46j57J09p6J22j4J08p0j71J3M3rj3L6o0O3J18j21N8Rn6J07o6q5J13
5726E2Mn3p8Q0j3J00q0j05J46l2J3Q1j30k8J17l9jR7j66J01p6j4J09l0l6l9k3
5753d3p2P5P8m4L0j17J69j17L8j7k6J26N4j42nK7J08j65J19k11M8J71q9NRN5r9
5780c5N3k2pm0Q2k2n0N1J21j50Q6N0k55K6J41q4J03j78RJ51r1K7m7M7M0m7l2N9
5808a4k4KK0n0J87o5p1JM9K8p0Jn7rQ8p3o7J39N3r5m1Q0Mm8J34j38K9k2P5oK8
5839F8K9n8Nj57P6l5L0L0nn2K09nk51J03Q4k8k9o7M9J06j50K7N7o2l9j8M3K0K3
5868Co6J0N0p2J6J32q0O9k0n2R0j24J30p2k5Q0m9p1JL5K7pL8j75K06q6qK2J78
5897A80j72%J29j46K6Q1j13j2P7L4J2j37P2P3k8j25P1qj50N1P7kP0r9P2l8Q8n6
$$ plain form
5700 11 -95 51 -106 3 -73 49 35 143 73 -98 -85 -42 -51 -64 -28 -88 -25 93 -28 30 39 -17 90 24 -61 52
5726 52 56 3 -75 5 -8 92 12 -93 53 21 34 115 -15 -43 74 35 34 131 -35 66 -10 -24 85 55 19 -20 -43
5753 -43 -115 -40 38 -6 24 -93 76 -41 -3 -20 -46 80 134 -8 -13 14 122 -43 76 -135 -87 84 -5 0 9 64 -35
5780 -35 18 -4 -11 -51 31 9 -41 10 131 -19 67 117 -138 -112 29 -55 48 -130 -121 30 -61 -34 -81 -34 6 -41 -73 -14
5808 -14 -38 -36 -16 -66 121 56 -15 -14 35 63 -7 -6 -63 -72 16 -57 -124 15 68 -27 -68 12 16 -32 102 -36 -7 -29 46 40 68
5839 68 97 39 44 -113 -37 -72 -42 -12 -17 -69 140 135 -116 -13 71 43 14 -53 -4 102 -48 -21 36 -26 -65 -83 -40 -20 3
5868 3 -63 -53 -3 -75 -59 73 -7 62 42 -10 80 -44 86 14 -11 69 20 -51 -50 -15 12 5 43 -132 74 -12 -20 2 180
5897 180 8 8 137 -9 17 98 -15 -27 50 84 96 -41 31 104 76 -49 22 14 -136 -85 -8 -10 60 -39 33 -5 83 27
5925B7J23j45K4j5rK7j6Q1j26k5R5J8j2r4oK6N3j08J49oO4k63J48JJ11j64k8P5
5953Em5O1q3p0Q8L4j5n9O5Q7r3rP5q4l8N5N5j18JN8J02n6q2K6J74j74J59r5r9
5982g5O4J04m0k1j5o2J44j42m3Q0O3jj50j0M9N4j5R9J0j71Q9j06J43n1L1K7r9
6009d4l4O6Ll6J85j69K9J10j05O1n0o3J14J11k12J23r8M9j7jO5m2K2j24J2N3J47
6036A55j34K0j2m2J14m6j83J08j3p6o2J90L4j6j52J65p2P0J4M7j06Q2L6k11K3
6061f7J35n1l2O6q5J7RJ1K9L7p7J5P9m7l8j1mk5J06j39J57j77J67j26J43k4k8
6088D0l6M7p5K5Pm2pm3O1N3n3J38p6r8QN4K7J30j58j4J45p6r7Q7jj74J35m3N7
6117B1j0Kj07J15N8N2j38j7L4o4J6j5Q1j16N2mPk4QJ1O7j4L0q5Q2n7q7J53p4K
$$ plain form
5925 27 150 5 29 14 5 32 16 97 -29 -54 41 59 47 -47 -53 -27 26 -82 67 61 125 -138 10 11 122 -42 -70 5
5953 5 -40 21 -62 -132 -44 -10 -25 -84 -19 68 -25 -34 41 -43 -81 -26 29 -89 -88 -30 72 16 -66 -40 134 -40 119 24 -75
5982 -75 -11 93 53 32 17 -45 99 -43 -86 -6 57 56 -94 -104 -55 -1 -16 83 93 -78 11 -95 48 -3 28 55 -44
6009 -44 -78 -12 -9 -45 140 -29 0 110 5 66 16 -47 67 178 -34 89 -9 40 23 22 87 45 67 -57 -45 8 155
6036 155 21 41 29 -13 101 55 -128 -20 -33 -109 -171 19 53 37 -115 50 -22 48 62 109 3 85 121 -90 -67
6061 -67 68 17 -15 51 -34 -17 -8 3 32 69 -8 7 86 39 1 -10 -14 -39 67 -72 85 -92 75 -51 92 68 40
6088 40 4 51 -24 1 8 -34 -41 -84 -23 30 -23 115 39 -59 -51 3 30 160 2 -12 133 57 -40 47 46 -128 7 -36 21
6117 21 11 13 -94 21 79 131 -7 -24 10 -54 -38 -53 28 -88 -36 -40 -33 -57 -49 -38 29 15 45 -40 42 -15 -102 51 -23 -21
6147b1m1O9J07l5j7k1k4N0n6n0Q9j27Q1m7J34j54l0J52p6mL8rj45R3%L1K3lj06
6176i9N6J06l5j29L3qP8j71J24R6n5l4Q3k7p3J63r2J09j36p4J90p8N3j05l1J0
6202d6n1J49q5P5Nq6R7j97M3M1kM8R3Mm9j50P2J25j37J70j66kkL3l3OJ2J77p3
6231G1L9j07O6j3p1M4P8o8k5k5o7K2J00J6j8j21J08k1m9J08j8j04O8r4O6qL3j1
6259aq9J07j6MO8l7lk7LM3O%q4L3l6L1N7j22J36R2k16J49o4r5J39n3l8Q2q5K2
6289FJ7k4j8M1M6j42J09n0OJ8o6J04J4j93%J57M6o2K2j7o9k0NJ53j42R8np3N7
6318A8r8R3p6O0on8O0P6p4j0Q2m2m0k9k3JJ24o5P4j94J02J0l8N1R0j24M6M3j55
6347a02J3R3k3O9L5j00M1K4p9lmJ06J9p8l7K4O5j28P0r4J05q3J84K2o1p0n1Q0
$$ plain form
6147 -21 -62 7 114 79 62 41 17 67 11 -39 50 -77 4 -43 91 -63 -93 59 -17 -21 17 8 -137 -44 -44 -13 10 7 -99
6176 -99 -43 63 28 -101 -68 -76 2 -169 -45 51 -4 -38 45 18 -55 108 16 125 -11 -85 105 27 80 -25 -56 -46
6202 -46 -97 52 -33 42 47 -39 58 -139 -96 -55 -57 -9 84 88 39 -111 -39 86 -51 119 -47 -49 -51 -18 -51 -45 -33 144 71
6231 71 110 3 69 56 -15 29 107 39 14 -11 -78 -56 44 60 42 -79 29 8 -41 67 49 -55 13 -81 -15 -23 10 -1
6259 -1 -90 17 1 5 73 36 33 6 9 52 58 58 -26 7 -29 2 59 -63 73 165 -51 98 34 -61 78 25 -13 69 -16 6
6289 6 23 -1 -19 22 68 -74 35 -15 -9 9 -57 47 61 -132 -132 25 71 9 31 14 -55 -75 -70 83 -59 39 34 -39 18
6318 18 -80 13 -63 -3 -9 -67 -7 69 -5 -15 67 25 -15 -44 -67 -66 58 -7 67 -127 -25 -15 -53 -2 88 -36 10 53 -102
6347 -102 -89 4 -19 50 85 -15 26 50 -29 -32 -36 70 89 11 -26 -2 63 -65 5 -89 16 -67 117 139 78 8 -43 37
6375C7k6p6J05o3p2J19k3J5k1n6m1L4L6KO2o1J12m6q8Q7j00lQ9O3p9j10J71k9
6403C8Q7j29q4J82j11R6r6m6M5Q2j9M0m4rl1pm9J0M2l0j7J4k1L8M6k9OP9j33N2
6433Bk3N3Pj05L5M7Q3n6q4J20n5j8k7K6n3O5oj6M2l6J06J7j19l3J7M8j06R3k9
6462eK3l6j11J62k0rj05Q6K8n8k4n4J57o7q8J75j16RP3K4l0R0j42o8J83q4l7J2
6490c2k3J02j33J27j40Q2n2J4P5j03N9m1M1O0j2r2j7Q3k6P4J0q9k2J19l6j0k9
6517a1j03J89j83P0N2Mq9P4J3M1N5j63K6q7P0J01j01qO4J7k3k4K6kK5l8J7O0j08
6546c6N8K5m2R0j48R0j5k4J43k24P8qo6O0o5P8J4L9j15O8L3K9j39N3J4J53o3l6
6574D4j09M7J49j41K0K4J5L6p7J2mN5j9p9K9kRrJ6p8R4qN1j28nL0m8K1O1qj6P1
$$ plain form
6375 37 11 -65 40 -23 -95 24 1 16 -5 -61 -102 -68 -32 -30 32 -29 83 37 -51 36 -64 -67 22 85 6 -104 67 38
6403 38 125 -4 -88 94 -17 79 -17 -63 -18 64 45 85 41 32 1 -6 -55 -45 -3 -33 -50 -36 -57 -19 27 -2 4 83 -50 2
6433 2 -21 32 39 -66 -31 16 99 43 -41 79 24 6 -21 5 -48 17 11 -5 37 1 107 124 5 -28 -11 37 -69 24 -5
6462 -5 18 -18 -129 33 13 4 -101 -15 13 -45 -69 -123 34 -33 -121 54 -62 -53 20 44 14 104 -38 -106 77 -7 -44 -32
6490 -32 -55 47 -86 41 -99 -17 -69 -55 20 -83 -24 -65 -24 36 24 -68 -85 -2 -28 46 56 -33 -55 64 28 18 -11
6517 -11 -114 75 -108 -38 14 18 -71 3 16 57 112 -51 -25 -112 -42 59 -42 -50 14 31 8 -16 10 8 33 -5 12 72 -36
6546 -36 22 47 5 95 -53 37 22 -2 141 -83 -5 -13 -79 -19 -84 -6 8 47 -68 0 33 62 -77 -24 -10 143 80 44
6574 44 -65 -18 131 -10 10 34 49 85 8 20 16 71 52 -27 2 0 9 0 16 -62 32 24 75 -53 -58 -28 -76 -55 6 -2 -18 53
6606E3J1lk0L7j71J39j41J68k7j8r9J12ok7K9L1j81J94m1J2n3k2K3J21k21oJ50
6633D4n4p5J07kj8k0mO4r8k4J04n3M6n6R3j47J29j16O3R4j99J37m3Qj08J58m4
6660a4m6Q1O5j16O0lJ3q4J4O3j14J85rj03j27J12nj24P1J15qNK9j17P2m4j9K9
6688a9L5n0Q0n4o9K07k20k4K1m8K58j53L7l5O8j19K26n7r9J6M1r1J63j64M9J35
6714A34j61K3LqJN3j06J29R1k35R9j34L9M8K6m8P2ql5k4JJ92k16J09j18R9o4N4
6742A6k3j3R1q0o8J16Q0Rj32J01j84q5J12K61j54j4j8Rp5j1J6k1J18n3m0M2P0
6769G0j48J59L3j86P0pK5Jo7J27j01q8J10m6L7M2k7pkl1LM4j11M8l5L6O4q6P9
6798FQ6p5N4n4P9oj9j07m3K6J9m6K5p8J57n9l4J10Oj30K9L0n4K8P5Op5J52j71
$$ plain form
6606 53 64 61 41 78 -93 46 -95 73 46 28 -71 41 35 8 37 68 -113 81 40 52 -1 -23 0 121 -100 -106 44
6633 44 -10 -85 22 20 2 -18 -22 42 -56 -80 24 -29 17 -39 54 -93 36 -80 -17 77 -122 15 -28 -20 -128 30 -14
6660 -14 -60 21 86 -30 30 27 40 -44 -30 33 -81 104 95 -8 -135 -23 -28 -152 -81 34 26 31 60 -57 15 -29 -48 -19
6688 -19 16 -34 46 -8 -77 130 -90 -114 -93 -141 117 -36 1 -34 34 -85 141 84 -15 1 42 -49 114 -50 -1 134
6714 134 -27 -4 -1 -9 -8 45 -61 68 159 -76 23 -111 -72 -24 2 -46 26 18 -17 -41 -40 152 -64 45 -73 26 -38 16
6742 16 -7 -20 71 -9 -77 39 119 128 -4 97 -87 -172 -60 201 47 33 15 24 -51 -62 -46 -67 51 -2 -42 0 70
6769 70 -78 81 114 -72 -2 -9 16 17 -50 77 -24 -112 -2 -48 -11 31 4 -3 -5 -36 -33 11 -100 -52 -87 -51 13 -73 6
6798 6 92 17 71 17 96 90 71 -36 -79 -53 -34 -80 -55 -133 24 -35 -69 41 47 -83 -54 -24 -78 -50 25 31 -44 108 -63
6827f3M7m0N0J34k09K6O0j1Q9n8mn0p1L6J14r8M3N2r9J13j34L1L2n3n6M4m8N4
6855f9R2Jm6p9J42j20J06l0l1O6p2j6R1%j19J05J6q0P0l3K1O1r9K0L9J1q3O9K9
6884F2l9K8k2j1r6R1o7%J0L3P3j0p1j13J32J5l4l0M6kk6n4Q8p6MJ09j68P1JK4
6914c2j01R0K8j9j11J15L8o4J7QO2o9jm0kP7R3l9p0l2R5j04P8m9Rj4n0J35n3l1
6944c6M4n3L0L9o3M4Orl9J57j46N7l9k6K8l2p7J16Nn7J7M4p7R7J5J9l2M1k4l6
6974A3n5J0N4k3M2m4Po7O4j05J45L4j14J03n2l3L8n6M5l9N2Nm3J04o9nO3j31J50
7003I3q5jl2R9j5j33R4J8n8N8O2mK0j00r1J17o0j8m7J9J5o4J24Q8j09J4n3L8O
7032ej03J03pm8l7P7Q6l8pJK5P6n0n3j6OJ1q2L6MM8K3MNN3m2j23M1mk4N3J21p0
$$ plain form
6827 -63 -16 -56 -6 128 -81 -55 5 -6 83 25 21 -29 -100 -64 50 -48 -5 47 -52 61 -73 -42 -10 -63 -119 -75 -123 -69
6855 -69 23 24 -22 -101 41 -79 27 -3 -34 32 -40 -56 35 35 -84 21 37 -43 27 -6 15 76 -23 -3 36 47 -36 33 62
6884 62 23 51 29 18 -78 13 -54 -54 -44 -11 62 52 -19 -132 0 15 -19 -49 -3 -5 -31 -85 3 -73 -69 40 -128 -57 -56 -32
6914 -32 -133 -43 -15 -34 -145 -30 8 -56 -39 -31 31 -38 -39 -79 -81 -4 89 50 -20 -52 43 -61 17 -32 -23 -37 -87 48 -5 -36
6944 -36 8 -45 -15 24 -39 5 11 2 -37 120 -26 31 -8 -34 -6 -38 -115 1 6 -51 -34 10 -67 30 45 64 32 73 49 13
6974 13 -42 -32 22 -1 41 -3 4 -63 1 -104 41 75 -39 64 12 -21 17 -39 6 -33 19 24 -19 85 16 11 74 -57 93
7003 93 8 7 -25 74 59 -74 20 38 -20 38 100 96 116 16 -75 42 -18 -36 -83 -64 -49 -113 11 99 -10 4 -49 -11 -5
7032 -5 -108 -5 -12 -60 -97 -20 66 28 21 22 47 123 73 20 4 10 21 -61 -25 -21 27 50 54 59 112 70 -53 -12 -16 -40 13 134 64
7065F4l3q9j5J59q8N0r5j3J21l1k0Pj9k1M3J0p3K7J75n4o7N2j00j9J08m8m8j5
7093c2J02K1m5j61K13p0k9J16j25m5J30j94O5K9L8o6N3q5M5jM3Pm1k8O7j4m8k7
7121h2n9N8Q9j19J47J3r3P5P7j50J07Lj15M8J3L1N6j19n4P2M4P7j43q9J3L5R1
7148B6k0P0q0L0p2m2Q3k4q9Q5P0nj01Q0j24J44m0R6o7r5m1R5J11n1j03K01j73
7175c6N7MP7j45Q0J6l1r2J2J64j08K9m4R4j44K3n4n4K67j93J63Lj71nN9M6m6J00
7203G1J3r9mj4O3p4P4J6m7rn7Q6p0q2J81n4j13L1J18j6k1P8J3r7p7P1L5J6j11
7232g9Q9j3l3m1J4J1J23p2K0n2L7j3k6R6j41Q4k1L3o3O7L4kp9J00q4J00J8j2r0
7261Enp5J1K07k04O9K2q5J83j11n6r1J89N2l7j06m5L0P6l3M4OJ2k7q2k2Q1J13
$$ plain form
7065 64 31 -58 -73 86 -2 48 -47 -60 61 30 10 17 -2 -23 20 30 -43 -16 159 105 38 90 -10 -29 79 31 -17 -32
7093 -32 70 91 46 -115 98 28 -1 115 -10 -55 75 -119 -54 -25 13 -53 0 -85 -40 -41 2 9 -32 -60 7 -7 -55 -82
7121 -82 -141 -83 6 -113 34 47 -46 29 106 -44 63 66 -49 -1 12 43 99 -20 -74 -2 42 119 -24 -113 -100 -65 26
7148 26 6 76 -4 26 -46 -88 -5 -29 -118 -33 37 32 -69 11 -113 31 -9 87 20 -75 -116 -21 90 39 -64 137 -36
7175 -36 21 25 102 -43 37 53 22 -70 -58 106 -2 27 -17 77 -67 -44 -98 -152 115 -78 85 88 -83 -88 -29 17 -29 71
7203 71 84 -15 -19 -33 30 -44 30 46 -1 -10 -67 19 -51 -133 48 -6 -119 -88 30 14 -7 71 84 -13 -90 -19 16 32 -79
7232 -79 10 -3 -36 -77 -63 -52 71 -1 19 -33 4 -9 -35 61 -80 4 -17 16 -47 20 54 52 -27 73 -11 89 107 95 5
7261 5 0 -75 -64 143 -61 8 30 -55 128 17 -39 -130 59 111 74 -32 -77 -47 29 -4 40 46 58 31 -51 -73 8 121
7289A21j30jk5M0P1j37L3R2k6mo6M8j02OM7Q6Kn6k7L8JK1N6j24P6M2j77J38Qp9
7319b8J9k6K1L8j1K9r7J16q3j9O1M3k37J96O9m9J6k2om2m8O2K3n5J76j15J8l9
7347A0jl4j3J1J25j36mL2M5m8k9K0Q4j07J63k01Q1L0o1k3q1J06oJ00j9r7K2Q8
7375E7o0K4M1q1%P9j49M6K3q9J15J47j65M5r9J73m9m4M5P4n9j59j03J13R8j09
7401h6J18o2Q1J04p6j58J76j48O7Q1j56l6L8L1O5m4j66J61J3Q5p7n2J45m4k03
7426a43J61K8p6R2j4j19R4M2q2P2l2N5j82J5Q5J49j39N1j54R0n1j2K4O2K5l0j02
7453i1R4O4j38Q6j01J1M3lP4j1m4N3j84J15omK2m3KJ2Jj4K5K3o1J27m9K7Q0l3
7483G7jr3NP9n0N1n4L8n7O9J3m5q4J1K8k4q1P0K3M2J7l9J6j1q9J44J1j02m9O1
$$ plain form
7289 121 -9 -10 -35 5 76 -61 -28 64 38 34 -32 16 -86 -80 -33 53 55 -1 -28 10 11 32 88 -36 40 82 -95 43 51 -28
7319 -28 -9 -35 -14 24 13 42 -55 61 -22 -41 20 63 -174 22 91 42 58 36 30 -12 -60 2 25 -30 146 31 49 10
7347 10 9 -25 -38 -27 98 -38 -42 -10 35 -13 -42 -22 62 -45 118 -83 -2 28 -33 -56 -137 -31 -37 63 44 -53 -31 57
7375 57 -3 21 62 -19 -19 60 -89 -43 -20 -109 6 153 -12 33 -66 107 58 14 59 133 74 -85 -188 -75 23 -86
7401 -86 32 -30 51 155 79 -79 97 -51 16 97 -59 -95 -57 -26 39 -5 -171 -10 3 88 11 -41 104 60 -143
7426 -143 18 46 -30 62 48 -71 23 65 -17 55 23 78 -104 -89 -4 145 6 57 -97 -7 -58 -70 -46 16 41 11 -91
7453 -91 3 67 -71 15 -86 -75 -32 -35 39 28 -16 37 -147 -32 -38 -42 -20 -63 -61 -49 -48 -62 -37 -14 -75 52 3 30 110 77
7483 77 76 -17 -12 67 17 68 14 52 -5 64 77 32 -52 -41 -13 -37 -118 -48 -25 17 34 -5 11 0 -89 55 66 -36 -85 -24
7513b4m4J53m4Lm0P9l8j34Q6L5m7J5M7j11J4oO2j2K1k4K3l3l7PQ1j0pj6J8p4P1
7544A4kqNk3JJO3kj09N8j41J23M9r4P2L0k6K8p5K7q4J23q2PM3kJ02j01l1k6M5
7575a5l9J08q3R8O6o6n8r1R1l9L8j4r8J95k8r9P6j5J4r4J09j30O8N8p9l0Q2OJ
7604C2j5j5Q3j25K23j80m5m8Q9O5j7Qm1r4J05j8j0P3o0j7M9j14M1qpM6J3q6k9
7633a02O2J2p4K55p0n8Lr2J18l4R9j19j6O3p5n7J80j01M5j3P6k62J28Q8j88M0
7659i2J12n0N1n1N0K4l6m2p5N8R5L0o1q3mM6r5J05k1L3p2J17r0M4n6J19l5O1j34
7688e2J59q8q6J27L1j43N0l8j9k2L1J18j40R9r4N9M0L5o0j6j19Qm3J48J02l0N7
7715A14o8o1l5k8O2j5L4O6l3o2K5l5R0l5O6j16J16p7j27J65J3j13J17r8Q8Op8
$$ plain form
7513 -24 -68 85 41 44 4 83 45 -89 -3 32 -15 0 47 -64 -50 -56 6 -6 15 -9 14 -19 -56 -49 32 22 15 -1 17 -57 14
7544 14 12 4 9 -14 -13 -12 51 49 -60 -2 -143 -20 29 -65 7 37 11 39 -36 -9 -93 30 -52 -45 -2 -4 98 -3 -34 -60 -15
7575 -15 -54 54 -29 69 135 69 11 -80 11 -28 10 -4 -102 93 65 -34 42 27 41 -53 56 -74 -6 52 -27 -57 25 31 32
7604 32 17 2 85 -40 183 3 -42 -90 -1 64 47 55 14 -80 25 7 -3 70 10 -7 42 -72 -31 -39 -46 0 13 -73 -102
7633 -102 -40 -28 -102 153 83 25 28 -64 54 20 119 0 -16 47 -28 -85 95 -6 39 26 102 -160 -32 56 -132 -92
7659 -92 20 -30 21 -30 20 44 8 -34 -109 -51 44 74 13 -70 -74 -28 -123 -18 -39 -6 -78 39 -51 -7 -63 56 21 82 -52
7688 -52 107 19 -67 60 91 -52 -2 -40 -59 -81 -50 68 -72 27 -67 -8 32 67 7 -9 -128 -120 -163 -15 87 57 114
7715 114 46 -15 -50 -78 -16 -31 3 69 36 -26 -1 -36 54 19 85 -31 85 8 -119 46 59 -54 63 -35 53 59 -19
7742a9lJ62j25m7K5oM0q2R8j8j09J86j61o1K35p8k4J3n7Q7j34k8R9m2R5kn0rK
7771a3j3r0K12q0J03j75J26k8l3L6k1Jq2J72j20q5J45r5l0L8m2Q3l5J4J04p8p6
7798f2N6k4o6N3J8J8rj05M7O3K7pJ30j02n3L4j29J47j5O4o3p6K0J25q7J4p3J12
7826E7K4Pk4J9r0m7M3M3l5l1KJ45k08R4j87LK56o4P1j13J2J04p1j03M4L3J7j9
7854a8J01J0o1j05J4J50q0j9l6j7N9M5j31Q4M5j8Q5j52rP2m2O6o0O2n1K1N2j50
7882h3R8J3M8j33j38J53K9j8J5N9q7M1Kp0J11N2j18P9o3O7j45K38r7o0o3N0l1
7909e1O8Okj8J00r0l5K7q8P7K2p0P1j04J48L5q5RQj84J29j8l2J64pj47M3%n8P9
7939cj02J74k4j07j5PO5J12j42K6L3l6l6J0J33k7j83N5N1M1o3J51j33J20o4L0
$$ plain form
7742 -19 -22 140 15 -32 -7 -13 27 -55 43 25 -84 102 -59 -120 115 37 13 26 -31 56 -78 -106 -7 -49 46 44 -6 -15 -13
7771 -13 -26 -116 96 16 119 -56 70 42 9 45 24 25 -57 115 -5 -90 55 -40 -70 -32 -74 9 -26 -12 92 14 -62
7798 -62 -6 -30 -96 -43 -25 -7 -16 -121 -74 -11 16 9 139 37 -16 18 -111 36 21 85 22 -54 -34 91 4 18 -55 57
7826 57 81 88 64 83 -7 -54 -11 32 -3 -34 -32 113 -95 -1 -188 -185 71 7 78 -35 -23 81 10 -93 -49 -16 1 -18
7854 -18 83 93 32 -73 -59 91 11 -8 -44 -61 -2 43 -88 -4 41 23 108 -44 -53 19 -23 43 -17 45 -6 15 67 -83
7882 -83 15 28 76 -57 -195 -42 -13 -31 -16 43 -44 -3 -1 -71 40 92 -26 53 -10 57 -88 150 53 -7 -70 -20 -51
7909 -51 17 23 21 3 103 13 -22 5 -83 -6 16 -54 17 -87 61 96 11 20 28 -156 -27 -45 -77 87 80 -67 -24 -24 -82 -3
7939 -3 -105 69 45 -62 -77 -70 -5 107 -35 -9 24 -12 -48 -38 95 68 -115 -60 -9 32 -31 120 -13 107 43 73
7965G3q5L5l4m6J39j80J74q4P3n5p3J4L8K3p9Lj6O0P3j13Q9k1l7P7m8L2m6k3n
7994d2MJ30p3l2N0JNm7L0mN0nj33P5j10J97k09J43l3n1%PL9p7R6N8n3Njp4J5P1
8026C2K3n8lN2m3j4O3j30J21j34K5N8j1o4K33j70L0Jm5J12k5Ql7m7p4P0p8K04
8054I9o9o9q3M7Q9n2R8l7p0R1q1J72o1m8j1r6l7R1M5N3l8Q2j14L8Q6k05P3m0o3
8083a10Q1R6Pr1kj4J47k03N6M7K0l0N8r2P9p9k7J43r6L8n4p1p7J97j05J16k7j
8111Fk1O7J9j23M9M0m8j0R2Kl9l5o1J57j03R5j63J98j47Q1n2m2J4J0K3o6k9Q3
8139cN0j13M0p9O0O4J1j02j3M6J02P5j29r5K13j55J6M3r7L5j7J13M6p3o2J11j68
8166h1J33j18J36j01l7J1mJ39o9Rl1l4j9q3J70l7O1l5M7O7j37O8m1q5n7
$$ plain form
7965 73 -12 23 -11 -57 82 -98 76 -8 65 10 -63 -49 -11 12 -67 -64 -80 -20 53 -60 29 8 -29 48 0 32 -14 -37 -42
7994 -42 -38 92 19 -13 37 38 43 -4 26 22 72 67 -66 9 -101 96 -113 30 -3 -54 -54 -47 -8 -85 11 69 16 21 20 -54 -39 32
8026 32 55 -3 -6 46 3 -11 52 -78 43 -91 -66 -8 -19 -83 150 -20 10 11 -34 78 53 61 24 -23 -97 -27 -105 99
8054 99 30 -39 -122 -75 14 -38 60 23 -47 44 -37 135 74 26 15 -81 -118 -27 18 71 33 115 1 39 125 -80 -7 -47 -110
8083 -110 -29 67 74 -17 -19 -33 114 -89 -33 14 34 4 62 -30 49 -30 -57 86 -10 28 -26 -97 -174 23 -82 34 7 6
8111 6 -15 52 71 -52 -3 37 -11 -21 71 73 34 -1 -62 95 -8 87 -76 122 -25 56 4 -38 -24 -14 9 -57 -86 -3
8139 -3 47 -66 -26 -105 -45 19 30 -72 -85 -39 63 138 9 -86 127 -28 -12 31 -66 -31 -48 65 111 38 -24 87 -81
8166 -81 52 -66 70 -31 -68 -57 -61 78 9 18 -13 -47 -66 -149 21 -16 45 10 57 124 -13 55 14 -71 -128
8191a28
$$ Imaginary data points
##PAGE= N=2
##DATA TABLE= (X++(I..I)), XYDATA
0@%%%%%%%%%%%%%Qj6J6j6J6k4L2l2M0m8N6p2Q0q8J04j20J41j65J86k10K40k72
35a44L06l46L89m34M85n38N96o63P35q13R00r95J098j209J331j468J618j783J967
54A032k173K404k665K963l309L718m203M794n533O481p760R590j2435J7526k9496
69a9066J12682J01065q9203l5074p0628m9193o4938l8621j1233K1592J6677L7166
81h8774L8469N6195M6189J7326M356J6488m131j5281k6347k4393r122m695j8013
94a1733j0805m297M291j11j5105q027R527R46j023M784J3115K5928K2459Q513
108C8462J1258J3421P707q399k5595k0692j3785k5471k6276j6438o015O888P628
121e7307O034J8732K6971K2820J1658N304J2846J1263n183j0590r571q532p472
$$ plain form
0 0 0 0 0 0 0 0 0 0 0 0 0 0 0 8 -8 8 -8 8 -16 16 -16 24 -24 32 -40 40 -48 56 -64 77 -88 98 -112 128 -144
35 -144 162 -184 205 -229 256 -282 314 -349 386 -427 473 -522 576 -633 698 -770 848 -935 1032
54 1032 -1141 1263 -1402 1561 -1748 1970 -2233 2561 -2972 3509 -4251 5339 -7096 10430 -19066
69 -19066 93616 194681 105478 70404 -224 -49417 -114355 -152976 -164209 -142617 -125940 -88774
81 -88774 -50305 5890 52079 69405 73761 90249 86118 70837 44490 20097 10975 6280 -11733
94 -11733 -22538 -26835 -22544 -22655 -37760 -45787 -36260 -35314 -36337 -31553 -18438 7490 29949 38462
108 38462 49720 63141 70848 62449 36854 16162 2377 -23094 -49370 -65808 -71823 -64935 -57307
121 -57307 -51273 -32541 -5570 17250 28908 34212 47058 58321 53138 42548 32977 24445 16973
134A6973j5626j8828q731k924n449p652j256J3182J4077O301R273J3863J4355
147B7558R960l150p629k962o001j3416j6806j0330O18q93k860N409J1252J2584
161C334R198K92J299N232j348q366j0698m426K163k769l745L972N797O056K478
176H469m366J1J476o133r124p652j071L591k003N59R316Q967R063N770k15N212
192B1870L408p459p436o211m286k730r433n245M256J484J968J547o73P864N903
207D827l213O68K314J439K289m990k472M519j480k950j857l689L501J593o377
222e878N15L389J321K589k393PN950q78k167K64k078K564m07o421O93K348k000
239b582m42k708l65M691j291j392K594J745L956J392k542L378K543k985k150l869
$$ plain form
134 16973 1347 -17481 -26212 -29136 -34585 -42237 -43493 -30311 -16234 -9933 -660 13203 27558
147 27558 37518 34368 26739 23777 17776 4360 -12446 -22776 -22158 -23051 -25911 -20502 -9250 3334
161 3334 12532 12824 14123 19355 18007 9641 -1057 -5483 -3320 -6089 -9834 -5862 -65 5991 8469
176 8469 4103 4114 5590 -543 -9667 -17319 -18390 -14799 -16802 -16243 -6927 2040 11103 16873 16658 21870
192 21870 25278 17819 10383 4172 -114 -2844 -12277 -17522 -13266 -11782 -9814 -8267 -8940 -1076 4827
207 4827 1614 2282 4596 6035 8324 3334 862 5381 3901 951 -906 -4595 -1094 499 -5878
222 -5878 -5363 -1974 -653 1936 -457 -450 5500 4622 2455 2719 641 3205 2798 -3623 -2930 -582 -2582
239 -2582 -3024 -5732 -6097 -1406 -2697 -4089 -1495 250 4206 5598 3056 6434 8977 5992 3842 -27
255b7j720L51m655l384J803J478L041J232J35N612L269j315o74j569l00j87n236
272b146k347J225L96J167k56M00M710J008j848n86j602J09j115m598m86K089O23
289c257K070J99K237M979M02j259M2j275r6k378n376m53J78j215K00q92J665M268
307C9n55J69K385L48K010n16l110J875J23k141j22k134J50J978k714o5K046m01
325f35J816l30j935L141l86k765N37j860K8J353l091J075L341k25K534O21p91
342B428L943p51l587M80k537j128O8m498K08K600j393J746R26n33M500p0k390
359A2K494o01n7J660l163P82K399k726K43o26k893J701k013l233K394J13O20L315
377D21m03K750L528k037J00q52l534n09k997l558K342O77J049M336J951L777L189
$$ plain form
255 -27 -1747 -1396 -6051 -9435 -7632 -6154 -3113 -1881 -1746 3866 7135 5820 5146 3577 3277 3090 -2146
272 -2146 -4493 -3268 -2872 -1705 -1961 -1561 3149 4157 2309 1723 121 230 -885 -5483 -5969 -3880 -3257
289 -3257 -1187 -988 1249 6228 6630 5371 5413 4138 4042 1664 -3712 -4165 -3987 -5202 -5002 -5894 -4229 39
307 39 -516 -347 2038 2386 4396 3880 770 2645 2768 627 505 -1629 -1479 499 -2215 -2280 -234 -635
325 -635 1181 851 -1084 2057 1671 -1094 -557 -2417 -2389 -1036 -4127 -3052 289 64 2598 3219 2428
342 2428 6371 5620 2033 2513 -24 -1152 -1084 -5582 -5374 -2774 -4167 -2421 -1495 -2028 2472 2402 12
359 12 2506 1905 1848 3508 345 1127 3526 800 1043 417 -2476 -775 -2788 -6021 -3627 -3514 -2894 421
377 421 18 2768 6296 4259 4359 3507 -27 -536 -3533 -7091 -4749 -4072 -3023 1313 3264 7041 10230
394A0230k021r72k617n515l705n682m580J190N40K220O301N683O903O077J647
409A5699J232j464n029n196p891o519k143k965n99L934M477O456N573K935K700
424A1200j11k501l575o193m395k061l232k31L225L691N208L931K552K468k20j761
440G995l065n798l073k078l495M41K359K403M618L508K909L389L56l99k387n027
456B656k243l413n428j150j256j182K368J438K193M004J918L354K956O81L366
471A0262O36k318J487j096l423p17l898l701j166l693j505o23j438K395R60oN810
488b034K527R32M310J094R32L070j249j556j200l704j334l740n110m29k915k785
504a3191L065Q64K408O461L026L761N351K119J791j641m370k213n782o223k100
$$ plain form
394 10230 8209 7237 4620 -895 -4600 -10282 -14862 -13672 -13132 -10912 -4611 1072 7975 14052 15699
409 15699 16931 15467 10438 5242 -2649 -9168 -11311 -14276 -14875 -10941 -6464 -8 5565 8500 11200
424 11200 11089 8588 5013 -1180 -5575 -7636 -10868 -11099 -7874 -4183 1025 4956 7508 9976 9756 7995
440 7995 4930 -868 -3941 -6019 -9514 -9073 -6714 -4311 307 3815 6724 10113 10469 10070 7683 2656
456 2656 413 -3000 -8428 -9578 -10834 -12016 -9648 -8210 -6017 -2013 -95 3259 6215 6896 10262
471 10262 10898 8580 10067 8971 5548 4831 933 -2768 -3934 -7627 -9132 -9755 -11193 -8798 -7838 -7844 -2034
488 -2034 493 1425 5735 6829 7761 10831 9582 8026 6826 3122 1788 -1952 -7062 -7491 -10406 -13191
504 -13191 -10126 -9262 -6854 -393 2633 6394 11745 13864 15655 14014 9644 7431 1649 -4574 -6674
519f674m906l104J998J17K599M855K631L069K056J115K649q41j108J645j844j31
535D126K821j286m30N39k767k721k825l564k320l827r30K796J699M904O914L131
551F260M341M439p14k328m280o576o408p073l907q00q43M369O936N644R058Q179
567A6297K842J625q46l975n648p718o805o176o018r37P76N92N334M850K690N137
583B020M141K153J226q05k65j031j986J82k534l829k30k212l126N2j281j026J149
600g402J583L950L459K728M437R41o09J709l370m765k345n417l825k78j007K015
616h196K343J988N182J966J143K893l056k916N65l389j757J440p34K347L367J279
632D465L611l14k043l97n702m774r84n103k190K767R71N135O873L808M959K061
$$ plain form
519 -6674 -11580 -14684 -12686 -12569 -9970 -5115 -2484 585 2641 3756 6405 5564 4456 6101 4257 4126
535 4126 6947 5661 5231 5770 3003 282 -2543 -6107 -8427 -12254 -13184 -10388 -8689 -3785 3129 6260
551 6260 10601 15040 14326 11998 7718 1142 -5266 -12339 -16246 -17046 -17889 -13520 -6584 -940 8118 16297
567 16297 19139 20764 19918 15943 10295 2577 -4228 -10404 -16422 -17359 -16583 -15991 -10657 -5807 -3117 2020
583 2020 6161 8314 9540 8735 8470 7439 5453 5635 3101 -728 -958 -3170 -6296 -6244 -7525 -8551 -7402
600 -7402 -5819 -1869 1590 4318 8755 9696 9087 10796 7426 2661 316 -5101 -8926 -9204 -10211 -8196
616 -8196 -5853 -3865 1317 3283 4426 7319 4263 1347 1912 -1477 -3234 -1794 -2528 -181 3186 4465
632 4465 8076 7762 5719 5322 -380 -5154 -6138 -11241 -13431 -10664 -9693 -4558 2315 6123 11082 13143
648A3143o24j03n717o100l805p196l642J368m55L717O645M011O126M685J528J131
664A4712l595m800l261o851m238j105l263P88L917K160M682M488J798K007m61
679F978r54q97m065k336r28k780L37J862j1K059J912N38J240J10k11n71k388l69
697d74k04j668P55N24q27J210J106k99N75j66Lj60q80O69O7j048Q91j34o52J128
717D16j22n81L89n1L64K76m05R09k57n77R75j062r26L44j235o58K08l84O53O32
737a092L98J752K94P46J528j129k09J15j813m02q17j705K85o90k8J502m00N77
755a088K026o82R01J065j483R50J07j675R29p94q04J326j406l27J419j528M92
772e72R85k106J135M97j696J481k93q03K029o30J7J922j443R39J390k128Q36K73
$$ plain form
648 13143 12519 12416 6699 599 -3206 -10402 -14044 -12676 -13131 -9414 -2769 1242 7368 12053 13581 14712
664 14712 11117 6317 3056 -3795 -8033 -9138 -12401 -11613 -7696 -5536 -854 3634 5432 7439 6978
679 6978 6024 5127 1062 -1274 -2202 -4982 -4645 -2783 -2794 -735 1177 1715 2955 3065 2854 2283 -105 -474
697 -474 -678 -2346 -1591 -1067 -1894 -684 422 123 698 532 535 375 -505 164 231 -817 74 -60 -712 416
717 416 294 -287 102 51 415 691 286 1195 938 361 1336 274 -652 -308 -1543 -2201 -1993 -2377 -1724 -1092
737 -1092 -694 1058 1352 2098 3626 2497 2288 2403 590 188 -629 -2334 -2049 -2739 -2767 -1265 -1665 -1088
755 -1088 938 256 1157 2222 739 1689 1796 121 1050 256 -548 778 -628 -955 464 -1064 -572
772 -572 413 -1693 -558 -61 -1757 -276 -569 -1372 657 27 44 1966 523 1462 2852 724 1560 1833
790A833k399Q81q98j931J376j283m16J963j004P81K174j379J583J264j635J389
806B299l51j752J174j361r59J140j458o3J247j379J000Q62j443J206J68j056J200
823D74o34l42J220j091J85J127j047Q07N55j112J086l73r78R99r79o68O40j695
841a826N3O64r40J076N81k73K012L57l9J316q32m83J51k155q02m88j584O23Q0
860b509j35K176Q92R53J897k80J62J31k240j062j426j941J85o87J7K160R69J966
878A228K403K1P99j29j880q92k229k479m01j205m6J751P99K317K533M47J478J13
896D628j573n04k244k431n84j643K46J726j3K532K521K53J736q2k075k41k550
913b98k888m59k163J41J747J83K906K957O88L091P90j388P21k371l038p28l303
$$ plain form
790 1833 -566 315 -583 -2514 -1138 -2421 -2837 -874 -1878 -1097 1077 -302 1281 2545 910 2299
806 2299 1948 196 1370 9 -950 190 -1268 -1331 -84 -1463 -463 399 -1044 162 330 -726 474
823 474 -160 -502 718 -373 -188 939 -108 699 1254 142 1228 855 -123 876 -103 -771 -131 -1826
841 -1826 -1773 -1109 -2049 -973 -392 -665 1347 1704 1665 2981 2149 1666 1817 -338 -1140 -1628 -3212 -2589 -2509
860 -2509 -2644 -468 424 1377 3274 2994 3156 3287 1047 -15 -1441 -3382 -3197 -3884 -3867 -1707 -738 1228
878 1228 3631 3652 4451 4322 2442 1550 -679 -3158 -3559 -4764 -4810 -3059 -2260 57 2590 3037 4515 4628
896 4628 3055 2551 307 -2124 -2708 -4351 -4105 -2379 -2392 140 2661 2914 4650 4568 2493 2252 -298
913 -298 -3186 -3645 -5808 -5667 -3920 -3737 -831 2126 2814 5905 6695 5307 6028 3657 619 -109 -3412
930c412j465J03j673J174J715j23L114J735k74K824K25n24J380j333j025K14k204
947D51m74m47k452K31m96j675J671J00j28K585M29P65K302R7P08L65j437L63q92
966B066j667L64j167j521J097p69n85Q32q32k01p9p73R57P8J14K300O15J405K724
985D958N40N24P21j583j326j913l053k062k854j588L90o90J474K978J571K818
1001I05L049J288J481J93r72j124k189j500j400k666p87L1j050J213J272k47J107
1018a396J040N25Q68j95P84R0o94J235L83q36R18k47j607o6p53j184j141j642
1036c918k02k12l91K008P03O8K928J448O75K217k1m55J3j536o75j698k673k02
1054a923k069j772J785m30k21K524M84J011K613O05J024K45r23P76j180j841P58
$$ plain form
930 -3412 -4877 -4774 -6447 -5273 -3558 -3681 -567 1168 894 3718 3943 3419 4799 3466 2441 2655 451
947 451 -23 -470 -2922 -2691 -3187 -4862 -3191 -3091 -3219 -634 -205 560 2862 2959 3667 4032 2595 2958 2066
966 2066 399 763 -404 -1925 -828 -1597 -2182 -1350 -2182 -2383 -2462 -3235 -2278 -2200 -2086 214 829 2234 4958
985 4958 5498 6022 6743 5160 3834 1921 -1132 -3194 -6048 -7636 -7246 -7936 -6462 -3484 -1913 905
1001 905 3954 5242 6723 6916 5944 4820 2631 1131 -269 -2935 -3722 -3691 -4741 -3528 -2256 -2503 -1396
1018 -1396 -356 169 1037 842 1626 1716 1022 2257 2640 1804 2722 2475 868 802 49 -1135 -2276 -3918
1036 -3918 -4120 -4332 -4723 -2715 -2012 -1944 984 2432 3107 5324 5303 4848 4861 3325 2650 952 -1721 -1923
1054 -1923 -3992 -5764 -3979 -4409 -4630 -2106 -1622 -611 2002 2607 3631 3876 2953 3729 2549 708 1466
1071A466k552j843J458j438m72J698p43P09J300NJ942K22o22K146j021n12J911
1088C654j932j441P21k110o64K93j786J1m99j03K242KO34K851o08Q18K479j003
1106C559j74J69k150n84p96j352M2j772n46J675r94Q34K262j205P30J824n02P55
1124A775M35o18K42q83N4N81j952j98J68k157K88R51j326M85M25L89J502P48J139
1143B048Q72p42J058M53j873po14k217l17o46q13Q9l31M23O42o3J917O66n36J483
1163A492M23n43J240j34r54O3o21J3n46j418K41q40r88J174m49l73J410j14M31
1182d93J229K63O31J5m71P20p13q17J044j474r48R64r23q5O79q61J64J76k95J232
1202C7m81j28J534p81K61J758j090j09P66j461k1n7j153M40q87n31J333o88M63
$$ plain form
1071 1466 -1086 -2929 -1471 -2909 -3381 -1683 -2426 -1717 -417 -412 1530 1752 1130 3276 2255 1743 3654
1088 3654 1722 281 1002 -1108 -1772 -1479 -3265 -3254 -3753 -3856 -1614 -1612 -978 1873 1265 2083 4562 3559
1106 3559 3385 3554 1404 820 24 -1328 -1286 -3058 -3604 -1929 -2923 -2089 173 -1032 -302 1522 1020 1775
1124 1775 2210 1592 1834 951 1005 1586 -366 -564 -396 -2553 -2265 -1314 -2640 -2155 -1730 -1341 161 909 2048
1143 2048 2920 2178 3236 3689 1816 1809 1195 -1022 -1339 -1985 -2798 -2709 -3040 -2617 -1975 -2038 -121 545 9 1492
1163 1492 1915 1372 2612 2478 1524 1587 966 979 433 -985 -744 -1584 -2572 -1398 -1847 -2220 -810 -924 -493
1182 -493 736 999 1630 1645 1174 1894 1181 364 1408 -66 -1014 -50 -973 -1058 -379 -1240 -1076 -900 -1195 37
1202 37 -444 -572 962 181 442 2200 1110 1001 1767 306 285 228 -925 -485 -1372 -1903 -570 -1258 -795
1221g95J488r32M93J241j103K29J63j181L71l40l94J191p44L49J210r28L37Q67
1239A522j375j58R5j449L94m55n34R59k51N39J351m48Q88R66r86O92p9j124K31
1258G78o71p30J35n96MM98q69P87M20n84Q20N5o26J066j75p0O05l95K32M67q20
1279C31M22J9r84N45o10p20N23m62j07L85n50N95N70l80P31O3k30R43k40k76M63
1300A031o23M9L23r76J72j01q11O74o61k28Q03l99J13R37o31N63N88m98O44j91
1320G78o23Q43r36m66Q07j032L10N05q45P41J56q28R43l54o70J052p83j81P04
1339A21q96K26R47r77R86L72p97J286m24q63J227j025m84Q02j299K27O00j369
1357a340Q64L70r67J280q9p16J380n40k76J281j090J90Q84j249N89J88j405R19
$$ plain form
1221 -795 693 -239 254 1495 392 621 784 -397 -26 -366 -760 431 -313 36 1246 318 655 1522
1239 1522 147 -11 84 -1365 -971 -1426 -1960 -1001 -1252 -713 638 190 1078 2044 1058 1750 1671 547 778
1258 778 107 -623 -488 -1084 -1080 -582 -1451 -664 -244 -828 -8 47 -579 487 312 242 847 452 684 1151 331
1279 331 753 772 -212 333 -277 -997 -474 -936 -1043 -658 -1208 -613 -43 -423 308 371 141 1084 844 568 1031
1300 1031 408 457 780 -196 -24 -125 -936 -262 -923 -1151 -348 -747 -634 303 -328 235 823 325 969 778
1320 778 155 998 62 -404 403 -629 -319 186 -659 82 238 -590 353 -1 -671 381 -402 -583 121
1339 121 -775 -549 398 -579 407 779 -18 1268 844 -19 1208 183 -301 501 -798 -571 29 -1340
1357 -1340 -476 -106 -1073 207 118 -598 782 242 -34 1247 157 347 1231 -18 571 759 -646 273
1375B73l27j020R48o15n70J162j023K84R47r36R34N68q37J193K14o98J032m24
1393A105l66O86r77k20M48j434L70k68j330N12j31n45J054j59N10J322n1P57R26
1412B209n76M86M1j205J57q10j226J74r99m34P49l15N19P84N5R98L91k26Q60l89
1432A243l91M96p39l40K18p15l02%p46J9l79l53N25j89M00J215K95O63J113K66
1452B299N13N7n28n51j095j011o00j477m38K01j87Q11R32N24J112P94L63M48o95
1471A472k24n12j343j33o8r44O99M39j91J376K79K85M53n66j96j52j080L71l84
1490d19j093R46K88m19J141j10j36M57q05m1N9j075L65k2p33J538L65l11J430
1509A425M2n43Q10q14o19k51j195K09j21p10J169K03k90J686R6j90J002o58o33
$$ plain form
1375 273 -54 -1074 -126 -741 -1311 -149 -1172 -888 59 -877 57 625 -212 981 1195 497 1529 1105
1393 1105 739 1425 448 228 676 -758 -388 -656 -1986 -1474 -1605 -2150 -1096 -1255 -745 577 526 1283 2209
1412 2209 1633 2119 2160 955 1112 302 -924 -750 -1749 -2183 -1434 -1749 -1230 -446 -391 607 998 772 1632 1243
1432 1243 852 1348 609 269 487 -228 -530 -530 -1276 -1257 -1636 -1989 -1464 -1653 -1253 -38 257 920 2033 2299
1452 2299 2812 2869 2341 1790 695 -316 -916 -2393 -2831 -2630 -2817 -2006 -1074 -550 562 1356 1719 2167 1472
1471 1472 1248 736 -607 -740 -808 -1752 -1053 -614 -805 571 850 1135 1588 1022 826 674 -406 -35 -419
1490 -419 -1512 -566 -278 -697 444 334 198 655 -150 -191 -132 -1207 -842 -864 -1597 -59 306 -5 1425
1509 1425 1467 924 1734 920 301 50 -1145 -936 -1057 -1767 -598 -395 -685 1001 1097 907 1909 1251 618
1528F18Q5r30j51o25r77O69k82m07J512k83j89J419P4K83Q82k26M67l32m40N85
1548A752r79q28L64j490p28O38p47QO20N4P79P80O18Q79m59j32P85j095o61J99
1568C57j436k76N50m12M35N39L85O72k2M59N33j089k92r9j446R6K49o24J62K95
1588i64L82R79K02M88L94q48M65K7j266lk48j108L79J70P5L58K22M43L68j07R55
1609A363rr17O78m42o89M57m14o08l8j31K81Ll51P57m05m22J230l12l74O98l21
1630C4m16P38n6K65K9m91Q53l09l95R56r81q74Q39q41n31N50p53O7N78PJ385Q2
1652G36j73J242o51m22R94j232j126K86j046r5N79m30N96L72J26J610l25L9Q28
1671A908j299n48N13j149l44L84p10M21M07J50R86k40k43Q57j005k22N12j107
$$ plain form
1528 618 703 -227 -378 -1003 -1980 -1311 -1593 -2000 -488 -771 -960 459 533 816 1698 1472 1939 1607 1167 1752
1548 1752 773 -55 309 -1181 -1909 -1271 -2018 -2010 -1390 -1336 -557 223 841 1720 1261 1129 1914 819 158 357
1568 357 -1079 -1355 -805 -1217 -782 -243 142 814 792 1251 1784 695 403 304 -1142 -1046 -797 -1421 -1259 -964
1588 -964 -582 397 599 1087 1481 633 1098 1125 -141 -144 -392 -1500 -1121 -951 -876 -518 -296 147 515 408 1363
1609 1363 1354 437 1115 673 -16 441 27 -581 -619 -750 -469 -466 -817 -60 -465 -887 343 31 -343 355 34
1630 34 -382 356 300 565 594 103 956 647 252 1208 227 -647 192 -649 -1180 -630 -1383 -1316 -738 -731 654 736
1652 736 563 1805 1154 732 1726 494 -632 -346 -1392 -1487 -908 -1338 -742 -370 -244 1366 1041 1080 1908
1671 1908 609 61 574 -575 -919 -535 -1245 -824 -417 -267 719 479 236 1093 88 -134 378 -729
1689g29j32P15k18N26O06k20N08l70j75J50j227m64J55j032K76R65p2R34R04K33
1709A333R23j22k42n62j434o73l75j287K11K66j92J238J200O66Q62K68j17j74
1727A789q99o53o50j030n0M4j99J043R04M52M08K2K3l11r48l96q30p09M39J36
1747a415R9J129O32P64Q22K39Jm62q22m96r53q69o3n37k2O53J31M86O53P3N15
1768E58J05j77N76l22n6O18m05K7N71r48k46k23j139k36n29o72O47j37M91J434
1788f3M97R24J105m92L52L2j314n70o39j172M0l68PJ103J78N29R49o18Q3j01j157
1809f95j82m03p68Q58L33O36J599N48Q43P99n88l62r00j983j036j425j435N0m1
1828d152P35J724R48J817J842M00O69J01j273n10j395j819m09r01o04O60k34Q80
$$ plain form
1689 -729 -861 -146 -364 162 768 548 1056 686 511 661 -566 -1030 -875 -1907 -1631 -666 -738 196 1100 1333
1709 1333 2256 2134 1892 1330 -104 -777 -1152 -2439 -2228 -1962 -2154 -916 284 950 1812 2080 1963 1789
1727 1789 890 237 -413 -1443 -1493 -1449 -1648 -605 299 751 1159 1181 1204 893 -55 -451 -1281 -1990 -1551 -1415
1747 -1415 -1316 -187 445 1209 2031 2270 2271 1809 987 491 -462 -1331 -1394 -1931 -1953 -1300 -1169 -683 -30 43 558
1768 558 663 486 1062 740 684 1302 897 924 1495 547 301 78 -1061 -1297 -1826 -2498 -1851 -1988 -1497 -63
1788 -63 434 1358 2463 1971 2323 2355 1041 471 -168 -1340 -1300 -1668 -1661 -558 -380 149 1098 480 563 462 -695
1809 -695 -877 -1280 -2048 -1190 -857 -221 1378 1926 2769 3568 2980 2618 1718 -265 -1301 -2726 -4161 -4111 -4152
1828 -4152 -3417 -1693 -745 1072 2914 3314 3983 4084 2811 2301 906 -913 -1322 -2223 -2827 -2167 -2401 -1521
1846a521J238J60R31L38n66L74l54q19K63o19M2P92k42M37O62j63L99J2q52p4
1866D38o32r06Kq24j39L95j24N45R24J58J038P10M5P36j90l19m3q88q83k95j239
1887a491l11l21n07N28M34M00J059O28O08Q65k66K43o8p54k54n57p38Ol55k39
1907a090O97k87K10O11k78K45J73n62K25k39m59O07j15J21P51j65K51O06o02J85
1927H85j35r76K22l53q49N59k71o8Q77k99L18O08o18M29J20p41N48M3n63Q10j86
1948C60j23P86o15n9J98j051N6p8r59L99J32k82J000J11L08R77j45L32K40q47
1968G40M3k58j190K78k66o29O17j90L4O20N4K90L18l82L69Q3n63N72j93m45M73
1989C75j47l64L75n40n7K8n41K61J03l53Q96k0N5J179k7lL23n29l98l56r17l88
$$ plain form
1846 -1521 -283 -123 808 1146 580 954 600 -219 44 -575 -533 259 17 454 1116 953 1352 1364 512 438
1866 438 -194 -1100 -1098 -1922 -2061 -1666 -1790 -1245 -321 -163 875 1585 1630 2366 2176 1857 1814 926 43 -252 -1491
1887 -1491 -1802 -2123 -2630 -2102 -1668 -1268 -209 419 1027 1892 1626 1869 1801 1047 793 236 -502 -496 -851 -1090
1907 -1090 -393 -680 -470 141 -137 108 281 -281 -56 -295 -754 -147 -262 -141 610 445 696 1302 700 885
1927 885 750 -226 -4 -357 -1206 -647 -918 -986 -109 -408 -90 518 -100 329 449 -292 256 299 -264 546 360
1948 360 237 1023 408 349 547 -504 -448 -526 -1485 -1086 -954 -1236 -236 -125 183 1160 1015 1347 1587 740
1968 740 783 525 -665 -387 -653 -1282 -665 -855 -821 -201 -147 143 461 79 448 531 -32 540 347 -98 375
1989 375 228 -136 239 -301 -358 -330 -871 -610 -507 -860 36 16 71 1250 1223 1220 1543 1014 616 260 -657 -1045
2011a045n74o00M48j26L44J078M08O99J137J23L30J64l11m45q32q25l09r88n48
2030a872o2l93K58N40J87N53P47O43N45K55M27L28l53K10k30q72k44n88j086n73
2050a580n07m00j32j94M98O07O10J376J225M87J183O25l17J14q48j339j157j658
2068a407r12q56j108N12J68K32K029J236Q27J745N02J00O40o14p31q76j573l03
2086c89p42j040M14k64l20J238J26J00J025j06J92K26j35O04N6n18O10j45p04
2105B28R95n23o87K12p94k15M2m98Q3o2k22J144j7n5J271l30j17R92m72KJ06n48
2127E35L0k37l51L40p69o19N59n97j40P22p75K32R78L1N87M04kM04m85k11L75
2148A011r14l74K18q49J84O44l96L82J08N6K94j56k21m2r58N2L43l99M04P30j37
$$ plain form
2011 -1045 -1619 -2219 -1771 -1897 -1553 -475 -67 632 1769 1892 2222 2386 2075 1630 798 -27 -336 -1324 -1872
2030 -1872 -1934 -2327 -2069 -1529 -1342 -789 -42 601 1146 1401 1828 2156 1803 2013 1783 911 667 79 -1007 -1580
2050 -1580 -2087 -2487 -2619 -2813 -2315 -1708 -1098 278 1503 1990 3173 3798 3481 3595 2747 1408 251 -1407
2068 -1407 -2319 -3175 -4283 -3771 -3603 -3371 -1342 -106 721 2466 2968 3068 3708 3094 2363 1487 -86 -389
2086 -389 -1131 -2171 -1757 -2021 -2341 -1103 -977 -877 148 42 234 460 325 929 985 467 1077 932 228
2105 228 1223 700 13 225 -569 -784 -742 -1240 -1157 -1219 -1441 -297 -314 -369 902 572 455 1447 975 977 1083 535
2127 535 565 328 -23 317 -452 -1071 -512 -1109 -1249 -527 -1302 -1070 -92 -61 526 930 928 1332 847 636 1011
2148 1011 97 -277 -59 -908 -724 -80 -476 -94 14 70 364 208 -13 -55 -1013 -961 -618 -1017 -613 117 -20
2169b0N78Q12J81J58k25l20m45j065k10l88j023Q1Q3j42Q04O38N29P29L33N03
2189A591J57l17j4l30q78j1n20p43J70k80j98M71J15M41N50j32P70o3l78N99o02
2210C98n83L05m70k76L69k10L18L38O6N46mm50M35o41p46K24p67l57L95k24M96
2231h38R17L10R54K39j92M97o79p14j41j210n49J27m39K87Q13K23Q20N30P3M83
2251A511n16n53j27r56l99M04l92L20O93J08P41M24k62K27p84o91M6r30k10L79
2271i67l12N24R94O2Q76J91k20J50q38n12l00r03j75M66j67Q44P54K54P12J31
2291A564m53p5q83p20l49p22j43M63J53P87R57L98P04K34m18j01q75p74l89p09
2311a351o8KL26N20P89M09M29oj55j80p43n09k91m78K16J89M25Q96K71N02N86
$$ plain form
2169 -20 558 1370 1551 1709 1484 1164 719 -346 -556 -944 -1967 -1886 -1803 -1945 -1141 -503 26 755 1088 1591
2189 1591 1748 1431 1417 1087 209 198 -322 -1065 -895 -1175 -1373 -902 -787 -346 204 72 842 779 401 1000 398
2210 398 -185 120 -350 -626 -257 -467 -149 189 255 801 797 347 782 141 -605 -381 -1148 -1505 -1110 -1334 -838
2231 -838 79 389 1343 1582 1390 1887 1208 494 353 -857 -1406 -1279 -1718 -1431 -618 -395 425 955 1028 1511
2251 1511 995 442 315 -641 -1040 -636 -1028 -708 -15 93 834 1258 996 1223 439 -252 -206 -1136 -1346 -967
2271 -967 -1279 -755 239 301 1177 1368 1148 1298 460 -52 -352 -1255 -1430 -964 -1131 -287 467 721 1433 1564
2291 1564 1111 1036 153 -567 -916 -1638 -1781 -1318 -1165 -378 579 977 1681 1915 1497 1396 521 -253 -642 -1351
2311 -1351 -1419 -1417 -1091 -571 218 627 1056 1050 895 715 -28 -537 -828 -1306 -1090 -901 -476 420 691 1193 1779
2332A779l70j88l87q51m11o99o53K27j05K69R03J82N82Q78k80M05O6n83J02l27
2352E39n44K23m29l59L41m36m3O3l24R6K79l91P59K87J3R54K07J8N64o87l29p6
2374G25r62j28l09q86L76J28j69P82L04K67P18k85KJ43o50nM9o61M05J56k07P87
2396E80j23p9L71n22k97N3q52N0j15m43N98L99M2J004K32M0O47n00l20O7j040
2417b08k75q0p99K31J56p3Q37J55K72O99n7Q7K57o85n6n8o97m4j69n42M86p9l4
2440f76M99q0L08L53q5K89K64l28J48j34n04J07k36m49k1j79m7J95j16L37K80
2461g5L7K57L95l8L51j3k16J67l95k34j84l80l44j89j81J67k70K19M64J11L33
2482a8M61K11M28M5k2J98n06q3l49q20k12j09m39m8K04j86M44N43J99O29qL28
$$ plain form
2332 1779 1409 1221 834 -17 -428 -1127 -1780 -1553 -1658 -1389 -486 -304 278 1156 876 1281 1347 764 866 539
2352 539 -5 218 -211 -570 -229 -665 -708 -645 -969 -873 -594 -985 -226 61 74 1028 1235 1253 1817 1130 801 725
2374 725 -237 -365 -674 -1560 -1184 -1056 -1225 -443 -139 128 846 561 563 706 56 51 100 -561 -156 0 -207 580
2396 580 457 378 749 227 -70 -17 -869 -819 -934 -1377 -779 -380 -338 666 898 938 1585 1085 765 832 -208
2417 -208 -483 -563 -1362 -1131 -975 -1048 -211 -56 216 915 858 945 1202 517 461 403 -294 -338 -507 -1049 -563 -642 -676
2440 -676 -177 -257 51 404 319 608 872 544 692 558 54 161 -75 -524 -545 -724 -771 -576 -692 -355 -75
2461 -75 -38 219 614 576 927 914 698 865 470 236 52 -328 -672 -861 -1042 -875 -1145 -926 -462 -351 -18
2482 -18 443 654 1082 1127 1105 1303 797 714 365 -455 -667 -776 -1215 -1263 -1059 -1245 -801 -258 -59 570 562 890
2504H90M80l30K01k04o76j1l56p70O8l06m06L28P7M14M73M8M86M22j47M61J63
2525A305o17J08m66n71J38m10k97J36k44J98M12k45N94K44l91O69O5l34M17k25
2545D86k51J77l37rq8m93J17j10l65M21p3k7N19M08J15N01j25J43j92n08j23l81
2567a95o09K0m50k40P71O9M42N70K15M61L17j50r7n21o99O4o05l39J91l82J30
2588a037O55Q7L08L00L7J51j21j2K32k78l5J34l55K38R6j01k81l70j63k50j47
2609i12j88L17j45M81O02L35M54M11j57q2j25m03m66n95m26m6l35N01K84LM99
2630GK90Q3L32k44k52l40k61j6Jj45O65K66l8O70M7k20p4m30p65k78n67j15p8
2653a462j02Q20N58L51R71J66k04M70l16o18l21o63l63k21l15L89K66J3P20Q5
$$ plain form
2504 890 1370 1040 1241 1037 361 350 -6 -776 -708 -1014 -1420 -1092 -1015 -601 -128 -80 406 828 681 1142 1305
2525 1305 688 796 330 -241 -103 -513 -810 -674 -918 -720 -308 -553 41 285 -106 563 628 294 711 486
2545 486 235 412 75 66 -22 -515 -398 -508 -873 -452 -525 -552 -33 375 490 991 866 1009 817 309 186 -195
2567 -195 -804 -784 -1234 -1474 -703 -634 -192 378 593 1054 1371 1221 1124 603 -96 -32 -637 -976 -785 -1167 -1037
2588 -1037 -382 -295 13 313 350 501 380 368 600 322 287 421 66 304 400 299 18 -352 -515 -765 -912
2609 -912 -1100 -783 -928 -447 155 490 944 1355 1198 1116 991 588 122 -473 -899 -945 -1280 -779 -495 -492 7
2630 7 297 380 712 468 216 -124 -385 -401 -400 -545 120 386 348 1018 1065 845 771 341 -424 -702 -1269 -1384 -1462
2653 -1462 -1564 -744 -186 165 1136 1302 1098 1568 1252 634 313 -350 -713 -934 -1249 -860 -594 -581 139 224
2673B24o8O45k44m17R3m33l13L20k65K48J89n1P04O4l46M33m16l96K09n05l73
2694f98M2k95J03K59P4N49J50N2M73j85Q2M01l87k11O2m60k41K8m46L7m0j23M64
2717c10O2R6M97j06K22K81j41K2j45m28Jl13k07K04l30M5N27l8J64L55j43mL6
2740C47l87o2j54n8m3k34K44L66r5K74L46j29J79j28j37j56j33j72kk49o0j2j41
2763e96L88J82QK64P4n4qj2lj23M1l4q7k02K07j21j89J83o7J3K05j07Q7rj24J45
2789F1r7k39K46p4l8J93k6J03L59j49J63J00l92J58k83m08L7m37k69L38m4J48
2811e50N73J0M05L16j33K37o8l65l1l83l95J34l63P2L36j71K90K64l31K64L9l22
2833a72K09l21j06L68k22K73L79j66L05J85m14K41l44m28L1m38j12L15k81J55
$$ plain form
2673 224 156 801 557 140 233 -200 -513 -193 -458 -210 -21 -72 632 696 350 783 367 -29 180 -325 -698
2694 -698 -656 -951 -848 -589 -515 34 184 236 709 524 606 1007 620 409 471 11 -230 -202 -648 -611 -651 -774 -310
2717 -310 -248 -152 345 239 461 742 601 623 478 50 51 -262 -469 -265 -595 -550 -23 -61 103 458 315 311 347
2740 347 -40 -102 -256 -314 -357 -591 -347 19 -76 198 544 415 594 466 329 173 40 -132 -134 -383 -443 -455 -596
2763 -596 -208 -26 -18 246 320 266 258 246 243 120 161 127 40 -162 45 -76 -265 -82 -149 -136 69 -38 49 40 -84 61
2789 61 -36 -275 -29 -103 -141 52 26 129 488 339 502 602 210 368 85 -323 -286 -723 -992 -654 -698 -550
2811 -550 23 33 438 754 621 858 790 425 394 11 -384 -250 -613 -541 -205 -376 -86 178 -153 111 150 -172
2833 -172 37 -284 -390 -22 -244 29 408 242 547 732 318 559 215 -213 -182 -620 -732 -417 -698 -543
2853e43M98q4L55L34l16K93k21k18J97k67k02J60k78K94M8k56K85j41k56J27k4
2874b15j83J93j38J82K67m8K52K22k07L33j03j78j04k14l86J88k33j42K29j49
2894d34J50K15O0J48o7L4J18p3k8J11k12m9R7q3J20Q2j01K6n6q1J66l85R5P9k82
2919c50K17j7j22J35Q5l4J22q7JK77r1p4K83k97JR2k15K89l36q8K22j68L3J62
2943D0k90K31K86m58K84J19k90K24j12j37L68k70r8L30n21J43J07m09J57K13k73
2964c56L30o6Q2K61r1j0M03m31K16Q3l49K23j20l99Q0j1j90K21j62O7K96k55R5
2987h3K62m38L58o1k56J17K3K7J99q3k0L83j90NJ36k49N5j34k45J56o3k86K56
3010a31j08k9K85n5M7J49j64K72rl21J14Q4l38J31m5l5J65M4n3L3m8M5P3k04J14
$$ plain form
2853 -543 -45 -129 226 560 244 537 316 98 295 28 -174 -14 -292 2 50 -206 79 -62 -318 -191 -215
2874 -215 -398 -205 -343 -161 106 58 310 532 325 658 555 377 273 59 -327 -139 -372 -514 -285 -434
2894 -434 -284 -69 -9 139 72 106 224 151 123 234 22 -27 70 -13 107 189 88 114 58 -23 143 -242 -147 -68 -350
2919 -350 -133 -150 -272 -137 -52 -86 36 -51 -50 227 136 62 345 48 49 141 -74 215 -121 -209 13 -155 -122 40
2943 40 -250 -19 267 -191 93 212 -78 146 34 -103 265 -5 -103 227 -294 -151 -44 -453 -296 -83 -356
2964 -356 -26 -92 -10 251 160 150 553 122 338 421 72 295 175 -224 -144 -155 -345 -124 -286 -219 77 -178 -83
2987 -83 179 -259 99 38 -218 -101 -78 -51 148 65 45 428 238 243 379 130 185 51 -194 -38 -101 -387 -131
3010 -131 -239 -268 17 -38 9 158 -6 266 257 -64 50 134 -204 -73 -118 -153 12 56 3 36 -12 33 106 -98 16
3035A6r9L1Q2p8N2J13P9J21j51pR7j5k71lk24j40m9j25L9l8L08K06J82L68K24
3060G18j69J34P8l56j35j21m58q0o8n4J31j45K05M05j00K97O9k85K73r3l33L4
3082e3O7j48K2l3J19J51k05Q4J69k10J3J6l01K31j4j29L15J3O7J86k84J44M3l29
3106f6J48r6l80K53p9j48L93j10N2K18k29K15J09l53L70j39l71L06j01k33L40
3127I9j35j07J39p7L9K5k88J68J20k20L65kj35L99r1k13J71k28j36m6k09k6L6
3150c52k7L77n3L0M40l5l3J31j79j44j89o3n7k12nK10p2JL01j8j70L26j39j56
3174h8J94j74J50o7N3J52j68K10N3p4k29K2k06j64j07J8J00l4Q5K02l4L87K81
3197E62k91J53l0k10M5r8j68k7k21J35J13k18O7J70k63K45J1k29K17j6j1J48m3
$$ plain form
3035 16 -83 -52 30 -48 4 117 196 317 166 159 256 241 -30 -33 -257 -397 -446 -571 -532 -570 -262 -56 126 494 718
3060 718 549 683 761 405 270 149 -309 -389 -457 -511 -380 -525 -320 85 -15 282 351 66 339 246 -87 -53
3082 -53 14 -134 -112 -145 -26 125 -80 4 173 -37 -24 -8 -309 -78 -92 -221 94 107 174 360 76 220 263 -66
3106 -66 82 -14 -394 -141 -220 -368 25 -85 -33 185 -44 171 280 -73 297 158 -213 93 -8 -241 99
3127 99 -36 -143 -4 -81 -42 -17 -305 -137 -17 -237 128 126 -9 390 299 86 257 29 -107 -153 -362 -388 -352
3150 -352 -379 -2 -55 -25 415 380 347 478 299 155 -34 -97 -154 -366 -371 -161 -233 -232 69 51 -119 207 68 -88
3174 -88 106 -68 82 15 68 220 52 262 315 241 12 34 -172 -336 -443 -425 -325 -359 -274 -72 -106 281 562
3197 562 271 424 394 184 229 131 -37 -64 -285 -150 -37 -255 -188 -18 -281 -36 -25 -254 -37 -53 -64 84 41
3220D1P0K52j34M6Kk29J00j18m15J70j21p1K09j0J01K18q9J36J43m1M1m3k71K02
3244A89j78j46Q1j10n0K40k02J15%j98K96n1j90J84j21r9K98r8J37M6K3J39n0
3267B55j98K54j87k38K12k71j35K70j29j38L28k31L63m2j28J90lj45K86j88k8
3288I7J62k55k6J68k67m6J92j61N7M0K4M0j45j8J94j17R5N3o4OJ11Q0o3N1j13
3313I5J35k86J47j8j81Mnr9J36p4NJ44m1P8K3L4K0k2l8J5N7j09j47j4J03J5j33
3340a56J94r6k38J83J11p9J37J01r4N2J53j44J74k01k1N8j77L9j1j37J21k54l
3363b88K72r1k4L06k72K6K25j26K70j78L9J82j93j37J01l6j60Q7j97K9L5j23J04
3386a49J25o9R0L7m6M2p1q6J73l2KN8j27K23j33q6L12q4n6P3j35j4J50k66R3O6
$$ plain form
3220 41 111 363 229 275 277 48 148 30 -385 -215 -336 -407 -198 -208 -107 111 22 158 301 260 301 258 -13 189
3244 189 11 -135 -54 -164 -214 26 -176 -61 -61 -259 37 -14 -204 -20 -141 -240 58 -40 97 143 166 305 255
3267 255 57 311 124 -114 98 -173 -308 -38 -167 -305 23 -208 155 113 -15 175 172 27 313 125 97
3288 97 259 4 -22 146 -121 -167 25 -136 -79 -39 -15 25 -120 -138 56 -61 34 87 23 29 140 220 157 208 95
3313 95 230 -56 91 73 -108 -104 -109 -208 -72 -146 -141 3 -38 40 63 97 117 95 57 72 129 20 -127 -141 -38 -23 -156
3340 -156 38 -58 -296 -113 -2 -81 56 157 63 115 268 124 298 97 76 134 -43 -4 -15 -152 -31 -285 -288
3363 -288 -16 -107 -131 175 -97 -71 154 28 298 120 159 341 148 11 112 76 -84 3 -194 -165 -130 -253 -149
3386 -149 -24 -93 -3 34 -12 30 -41 -127 46 14 16 74 -53 170 37 -49 263 179 123 196 61 47 197 -69 24 90
3412I0k68K46p6j03J13n6L3M5j69O7R7m7R0K5j91K11q8MO9n4k5M6j84Q1Pj97K16
3439a8Q9j43J09L9L2Q0K2j14J63k80K7J16l72J88j07j14J41k8J0J07K3j28J70
3462A2L0J42jj00J78O4q9n5n0k5q2j77pJ41j37L2K3r4J82j72J28K49j46MJ59j48
3488F1J18k3p9O7j87m0J04r2L1Q6k86K79Q6k59K8R7OJ36n1p0J06n6r9J64k19m1
3514a33J36j00K2qp4K34j30q3K53r3j02K61k06R0P2n0Q4p5j85K41n0j57Q1o3j08
3539a43K10j82J32k2k04J42J54k53J85J1l17M10j88J11J08k92J18R3j65K14j00
3560B2j16K08p0n0P1r5N2k5l8k7RJ9J00J2k04K14M5p1M6O3r9J14j23o4J90j58
3586B5o8J05k04J36m8rJ10l7l1O5j52K55j09j00J90K2n8O4J5k57Q9pl3m5m6m8
$$ plain form
3412 90 -178 68 -8 -111 2 -54 -21 24 -145 -78 19 -28 62 87 -104 107 19 23 92 38 13 59 -125 -44 -37 -234 -18
3439 -18 71 -72 37 76 108 188 210 96 259 -21 6 122 -250 -62 -169 -283 -142 -170 -160 -53 -30 -158 12
3462 12 42 184 183 83 261 325 236 181 131 106 24 -153 -160 -19 -156 -124 -101 -195 -13 -185 -57 192 46 50 209 61
3488 61 179 156 77 144 -43 -83 21 -71 -40 46 -240 39 125 -134 -106 -9 -3 133 82 12 118 62 -37 127 -92 -133
3514 -133 3 -97 -75 -83 -157 77 -53 -136 117 24 -78 183 -23 67 139 89 173 98 -87 154 104 -53 28 -35 -143
3539 -143 67 -115 17 -5 -209 -67 87 -166 19 30 -287 123 -65 46 154 -138 -20 73 -92 122 22
3560 22 -94 114 44 -6 65 -30 22 -3 -41 -68 -59 -40 60 72 -132 82 127 56 102 165 66 180 57 -7 183 25
3586 25 -43 62 -142 -6 -54 -63 47 10 -21 44 -108 147 38 -62 128 150 92 156 171 -86 3 -4 -37 -82 -128 -176
3612a76l1N3J78j55O7J36n8J52%k9P7o6p4M3j33M7j17o5q5J4J25Q1L7r9J22N7
3638A01j40J50q5j8R1j39J30m5n0m6J24o8%O1q6K1j73P7N4p2K3J64n8J31O5j54
3664E8O0O0k07M8n6L7l5oQ4m1q4J42Q5j34P2O1k30J04p6j62M1O2k2J12q9J51Q0
3691A15l3J44n2j93J38o1k06J10N2R5o8j61J55n2k5O0j62j20L21m8j5j2L8J46
3715A66OrJ03j06j65J17k33N7J0j15r9J45j38K30K2qJ21q1J03Q8j4k8j0j60kQ4
3741H4j52M1m6Ro0L3q3Q1n3n0J10oR2J76p3N2P4m9R0k44P1p4j44Mp4j8M9L8l0
3770a52l9L09o7O2r1Q6pMQ1r1j1J3j6m6j57K3RM6O2j59J11j43O2J03j8J80n4P
3798A07J00j00Q4n0j16m4j21L5l3k0PO9J42j66J43k1Q6m2k6Oq3rK5M8j27J26m
$$ plain form
3612 -176 -207 -154 24 -131 -64 72 14 166 166 137 214 148 74 117 -16 31 -86 -151 -236 -222 -97 -16 21 -78 44 101
3638 101 -39 111 26 8 99 -40 90 45 -5 -51 73 5 5 66 -20 1 -172 -95 -41 -113 -90 74 16 147 212 58
3664 58 118 178 -29 19 -37 0 -35 -41 43 2 -82 60 145 11 83 144 -86 18 -58 -220 -179 -117 -139 -27 -116 35 115
3691 115 82 226 174 -19 119 58 -148 -38 14 109 41 -120 35 -17 -42 18 -144 -264 57 9 -6 -18 20 166
3715 166 172 163 266 160 -5 112 -121 -64 -54 -169 -268 -123 -261 -31 -9 -17 104 23 126 214 200 172 162 2 0 84
3741 84 -68 -27 -73 -64 -124 -91 -174 -93 -146 -196 -86 -92 0 176 103 155 229 180 270 26 97 23 -121 -117 -191 -209 -160 -122 -152
3770 -152 -191 118 51 113 22 108 101 105 186 95 84 97 81 35 -122 -99 -90 -44 18 -141 -30 -173 -111 -8 -26 154 100 107
3798 107 207 107 191 141 25 -19 -140 -105 -138 -158 -151 -82 60 -106 37 16 102 60 34 40 -43 -52 -27 21 -106 20 16
3825A6O8Pr5J54j19O9j49P5p8J1O5j49M5Q7nP8l8l4J84o5j84J62j33J15j14r1
3851a18Q3o4L4P2q4R2K9j02N2M8q3N6K0k00K21Nr9J28p4lK6J05o6J54j31j12Q2
3878G1j43j9j85K0R9N1J7R2L6j0k7P3J48j26k4l9pj3o6N5j51L0K8J05m3M4L8p6
3906b2pM1j46K14o6p2J79r9p5R1J0l9J50j31K9Lq5Q0Kj00j02j7j1J71J5lP2K0
3934A02q3J28r5L4N0j63O2K5r5M4l5p6Q9j71lJ88p3k0J19o1J9J35j05J25Q2j2
3960B10j50r5j9J34k46K38kp8k4R2k45J75q0K8J3%J49m4j89K32q3l9M4l3K0K4
3986C2j8OJk07Q2K1n5K8J00p9M7J20j28K29k36J38J56k16p1Q9j19n6K24j88KJ03
4012Ej6m4J32j7l5k15J74k9l9M2O1j34J12J37j24J36m9j69J52j04Q6Ok16O1Q2
$$ plain form
3825 16 84 91 -4 150 31 100 -49 26 -52 -41 24 -125 -80 7 2 80 42 8 192 127 -57 105 -28 87 -27 -118
3851 -118 -35 -99 -65 7 -77 15 44 -58 -6 42 -41 15 35 -165 56 61 -38 90 16 13 39 144 78 232 101 -11 71
3878 71 -72 -91 -276 -256 -157 -106 -89 3 39 29 2 75 223 97 73 34 27 14 -52 3 -148 -118 -90 15 -28 16 54 -22
3906 -22 -29 12 -134 80 14 -58 121 22 -53 38 48 9 159 28 57 60 -25 55 57 -43 -145 -162 -173 -2 13 10 82 102
3934 102 19 147 52 86 136 -27 35 60 -35 9 -26 -102 -13 -184 -187 1 -72 -92 27 -34 -15 120 15 140 222 210
3960 210 60 -35 -54 80 -166 72 70 -8 -32 60 -185 -10 -90 -62 -49 -49 100 56 -133 99 16 -23 21 -12 8 32
3986 32 14 20 21 -186 -104 -83 -138 -110 -10 -89 -42 78 -50 179 -57 81 237 21 -50 39 -80 -136 88 -100 -98 5
4012 5 -11 -55 77 60 25 -190 -16 -45 -84 -42 19 -115 -3 134 10 146 97 -72 80 -24 62 68 -148 -87 -5
4037ep5l5J63j09P1O8L3K4j26j2J66j36L4j1j30J33o5L4J33j53k6M4r1JK0r4R4
4064e0j41K08ML2OJ8k8P2p0JMj76O0O4k07J55j11J27Lmk3J79r8n7J48j86J27l2
4092B5%P3J0k23J37N4j67L2J1K4N5o6o6N4n7K0K2r3J44k1M5lJ18k21K82k0j08
4119F1N7j46J03k2j78N4n0q1K01o6K5P5q9L4J18j25L13j90n6J76o4k06L3l3RJ96
4145A49j76p8P2P5m3n4m0J35j35O7Q4o1O5j6K6M4p6Q8j16jj8j9m3J9Nr4R4J9j12
4174a40N6O3kN3RMJ23o2l5P1n4j2o5j45J52o2j62J60K8k13O1K31J5lj56J31J4
4201F0n8M7J5k1J9j47M8M6l1j9Q2m7m5J57j27J9n7R3j07J2J11p7m2N6O0q9J60
4228A18K4j29O0j4m5j23k5O9j15O2Q7l8m3J46mM7J1o8J49j45j9N6j31k6J1R3m3
$$ plain form
4037 -5 -80 -115 48 -61 10 78 111 135 9 -3 163 27 61 50 -80 53 -12 22 155 2 -24 20 -71 -70 -50 -144 -50
4064 -50 -191 17 21 53 59 77 49 121 51 52 56 -120 -60 4 -203 -48 -159 -32 -29 -33 -56 123 25 -32 116 -70 57 25
4092 25 25 98 108 -115 22 76 -91 -59 -48 -24 31 -35 -101 -47 -104 -84 -62 -155 -11 -32 13 10 128 -93 189 169 61
4119 61 118 -28 75 53 -125 -71 -121 -202 -1 -67 -42 33 -56 -22 96 -29 284 94 38 214 150 -56 -23 -56 -47 149
4145 149 -27 -105 -33 42 -1 -55 -95 40 -95 -28 56 -5 60 44 70 114 38 126 10 9 -9 -28 -71 -52 -47 -141 -47 -28 -140
4174 -140 -84 -21 -23 30 39 43 166 104 69 140 86 74 9 -136 16 -46 -208 -48 -20 -233 -172 59 74 71 -85 46 60
4201 60 2 49 64 43 62 -85 -37 9 -22 -41 41 -6 -51 106 -21 -2 -59 34 -73 -61 50 -27 -69 -13 47 -42 118
4228 118 142 13 73 59 14 -109 -134 -65 -180 -118 -31 -69 -112 34 30 77 88 20 169 24 5 61 -70 -96 -85 8 -35
4255c5O0O3r0J16m5j17J79p2j20Q8q7M9L6o6J9N1K6n0J74k39J00o8Lj7M5m0L7
4282@q3PJ77mN1j37j0O0n7Nn9J5MN5M6M8lm2J6n6j00J9J0o4K8mL3R4j04J62j15
4313hk1N5J06o9kq0q2J58m0L2Jj16Q5J10j28l4N0l9o9j6o8J83Kmj08J70J17j01
4341H4nN2ro4J16k52L6k5j03P0R7r6M7j0L8M3P1Rq6M0K3o1m4J37j17j7J03j03
4369b6m2n7R0l8M0j24j1J59lk0N8%N1j5J18K3j81L0p0l9O4N3k6m2j4M2n7N7k4
4398dJ09o6r5M3o1J73k07J23L6j6j6J01j33k5L3o4j36J56n9M4P9o7O6rjJ95j4
4425A85j33K9p7m6j7Ln0N9NrO2j61J99m7L3L2M4%%o2j8o5r0J41j46m9K04j11L7
4454d8M9M8N7j64O4m6Q2l6o9j4p9J05j55K06j46KK28K0k6R2m1j42J16j44J00j08
$$ plain form
4255 -35 25 88 -2 114 69 -48 131 59 -61 27 -60 -11 25 -41 -22 29 55 5 179 -60 40 -28 -25 -42 3 -37 0
4282 0 -83 -76 101 97 148 11 1 61 4 9 -50 -35 -31 24 70 118 115 73 89 33 -67 -48 -38 -102 -74 -78 -45 49 -55 107 -8
4313 -8 -29 26 132 63 61 -19 -101 57 17 49 50 -66 19 129 1 -33 17 -22 -91 -107 -175 8 10 6 -102 68 185 84
4341 84 79 131 122 58 174 -78 -42 -67 -170 -100 -3 -99 -52 -62 -24 19 90 99 13 53 76 15 -29 108 -9 -26 77 -26
4369 -26 -68 -125 -35 -73 -33 -157 -168 -9 -12 -32 26 26 77 62 180 203 22 52 -18 -57 7 60 34 -8 -22 20 -37 20 -4
4398 -4 105 39 -56 -13 -74 99 -108 15 51 35 19 120 -13 -38 -5 -69 -205 -49 -108 -64 15 -52 14 5 4 199 185
4425 185 52 81 4 -42 -59 -56 -106 -47 -42 -51 11 -150 49 2 35 67 111 111 111 49 31 -34 -124 17 -129 -178 26 -85 -48
4454 -48 1 49 106 -58 6 -40 42 6 -63 -77 -156 -51 -206 0 -146 -144 84 104 78 170 129 -13 103 -41 59 -49
4480d9p5J12P8m6J06j01n6N2o3j3J52l15J49N0L6Q3J1p1k8L8L1L1r7n9K8j5j8
4507d9j26Q3L8N6r0J25m5M6O1PJ9p0q1J11n7j26K7L2Nk5j31J06N6r1J37n8l8J23
4535D5o2L8M2p1m4M9J16j06o5L3K7L3l7Lm8MJ57j79Q8J1k6J09n8l1j54J12r2P3
4563c3J10j73J83j4l5Nnj18J7j2KJ56k19O3N3k9jP4oJ7o2l3N5j3L9p8j37J13J77
4592I6k8P0Kq7P7j65N6k0m2P4q7MO0N9j32J13jk4O7n2p7J60r1o4m9j5J06O2k25
4621a53K04p1o2m5K15p0L7r4J21n5J09j61nJ71k19J61p5P3j22O3%o6O9q1O9P7
4647I0k09J10O8m4L6k3j4jl1J83o7q6l1nKn9j3KN6N1j83R2KM5J40r0j2J18M4j07
4677F4N7r7R8j32j2O9qr2M2ko5P1l7J93j67O9l9J27j05J4L0k4rP9p6o2l0R0j54
$$ plain form
4480 -49 -124 -12 66 20 126 25 -31 21 -42 -55 97 -218 -69 -19 17 100 111 40 12 50 81 112 15 -44 -16 -31 -49
4507 -49 -175 -92 -54 2 -88 37 -8 38 99 106 125 55 -26 85 28 -98 -71 -39 -34 -59 -190 -84 -28 -119 18 -40 -78 45
4535 45 -17 21 63 -8 -52 -3 113 7 -58 -25 2 35 -2 1 -47 -43 114 -65 23 34 8 117 59 28 -126 -14 -106 -33
4563 -33 77 -96 87 73 38 43 38 -80 -63 -75 -73 83 -136 -73 -20 -49 -50 24 18 35 -27 -60 -5 -18 21 -57 -194 -81 96
4592 96 68 138 140 53 130 -35 21 1 -41 33 -54 -50 10 69 -63 50 49 25 92 40 -37 123 32 -32 -81 -96 10 72 -153
4621 -153 51 -20 -82 -127 88 18 55 -39 82 27 136 -25 -30 141 -78 83 8 81 -41 22 22 -44 25 -56 13 90
4647 90 -119 -9 59 15 51 28 14 13 -18 165 98 12 -19 -24 -22 -81 -94 -92 -36 15 -168 -76 -74 -29 111 21 9 127 171 64
4677 64 121 24 122 -10 -22 47 39 -53 -11 -13 -78 -7 -44 149 -18 51 12 139 34 48 78 54 45 124 48 -14 -44 46 -108
4706a08Q7L0o4q0J03K1j47J33nJ62o9j7q6O0k3P9j2Q3j50J5j3J6o9M7M4r9M8K1
4734GM8q5O7o6K2k1k8l3P7m9N4k5L8P2j96O2Q4k25P7J30K2N3k05J24Q1r1R8r3
4762ap8J24j6o8J70j34N1o1OM6J0K5j39R5%n2L5K2n9Q9l0J82j57L9J0j87Q4m6
4790d0K3L1K0j94jR4J07j09J6Q4j50L2J06j39J78m7j2K7N8k7J55k36p3J90j14
4815b1K8j27L2J6k5J15M7j36J72q5P4j10R2K1k7K7p6o7P1Q3j96P5P8j34K0j3O0
4842frj1k6L0K4K2Q5j81J89j3m9m2j5M8m7L6m8p4J3J35j22j73K81j97J88j8lQ0
4870I7j82QJ25j17Q5L8j37Q4pkK7q6K1k7J13q7M0K1J12j96Q1L5q5J00l2j36J47
4897D0J7j75J89O2j16o3j2J46n5j5j7L9M8n6L0m3o8l0o2M1N0RJ21K0m3m0j2O9
$$ plain form
4706 -108 -21 9 -55 -135 -32 -11 -158 -25 -30 132 63 46 -40 20 -3 76 64 147 -3 12 -1 15 -54 -7 37 -62 -14 7
4734 7 55 -30 37 -29 -7 -28 -56 -89 -12 -61 -7 -32 6 78 -118 -56 28 -197 -120 10 32 85 -120 4 85 -6 92 -1
4762 -1 -79 45 29 -39 131 -3 48 -13 -7 39 49 74 -65 30 30 -22 13 35 -24 65 35 217 60 99 109 -78 6 -40
4790 -40 -17 14 34 -160 -161 -67 40 -69 -53 31 -119 -87 19 -120 58 11 -1 26 84 57 212 -24 -97 93 -21
4815 -21 7 -120 -88 -72 -97 18 65 -71 101 16 90 -20 72 93 66 93 17 -50 21 104 -92 -17 61 -73 -53 -66 -6
4842 -6 -15 -26 -52 -22 2 24 109 -72 117 104 55 13 -2 46 -1 35 -13 -87 -74 61 -61 -234 47 -150 38 20 17 97
4870 97 -85 -77 48 -69 16 54 -83 1 -6 -8 19 -67 -46 -73 40 -47 -7 14 126 -70 11 46 -39 61 29 -107 40
4897 40 57 -118 71 133 17 -46 -58 88 33 18 1 40 88 32 62 19 -49 -79 -141 -100 -50 -41 80 100 57 17 5 74
4925G4j48N5l2%M5kJ1n9K8J10k01J92j00RO9k0j37M1k6J87L8k1o7j7L5J9j94L0
4953h1P2rP3j34J54q2j6j74K33q1P6k8p0n7J81j8J3L2p7l5j0M9jJ5K8m8o7P2K2
4982C2j26O8L8K5n4J10j62N6J07Nj13j20R5Nr4K16j30L4l0P4k4J23j73K8k0N6
5008B6p1P1k6nk6J04n5Rj9n8J62k9o4j2mk4Q7m3Mn5M8q4l0Q4R8Mk5rL0n7n3N1
5040B9r5N0j39n8J82j4n1P9l3N9j1M2k2L4o0K8r3O7M0j14K1p3N7J10j5n2j0o8
5068a10J93j14j7q0J03J06j23Q2P4N5j28QP3j47K3j3n4R3j88J97j22J65l3n8M7
5093C2N6J9j43K3L1Q9j06O7k0p7K0J6j06K6K13j67Q3j46O8l9J15r1Q2N3rL5j26
5120bN4o9J57j09o0P2j1n6J1K6n9jj15P0N3J8k9n9M9R5N8j69Q6qR2q0J8q9J49
$$ plain form
4925 74 -74 -19 -51 -51 -6 -8 3 -56 -28 82 -119 73 -27 -18 51 31 -106 -65 -91 96 134 113 46 29 64 83 -111 -81
4953 -81 -9 -18 55 -79 75 -7 -23 -197 36 -45 31 3 -67 -124 57 39 52 84 7 -28 -38 11 10 25 53 5 -62 10 32
4982 32 -94 -26 12 37 -17 93 -69 -13 94 99 -14 -134 -39 -34 -128 88 -42 -8 -38 36 12 135 -38 -10 -30 26
5008 26 -45 26 0 -5 -31 73 18 27 8 -50 112 83 19 7 3 -21 66 23 27 -28 20 -64 -94 -10 88 92 67 58 88 31 -22 29
5040 29 -66 -16 -155 -213 -31 -45 -96 -17 -50 9 -2 40 18 52 -8 20 -73 -6 34 -80 -59 -132 -75 35 20 -32 -42 -110
5068 -110 83 -31 -48 -128 -25 81 -42 40 114 169 41 49 122 -25 -2 -15 -69 24 -164 33 -89 76 43 -15 32
5093 32 88 107 -36 -13 18 107 1 68 48 -29 -9 7 -99 -73 140 -27 56 -90 -22 -61 54 -37 45 98 89 124 -2
5120 -2 52 -17 140 31 -29 43 32 -24 -13 13 -46 -47 -162 -92 -39 -21 -50 -109 -60 35 93 -76 10 2 94 14 32 -57 92
5149I2q6j09M9J6L0R1q8N0m8m3K20r1q7M1O4j0j40J6J18l0q1m0J30j88K48o9j09
5176e4O6j26mJ15p3K5J51l7L6j08j57K37n7J9n6j6R8o0j6k7J01l6NL8n6m1j5l2
5204h0L7r8J75j3j08O6QO7Ro5N2k9j03J1J71j61Q3J7m4Q3l3j2J7n0N0L1j18R8
5232F1Jj61K8J03k7M8p4j4QMJJ8K2j03J41r6P1qj9M6q4R5j8k9L2mm0N9j18K3J5
5263a9o3J6N3K3o4K6Q4j19P1J8P2rn9M5l7O3k0p3r0J2K7J08j00L5l6m1J38n1j36
5292a26J14Q8j01kK4R3j5jj31O4j6K4J8j05P6k3o8Q2p6j2J41j02J8O6o6L0M3m7
5320a0J21j00mO2k96J65J30L7j24o2j4k3J52l2k6R5j17M2Q1po7j8J8J12q3Mk4
5347A2m4K48j48j00P8K5p4j05J48N2p1r9J3O7Pj8l2J08l2L2l0m0k3Q1q2J24j91
$$ plain form
5149 92 6 -103 -54 -38 -8 83 -5 45 -3 -46 174 83 -4 37 101 91 -49 -33 85 55 -26 -66 64 -124 124 55 -54
5176 -54 12 -114 -118 -3 -76 -51 100 63 99 -9 -166 71 14 33 -23 -39 59 -1 -17 -44 57 21 26 64 8 -33 -48 -80
5204 -80 -43 -141 34 21 -87 -21 -13 54 63 -2 50 21 -82 -71 100 -61 22 39 -5 78 45 33 50 0 50 81 -37 61
5232 61 62 -99 -71 32 5 53 -21 -35 -27 -23 -22 -4 18 -85 56 -40 31 23 4 50 -34 61 43 14 46 42 2 61 -57 -34 -19
5263 -19 -82 -66 -13 10 -54 -28 56 -63 8 26 98 89 30 75 38 101 81 8 -82 -70 -43 65 -35 0 -36 -77 61 10 -126
5292 -126 -12 76 -25 -27 -3 90 75 74 -57 7 -9 15 33 -72 4 -19 -87 -5 -81 -93 48 -54 -36 30 -36 -6 37 -10
5320 -10 111 11 7 69 -227 -62 68 105 -19 -81 -95 -118 34 2 -24 71 -46 -4 77 70 3 -15 3 115 32 36 12
5347 12 -32 216 68 -32 46 71 -3 -108 40 92 21 -78 -65 2 9 -9 -41 67 35 67 37 -3 -26 55 -27 97 -94
5374i4J44L7j05%k6q4J38o4p9J06j70K71l6j25Q9l1J36j55J36j23Q8K4j00p6J03
5399Dk6j6R9r6J04q2M5L8n6M3rj1Q0m9r1Q1K0M0k1j77J38M4j42J3l6jJ07j93J00
5428e0R1q1Rp2K21j43l7J14j47mJ45j11L1Q4j93J35q4P9Rj8o2J43K2j17P9N2j92
5455i7O7L9n2M5m0Q6q4P7l7L0r4N4L2K7q2j0l9R1n8O1m0j2K9K4J11j84J04K3r4
5484b3R2o2K4n4k0M1o9P2j5O1j55J04Q1l3l3r6O6m3J11KL3j00M9j10KL0O4J3j54
5513a22J87m3j14J3mQ6M9m7p8M7pm1J65k33J56J17r8l0J0Q4j39J7J43j26N4p8
5539c2l2J17L5n3M2l6O6j6k3r8J35j10PM9J6k2j09Q5o6M4k8N4k7n4J33p3L0K3
5567E7m6K1K3k4L1n1Q8j20J8M4j57R7O7j73J38jq1K1JR7j24J71j7q9j6K4J19p6
$$ plain form
5374 -94 50 87 -18 -18 -44 -128 10 -54 -133 -27 -197 74 38 -87 2 -29 107 -48 88 -35 53 77 -23 -99 4
5399 4 -22 -38 61 -35 69 -13 32 70 14 57 48 37 117 68 -23 58 78 118 97 -80 58 102 -40 -27 -63 -64 43 -150 -50
5428 -50 41 -40 -31 -103 118 -25 -62 52 -95 -99 46 -65 -34 50 -143 -8 -92 -13 -4 -22 -84 59 81 -36 43 95 -97
5455 -97 -30 9 -43 2 -38 48 -36 41 4 34 -60 -6 26 53 -29 -39 -78 13 -45 16 -24 -36 -7 17 128 -56 48 71 -23
5484 -23 69 7 31 -23 -43 -2 -71 1 -14 47 -108 -4 77 44 11 -85 -19 -62 49 51 84 -16 33 -77 -75 -45 19 32 -122
5513 -122 65 22 -92 -79 -83 3 52 5 -73 -26 -33 -74 91 -142 14 131 33 3 13 97 -42 -25 118 -8 46 -32
5539 -32 -64 53 88 35 77 41 107 91 68 -30 105 -5 2 51 67 45 -64 21 -45 -1 -29 25 -2 -56 77 4 34 57
5567 57 11 32 55 31 62 11 99 -21 -3 41 -116 -19 48 -125 13 12 -69 -48 -47 50 -74 97 80 -9 -25 -1 118 42
5595D2j86J29m0k6K7j3np1JP7Q7q7M5Q5q9j16J25r2J05l9NN8%kJ4K6J4p2R1j06
5625a3l5J2O2p5M3L5J7l8k3K5k6M0K0o5J00j23n4J36P9l3r2L6r8R8kj11N9N9k
5654C1j17N0N8PK9r8J02r6Q5n4p6J4Q0kl2OP7r8P6l8k3J1n1K9M8j14J56l7o5Q7
5684D5m7J05j19J8l3Qm2J09p9N8j11M4q0L9J00k5n1J01J4m7L9k4o5K8M2l4OJ9
5712A8j4j04R3K4q3J76j32Q9p7L3J5p1p8Q9J21j37J01j18J01l8j4O2j6p0o7R4
5738ck3l0K3N0j1l8J6J18q9P8j43M8NJ6L9n9m9O4O6m3q4J04o5M2M7m9o7n0J17
5767C0n3j03O8J14m1l9M6j3o0O5pJ5l0n7J72j06N8j1j63P2Q8k5j12K47p8r0k3
5794c6J08O3j48Jl4J04j12N1Q8Oj16J02oj02O4k6j45J71kj7j7j1m1R6j01R9r6
$$ plain form
5595 42 -144 -15 -55 -81 -54 -67 -72 -143 -142 -65 22 -65 -20 65 -24 -140 -15 -107 -2 -41 -36 22 22 20 34 60 74 2 93 -13
5625 -13 -48 -36 26 -49 -6 29 46 8 -15 10 -16 24 44 -21 79 -44 -98 38 117 84 -8 28 -70 28 26 -85 -26 33 31
5654 31 -86 -36 22 29 58 -40 62 -34 51 -3 -79 -65 15 13 -19 -13 64 -34 42 4 -19 -8 -59 -30 18 -96 60 23 -42 45
5684 45 -2 103 -16 2 -31 -23 -65 44 -35 23 -88 -44 -124 -85 15 -10 -61 40 54 7 46 22 -43 -15 27 -7 -1 18
5712 18 4 -100 -7 17 -66 110 -22 67 -10 23 38 -33 -111 -22 99 -38 63 -55 46 8 -6 56 40 -30 -97 -3
5738 -3 -26 -56 -33 17 6 -32 -16 102 13 91 -52 -4 1 17 56 -3 -52 12 78 35 -49 55 -10 32 79 30 -37 -87 30
5767 30 -23 -126 -58 56 15 -24 22 9 -51 14 7 22 -8 -65 107 1 59 48 -115 -43 45 20 -92 155 77 -13 -36
5794 -36 72 135 -13 -12 -46 58 -54 -3 85 91 -25 77 71 -31 33 7 -138 33 31 14 -3 -14 -55 41 -60 39 -57
5821e7J60j31Lj0Mn3O6k2j9Q5N9j45J22l5r5J57k54K29n5nO3j28J09N3k07Q1L4
5848In8O5l0p6J09r6m1Q8l5j9J44j8j36K07j43Q0L1m9l2p3L3p4J82Jo3N3r9j5
5876e5k9L1KK0J0J04K3j02Qk7l1k1o8J51pnj0%p3K9J7n0N1L9Kj35J8N0P8m4Q3
5907E9j54K2n5K0J41K5o1%o8N9R3j93O7R4J8j8q7J43o0j31Q5O4M1j20R6o7k9N
5935a1k5K6P5j39R8j6k5P%n5O5N1j4n0J26r3l3N9j72J08j7oM4r7M2J09q9R1j73
5964a14Q8J85k61Q9P1l0j26J24n2P1ln6J6l7l5j2N1nR4p6q1M7Q1q6J26j32J02
5991C9Jp3qR1r7J04j3o4J05j47N4L3M4j12P2m2N0j02J48r1j26J47K0J2j07N2J40
6018A30j18N0p8J38k09P3M8n4O7r4k9O4j29P4N6m3L3j6J05j69J45l3N6l9p8O8
$$ plain form
5821 -57 103 -28 -25 -35 -31 -84 -18 -40 -59 26 85 -60 62 27 -68 89 -165 64 9 4 67 -61 48 101 -106 -25 9
5848 9 -49 16 -14 -90 19 -77 -118 -30 -65 -84 60 42 -94 113 -30 50 81 32 0 -73 -40 -114 68 69 6 59 -40 -55
5876 -55 -84 -53 -51 -31 -21 83 106 4 12 -15 -46 -67 -135 16 9 4 -6 -6 -79 -50 -33 -83 -32 7 9 -126 -108 -58 20 -24 59
5907 59 -95 -73 -128 -108 33 58 -3 -3 -71 -12 81 -112 -45 49 67 49 -38 105 45 -86 -1 63 104 -16 80 13 -16 -11
5935 -11 -36 -10 65 -74 24 8 -17 -10 -10 -65 0 51 37 -13 113 20 -13 46 -126 -18 -35 -41 3 -94 -52 57 -32 59 -114
5964 -114 -26 159 -102 -13 58 28 -98 26 -26 45 42 -14 2 -35 -70 -82 -31 -36 58 -18 -99 -52 29 -57 69 -63 39
5991 39 40 -33 -41 50 -47 57 44 -20 85 -62 -8 25 69 -43 29 -13 37 -65 83 -8 -134 13 33 45 -62 -10 130
6018 130 12 62 -16 122 -87 -14 34 -20 47 -47 -76 -12 -141 -67 -11 -54 -21 -37 68 -101 44 11 67 28 -50 18
6044A8l5n1R9o3l1L8K5J18n0j58Q7q1K2M8q6N3J11j06L6k9J9J14k5j20L4o4J06
6071B9j10LJ44j20L6M2j02O1M2q1Q2j35J04n0j1Q8J9J3j07J23Nn7l3J4P8q1m7
6098e1p3J03J7M8K4m5n2K8p8J28l9p0J9J31j70pP8m4qL3m2N4p3Q8n0J9N9o1%N5
6128B1K1m0Q0m9KO4k09J57R5j96Q5M4q7l8j4Q2k9J02J8q9j26J96r7pOl9k1N4Q8
6157G4j23P3p1O4k8Oo9pJ20J22k62P1Q4q5j15R5J47j55R8M1j61R9j05Q9J6l3j5
6184c0N5kj4O2j78J51m8J7p6J51k11P1nM7L4l6K1K3l5N9p3m0J47j15k1O4q4J00
$$ plain form
6044 18 -17 -68 31 -32 -63 -25 0 118 68 -90 -3 -84 -62 -14 -100 -47 64 -42 -6 -35 -16 98 73 -47 -13 -77 29
6071 29 -81 -78 66 -54 -18 24 -78 -17 25 -56 26 -109 -5 -55 -66 22 41 54 -53 70 75 18 -15 -1 77 -4 -51
6098 -51 -124 -21 -4 44 68 23 -29 -1 -79 49 10 -60 -41 90 -80 -87 -9 -53 -61 -28 -70 -16 -89 -1 -51 -32 27 -34 -34 21
6128 21 42 2 82 33 35 99 -110 47 142 -54 31 75 -12 -50 -64 18 -11 91 109 20 -106 90 -7 -14 -8 -47 -68 -14 74
6157 74 -49 24 -47 17 -11 -5 -74 -81 39 161 -101 -30 54 -31 -146 -51 96 -59 39 80 -81 18 -87 2 18 -15 -30
6184 -30 25 23 9 71 -107 44 -4 13 -63 88 -123 -52 -57 -10 24 -12 9 32 -3 56 -17 -57 90 -25 -46 18 -66 34
$$ [...]
8191D3
##END NTUPLES=NMR FID
##END=
