##TITLE=31P_DE-80H_X3
 64 sc D2O
 26.2.2025
##JCAMPDX= 6.0         $$ Bruker NMR JCAMP-DX V2.0
##DATA TYPE= NMR SPECTRUM
##DATA CLASS= NTUPLES
##ORIGIN= UXNMR, Bruker Analytische Messtechnik GmbH
##OWNER= root
$$ XWIN-NMR		Version 3.5
$$ Tue Mar 11 12:54:13 2025 Russian Standard Time (UT+4h)  new_Human@DPX200
##.OBSERVE FREQUENCY= 81.013821
##.OBSERVE NUCLEUS= ^31P
##.ACQUISITION MODE= SIMULTANEOUS
##.ACQUISITION SCHEME= undefined
##.AVERAGES= 64
##.DIGITISER RES= 17
##SPECTROMETER/DATA SYSTEM= spect
##.PULSE SEQUENCE= zgpg30
##.SOLVENT NAME= CDCl3
##.SHIFT REFERENCE= (INTERNAL, CDCl3, 0, 198.062)
##AUDIT TRAIL= $$ (NUMBER, WHEN, WHO, WHERE, WHAT)
$$ ##TITLE= Audit trail, XWIN-NMR		Version 3.5
$$ ##JCAMPDX= 5.01
$$ ##ORIGIN= Bruker BioSpin GmbH
$$ ##OWNER= new_Human
$$ C:/Bruker/XWIN-NMR/data/yarkov/nmr/P31/2/pdata/1/auditp.txt
$$ ##AUDIT TRAIL=  $$ (NUMBER, WHEN, WHO, WHERE, WHAT)
(   1,<2025-03-11 12:51:59.65 +0400>,<new_Human>,<DPX200>,
      <created by zg, POWCHK disabled, PULCHK disabled
       configuration hash MD5:
       00 E9 B6 7A A2 85 ED C7 34 08 36 98 17 FE 4E 26
       data hash MD5: 32K
       B9 E2 93 BE 6B 32 53 79 63 52 19 AE CF 07 2E DA>)
(   2,<2025-03-11 12:52:07.71 +0400>,<new_Human>,<DPX200>,
      <Start of raw data processing
       efp BC_mod = 2 LB = 1.5 FT_mod = 6 PKNL = 1 PHC0 = 1800.954 PHC1 = 13.49542 SI = 64K 
       data hash MD5: 64K
       93 D4 67 AF C3 7F AC 01 92 39 05 A6 12 AD 67 04>)
(   3,<2025-03-11 12:53:38.14 +0400>,<new_Human>,<DPX200>,
      <pk PHC0 = 2.622559 PHC1 = -6.000004 
       data hash MD5: 64K
       49 57 9C EE E4 1D 68 BF FE 3A 54 65 16 6F EF FD>)
$$ ##END=
$$ 
$$ hash MD5
$$ 99 25 C6 69 B1 EA A1 79 1B 84 2E B1 90 F7 10 3E
##$RELAX= 
##$RELAX= 
##$RELAX= 
##$RELAX= 
##$RELAX= 
##$RELAX= 
##$RELAX= 
##$RELAX= 
$$ Bruker specific parameters
$$ --------------------------
##$DU= <C:/Bruker/XWIN-NMR>
##$EXPNO= 2
##$NAME= <P31>
##$PROCNO= 1
##$TYPE= <nmr>
##$USER= <yarkov>
##$AMP= (0..31)
100 100 100 100 100 100 100 100 100 100 100 100 100 100 100 100 100 100 
100 100 100 100 100 100 100 100 100 100 100 100 100 100 
##$AQSEQ= 0
##$AQ_mod= 1
##$AUNM= <au_zg>
##$AUTOPOS= <>
##$BF1= 81.014009
##$BF2= 200.13
##$BF3= 200.13
##$BF4= 200.13
##$BF5= 200.13
##$BF6= 200.13
##$BF7= 200.13
##$BF8= 200.13
##$BYTORDA= 1
##$CFDGTYP= 0
##$CFRGTYP= 5
##$CHEMSTR= <none>
##$CNST= (0..31)
1 1 145 1 1 1 1 1 1 1 1 1 1 1 1 1 1 1 1 1 1 1 1 1 1 1 1 1 1 1 1 1 
##$CPDPRG= <waltz16>
##$CPDPRG1= <>
##$CPDPRG2= <waltz16>
##$CPDPRG3= <>
##$CPDPRG4= <mlev>
##$CPDPRG5= <mlev>
##$CPDPRG6= <mlev>
##$CPDPRG7= <mlev>
##$CPDPRG8= <mlev>
##$CPDPRGB= <>
##$CPDPRGT= <>
##$D= (0..31)
0 1 0 0 0 0 0 0 0 0.06 0 0.03 2e-05 3e-06 0 0 0.0002 0 0 0 0 0 0 0 0 0 
0 0 0 0 0 0 
##$DATE= 1741683119
##$DBL= (0..7)
120 120 120 11 120 120 24 19 
##$DBP= (0..7)
150 150 150 150 150 150 150 150 
##$DBP07= 0
##$DBPNAM0= <>
##$DBPNAM1= <>
##$DBPNAM2= <>
##$DBPNAM3= <>
##$DBPNAM4= <>
##$DBPNAM5= <>
##$DBPNAM6= <>
##$DBPNAM7= <>
##$DBPOAL= (0..7)
$$ [...]
##$SUBNAM3= <"">
##$SUBNAM4= <"">
##$SUBNAM5= <"">
##$SUBNAM6= <"">
##$SUBNAM7= <"">
##$SUBNAM8= <"">
##$SUBNAM9= <"">
##$SW= 400.765351723535
##$SWIBOX= (0..15)
0 1 3 0 0 0 0 0 0 0 0 0 0 0 0 0 
##$SW_h= 32467.5324675325
##$TD= 32768
##$TD0= 1
##$TE= 0
##$TE2= 300
##$TE3= 300
##$TEG= 300
##$TL= (0..7)
0 120 53 12 22 120 120 120 
##$TP= (0..7)
150 150 150 150 150 150 150 150 
##$TP07= 0
##$TPNAME0= <>
##$TPNAME1= <>
##$TPNAME2= <>
##$TPNAME3= <>
##$TPNAME4= <>
##$TPNAME5= <>
##$TPNAME6= <>
##$TPNAME7= <>
##$TPOAL= (0..7)
0.5 0.5 0.5 0.5 0.5 0.5 0.5 0.5 
##$TPOFFS= (0..7)
0 0 0 0 0 0 0 0 
##$TUNHIN= 0
##$TUNHOUT= 0
##$TUNXOUT= 0
##$USERA1= <user>
##$USERA2= <user>
##$USERA3= <user>
##$USERA4= <user>
##$USERA5= <user>
##$V9= 5
##$VALIST= <valist>
##$VCLIST= <CCCCCCCCCCCCCCC>
##$VD= 0
##$VDLIST= <DDDDDDDDDDDDDDD>
##$VPLIST= <PPPPPPPPPPPPPPP>
##$VTLIST= <TTTTTTTTTTTTTTT>
##$WBST= 1024
##$WBSW= 4
##$XGAIN= (0..3)
0 0 0 0 
##$XL= 0
##$YL= 0
##$YMAX_a= 27246
##$YMIN_a= -32776
##$ZGOPTNS= <>
##$ZL1= 120
##$ZL2= 120
##$ZL3= 120
##$ZL4= 120
##$ABSF1= 0
##$ABSF2= 0
##$ABSG= 0
##$ABSL= 0
##$ALPHA= 0
##$AQORDER= 0
##$ASSFAC= 0
##$ASSFACI= 0
##$ASSFACX= 0
##$ASSWID= 0
##$AUNMP= <proc_1d>
##$AZFE= 0.1
##$AZFW= 0.5
##$BCFW= 0
##$BC_mod= 2
##$BYTORDP= 0
##$COROFFS= 0
##$CY= -3
##$DATMOD= 1
##$DC= 0
##$DFILT= <>
##$DTYPP= 0
##$F1P= 0
##$F2P= 0
##$FCOR= 1
##$FTSIZE= 65536
##$FT_mod= 6
##$GAMMA= 0
##$GB= 0
##$INTBC= 1
##$INTSCL= 9.790993e-09
##$ISEN= 30
##$LB= 1.5
##$LEV0= 0
##$LPBIN= 0
##$MAXI= 10000
##$MC2= 0
##$MEAN= 0
##$ME_mod= 0
##$MI= 50
##$NCOEF= 0
##$NC_proc= -4
##$NLEV= 6
##$NOISF1= 182.463
##$NOISF2= 159.3651
##$NSP= 0
##$NTH_PI= 0
##$NZP= 0
##$OFFSET= 198.0616
##$PC= 4
##$PHC0= 1803.577
##$PHC1= 7.495417
##$PH_mod= 1
##$PKNL= yes
##$PPARMOD= 0
##$PSCAL= 0
##$PSIGN= 0
##$REVERSE= no
##$SF= 81.0140089999434
##$SI= 65536
##$SIGF1= 159.3651
##$SIGF2= -187.1042
##$SINO= 113.3802
##$SIOLD= 16384
##$SREGLST= <1H.CDCl3>
##$SSB= 0
##$STSI= 65536
##$STSR= 0
##$SW_p= 32467.5324675325
##$SYMM= 0
##$S_DEV= 0
##$TDeff= 32768
##$TDoff= 0
##$TI= <>
##$TILT= no
##$TM1= 0
##$TM2= 0
##$TOPLEV= 0
##$USERP1= <user>
##$USERP2= <user>
##$USERP3= <user>
##$USERP4= <user>
##$USERP5= <user>
##$WDW= 1
##$XDIM= 65536
##$YMAX_p= 486487937
##$YMIN_p= -18363003
$$ End of Bruker specific parameters
$$ ---------------------------------
##NTUPLES= NMR SPECTRUM
##VAR_NAME=  FREQUENCY,     SPECTRUM/REAL,   SPECTRUM/IMAG
##SYMBOL=    X,             R,               I
##VAR_TYPE=  INDEPENDENT,   DEPENDENT,       DEPENDENT
##VAR_FORM=  AFFN,          ASDF,            ASDF
##VAR_DIM=   65536,         65536,           65536
##UNITS=     HZ,            ARBITRARY UNITS, ARBITRARY UNITS
##FACTOR=    0.49542278885378, 1,            1
##FIRST=     16045.7642231865, 0,            0
##LAST=      -16421.768244346, 0,            0
##MIN=       -16421.768244346, -18363003,    0
##MAX=       16045.7642231865, 486487937,    0
$$ Real data points
##PAGE= N=1
##DATA TABLE= (X++(R..R)), XYDATA
$$ [...]
40819B74455k0801l09332m59498k53081J36076L41316J91150j21974k38679j9197
40809d79565K87368L37961J19143p6922q0268k2171l4985k7295R4446J96932J19620
40798D34264m6488r5500k1040J6055l0629m8715J5099O8593K4236q0801j33160
40787A01914n5705J05608J81379M5010j91024k72828j46788k8165m3380l1118
40777c35097J30721K38331P5808j69258j47927R8117K04071P0856j6799P6600
40767B25423R5009j35871l48832k35988M0403P7407j59502l02161j34512J34017
40757g44607K23935J51587Q9847N7328l6745j30466l8490K28193L84407K30281
40747D15270o1047j76593q2198m765m5173n6721M9375J22778K3181j45488k08939
$$ plain form
40819 274455 253654 -55678 -515176 -768257 -632181 -290865 -99715 -221689 -460368 -479565
40809 -479565 -192197 145764 264907 187985 107717 85546 50561 23266 117712 314644 434264
40798 434264 387776 292276 271236 287291 256662 207947 223046 291639 315875 235074 101914
40787 101914 46209 151817 333196 378206 187182 -85646 -232434 -260599 -303979 -335097
40777 -335097 -204376 33955 109763 -59495 -207422 -109305 94766 165622 148823 225423
40767 225423 320432 184561 -164271 -400259 -359856 -282449 -441951 -744112 -878624 -744607
40757 -744607 -520672 -369085 -279238 -221910 -258655 -389121 -427611 -199418 184989 415270
40747 415270 354223 177630 95432 90667 45494 -11227 38148 160926 184107 38619 -170320
40736a70320j71305j19090k7078J35234K33884J47548J5193L6805R7676q6168
40726I2379m45322n33661j47157L37650M41087J73853p0462o1844O4969Q0712
40716f7796p9365l10921m37524l18882P929K96219L11897R8358p1171j3950J75008
40705d10198K75565K04552P5830L3979Q2129R5679n003j33722j27085N5356K62484
40694D09566K95078R7587j90061l53194k91927j12210j645n172N238J06605J86078
40683A45943J15890n2924k04583l33115m11606k41954K48611O54461M66018j53076
40673B33665m29078j5409M83948L68832j74829m31668k17349J2167J852M907J62542
40662d20J82999r8269l33178j96945P0077O7362j08663p5976J50526J91991l2805
$$ plain form
40736 -170320 -341625 -460715 -487793 -352559 -118675 28873 44066 80871 178547 92379
40726 92379 -352943 -886604 -1033761 -696111 -255024 -81171 -151633 -213477 -148508 -67796
40716 -67796 -147161 -458082 -895606 -1214488 -1206559 -910340 -598443 -500085 -571256 -585206 -410198
40705 -410198 -134633 69919 145749 179728 261857 357536 352533 218811 91726 147082 409566
40694 409566 704644 802231 612170 258976 -32951 -145161 -146806 -151978 -146740 -40135 145943
40683 145943 261833 208909 4326 -328789 -740395 -982349 -733738 -79277 386741 233665
40673 233665 -195413 -210822 273126 641958 467129 35461 -181888 -169721 -167869 -162962 -420
40662 -420 182579 84310 -248868 -445813 -375736 -308374 -417037 -493013 -342487 -150496 -183301
40651a83301j73814m3870J06658P2473M9889K51519M74364L77260N409k73176
40641F63411k51348l2736K15157L79489L25359l229l87534n01516l20554j29183
40631d2684q8858p1646K239k2331k08328l01070r4410J95305K30021O8410L8580
40620b94772J85209K29847Q6524K0412J75585K98306J37004j59498k91200k41821
40610A45596j92121j59506l2637J18852R1217r4660j75069m3057R7113P3167n112
40599a76217J0389L4653o2766j63768o1410J68002K31770N8568r5539l9185J02406
40588F903J43698J24673J65067K09675J37405M976n0861p1892j86971l10046k17091
40577d4464N8501K05591R6001k1266O7682K04610J47027l2735j01870o0712r5908
$$ plain form
40651 -183301 -357115 -400985 -294327 -221854 -171965 79554 553918 931178 936587 663411
40641 663411 412063 379327 594484 973973 1299332 1296103 908569 407053 86499 -42684
40631 -42684 -131542 -203188 -200949 -223280 -431608 -732678 -827088 -631783 -401762 -333352 -294772
40620 -294772 -109563 120284 206808 227220 402805 701111 838115 678617 387417 145596
40610 145596 -46525 -206031 -238668 -119816 -28599 -123259 -298328 -341385 -244272 -171105 -176217
40599 -176217 -165828 -131175 -193941 -357709 -419119 -251117 -19347 39221 -56318 -95503 6903
40588 6903 150601 275274 440341 650016 787421 792397 741536 669644 482673 172627 -44464
40577 -44464 14037 219628 315629 294363 362045 566655 713682 680947 579077 518365 422457
40566D22457k35702l30217l23607k84797k01662o232K08189K59322J75265J58764
40556a58220K28674J79302l9067j89922j21466k989l0693j26984j16247o716R5803
40545b88525J88682K86379K76648P6921j66351k34433j17154L3449J40040K06100
40535D01756J71820j9736k48776l12947j92562n4413L316M5236J28000J92728
40525A14422J70439Q1933q721o8012j02701j43878k08293k41331j54228L4107
40515e26263J76054J83306J34536J13175O9758l0460o8979L6511J29853K2337
40505B39828j93482k72193j80809p5692K0147K03547L66676K39563j58368m37977
40495b48760l60603j48870r2957j21283j7627J55681J70233M8208M2528K21290
$$ plain form
40566 422457 186755 -143462 -467069 -751866 -953528 -959760 -751571 -492249 -316984 -158220
40556 -158220 70454 249756 210689 20767 -100699 -103688 -134381 -261365 -377612 -384328 -288525
40545 -288525 -99843 186536 463184 540105 373754 139321 22167 55616 195656 401756
40535 401756 573576 553840 305064 -7883 -200445 -254858 -251542 -206306 -78306 114422
40525 114422 284861 366794 358073 290061 187360 43482 -164811 -406142 -560370 -526263
40515 -526263 -350209 -166903 -32367 80808 150566 120106 51127 87638 217491 239828
40505 239828 46346 -225847 -406656 -482348 -462201 -258654 108022 347585 189217 -248760
40495 -248760 -609363 -758233 -851190 -972473 -990100 -834419 -664186 -615978 -573450 -352160
40485c52160L57121K76412Q4799l9198q6146j35404j71963j25532k2252L6336
40475a77987K8616L6650R9590J38052P6276k8051n7238p228Q132o3142j24566
40464g0896p6702K8969O2663j236o0494l4916K5012p060j84150l79760l55785
40453a054355j8005M01255N45582L53864J21846P9317J05010K93j66153k15203
40443A53451j84150k11567k25450p2478J28553J26367j1628J0751J69638J15902
40433f11j84690k92838K539K89066J73644q8137m5106J86383J41300j92356l48882
40422c59688j33908J15824J03305l8342p2480r272N3678J40606K42850J93940
40412B36513q0888l56621l53334q4112J95572K92864K04223L1024j03618j19588
$$ plain form
40485 -352160 4961 281373 366172 326974 240828 105424 -66539 -192071 -214323 -177987
40475 -177987 -149371 -112721 -13131 124921 201197 173146 115908 108680 116812 53670 -70896
40464 -70896 -147598 -118629 -55966 -57202 -117696 -152612 -127600 -134660 -318810 -698570 -1054355
40453 -1054355 -1072360 -671105 -125523 228341 350187 429504 534514 534807 368654 153451
40443 153451 -30699 -242266 -467716 -540194 -411641 -285274 -296902 -286151 -116513 -611
40433 -611 -185301 -478139 -475600 -186534 -12890 -101027 -146133 40250 181550 -10806 -359688
40422 -359688 -493596 -377772 -274467 -312809 -385289 -394561 -340883 -200277 42573 236513
40412 236513 155625 -200996 -554330 -638442 -442870 -150006 54217 85241 -18377 -137965
40402a37965o0534n3846j33105j90643j58731j10854j01862m8767J06285K40101
40392f49921K09007P2038n285N634J8108L2027J17079K15607J69413k5620j78749
40381b0662j76777j21234j09831o1662R5610K13986J03948j50788k72322j69724
40371f69456l5856l5359j03302j33946j64090k19438j54529J33322M34253M24098
40361e24303J12283j48711j29380L3107J23393J40150J62663J36120m718j34986
40351b34382q4799Q7727J72810J14472M1588J7136l2889j16684j03810O6430K52347
40340A79946K77373J32890n2568j60178j42241k3436R6791J07305L79j21931j68966
40329A25364j26165j3488J12571J24360n1986k45400j65081J82296L90506J50432
$$ plain form
40402 -137965 -198499 -252345 -385450 -576093 -734824 -845678 -947540 -996307 -890022 -649921
40392 -649921 -440914 -368876 -374161 -368527 -350419 -318392 -201313 14294 183707 158087 -20662
40381 -20662 -197439 -318673 -428504 -490166 -394556 -180570 -76622 -227410 -499732 -669456
40371 -669456 -705312 -740671 -843973 -977919 -1142009 -1361447 -1515976 -1382654 -948401 -524303
40361 -524303 -412020 -560731 -690111 -657004 -533611 -393461 -230798 -94678 -99396 -234382
40351 -234382 -319181 -231454 -58644 55828 97416 114552 81663 -35021 -138831 -72401 179946
40340 179946 457319 590209 537641 377463 235222 211786 308577 415882 416261 294330 125364
40329 125364 -801 -14289 98282 222642 170656 -74744 -239825 -57529 332977 483409
40319D83409k92147m14908r3546K63685K81615O5102m0191O5179J83334J55620
40309F57152L3576q8042k19297l73960m50814l46803j35367J928K4473Q4929K76275
40298e35950M37325L30413k9889l53555l92642j77212R2953K77317L41175K74659
40288B64594J01867n4615n3981Q0992J60496O4293r4927j26985l0672J0447r8173
40277B23336k13994j57715J7970Q0401p0343k58022k51229m4643J63130K25867
40267b85242J81043J27016P8186K310o9240o5606m24J8850n9116j35743q2988
40256b90954P4578J73682J10384m3459j41058j15322k033J25363J89661J32976
40246B13818k2039j63536k02425j60559r7636j7852O4003M5763j20072k52893
$$ plain form
40319 483409 191262 -223646 -317192 -53507 228108 293210 253019 318198 501532 657152
40309 657152 690728 602686 383389 9429 -441385 -788188 -923555 -921627 -897154 -812225 -535950
40298 -535950 -98625 231788 201899 -151656 -544298 -721510 -628557 -351240 -10065 264594
40288 264594 366461 311846 257865 338857 499353 563646 468719 341734 311062 321509 223336
40277 223336 9342 -148373 -130403 -50002 -120345 -378367 -629596 -674239 -511109 -285242
40267 -285242 -104199 22817 101003 103313 34073 -31533 -31957 -13107 -72223 -207966 -290954
40256 -290954 -216376 -42694 67690 24231 -116827 -232149 -234182 -108819 80842 213818
40246 213818 191779 28243 -174182 -334741 -432377 -450229 -386226 -340463 -460535 -713428
40236g13428j12890K29704L95178J59914k38399l87821j77321J46719L05913K27699
40226a64732J5877j69150k04903q5905P4293J60147J53853J01670M3500L772k2617
40215i4195r1029k08238k16764L4809L67089L76504O966k64377o5932K96364K72714
40204D13911r9994k67933k8457J73633l6131l83496l73320q860K51547J29124
40194b29976j73820k91475j19556J12713J17833j15528k81699j27316J84878K63492
40184f60454M4728q7219J58151N50739O41949L26371j02779l42992l24962j44335
40174E9197N2595J43123J30194J37903K08531J95182j4128k73033l53806k64231
40164B1527j85740j52203k8052J82711K44481J2096l09859l65467n6048L35828
$$ plain form
40236 -713428 -826318 -596614 -201436 -41522 -279921 -667742 -845063 -698344 -392431 -164732
40226 -164732 -148855 -318005 -522908 -608813 -534520 -374373 -220520 -118850 -75350 -71578 -94195
40215 -94195 -185224 -393462 -610226 -575417 -208328 168176 175142 -89235 -155167 141197 413911
40204 413911 313917 45984 17527 191160 155029 -228467 -601787 -610647 -359100 -229976
40194 -229976 -403796 -695271 -814827 -702114 -584281 -699809 -981508 -1108824 -923946 -660454
40184 -660454 -615726 -702945 -544794 5945 647894 974265 871486 528494 203532 59197
40174 59197 111792 254915 385109 523012 731543 926725 912597 639564 285758 21527
40164 21527 -164213 -316416 -344468 -161757 82724 94820 -215039 -580506 -636554 -300726
40154c00726M35158J68511j46940j50472J33312L19702J56475j63742l04173k39353
40144i2248j96569k43645k12298l0985J37069J63787J33781J43954J33707N7082
40134f365L2139J26888J55355o3627l39311k95752P1056L21639J62435j62214
40124B243k56821j24642m5807o0036M7697K61081K52963o1779k78794q8066K10702
40113a41259J60431j17284j24010J80298K95054j181k91635k05952J3602k2695
40103b54631j99743j46880J07352J97133K6912j13328k8099J45093K03414R9286
40093C6509j17757l24409l07320N899L24055K98109L2785m6210J47788K29162
40083B78611k2493k87473j95303J25409K65654Q7140k11374m11272m06834j64688
$$ plain form
40154 -300726 134432 302943 156003 5531 138843 458545 615020 451278 147105 -92248
40144 -92248 -288817 -532462 -744760 -775745 -638676 -474889 -341108 -197154 -63447 -6365
40134 -6365 25774 152662 308017 244390 -94921 -390673 -319617 2022 164457 2243
40124 2243 -254578 -379220 -425027 -485063 -437366 -176285 76678 14899 -263895 -351961 -141259
40113 -141259 19172 -98112 -222122 -41824 253230 252049 -39586 -245538 -231936 -254631
40103 -254631 -454374 -601254 -493902 -296769 -269857 -383185 -411284 -266191 -62777 36509
40093 36509 -81248 -405657 -712977 -707078 -383023 -84914 -52129 -98339 49449 278611
40083 278611 256118 -31355 -226658 -101249 164405 251545 40171 -371101 -777935 -942623
40073i42623J91838L63685J91658q6514j31798K0478M7784j39511k70022j47966
40063i02991O9744J58178J48976J84405K16179Q6312j56352k55622j00053J08672
40053d42552J36004L2609K8220J69153K35848N7377k33354l58883k33691k7898
40043f37167P4028O3636M3277O3984Q2030L9817n2836j19374r0610K7651J70759
40032c34805K79853L10337K05064m2814k89706l29511j43398N1983Q5672M0139
40022a67186O8853J36722J08090p17m9483n681L8279N1298Q2977J06061K0617
40011C89830j67282l23248l54626k76129j26290M0730J16213N1071k9535P725
40001f71541Q6979O5416o05J2768N92j92064l61087j47939L21541M88231J84327
$$ plain form
40073 -942623 -750785 -387100 -195442 -281956 -413754 -393276 -345492 -485003 -755025 -902991
40063 -902991 -833247 -675069 -526093 -341688 -125509 -39197 -195549 -451171 -551224 -442552
40053 -442552 -306548 -273939 -245719 -76566 159282 216659 -16695 -375578 -609269 -637167
40043 -637167 -563139 -499503 -456226 -392242 -310212 -270395 -323231 -442605 -533215 -505564 -334805
40032 -334805 -54952 255385 460449 417635 127929 -201582 -344980 -292997 -207325 -167186
40022 -167186 -98333 38389 146479 145762 96279 90598 128877 180175 263152 369213 389830
40011 389830 222548 -100700 -455326 -731455 -857745 -817015 -700802 -649731 -679266 -671541
40001 -671541 -584562 -519146 -519751 -506983 -506391 -698455 -1059542 -1207481 -885940 -397709 -213382
39990b13382r1931K9855K20768N6955k42157j96050J20725K26884M3435l7861
39980h2759J23230J94426o627j64415J9762L27892L32719o293l20553l10703n2924
39969E3755J44401P8725j52098k69695j41810O4763J21850L1211o0071j31427
39959b60396k57348l58165k45067O1666L02535L28987K66308K55108K48801J71228
39949E13657P1291q402j32971k99000l29036j23719J16401J27632m2213j07964
39939b14324L5291J75104R5292j38846k87022k23436l4839J19988J69275J47705
39929a55812J09890O5665R276k0896L0597J33194J53821P807j95370k38688n3407
39918a53923J84599K69582K07813J41608Q5327q0816l23948l87891j59366Q5571
$$ plain form
39990 -213382 -305313 -275458 -54690 2265 -239892 -435942 -315217 -88333 -44898 -82759
39980 -82759 40471 234897 228270 63855 83617 411509 744228 737935 417382 106679 53755
39969 53755 198156 276881 124783 -144912 -286722 -221959 -100109 -68898 -128969 -260396
39959 -260396 -517744 -875909 -1120976 -1059310 -756775 -427788 -161480 93628 342429 513657
39949 513657 584948 576546 443575 144575 -184461 -308180 -191779 -64147 -106360 -214324
39939 -214324 -179033 -3929 91363 -47483 -334505 -557941 -592780 -472792 -303517 -155812
39929 -155812 -45922 19743 29019 8123 38720 171914 325735 333542 138172 -100516 -153923
39918 -153923 30676 300258 508071 649679 735006 654190 330242 -57649 -217015 -131444
39908a31444M3349j42715q6487K18330L55851J25659j61325j89005q2908r8417
39898a49112j69164r6076L8817J1491j34378j70570q0715l2793l0824N7380J74249
39887e81695J36917J2145N1693K28098K23617l2806k00158m8158J98561K37421
39877B25635J14908M7510N2991P025r3277j41676r6507N471J02622Q4489j28331
39866A80860l89454m09238j51098O5743M449j71802k01289j13848p9846o7440
39856a332963N7115K16309K11716O7317M827R4315J81306J76234J84015K80507
39846A40698L38972J85687j45999l90673k93095R8697M03314K77005j70804m81981
39836c8179m07263j59914l2586j8130R975k648j29524j97767k1747K21257K05112
$$ plain form
39908 -131444 -88095 -230810 -317297 -98967 256884 382543 221218 32213 -50695 -149112
39898 -149112 -318276 -414352 -375535 -364044 -498422 -668992 -749707 -782500 -813324 -755944 -581695
39887 -581695 -444778 -432633 -380940 -152842 70775 37969 -162189 -210347 -11786 225635
39877 225635 340543 388053 441044 448069 354792 213116 116609 122080 224702 309191 180860
39866 180860 -208594 -617832 -768930 -703187 -698738 -870540 -1071829 -1185677 -1265523 -1332963
39856 -1332963 -1275848 -1059539 -847823 -780506 -775679 -681364 -500058 -323824 -139809 140698
39846 140698 479670 665357 519358 128685 -164410 -65713 337601 614606 443802 -38179
39836 -38179 -445442 -605356 -637942 -656072 -646097 -648745 -778269 -976036 -997783 -776526 -571414
39825e71414k3052j04415O2818K01923J56609J20480K29871K90032J30289o3724
39815D29417n1236M5662o5952l62543n14321l49633m7987J48303J94367J63144
39805d10779R5035K1949J1030P8399J34090R7955J5066j6738K0252Q1307J52192
39794B79758K18517J92045K2714j25199j4056K78160L38068k8440m19283l13917
39784D28367J78107M23781J44047k18709j77034J25515K15735L190j88874j73289
39774G60836r2704q0705p5742l2164k6313n5566K1503K20659L18244J55525j04727
39763A008846j95337j04721l7524p3046n7759J25828L39512L68010K66220L55144
39753A995173P72429J145924R32999J03135p43024j051091r05345p56930p51458
$$ plain form
39825 -571414 -594466 -698881 -636063 -434140 -277531 -157051 72820 362852 493141 429417
39815 429417 378181 423843 357891 -4652 -518973 -868606 -916593 -768290 -573923 -410779
39805 -410779 -315744 -293795 -282765 -204366 -70276 27679 42745 26007 46259 127566 279758
39794 279758 498275 690320 713034 587835 573779 851939 1190007 1161567 742284 428367
39784 428367 606474 1030255 1174302 955593 778559 904074 1119809 1122999 934125 760836
39774 760836 668132 587427 511685 479521 453208 397642 419145 639804 958048 1113573 1008846
39763 1008846 813509 708788 671264 598218 540459 666287 1005799 1373809 1640029 1995173
39753 1995173 2767602 3913526 4846525 4949660 4206636 3155545 2250200 1493270 741812
39744G41812o39256k91592M1088Q2087j06004k47071j89467p00J64676J92408
39734b52019P9112o0018j11466j00930j20181j31817O52K60643M20337L07827
39724B92140O478k72112l87180k94008l5554K00009J76230j02211l25059k46913
39714i88180j1858N6707r7551k23281j35497O6840J89452J85968J37675J06002
39704g13723J04026J51763K54089L32048K68093N9920j27572j30121J6184J17183
39694C31890O8604k2886o243J08103J82180J33307L341j13706j40109n4624O2127
39683E51984P3930m1851j38552j05187l7539p2962j47615j04198J8844K5608j22490
39672a00028k52467k58775k12539j48570J9189K75304M16015L20362J30898K7181
$$ plain form
39744 741812 102556 -189036 -147948 -65861 -171865 -418936 -608403 -609103 -444427 -252019
39734 -252019 -172907 -232925 -344391 -445321 -565502 -697319 -696667 -436024 -15687 292140
39724 292140 298618 26506 -360674 -654682 -690236 -490227 -313997 -416208 -741267 -988180
39714 -988180 -1000038 -943331 -1040882 -1264163 -1399660 -1332820 -1143368 -957400 -819725 -713723
39704 -713723 -609697 -457934 -203845 128203 396296 456216 328644 198523 214707 331890
39694 331890 400494 377608 371365 479468 661648 794955 798296 684590 544481 489857 551984
39683 551984 625914 584063 445511 340324 302785 229823 82208 -21990 -3146 22462 -100028
39672 -100028 -352495 -611270 -823809 -972379 -953190 -677886 -261871 58491 189389 216570
39662B16570j5925r5087j62758j28805o0203q3482j57721j28302K5557J54411
39652d35745J41608K3525q4615r3936J846R9075N9251j07501j96831n3110J97726
39641d48707K86937J48089j2772p140R7772R4843p6276k43219k13410j9230J20912
39630b72201R8408P1219K24410M45296M13386L4771l81670m70441k20345N7700
39620E33J01996n5176j88850j61060o8488q0101j46012j6103L52810N90088L50172
39609F79809j59636m03975k25284L0512J04299J27165K20867K21551L3490j11921
39599E16877m0432M2997o6336j76447n2241J12014J1624j93783j13844J99890
39589B40319L27503J71342N2305R2389K6883k37725l65166j21139K21604K80597
$$ plain form
39662 216570 200645 105558 -57200 -186005 -246208 -329690 -487411 -615713 -590156 -435745
39652 -435745 -294137 -270612 -355227 -449163 -447317 -348242 -288991 -396492 -593323 -646433 -448707
39641 -448707 -161770 -13681 -26453 -33593 64179 159022 82746 -160473 -373883 -393113 -272201
39630 -272201 -173793 -102574 121836 567132 980518 1015289 633619 163178 -57167 533
39620 533 102529 47353 -141497 -302557 -371045 -451146 -597158 -613261 -260451 329637 679809
39609 679809 520173 116198 -109086 -78574 25725 152890 373757 595308 628798 516877
39599 516877 476445 519442 453106 276659 224418 336432 348056 154273 40429 240319
39589 240319 567822 739164 791469 883858 910741 673016 307850 186711 408315 688912
39579F88912Q1814p8104p0830K388L2009j6953j28582k05738j35302K4856P3280
39568B67750m6449j65415j70082j44178j34656k8072J88492K88760J29827r4679
39558I1298j37079m4588l080j1861L0215O1671l9211j85808j86796n4865L6268
39547d43836M2156M3019R277j43248k87157j81293J26248K92679J70662K1575
39537c49918R0396K21686J20406j78850l56700k47999j2308J20884R3240j7276
39527e16439j23533j70331j44793r0586n3816r170Q4997J66160J22441j692L010
39516g33752K17779M18716L46608P4842q7276l7045J492j41629l07715k68203
39506e16183q4870L664l7667q034J92195L99872M06684J84068j43732m04806m26717
$$ plain form
39579 688912 770726 692622 621792 624180 656189 639236 510654 304916 169614 194470 267750
39568 267750 221301 55886 -114196 -258374 -393030 -421102 -232610 56150 185977 91298
39558 91298 -45781 -90369 -93449 -105310 -75095 -13424 -52635 -238443 -425239 -480104 -443836
39547 -443836 -401680 -358661 -349384 -492632 -779789 -961082 -834834 -542155 -371493 -349918
39537 -349918 -259522 -37836 82570 -96280 -452980 -700979 -713287 -592403 -499163 -516439
39527 -516439 -639972 -810303 -955096 -1045682 -1099498 -1108668 -1023671 -857511 -735070 -736762 -733752
39516 -733752 -515973 -97257 249351 324193 236917 199872 201364 59735 -247980 -516183
39506 -516183 -601053 -597389 -635056 -643090 -450895 -51023 355661 539729 395997 -8809 -435526
39495d35526j48680K35964L99020K41522J5445k3290M8549j1985k08954k82630
39485a70565r6104J42617J41695r2701k56062j16040K05454L68884K04425j03991
39475B27612k46279j40673J3369K0651o8626n4420J34545L39243L53631J54673
39465G33726q7045k02492j76078r5558k3745J6594r587j03938j59226o4058J10688
39454f0719J80504J25171J11331J79827J43178p2581k34633j75050j17533l09286
39444b29791n12955k91769K65835N71241L48846j3329q3104M9392P4352q700j45
39433A69873Q3674N9154o3210p9808O9022K09316J87361K9391j56058k84528k99459
39422g5272j92025l0205J02041J75444J82966J07598j4304p9379l8894M9244J45292
$$ plain form
39495 -435526 -584206 -348242 50778 292300 307745 284455 333004 321019 112065 -170565
39485 -170565 -266669 -124052 17643 -75058 -331120 -447160 -241706 127178 331603 227612
39475 227612 -18667 -159340 -145971 -125320 -193946 -248366 -113821 225422 579053 733726
39465 733726 646681 444189 268111 172553 148808 165402 155815 51877 -107349 -171407 -60719
39454 -60719 119785 244956 356287 536114 679292 606711 372078 197028 79495 -229791
39444 -229791 -742746 -1034515 -768680 -197439 151407 138078 54974 104366 178718 170018 169873
39433 169873 253547 312701 249491 169683 238705 448021 635382 664773 508715 224187 -75272
39422 -75272 -267297 -297502 -195461 -20017 162949 270547 256243 176864 137970 187214 332506
39411C32506K80048M02897L34034J3751l23216l93874k11522k9850p101p7639
39401C20034j11599n6446O2486J71694J92842J24158M1962j2600o2826q6127j7191
39390E66387Q5177N5861j01380j63837m4718L6270p5802j82146q3454J8096j57179
39379d6725m10044k84630J95075M78735K67201q2728j15692J03412J85869R19
39369B91392k22827k68736j62044m8889j4669m5314p7402n7431K2758J39328K62917
39358a80917L43083L02865J12445j46079l34741l60583k08552M4402K14638J37727
39348g5712j12208k63347k02501j25737k00072k75056j43190R6705K06565J88782
39338i05771J97905K06525J03629J7646J44026L12784J73428j83074k68121M1440
$$ plain form
39411 332506 612554 1015451 1349485 1363236 1040020 646146 434624 404774 397673 320034
39401 320034 208435 151989 214475 386169 579011 703169 745131 732531 669705 583578 566387
39390 566387 651564 707425 606045 442208 397490 433760 357958 175812 92358 110454 -46725
39379 -46725 -456769 -741399 -546324 -67589 199612 116884 1192 104604 290473 291392
39369 291392 68565 -200171 -362215 -411104 -425773 -471087 -548489 -605920 -583162 -443834 -180917
39358 -180917 162166 465031 577476 431397 96656 -263927 -472479 -428077 -213439 -75712
39348 -75712 -187920 -451267 -653768 -779505 -979577 -1254633 -1397823 -1301118 -1094553 -905771
39338 -905771 -707866 -501341 -397712 -380066 -236040 76744 250172 67098 -201023 -159583
39328a59583K68340O1668k88454l48001j69157p1579q3487J1376K38351L93519
39318a47007L55385J70898q6108l19797l69069j70245J11252K71985K89732K24056
39308C31082P2809j03032j17575M8960R9429j60407m36662l21997Q0198K90173
39298b17022J45772m1305l8096N358p9302j61535n9110J41440K19567J22652l1806
39287F613j35804j37110j6021J53108K05801P5977q3859p5727J02208K73915K94178
39276F63279J60272l0830j51519j17555J2909M8776j21734l44993l48785r6849
39266c27029J30443Q7517j11194j52293M7203K44916K20093L5623j21479j88317
39256a34517j81485o1214J58406K69879Q9070k23922l08208p9304J75634K18686
$$ plain form
39328 -159583 108757 170425 -118029 -466030 -635187 -706766 -790253 -778877 -540526 -147007
39318 -147007 208378 379276 293168 -26629 -395698 -565943 -454691 -182706 107026 331082
39308 331082 403891 300859 183284 232244 331673 171266 -265396 -587393 -507195 -217022
39298 -217022 -71250 -112555 -150651 -145293 -224595 -386130 -445240 -303800 -84233 38419 6613
39287 6613 -129191 -266301 -282322 -129214 76587 152564 68705 -7022 95186 369101 663279
39276 663279 823551 792721 641202 523647 536556 585332 463598 118605 -230180 -327029
39266 -327029 -196586 -109069 -220263 -372556 -325353 -80437 139656 175279 53800 -134517
39256 -134517 -316002 -377216 -218810 51069 140139 -83783 -391991 -471295 -295661 -76975
39246g6975J28963O7704K4733n7560j14350q2573l6062l8658j0626R8360J50422
39235E3378J9877j65546j78079k871J77842K40733J92968N5611j44210k93385
39225d3682k59615m1762K28396L96337L47008O6478k69398l90348k28141j021
39215a95748R4036J06285J21033M3421j81434l21052j31100K25913L46809J33728
39205B41891j10954j29769J6406J46159J89424J64585J05084N4905J1541j08413
39195E80859l15788m34915l24521j27444p1423r9490J8528K46200K77437J1840
39185b38717k71410l04935j38255M6945J81898K48103J85422J2062j15953r0852
39175d85692J3289P2198O5461M1732L4369M7576M3936l2695j31318q8011J03225
$$ plain form
39246 -76975 51988 119692 144425 86865 -27485 -110058 -146120 -184778 -195404 -97044 53378
39235 53378 73255 -92291 -270370 -273241 -95399 145334 338302 393913 249703 -43682
39225 -43682 -303297 -345059 -116663 279674 626682 693160 423762 33414 -194727 -195748
39215 -195748 -101712 4573 125606 169027 -12407 -333459 -464559 -238646 108163 241891
39205 241891 130937 1168 17574 163733 353157 517742 622826 677731 689272 580859
39195 580859 265071 -169844 -494365 -621809 -693232 -792722 -774194 -527994 -250557 -238717
39185 -238717 -510127 -815062 -953317 -906372 -724474 -476371 -290949 -278887 -394840 -485692
39175 -485692 -472403 -400205 -334744 -293012 -258643 -211067 -167131 -199826 -331144 -419155 -315930
39164c15930J65524o3180k69129p2206L14577L17241j08892l63480j11083K37323
39154b69235K21319R364o885J15483P8313o4946k7056J62766K02017M0026o6901
39143C94265j6287M825j16240k44635k61677k35550k36213j81812K8034L36607
39133e28683N44008M57997P7492l24577m15783j84816M3404P1760Q6242K69277
39123I6321M16631K40092j44443l81813l89727l38673k39383K6514L16415L19493
39113g8573P2500m8048P3448J27135n9168k24015j44326l106j2255j7540J85363
39102a28585M13380L44025K5198k09344k15127j11429J8008J73737K45971R3861
39092F49695j76205k91727j95018q7052o9079j6758J16814J46454m8500k82312
$$ plain form
39164 -315930 -150406 -213586 -482715 -554921 -240344 76897 -31995 -395475 -506558 -269235
39154 -269235 -47916 -38552 -45437 70046 148359 83413 56357 219123 421140 461166 394265
39143 394265 377978 382803 266563 21928 -239749 -475299 -711512 -893324 -865290 -528683
39133 -528683 15325 473322 550814 226237 -189546 -374362 -330958 -259198 -172956 96321
39123 96321 512952 753044 608601 226788 -162939 -501612 -740995 -714481 -398066 -78573
39113 -78573 -6073 -54121 19327 146462 87294 -136721 -281047 -284153 -296408 -313948 -128585
39102 -128585 284795 628820 654018 444674 229547 118118 136126 309863 555834 649695
39092 649695 473490 181763 -13255 -100307 -169386 -186144 -69330 77124 28624 -253688
39082b53688k97052j01698R0177J60650J58621J34317P0451k7180r8689j08200
39072b72291p0657J526R9924J65001J14386m4390j93431k35370j98537j67055
39062h00894j42071m2383J46073K88378K39345N3124l6074J03902L12764L31682
39052D53846J46828n820Q952M5094o2567k16853k06436l0341J25939J82582K15386
39041F56610K28485J16694r9916k33821k07464j57439j60493r1701R2258J73907
39031C17120O550j88792j42861J9246o111j65067j23982J45567K78496R3105j29467
39020A03804j03614N2350P9517j6218o6656n3904p4735j23138j26223j05298j21512
39009e55627j40101r4283n02J02945K14104K58760R6059k13324l36112q7113K43056
$$ plain form
39082 -253688 -550740 -652438 -562261 -401611 -242990 -108673 -38222 -65402 -164091 -272291
39072 -272291 -342948 -341422 -241498 -76497 37889 -6501 -199932 -435302 -633839 -800894
39062 -800894 -942965 -985348 -839275 -550897 -311552 -258428 -294502 -190600 122164 453846
39052 453846 600674 594854 603806 648900 586333 369480 163044 132703 258642 441224 656610
39041 656610 885095 1001789 901873 668052 460588 303149 142656 50955 143213 317120
39031 317120 323670 134878 -7983 11263 5152 -159915 -283897 -138330 140166 233271 103804
39020 103804 190 52540 132057 115839 49183 -4721 -79456 -202594 -328817 -434115 -555627
39009 -555627 -695728 -790011 -790513 -687568 -473464 -214704 -118645 -331969 -668081 -755194 -512138
38998e12138K58777M1027K8228L41072N70630L45064j55445m31173k71762M8059
38988B62339J52366J625j26712m5996R0138M2181j23931j18829J11207K71364
38978E15752J46236j14205k71623l11352k96474j62710R6307K59282J71306J4709
38968D7228m737l3803k77047n15571l66136P5222L16381J83999L542K5658J18828
38957d26436J32611J43001J81167R4584j40349k90727k19342o5686N8073K19836
38947c13268L74384K93859o096j47373M6477K28330P1779k10308k50867j17004
38937c0087r7494j63476r8408L1410J5327l6945J26167L40237J89545k55108m12994
38926c91826m4043L74375L45263n87k39631k74964k69478k29553n7064J22707
$$ plain form
38998 -512138 -253361 -212334 -184106 156966 727596 1072660 917215 486042 214280 262339
38988 262339 414705 416330 289618 243622 333760 375941 252010 133181 244388 515752
38978 515752 661988 547783 276160 -35192 -331666 -494376 -398069 -138787 32519 47228
38968 47228 42491 8688 -268359 -783930 -1150066 -1074844 -758463 -574464 -570922 -545264 -426436
38957 -426436 -293825 -150824 30343 124927 -15422 -306149 -525491 -591177 -533104 -313268
38947 -313268 61116 354975 348879 201506 247983 476313 548092 337784 86917 -30087
38937 -30087 -127581 -291057 -389465 -358055 -342728 -379673 -253506 86731 276276 21168 -391826
38926 -391826 -435869 -61494 283769 283182 43551 -231413 -500891 -730444 -787508 -664801
38916f64801P5971j23852j38791J20589L14952J40296k36073l84909j58815J51498
38906i03935J97403k4059k00535p5963K72640N28919M72997J98598j1096k366
38896D52603J05361J18947M3848M7857J67094K05035P456k90504m30892l61649
38886F5156k38100j54217o1315O2349J57239K12734K62063K30692R210k79653
38876B66158l40380j30527L2682n5921j73797m8729J88419K26666P3295j1511
38866B6355K7076P122r4539q0909P7614J27641p0779l00786k96782r2896Q7612
38855e83271J29304O8800k3965p3838j4238J14856J74438J13690L7858J3205m9252
38844i2413k01868l04357k23753p1754n0306j37513j30817L3888K11306K92944
$$ plain form
38916 -664801 -588830 -712682 -851473 -730884 -415932 -275636 -511709 -896618 -1055433 -903935
38906 -903935 -706532 -730591 -931126 -1007089 -734449 -205530 267467 466065 454969 452603
38896 452603 557964 676911 720759 768616 935710 1140745 1148201 857697 426805 65156
38886 65156 -172944 -327161 -388476 -326127 -168888 43846 305909 536601 545811 266158
38876 266158 -74222 -204749 -172067 -227988 -401785 -450514 -262095 -35429 37866 26355
38866 26355 53431 60553 -33986 -114895 -37281 90360 19581 -281205 -577987 -670883 -583271
38855 -583271 -453967 -385167 -409132 -482970 -497208 -382352 -207914 -94224 -56366 -43161 -92413
38844 -92413 -294281 -598638 -822391 -894145 -944451 -1081964 -1212781 -1178893 -967587 -674643
38834f74643L19851L14038K01839o554j42569j14876p1429j63089k66090j52749
38824g56271J21526K49075J15175k7302O0673K48893K44721K5461j49867j10982
38814B1102M5451J51923J60184R2298l7307j72725k10475j31062n3211p8918j50603
38803c63343j34923L09J56057K17458J57608N0586j387K2471M0018l442l2399
38792A09013L9460J37600J16735q19n0834l118j9412j79415l35174l28055j86847
38781g00866j8725J29424J98965R2941j35457k34598o7052J63214J74085j3917
38771d11986j39903o3332J06957J92684J25187q733k7616J48658L31033K61883
38761E14832K1817l5292J43961J61344j81154m63038k64497J25129J30732j99146
$$ plain form
38834 -674643 -354792 -40754 161085 154531 11962 -102914 -174343 -337432 -603522 -756271
38824 -756271 -634745 -385670 -270495 -297797 -237124 11769 256490 281951 132084 21102
38814 21102 66553 218476 378660 470958 433651 260926 50451 -80611 -133822 -212740 -363343
38803 -363343 -498266 -497957 -341900 -124442 33166 83752 82365 104836 144854 141412 109013
38792 109013 148473 286073 402808 401989 351155 348037 328625 149210 -185964 -514019 -700866
38781 -700866 -719591 -590167 -391202 -298261 -433718 -668316 -735368 -572154 -398069 -411986
38771 -411986 -551889 -615221 -508264 -315580 -190393 -199126 -226742 -78084 252949 514832
38761 514832 536649 501357 645318 806662 625508 162470 -102027 23102 153834 -45312
38751d5312k99344j3993K09752J02561n7350k4419J4476j13581j87136J6690L10599
38740h7057M04495L29981K50995J22910j34194l48002l11156j19505o25L5237
38730A43079R1947J06669j3544j15929M26K05140J93349k7909j44441k2796J27026
38719E43017J22645N1053M5636O4159J5254o9689j17032j43270j95903k32945
38709H2925j47522J06098M35868O57215O55665N29533M83200N20821L81873q3290
38699C622386o05176p74154n54904k84312j83102j36953j0280R3598L4130r9052
38689A102181j11560L969P5429Q368j08931j55609j26525j09257j75934l13744
38679H8387m25174l94463j90213Q7610K84141L22658K54660J80689J38123Q1531
$$ plain form
38751 -45312 -344656 -358649 -148897 -46336 -103686 -128105 -113629 -227210 -414346 -397656 -87057
38740 -87057 317438 647419 898414 1021324 887130 539128 227972 108467 107842 143079
38730 143079 235026 341695 328151 212222 212648 417788 611137 583228 438787 415991 543017
38719 543017 665662 716715 762351 826510 841764 772075 655043 511773 315870 82925
38709 82925 -64597 41501 477369 1134584 1790249 2319782 2802982 3323803 3705676 3622386
38699 3622386 3017210 2243056 1688152 1403840 1220738 1083785 1073505 1167103 1201233 1102181
38689 1102181 990621 994590 1070019 1078387 969456 813847 687322 578065 402131 88387
38679 88387 -336787 -731250 -921463 -833853 -549712 -227054 27606 208295 346418 427949
38669D27949k8081j39917j53746m9612O1702N8362l4425n9794O9626K29528K15249
38658E96841J6807j34325o0914J08930J25516l969l3794J01212J46988m8744k29186
38647E85362j01520J66158J61731j41864l49393k49182q0163q7086j58998j03230
38637c58185P361J685q4617j12600r0625r5072p1976O1478K22790K76012K42928
38626h21K14032J56755J6176r9275o1673K9543j4944j47764j45184K9045J63910
38615A39800J17081k6724j36559j76470j39534k8879O2383K6353p6207p8488K5917
38604b91327O9410o04k8478P4000J60932R0203l7002l7516O4769Q8632j5080r3213
38592D4726k2951J21342J95600J87425J84782J76136K5277k84537n03981l79473
$$ plain form
38669 427949 399868 259951 106205 56593 118295 176657 142232 82438 152064 381592 596841
38658 596841 613648 479323 418409 527339 652855 648886 615092 716304 863292 814548 585362
38647 585362 483842 650000 811731 669867 320474 71292 -8871 -95957 -254955 -358185
38637 -358185 -350824 -349139 -433756 -546356 -636981 -732053 -804029 -742551 -519761 -243749 -821
38626 -821 213211 369966 386142 286867 225194 254737 239793 92029 -53155 -24110 139800
38615 139800 256881 230157 93598 -82872 -222406 -251285 -188902 -162549 -238756 -317244 -291327
38604 -291327 -221917 -222521 -250999 -176999 -16067 74136 37134 -382 64387 153019 137939 44726
38592 44726 21775 143117 338717 526142 710924 887060 912337 627800 123819 -255654
38582b55654k0280J86631N1420k15980l29644k48085p4742J40650L35497L58937
38572g1250J66420n4479j38727j63612k18684j66677Q5492K78248J31482j57858
38562c09645j74499M4093P6326j47917k13442N5293K69614J38629k3511J64111
38552a20948M80186M40477O9962j58922o1743N5318n1713k24237k32058j23277
38542G3045p3691j06865j35310j33717j16530m4766R9232K05543J43974l6682
38532a25767j32485k8764J64104K55129J81468J7846j50895k60842k14794L9462
38522b55538L40683L98875J61315o0699k354J53537L6127l24959m86600k16839
38512b56452J69356K50684L7577j40882j22742l8254j8515j7737M5785J37056
$$ plain form
38582 -255654 -275934 -89303 -37883 -253863 -583507 -831592 -906334 -765684 -430187 -71250
38572 -71250 95170 40691 -98036 -261648 -480332 -647009 -561517 -283269 -151787 -309645
38562 -309645 -484144 -440051 -363725 -511642 -725084 -669791 -400177 -261548 -285059 -120948
38552 -120948 359238 799715 869677 710755 649012 704330 652617 428380 196322 73045
38542 73045 -646 -107511 -242821 -376538 -493068 -537834 -438602 -233059 -89085 -125767
38532 -125767 -258252 -287016 -122912 132217 313685 331531 180636 -80206 -295000 -255538
38522 -255538 85145 484020 645335 584636 582282 735819 771946 446987 -39613 -256452
38512 -256452 -87096 163588 201165 60283 -62459 -100713 -119228 -136965 -91180 45876
38502D5876J60335Q5704k7288r3545p0517J1218P2484M4249r3049k93951m34255
38491e92739l61554n6932K65168L34658J29712j00086j42742l7545O8750J39955
38481c53355K13239K47741J64953J2413m9528N0868K00140K41968J52209K4289
38471I04937p2785j44699j84741j33463J1489J22571R3176J3484M2081J21912
38461G73962L3223k26732l58494j81972Q6352J63737R2447N9518K7712j37867
38451C31886l18779k74303m5660J19710J85461K92437L55124J36557k37049l01409
38441B43975P8875N06051O81848P96396J035411J141191Q38680L55156Q4380k9596
38431E732367l27109p90703j010857p78738l56265j11080j39996k96024l94434
$$ plain form
38502 45876 206211 291915 264627 171082 100565 111783 184267 228516 135467 -158484 -592739
38491 -592739 -954293 -1011225 -746057 -411399 -281687 -381773 -524515 -562060 -493310 -353355
38481 -353355 -140116 107625 272578 284991 235463 286331 486471 728439 880648 904937
38471 904937 832152 687453 502712 369249 380738 503309 596485 609969 652050 773962
38461 773962 807185 580453 221959 39987 126339 290076 382523 442041 469753 331886
38451 331886 13107 -261196 -306856 -187146 -1685 290752 645876 782433 545384 243975
38441 243975 322850 828901 1510749 2307145 3342556 4483747 5322427 5677583 5761963 5732367
38431 5732367 5405258 4614555 3603698 2824960 2468695 2357615 2217619 1921595 1527161
38422A527161l54122k51853k24880k58086j77121N8508K27054J60055R581M421
38412G20718J00430R4850n0028k19728l47053l77785j98939J40331L03604P6332
38402B42732k39663j96965J31154K52815m814k75905k34404o968J26456J21937
38392h3625Q5295M5363r50O518P9112R9637j8670j92702k76332k16598n3695J28481
38380c98166K14065J37364m116l4322O6205J28304L8195j05262j34133j8143J28131
38369A8122J82135J25925O3653J17493K62030L15172J73019j5942l4905R3886
38359A300588J34574m3495l14509m78683m77944l94756l11775k12825k0479K48636
38349e70668M02272K64418m6598j99613o3666J40922J76337N9618r9400k78446
$$ plain form
38422 1527161 1173039 921186 696306 438220 261099 319607 546661 706716 716297 720718
38412 720718 821148 915998 865970 646242 299189 -78596 -277535 -137204 166400 242732
38402 242732 3069 -193896 -62742 190073 185259 -90646 -325050 -332018 -205562 -83625
38392 -83625 1670 47033 46083 52601 131713 231350 212680 19978 -256354 -472952 -526647 -398166
38380 -398166 -184101 -46737 -50853 -85175 -18970 109334 147529 42267 -91866 -110009 18122
38369 18122 200257 326182 389835 507328 769358 1084530 1257549 1241607 1206702 1300588
38359 1300588 1435162 1391667 1077158 598475 120531 -274225 -586000 -798825 -819304 -570668
38349 -570668 -168396 96022 49424 -150189 -213855 -72933 103404 163022 63622 -214824
38339b14824l99254k68633J10607M07918L87801K24713J44242M8276j62778k11939
38329F6129J35592N14184L69475j99391n60721m46088j71682M635J55162K61785
38319A29080J23342j69981k17963M5740J99789K6896j50398p1682K8531r2562
38309a49208k24452j00724J21743J60393O6493K8196M563r4037j32431n824Q6791
38298b38497l1652j68133q9638M9370p230j36369o2033J26615J30932j3152j811
38287d41598J90175K69400J25824l0672p0115j01516j57295o8292K10034M24539
38277C50484L44512P0251j21595j13322q924N2407M1736K2485M1695O1532K0474
38266G61735n6998q6662n9980n3352r5946j47028k00459k54570j90771R4873M17966
$$ plain form
38339 -214824 -614078 -882711 -772104 -364186 23615 248328 392570 440846 278068 66129
38329 66129 201721 715905 1085380 885989 325268 -120820 -292502 -287867 -132705 129080
38319 129080 252422 82441 -135522 -89782 110007 136903 -13495 -85177 -56646 -149208
38309 -149208 -373660 -474384 -352641 -192248 -125755 -97559 -92996 -187033 -319464 -325288 -238497
38298 -238497 -270149 -438282 -527920 -478550 -485780 -622149 -684182 -557567 -426635 -439787 -441598
38287 -441598 -251423 17977 143801 113129 43014 -58502 -215797 -284089 -74055 350484
38277 350484 694996 765247 643652 530330 521406 573813 615549 638034 679729 741261 761735
38266 761735 704737 618075 558095 504743 408797 261769 61310 -193260 -384031 -289158 128808
38255A28808M33790J15248j74457j90255q7924o5636n8191P793j4196j94566k98687
38244c98273j49320N2237P3223M2206J52093K43830Q8639j48051j61015k8174
38234b32605k2621p6828N9178K50440J26304k35803l42007n8993J80804R1467
38224b60664n3823N1065K37763J78967r5955k94617k72352j15591L8046Q7102
38214e00059K929q8248J2914L06661N27794M47705J37710j37361j94184o3209
38204D52652O2474M198j95852k99857k08503j40921k87473m29295k14308K60294
38194i96591N05720L03717m0211j83235j43267p2865M5456K57408M16015L43445
38184D35592R7933j01143j41928r0884o0874j01299j73880j90724j17245l0652
$$ plain form
38255 128808 562598 677846 503389 313134 225210 159574 101383 109176 94980 -99586 -398273
38244 -398273 -547593 -495356 -422133 -379927 -227834 15996 104635 -43416 -204431 -232605
38234 -232605 -255226 -332054 -272876 -22436 103868 -131935 -473942 -532935 -352131 -260664
38224 -260664 -314487 -263422 -25659 153308 57353 -237264 -509616 -625207 -587161 -500059
38214 -500059 -497130 -585378 -572464 -265803 261991 709696 847406 710045 515861 452652
38204 452652 515126 519324 323472 23615 -184888 -325809 -613282 -1042577 -1256885 -996591
38194 -996591 -490871 -187154 -227365 -410600 -553867 -626732 -581276 -323868 92147 435592
38184 435592 533525 432382 290454 199570 138696 37397 -136483 -327207 -444452 -475104
38174d75104r979p785O8003J92006K62162K52998K03026J14511o92o1525m9938
38163D87683q7051k07285k09119M2929L28876L65090K28209J60164J11192j13124
38153A107564l68500l19317l6936N2326j40764k33192l3942J57083R6868k0916
38143B60274K1127Q2505j9990j56956j34629k0652L7585P2224J40694J47262K9974
38132D59418r4965j46755j96931k30677q6729J97971L08735J25005n2069K8556
38122C11559J98149K20971J72797J72311P7591j98100l80097k33754l677m4514
38112B93236k52106k89259j63022j14128j03626Q7993L44810L09069j4709k21331
38102a23073j23922J9200n451m7075P4946K40146K39332J04757L5003J10788K27685
$$ plain form
38174 -475104 -485083 -492868 -424865 -232859 29303 282301 485327 599838 599146 537621 487683
38163 487683 400632 193347 -15772 27157 356033 721123 949332 1109496 1220688 1107564
38153 1107564 739064 419747 382811 435137 294373 61181 27239 184322 281190 260274
38143 260274 281401 363906 343916 186960 52331 31679 69264 141488 282182 429444 459418
38132 459418 364453 217698 20767 -209910 -296639 -98668 210067 335072 283003 311559
38122 311559 509708 730679 903476 1075787 1153378 955278 575181 341427 337750 293236
38112 293236 41130 -248129 -411151 -525279 -628905 -540912 -196102 112967 98258 -123073
38102 -123073 -246995 -227795 -233246 -280321 -205375 34771 274103 378860 413863 524651 752336
38091G52336K50413J51881K2617m1488o4886j47259k76170l09699k05678j11562
38081B0505j27489j50356p7210K1894P6792J51597K36459J51911j11188k19166
38071b6251L5534L38815K90824J7620p6624J6008j9564j80694j38225J16668J74823
38060E48934j07394l31051j76114J35675K61212K39512K64761K68489Q6973j59115
38050A031882k03190m0646R7683J06937P9591O1322j6922j62924k79981l12497
38040C61255k75586j51122O8786K33991J40764j50010k95783j04276J73847J67209
38030A69075j04000k67375j25199J09201J66861P5735J1178n661n0883q4586l6806
38019a42460j0980j40556k98568k30417L3833J86416R4392l4186m382J12117J74722
$$ plain form
38091 752336 1002749 1154630 1177247 1135759 1070873 923614 647444 337745 132067 20505
38081 20505 -106984 -257340 -334550 -312656 -235864 -84267 152192 304103 192915 -26251
38071 -26251 9283 348098 638922 656542 579918 595926 576362 395668 257443 374111 548934
38060 548934 441540 110489 -65625 70050 331262 570774 835535 1104024 1190997 1031882
38050 1031882 828692 788046 885729 992666 1072257 1133579 1116657 953733 673752 361255
38040 361255 85669 -65453 3333 237324 378088 228078 -67705 -171981 1866 169075
38030 169075 65075 -202300 -327499 -218298 -51437 24298 35476 29815 -21068 -105654 -142460
38019 -142460 -153440 -293996 -592564 -822981 -789148 -602732 -508340 -542526 -546908 -434791 -260069
38008b60069J85180J95973K16766K86314M18913M39936J56032k52962l50639o7972
37998I67472J51011M552k34905j96259K4223R4264k4755j18882r9314l1741N6954
37987E92620J41220J20398j177m0760N8002P8914r4021k28837j25565L6897K1265
37976E58956q3328j05581j23976k11114j57274J50776L74606K01392r3175n4364
37966D56918K13735K54003J7454j39021r6983o7190j02788m7352O6359N8715J0116
37955F23966J44395L42652K66286m8585k07179p1653J08893J86237K53191K76950
37945A875153P7333k61009l94221k18451J0068R0233O2197n916o6563J0841K36679
37934A416344L21850R4499j06299N9526K69991R126n06009o00175k21938M7449
$$ plain form
38008 -260069 -74889 121084 337850 624164 1043077 1483013 1639045 1386083 1035444 967472
37998 967472 1118483 1123035 888130 691871 716094 810358 785603 666721 567407 535666 592620
37987 592620 733840 854238 853061 812301 870303 949217 855196 626359 500794 537691 558956
37976 558956 475628 370047 246071 34957 -122317 28459 403065 604457 511282 456918
37966 456918 670653 924656 942110 803089 706106 638916 536128 488776 555135 613850 623966
37955 623966 768361 1111013 1377299 1328714 1121535 1049882 1158775 1345012 1598203 1875153
37945 1875153 1952486 1691477 1297256 1078805 1088873 1179106 1241303 1235387 1168824 1179665 1416344
37934 1416344 1738194 1832693 1726394 1785920 2055911 2065037 1559028 958853 736915 784364
37924G84364K8466J32245M49236N31306K75086J72392M02667M91327K22966J14956
37914C605011N39259J057925J109222P69515L87622J6076l46106m60139k55748
37905F422637j02195k81969n93998p75269q58432q48276n77117j69501p4566l21440
37895A819874l56907K9658K94946Q4514j18462J50070M79037K53919l36474o51468
37885A648707n46037l22286r4066J76779L12480J71150J5119J23198K93896J92035
37875A970975q4798k12151j28713N1385K88231M38914K31232k27201l60866O0188
37865B027196M86269L85226q946j87802j15961j1023J48996M11506N76654N65123
37855D277238O07396P22590N70501J57181L797K35074K94025J5732Q0302Q16302
$$ plain form
37924 784364 812830 945075 1394311 1925617 2200703 2373095 2775762 3267089 3490055 3605011
37914 3605011 4144270 5202195 6311417 7080932 7468554 7484630 7138524 6678385 6422637
37905 6422637 6320442 6038473 5444475 4669206 3810774 2962498 2385381 2215880 2141314 1819874
37895 1819874 1462967 1492625 1787571 1872085 1753623 1903693 2382730 2636649 2300175 1648707
37885 1648707 1102670 780384 686318 863097 1175577 1346727 1361846 1485044 1778940 1970975
37875 1970975 1886177 1674026 1545313 1596698 1884929 2323843 2555075 2327874 1967008 2027196
37865 2027196 2513465 2898691 2889745 2701943 2585982 2574959 2723955 3135461 3712115 4277238
37855 4277238 4884634 5607224 6177725 6334906 6338703 6573777 6867802 6883534 6963836 7780138
37845G780138J526184J735864K107496L177305M124111L880543K687828J457053
37837B8476522L19475j052608k340213k945602k937851k651505j969154r24352
37829A3974712k26775j99569q2666N92353J014891O29670L95268J134471K000400
37820A9232755K193004K698942M395382N999593O176302O051440P012097P844624
37812F1604139P354407P969473J2584378J9547419K6130868L5700197N3918138
37805B24809019P6103709Q5583643O9241462L0750104j4533383n2751342p5937830
37798C43265382p9886245o6209268m5046046k8489723k0210135j5531180j0869543
37791G7023242p799269p721212q309850p348617n939948n624957n488947m300615
$$ plain form
37845 7780138 9306322 11042186 13149682 16326987 20451098 24331641 27019469 28476522
37837 28476522 28795997 27743389 25403176 22457574 19519723 16868218 14899064 13974712
37829 13974712 13747937 13548368 13465702 14058055 15072946 15702616 16097884 17232355 19232755
37820 19232755 21425759 24124701 28520083 34519676 40695978 46747418 53759515 61604139
37812 61604139 68958546 76928019 89512397 109059816 135190684 170890881 224809019
37805 224809019 300912728 386496371 455737833 486487937 471954554 419203212 343265382
37798 343265382 263379137 197169869 152123823 123634100 103423965 87892785 77023242
37791 77023242 69223973 61502761 53192911 45844294 39904346 34279389 28790442 24489827
37783B4489827k943416k614039k639318j968218j131029j019237j184388q85442
37775A0104740n39246p38642r85872o70681k55106l38759n38985l51065j56473
37766E529911l79872n77491l20831q5579l33218n75690k61223K29887L35459K51035
37756C812388K98213J80893k84319n09943q8787L62436J96854j52861L7580N61638
37746D414092P71582P08593Q60647J305269J884006K679849L533222L652609K537637
37737B2347506P87107p60264k087013l382183m050307l415855j990517r74570
37729F473904p37273p13536n61336m84698n49763n49273m93527n23082m49050
37720A412366m9533L44611K45314j75773l43326j82915q1824j06882J5403K31874
$$ plain form
37783 24489827 21546411 18932372 16293054 14324836 13193807 12174570 10990182 10104740
37775 10104740 9565494 8826852 7840980 7170299 6915193 6576434 6037449 5686384 5529911
37766 5529911 5150039 4572548 4251717 4166138 3832920 3257230 2996007 3225894 3561353 3812388
37756 3812388 4110601 4291494 4007175 3497232 3408445 3770881 3967735 3814874 3852454 4414092
37746 4414092 5185674 5894267 6754914 8060183 9944189 12624038 16157260 19809869 22347506
37737 22347506 23134613 22374349 20287336 16905153 12854846 9438991 7448474 6473904
37729 6473904 5736631 5023095 4461759 3977061 3427298 2878025 2384498 1861416 1412366
37720 1412366 1362833 1707444 1952758 1776985 1433659 1250744 1168920 1062038 1077441 1309315
37710A309315J85298j14736k71451j42570M9537J95865L54816M12548K30642M7261
37700B256525J98334N36737O60518N93912O65257Q12072O23916N0553n03186p83786
37690E110852q72610q04501n36470k72704k95565m78114m52500k26705j34653
37681A037030k23133k20844r5928j05444k73180l27065j83597k6757Q5482K23335
37671a10101K45226k3605l16075j94306K08070L06393k7289k79595j27187J31432
37661a87037J49510J5266m4483r647N9687J27308O6106j92435l83539k12410J01403
37650e10271J01550j20903n4655K93953L27122j12634l98484j28561K31312J54654
37640b16917j20021r6419J57259K59391J96407J93187J97433K5226j96228k15333
$$ plain form
37710 1309315 1494613 1379877 1108426 965856 1015393 1211258 1566074 1978622 2209264 2256525
37700 2256525 2454859 2991596 3652114 4246026 4911283 5723355 6347271 6397824 5894638 5110852
37690 5110852 4238242 3433741 2897271 2624567 2329002 1850888 1398388 1171683 1037030
37681 1037030 813897 593053 497125 391681 118501 -208564 -392161 -418918 -333436 -110101
37671 -110101 135125 111520 -204555 -398861 -190791 115602 88313 -191282 -318469 -187037
37661 -187037 -37527 -22261 -66744 -76391 -16704 110604 176710 -15725 -399264 -611674 -510271
37650 -510271 -408721 -529624 -584279 -290326 36796 -75838 -474322 -602883 -371571 -216917
37640 -216917 -336938 -433357 -276098 -16707 179700 372887 570320 595546 399318 183985
37630A83985j11690j25012j86391n0933K18951L13750J51836o2923j95029k55066
37620a18522j82827J02835M35599M87699J79031k16181m08637l63469k07045l2824
37610c24341J28215K31606J97927L505k06119j91958P8238K98023J76032j52828
37600B38300l11438k14485j11113j21289j00477l220K2928M455J77495M96612
37590G7768N46129J73429k16208k81263k29132l24331l45304j3195L86862L76869
37580A51624N2583r4133J8063J4571k14732l28653j46069O8434Q4260L8048R4268
37569b61736J36983L0714r0355l6281J20804J55722O598j73521k11959p2563J22526
37558b73068J91493Q2868m6985m4245J4407l1991j20092m6940J44342J59106q0703
$$ plain form
37630 183985 72295 -52717 -239108 -290041 -71090 242660 394496 331573 136544 -118522
37620 -118522 -301349 -198514 237085 724784 903815 687634 278997 -84472 -291517 -324341
37610 -324341 -196126 35480 233407 236912 30793 -161165 -82927 215096 391128 238300
37600 238300 -73138 -287623 -398736 -520025 -620502 -623722 -600794 -596339 -418844 77768
37590 77768 623897 797326 581118 299855 70723 -253608 -598912 -612107 -225245 151624
37580 151624 204207 110074 128137 142708 -72024 -400677 -546746 -478312 -394052 -356004 -261736
37569 -261736 -124753 -94039 -184394 -220675 -99871 55851 62449 -111072 -323031 -395594 -273068
37558 -273068 -81575 1293 -45692 -89937 -75530 -107521 -227613 -274553 -130211 28895 -51808
37547e1808k47673o6198K66589L52847J41716n7183m9947J8216l7952j45371j18122
37536E114K0997N2761j05706k45848j40457J30508K75675J85390O0392J02402
37526C41228K35017K45408R0239q6145j75648j94970j69762q0783M2923R4552
37516C42059J8035r6198j05439J0959J07204J5936k55868m90787m61272j74418
37506a089789J24766K08814Q6806m1134l217J78976L06392J96092r6230k94741
37496d23265k24183l6926K0984j5131P5111K58224K26489r0001l10589j12571
37486f31858K93080M49831K43015o1959k30309k31578r6790J16329K49317J76472
37476B75550k550r8674j08998j46931j70565m2343J75339K60018J68765P5386
$$ plain form
37547 -51808 -299481 -365679 -99090 253757 395473 338290 288343 306559 268607 123236 5114
37536 5114 26111 78872 -26834 -272682 -413139 -282631 -6956 178434 238826 341228
37526 341228 576245 821653 911892 825747 650099 455129 285367 204584 247507 342059
37516 342059 360094 263896 158457 169416 276620 292556 36688 -454099 -915371 -1089789
37506 -1089789 -965023 -756209 -669403 -710537 -713754 -534778 -228386 -32294 -128524 -423265
37496 -423265 -647448 -684374 -663390 -678521 -603410 -345186 -118697 -208698 -519287 -631858
37486 -631858 -338778 111053 354068 292109 61800 -169778 -266568 -150239 99078 275550
37476 275550 273000 174326 65328 -81603 -252168 -294511 -119172 140846 309611 384997
37466C84997N5730Q650p7013o7228L2875K8097j21596j83107k8363J27754N8684
37455B19480j22951j57364p282J69670K67194K50494P9640j72330k61005o5729
37445A99817J69595J37702q9472j93877j10280o8868j48463j38262N7975J95680
37435A1547N1945k16947k93779j22890Q8433J81026J61670Q8214K4909N9236J84317
37424B17681K12648N894k39447j78245J74038L76500J40640k49595l15057l1564
37414A13493J76612N2454j83719k23260j07684q3369j82306k00360m5350J42222
37404e41267K53358L62275M97032M64377J17295l21768m66565k75426r1616j25567
37394a27872j71628N628K48259K31523k7752j89717p9794J23331K07778J71533
$$ plain form
37466 384997 440727 449377 372364 305136 338011 366108 244512 61405 33042 160796 219480
37455 219480 96529 -60835 -68117 101553 368747 619241 698881 526551 265546 199817
37445 199817 369412 507114 417642 223765 113485 44617 -103846 -242108 -184133 11547
37435 11547 63492 -153455 -447234 -570124 -481691 -300665 -138995 -50781 -25872 33364 217681
37424 217681 430329 436223 196776 18531 192569 569069 709709 460114 145057 113493
37414 113493 290105 342559 158840 -64420 -172104 -255473 -437779 -638139 -683489 -541267
37404 -541267 -287909 74366 571398 1035775 1153070 831302 364737 89311 -2305 -127872
37394 -127872 -299500 -293872 -45613 185910 158158 -31559 -111353 11978 219756 391289
37384C91289Q0482o5920k12822k08582k6114J46068J63397J07992Q5484K9716
37374D90990j23229k46927k10768j01198n2779j1947J04670J72642N1396j17201
37364d4351j03208K0682R947j05486p1094J16217J64811l0365k23317k21236j18724
37353f06124k7537R3407K11284J56491n0824j29248K4229J35060K008j67753j32996
37342d92003k8332q3854j88579r2682J38216K33835J56553Q2543M8268l6502r5984
37331c58521K9453K28308K00775o4292k22760p6254J44639J36020n7088j39846
37321a79566L1158K83683L30038P2553k78845m10369k48720k7545M1573L5108
37311c50932J30113K78984K68081M3882k04590k74839j31377J03928K30985J16792
$$ plain form
37384 391289 471771 405851 193029 -15553 -41667 104401 267798 375790 461274 490990
37374 490990 367761 120834 -89934 -191132 -243911 -255858 -151188 21454 72850 -44351
37364 -44351 -147559 -126877 -116930 -222416 -293510 -177293 -12482 -42847 -266164 -487400 -606124
37353 -606124 -633661 -540254 -328970 -172479 -223303 -352551 -328322 -193262 -191254 -359007 -492003
37342 -492003 -520335 -604189 -792768 -885450 -747234 -513399 -356846 -274303 -226035 -262537 -358521
37331 -358521 -329068 -100760 100015 35723 -187037 -263291 -118652 17368 -39720 -179566
37321 -179566 -148408 135275 465313 537866 259021 -151348 -400068 -427613 -386040 -350932
37311 -350932 -220819 58165 326246 370128 165538 -109301 -240678 -136750 94235 211027
37301B11027j22387j93159r222J53074O4903p8795K9483K80606K92324J1247k15561
37290D23540j87329r4633j31325k02738j67891q9211o3476k4773J03459K26986
37280b07391K16940J03288j812o6444j12219j22943q0591j3053O7347J88614L18055
37269B89791L27609J46294j02214j91024k8020K12917K34891m3447l27092k79710
37259B39995k1293k5689m08742o48080k93027L35639N65323K93838J0129l331
37249D4762M8064P00o364O0276l4987l19876m08897o2023M02901N48090L65185
37238F37831J05916j37062l52322l69371p5551K79503L46021J49508J37L786k7477
37227E60919j91377l08223j92465P0208K15634J07457j04568j51349K1843J70800
$$ plain form
37301 211027 88640 -104519 -113741 39333 104236 25441 54924 335530 627854 639101 423540
37290 423540 236211 141578 10253 -192485 -360376 -449587 -513063 -537836 -434377 -207391
37280 -207391 9549 112837 111025 44581 -67638 -190581 -271172 -284225 -216878 -28264 289791
37269 289791 617400 763694 661480 470456 442436 655353 890244 846797 519705 239995
37259 239995 218702 193013 -215729 -863809 -1156836 -821197 -255874 37964 48093 44762
37249 44762 92826 93526 87162 147438 112451 -207425 -616322 -678345 -275444 272646 637831
37238 637831 743747 606685 254363 -115008 -190559 88944 434965 584473 584610 588396 560919
37227 560919 369542 61319 -131146 -60938 154696 262153 157585 6236 28079 198879
37217A98879R7590m5625j9666M7812j66196n64346o26179j60799L54912M26715
37207d56903J65742k2503l3932n323O1055K20813L25074K05157j3773j01044p9335
37196B65028r3845r6228M277M6807j38527l31750j87869J80557L17821R8527j36949
37185g2151j43518n2211j2260N1502J78092K03103L6159j51040j88265j47523
37175b98112j55026j47022j035K05228K48383M6220k22967l00791j08193J88656
37165e44659L67167L62617K42390M2679k04194l24170j50279J40627J51081j58536
37155g5277l52472j66637R5771R0931k5487L3661J38618M5526n9383J15158L35131
37144A75540J71937j94675j97688J52933K56767p6222l47233k45031p4763o0675
$$ plain form
37217 198879 296469 250844 231178 278990 112794 -451552 -1077731 -1238530 -883618 -456903
37207 -456903 -291161 -313664 -347596 -352919 -291864 -71051 254023 459180 445407 344363 265028
37196 265028 171183 74955 79232 126039 -12488 -344238 -532107 -351550 -33729 64798 -72151
37185 -72151 -215669 -267880 -280140 -228638 -50546 152557 188716 37676 -150589 -298112
37175 -298112 -453138 -600160 -601195 -395967 -147584 -101364 -324331 -625122 -733315 -544659
37165 -544659 -177492 185125 427515 470194 266000 -58170 -208449 -67822 83259 -75277
37155 -75277 -427749 -594386 -498615 -407684 -433171 -399510 -260892 -215366 -274749 -159591 175540
37144 175540 347477 152802 -44886 108047 364814 288592 -58641 -303672 -378435 -439110
37134d39110O1059L77964M04496j33354o63761n12648J12213M67681L14508L6683
37124B5731o8727n0635M3176K44942M04823K84559m8316k54615j79229n203M4575
37113D41081p3364k74055m05498l13399l6785J49763Q1450l8603M8902K39401
37103a81107K37717L1096j25602j29583j24665j97496k56566k19380j00699O3893
37093a002392J94838J51338n1710j34932P0679K82891J49532j49091j22190K33826
37083c77211L61207j5682m47450m14300m3116J68405Q3750RJ00844K03191R4728
37072b85625j27803j84713J7831K50098K12705q9766k96966r4469L73683O32552
37062D07527M33100K9100j78193j34491j23649l17796n05527l49913J44325N43799
$$ plain form
37134 -439110 -378051 -87 404409 271055 -392706 -905354 -793141 -325460 -10952 25731
37124 25731 -42996 -93631 -50455 194487 599310 883869 835553 580938 401709 396506 441081
37113 441081 367717 93662 -311836 -625235 -662020 -512257 -430807 -469410 -420508 -181107
37103 -181107 56610 87706 -37896 -167479 -292144 -489640 -746206 -965586 -1066285 -1002392
37093 -1002392 -807554 -656216 -707926 -842858 -772179 -489288 -339756 -488847 -611037 -377211
37083 -377211 -16004 -31686 -479136 -893436 -936552 -768147 -684397 -684388 -583544 -380353 -285625
37072 -285625 -413428 -598141 -580310 -330212 -117507 -207273 -504239 -598708 -225025 407527
37062 407527 840627 869727 691534 557043 433394 115598 -389929 -739842 -595517 -51718
37052e1718M41676n0556l97096k51883J58767L56680J84319r8493k04647j06224
37042a9175O5661K19602L25432L43107K22970k6066k84969l71232k16516p666
37032B51148j9855k47757l61935j52680J51742J97566j1961j87759j95941j42090
37022g19522p7732N9350K05311J85287K9445j8286J03817J58359J1336j36234
37012a98869r7406j2457p5095j67114n7079J81734K63098J33854K7739O7771R6747
37001A62923j1172j02153L5254L27679M65749K72461r0243l04686k28035p452
36991E20325J08419K6785j36703k23358j91411j08732m4620o623L6149R2808J12431
36980A85470J6617k00001m07309m24008j90290J54155L72753L20030N8209j95132
$$ plain form
37052 -51718 389958 339402 -57694 -309577 -150810 205870 390189 291696 87049 -19175
37042 -19175 46486 266088 591520 934627 1157597 1131531 846562 475330 258814 251148
37032 251148 231293 -16464 -378399 -531079 -379337 -181771 -193732 -381491 -577432 -719522
37022 -719522 -797254 -737904 -532593 -347306 -317861 -336147 -232330 -73971 -62635 -198869
37012 -198869 -296275 -308732 -383827 -550941 -608020 -426286 -163188 -29334 -1595 66176 162923
37001 162923 151751 49598 84852 412531 878280 1150741 1060498 755812 527777 520325
36991 520325 628744 655529 518826 295468 104057 -4675 -49295 -55918 -19769 73039 185470
36980 185470 202087 2086 -405223 -829231 -1019521 -865366 -492613 -172583 -114374 -309506
36970c09506k58973j36634N3782K53200M48327N01529K15556l13581o22938l96208
36960e65446Q5368K80908R1591r6944m4018N5907O49q0639k3309N2525l320m3201
36948b89929J17884K87706J28956k59474l93840r5579K32156J80487j01610j65531
36938c58774R2022L23936K26660j05765l65761l88698k34515l7906R8917J19931
36928f29953M5705r024N7569J92436K34802J30259R181L177P2933R7924O0357
36917B65366L2185K8194r035r5400j80093k20518j91767n7510J52274K72609J63342
36906A59647p4874k05438j72536j24592j07207K6392L03704M72225L33028N5705
36896F66054o0766j9533p1249k82260m13582k72043J5373J68215P6412j24367
$$ plain form
36970 -309506 -568479 -705113 -651331 -398131 50196 551725 767281 453700 -169238 -565446
36960 -565446 -480078 -199170 -107579 -204523 -248541 -192634 -191985 -272624 -295933 -243408 -246728 -289929
36948 -289929 -172045 115661 244617 -14857 -408697 -504276 -272120 -91633 -193243 -358774
36938 -358774 -266752 57184 283844 178079 -187682 -576380 -810895 -848801 -749884 -629953
36928 -629953 -584248 -593272 -535703 -343267 -108465 21794 30975 34152 107085 205009 265366
36917 265366 297551 325745 316710 221310 41217 -179301 -371068 -428578 -276304 -3695 159647
36906 159647 84773 -120665 -293201 -417793 -525000 -498608 -194904 277321 610349 666054
36896 666054 605288 585755 514506 232246 -181336 -453379 -438006 -269791 -193379 -317746
36886c17746k33455j74256k6751Q9486J43213J71491J50353l447k43940l33981
36876g79033j13835K35228L61277J64660j00077j58818j0746J52091J83978P4732
36866I457r5342k04824j63353j1341R5216N5169o1563j08650k6082J29070K51472
36855a30771K36884L7399k49223m03503l01851p7574L9778J1683j6843J0946n893
36844h48968p2153N669L03559N34373L66110r1007l81193k83285l2677Q0907O1207
36833c57458L1778k2712j40255k03969j10295K5486N1175L4139J04069J72031
36823d16011Q4813m5547J0512J79214J64966m2157j12366R0079K80232K11590
36813D05325L7980J0179Q1787N8490o5139j56710j76985j45463j9209J82258K60523
$$ plain form
36886 -317746 -551201 -725457 -752208 -662722 -519509 -348018 -197665 -201112 -445052 -779033
36876 -779033 -892868 -657640 -296363 -131703 -231780 -390598 -401344 -249253 -65275 9457
36866 9457 -85885 -290709 -454062 -465403 -370187 -315018 -376581 -485231 -511313 -382243 -130771
36855 -130771 106113 143512 -105711 -509214 -811065 -888639 -848861 -837178 -854021 -843075 -848968
36844 -848968 -921121 -915452 -611893 -77520 288590 197583 -183610 -466895 -499572 -418665 -357458
36833 -357458 -325680 -348392 -488647 -692616 -802911 -777425 -726250 -692111 -588042 -416011
36823 -416011 -331198 -376745 -366233 -187019 -22053 -64210 -176576 -86497 193735 405325
36813 405325 443305 453484 535271 593761 528622 371912 194927 49464 30255 212513 473036
36802D73036O6851k43500l80195k66254n7148R2772J19099K933j85429k74181
36792f52016j73614N238J32675K33216L39099L32176J22800j50903l01467l38423
36782d51219l37794k22772P6306L75497M27952K75244J55673J50870J68768J66643
36772G85168J23288q1969m48892o41111l64594J20098K68043j774k46922j93502
36762f82167m3079j8102m0269k933K5384K9471J27064K70889K24136j5987j43550
36751b69143o3285p8242l27764m57414j73817K42657L64289K46258K11664K59133
36741d5664J46412r5382j95268j23580j18742k38756k57108m9545K14751L22734
36731d40148K32544K2482j75989k09445n8407P6249K9887n9549L5398K36853K54096
$$ plain form
36802 473036 539887 296387 -83808 -350062 -407210 -314438 -195339 -192406 -377835 -652016
36792 -652016 -825630 -820392 -687717 -454501 -115402 216774 339574 188671 -112796 -451219
36782 -451219 -789013 -1011785 -935479 -559982 -132030 143214 298887 449757 618525 785168
36772 785168 908456 826487 377595 -263516 -628110 -508012 -239969 -241743 -488665 -682167
36762 -682167 -725246 -743348 -783617 -786550 -761166 -731695 -604631 -333742 -109606 -125593 -269143
36751 -269143 -332428 -410670 -738434 -1195848 -1369665 -1127008 -762719 -516461 -304797 -45664
36741 -45664 100748 5366 -189902 -313482 -432224 -670980 -928088 -977633 -762882 -440148
36731 -440148 -207604 -185122 -361111 -570556 -628963 -552714 -522827 -582376 -546978 -310125 -56029
36720e6029L1119j80918k03646j22010o6860m6532m2989p2987j06413q5587l8061
36709i90913k0280J8388J37192K20031J09665j01621j48449L8164K49615K89607
36699a98601J53564n4823j89275j03184J47994K36358k5379l05647j58905K62467
36689b35431L64144K776k89118j24626J89591K02392j3506j04202k0717L1235
36679B538P650J6663L4682l8514j42646j50691r7108p0770j0963J38568K17976
36668i2615P7171j17388j06028M7292Q5838Q202J8368Q3388m6949l41483m16919
36657h01123j03689K62451L08745J11406o258N2796J32329J30248Q6760K1624
36647A95289j03370k49304k81795j35300Q4671K01953J38286l0773j62245j70561
$$ plain form
36720 -56029 -24910 -205828 -409474 -531484 -598344 -644876 -687865 -760852 -867265 -952852 -990913
36709 -990913 -1011193 -992805 -855613 -635582 -525917 -627538 -775987 -737823 -488208 -198601
36699 -198601 -45037 -99860 -289135 -392319 -244325 -7967 -33346 -338993 -497898 -235431
36689 -235431 128713 131489 -157629 -282255 -92664 109728 96222 -7980 -28697 2538
36679 2538 10188 26851 61533 23019 -119627 -270318 -367426 -438196 -449159 -310591 -92615
36668 -92615 -15444 -132832 -238860 -191568 -105730 -97528 -79160 4228 -42721 -384204 -801123
36657 -801123 -904812 -642361 -333616 -222210 -228468 -175672 -43343 86905 173665 195289
36647 195289 91919 -157385 -439180 -574480 -489809 -287856 -149570 -180343 -342588 -513149
36637e13149o9480Q5791K52867L85116M16150L11894J11384j16022l14373m20554
36627A29624l77691k24063r1815m9309k3899M6687Q9785L0597n5042o0505l0499
36616f16130n9505q1849M5643K84540M24076L44691J16632j39949l24706l19423
36606c25980q7470J81698K30896O9261m2528K5148J06374K4409j50320k27421
36596a95933j40008K5284J31420P6832j10147k50841k20521j42760j88356k27197
36586a242227K1341M64045O19968K78578j63847k55526q1372q282q3695n8312
36576e09329J28713K68273K51915J89095J32062j9368k65676m05272k96731o0181
36566e86499Q2804O3993m718J5032J43996K47767J58071j14087l40359l30971
$$ plain form
36637 -513149 -582629 -496838 -243971 141145 557295 869189 980573 864551 550178 129624
36627 129624 -248067 -472130 -563945 -613254 -637153 -590466 -500681 -470084 -525126 -585631 -616130
36616 -616130 -675635 -757484 -711841 -427301 -3225 341466 458098 318149 -6557 -325980
36606 -325980 -413450 -231752 -856 68405 25877 51025 157399 181808 31488 -195933
36596 -195933 -335941 -310657 -179237 -102405 -212552 -463393 -683914 -826674 -1015030 -1242227
36586 -1242227 -1220886 -756841 -136873 141705 -22142 -277668 -359040 -367322 -451017 -509329
36576 -509329 -380616 -112343 139572 328667 460729 441361 175685 -229587 -526318 -586499
36566 -586499 -503695 -439702 -444420 -429388 -285392 -37625 120446 6359 -334000 -664971
36556f64971j57393j4473N1230J23853K00018J76686M2125q5367j11983l2670
36546d72945J29265L01287L20745R4953k08342l10895j72806j9244p740n1482
36536c97204j1101J09712K18285K42178J40230o2375k17420j70864K7707J63733
36526D2881J27635Q732q5591j32806r7472O9290K68185K80204N4512j86974k26442
36515A22154r3142N0035J16927J07580M8273J3675Q0099J79358J38830n8438k11734
36504D93617j88001r9840r0628j14697o6228L1623J11774J87706K44532J64102
36494F73960o4262k07242p3094J76636K19463K263k27615k68950j49156L501Q6890
36483A72394M3203r0674j66492q8697M2515P4608K2295N61J6318K509l012Q8992
$$ plain form
36556 -664971 -822364 -836837 -785607 -661754 -461736 -285050 -242925 -328292 -440275 -472945
36546 -472945 -343680 -42393 278352 373305 164963 -145932 -318738 -337982 -345722 -397204
36536 -397204 -408305 -298593 -80308 161870 302100 239725 22305 -148559 -120852 42881
36526 42881 170516 179248 93657 -39149 -136621 -67331 200854 481058 535570 348596 122154
36515 122154 29012 79047 195974 303554 351827 365502 445601 624959 763789 705351 493617
36504 493617 305616 205776 115148 451 -65777 -34154 77620 265326 509858 673960
36494 673960 609698 402456 329362 505998 725461 727724 500109 231159 82003 85504 172394
36483 172394 215597 124923 -41569 -130266 -87751 -13143 9152 9713 26031 28540 25528 114520
36471A14520K16626K13951N9687r4796j51770j63247j92851k25234k22575j54475
36461f00164Q453K12275K79465R8961j84179l21777k62319j45469o3587j4829
36451i93170l0940j33059j98105r2514R2322J69205J75075K83501M20187L00554
36441f944r0651l83727l08527j4501K19356L17765L02310J30029j51237l07240
36431b93367j97873J2484J08607J14264J42352J39987J0622j53013j91449j31297
36421d38683j03888j02979l1838P8404R6131l311j09977j16100K2384K63256M14078
36410c2523K45837j75993m40336k70164J02378K70092K03684J81671K84238K99832
36400F68716J15646j17139k47077k88220k76569j95412r3528p0550j05354q7730
$$ plain form
36471 114520 331146 545097 604784 509988 358218 194971 2120 -223114 -445689 -600164
36461 -600164 -591711 -379436 -99971 -1010 -185189 -506966 -769285 -914754 -978341 -993170
36451 -993170 -1024110 -1157169 -1355274 -1447788 -1355466 -1186261 -1011186 -727685 -307498 -6944
36441 -6944 -97595 -481322 -789849 -804350 -584994 -267229 35081 165110 13873 -293367
36431 -293367 -491240 -478756 -370149 -255885 -113533 26454 37076 -115937 -307386 -438683
36421 -438683 -542571 -645550 -677388 -598984 -502853 -506164 -616141 -732241 -709857 -446601 -32523
36410 -32523 213314 37321 -403015 -673179 -570801 -300709 -97025 84646 368884 668716
36400 668716 784362 667223 420146 131926 -144643 -340055 -433583 -504133 -609487 -697217
36390f97217k7633k2543k4352J03234K74031K18508q4078k93843j60864J57349
36380e57408L69864M10358L60722K42034P9008j4263j6293r7908l31586m74098
36370b9570k98135j919K5483k10123k88707J3330L93208M42160J76182m8999l2717
36359A40193P6284O9270l2141p4933n1362j06325k64644l27783j52620J02197
36349f21864J86539J26007J44064K51248K06822m3807k00575n0924J83118J81892
36339C62520l01r0008n5849p4193j30888l5515J73290K14238K6281j13168o3199
36328B13208n9804k68161m19769k14106J53599K47943N0768m3469J25393K53285
36318C8887J06822p7772K0397K71795K69104o2950l48106k80692o812J34189N9324
$$ plain form
36390 -697217 -724850 -747393 -771745 -668511 -394480 -175972 -260050 -553893 -714757 -557408
36380 -557408 -187544 222814 583536 825570 904578 890315 874022 776114 444528 -29570
36370 -29570 -327705 -329624 -304141 -514264 -802971 -789641 -396433 45727 221909 172910 140193
36359 140193 216477 285747 253606 178673 127311 20986 -243658 -571441 -724061 -621864
36349 -621864 -435325 -309318 -165254 85994 292816 249009 48434 -2490 180628 362520
36339 362520 362219 272211 216362 142169 11281 -24234 149056 363294 389575 276407 213208
36328 213208 153404 -114757 -534526 -748632 -595033 -347090 -296322 -339791 -214398 38887
36318 38887 145709 67937 88334 360129 629233 566283 218177 -62515 -69327 64862 124186
36307A24186m6727o6926q2309j57965j90499o9892J26625K32835K20119J88103
36297B77550J64537P7817n5285q9350K0567J00916l7j70748j96241p7206j033
36286E1487l5879o5902m4303q9331k46898l51938k58165o0210N8346Q2229J14026
36275h46538J61370J50044R2458O6873N7690j0108q8467m2423J06189J53004l84
36264b00292j84458j86342k2798J17391J25300O2309M2531J07748J96576J88232
36254B46197J2664k37950l51353k07720P1350K34408J56082m3437j31740q102
36244b59601J91065K49531J23284l3386j03511j39301j78838r3815J88885M32546
36234C76859L27776m9052l00656k55444j47092j68478j73677o357J67043J21603
$$ plain form
36307 124186 77459 10533 -71776 -229741 -420240 -490132 -363507 -130672 89447 277550
36297 277550 442087 519904 464619 375269 395836 496752 496715 325967 129726 52520 51487
36286 51487 15608 -50294 -94597 -183928 -430826 -782764 -1040929 -1101139 -1042793 -960564 -846538
36275 -846538 -685168 -535124 -442666 -375793 -318103 -328211 -416678 -459101 -352912 -199908 -200292
36264 -200292 -384750 -571092 -593890 -476499 -351199 -288890 -246359 -138611 57965 246197
36254 246197 258861 20911 -330442 -538162 -466812 -232404 -76322 -119759 -251499 -259601
36244 -259601 -68536 180995 304279 270893 167382 28081 -150757 -244572 -55687 376859
36234 376859 704635 655583 354927 99483 -47609 -216087 -389764 -396121 -229078 -107475
36224a07475l1730j1731J87961K94588J46635j34095l28416l02904n6682K53935
36214h9914L89979K66018M5314r6770j65037j87072p9532J32184J89830l2188
36204C72812k51854j90137m0435j30737l14575j99899J30619J99214p1342k32200
36194g28534p6317N6723o1705j58708k1848P5227j05981k76182r5263K27444K91054
36183h74090J68132K05848L73102L23438L48k93471l81441l53426k60947o3655
36173a156162J40822J95725J73625K45485L10983J39170j51809j77077J13622
36164a65616L24246J93149q5781k32896k22854j24685O3570K60199K74933J01610
36154C85875k2980J5239N5706K23p967R7342J30905P020n6435N9704Q6963j88815
$$ plain form
36224 -107475 -139205 -150936 37025 331613 478248 344153 15737 -287167 -343849 -89914
36214 -89914 300065 566083 611397 514627 349590 162518 82986 215170 405000 372812
36204 372812 120958 -69179 -109614 -240351 -554926 -754825 -624206 -424992 -496334 -728534
36194 -728534 -804851 -748128 -809833 -968541 -990389 -915162 -1021143 -1297325 -1392588 -1165144 -874090
36183 -874090 -705958 -500110 -127008 196430 196778 -96693 -478134 -831560 -1092507 -1156162
36173 -1156162 -1015340 -819615 -645990 -400505 -89522 49648 -102161 -279238 -165616
36164 -165616 158630 351779 265998 33102 -189752 -314437 -250867 9332 284265 385875
36154 385875 362895 378134 433840 434063 426096 523438 654343 661363 604928 664632 751595 562780
36142E62780m75305l67155K073J43212n0206j96561o3858J17052R0902l1041j7664
36131b85771R3231Q3233r4889k50716k08065J412K00475K59704K07662J51507
36121A57783J15488L3903p6758o5330J29352L04927K05358j41412m44673m84750
36111b66112k91119k1167J83647K32174J29269J150m2554n1944j16197j59743
36101d02596m8653J40946J99015J24555J22485K15058J62733j07302l05748k19369
36091a18876n9177r2443j78572l9011J88259J13672k33073l68421q0898K46289
36081f22251K42705R7777J82146M01511L37448p7279m23970l74484q5112R5788
36071b25721P4071N819L627L2172M4461O4567J03956Q7153o4137k80127l48307
$$ plain form
36142 562780 87475 -279680 -277607 -134395 -184601 -381162 -445020 -327968 -237066 -268107 -285771
36131 -285771 -192540 -109307 -204196 -454912 -662977 -661565 -461090 -201386 6276 157783
36121 157783 273271 307174 230416 165086 294438 599365 804723 663311 218638 -266112
36111 -266112 -557231 -578398 -394751 -162577 -33308 -32158 -74712 -126656 -242853 -402596
36101 -402596 -451249 -310303 -111288 13267 135752 350810 513543 406241 100493 -118876
36091 -118876 -178053 -270496 -449068 -488079 -299820 -186148 -419221 -787642 -868540 -622251
36081 -622251 -379546 -281769 -99623 301888 639336 562057 138087 -236397 -321509 -225721
36071 -225721 -151650 -145831 -142204 -110032 -65571 -1004 102952 190105 125968 -154159 -502466
36060e02466j39788J92374L44080K13278Q403n2943j6716m5369j28914j33409
36050b61470o2548m8123r2875m7184J20880K43968K21941J80180K46956L24416
36040H26141K22347o5063l29514l57258j27627J38332J41749j62348m25055k83595
36030d21891J28417L09875P7202j95256j56487L4981N2922p0964j03353n8321
36020d02875r3501j17212O4176K87522J85505j89413l55241j18488J34519N1966
36010e53042j72243j74242J1039R4957M2836Q1813K84511M51531M10959K11906
36000F90025k952j54004k28282k46034k49186k54489k25473j42433o1436m1633
35990i15897n7272m8785k0995k3606o5362j05818j08712o2809K1178J01482J24093
$$ plain form
36060 -502466 -642254 -449880 -105800 107478 115881 62938 46222 853 -128061 -261470
36050 -261470 -324018 -372141 -465016 -512200 -391320 -147352 74589 254769 501725 826141
36040 826141 1048488 983425 653911 296653 169026 307358 449107 286759 -138296 -421891
36030 -421891 -293474 16401 93603 -101653 -258140 -223159 -170237 -241201 -344554 -402875
36020 -402875 -496376 -613588 -549412 -261890 -76385 -265798 -621039 -739527 -605008 -553042
36010 -553042 -725285 -899527 -888488 -793531 -750695 -668882 -384371 67160 478119 690025
36000 690025 687073 533069 304787 58753 -190433 -444922 -670395 -812828 -874264 -915897
35990 -915897 -973169 -1021954 -1042949 -1066555 -1131917 -1237735 -1346447 -1409256 -1388078 -1286596 -1162503
35979a162503Q1024L1715N2845J67153K93981K74305L9905k09194j56276J85437
35969d01608L66023O6498l89561m22145n83L40086K93087J41472J94731L04000
35959D92000K05971J763m2514N9014Q7411j8740j51412k48332k86451k09006p3922
35948a84218r0769k79510l15759m543L24399K59777n2989j47681L2812J32359
35938c26122M8676P2627K90127L53525M9246l15743l52596j14396P7717J05769
35928a11170R3460J16609J09536J2439j28749j93624q7826J24818K17827N8619
35918B11939j68774j77508J6011J21637L100j73287k41354k29883k03996j56967
35908i99082j14101j08566l0145K26446M49452K95958j47121l79465j91324N9504
$$ plain form
35979 -1162503 -1081479 -1049764 -996919 -829766 -535785 -261480 -221575 -430769 -587045 -401608
35969 -401608 -35585 30913 -358648 -780793 -781376 -441290 -148203 -6731 188000 492000
35959 492000 697971 699734 657220 716234 803645 784905 633493 385161 98710 -110296 -184218
35948 -184218 -274987 -554497 -870256 -874799 -550400 -290623 -343612 -491293 -458481 -326122
35938 -326122 -277446 -204819 85308 438833 488079 172336 -180260 -294656 -216939 -111170
35928 -111170 -17710 98899 208435 220874 92125 -101499 -189325 -64507 153320 211939
35918 211939 43165 -134343 -118332 3305 6405 -166882 -408236 -638119 -842115 -999082
35908 -999082 -1113183 -1221749 -1251894 -1025448 -575996 -280038 -427159 -806624 -997948 -938444
35898i38444N9591j0422Q0154J49492j7505j84876l4948K34289J84315j51008
35888f29362l26009j77045J9752O6920P4906J36267J75231J96362L27322N24410
35878C88754N48259L22259M1452j37594k42126k73888j55838L5990P9179n9964
35868E46483j62524j09791l0716k2747j8547j9437j43417l19603k68998M3619
35858e05678K70571J99221P6827J60940K70582J21235j61299k47162j30484n6777
35848b024n8140L5102J93412K02371O8903L3322J34671J18165j33893l93755m37434
35837b39300l37513k62376k03263o4908J25421K46628K31202J02256n2025j11205
35827e65083l8530L3036l5741j65337j78382j13412j61819k80162j80043J92706
$$ plain form
35898 -938444 -878853 -889275 -809121 -659629 -677134 -862010 -896958 -662669 -478354 -629362
35888 -629362 -955371 -1132416 -1112664 -1045744 -970838 -834571 -659340 -462978 -135656 388754
35878 388754 937013 1259272 1300724 1163130 921004 647116 491278 527268 606447 546483
35868 546483 383959 274168 243452 220705 202158 182721 39304 -280299 -549297 -505678
35858 -505678 -235107 -35886 40941 201881 472463 593698 432399 185237 54753 -2024
35848 -2024 -60164 -25062 168350 370721 439624 472946 607617 725782 591889 198134 -239300
35837 -239300 -576813 -839189 -1042452 -1107360 -981939 -735311 -504109 -401853 -453878 -565083
35827 -565083 -603613 -570577 -606318 -771655 -950037 -1063449 -1225268 -1505430 -1685473 -1492767
35817a492767M82486M10622J63181O1602Q7456K2109j20176j25806L3811J50520
35807c26962R8380k8844r5088n2665P8845K00678J58110n3731j89125n5489J75651
35796i0240K02783N2792Q145J16577J09336j47323m27800m66278k47602R1773
35786g97837L97113M66662J84369k13375l02835m2347J32043m3463k49164r3099
35776e61933K62521L49471P6805k15846k90899k35365j71983p2395R0303K35970
35766e33351K81205K04958K0551j88932k68410j68727m2379j5249M827J10425
35756e95082J63445M0873o4881P4347K89035K54098N6166N6836K34552J88425
35746F97814j43085l19774j31641M0090j23666l50574k72416l4287K7958k0937
$$ plain form
35817 -1492767 -1010281 -599659 -436478 -374876 -287420 -265311 -385487 -511293 -477482 -326962
35807 -326962 -228582 -257426 -352514 -405179 -326334 -125656 32454 -21277 -210402 -265891 -90240
35796 -90240 112543 165335 173480 290057 399393 252070 -175730 -642008 -889610 -797837
35786 -797837 -400724 65938 250307 36932 -265903 -308250 -176207 -219670 -468834 -561933
35776 -561933 -299412 50059 126864 -88982 -379881 -615246 -787229 -859624 -769321 -533351
35766 -533351 -252146 -47188 -26637 -215569 -483979 -652706 -695085 -710334 -705507 -595082
35756 -595082 -431637 -390764 -455645 -381298 -92263 161835 218001 274837 509389 697814
35746 697814 554729 234955 103314 143404 19738 -330836 -603252 -637539 -609581 -630518
35736f30518O7077J75520K4281k37690j83231J93839M36669L12087P3106m4759
35726A86381j39995k97062l16812l6030L54808N38281M27689J42629j76785l84239
35716B98865l56628j74766j00632k23397l11438j77020J7616L2836n8395k4653
35706a077612J16351J54831Q7402J29133L07569L59780J41429j21482j50040J0766
35696d1873J13596O9490p802l9108o8255j29148j78899j76210j19980j5265J02729
35685d90725J40594O4276J2697J35729L29722L29612R6926j03764j03717p0843
35675C40507j88648l16816k21559J9145J42217J31365J84408K82399J67101j80942
35665C59177m05960k84628n7666k8168r4143K6406K88559L68585J45519j59510
$$ plain form
35736 -630518 -563441 -387921 -363640 -601330 -784561 -590722 -154053 158034 231140 186381
35726 186381 46386 -250676 -567488 -603518 -248710 289571 717260 859889 683104 298865
35716 298865 -57763 -232529 -333161 -556558 -867996 -1045016 -1027400 -994564 -1052959 -1077612
35706 -1077612 -961261 -806430 -719028 -589895 -282326 77454 218883 97401 -52639 -41873
35696 -41873 71723 141213 133411 94303 26048 -103100 -281999 -458209 -578189 -593454 -490725
35685 -490725 -350131 -285855 -273158 -137429 192293 521905 618831 515067 411350 340507
35675 340507 151859 -164957 -386516 -367371 -225154 -93789 90619 373018 540119 359177
35665 359177 -46783 -331411 -389077 -417245 -511388 -484982 -196423 172162 317681 158171
35655A58171l15100l03128j95458l4055J07763J23638J5305p9826o1562J6007
35645e68245L4746m9795j75214k15488o7085K33882M90251N13764L11168M6981
35635E54965j42707k27493k19883j38373k5787O9908J28470J36233Q2281J6629
35625B34243K8538J02546R8150l8500j59141j30291m4488n4698j06841l8634J23857
35614A4741J83768O5537j01331j82902j58074n1947Q5319J54424J15490P9039
35604B04064J31926J53265Q091j65764j30064N6172J18410J9641j3572O0410O281
35593D48860k30202l56216k07998m1424r8444j92296l8166K37884K74015K4010
35583a79977j99766j80209r225J36655J93900J68178P7033l1533j09199j45911
$$ plain form
35655 158171 -156929 -460057 -655515 -689570 -581807 -458169 -442864 -522690 -584252 -568245
35645 -568245 -533499 -583294 -758508 -973996 -1041081 -807199 -316948 196816 507984 554965
35635 554965 412258 184765 -35118 -173491 -199278 -129370 -900 135333 217614 234243
35625 234243 262781 365327 463477 424977 265836 135545 91057 36359 -70482 -109116 14741
35614 14741 198509 264046 162715 -20187 -178261 -230208 -144889 9535 125025 204064
35604 204064 335990 489255 497346 331582 201518 257690 376100 395741 382169 442579 448860
35593 448860 218658 -137558 -345556 -386980 -485424 -677720 -715886 -478002 -203987 -179977
35583 -179977 -379743 -559952 -569177 -432522 -238622 -70444 6589 -24944 -134143 -280054
35573b80054j19731K333J34820R0605j37860k71614j08927J49162J75280K645
35563c63341m9656J15549K46763J53360l5406j11063o6435k1112k7157o0603r4562
35552c13663r3462k1637Q3043J26412Q7946M3809K9585j3682j09540j69485j19697
35541d70371k3062Q482k6512k6504O3251J69221J67326J6500j95402l31571l17602
35530i66244j68145N7210K66458L30851J77354q4520k29676j63532j0598Q6496
35520g04346J30997J59367J14534k6421j19539k8325J47182J97171R8716J23l5216
35509f5757n5296k6960J26597K76465J55244k21714m53796k49003J71735L74699
35499C2214K77359J60986J84410J70048n5411l33193l56643q6437J89171K05470
$$ plain form
35573 -280054 -399785 -397452 -262632 -172027 -309887 -581501 -690428 -541266 -365986 -363341
35563 -363341 -412997 -297448 -50685 102675 67269 -43794 -110229 -131341 -158498 -219101 -313663
35552 -313663 -407125 -428762 -345719 -219307 -131361 -87552 -57967 -71649 -181189 -350674 -470371
35541 -470371 -493433 -484951 -511463 -537967 -474716 -305495 -138169 -121669 -317071 -648642 -966244
35530 -966244 -1134389 -1077179 -810721 -479870 -302516 -387036 -616712 -780244 -790842 -704346
35520 -704346 -573349 -413982 -299448 -325869 -445408 -473733 -326551 -129380 -30664 -30541 -65757
35509 -65757 -121053 -148013 -21416 255049 410293 188579 -265217 -514220 -342485 32214
35499 32214 309573 470559 654969 825017 769606 436413 79770 -6667 182504 387974
35489C87974K238j84410k05341r4972M1941J27058J14794J8168n6127j952J25043
35478B74414J40700k4288k10320k22873n4428J55120K85941K79023J07486j62302
35468E68473l35597k49922L5812K99231L78443K67480M5713j77361k78330j98986
35458C54956j9955J12798J24770L1348j24405k76203l33250k68716j69361j15022
35448f83040o2750N7330J91844K21719J27089j0410j30163k17875k49210k03301
35438i58767r9534L8895J89788K61294J58344m578M2363L05990L92192L8819m10548
35427d5742m08530L8481L97682L54576J28607K028o4832j99042l25983l18394
35417d41149k06777o7160J14873L20978M11931L00089P2535j45249k95284l04146
$$ plain form
35489 387974 390212 205802 461 -94511 -52570 74488 189282 207450 151323 149371 274414
35478 274414 415114 390826 180506 -42367 -96795 58325 344266 623289 730775 568473
35468 568473 232876 -17046 18766 317997 696440 963920 1009633 832272 553942 354956
35458 354956 335001 447799 572569 603917 479512 203309 -129941 -398657 -568018 -683040
35448 -683040 -745790 -688460 -496616 -274897 -147808 -158218 -288381 -506256 -755466 -958767
35438 -958767 -1058301 -1019406 -829618 -568324 -409980 -414558 -372195 -66205 325987 364806 -45742
35427 -45742 -454272 -415791 -18109 336467 465074 467102 402270 203228 -122755 -441149
35417 -441149 -647926 -715086 -600213 -279235 132696 432785 505320 360071 64787 -239359
35407b39359j02100J93605L29541K41581J11119K3272j46121l77046l70693n905
35397c42106L56148L29235M5609r1816l3537q0502l28531n00676l85415j33468
35387a165059K01j973K9228J80843L58806M14939L05400J25071L131j7329K1185
35376B54443O5703N9727o5500k80921l93366k62039l6871L5541n507O1089J84845
35365c82856R7437j26406n1552L74419N70560J72423l30919k99067R9497K22999
35355C46535j9287j57704n1856o5464k95855l17191Q3041M82172M48297J46710
35345E99398r906L0158L8165o4315j80861k73497l44444l08318j03750J64362
35335d53008L48316M07156L27083P4804k30926l04394m3243K67111K94767P0158
$$ plain form
35407 -239359 -341459 -147854 181687 423268 534387 557659 411538 34492 -336201 -342106
35397 -342106 14042 343277 388886 297070 263533 183031 -145500 -646176 -1031591 -1165059
35387 -1165059 -1164858 -1166831 -1137603 -956760 -597954 -183015 122385 247456 250587 233258 254443
35376 254443 320146 379873 314373 33452 -359914 -621953 -658824 -623283 -628790 -567701 -382856
35365 -382856 -285419 -411825 -463377 -88958 481602 654025 323106 24039 123536 346535
35355 346535 327248 169544 117688 52224 -243631 -560822 -477781 4391 452688 599398
35345 599398 589492 619650 657815 593500 412639 139142 -205302 -513620 -617370 -453008
35335 -453008 -104692 302464 629547 704351 473425 169031 125788 392899 687666 757824
35325G57824j32464j83467j56376j05021q924J00583J42755J02490K4255o6418
35315D75237j38322j24784k2403O0863N7262M4484R4426J29958O2448l7671n6631
35304E44867k5588l6189o1731l8526m5097j95994l94845m02405j66868Q9264J54150
35293e78962N8299l0699l0784J1494L7749N9195J10325J52210Q3704j00415k25967
35282d53851j40413L5173M2749j05729r7980J95467M56622L44524j2552k12032
35272E1978j30983K671J8397j8159k8019m1353n6513j6416K5343n9244k14177
35261d66475k09601J967J64800Q0963j08181j57064o4426m505k9951l5752L9484
35250g88741J38513J85039J41197L155j56793j93639m7147J48829K24262J85882
$$ plain form
35325 757824 625360 441893 285517 180496 171572 272155 414910 517400 541655 475237
35315 475237 336915 212131 189728 250591 307853 352337 446763 576721 639169 601498 544867
35304 544867 519279 483090 421359 382833 337736 141742 -253103 -655508 -822376 -733112 -578962
35293 -578962 -520663 -551362 -582146 -570652 -532903 -473708 -363383 -211173 -127469 -227884 -453851
35282 -453851 -594264 -559091 -516342 -622071 -720051 -524584 -67962 276562 264010 51978
35272 51978 -79005 -76334 -57937 -76096 -104115 -145468 -201981 -218397 -193054 -252298 -466475
35261 -466475 -676076 -674109 -509309 -428346 -536527 -693591 -758017 -762522 -792473 -828225 -788741
35250 -788741 -650228 -465189 -323992 -320837 -477630 -671269 -718416 -569587 -345325 -159443
35240a59443J44665R4397n1467k17003j81602Q2449K86854J88603o7258j54092
35230c3897k8301L7426j15919l00199k70585o7100R0182J29079J58862K23594
35220a76858K19043Q4719q0190j58423j56056j31746q1752J8932J23788J45799
35210a92744N8056p5251j41729n5921J41921K68758J85554O322k1026J25893J82618
35199D82451j7244k83455l43571k10981r0579n6675m5968n9124j16649r1148J38980
35188f93963M03753L98803J31426q5172j11625j32669k45287k44796k791K46657
35178c35664K41986P5233j7971l7383j02578j40952j8459J40715J08606l8906
35168a25373j6725J81898K43260K9010k13212k38548j19129l9099k4063k1140
$$ plain form
35240 -159443 -14778 79619 28152 -188851 -370453 -288004 -1150 187453 120195 -33897
35230 -33897 -62198 -24772 -140691 -440890 -711475 -778575 -688393 -559314 -400452 -176858
35220 -176858 42185 126904 46714 -111709 -267765 -399511 -481263 -462331 -338543 -192744
35210 -192744 -134688 -209939 -351668 -407589 -265668 3090 188644 194966 173940 299833 482451
35199 482451 465207 181752 -161819 -372800 -463379 -520054 -566022 -625146 -741795 -832943 -693963
35188 -693963 -290210 108593 240019 154847 43222 -89447 -334734 -579530 -582321 -335664
35178 -335664 -93678 -18445 -36416 -73799 -176377 -317329 -335788 -195073 -86467 -125373
35168 -125373 -142098 39800 283060 312070 98858 -139690 -258819 -297918 -321981 -343121
35158c43121l6783n2818J883P2146j5829k30528k68173o198K28415J16484j47436
35147f81958j52310Q0861J55995m3478j88520o6539Q8312J1151j62609j37373
35137a096468P7586K15905J65703Q4288J15204J83376J22600r3489l03093l20128
35127h48516j31810R1273K05713K51456L11445L02870R7799j80411k34886k8001
35117a63068J21199J857j72905j14274R2506J53008L2254m0855K8360Q9943L5178
35106F3203o5854j41221j98341j84845J559K83033L91005K05789n7379j34123
35096A62826n2996m2583j78201k81077j68078J11062L31414L41661K00671N8526
35086D83225l4393j19272j72368j12650R788K3995p3933n7341J45471K33184l6164
$$ plain form
35158 -343121 -379904 -432722 -430839 -358693 -374522 -605050 -873223 -879421 -651006 -534522 -681958
35147 -681958 -834268 -753407 -597412 -640890 -829410 -895949 -807637 -796486 -959095 -1096468
35137 -1096468 -1018882 -802977 -637274 -552986 -437782 -254406 -131806 -225295 -528388 -848516
35127 -848516 -980326 -889053 -683340 -431884 -120439 182431 280230 99819 -135067 -163068
35117 -163068 -41869 -40012 -212917 -327191 -234685 -81677 -49423 -90278 -61918 28025 63203
35106 63203 -2651 -143872 -342213 -527058 -525499 -242466 148539 354328 296949 162826
35096 162826 109830 67247 -110954 -392031 -560109 -449047 -117633 224028 424699 483225
35086 483225 448832 329560 157192 44542 54330 78325 4392 -52949 92522 325706 289542
35075B89542l90146l75674k9340J90846R9999k8614j1868k1835j50830j54937
35065e82857J11212L67600L15995P8328p8112j82450l79375n27563l70641J1001
35055a236862K77968K94241K01112R6338m3774j51657q4486J21814K56115K14875
35045e4316R5850K3031M5105J54890K42251J25165j80502l62212k25565l9089
35035a75392j34673l25637j67738K74689M43752J32785j96429j26856J39188J90334
35025E4023J4149j30189j60823j56731r9907M1304J24748L5975m4968J17252L90638
35014A85471M02091O7779k83246l49962j89191l7806K786k790O504K036p0460
35003b66788j90149k40794j15638J44046L50691L37313J07176j71002k82327j29079
$$ plain form
35075 289542 -100604 -476278 -505618 -314772 -214773 -243387 -255255 -277090 -427920 -582857
35065 -582857 -471645 -104045 211950 290278 212166 29716 -349659 -877222 -1247863 -1236862
35055 -1236862 -958894 -664653 -463541 -367203 -410977 -562634 -647120 -525306 -269191 -54316
35045 -54316 41534 64565 109670 264560 506811 631976 451474 89262 -136303 -175392
35035 -175392 -310065 -635702 -803440 -528751 -84999 47786 -148643 -275499 -136311 54023
35025 54023 68172 -62017 -222840 -379571 -479478 -438174 -313426 -277451 -322419 -205167 185471
35014 185471 587562 655341 372095 22133 -167058 -204864 -202078 -204868 -198364 -196328 -266788
35003 -266788 -456937 -697731 -813369 -669323 -318632 18681 125857 -45145 -327472 -456551
34993d56551J40727K24383J2429k15012j23468J95698L36479J68087j634O1799
34983C42937J75149Q5587j32058k62528k81751k41954o7254K32258L64757J32862
34973C48005j76231j74686M079o6224l45263l47286K8023K58624J0366l23838
34963g84431k38617J30919K90777J37142l5652r9115j76782k22805r87M30129
34953e69422O31211L65344n3192k06848j05469j6423J4510J46433L57033M11280
34943I74457K21814l8137k19800l38537l71325j98998J12374K37281J0380k88576
34933A00933l13968j38399o6937j19478o8152P5549L4436k13413k95794k942L57398
34922f50767L98858J81982L4430N4780Q4391L4256m0375j08081j60989j16822
$$ plain form
34993 -456551 -315824 -91441 -79012 -294024 -417492 -221794 114685 282772 281138 342937
34983 342937 518086 603673 471615 209087 -72664 -314618 -381872 -149614 215143 348005
34973 348005 171774 -2912 1167 -65057 -410320 -757606 -729583 -470959 -460593 -784431
34963 -784431 -1023048 -892129 -601352 -464210 -499862 -598977 -775759 -998564 -999551 -569422
34953 -569422 61789 427133 373941 167093 61624 45201 59711 206144 563177 974457
34943 974457 1196271 1158134 938334 599797 228472 29474 141848 379129 389509 100933
34933 100933 -213035 -351434 -418371 -537849 -606001 -530452 -496016 -709429 -1005223 -1008165 -650767
34922 -650767 -251909 -69927 -35497 19283 103674 137930 97555 -10526 -171515 -288337
34912b88337N7997K01381J49221m362o7143p2251j64292k40525n5345L01571L93797
34901B11712L4168m02569m50409j20716K01661K75233J92536J26272J00175N0569
34891B18632j2619q27J02382J53116k810k84430m01483k04619J04465K29290J29396
34880C0493l4939j75531k72242k07646R7360M16002L97873N5449k22098j99409
34870a14688m4433L4981Q0312J51511J12338j22286l55468l63827k05139n9406
34860h86105N3006J69946J91118M6910q9641l8048P0452l47j77646j93848l7177
34849h91380O2227O6542J69889L59559L31091o994k88824j83043J36256K78983
34839C4306J99133J55133K24492K00376q967j78639r5771J11754J56197j977j23059
$$ plain form
34912 -288337 -230340 -28959 120262 115900 48757 -23494 -187786 -428311 -483656 -182085 211712
34901 211712 245880 -156689 -607098 -727814 -526153 -250920 -58384 67888 168063 218632
34891 218632 206013 205186 307568 460684 457874 173444 -228039 -432658 -328193 -98903 30493
34880 30493 -4446 -179977 -452219 -659865 -562505 -146503 251370 306819 84721 -114688
34870 -114688 -159121 -124140 -43828 107683 220021 97735 -257733 -621560 -826699 -886105
34860 -886105 -833099 -663153 -472035 -425125 -514766 -552814 -482362 -482709 -660355 -854203 -891380
34849 -891380 -829153 -762611 -592722 -233163 97928 90934 -197890 -380933 -244677 34306
34839 34306 233439 388572 613064 813440 804473 625834 530063 641817 798014 796037 672978
34828F72978o1091J6848j14187l79659m75551k83516l6424J3370n5361K6564L00532
34817c75497M96395L85440N3672k42607l62182l24345j76793L7170K12024K22667
34807g4056P6887n5675k3163J37258K52519K14929Q3833p107O017Q1370J35024
34796H27836J05938j0720j50254k18319j90517j50770j72329j87019o8522J49929
34786f4747K57643J24601j15111k23102j38536r613J7604n1049j05618n1010J17868
34775b41070K95419L27319J59626p4741j80828j14401q088J5153k5997n3815o1763
$$ plain form
34828 672978 611887 628735 514548 134889 -340662 -624178 -660602 -647232 -702593 -676029 -375497
34817 -375497 120898 506338 560010 317403 -44779 -369124 -545917 -508747 -296723 -74056
34807 -74056 2831 -52844 -76007 61251 313770 528699 612532 605425 611442 692812 827836
34796 827836 933774 923054 772800 554481 363964 213194 40865 -146154 -214676 -64747
34786 -64747 192896 317497 202386 -20716 -159252 -168865 -151261 -202310 -307928 -358938 -241070
34775 -241070 54349 381668 541294 466553 285725 171324 163236 178389 152392 98577 36814
$$ [...]
##END NTUPLES=NMR SPECTRUM
##END=
