##TITLE=1H_DE-80H_X3
 200.13MHz, d2o
 8 sc
 
 19ns.26.2.2025
##JCAMPDX= 6.0         $$ Bruker NMR JCAMP-DX V2.0
##DATA TYPE= NMR FID
##DATA CLASS= NTUPLES
##ORIGIN= UXNMR, Bruker Analytische Messtechnik GmbH
##OWNER= pz
$$ XWIN-NMR		Version 3.5
$$ Fri Jan 16 10:30:36 2026 Russian Standard Time (UT+4h)  Yarkov@DPX200
##.OBSERVE FREQUENCY= 200.1313
##.OBSERVE NUCLEUS= ^1H
##.DELAY= (6, 6)
##.ACQUISITION MODE= SIMULTANEOUS
##.ACQUISITION SCHEME= undefined
##.AVERAGES= 8
##.DIGITISER RES= 18
##SPECTROMETER/DATA SYSTEM= spect
##.PULSE SEQUENCE= zg30
##.SOLVENT NAME= CDCl3
##.SHIFT REFERENCE= (INTERNAL, CDCl3, 0, 14.3821)
##AUDIT TRAIL= $$ (NUMBER, WHEN, WHO, WHERE, WHAT)
$$ ##TITLE= Audit trail, XWIN-NMR		Version 3.5
$$ ##JCAMPDX= 5.01
$$ ##ORIGIN= Bruker BioSpin GmbH
$$ ##OWNER= Yarkov
$$ C:/Bruker/XWIN-NMR/data/yarkov2/nmr/H-C/1/audita.txt
$$ ##AUDIT TRAIL=  $$ (NUMBER, WHEN, WHO, WHERE, WHAT)
(   1,<2026-01-16 10:29:37.54 +0400>,<Yarkov>,<DPX200>,
      <created by zg, POWCHK disabled, PULCHK disabled
       configuration hash MD5:
       00 E9 B6 7A A2 85 ED C7 34 08 36 98 17 FE 4E 26
       data hash MD5: 16K
       4C 46 61 4C 48 5F A6 78 C5 52 2C 4A FE 00 4B DB>)
$$ ##END=
$$ 
$$ hash MD5
$$ C1 8C 75 F0 67 D9 5A DD 0F DB 7C 64 CD BF BD 6E
##$RELAX= 
##$RELAX= 
##$RELAX= 
##$RELAX= 
##$RELAX= 
##$RELAX= 
$$ Bruker specific parameters
$$ --------------------------
##$DU= <C:/Bruker/XWIN-NMR>
##$EXPNO= 1
##$NAME= <H-C>
##$PROCNO= 1
##$TYPE= <nmr>
##$USER= <yarkov2>
##$AMP= (0..31)
100 100 100 100 100 100 100 100 100 100 100 100 100 100 100 100 100 100 
100 100 100 100 100 100 100 100 100 100 100 100 100 100 
##$AQSEQ= 0
##$AQ_mod= 1
##$AUNM= <au_zg>
##$AUTOPOS= <>
##$BF1= 200.13
##$BF2= 200.13
##$BF3= 200.13
##$BF4= 200.13
##$BF5= 200.13
##$BF6= 200.13
##$BF7= 200.13
##$BF8= 200.13
##$BYTORDA= 1
##$CFDGTYP= 0
##$CFRGTYP= 5
##$CHEMSTR= <none>
##$CNST= (0..31)
1 1 145 1 1 1 1 1 1 1 1 1 1 1 1 1 1 1 1 1 1 1 1 1 1 1 1 1 1 1 1 1 
##$CPDPRG= <>
##$CPDPRG1= <>
##$CPDPRG2= <>
##$CPDPRG3= <>
##$CPDPRG4= <mlev>
##$CPDPRG5= <mlev>
##$CPDPRG6= <mlev>
##$CPDPRG7= <mlev>
##$CPDPRG8= <mlev>
##$CPDPRGB= <>
##$CPDPRGT= <>
##$D= (0..31)
0 0.7 0 0 0 0 0 0 0 0 0 0.03 0 0 0 0 0 0 0 0 0 0 0 0 0 0 0 0 0 0 0 0 
##$DATE= 1768544977
##$DBL= (0..7)
120 120 120 120 120 120 120 120 
##$DBP= (0..7)
150 150 150 150 150 150 150 150 
##$DBP07= 0
##$DBPNAM0= <>
##$DBPNAM1= <>
##$DBPNAM2= <>
##$DBPNAM3= <>
##$DBPNAM4= <>
##$DBPNAM5= <>
##$DBPNAM6= <>
##$DBPNAM7= <>
##$DBPOAL= (0..7)
0.5 0.5 0.5 0.5 0.5 0.5 0.5 0.5 
##$DBPOFFS= (0..7)
0 0 0 0 0 0 0 0 
##$DE= 6
##$DECBNUC= <off>
##$DECIM= 32
##$DECNUC= <off>
##$DECSTAT= 4
##$DIGMOD= 1
##$DIGTYP= 9
##$DL= (0..7)
0 120 120 120 120 120 120 120 
##$DP= (0..7)
150 150 150 150 150 150 150 150 
##$DP07= 0
##$DPNAME0= <>
##$DPNAME1= <>
##$DPNAME2= <>
##$DPNAME3= <>
##$DPNAME4= <>
##$DPNAME5= <>
##$DPNAME6= <>
##$DPNAME7= <>
##$DPOAL= (0..7)
0.5 0.5 0.5 0.5 0.5 0.5 0.5 0.5 
##$DPOFFS= (0..7)
0 0 0 0 0 0 0 0 
##$DQDMODE= 0
##$DR= 18
##$DS= 0
$$ [...]
##$SUBNAM2= <"">
##$SUBNAM3= <"">
##$SUBNAM4= <"">
##$SUBNAM5= <"">
##$SUBNAM6= <"">
##$SUBNAM7= <"">
##$SUBNAM8= <"">
##$SUBNAM9= <"">
##$SW= 18.0517328524113
##$SWIBOX= (0..15)
0 0 2 0 0 0 0 0 0 0 0 0 0 0 0 0 
##$SW_h= 3612.71676300578
##$TD= 16384
##$TD0= 1
##$TE= 0
##$TE2= 300
##$TE3= 300
##$TEG= 300
##$TL= (0..7)
0 120 120 120 120 120 120 120 
##$TP= (0..7)
150 150 150 150 150 150 150 150 
##$TP07= 0
##$TPNAME0= <>
##$TPNAME1= <>
##$TPNAME2= <>
##$TPNAME3= <>
##$TPNAME4= <>
##$TPNAME5= <>
##$TPNAME6= <>
##$TPNAME7= <>
##$TPOAL= (0..7)
0.5 0.5 0.5 0.5 0.5 0.5 0.5 0.5 
##$TPOFFS= (0..7)
0 0 0 0 0 0 0 0 
##$TUNHIN= 0
##$TUNHOUT= 0
##$TUNXOUT= 0
##$USERA1= <user>
##$USERA2= <user>
##$USERA3= <user>
##$USERA4= <user>
##$USERA5= <user>
##$V9= 5
##$VALIST= <valist>
##$VCLIST= <CCCCCCCCCCCCCCC>
##$VD= 0
##$VDLIST= <DDDDDDDDDDDDDDD>
##$VPLIST= <PPPPPPPPPPPPPPP>
##$VTLIST= <TTTTTTTTTTTTTTT>
##$WBST= 1024
##$WBSW= 4
##$XGAIN= (0..3)
0 0 0 0 
##$XL= 0
##$YL= 0
##$YMAX_a= 174315
##$YMIN_a= -153974
##$ZGOPTNS= <>
##$ZL1= 120
##$ZL2= 120
##$ZL3= 120
##$ZL4= 120
##$ABSF1= 10
##$ABSF2= 0
##$ABSG= 5
##$ABSL= 3
##$ALPHA= 0
##$AQORDER= 0
##$ASSFAC= 0
##$ASSFACI= 0
##$ASSFACX= 0
##$ASSWID= 0
##$AUNMP= <proc_1d>
##$AZFE= 0.1
##$AZFW= 0.1
##$BCFW= 1
##$BC_mod= 2
##$BYTORDP= 1
##$COROFFS= 0
##$CY= 83.5205535888672
##$DATMOD= 1
##$DC= 2
##$DFILT= <>
##$DTYPP= 0
##$F1P= 10.8118882576601
##$F2P= -7.23987719738617
##$FCOR= 0.5
##$FTSIZE= 0
##$FT_mod= 4
##$GAMMA= 1
##$GB= 0.15
##$INTBC= 1
##$INTSCL= 1
##$ISEN= 128
##$LB= 0.25
##$LEV0= 0
##$LPBIN= 0
##$MAXI= 10000
##$MC2= 0
##$MEAN= 0
##$ME_mod= 0
##$MI= 1.114404
##$NCOEF= 0
##$NC_proc= 0
##$NLEV= 6
##$NOISF1= 3.799351
##$NOISF2= 2.8
##$NSP= 1
##$NTH_PI= 0
##$NZP= 0
##$OFFSET= 14.38212
##$PC= 1
##$PHC0= -5301.897
##$PHC1= 7.62193
##$PH_mod= 1
##$PKNL= yes
##$PPARMOD= 0
##$PSCAL= 0
##$PSIGN= 0
##$REVERSE= no
##$SF= 200.129724274929
##$SI= 16384
##$SIGF1= 3
##$SIGF2= 2
##$SINO= 400
##$SIOLD= 16384
##$SREGLST= <1H.CDCl3>
##$SSB= 0
##$STSI= 0
##$STSR= 0
##$SW_p= 3205.1282051282
##$SYMM= 0
##$S_DEV= 0
##$TDeff= 0
##$TDoff= 0
##$TI= <>
##$TILT= no
##$TM1= 0
##$TM2= 0
##$TOPLEV= 0
##$USERP1= <user>
##$USERP2= <user>
##$USERP3= <user>
##$USERP4= <user>
##$USERP5= <user>
##$WDW= 1
##$XDIM= 8192
##$YMAX_p= 0
##$YMIN_p= 0
$$ End of Bruker specific parameters
$$ ---------------------------------
##NTUPLES= NMR FID
##VAR_NAME=  TIME,          FID/REAL,        FID/IMAG
##SYMBOL=    X,             R,               I
##VAR_TYPE=  INDEPENDENT,   DEPENDENT,       DEPENDENT
##VAR_FORM=  AFFN,          ASDF,            ASDF
##VAR_DIM=   8192,          8192,            8192
##UNITS=     SECONDS,       ARBITRARY UNITS, ARBITRARY UNITS
##FACTOR=    0.0002768,     1,               1
##FIRST=     0,             0,               0
##LAST=      2.2672688,     0,               0
##MIN=       0,             -153974,         0
##MAX=       2.2672688,     174315,          0
$$ Real data points
##PAGE= N=1
##DATA TABLE= (X++(R..R)), XYDATA
$$ plain form
0 0 0 0 0 0 0 0 0 0 0 0 0 0 0 0 0 0 8 -8 8 -8 8 -12 16 -16 20 -24 28 -32 37 -42 48 -56 64 -73 82 -92 105 -116
38 -116 132 -147 163 -182 201 -222 246 -273 301 -333 367 -403 446 -490 539 -595 657 -727 804
57 804 -893 995 -1115 1255 -1425 1634 -1896 2242 -2717 3407 -4519 6642 -20460 107298 50930
72 50930 -119575 -23123 37500 -43982 -66219 26426 56035 53015 90542 29691 -129167 -77537
84 -77537 55315 -38424 -101297 91402 174315 2594 -86516 10223 23552 -63932 -38623 31095
96 31095 -4473 -12476 23609 -40018 -75417 54265 113756 -14783 -48247 77438 42181 -118774
108 -118774 -75309 58292 33922 -5981 34337 26022 -21947 -15569 -8178 -55024 -36936 71023
120 71023 47582 -76865 -24982 78656 -723 -66489 20061 70781 11133 -31468 -7399 -3508
$$ packed form
0@%%%%%%%%%%%%%%%%Qj6J6j6J6k0K8l2L6m4N2o0O9p9R0j04J20j37J55j74J97k21
38a16K48k79L10l45L83m23M68n19N74o34P00p70Q49r36J029j134J252j384J531
57H04j697J888k110K370k680L059l530M138m959O124p926J1161k7102J27758n6368
72E0930j70505R6452O0623q1482k2237R2645K9609l020L7527o0851j58858N1630
84g7537J32852r3739o2873J92699Q2913j71721q9110R6739J3329q7484K5309O9718
96C1095l5568q003L6085o3627l5399J29682N9491j28539l3464J25685l5257j60955
108a18774M3465J33601k4370l9903M0318q315m7969O378P391m6846J8088J07959
120G1023k3441j24447N1883J03638p9379o5766Q6550N0720n9648m2601K4069L891
$$ plain form
132 -3508 -24725 9177 21928 -26522 7186 60343 -25624 -85797 4981 52196 -20191 -36335
144 -36335 41088 49939 -19832 -23283 12514 -2211 -3206 21108 -6016 -28331 16745 29158 -35317
157 -35317 -37606 43939 37429 -42450 -27743 26459 1350 -30190 -5503 20705 15176 11374 16767
170 16767 -8371 -20833 21819 10100 -49143 -10965 44717 -895 -37859 1624 30558 3765
182 3765 -21495 2286 14265 -10946 -4053 3631 -19494 5052 36657 -2027 -22738 17225 26499
195 26499 -18659 -36058 4927 19062 -16967 -15566 13850 8223 880 7885 -2090 -7969 10440
208 10440 12535 -18785 -20714 21305 18522 -22071 -7956 23756 7907 -15087 -11577 819 -377
221 -377 -7380 -820 -1147 -1500 20933 11457 -19700 2104 23555 -5341 -20782 -2978 12543 3486
$$ packed form
132c508k1217L3902J2751m8450L3708N3157q5967o0173R0778M7215p2387j6144
144c6335P7423Q851o9771l451L5797j4725r95K4314k7124k2315M5076J2413o4475
157c5317k289Q1545o510p9879J4707N4202k5109l1540K4687K6208n529l802N393
170A6767k5138j2462M2652j1719n9243L8178N5682m5612l6964L9483K8934k6793
182C765k5260K3781J1979k5211O893P684k3125K4546L1605l8684k0711L9963R274
195B6499m5158j7399M0985J4135l6029J401K9416n627p343P005r975n879J8409
208A0440K095l1320j929M2019k783m0593J4115L1712j5849k2994L510J2396j196
221c77p003O560l27l53K2433r476l1157K1804K1451k8896j5441J7804J5521r057
$$ plain form
235 3486 -14403 -1341 13213 -1313 -3116 -1941 -13572 834 10632 -11084 -10113 14848 19008
248 19008 891 -8929 8162 14750 -8999 -15231 -1526 -166 -1088 -2006 -5538 1235 9883 3934
262 3934 -11075 -9499 9153 5000 -13487 -4132 13310 12373 3004 -1828 6197 9203 -3888 -9573
276 -9573 -9651 -6788 4000 -3996 -14190 4945 13601 414 -4864 -2810 6434 6566 -9630 -4948 9701
291 9701 6488 4827 1404 -2125 8851 4533 -12722 -10513 -2811 -611 -4565 -11841 -348 12119
305 12119 2389 -3295 1665 5711 7109 -1205 -5511 3660 7558 3554 -2885 -3901 5974 3693 -9626
320 -9626 -9274 -2819 468 -2612 -9606 -1058 9145 2423 39 960 2551 9949 2399 -6580 4178
335 4178 7187 1274 -1787 -6347 1237 4487 -10520 -9559 -173 -1960 146 -3261 -4736 8613 7715
$$ packed form
235C486j7889J3062J4554j4526j803J175j1631J4406R798k1716R71K4961M160
248A9008j8117r820J7091O588k3749o232J3705J360r22r18l532O773Q648n949
262C934j5009J576J8652m153j8487R355J7442r37r369m832Q025L006j3091n685
276i573p8K863J0788p996j0194J9135Q656j3187n278K054R244J32j6196M682J4649
291I701l213j661l423l529J0976m318j7255K209P702K200l954p276J1493J2467
305A2119r730n684M960M046J398q314m306R171L898m004o439j016R875k281j3319
320i626L52O455L287l080o994Q548J0203o722k384R21J591P398p550q979J0758
335D178L009n913l061m560P584L250j5007R61R386j787K106l407j475J3349q98
$$ plain form
350 7715 -2565 442 3077 6085 4808 -6140 -637 8824 955 -3591 -3253 -2536 1819 -4266 -10654
365 -10654 -3483 1171 841 -1909 -2954 6750 9123 225 -295 3179 4546 2814 -4310 -2315 3910
380 3910 987 -1804 -4058 -3546 3216 -2140 -9542 -2163 1291 331 -65 -2517 4724 9208 592 313
396 313 3245 1607 3696 -2507 -6640 2737 2015 -4609 -3351 -2241 1512 1020 -6891 -2669 3766 286
412 286 -104 -189 1343 7075 3364 -1855 1503 3215 1863 -2579 -5606 285 1495 -3767 -3803 -1238 1725
429 1725 1199 -3532 -1183 2481 1278 1206 -911 252 6219 2125 -2354 1101 1587 1323 -1907 -6109
445 -6109 254 1592 -4929 -1998 130 101 3564 -722 -2241 3949 1981 -563 -608 -1303 4414 2959
461 2959 -4725 504 3467 -1453 -2048 -2938 -1830 1039 -2239 -2458 619 1236 4021 1169 -1965 4014
$$ packed form
350G715j0280L007K635L008j277j0948N503R461p869m546L38P17M355o085o388
365a0654P171M654l30k750j045R704K373q898n20L474J367j732p124J995O225
380C910k923k791k254N12O762n356p402P379L454r60l96k452P241M484q616k79
396C13K932j638K089o203m133R377p22o624J258J110L753m92p911M222O435l480
412B86l90q5J532N732l711n219L358J712j352m442l027N891J210n262l6K565K963
429A725n26m731K349L664j203p2k117J163N967m094m479L455M86k64l230m202
445f109O363J338o521K931K128k9L463m286j519O190j968k544m5o95N717j455
461B959p684N229K963m920n95q90J108K869l278k19L077O17K785k852l134N979
$$ plain form
477 4014 3902 -2637 -2511 67 1888 -361 -3734 987 2004 -1474 -287 -2386 -2847 2442 -311 -3579
493 -3579 661 3215 4044 175 -1782 5691 3479 -4555 -844 -246 -2536 328 -2714 -2928 2371 1109
509 1109 -482 -2023 -2132 3983 790 -5492 2521 5582 426 1117 1252 1693 2218 -2154 -2974 -1956 -2260
526 -2260 246 -2963 -4815 2990 3669 -2431 -1346 2116 2978 -412 -2530 2459 3544 1045 2435 111
542 111 -355 3158 -1502 -5704 -2836 -564 -518 -4570 -3709 4352 2623 -2381 1673 2117 1369 2556 -1434
559 -1434 -475 3756 2002 926 -1200 -898 4082 -1578 -7787 -1623 7 -3258 -2797 -1985 1978 3574
575 3574 137 1229 2195 2004 3743 -859 -2741 3592 2931 -1993 -1869 399 2121 -2007 -5693 -1525
591 -1525 -930 -2581 -1271 -2111 481 4906 2089 149 2000 3401 4052 -1504 -2967 3800 1441 -3520
$$ packed form
477D014j12o539J26K578J821k249l373M721J017l478J187k099m61N289k753l268
493c579M240K554Q29l869j957P473k212q034L711N98k290K864l042k14N299j262
509A109j591j541j09O115l193o282Q013L061n156O91J35M41N25m372q20J018l04
526b260K506l209j852P805O79o100J085L462Q62l390k118M989J085k499J390k324
542A11m66L513m660m202K868K272M6m052Q61Q061j729n004M054M44p48J187l990
559a434R59M231j754j076k126L02M980n660o209O164J630l265M61Q12L963J596
575C574l437J092R66j91J739m602j882O333o61m924J24K268J722m128l686M168
591a525N95j651J310q40K592M425k817j940J851J401O51n556j463O767k359m961
$$ plain form
607 -3520 -732 -891 -523 -127 -4126 -2709 -199 -1383 -30 -1859 -955 6254 2577 -1843 3758 4057
623 4057 1113 123 -1800 978 1049 -3177 -1626 -1348 -1991 1112 -2475 -4601 1599 1461 -1774 -1278 912
640 912 3990 1867 -1324 2899 3655 637 1276 -1410 -2171 1172 -1439 -3534 -2169 -411 1026 -2642
656 -2642 -3154 2536 1158 -1695 983 1017 1886 2598 191 806 2327 778 923 -2051 -2545 2498 -1830
673 -1830 -4625 -126 -296 -913 -419 -1088 1691 1922 -28 1070 818 -176 2754 -296 -1009 2376 1535
690 1535 -724 -1744 -1395 -97 -872 -4132 -405 -823 -560 856 -23 320 2681 848 24 1053 783
707 783 1471 -936 -1428 1871 222 -1595 -443 -1008 -324 -605 -2530 -578 94 -408 1474 -503 983
724 983 3400 308 -617 1257 263 -43 -618 -1970 967 37 -1942 181 -477 -417 656 -1856 -1266 1516
$$ packed form
607c520K788j59L68L96l999J417K510j184J353j829R04P209l677m420N601K99
623D057k944r90j923K778P1m226J551K78o43L103l587k126O200j38l235M96K190
640I12L078k123l191M223P56l018O39k686p61L343k611k095J365J758J437l668
656b642n12N690j378k853K678L4Q69P12k407O15J521j549J45k974m94N043m328
673a830k795M499j70o17M94o69K779K31j950J098k52r94K930l050p13L385q41
690A535k259j020L49J298p75l260L727m18K63J416q79L43K361j833q24J029k70
707G83O88k407m92L299j649j817J152n65O84k81j925J952O72n02J882j977J486
724I83K417l092r25J874r94l06n75j352K937r30j979K123o58O0J073k512N90K782
$$ plain form
742 1516 112 559 640 674 2721 534 -1112 1028 -163 -1301 -773 -1721 -63 462 -1250 -130 -91 234
760 234 1308 -935 -352 2123 244 -198 1179 632 1668 508 -1676 501 -437 -1842 -570 -2020
776 -2020 -891 1289 -1344 -767 1404 551 1084 -99 -664 2313 847 -925 1340 358 402 1143 -1751
793 -1751 -1045 361 -1674 -1616 -1371 -978 1385 -427 -967 2089 1240 813 912 20 1540 1940 -888 305
811 305 27 31 99 -1900 -1951 337 -1066 -2075 -1040 -1270 603 -342 168 1434 1547 573 1471 -188 931
830 931 1732 -1226 -674 547 -562 -223 -1669 -2193 297 -811 -1873 -213 -522 960 1680 -505 1317
847 1317 2646 807 999 214 71 1433 -863 -1635 -115 -970 -822 -1065 -2120 -138 61 -1412 -85
864 -85 273 861 1792 169 950 2534 816 823 265 -346 1041 -634 -2004 -307 -994 -1097 -617 -2087 -218
$$ packed form
742A516j404M47Q1L4K047k187j646K140j191j138N28r48J658N25j712J120L9L25
760B34J074k243N83K475j879m42J377n47J036j160k184K177r38j405J272j450
776b020J129K180k633N77K171q53N33j183n65K977j466j772K265r82M4P41k894
793a751P06J406k035N8K45L93K363j812n40L056q49m27R9q92J520M00k828J193
811C05k78MO8j999n1K288j403j009J035k30J873r45N10J266J13r74Q98j659J119
830I31Q01k958N52J221j109L39j446n24K490j108j062J660l09J482P20k185J822
847A317J329j839J92p85j43J362k296p72J520q55J48k43j055J982J99j473J327
864h5L58N88R31j623P81J584j718Pn58o11J387j675j370J697o87j03M80j470J869
$$ plain form
883 -218 825 -1076 243 815 618 2154 529 93 2313 720 -60 514 -1000 -24 -99 -2411 -957
900 -957 -445 -1573 -318 -1124 -724 1546 -93 -125 1628 798 1411 1246 -140 1424 1001 -613 149 -638
918 -638 -730 183 -1831 -1474 -112 -1114 -652 -405 -417 1320 609 -94 1495 783 821 1398 -455 449 1038
937 1038 -811 -333 -532 -928 -23 -1344 -1499 264 -902 -462 309 -538 1014 1478 -96 907 1347 699
955 699 890 284 -834 714 -620 -1210 418 -1196 -797 -567 -763 -56 -241 -518 734 29 684 1388
973 1388 63 677 1033 -134 142 -484 -594 111 -699 -1003 -37 -782 -145 -27 -966 261 377 -211 746
992 746 388 409 1338 66 149 873 -491 -82 -214 -1105 161 -522 -1606 138 -173 -419 523 -528 396
1011 396 1026 -366 517 953 -7 766 49 -424 588 -571 -865 -157 -1037 -294 -1 -1047 364 426 -404
$$ packed form
883b18J043j901J319N72j97J536j625m36K220j593p80N74j514R76p5k312J454
900i57N12j128J255q06M00K270j639l2J753q30O13j65j386J564m23j614P62p87
918f38r2R13k014L57J362j002M62K47j2J737p11p03J589p12L8N77j853R04N89
937A038j849M78j99l96R05j321j55J763j166M40P71q47J552M64j574J003M40o48
955F99J91o06j118J548j334n90J628j614L99K30j96P07j85k77J252p05O55P04
973A388j325O14L56j167K76o26j10P05q10l04R66p45O37J18r39J227J16n88R57
992G46l58K1R29j272Q3P24j364M09j32q91J266o83j084J744l11k46R42j051R24
1011C96O30j392Q83M36r60P73p17m73J012j159k94P08q80P43K93j046J411O2q30
$$ plain form
1030 -404 564 -46 156 1369 26 196 1334 -673 68 290 -815 -44 -651 -1059 -459 -992 -393 635
1048 635 -702 131 1001 -429 418 553 -393 1386 289 -438 841 -85 -491 312 -1244 -298 146 -1501
1066 -1501 -454 74 -998 441 226 227 1399 553 -40 955 -289 488 432 -885 -177 127 -1033 -618
1084 -618 -819 -728 203 -1084 -561 291 -296 415 586 -110 1253 823 209 703 187 223 379 -1000 -301 6
1104 6 -1122 -549 -558 -969 207 -613 -463 636 -8 436 896 -75 1110 1141 -170 578 219 -216 278 -743
1124 -743 -849 53 -941 -796 -427 -1834 148 675 -869 499 660 348 903 251 619 1214 29 203
1142 203 222 -537 -81 -627 -1209 -162 -642 -725 -312 -738 709 385 -943 735 1009 254 2005 335 -785
1161 -785 1725 -227 -286 500 -658 -384 -269 -1006 -483 -390 -1058 -182 -361 117 746 -118 269 1500 144
$$ packed form
1030d04R68o10K02J213j343J70J138k007P41K22j105P71o07m08O00n33N99J028
1048F35j337Q33Q70j430Q47J35r46J779j097p27J279r26m06Q03j556R46M44j647
1066a501J047N28j072J439k15JJ172q46n93R95j244P77n6j317P08L04j160M15
1084f18k01R1R31j287N23Q52n87P11J71o96J363m30o14M94n16L6J56j379O99L07
1104Fj128N73rm11J176q20J50J099o44M44M60r71J185L1j311P48l59m35M94j021
1124g43j06R02r94J45L69j407J982N27j544J368J61l12N55o52L68N95j185J74
1142B03J9p59M56n46n82J047m80q3M13m26J447l24j328J678K74p55J751j670j120
1161g85K510j952n9P86j158K74J15p37N23R3o68Q76j79M78O29q64L87J231j356
$$ plain form
1180 144 516 968 -875 344 231 -308 259 -594 -517 -56 -1549 -931 -278 -472 -316 230 -2 948 332
1199 332 -56 673 414 307 829 -308 -73 171 -862 -51 -294 -1038 -139 -690 -608 258 -321 -53 569 -30
1219 -30 654 807 -94 846 595 -170 392 -201 -402 164 -1344 -671 323 -832 -46 129 -714 815 175
1238 175 -780 888 31 158 34 -661 47 162 -680 -5 -73 -711 56 -279 -197 -236 -309 -180 320 -267 335
1259 335 320 -67 546 449 -11 606 19 48 245 -376 -271 -141 -597 9 -303 -595 149 -55 -204 353 -48
1280 -48 355 125 -126 383 399 -140 253 -30 -381 211 -442 -459 25 -585 -330 9 -377 352 212 -220 560
1301 560 228 109 541 -122 41 372 -363 -42 49 -549 -60 -379 -683 62 -173 -305 299 -201 198 636
1321 636 -106 495 499 -9 464 113 -256 273 -304 -408 -4 -546 -174 -40 -752 28 201 -465 466 159 100
$$ packed form
1180A44L72M52j843J219j13n39N67q53P7M61j493O18O53j94J56N46k32R50o16
1199C32l88P29k59j07N22j137K35K44j033Q11k43p44Q99n51Q2Q66n79K68O22n99
1219c0O84J53r01R40k51p65N62n93k01N66j508O73R94j155P86J75q43J529o40
1238A75r55J668q57J27j24o95P08J15q42O75o8o38P67l35Q2l9p3J29N00n87O02
1259C35j5l87O13r7m60O17n87K9J97o21J05J30m56O06l12k92P44k04j49N57m01
1280d8M03k30k51N09J6n39L93k83l51N92o53j7M84o10K55L39l86P29j40m32P80
1301E60l32j19M32o63J63L31p35L21R1n98M89l19l04P45k35j32O04n00L99M38
1321F36p42O01Mn08M73l51l69N29n77j04M04n42L72J34p12P80J73o66R31l07n9
$$ plain form
1342 100 755 117 115 666 -145 131 54 -513 68 -127 -743 -139 -400 -455 164 -439 12 524 -75 336 460
1363 460 44 659 297 -130 432 -122 -174 -15 -581 -203 -142 -612 -322 -281 -428 251 -120 -175 618 153 339
1384 339 657 78 559 415 -262 305 24 -428 6 -483 -513 -1 -527 -452 -22 -309 248 106 -149 642 479
1405 479 85 619 194 175 403 -226 -113 -60 -536 -129 -472 -555 -65 -371 -386 239 -104 129 556 162 513
1426 513 613 122 543 189 -10 361 -333 -334 -26 -575 -311 -165 -493 -65 -94 -358 214 121 71 598 150 326
1448 326 680 33 303 131 -148 135 -144 -504 -126 -376 -491 -90 -341 -101 84 -286 141 283 -25 580
1468 580 343 11 451 168 29 269 -226 -34 -126 -591 -128 -154 -433 5 -212 -189 203 -5 -17 428 30
1489 30 279 515 -95 317 215 -175 99 -261 -311 -152 -418 -263 -33 -317 -26 18 -104 229 278 29 425
$$ packed form
1342A00O55o38kN51q11K76p7n67N81j95o16O04k61n5O19o03M51N12n99M11J24
1363D60m16O15l62m27N62n54n2J59n66L78O1m70K90M1j47O79l71n5P93m65J86
1384C39L18n79M81j44o77N67k81m52M34m89l0N12n26P5M30k87N57j42k55P91j63
1405D79l94N34m25j9K28o29J13N3m76M07l43q3M90l06j5O25l43K33M27l94L51
1426E13J00m91M21l54j99L71o94jL08n49K64J46l28M28k9k64N72r3n0N27m48J76
1448C26L54o47K70j72k79K83k79l60L78k50j15M01k51K40J85l70M27J42l08O05
1468E80k37l32M40k83j39K40m95J92r2m65M63k6k79M38k17K3L92k08j2M45l98
1489C0K49K36o10M12j02l90K74l60n0J59k66J55K30k84K91M4j22L33M9k49L96
$$ plain form
1510 425 191 165 321 -15 113 188 -383 13 -212 -432 -84 -258 -248 36 -17 -30 117 -15 227 228 52 335
1532 335 165 -64 215 -79 -130 28 -288 -197 -219 -416 -94 -13 -211 202 123 25 337 20 98 272 44 220
1554 220 177 -196 16 -20 -208 103 -216 -201 27 -298 -81 80 -84 151 208 7 291 220 47 227 -56 22
1576 22 90 -257 -160 -104 -480 -7 -68 -263 204 -53 -247 300 -53 219 253 39 325 219 -31 154 -4 -225
1598 -225 102 -311 -242 -19 -488 -194 -11 -282 78 90 -187 351 84 15 398 49 -42 297 -157 -75 -184 -481
1620 -481 -6 -226 -395 -100 -249 -322 153 -73 10 247 83 294 305 13 350 153 -139 123 -181 -285 -65
1641 -65 -329 -146 -92 -238 -60 76 -165 214 79 -11 391 76 97 431 131 139 147 -191 -6 -215 -266 -75 -309
1664 -309 -287 8 -260 -133 216 -21 186 302 16 234 246 165 238 -81 -51 78 -251 -35 18 -316 -188 -140
$$ packed form
1510D25k34k6J56l36J28P5n71L96k25k20L48j74J0K84n3j3J47j32K42Jj76K83
1532C35j70k29K79k94n1J58l16R1k2j97L22Q1j98M13p9r8L12l17P8J74k28J76
1554B20m3l73K12l6j88L11l19J5K28l25K17J61j64K35N7k01K84p1j73J80k83P8
1576B2O8l47R7N6l76M73o1j95M67k57j94N47l53K72L4k14K86j06k50J85j58k21
1598b25L27m13O9K23m69K94J83k71L60J2k77N38k67o9L83l49r1L39m54Q2j09k97
1620d81M75k20j69K95j49p3M75k26Q3K37j64K11J1k92L37j97k92K62l04j04K20
1641f5k64J83N4j46J78J36k41L79j35r0M02l15K1L34l00QQl38J85k09n1J91k34
1664c09K2K95k68J27L49k37K07J16k86K18J2q1P3l19L0J29l29K16N3l34J28M8
$$ plain form
1686 -140 -261 -57 -111 -230 151 91 209 267 82 269 318 -107 160 172 -91 33 -264 -190 -9 -280 -128 -26
1708 -26 -184 -34 -48 -119 206 55 223 240 110 121 250 65 -25 70 -208 -28 -107 -295 -30 -180 -173 111 -79
1731 -79 31 232 -72 265 275 141 301 188 -93 83 -78 -153 -14 -163 -154 -49 -325 -168 -156 -262 12 105
1753 105 15 211 -2 88 310 40 250 155 -150 94 65 -81 72 -157 -161 -64 -201 -209 138 -192 44 120 45 223
1777 223 191 76 186 93 76 65 -37 -18 82 -249 -110 -87 -244 -56 -118 -127 116 -125 -8 198 -69 128 229
1800 229 31 182 76 -191 73 -57 -176 -59 -168 -178 70 -192 35 -6 -162 184 55 139 227 -24 93
1821 93 176 -117 -41 26 -71 -47 -17 -98 -44 -160 -116 145 -148 10 116 40 201 180 32 103 150 -65 49 -108 -12
1846 -12 54 -211 -141 -38 -188 -56 23 -102 98 -37 -91 104 48 89 162 -25 216 207 -71 56 -52 -215 68
$$ packed form
1686a40j21K04n4j19L81o0J18N8j85J87M9m25K67J2k63J24k97P4J81k71J52J02
1708b6j58J50j4p1L25j51J68J7j30J1J29j85r0R5k78J80p9j88K65j50PK84j90
1731g9J10K01l04L37J0j34J60j13k81J76j61p5J39j49RJ05k76J57J2j06K74R3
1753A05r0J96k13R0K22k70K10r5l05K44k9j46J53k29mR7j37qL47l30K36P6p5J78
1777B23l2j15J10r3j7j1j02J9J00l31J39K3j57J88o2rK43k41J17K06k67J97J01
1800B29j98J51j06k67K64j30j19J17j09j0K48k62K27m1j56L46j29Q4Q8k51J17
1821I3Q3k93P6O7r7K4L0q1N4j16M4K61k93J58J06p6J61k1j48P1M7k15J14j57R6
1846a2O6k65P0J03j50J32P9j25K00j35n4J95n6M1P3j87K41rk78J27j08j63K83
$$ plain form
1869 68 -107 -243 71 -187 -56 120 -126 66 132 -28 115 183 -54 231 64 -92 -62 -272 -74 68 -145
1890 -145 -54 -122 -202 21 -105 -45 223 23 96 309 -57 191 216 54 108 51 -62 -42 -150 -310 -26 -151 -50
1913 -50 -12 -234 69 59 19 158 81 10 174 -49 53 215 -136 7 -58 -134 -21 -61 -202 -15 -35 -135 100
1936 100 -87 44 108 -9 246 165 45 180 165 11 73 37 8 -3 -206 -89 -108 -244 48 -12 -177 18 12 -107
1960 -107 190 2 84 236 12 131 111 -180 61 25 -211 26 -153 -181 41 -225 -118 -38 -88 16 -79 -56 183
1983 183 2 -18 216 191 121 6 -78 -123 -66 -77 -72 -42 -135 -113 -172 -150 110 -17 46 177 24 181 153 18 126
2008 126 -12 -247 22 -122 -134 17 -155 -120 -25 -172 -46 62 -102 71 79 -61 149 130 156 178 -24 96 155
2031 155 -115 -31 -13 -218 -66 -97 -178 -68 -102 114 -42 -151 128 89 51 110 94 7 51 71 -66 37 -79 -96
$$ packed form
1869F8j75j36L14k58J31J76k46J92O6j60J43O8k37K85j67j56L0k10J98J42k13
1890a45R1o8q0K23j26O0K68k00P3K13l66K48K5j62N4n7j13K0j08j60K84j25J01
1913e0L8k22L03j0m0J39p7p1J64k23J02J62l51J43o5p6J13m0j41J87k0j00K35
1936A00j87J31O4j17K55q1j20J35j5j54O2l6k9j1k03J17j9j36K92o0j65J95oj19
1960a07K97j88Q2J52k24J19k0k91K41l6k36K37j79k8K22k66J07Q0n0J04r5K3K39
1983A83j81k0K34k5p0j15q4m5N7j1NL0r3K2n9K2K60j27O3J31j53J57k8j35J08
2008A26j38k35K69j44j2J51j72L5R5j47J26J08j64J73Qj40K10j9K6K2k02J20N9
2031A55k70Q4J8k05J52l1q1J10l4K16j56j09K79l9l8N9j6q7M4K0j37J03j16j7
$$ plain form
2055 -96 31 -131 3 12 -85 72 61 -12 163 92 4 252 34 73 232 -48 -101 142 -136 46 -69 -104 -46 -63
2079 -63 -20 -61 -150 98 68 -106 63 17 5 117 -25 -36 32 -62 -119 73 -131 -35 -143 -197 -26 -123 23 132 -34
2104 -34 -45 94 132 160 62 -15 75 -1 -22 12 -10 -60 -27 -62 -42 -12 -87 57 -5 -51 95 -102 -101 159 -49 69 108
2131 108 -13 62 55 -83 -37 -27 -84 55 -51 -19 209 -60 61 57 -95 137 50 -10 39 5 -42 64 -98 -103 49
2156 49 -20 -119 160 30 -110 82 -63 63 80 -76 113 31 78 126 80 -80 127 -84 131 -14 -95 46 -140
2179 -140 -106 106 -98 108 -11 -59 61 16 -192 189 149 -56 277 13 -44 82 -83 47 -2 -88 -33 -46 -85
2202 -85 99 39 -71 38 50 76 122 56 135 113 17 95 -61 27 -27 -57 -83 18 -22 -64 -28 -229 -66 22 -74 -20 10
2229 10 0 65 131 118 152 72 177 -13 -55 -10 38 -59 6 -157 -117 -79 -49 -45 -92 64 -85 13 27 13 133 45 48 -5
$$ packed form
2055i6J27j62J34Rr7J57j1p3J75p1q8K48k18L9J59k80n3K43k78J82j15l5N8j7
2079f3M3m1q9K48l0j74J69m6j2J12j42j1O8r4n7J92k04R6j08n4J71r7J46J09j66
2104c4j1J39L8K8r8p7R0p6k1L4k2n0L3l5K0L0p5J44o2m6J46j97JK60k08J18L9
2131A08j21P5pj38M6J0n7J39j06L2K28k69J21mj52K32q7o0M9l4m7J06j62nJ52
2156D9o9r9K79j30j40J92j45J26J7j56J89q2M7M8m6j60K07k11K15j45q1J41j86
2179a40L4K12k04K06j19m8J20m5k08L81m0k05L33k64n7J26j65J30m9q6N5j3l9
2202h5J84o0j10J09J2K6M6o6P9k2r6P8j56Q8n4l0k6J01m0m2L6k01J63Q8r6N4L0
2229A0j0O5O6j3L4q0J05j90m2M5M8r7O5j63M0L8L0Mm7J56j49R8J4j4J20q8Ln3
$$ plain form
2257 -5 -58 -19 -178 -127 5 -137 -40 21 -151 13 61 -44 52 -10 -11 89 -59 60 72 -17 108 -91 76 -14 -17 -80
2283 -80 -40 -47 50 -93 -21 33 75 -47 116 131 37 105 -37 -14 -49 -67 8 -93 -67 -134 73 -123 55 -1 -86 124
2309 124 -34 -45 20 -6 58 89 -53 49 73 -32 132 -16 -53 77 -95 -27 -15 -100 33 2 -53 -43 8 53 50 -18
2335 -18 51 42 -106 4 15 21 22 21 -92 -46 -85 -135 39 -55 -17 -79 41 92 -39 100 68 -67 60 40 11 54 -19 -83
2363 -83 -17 -82 -31 60 30 -36 -12 47 -7 69 53 60 85 -159 -10 -32 -99 17 -11 -124 80 -66 -108 -16 -77 -22 -19 17
2391 17 64 -19 -1 47 55 32 95 -9 -15 0 56 20 -34 -22 -48 32 -36 -83 7 -29 31 -109 2 59 48 -20 46 39 -26 47
2421 47 -86 -8 17 4 69 -94 99 -30 -135 6 -11 5 61 48 10 -97 33 -39 26 -29 79 46 -102 -30 -57
2446 -57 -17 -16 -16 -62 -29 -5 8 38 -16 -19 53 -3 124 -2 -57 70 9 25 -5 -165 -84 -37 -187 -95 -34 -87 13 16 -38
$$ packed form
2257en3L9j59N1J32j42R7O1j72J64M8j05R6o2jJ00j48J19J2q9J25j99J67r0lo3
2283h0M0pR7j43P2N4M2j22J63J5r4O8j42K3l5j8P5j01K6o7K07j96J78n6q5K10
2309A24j58j1O5k6O4L1j42J02K4j05J64j48l7J30j72O8J2q5J33l1n5J0N1M5lo8
2335a8O9rj48J10J1OJjj13M6l9n0J74r4L8o2J20N1j31J39l2j35J27k0k9M3p3o4
2363h3O6o5N1R1l0o6K4N9n4P6j6PK5k44J49k2o7J16k8j13K04j46m2R2o1N5LL6
2391A7M7q3J8M8Qk3O3j04oJ5N6l6n4J2k6Q0o8m7R0l6O0j40J11N7j1o8O6po5P3
2421D7j33P8K5j3O5j63J93j29j05J41j7J6N6j3l8j07J30p2O5n5J08l3j48P2k7
2446e7M0J%m6L3K4J3L0n4lP2n6J27j26n5J27o1J6l0j60Q1M7j50R2O1n3J00Ln4
$$ plain form
2475 -38 189 79 -18 24 -26 -3 26 52 90 63 -70 74 -101 17 43 -111 15 -14 -98 -54 121 48 17 6 -10 -44
2501 -44 39 -142 108 -26 -187 8 -114 -49 -22 -165 -85 30 -29 -36 -187 55 25 -22 81 122 34 -25 -50 -84 -125
2526 -125 55 -107 50 -97 -52 20 -103 68 73 -78 126 23 -65 57 26 -14 82 -130 58 45 29 -164 -128 70
2550 70 -216 -107 -12 40 -30 -66 23 69 57 22 117 77 -6 31 49 -25 65 17 42 -26 -74 -44 33 -94 -82 90 -5 44
2578 44 -52 -56 54 10 38 54 -41 -95 -46 155 -48 -18 -97 -61 69 10 -99 78 4 16 10 71 35 -26 9 -21 84 -42
2606 -42 8 -7 53 99 -104 16 97 -63 9 32 -77 39 33 -91 58 50 -17 73 -23 -35 48 -130 18 -89 41 -18
2632 -18 -71 120 17 -14 11 16 -24 103 16 75 128 80 -17 70 60 36 21 -53 82 -9 -65 143 92 -38 -61 0 -2 66
2660 66 39 42 73 40 -10 -80 -73 -67 13 2 -85 -69 -46 30 -62 4 57 -30 -43 -37 -8 -87 39 -70 64 -5 -46 48 5 33 36
$$ packed form
2475c8K27j10r7M2n0K3K9K6L8k7j33J44j75J18K6j54J26k9q4M4J75p3l1j1j6l4
2501d4Q3j81K50j34j61J95j22O5K7j43Q0J15n9pj51K42l0m7J03M1q8n9k5l4m1
2526a25J80j62J57j47M5P2j23J71Nj51K04j03q8J22l1m0R6k12J88j3j6j93L6J98
2550G0k86J09R5N2p0l6Q9M6j2l5R5m0q3L7J8p4R0m8K5o8m8L0P7j27J2J72r5M9
2578D4r6mJ10m4K8J6r5n4M9K01k03L0p9L6J30n9j09J77p4J2oO1l6o1L5l0J05j26
2606d2N0j5O0M6k03J20Q1j60P2K3j09J16oj24J49qo7R0r6j2Q3j78J48j07J30n9
2632a8n3J91j03l1K5Nm0J27q7N9N3m8r7Q7j0k4j5p4J35r1n6K08n1j30k3O1kO8
2660F6k7LL1l3n0p0POQ0j1q7J6K3P6r2O6N3q7j3OK9p9J26j09J34o9m1R4m3K8L
$$ plain form
2691 36 -80 38 71 -79 32 -128 -8 -84 -20 -11 89 90 -65 122 27 51 71 100 81 62 -50 100 -152 93 20
2716 20 -47 12 -80 10 40 -30 -96 -43 -42 75 0 -101 27 167 14 63 21 -43 -18 25 0 14 39 55 -17 -61 -29 -74
2744 -74 54 -50 45 -40 93 55 -60 -93 5 -21 -7 13 -92 62 5 87 -95 -759 515 -546 489 405 -24
2767 -24 212 367 -170 21 -318 7 -60 -58 11 224 7 157 15 46 108 -35 -120 -135 60 -170 -27 129 385
2790 385 16 -114 140 129 119 28 -289 -302 -395 147 -282 -218 -355 -46 -112 125 142 220 -48 -719 199 -100 123
2813 123 -134 -17 521 536 -1173 138 -193 -30 -379 216 50 -85 -77 -83 -83 2 54 92 56 37 -1 14 19 -88 60
2838 60 56 56 -65 -17 -80 -87 -34 65 11 18 -84 24 73 -32 24 27 -2 -51 12 -32 -7 -24 30 -74 -78 -10 -87 61 39 -27
2868 -27 -65 -63 -44 85 -62 91 -26 -133 10 154 47 -44 74 30 64 -5 -106 17 19 19 -49 34 -22 -24 23 -100
$$ packed form
2691C6j16J18L3j50J11j60J20p6O4RJ00Jj55J87r5K4K0K9j9j9j12J50k52K45p3
2716B0o7N9r2R0L0p0o6N3JJ17p5j01J28J40j53M9m2o4K5M3k5J4K5J6p2m4L2m5
2744g4J28j04R5q5J33l8j15l3R8k6J4K0j05J54n7Q2j82o64J274j061J035q4m29
2767b4K36J55n37J91l39L25o7KO9K13k17J50j42L1O2j43q5j5J95k30J43J56K56
2790C85l69j30K54j1j0r1l17j3r3N42m29O4j37L09o6K37J7P8k68o71R18k99K23
2813A23k57J17N38J5j709J311l31J63l49N95j66j35Qo%Q5N2L8l6j9l8J5Nj07J48
2838F0m%j21M8o3pN3R9n4Pj02J08M9j05N6Lk9m9O3m4K5j7N4j04mO8p7J48k2o6
2868b7l8KJ9J29j47J53j17j07J43J44j07r1J18m4L4o9j01J23K%o8Q3n6kM7j23
$$ plain form
2894 -100 2 -2 2 -26 -21 42 -180 10 -108 -55 123 -19 -39 31 -100 11 61 46 58 58 -73 93 72 7 -10 -63 17
2921 17 45 -68 -15 47 -51 -60 -221 18 -126 -38 26 -22 13 -96 -59 -5 -76 -32 10 10 9 63 -100 62 10 -70 -131 -131 16
2950 16 87 -1 18 71 -4 3 52 -24 38 -16 -35 -23 -9 -35 123 -20 54 -21 31 57 12 80 -14 25 -50 -85 69 -125 -47
2979 -47 -5 27 50 28 -165 -131 -28 -68 -122 67 -19 4 -3 -14 70 14 -15 -27 71 -2 117 1 -4 -15 -67 -37 -7 125
3007 125 -83 -103 90 43 -4 2 55 151 -64 50 -30 -62 -96 -68 -97 -18 -41 49 -89 -42 108 -80 -24 31 -12 -42 -49
3034 -49 96 64 -20 -9 -27 29 -19 -64 54 66 69 -37 7 -13 -63 15 -63 -26 53 64 -23 38 24 -34 92 -25 -22 0 -50
3063 -50 20 -60 9 0 -156 19 55 -125 -13 -5 62 37 54 -31 8 -28 -16 -54 -30 -74 23 -21 -86 9 28 85 -10 -24 -42
3092 -42 141 -62 21 -12 15 -9 -26 -46 -53 -28 -83 -31 -55 -17 -24 -32 -3 -4 -4 -45 -14 91 102 116 -97 -39 -55 22 10 -38 8
$$ packed form
2894a00J02mMk8NO3k22J90j18N3J78j42k0P0j31J11N0j5J2%j31J66k1o5j7n3Q0
2921A7K8j13N3O2r8rj61K39j44Q8O4m8L5j09L7N4p1M4M2%jN4j63J62n2q0o1%J47
2950A6P1q8J9N3p5PM9p6O2n4j9J2J4k6J58j43P4p5N2K6m5O8r4L9p5l5J54j94P8
2979d7M2L2K3k2j93L4J03m0n4J89q6K3pj1Q4n6k9j2R8p3J19j16nj1n2L0L0J32
3007A25k08k0J93m7m7ON3R6k15J14q0l2l4K8k9P9k3R0j38M7J50j88N6N5m3l0p
3034d9J45l2q4J1j8N6m8m5J18J2Lj06M4k0n0P8p8L7P9J1q7O1j4n8J26j17LK2n0
3063e0P0q0O9rj56J75L6j80J12QO7k5J7q5L9l6J2l8K4m4R7m4o5R5J9N7r5j4j8
3092d2J83k03Q3l3K7k4j7k0pK5n5N2k4L8pqK9j%m1L1J05J1J4k13N8j6P7j2m8M6
$$ plain form
3123 8 157 37 -50 117 21 59 -13 56 38 -65 64 17 22 -53 8 56 56 133 3 51 -47 -136 -82 -3 -84 -12 -12 50 -64
3152 -64 -50 26 -150 107 -127 40 -6 -34 -75 45 -31 45 22 -10 -60 96 -16 -16 -5 -47 -27 -67 -9 -2 29 9 52 11
3180 11 119 -112 19 6 -41 -49 -13 -87 -8 -75 -37 -12 -45 -4 -63 -115 81 -3 -16 -26 66 23 18 56 94 10 -75 -6 102
3209 102 -41 33 117 -15 50 56 -74 -9 -186 37 34 -15 6 31 -11 -31 8 -83 -54 7 -40 -56 -133 21 -21 54 -70
3236 -70 -58 65 -58 70 93 128 -7 75 64 19 -21 80 -2 29 -36 60 3 69 58 -19 -52 25 13 -18 -43 -7 -70 -37
3264 -37 40 42 -4 74 -122 -32 -23 10 -37 -27 -18 -88 -78 70 -39 -16 58 -20 76 36 -75 -41 -16 76 -3 -44 -24 -40 29 46
3294 46 105 -55 -9 -52 -37 23 -64 -72 -116 -36 47 70 -7 20 37 -105 29 64 -43 -37 28 -48 -79 -149 -164 1 -6 61 -68
3323 -68 -18 -43 51 -51 37 -46 -3 12 3 -16 8 -84 -58 -47 -17 -61 0 43 54 -25 39 53 59 9 -61 -6 -31 -55 47 -97
$$ packed form
3123HJ49j20q7J67r6L8p2O9j8j03J29m7Np5O1M8%P7j30M8r8q9N4P9q1P2%O2j14
3152f4J4P6j76K57k34J67m6k8m1J20p6P6k3l2n0J56j12%J1m2K0m0N8PL1k0M3m1
3180A1J08k31J31j3m7qL6p4P9o7L8K5l3M1n9n2J96q4j3j0R2m3nL8L8q4q5O9J08
3209A02j43P4Q4j32O5Oj30O5j77K23lm9K1K5m2k0L9r1K9O1m7j6p7J54m2P5j24
3236g0J2J23j23J28K3L5j35Q2j1m5m0J01q2L1o5R6n7O6j1p7l3P7j2l1k5L6o3L3
3264c7P7Km6P8j96R0RL3m7J0Rp0J0J48j09K3P4p8R6m0j11L4K5R2p9m1K0j6O9J7
3294D6N9j60M6m3J5O0q7qm4Q0Q3K3p7K7J7j42J34L5j07OO5p6l1p0j5J65pO7j29
3323f8N0k5R4j02Q8q3M3J5rj9K4r2K6J1L0m4O1M3J1p9O4J4On0p0N5k5k4J02j44
$$ plain form
3353 -97 -86 2 55 -43 -74 25 45 46 -77 -112 11 -128 -15 -12 26 41 85 16 97 -79 45 -34 -106 -19 97 -101 -104 45
3381 45 21 -11 17 -17 -30 -18 -23 74 64 72 43 -35 -126 -9 121 -83 -49 -30 16 18 51 32 53 -1 -16 62 47 77 -76 -43
3411 -43 -13 -113 15 -108 123 -36 -15 30 -98 114 -57 -87 58 -20 52 19 -8 106 50 73 88 -88 -25 -86 -16
3436 -16 -110 50 -68 15 92 -112 66 14 -78 27 125 50 46 7 -9 81 63 -4 77 98 30 53 -25 65 13 -56 66 6
3464 6 -25 -43 -70 39 -21 28 32 -110 -23 -6 -12 36 -23 -36 -27 -91 -70 49 -15 -53 -34 -6 -27 -92 49 26 -2 -83 58 -17
3494 -17 60 58 -69 88 6 33 -32 -7 14 35 -80 -4 33 158 20 27 -40 -1 -5 -62 -128 -86 -9 -44 -29 -15 13 138 -65
3523 -65 64 -124 20 -19 1 -22 -40 -36 7 -35 53 8 5 -103 -10 -4 -66 -49 -36 -90 32 -9 9 -17 -17 -33 77 -29 78
3552 78 24 18 118 -94 17 -82 -11 -2 -93 -74 -64 -63 13 -117 11 3 45 99 -94 91 -25 62 -6 -20 -65 18 -38 -88
$$ packed form
3353i7J1Q8N3r8l1R9K0Jj23l5J23j39J13LL8J5M4o9Q1j76J24p9p2Q7J16j98lJ49
3381D5k4l2K8l4j3J2nR7j0Qk9p8r1J17J30k04L4J9M6KL3j9K1n4j5P8j5L0j53L3
3411d3L0j00J28j23K31j59K1M5j28K12j71l0J45p8P2l3k7J14n6K3J5j76O3o1P0
3436a6r4J60j18Q3P7k04J78n2r2J05R8p5ml9j6R0j8o7Q1K1o8K3p8R0n2o9J22o0
3464Fl1j8k7J09o0M9Mj42Q7J7oM8n9j3Ro4K1J19o4l8J9K8k1o5J41k3k8q1J41p5
3494a7P7kj27J57q2K7o5K5K1K1j15P6L7J25j38Po7L9mn7o6M2P7l5J5J4K8J25k03
3523f5J29j88J44l9K0k3j8MM3m2Q8m5lj08R3Oo2J7J3n4J22m1J8k6%j6J10j06J07
3552G8n4oJ00k12J11r9P1Rr1J9J0JP6j30J28qM2N4j93J85j16Q7o8j4m5Q3n6n0
$$ plain form
3580 -88 95 41 -55 17 65 -22 -41 -18 -129 -79 -16 91 -90 -61 112 -28 25 -83 156 0 16 16 -138 -70 -34 58
3606 58 48 51 -61 24 -56 29 38 -58 -43 58 -19 -10 -84 30 20 -42 -56 4 -18 -19 59 -49 -82 53 -39 -105 95 -11 -72
3635 -72 7 75 -42 161 -59 64 -19 -43 -24 -88 27 113 -5 -28 130 63 -7 -34 -168 28 85 -173 5 -42 -97
3660 -97 31 23 -65 -62 28 -3 -23 42 -27 87 36 48 7 30 -106 101 19 11 43 -17 148 -43 64 -55 74 -99 -32
3687 -32 64 -11 -21 -54 -27 -171 -61 -38 -48 -108 -129 35 -42 28 6 -85 14 -17 70 94 67 -16 33 -12 -29 -34 -52 38 3
3716 3 49 -28 86 -72 -17 53 -102 4 -9 -101 -63 40 -14 -51 -133 144 -76 53 32 16 103 -52 -51 40 -24 -78 4
3743 4 35 6 3 9 43 -27 -42 28 16 -70 1 -96 -40 94 -11 -46 27 -32 369 -383 -214 -118 -282 65 97 604 -650
3770 -650 -417 1 -478 57 -30 -29 -1 4 -32 -24 62 67 -8 -94 -7 -99 -57 -15 44 26 42 -37 -3 16 116 34 -94 -39 -56
$$ packed form
3580h8J83n4r6P2M8q7j9K3j11N0O3J07j81K9J73j40N3j08K39j56J6%j54O8L6R2
3606E8j0Lj12Q5q0Q5Rr6J5J01p7Rp4J14j0o2j4O0k2jP8j08l3J35r2o6K00j06o1
3635g2P9O8j17K03k20J23q3k4J9o4J15Q6j18k3J58o7p0k7j34J96N7k58J78m7n5
3660i7J28qq8LR0l1k0O5o9J14n1J2m1K3j36K07q2qL2o0J65j91J07j19J29j73O7
3687c2R6p5j0l3K7j44J10K3j0o0k1J64p7P0k2r1R9l1Q7K4k7q3M9m5j7nj8R0l5
3716CM6p7J14j58N5P0j55J06j3r2L8J03n4l7q2K77k20J29k1j6Q7j55JR1o4n4Q2
3743DL1k9lOL4p0j5P0j2q6P1r7N6J34j05l5P3n9M01p52J69R6j64L47L2N07j254
3770f50K33M18m79N35q7JK8Nl6QQ6Np5q6Q7r2M2M2N9j8J6p9L4J9J00q2j28N5j7
$$ plain form
3799 -56 74 -13 24 -29 -100 37 33 21 -25 -98 53 113 -33 -7 134 67 5 57 39 45 30 47 -12 53 3 -135 -53 -70
3827 -70 -16 4 -10 -69 -2 29 26 -14 7 -53 -74 56 -75 14 21 48 -10 -90 -44 59 -30 -21 1 -53 62 25 57 -19 100
3856 100 -46 -87 -244 -57 -30 -271 -221 -76 415 190 -313 -121 -7 17 24 105 -132 -93 104 11 69 82 -66 55
3880 55 -45 3 -19 111 47 57 40 -12 -2 -68 38 60 -2 19 32 10 -77 -56 40 83 28 34 -16 -65 -105 -108 -113 13 18 -27
3910 -27 119 -173 -39 -104 -40 -37 60 -26 82 -4 36 -29 -81 52 -1 -54 79 149 -156 -1 15 15 -26 70 13 -22 2
3937 2 -71 132 -34 38 34 -55 -11 -129 -101 12 141 5 -58 -64 -4 -59 -41 -77 48 42 -144 -48 115 42 -53 9 -59 -38
3965 -38 -30 -131 26 131 11 86 42 -22 13 89 -38 -59 -7 70 -8 -19 46 -12 74 82 50 -37 -14 -72 26 38 -22 -5 29
3994 29 43 -87 142 -16 -41 -12 -108 94 6 -42 -103 -8 -14 -33 -44 -147 83 49 61 -19 -35 101 44 9 -23 21 -13
$$ packed form
3799e6J30q7L7n3p1J37mj2m6p3J51O0j46K6J41o7o2N2j8Oj5J7n9O5n0j38Q2j7
3827g0N4K0j4n9O7L1lm0K1o0k1J30j31Q9PK7n8q0M6J03q9RK2n4J15l7L2p6J19
3856A00j46m1j57J87K7k41N0J45M91k25n03J92J14K4PQ1k37L9J97r3N8J3j48J21
3880E5j00M8k2J30o4J0j7n2J0o6J06K2o2K1J3k2q7K1R6M3n5On0m9m0lnJ26Nm5
3910b7J46k92J34o5O4LR7q6J08q6M0o5n2J33n3n3J33P0l05J55J6%m1R6n7l5K4
3937Bp3K03j66P2mq9M4j18K8J13J29j36o3oO0n5J8l6J25oj86R6J63p3r5O2o8K1
3965c8Qj01J57J05j20P5m4o4L5P6j27k1N2P7p8j1O5n8Q6Ql2q7K3n8R8J2o0J7L4
3994B9J4j30K29j58k5K9r6K02q8m8o1R5oj9j1j03K30l4J2q0j6J36n7l5l2M4l4
$$ plain form
4021 -13 58 48 -42 13 -159 13 18 -35 28 5 14 -34 9 127 39 -53 -120 -47 -12 -75 52 9 94 -19 2 36 -100 16
4049 16 18 62 3 -39 -65 -86 -12 -56 49 -64 65 -20 13 -93 106 78 94 45 -88 -96 0 -14 -101 120 7 -120 -34
4076 -34 45 -62 -63 -29 -13 -56 22 -109 42 -69 106 11 48 77 -116 -12 7 70 20 -47 7 35 16 74 133 54 73
4103 73 95 11 -8 -136 8 -17 19 -83 4 -91 45 128 73 -51 -11 -2 -18 -7 77 10 32 -60 36 -74 -5 -27 2 40
4131 40 -16 45 -70 39 29 -66 -73 40 89 52 76 33 40 -8 35 6 -74 74 9 5 155 11 75 41 115 45 -11 -2 60
4160 60 20 -61 0 54 30 -16 108 22 50 -59 11 -23 -12 57 57 -92 -15 -30 80 -25 -44 58 36 37 -9 -74 28 86
4188 86 7 52 -33 -58 23 -33 -86 -12 201 10 -108 18 0 -29 -42 -45 -9 -56 -71 -26 73 9 72 59 15 48 -104 -16
4216 -16 -62 28 -69 26 45 20 7 133 25 -73 115 81 97 -46 -23 -51 -64 31 -36 -7 0 -20 -77 -24 -25 35 17 23 68 -8
$$ packed form
4021a3P1j0r0N5j72J72Nn3O3k3Rm8M3J18q8r2o7P3L5o3J27m3Q5j13K1L4j36J16
4049A6KM4n9m2k6k1P4m4J05j13J29q5L3j06J99k8J6m9j33qR6j4q7K21j13j27Q6
4076c4P9j07jL4J6m3P8j31J51j11J75r5L7K9j93J04J9O3n0o7N4K8j9N8N9p9J9
4103G3K2q4j9j28J44k5L6j02Q7r5J36Q3n5j24M0Rj6J1Q4o7K2r2R6j10O9k2K9L8
4131D0n6O1j15J09j0r5pJ13M9l7K4m3Pm8M3k9q0J48o5mJ50j44O4l4P4p0n6RO2
4160F0m0q1O1N4k4m6J24q6K8j09P0l4J1O9%j49P7j5J10j05j9J02k2Jm6o5J02N8
4188H6p9M5q5k5Q1n6n3P4K13j91j18J26j8k9j3lL6m7j5M5R9o4O3j3m4L3j52Q8
4216a6m6R0r7R5J9k5j3J26j08r8J88l4J6j43K3k8j3R5o7K9Pk0n7N3jO0j8OM5p6
$$ plain form
4246 -8 63 33 65 -11 -55 -66 2 -13 -61 -14 -98 11 -47 66 -200 -34 -41 -52 31 -54 26 -37 4 -42 -23 3 -25 -20 -91 30
4276 30 -54 -17 -48 -11 -69 -10 -27 30 -80 44 -36 114 -3 -1 72 -30 -44 6 -44 -165 60 57 21 -14 -7 -83 25 8
4304 8 60 14 -162 -39 -108 88 6 72 -68 18 72 48 -95 -49 -36 -56 57 13 81 23 -23 9 -42 133 -35 22 -24
4331 -24 -34 29 -48 77 45 -1 -23 -14 58 32 4 -6 -63 113 -94 30 101 87 -66 102 94 17 -27 101 88 119 41 -28
4359 -28 64 -61 -80 5 -32 -99 67 25 97 5 30 -12 2 -8 -19 -33 -33 -12 -5 -31 -67 -44 -52 4 14 -23 -70 26 78 99 6
4390 6 -22 58 23 11 69 -8 -11 8 16 -42 13 -5 85 -46 -83 82 -72 16 32 -73 -64 -44 53 -46 -41 33 60 15 -34 -96 -63
4421 -63 20 16 95 -45 47 5 -61 94 85 -2 156 -16 29 -73 -19 82 26 85 -23 -80 75 19 -167 -34 51 70
4447 70 -58 53 -23 -48 -5 -7 -50 1 78 -56 117 59 -33 22 85 5 -62 -102 129 12 174 26 -130 -39 69 34
$$ packed form
4246hP1l0L2p6m4j1O8j5m8M7q4J09n8J13k66J66pj1Q3q5Q0o3M1m6J9K6k8Np1J21
4276C0q4L7l1L7n8N9j7N7j10J24q0J50j17KP3j02j4N0n0j21K25ll6l5Pp6J08j7
4304HN2m6j76J23o9J96q2O6j40Q6N4k4j43M6J3k0J13m4O8n8m6L2n1J75j68N7m6
4331b4j0O3p7J25l2m6k2RP2k6k8j0n7J76k07J24P1j4j53J68qp7m4J28j3L1p8o9
4359b8R2j25j9Q5l7o7J66m2P2r2K5m2J4j0j1j4%K1Pk6l6K3qN6J0l7m7R6N2K1r3
4390Fk8Q0l5j2N8p7lJ9Qn8N5j8R0j31l7J65j54Q8J6j05RK0R7r9NP4K7m5m9o2L3
4421f3Q3mP9j40R2m2o6J55rq7J58j72M5j02N4J01n6N9j08n7J55n6j86J33Q5J9
4447G0j28J11p6k5M3km3N1P7j34J73n8r2N5O3q0o7m0K31j17J62j48j56R1J08l5
$$ plain form
4473 34 -93 -18 3 54 145 16 -74 52 42 58 -124 -34 36 36 -22 69 -79 -48 -5 10 -34 -43 60 -95 91 59 7
4500 7 14 20 38 15 -72 101 54 53 40 -43 61 45 69 12 -1 1 -68 11 13 38 -13 48 -22 1 -43 70 68 2 43 -90 -60 68
4532 68 -62 -96 -13 10 31 -78 97 68 -111 37 -30 90 15 -65 33 -44 27 -7 -52 -147 -107 -19 -200 -23 90 91
4558 91 7 40 -53 32 10 20 12 -12 18 123 38 -5 0 -17 -59 3 -50 29 -29 -49 -7 78 -30 62 19 48 -19 43 31 69
4588 69 18 -94 -16 -23 -195 -80 -39 26 -89 -49 27 31 17 28 -11 9 -26 46 31 -106 -71 -134 54 -11 -2 -61 -9 48 40
4617 40 -3 105 -26 59 -29 -26 35 15 -16 -41 -71 25 -60 77 1 18 -33 -40 -47 -5 -56 -37 -116 21 60 34 -5 -95 10
4646 10 -2 -46 -24 -10 131 -137 -32 -25 0 -69 -104 -66 9 96 -48 3 25 61 -12 22 -41 -40 -16 3 39 -25 41 -8 2
4675 2 24 8 110 -100 31 43 -33 80 10 -13 1 12 75 10 -35 -48 57 -81 -45 7 -100 49 49 41 -85 -37 47
$$ packed form
4473C4j27P5K1N1R1j29r0J26j0J6j82R0P0%n8R1j48L1M3J5m4rJ03j55J86l2n2
4500GPOJ8k3q7J73m7jj3q3J04j6K4n7j3Ko9P9KK5n1O1p0K3m4J13ko6M1j33L0J28
4532F8j30l4Q3K3K1j09J75k9j79J48o7J20p5q0R8p7P1l4m5r5M0Q8j81J77J13J
4558I1q4L3r3Q5k2J0qk4L0J05q5m3Nj7m2O2n3P9n8k0M2Q5j08R2m3K9o7O2j2L8
4588F9n1j12P8pj72J15M1O5j15M0P6Mj4J1l9K0l5P2j5j37L5o3J88o5Rn9N2N7q
4617D0m3J08j31Q5q8LO1k0l1k5l0R6q5J37p6J7n1ppM2n1J9p9J37L9k6l9r0J05
4646A0j2m4K2J4J41k68J05PK5o9l5L8P5Q7j44N1K2L6p3L4o3JK4J9L6o4O6m9J0
4675BK2j6J02k10J31J2p6J13p0k3J4J1O3o5m5j3J05j38L6N2j07J49%qj26M8Q4
$$ plain form
4702 47 1 53 -26 98 106 -38 60 -8 -158 -111 38 -127 70 86 -41 57 -16 -23 -60 -24 -20 -63 -61 -35 -33 16 -5 47 100
4731 100 -7 10 -57 -16 -99 -58 37 20 -64 -12 -39 -49 47 35 -34 63 -66 -55 -3 129 5 9 -21 5 -15 -7 -110 -47
4759 -47 -21 -7 70 -34 57 -27 33 49 29 -6 -9 -36 -28 42 129 23 37 -21 15 -98 -15 -1 46 63 -116 63 -44 31
4787 31 -102 -26 9 -21 154 68 -58 -22 -50 -13 -31 -59 37 16 -7 -74 17 -22 -75 -40 190 30 61 -9 45 -12 26 25
4815 25 -12 -60 53 7 36 10 28 -54 -1 97 -1 -128 1 30 -31 -3 77 45 10 -89 17 33 11 -5 -53 -54 -88 14
4843 14 -9 6 -137 99 47 -95 81 45 -19 23 95 7 8 -57 38 -46 -17 11 -30 84 112 56 57 -11 79 92 -30 292
4871 292 -39 -15 -270 -65 422 -71 519 78 28 43 -96 -68 74 10 -63 116 113 110 19 -2 14 2 8 42 -10 -60
4897 -60 -60 42 -107 55 73 81 117 -25 -76 38 71 -36 -23 93 -8 26 14 118 -161 22 45 -104 -8 36 -2
$$ packed form
4702D7m6N2p9J24Qj44R8o8j50M7J49j65J97J6j27R8p3pl7L6Mm3KK6KM9k1N2N3
4731A00j07J7o7M1q3M1R5j7q4N2k7j0R6j2o9R7j29J1N2J32j24Ml0K6k0Qj03O3
4759d7K6J4P7j04R1q4O0J6k0l5lk7QP0Q7j06J4n8L6j13Q3J4M7J7j79J79j07P5
4787C1j33P6L5l0J75q6j26L6k8L7j8k8R6k1k3o7R1l9n3L5K30j60L1p0N4n7L8j
4815B5l7m8J13m6K9k6J8q2N3R8r8j27J29K9o1K8Q0l2l5r9J06J6k2j6m8jl4J02
4843A4k3J5j43K36n2j42J76l6o4M2P2q8Jo5R5q4K9K8m1J14K8n6Jo8R0J3j22L22
4871B92l31K4k55K05M87m93N90m41n0J5j39K8J42o4p3J79llr1k1J6j2OL4n2n0
4897f0%J02j49J62J8QL6j42n1J14L3j07J3J16j01L4j2J04k79J83K3j49R6M4l8
$$ plain form
4922 -2 -28 -45 -94 -22 -85 -38 -37 -117 -65 -14 9 -24 -123 -1 -15 70 -3 28 20 82 81 -56 -25 67 46 0 74 -60 92 27
4952 27 97 41 102 -45 -66 -67 27 101 -41 -10 -3 27 29 14 21 -64 -12 18 -43 44 -73 134 -63 -31 -107 11 11 12 -88 -29
4982 -29 -38 -22 -80 126 -3 72 -24 13 15 -63 72 3 156 -46 -85 -55 -30 60 80 42 15 49 -101 43 -17 -17 29 -89
5010 -89 69 37 18 -85 -79 89 7 21 132 49 -18 -100 2 -39 -154 -27 46 -65 -78 -55 124 -152 13 45 33
5035 33 44 -38 129 -25 19 14 -22 32 36 -1 -8 -42 -28 -101 51 -13 -41 30 -68 -17 -52 23 94 -100 -79 -15 -21 5 30 13
5065 13 -59 84 -66 -153 15 -29 90 -1 -77 69 35 -131 68 -31 -45 -12 -53 -47 -11 -129 52 51 -3 144 20 -3
5091 -3 -74 -32 -104 -48 9 31 -7 14 -14 62 8 -40 1 11 -35 -53 70 34 -80 -40 61 66 71 76 -20 89 6 47 -14 -4
5121 -4 72 41 100 -53 -43 77 -33 28 11 74 -16 26 -30 -7 42 -73 80 76 47 36 26 19 -36 -22 111 67 -5 140
$$ packed form
4922bk6j7m9P2o3M7Jq0N2N1K3l3r9J22j4Q5p3L1qO2jj37L1R2k1m6P4j34J52o5
4952B7P0n6O1j47k1jR4P4j42L1PL0Kj5Pq5N2L0o1Q7j17K07j97L2p6J18%Jj00N9
4982b9rJ6n8K06j29P5r6L7Kp8J35o9J53k02l9L0K5R0K0l8k7L4j50J44o0%M6j18
5010h9J58l2j9j03OJ68q2J4J11q3o7q2J02m1j15J27P3j11j3K3J79k76J65L2j2
5035C3J1q2J67j54M4nl6N4Ml7pl4J4p3J52o4k8P1r8N1l5P5P1j94K1O4oK6K5j7
5065A3p2J43j50q7J68m4J19r1p6J46l4j66J99r9j4L3m1OL6j18J81jn4J47j24k3
5091cp1M2p2N6N7K2l8K1k8P6n4m8M1J0m6j8J23l6j14M0J01NNNr6J09q3M1o1J0
5121dP6l1N9j53J0J20j10O1j7O3r0M2n6K3M9j15J53mk9j1j0pn5J4J33m4p2J45
$$ plain form
5149 140 48 34 -44 -48 -69 -18 -48 8 50 116 -12 1 60 76 -52 -29 61 79 25 13 -11 8 14 67 -24 3 -89 62 96
5178 96 7 -94 -129 -25 57 -13 -33 -6 -15 81 -27 -78 -43 -90 105 -75 46 57 -46 -38 -63 38 73 48 39 -29 47 -59
5206 -59 -47 -65 47 -31 -11 139 4 -57 -1 -24 -108 -26 92 82 -99 -3 0 -48 -124 -75 -71 -33 22 -54 29 -11 -100 4
5234 4 -15 9 48 54 144 48 -25 -37 33 -96 60 68 -19 29 -20 -39 -11 36 -10 94 -57 -24 67 30 -49 -45 -33 21 -122 -21
5264 -21 -12 -84 -110 31 8 -17 -51 -169 4 -15 0 46 8 -15 -75 57 -20 4 6 -40 176 39 -23 -41 87 -33 -49
5291 -49 5 69 50 62 30 -26 -53 -19 -9 23 2 22 32 -149 -28 64 -6 -16 -67 93 -33 -93 40 -3 -94 -18 -33 17
5319 17 -114 56 9 28 -29 46 -77 46 56 3 -5 30 1 -19 17 -30 112 -30 19 -61 10 51 20 -26 -22 -1 -27 -19 -42
5348 -42 92 -26 72 -26 -78 19 2 6 21 -59 1 -93 -7 -5 -43 -23 41 27 15 1 2 -48 -12 55 15 -95 -5 23 -24 24
$$ packed form
5149A40r2j4p8mk1N1l0N6M2O6j28J3N9J6j28K3R0J8n4j2k4J9ON3r1K7r2J51L4
5178I6q9j01l5J04Q2p0k0K7rR6j08n1L5m7J95j80J21J1j03Qk5J01L5k5ro8P6j06
5206e9J2j8J12p8K0J50j35o1N6k3q4Q2J18j0j81R6Lm8p6M9ML8N5p6Q3m0q9J04
5234Dj9K4L9OR0r6p3j2P0j29J56Qq7M8m9j9K8M7m6J04j51L3R1l7p9MJ2N4j43J01
5264b1Rp2k6J41k3k5l4j18J73j9J5M6l8k3o0J32p7K4Km6K16j37o2j8J28j20j6
5291d9N4O4j9J2l2n6k7L4J0L2k1K0J0j81J21R2p0j0n1J60j26o0J33m3r1P6j5N0
5319A7j31J70m7J9n7P5j23J23J0n3qL5k9k0L6m7J42j42M9q0P1M1l1m6MK1k6Qk3
5348d2J34j18R8r8n2R7j7MJ5q0O0r4Q6Kl8K0O4j4j2j4Jn0L6O7m0j10R0K8m7M8
$$ plain form
5378 24 -6 85 130 13 129 44 -85 -8 -65 173 47 32 109 -59 -7 -36 -29 -28 62 4 -141 16 -12 69 19 18 -17 -124
5406 -124 -10 63 -8 -52 -41 -36 111 51 -34 45 -12 26 -56 61 -84 14 74 -88 16 127 -59 -38 20 -58 46 51
5432 51 93 -44 42 54 -23 -62 -13 -118 -79 -48 28 -19 -5 49 -146 -101 -71 -30 83 -77 5 112 -20 -69 -59 -104 18
5459 18 -5 15 61 55 -31 45 7 -26 -28 7 18 24 -7 25 18 98 -23 82 -10 -111 15 44 130 -60 25 79 30 -23 -39 -58
5489 -58 85 14 -66 22 -43 -121 -41 -29 26 28 24 128 80 -62 128 30 10 -1 -74 8 71 -128 -22 88 -14 -37 -70
5516 -70 114 14 -39 -31 -82 56 -66 31 43 -47 -102 -36 -36 -14 -81 -70 110 -67 -3 -33 25 28 54 68 60 7 19 78 -39
5545 -39 92 112 4 -67 87 -165 -100 13 -108 -13 -25 -31 -9 135 15 -179 -1 -7 -26 29 77 35 -79 21 57
5570 57 128 47 42 -57 -41 -20 -40 -69 -32 50 -73 34 114 -20 3 24 -91 64 -11 -56 59 -47 13 -19 111 138 49
$$ packed form
5378B4l0R1M5j17J16q5j29P7n7K38j26j5P7j68N2k9PJR0n8j45J57k8Q1n0jl5j07
5406a24J14P3p1m4J1NJ47o0q5P9n7L8q2J17j45R8O0j62J04J11j86K1N8p8J04N
5432E1M2j37Q6J2p7l9M9j05L9L1P6m7J4N4j95M5L0M1J13j60Q2J07j32m9J0m5J22
5459A8k3K0M6oq6P6l8l3kL5J1Ol1L2pQ0j21J05r2j01J26K9Q6j90Q5N4m9n3j6j9
5489e8J43p1q0Q8o5p8Q0J2N5KmJ04m8j42J90r8k0j1p3Q2O3j99J06J10j02k3l3
5516g0J84j00n3Qn1J38j22R7J2r0n5O6%K2o7J1J80j77O4l0N8LK6J4qn3J2N9j17
5545c9J31K0j08p1J54k52O5J13j21R5j2oK2J44j20j94J78oj9N5M8m2j14J00L6
5570E7P1q1nr9J6K1k0k9L7Q2j23J07Q0j34K3K1j15J55p5m5J15j06O0l2J30K7q9
$$ plain form
5597 49 124 -36 88 -11 -7 54 16 41 3 -25 12 56 -91 -47 51 52 13 -107 61 21 -70 65 -136 93 -2 -46 46
5624 46 -14 12 -45 -63 -27 15 16 -3 63 -110 1 -80 -28 -35 181 -71 -4 -55 23 -13 -42 8 -12 77 125 56 -119 13
5652 13 -34 16 -18 42 75 74 18 -9 -34 -32 -17 30 23 4 -3 -51 -88 73 0 -10 -2 -31 -153 6 48 -122 44 -33 -101 -75
5682 -75 59 -12 -58 135 155 -69 33 -85 -85 -51 30 -19 1 -79 -105 46 38 -11 -70 -19 39 -76 60 112 -41 -79 67
5709 67 40 24 24 -7 -81 -32 -22 37 -50 -2 -77 80 33 -42 59 39 -64 -138 -35 -56 38 18 -52 -26 -72 4 43 82 -131
5738 -131 35 96 -40 9 8 -23 -37 -75 -105 26 60 -28 22 -10 -4 -6 -10 76 -42 38 24 4 -10 1 7 29 -9 -57 -35 32
5768 32 -21 -29 134 2 -40 52 56 -55 -64 -17 -12 -22 -88 -30 16 124 -27 9 86 133 82 107 156 49 44 -70 -5 -142 -34
5797 -34 -113 120 -44 31 -65 -24 -86 134 -74 22 71 -78 -60 18 108 15 16 60 -40 -127 54 -3 18 54 26 1 -80
$$ packed form
5597D9P5j60J24r9MO1l8K5l8k8L7M4j47M4R8Jl9j20J68m0r1J35k01K29r5m4R2
5624D6o0K6n7j8L6M2Jj9O6j73J11q1N2pK16k52O7n1P8l6k9N0k0Q9M8o9j75J32
5652A3m7N0l4O0L3jn6k7k5KJ5M7pj9pm8l7J61p3j0Qk9j22J59M2j70J66p7o8K6
5682g5J34p1m6J93K0k24J02j18%L4Q1m9K0q0k6J51qm9n9N1N8j15J36N2j53l8J46
5709F7k7j6%l1p4M9J0N9q7M8p5J57m7p5J01k0j03p4J03k1R4k0p0K6m6P6L9L9k13
5738a31J66O1j36M9jl1j4l8l0J31L4q8N0l2OkmQ6j18Q0j4k0j4J1OK2l8m8K2O7
5768C2n3qJ63j32m2R2Mj11rM7Nj0o6N8M6J08j51L6P7M7n1K5M9j07nj14O5j37J08
5797c4p9K33j64P5r6M1o2K20k08R6M9j49J8P8R0r3JM4j00q7J81n7K1L6k8k5q1
$$ plain form
5824 -80 12 -39 -11 58 63 46 -47 6 44 135 71 -17 -162 62 42 -5 -81 84 -130 -38 -95 71 -71 -151 58 -67 -17
5851 -17 65 41 52 -86 -12 -50 -18 68 90 -20 13 -55 -10 44 -38 -131 -74 14 -6 -26 14 65 74 34 -11 -83 -38 18 -64 12
5881 12 -47 -48 37 -3 17 27 24 33 9 -104 -15 55 17 -22 62 5 -3 12 -43 -51 -17 39 -70 -44 50 -29 17 70 151 72 -16 47
5913 47 -12 -67 151 -29 -48 20 -65 -49 -85 45 -87 75 -53 94 38 -59 -5 170 -9 -50 15 11 82 54 -97 -61
5939 -61 -15 22 -20 -79 -5 -144 114 -17 -41 35 56 -54 22 -58 -1 -22 -50 -27 -24 -17 79 13 -78 -23 -149 41 1 -4 -66
5968 -66 -9 73 -21 92 -39 82 10 -67 20 -70 79 11 -16 -34 -52 85 11 10 0 40 8 96 -36 104 70 -97 132
5995 132 40 -48 -5 -69 9 56 -93 -40 40 14 -13 52 -6 62 -42 68 11 -19 -7 77 -27 -131 129 -49 -8 -48
6021 -48 5 -93 -158 65 -19 -56 -27 19 59 -56 -81 -21 -115 -2 -102 -78 49 -108 25 -112 -30 -57 26 -51 -77 -52
$$ packed form
5824h0R2n1K8O9Nj7r3N3L8R1o4q8j45K24k0m7p6J65k14R2n7J66j42q0K09j25N0
5851a7Q2k4J1j38P4l8L2Q6K2j10L3o8M5N4q2r3N7Q8k0k0M0N1Rm0m5p2M5N6q2P6
5881A2n9jQ5m0K0J0lRk4j13Q9P0l8l9Q4n7qJ5n5qL4N6j09K6R4p9M6N3Q1p9q8O3
5913D7n9n5K18j80j9O8q5J6l6J30j32J62j28J47n6r7N4J75j79m1O5mP1k8j51L6
5939f1M6L7m2n9P4j39K58j31k4P6K1j10P6q0N7k1k8K3LPR6o6r1N5j26J90m0no2
5968f6N7Q2r4J13j31J21p2p7Q7r0J49o8k7j8j8J37p4jj0M0l2Q8j32J40l4j67K29
5995A32r2q8M3o4P8M7j49N3Q0k6k7O5n8O8j04J10n7l0J2Q4j04j04K60j78M1m0
6021d8N3r8o5K23q4l7K9M6M0j15k5O0r4J13j00K4J27j57J33j37Q2k7Q3p7k6K5
$$ plain form
6047 -52 -81 127 -78 56 84 -67 48 -15 -26 -59 -3 7 9 2 -50 17 -10 -69 -36 -42 -33 109 -32 -9 75 8 -117 -4
6075 -4 52 -21 58 -80 12 -67 59 -58 114 -70 -71 0 -3 32 -46 110 -68 -23 43 42 24 12 -116 -21 32 42 -23 40
6103 40 -118 -70 -46 44 -51 37 7 169 -104 55 59 -21 77 100 58 -1 -16 -54 65 86 -67 32 73 -42 -7 48 -11
6130 -11 20 -27 -111 -27 92 53 -33 -31 17 -34 -39 -91 -118 -4 22 -8 -103 13 -1 -59 -13 70 -48 110 52 -34 84 70
6158 70 9 -16 15 -62 -36 34 36 15 -71 26 12 3 83 11 58 76 4 50 11 10 79 -5 -32 -35 57 38 -39 -74 29 -48 54
6189 54 -36 -15 39 17 -81 -50 -2 -5 -14 11 7 -3 141 58 -48 53 8 33 -1 141 -38 -14 -40 -130 -3 20 119 34 58
6218 58 37 77 -122 76 94 15 108 4 71 -139 -23 54 -38 42 29 -5 49 -63 -2 4 -51 -37 -105 -79 85 27 26 179
6246 179 34 175 -13 -56 -99 25 -158 101 150 -65 -54 84 15 24 28 94 -4 -2 102 67 -70 -68 -55 -104 -95 7 -12
$$ packed form
6047e2k9K08k05J34K8j51J15o3j1l3N6J0Kpn2O7k7n9L3oRJ42j41K3Q4o7j25J13
6075dN6p3P9j38R2p9J26j17J72j84jP1lL5p8J56j78M5O6jj8j2j28R5N3J0o5O3
6103D0j58M8K4R0r5Q8l0J62k73J59Mq0R8K3m2n9j5l8J19K1j53R9M1j15L5N5n9
6130a1L1m7q4Q4J19l9q6KM8n1nn2k7J14K6l0r5J16j4n8M6Q3j18J58n8q6J18j4
6158G0o1k5L1p7K6P0Kk1q6R7j4rQ0p2M7J8p2M6l9jO9q4k7lR2j9p7l5J03p7J02
6189E4r0K1N4k2r8L1M8lrK5mj0J44q3j06J01m5K5l4J42j79K4k6r0J27K3R9q5K4
6218E8k1M0j99J98J8p9R3j04O7k10J16P7r2Q0j3l4N4j12O1On5J4o8K6J64n8jJ53
6246A79j45J41j88m3m3J24j83K59M9k15J1J38o9RMO6r8KJ04l5j37KJ3m9RJ02j9
$$ plain form
6273 -12 -43 123 -18 5 21 18 43 -111 -15 31 -71 -3 -73 59 38 -95 -21 49 -27 -15 34 -18 -53 -15 -11 -182 43
6300 43 -18 -29 15 103 21 15 78 -133 -81 -23 -55 55 -42 50 29 41 -46 -44 -126 -26 6 -29 47 19 19 -87 55 -128 -134
6329 -134 3 82 -41 -5 28 68 -41 7 17 -24 82 69 53 13 -11 15 71 -22 75 -57 -18 -57 -56 90 32 -86 -27
6356 -27 -174 76 -20 -9 -53 75 45 -62 4 68 -24 35 -68 -53 1 -76 31 -96 -49 21 -11 -8 51 -72 -117 -31 -6
6383 -6 48 -11 13 12 7 -24 -7 -60 27 -38 -76 -127 49 79 39 92 53 -6 -47 -37 -19 -28 -90 -108 -2 -99 -64 -13 15 19 53 10
6415 10 -141 30 -60 -125 159 -82 26 32 -46 -53 -84 77 -72 -58 35 52 64 96 75 -54 -11 66 -94 12 -92 -9
6441 -9 40 -82 -8 -127 12 -49 2 88 -10 154 87 -34 27 109 -80 79 -44 -58 8 -35 26 11 -4 1 36 17 -72
6468 -72 -110 -41 -25 -103 52 62 69 -9 296 178 140 31 -10 -44 58 14 55 -6 -80 44 -25 22 35 24 68 -59 52
$$ packed form
6273a2l1J66j41K3J6lK5j54R6M6j02O8p0J32k1j33P4P0p6J2M9n2l5L8Mj71K25
6300D3o1j1M4Q8q2oO3k11N2N8l2J10r7R2k1J2q7Kq2J00L2l5P6k8%j06J42j83o
6329a34J37P9j23L6L3M0j09M8J0m1J06j3j6m0k4K6N6r3R7j32L9l9JJ46n8j18N9
6356b7j47K50r6J1m4J28l0j07O6O4r2N9j03J5N4p7J07j27M7P0l2LN9j23m5Q6K5
6383fN4n9K4jnl1J7n3Q7o5l8n1J76L0m0N3l9n9m1J0J8ro2j8J06r7L5N1K8ML4m3
6415A0j51J71r0o5K84k41J08Op8pl1J61j49J4R3J7J2L2k1j29M3P7j60J06j04Q3
6441iM9j22P4j19J39o1N1Q6r8J64o7j21O1Q2j89J59j23j4O6m3O1j5j5NL5j9q9
6468g2l8O9J6p8J55J0Pp8L05j18l8j09m1l4J02m4M1o1p4J24o9M7J3j1M4j27J11
$$ plain form
6495 52 -105 33 142 -68 -130 13 3 11 -66 -148 50 92 -12 29 -45 -41 105 85 69 -53 -79 1 -81 -36 -55 38 83
6522 83 56 -37 -66 17 -13 -70 -35 5 -55 -46 -30 -28 -47 -19 52 -193 -75 108 -48 -6 -87 -139 50 -5 -11 -76 81 -60
6550 -60 -163 -94 -125 57 -85 -42 86 -35 -4 43 -6 8 79 10 45 7 54 -1 -103 -86 -37 19 -55 9 -77 6 56
6577 56 -44 -72 60 -5 -138 -30 7 -54 -60 -95 128 31 25 -46 -75 22 -132 -78 -50 41 25 40 4 -63 -39 114 -25
6604 -25 2 -5 82 -42 -18 -36 -33 28 -31 -20 -55 -16 -75 -91 -70 -85 -61 51 -9 -97 41 47 9 -13 22 91 -63 51 -30
6633 -30 44 -50 35 88 -90 -37 -80 -98 -77 -118 44 -36 26 40 -20 -40 49 66 -42 32 44 47 81 -18 -51 -45 -6 3 -23 56
6663 56 -61 49 33 -70 -19 -13 26 33 -58 0 -150 77 47 -52 96 38 79 -32 -95 13 -62 27 0 -19 38 31 77 69
6691 69 -112 4 -75 -9 30 -52 5 -75 94 -47 99 -80 -4 23 4 51 21 -50 22 48 -59 49 -3 76 12 58
$$ packed form
6495E2j57J38J09k10o2J43j0Qp7q2J98M2j04M1p4MJ46k0j6j22k6Q0q2M5j9R3M5
6522H3k7r3k9Q3l0n7L5M0o0RJ6Kj9K8P1k45J18J83j56M2q1n2J89n5oo5J57j41
6550f0j03O9l1J82j42M3J28j21L1M7m9J4P1o9L5l8M7n5j02J7M9N6p4O4q6Q3N0
6577E6j00k8J32o5j33J08L7o1ol5K23r7op1k9R7j54N4K8R1j6J5l6o7K4J53j39
6604b5K7pQ7j24K4j8LO1n9J1l5L9n9j6K1j5K4J12o0q8J38Ol8k2L5O9j54J14q1
6633c0P4r4Q5N3j78N3m3j8K1m1J62q0O2J4o0k0Q9J7j08P4J2LL4r9l3OL9Rk6P9
6663E6j17J10j6j03N1OL9Pr1N8j50K27l0r9J48n8M1j11o3J08p5Q9k7j9N7pM6q
6691F9j81J16p9O6L9q2N7q0J69j41J46j79P6K7j9M7l0p1P2K6j07J08n2P9o4M6
$$ plain form
6717 58 50 84 -139 -29 34 -1 106 97 27 33 124 70 76 49 69 -49 -51 86 27 -33 28 -26 -103 -10 -19 -30 10 -25 -16 -50 -36
6748 -36 -53 -13 103 19 52 -13 6 -22 -22 -46 30 44 -41 -32 81 78 132 -66 21 -110 27 -131 2 -9 -121 4 -65
6775 -65 -20 -12 21 -37 13 -122 -2 67 -69 51 -68 -111 86 0 -74 -48 -121 31 -94 -88 70 27 114 4 -13 7
6801 7 -4 -15 -8 78 -59 5 44 40 38 -69 -16 -9 -26 -1 -122 -22 -54 -101 39 -119 102 -26 53 -7 -21 125 -51 41
6829 41 -53 76 -121 -36 -65 -59 9 -3 22 94 -70 0 17 9 25 -11 142 -16 -120 -41 5 -90 66 13 35 -61 78
6856 78 55 -38 48 12 7 -50 96 42 19 9 86 -22 -118 -96 79 72 -26 67 -4 -17 -22 -83 1 -28 102 29 -60 6 82 13
6886 13 91 -29 12 -118 4 66 -33 -24 -35 -85 56 65 -52 70 48 91 -128 128 -26 -17 -10 71 94 -44 -9 45 -75
6913 -75 -139 -27 58 20 55 52 16 22 78 -21 -23 55 -106 -81 -49 -14 -94 -4 -20 -76 43 -122 66 -72 109 56 -79 82
$$ packed form
6717E8qL4k23J10O3l5J07rp0OR1n4Ok7K0j18kJ37n9o0O1n4p7R3rj1M0l5Rl4J4
6748c6j7M0J16q4L3o5J9k8%k4P6J4q5RJ13lN4j98Q7j31J37j58J33j1j12J25o9
6775f5M5QL3n8N0j35J20O9j36J20j19m3J97q6p4K6p3J52j25OJ58m3Q7j10j7K0
6801Gj1j1PQ6j37O4L9mkj07N3Pj7K5j21J00l2m7J40j58K21j28P9o0j4J46j76R2
6829D1r4J29j97Q5k9OO8j2K5P2j64P0J7qJ6l6J53j58j04P9M6r5J56n3K2r6J39
6856G8k3r3Q6l6nn7J46n4k3j0P7j08r6K2J75pr8R3p1j3no1Q4k9J30p3q9O6P6o9
6886A3P8j20M1j30J22O2r9Rj1n0J41Rj17J22k2M3k19K56j54RPQ1K3j38L5N4j20
6913g5o4J12Q5l8L5ll6ON6r9kP8j61K5L2L5q0R0j6n6J19j65J88j38J81n3j35J61
$$ plain form
6941 82 -30 56 82 40 50 -58 33 68 -95 -77 30 -17 57 -70 -48 -64 23 -57 -34 2 -99 42 37 44 10 -50 -54 -26
6969 -26 11 -17 -20 90 77 6 -25 -36 43 100 -60 18 2 34 -79 71 32 123 -12 27 -9 -49 74 -22 74 9 67 43
6997 43 -14 -6 -12 -89 10 -66 -96 -80 54 -12 49 -6 -8 -116 -59 -23 79 80 11 -15 46 -20 -20 4 19 -8 -4 -14 -35 35 -73
7028 -73 -19 118 62 0 -79 -135 83 30 18 -83 -83 18 108 49 32 32 -30 71 -35 61 -10 -21 35 19 12 24 141 46
7056 46 -52 38 -8 -22 17 26 -71 33 -17 -46 39 18 -8 71 61 -54 94 -6 -106 50 61 -65 -115 34 9 -10 -102
7083 -102 -64 -47 19 -58 -10 -40 36 32 111 -65 -12 -62 8 26 -15 15 -80 45 0 26 -40 10 87 -8 -125 82 49 -18
7111 -18 -30 59 -20 -14 42 -62 48 -23 -80 52 70 16 14 24 -4 9 -25 -36 -1 25 -133 12 -3 -45 -107 -29 -21 -58 -130
7140 -130 -18 -24 -76 13 150 16 -38 65 -37 32 -30 26 67 -67 33 -143 -67 30 -45 15 -13 142 -49 -13 -18 -112
$$ packed form
6941H2j12Q6K6m2J0j08R1L5j63J8J07m7P4j27K2j6Q7q0K3L6j01J41nPl4o0mK8
6969b6L7k8lJ10j3p1l1j1P9N7j60P8j6L2j13J50l9R1j35L9l6m0J23r6R6o5N8k4
6997D3n7Qop7R9p6l0J6J34o6O1n5kj08N7L6J02Jo9k6O1o6%K4J5k7Mj0k1P0j08
7028g3N4J37n6o2p9n6K18n3j2j01%J01R0n9j7%o2J01j06R6p1j1N6j6pJ2J17r5
7056D6r8R0m6j4L9Rr7J04n0k9Q5k1k6P9j0j15J48j00j00J56J1j26n0J49k5j9r2
7083a02L8J7O6p7M8l0P6mP9j76N3n0P0J8m1L0r5J25m5K6o6N0P7r5j17K07l3o7
7111a8j2Q9p9ON6j04J10p1n7J32J8n4kJ0k8J3l4j1L5K6j58J45j5m2o2P8Ql7p2
7140a30J12on2Q9J37j34n4J03j02O9o2N6M1j34J00j76P6R7p5O0k8J55j91L6nr4
$$ plain form
7166 -112 -6 -32 -39 18 47 -53 64 -50 -85 -27 -105 126 -106 65 -14 58 9 61 44 -127 64 -43 -86 65 1
7191 1 -52 69 -101 -22 19 -21 75 -6 66 15 94 -57 7 -129 32 104 -5 119 64 -50 -46 -3 -113 -110 53 75 -75
7218 -75 35 -7 -127 47 -90 9 -91 1 -20 -93 89 0 50 72 -111 53 65 34 3 -18 86 -86 -5 -54 -110
7243 -110 53 31 76 -66 16 -66 36 -27 24 -32 -39 64 44 55 13 147 -82 21 12 -71 47 3 -63 43 -56 4
7269 4 75 -73 -36 16 -18 -32 -4 136 -13 4 -44 -53 -7 -55 6 -73 -26 -23 -13 45 6 -10 -63 0 -73 -48 -7 36 -66 19
7299 19 -47 -4 12 72 -53 -40 -18 67 -50 -52 -70 -8 38 -11 -54 10 -7 -15 -21 -35 -68 -17 -1 42 32 -85 57 6 41 -28
7329 -28 -1 -64 7 -36 -108 -52 -10 54 -60 -42 -48 -122 -70 31 17 49 -148 -45 124 -28 24 -33 4 -30 -42 -5 92 -6
7357 -6 29 23 54 -48 -120 42 61 -13 37 10 23 31 -104 -26 -1 63 8 183 -22 -37 20 30 11 -90 5 87 -5 -65 -68
$$ packed form
7166a12J06k6pN7K9j00J17j14l5N8p8K31k32J71p9P2m9N2j7j71J91j07m3J51o4
7191An3J21j70P9M1m0R6q1P2n1P9j51O4j36J61P2j09J24n5j14MM3j10LJ63K2j50
7218g5J10m2j20J74j37R9j00R2k1p3J82q9N0K2j83J64J2l1l1k1J04j72Q1m9n6
7243a10J63k2M5j42Q2q2J02o3N1n6pJ03k0J1m2J34k29J03rq3J18m4o6J06r9O0
7269DP1j48L7N2l4j4K8J40j49J7m8rM6m8O1p9M7LJ0N8l9j6n3O3p3K5M1M3j02Q5
7299A9o6M3J6O0j25J3K2Q5j17kj8O2M6m9m3O4j7qoj4l3N1J6M3j0j17J42n1L5o9
7329b8K7o3P1m3p2N6M2O4j14J8op4N2J01j4L2j97J03J69j52N2n7L7l4j2L7R7r8
7357fL5oL1j02p2J62J9p4N0k7J3Qj35P8K5O4n5J75k05j5N7J0j9j01R5Q2r2o0l
$$ plain form
7386 -68 4 -74 46 -19 10 51 26 -47 28 -59 -37 62 -77 74 106 65 -106 7 -1 58 -35 -61 4 -60 -83 63 -99
7413 -99 -74 -20 146 -11 -24 -3 7 -134 7 -19 -3 3 -1 -28 78 5 28 34 35 7 -4 -8 -17 46 -12 -67 -27 -74 -36 -32 38
7444 38 34 -82 -22 37 42 22 -26 -61 -2 -52 3 45 8 -2 -20 21 -79 -83 -30 55 -88 34 34 58 70 51 -54 73 -43
7473 -43 -49 -33 105 18 -71 -92 -11 -5 2 63 -141 62 4 107 27 -137 -125 38 -69 -97 -72 118 137 60 -19 58 -40 58
7501 58 -36 148 54 81 -13 -56 -56 -47 -25 44 -8 -25 22 -70 -7 50 -6 -14 -38 -10 -39 -59 98 -49 11 -58 81 -52 73
7530 73 17 -45 99 -23 -89 50 -39 3 21 -49 -6 -85 62 -139 26 -23 -130 -26 47 -1 13 55 107 28 -117 11
7556 11 -103 -61 113 6 70 -35 24 89 -5 -21 -17 26 -74 -63 -34 67 -50 -8 -41 68 76 -65 3 148 157 43
7582 43 122 -33 1 -101 25 -52 2 11 -104 37 115 14 62 -70 8 28 1 52 -58 -41 23 -24 -54 95 -105 0
$$ packed form
7386f8P2p8J20o5K9M1k5p3P5q7K2R9j39J51L2m1j71J13qN9r3k6O5o4k3J46j62
7413i9K5N4J66j57j3K1J0j41J41k6J6Omk7J06p3K3OJk8j1mrO3n8n5M0m7L8MP0
7444C8mj16O0N9Nk0m8l5N9n0N5M2l7j0j8M1j00mN3Q5j43J22%K4J2j9j05J27j16
7473d3oJ6J38q7q9k1Q1OPO1k04K03n8J03q0j64J2J63j07k8K5J90J9p7p9P7r8R8
7501E8r4J84r4K7r4m3%RK2O9n2j7M7r2O3N7n6qk4K8k9k0J57j47O0o9J39j33J25
7530G3n6o2J44j22o6J39q9M2J8p0M3p9J47k01J65m9j07J04P3m8J4M2N2p9j45J28
7556A1j14M2J74j07O4j05N9O5r4j6MM3j00J1K9J01j17M2l3J09Qj41O8J45Rj14
7582D3P9j55L4j02J26p7N4Rj15J41P8j01M8j32P8K0k7N1j10J7O4m7l0J49k00J05
$$ plain form
7608 0 -15 1 -1 43 30 -34 9 -48 -3 141 29 81 24 131 11 -43 0 7 -7 -77 -63 -116 56 -90 9 -36 4 -19 42
7637 42 28 119 -67 -33 -13 137 -19 -45 93 -86 -27 -15 56 32 35 27 59 61 -59 -12 42 -69 39 -123 -36 80 -38
7664 -38 -27 37 -107 -44 41 114 80 32 29 27 133 38 17 -32 60 -56 -30 -82 -126 -78 17 92 -60 -15 -17 -59 -38 66 -17
7693 -17 14 23 -38 58 -13 -100 111 56 20 25 19 100 14 33 24 101 -43 95 9 3 89 -80 131 -48 -102 32 -11 30 -77
7722 -77 -58 -2 -93 -34 -9 -3 -68 55 -49 76 72 28 -35 -74 6 25 -15 76 33 168 -2 -83 23 2 -37 -129 -104 -24
7750 -24 18 -99 -83 60 -60 -8 -27 60 30 -23 131 0 0 66 56 -53 74 -58 72 -40 -68 -15 -65 48 -68
7775 -68 -26 53 4 118 37 -19 25 16 43 10 -47 42 -44 4 14 -26 90 58 65 79 62 131 12 -18 57 -66 33 -8 -80
7804 -80 23 52 -21 -28 5 10 -28 -32 -40 -3 10 -69 -32 -69 21 -6 44 67 -81 56 -77 -118 -98 57 -1 50 46 -19 -22 19 -34
$$ packed form
7608@j5J6kM4j3o4M3n7M5J44j12N2n7J07j20n4M3Pj4p0J4n3J72j46R9m5M0k3O1
7637D2j4R1j86L4K0J50j56k6J38j79N9J2P1k4LqL2Kj20M7N4j11J08j62Q7J16j18
7664c8J1O4j44O3Q5P3l4m8lkJ06r5k1m9R2j16K6n2m4M8R5P5j52M5km2K1J04q3
7693a7L1Ro1R6p1q7K11n5l6NoQ1q6J9rP7j44J38q6oQ6j69K11j79n4J34m3M1j07
7722g7J9N6r1N9K5Oo5J23j04J25mm4o3l9Q0J9m0R1m3J35j70q1J06k1l9r2K5Q0
7750b4M2j17J6J43j20N2j9Q7l0n3J54j31%O6j0j09J27j32J30j12k8N3n0J13j16
7775f8M2P9m9J14q1n6M4rK7l3n7Q9q6M8J0m0J16l2PJ4j7O9j19l0P5j23R9m1p2
7804h0J03K9p3pL3Nl8mqL7J3p9L7l7R0k7N0K3j48J37j33m1K0J55n8N1mo5lM1n3
$$ plain form
7835 -34 133 -32 -52 41 36 137 59 95 70 -79 22 6 -11 9 76 75 51 -32 -15 -98 -27 14 -6 -74 -87 47 118 40
7863 40 11 170 27 14 36 58 -39 -1 9 75 -86 -38 38 -151 -92 -80 -16 35 23 -85 72 5 -39 33 3 22 63
7890 63 128 36 -63 -19 19 -118 140 -18 -4 29 64 -17 -2 -71 -23 51 -5 -51 18 56 107 -115 11 -15 -20 158 -36
7917 -36 25 -28 91 43 15 -50 -3 37 44 -16 40 -103 -98 -97 -45 -14 -54 -9 -43 -93 50 -38 -49 8 -117 -47 16 -39 -6 -96
7947 -96 17 -64 52 8 46 31 47 -39 -27 -26 3 100 -123 32 63 -48 78 -25 -83 -30 -95 26 4 38 -27 -27 -34 -43
7975 -43 27 22 27 21 -81 63 65 -57 74 50 -56 29 -10 53 -13 40 -37 -7 -1 65 -24 -12 28 11 -24 8 25 -46 -14 45
8005 45 -39 -115 149 -51 64 -36 26 -87 15 -28 -125 -16 -63 16 -83 -21 -2 124 -114 30 78 21 -96 -153 84
8030 84 66 -62 -73 41 29 38 45 22 96 -49 -82 -8 -25 42 26 82 81 131 -39 6 79 -23 -30 104 -7 63 -59 38
$$ packed form
7835c4J67j65k0R3nJ01p8L6k5j49J01j6j7K0O7jk4q3J7q3P1M1k0o8j3J34P1p8
7863D0k9J59j43j3K2K2r7L8J0O6j61M8P6j89N9J2O4N1j2j08J57o7m4P2l0J9M1
7890F3O5r2r9M4L8j37K58j58J4L3L5q1J5o9M8P4n6m6O9L8N1k22J26k6nJ78j94
7917c6O1n3J19m8k8o5M7M0Po0N6j43NJN2L1m0M5l4n0J43q8j1N7j25P0O3n5L3r0
7947i6J13q1J16m4L8j5J6q6J2JK9R7k23J55L1j11J26j03n8N3o5J21k2L4o5%pr
7975d3P0nNoj02J44Kj22J31k4j06Q5l9O3o6N3p7L0OO6q9J2M0j7l5L2J7p1L2N9
8005D5q4p6K64k00J15j00O2j13J02m3r7J09m7P9r9O2J9J26k38J44M8n7j17n7K37
8030H4j8j28j1J14j2RPk3P4j45l3P4j7O7j6N6jN0j70M5P3j02pJ34j11P0j22R7
$$ plain form
8058 38 47 -21 48 -4 83 52 20 6 -20 71 -15 27 23 41 33 -47 72 13 86 -73 -48 14 25 -75 33 -11 29 -36 -17 -104
8088 -104 82 -58 101 56 -7 47 37 -83 48 61 -29 58 -111 -5 -78 53 -59 -109 17 -125 -104 26 40 20
8112 20 -102 45 -36 120 -37 -65 -19 -31 23 -39 107 7 -21 0 53 -132 -27 55 -4 -8 10 80 143 -28 -45 -19
8138 -19 52 82 -27 -41 -2 20 72 -7 -1 68 -30 7 44 97 37 57 -26 141 107 99 -80 11 123 94 2 -79 17 -81 8
8167 8 43 -12 -59 61 -6 -18 20 24 -79 15 69 -168 60 -63 -57 29 -21 120 -122 119 -46 -58 71 -54
$$ packed form
8058C8Ro8O9n2Q7l1l2j4k6R1q6M2mJ8qq0J19n9P3j59K5O2J1j00J08m4M0o5J9q7
8088a04J86j40J59m5o3N4j0j20J31J3r0Q7j69J06p3J31j12n0J26j42K1J30J4k0
8112B0j22J47q1J56j57k8M6j2N4o2J46j00k8K1N3j85J05Q2n9mJ8P0O3j71j7K6
8138a9P1L0j09j4L9K2N2p9OO9r8L7L7N3o0K0q3J67l4qj79R1J12k9r2q1R6r8Q9
8167HL5n5m7J20o7j2L8Mj03R4N4k37K28j23OQ6n0J41k42K41j65j2J29j25
8191e4
$$ Imaginary data points
##PAGE= N=2
##DATA TABLE= (X++(I..I)), XYDATA
$$ plain form
0 0 0 0 0 0 0 0 0 0 0 0 0 8 -8 8 -8 15 -16 16 -24 24 -32 40 -48 56 -64 73 -88 103 -119 136 -152 176 -199
33 -199 224 -254 287 -320 359 -399 447 -495 551 -611 678 -750 826 -912 1007 -1108 1222 -1346
51 -1346 1482 -1633 1804 -1993 2208 -2448 2729 -3056 3440 -3902 4470 -5190 6129 -7416 9295
66 9295 -12307 17910 -31870 141816 149131 -153974 -19907 34076 -95690 -131690 17621 55906
78 55906 29574 48765 36109 -88104 -44946 92797 10577 -107913 38133 110353 -64894
89 -64894 -137779 22463 93816 13904 14392 79052 17572 -50352 -32307 -63222 -89863 30549
101 30549 99769 -14695 -57796 68155 59343 -96375 -63047 84932 47063 -39392 -2923
112 -2923 14778 -23804 -8476 23466 -1303 -2462 64225 32082 -98197 -64481 57858 -252
$$ packed form
0@%%%%%%%%%%%Qj6J6j6K3l1L2m0M8n6P2q8J04j20J37j61J91k22K55k88L28l75
33a99M23m78N41o07O79p58Q46r42J046j162J289j428J576j738J919k115K330k568
51a346K828l115L437l797M201m656N177n785O496p342Q372r660J1319j3545J6711
66I295k1602L0217m9780J73686P315l03105J34067N3983j29766l6000J49311L8285
78E5906k6332J9191j2656j24213M3158J37743q2220j18490J46046P2220j75247
89f4894p2885J60242P1353p9912M88O4660o1480o7924J8045l0915k6641J20412
101C0549O9220j14464m3101J25951q812j55718L3328J47979l7869q6455L6469
112b923J7701l8582J5328L1942k4769j159O6687l2143j30279L3716J22339n8110
$$ plain form
124 -252 -73133 23151 84072 8506 -43313 -9035 11456 -11772 4770 27736 -12268 -2270 50751
137 50751 -13318 -74304 14371 64967 -20960 -54860 18999 33167 -37273 -37476 23641 21919 4156
150 4156 22303 2713 -27159 5600 22371 -29946 -32986 45654 46847 -36664 -28694 35135 8398
163 8398 -38160 -14269 13900 2200 -9022 964 -3084 -9021 27371 28654 -28458 -8710 45306
176 45306 -3558 -51536 -5940 29562 1956 -21258 5130 24514 -4088 -11291 3150 -16197
188 -16197 -8159 23193 -6661 -28422 16859 34196 -7286 -21965 17152 28769 -15768 -26512
200 -26512 6061 2470 -12897 -979 1035 -2394 13094 15274 -12272 -18100 16363 15938 -26142
213 -26142 -14595 25875 12490 -12889 -3043 11829 6945 -7333 -7562 -4926 -9606 4075 4656 -19769
$$ packed form
124b52p2881R6284O0921p5566n1819L4278K0491k3228J6542K2966m0004R998N3021
137E0751o4069o0986Q8675N0596q5927l3900P3859J4168p0440k03O1117j722j7763
150D156J8147j9590k9872L2759J6771n2317l040P8640J193q3511P970O3829k6737
163H398m6558K3891K8169j1700j1222R986m048n937L6392J283n7112J9748N4016
176D5306m8864m7978M5596L5502k7606k3214K6388J9384k8602p203J4441j9347
188a6197Q038L1352k9854k1761M5281J7337m1482j4679L9117J1617m4537j0744
200b6512L2573l591j5367J1918K014l429J5488K180k7546n828L4463m25m2080
213b6142J1547M0470j3385k5379R846J4872m884j4278k29K636m680J3681N81k4425
$$ plain form
227 -19769 10 29753 2625 -16966 4491 15383 841 -16825 -5867 14229 1960 -4809
239 -4809 5056 -2535 1225 9822 -13243 -19390 4898 7631 -9378 -11704 9473 21585 1098 -7459
253 -7459 9033 8082 -2735 -5515 -8002 -2406 6604 2250 -7328 -3901 11721 6438 -16506 -11667
267 -11667 5872 1048 -8514 -6133 6695 15260 5824 711 5300 4333 5465 -3093 -17273 -3024
281 -3024 8411 -6173 -9450 54 7197 6600 -8783 -8988 6338 1016 -5484 -1950 -788 10602
295 10602 12989 -2246 531 9905 4942 -3928 -12231 -6364 4935 -4954 -11928 -1460 4349 3960
309 3960 -1887 -6273 2700 6680 147 -3254 -678 9288 10160 -2273 -1599 6310 4315 -2605 -10169
324 -10169 -5987 3504 -4034 -8847 -2406 -47 4800 1394 -7754 2707 9282 629 -274 821 6005
$$ packed form
227a9769J9779K9743k7128j9591K1457J0892j4542j7666J0958K0096j2269o769
239d809R865p591L760Q597k3065o147K4288K733j7009k326K1177J2112k0487q557
253g459J6492r51j0817k780k487N596R010m354r578L427J5622n283k2944M839
267a1667J7539m824r562K381J2828Q565r436n113M589r67J132q558j4180J4249
281c024J1435j4584l277R504P143n97j5383k05J5326n322o500L534J162J1390
295A0602K387j5235K777R374m963q870q303N867J1299r889o974J0468N809l89
309C960n847m386Q973L980o533l401K576R966Q72j2433O74P909j995o920p564
324a0169M182R491p538m813O441K359M847l406r148J0461O575q653r03J095N184
$$ plain form
339 6005 10959 -2227 -5465 5666 782 -4530 -5792 -9247 750 2625 -8697 -4116 3383 3351 2811
354 2811 -4793 -1470 10055 3035 -2955 2568 4594 6732 2331 -5637 -459 2484 -3457 -7395 -8286
369 -8286 -1179 3026 -5054 -4365 3650 4765 3132 -1839 -616 6605 3174 -1124 79 1177 5975
384 5975 2731 -6527 -880 2947 -3449 -5382 -6631 -2620 3316 -3461 -3979 4253 3578 3896 2078 -2552
400 -2552 5194 6348 -3333 -1756 1441 1979 1773 -5097 -3474 3632 -1567 -5231 -3159 -2551 1809 524
416 524 -4117 1332 5562 3600 976 -894 3454 5042 -2088 -3220 204 1113 -74 -4111 -2860 1888
432 1888 -480 -2280 -2377 -2003 3009 1064 -3640 1625 4542 2734 1641 -1532 2392 4710 -3655 -3451
448 -3451 781 -1828 -182 -1753 -4486 2298 2187 -2444 -668 -421 2479 2714 -4369 -191 5942 605
$$ packed form
339F005M954j3186l238J1131m884n312j262l455R997J875j1322M581P499l2n40
354B811p604L323J1525p020n990N523K026K138m401p968N178K943n941l938q91
369h286P107M205q080O89Q015J115j633m971J223P221l431m298J203J098M798
384E975l244r258N647L827o396j933j249M011N936o777n18Q232o75L18j818m630
400b552P746J154r681J577L197N38k06o870J623P106n199l664K072O08M360j285
416E24m641N449M230j962k624j870M348J588p130j132L424R09j187m037J251M748
432A888k368j800r7L74N012j945m704N265K917j808j093l173L924K318q365K04
448c451M232k609J646j571k733O784j11m631J776K47K900K35p083M178O133n337
$$ plain form
464 605 -596 1370 712 2087 -1388 -4325 -1162 -1266 -967 -1262 -3646 2112 4752 -1628 -1181 2985 2831
481 2831 455 -3098 352 3084 -1227 -426 637 -1154 2493 264 -5283 -1812 468 -837 -2449
496 -2449 -3124 4073 5593 -2382 908 4806 59 877 -489 -3171 1530 866 -2462 -1600 -1270 2648
512 2648 862 -6669 -885 3936 -2964 -2769 1024 2048 3881 1734 689 3136 1495 997 -1486 -4991
528 -4991 663 2218 -4644 -3441 1699 1566 -1586 -3843 393 2256 -1623 -385 977 855 4981 3246
544 3246 -1151 2087 3628 653 -3781 -4904 909 132 -6172 -1863 1946 -521 645 -1428 -1851 2864
560 2864 1355 -769 236 1252 5859 3226 -3230 2283 4761 -2195 -3685 -2902 -1829 -703 -3954
575 -3954 -3135 645 640 1872 88 -2399 3425 4050 -2005 -884 3092 4274 1416 -1900 1643 2860
$$ packed form
464F05j201J966o58J375l475k937L163j04K99k95k384N758K640o380M47M166j54
481B831k376l553L450K732m311Q01J063j791L647k229n547L471K280j305j612
496b449o75P197J520p975L290L898m747Q18j366k682M701o64l328Q62L30L918
512B648j786p531N784M821o900J95L793J024J833k147j045K447j641m98k483l505
528d991N654J555o862J203N140j33l152k257M236J863l879J238J362j22M126j735
544C246m397L238J541k975m434j123N813p77o304M309L809k467J166k073m23M715
560B864j509k124J005J016M607k633o456N513K478o956j490P83J073J126l251
575c954Q19L780nJ232j784k487N824O25o055J121L976J182k858l316L543J217
$$ plain form
591 2860 -2023 -2604 -3244 -3532 -41 -2236 -4584 -282 2117 2599 -140 -1695 4877 4233 -2325 545
607 545 2783 1112 1908 -1080 -1243 1966 -1018 -2349 -3135 -4195 955 -651 -6118 619 3969 212
623 212 780 1241 2892 3945 -435 -36 2153 23 1546 -430 -3881 1122 1465 -3991 -3884 -866 566
640 566 -707 -4076 496 2858 630 890 1589 1204 3706 1944 -1496 181 1077 834 -1960 -3679 1126
657 1126 739 -4014 -1553 -22 -1070 232 -1155 -780 2360 1353 1695 1666 386 3923 1507 -2926
673 -2926 444 1117 -2030 -1006 -1903 -839 549 -2417 -1344 -3 -703 1261 -191 -1662 2126 2348
689 2348 -1047 288 2133 2367 350 -2006 132 911 -1831 -1633 -1427 -1673 1029 -377 -1411 779
705 779 718 1566 -262 -1131 2021 1167 -1472 1177 919 537 849 -1441 -681 292 -1815 -1142 -1564 -1978 1206
$$ packed form
591B860m883n81o40k88L491k195k348M302K399M82k739j555O572o44o558K870
607E45K238j671P96k988j63L209k984j331p86j060N150j606n467O737L350l757
623B12N68M61J651J053m380L99K189k130J523j976l451N003L43n456J07L018J432
640E66j273l369M572K362k228K60O99l85K502j762l440J677Q96k43k794j719M805
657A126l87m753K461J531j048J302j387L75L140j007L42k9j280L537k416m433
673b926L370O73l147J024q97J064J388k966J073J341p00J964j452j471L788K22
689B348l395J335J845K34k017k356K138P79k742J98K06k46K702j406j034K190
705G79o1Q48j828q69L152q54k639K649k58l82L12k290P60R73k107O73m22m14L184
$$ plain form
724 1206 33 -1495 2193 1524 559 1095 -111 961 1225 -1679 266 487 -508 950 -795 -1709 475
741 475 -875 -1856 -606 -827 933 568 -927 2101 2245 9 897 140 -63 643 -967 -1184 184 120
759 120 231 -797 -1893 1535 106 -1995 293 190 773 1017 -414 1881 2355 -184 632 -9 -1062
776 -1062 801 -1643 -2523 429 -406 -864 -255 -1056 1152 736 -1858 601 1139 145 1764 296 248 2539
794 2539 478 -729 -83 -958 -88 -1380 -2908 19 163 -1315 73 -168 599 1546 -418 296 1377
811 1377 495 1286 314 -393 1876 1376 -1408 -282 -521 -1079 -1322 -2680 -213 358 -849 597 471 765
829 765 2637 161 -277 2327 915 518 564 -678 1351 298 -2063 -649 -918 -1364 -516 -2407 -1370
846 -1370 1183 -243 -119 899 720 2345 1066 -392 1732 1323 204 307 -848 89 328 -1838 -1486
$$ packed form
724A206j173j528L688o69r65N36j206J072K64k904J945K21r95J458j745r14K184
741D75j350r81J250k21J760l65j495L028J44k236Q88p57k03P06j610k17J368o4
759A20J11j028j096L428j429k101K288j03N83K44j431K295M74k539Q16o41j053
776a062J863k444q80K952q35m58O09q01K208m16k594K459N38r94J619j468m8K291
794B539k061j207O46q75Q70j292j528K927J44j478J388k41P67R47j964P14J081
811A377q82P91r72p07K269n00k784J126k39n58k43j358K467N71j207J446j26K94
829G65J872k476m38K604j412l97M6j242K029j053k361J414k69m46Q48j891J037
846a370K553j426J24J018j79J625j279j458K124m09j119J03j155R37K39k166L52
$$ plain form
863 -1486 -822 -1240 -583 -1530 -1350 1240 230 -37 1096 932 1986 1516 -296 1322 1313 -265 126 -1206
881 -1206 -917 470 -1988 -1832 -363 -1306 -207 -510 -1356 1481 1079 -257 1420 978 1124 2037 -330
898 -330 383 1325 -611 -389 -700 -1701 91 -1109 -2419 -70 -444 -682 247 -715 904 1777 -53 951
916 951 1345 580 1641 177 -613 1025 -302 -1226 -649 -1473 -425 -596 -1910 45 139 -340 803 -181
934 -181 338 1882 305 388 1276 386 1006 216 -890 541 -198 -1531 -298 -1349 -714 -1 -1452 -507
952 -507 998 -140 627 492 856 1692 601 -1169 1523 1055 -1314 512 -574 177 -450 -1020 -343 -632
970 -632 -995 192 -595 -203 1108 326 472 1109 240 970 393 -342 517 -43 -409 152 -906 -347 131
989 131 -1098 -404 -207 -681 340 -85 -153 1344 480 325 1115 -38 349 584 -586 101 248 -1064 3
$$ packed form
863a486O64m18O57r47J80K590j010k67J133j64J054m70j812J618rj578L91j332
881a206K89J387k458J56J469r43J099l03q46K837m02j336J677m42J46R13k367
898c30P13R42j936K22l11j001J792j200j310K349l74k38R29r62J619Q73j830J004
916I51L94p65J061j464p90J638j327r24N77q24J048j71j314J955R4m79J143r84
934a81N19J544j577Q3Q88q90O20p90j106J431p39j333J233j051O35P13j451R45
952e07J505j138P67j35L64Q36j091j770K692m68k369J826j086P51o27n70O77k89
970f32l63J187p87L92J311p82J46O37q69P30n77p35Q59n60l66N61j058N59M78
989A31j229O94J97m74J021m25o8J497q64j55P90j153L87K35j170O87J47j312J067
$$ plain form
1008 3 -606 -763 615 -893 -509 536 -379 220 579 -68 1024 725 -196 878 261 -237 256 -878 -467
1027 -467 111 -999 -415 -68 -455 440 29 -543 1358 -447 437 901 -263 623 986 -580 250 -152
1045 -152 -991 105 -1138 -795 567 -1140 -383 340 -31 430 484 -231 918 743 -92 998 28 122 1055
1064 1055 -602 -567 380 -1163 -551 -552 -1155 118 269 -816 358 442 431 773 -107 192 1062 82 192 310
1084 310 -228 542 -466 -1074 169 -834 -871 -408 -981 -127 276 -471 357 571 394 1141 219 281 1270 19
1104 19 -30 422 -484 26 -343 -1270 -290 -676 -976 -136 -829 -180 854 -382 309 1111 423 1005 593 60
1124 60 1071 265 -408 219 -295 377 -185 -1140 -564 -395 -852 -345 -242 -234 985 173 132 939 549 723 888
1145 888 -79 557 457 -618 -61 -778 -756 169 -874 -595 -35 -1374 -66 365 400 747 117 835 810 191
$$ packed form
1008Co09j57J378j508L84J045r15N99L59o47J092k99r21J074o17m98M93j134M11
1027d67N78j110N84L47l87Q95m11n72J901j805Q84M64j164Q86L63j566Q30m02
1045a52q39J096j243L43J362j707P57P23l71M61N4p15J149j75q35J090r70R4R33
1064A055j657L5R47j543O12jo03J273J51j085J174Q4j1L42q80K99Q70r80J10J18
1084C10n38P70j008o08J243j003l7M63n73Q54M03p47Q28K14j77P47r22O2R89j251
1104A9m9M52r06N10l69r27R80l86l00Q40o93O49J034j236O91Q02o88N82m12n33
1124F0J011q06o73O27n14O72n62r55N76J69m57N07J03QJ219q12m1Q07l90J74J65
1145H88r67O36j00j075N57p17K2R25j043K79N60j339J308M31L5L47o30P18k5o19
$$ plain form
1165 191 314 765 -451 13 413 -1054 -120 -553 -1166 -51 -583 -1122 205 -209 -612 770 156 874
1183 874 820 -385 753 690 660 373 -303 -285 792 -533 -91 131 -987 -103 50 -991 172 171 -38 963
1203 963 285 505 983 129 116 859 -479 352 334 -282 637 -44 -999 -24 -551 -448 103 -594 115 713
1223 713 19 568 681 96 685 -52 -461 840 -649 803 307 -478 -410 -3 -384 163 -253 -631 66
1242 66 -296 157 547 89 548 529 213 553 185 267 70 -166 -457 -36 -514 -299 39 -610 -108 213 -226
1263 -226 270 234 113 551 335 111 636 -118 78 233 -564 -96 -38 -682 -62 -272 -387 124 -422 178 551
1284 551 -91 301 463 -44 528 221 -247 421 18 -329 144 -485 -304 47 -733 -30 119 -236 226 23
1304 23 39 612 18 188 631 -14 183 215 -406 146 9 -590 70 -527 -454 89 -482 -239 381 -155 171
$$ packed form
1165A91J23M51j216M64M00j467R34m33o13J115n32n39J327m14m03J382o14P18
1183H74n4j205J138o3l0k87o76J8J077j325M42K22j118Q84J53j041J163jk09J001
1203I63o78K20M78q54j3P43j338Q31j8o16R19o81r55R75n27J03N51o97P09N98
1223G13o94N49J13n85N89p37m09J301j489J452m96p85O8M07l81N47m16l78O97
1242F6l62M53L90m58M59j9l16L40l68Q2j97k36k91M21m78K15L38o49N02L21m39
1263b26M96l6j21M38k16k24N25p54J96J55p97M68N8o44O20k10j15N11n46O00L73
1284E51o42L92J62n07N72l07m68O68m03l47M73o29J81L51p80P03J49l55M62k03
1304B3J6N73n94J70M43o45J97L2o21N52j37n99O60n97P3N43n71K43O20n36L26
$$ plain form
1325 171 391 -131 713 389 -154 558 62 -185 338 -475 -278 285 -704 -103 -143 -544 119 -86 -228 590
1345 590 207 74 835 162 388 554 -205 144 176 -413 -42 -344 -539 -62 -564 -401 -15 -288 57 250
1365 250 -167 394 510 180 651 245 243 470 -170 -94 84 -511 -155 -261 -763 -112 -273 -432 127 -74 70
1386 70 559 -61 294 649 145 571 427 -113 354 -106 -436 27 -422 -384 -198 -691 -298 -57 -469 212 272
1407 272 -9 632 193 335 770 277 183 285 -259 57 -20 -676 -170 -356 -413 -119 -483 -147 74 -204 37
1428 37 453 142 545 462 64 651 212 -84 248 -160 -234 -54 -528 -155 -311 -568 -176 -234 -236 378 71 -51
1450 -51 425 151 293 551 -48 396 223 -162 156 -113 -319 28 -477 -352 -93 -466 -129 -7 -242 344
1470 344 298 87 596 335 239 487 -10 43 150 -211 -29 -81 -457 -149 -260 -488 -176 -209 -148 366 -10 236
$$ packed form
1325A71K20n22Q44l24n43P12m96k47N23q13J97N63r89O01m0m01O63k05j42Q18
1345E90l83j33P61o73K26J66p59L49L2n89L71l02j95M77n02J63L86k73L45J93
1365B50m17N61J16l30M71m06kK27o40P6J78n95L56j06n02O51j61j59N59k01J44
1386G0M89o20L55L55n04M26j44n40M67m60l30M63m49L8J86m93L93K41m12O81O0
1407B72k81O41m39J42M35m93r4J02n44L16p7o56N06j86n7K94l64L36K21k78K41
1428C7M16l11M03q3l98N87m39k96L32m08p4J80m74L73j56k57L92n8kO14l07j22
1450e1M76k74J42K58n99M44j73l85L18k69k06L47n05J25K59l73L37J22k35N86
1470C44m6k11N09k61r6K48m97N3J07l61J82n2l76L08j11k28L12l3O1N14l76K46
$$ plain form
1492 236 505 -16 377 323 -59 236 -44 -150 226 -245 -217 53 -323 -235 -45 -399 1 51 -84 236 240 16
1514 16 514 212 174 355 -2 122 -51 -303 -3 -224 -414 14 -266 -182 74 -205 61 291 -47 398 199
1535 199 -73 431 177 -32 275 -127 -73 0 -379 -123 -237 -323 -59 -95 -236 323 -11 118 321 76 229
1556 229 225 -87 195 8 -215 28 -173 -287 -20 -323 -199 13 -370 -48 73 -156 244 176 16 362 56
1577 56 21 283 -15 150 45 -291 -42 -74 -333 1 -119 -278 73 -182 50 277 -60 204 253 31 348
1598 348 65 -44 275 -85 -171 -5 -281 -284 17 -370 -131 -73 -146 95 16 -111 335 143 78 299 18 286
1620 286 342 -194 22 148 -355 -63 -285 -291 -81 -305 -191 172 -115 168 338 65 367 281 -11 294 135
1641 135 -124 151 -98 -132 -37 -263 -156 -184 -220 -16 -22 -182 270 88 11 316 86 226 265 -122 134 200 -122
$$ packed form
1492B36K69n21L93n4l82K95k80j06L76m71K8K70l76Q8J90l54M00N0j35L20Mk24
1514A6M98l02l8J81l57J24j73k52L00k21j90M28k80Q4K56k79K66K30l38M45j99
1535A99k72N04k54k09L07m02N4P3l79K56j14q6K64l6j41N59l34J29K03k45J53
1556B29ml12K82j87k23K43k01j14K67l03J24K12l83L22J21k29M00o8j60L46l06
1577E6l5K62k98J65j05l36K49l2k59L34j20j59L51k55K32K27l37K64M9k22L17
1598C48k83j09L19l60q6J66k76lL01l87K39N8p3K41p9j27M46j92o5K21k81K68
1620B86N6n36K16J26n03K92k22oK10k24J14L63k87K83J70k73L02q6k92L05j59
1641A35k59K75k49l4R5k26J07k8l6K04oj60M52j82p7L05k30J40L9l87K56O6l22
$$ plain form
1664 -122 57 -213 -169 -97 -294 -378 -62 -176 -17 59 -249 121 256 -12 332 155 90 463 57 -62 142 -148
1686 -148 -82 -147 -416 -113 -220 -457 -49 -193 -32 51 -58 35 380 77 201 235 -35 183 24 -204 -15 -178
1708 -178 -355 -134 -273 -63 -76 -338 -10 -39 -62 208 -68 178 316 122 221 268 1 87 58 -236 -96 -163 -207
1731 -207 15 -214 -230 6 -164 39 58 -50 153 280 81 393 167 68 193 -87 -20 77 -241 -71 -216 -171
1753 -171 -81 -109 -173 153 -103 -43 185 48 196 223 125 180 118 -126 213 -74 -101 -56 -174 -201 18 -173 -129 -103
1777 -103 -268 67 169 -26 230 211 -46 261 100 17 112 -193 -31 -14 -200 -40 -140 -212 -77 22 -54 187
1799 187 48 134 237 -4 194 84 -54 188 11 -40 135 -69 -78 -34 -184 -129 -98 -59 303 -14 -149 180 85
1822 85 66 124 126 43 230 -69 16 22 -92 76 -119 -69 34 -214 -134 113 -181 38 174 -70 201 138 31 192
$$ packed form
1664a22J79k70M4P2j97q4L16j14J59P6l08L70J35k68L44j77o5L73m06j19K04k90
1686a48O6o5k69L03j07k37M08j44J61Q3j09R3L45l03J24L4k70K18j59k28J89j63
1708a78j77K21j39K10j3k62L28k9k3K70k76K46J38j94R9M7k67Q6k9k94J40o7m4
1731b07K22k29j6K36j70K03J9j08K03J27j99L12k26r9J25k80O7R7l18J70j45M5
1753a71R0k8o4L26k56O0K28j37J48K7r8N5o2k44L39k87k7M5j18k7K19j91M4K6
1777a03j65L35J02j95K56j9k57L07j61q3R5l05J62J7j86J60j00p2J35R9p6K41
1799A87j39Q6J03k41J98j10j38K42j77n1J75k04rM4j50N5L1L9L62l17j35L29r5
1822H5j9N8Kq3J87k99Q5Oj14J68j95N0J03k48Q0K47k94K19J36k44K71o3j07J61
$$ plain form
1846 192 -34 -151 86 -63 -123 -18 -212 -25 10 -253 76 36 -138 201 57 -21 274 34 141 249 -21
1867 -21 100 126 -117 96 -35 -212 60 -202 -113 -142 -287 -2 10 -105 229 185 -64 226 109 -6 223 66
1889 66 -80 99 -246 -21 -6 -291 -13 -64 -303 5 -43 -71 116 -41 110 224 16 122 203 -81 185 -28
1911 -28 -219 94 -103 -94 -54 -151 -125 -208 -137 35 -76 -75 118 92 -32 202 126 23 243 0 90 -26 -139 28
1935 28 -30 -219 -7 -255 -147 144 -210 -64 98 16 90 156 82 312 91 -43 188 19 -129 -35 -268 -54
1957 -54 -47 -104 -113 -82 -30 117 98 -95 219 146 -15 202 67 53 134 -22 -31 -38 -59 -62 -100 -134 -99 -246 -107 88 -144
1984 -144 35 154 -17 100 94 134 163 146 69 9 -108 18 -71 -147 -36 -159 -177 50 -168 -32 92 -59 -7 108
2008 108 34 98 55 12 110 21 -55 58 -144 -85 -108 -187 -107 -40 -53 39 21 -76 65 2 42 314 53 23 122 -12 -30
$$ packed form
1846A92k26j17K37j49o0J05j94J87L5k63L29m0j74L39j44p8K95k40J07J08k70
1867b1J21K6k43K13j31j77K72k62Q9k9j45K85J2j15L34m4k49K90j17j15K29j57
1889F6j46J79l45K25J5k85K78n1k39L08m8k8J87j57J51J14k08J06Q1k84K66k13
1911b8j91L13j97RM0r7K6q3P1J72j11JJ93k6j24K34p6j03K20k43R0j16j13J67
1935B8n8j89K12k48J08K91l54J46J62q2P4O6p4K30k21j34K31j69j48R4k33K14
1957e4Pn7rL1N2J47j9j93L14p3j61K17j35j4Q1j56rpk1ll8l4L5j47J39J95k32
1984a44J79J19j71J17oM0K9j7p7o0j17J26q9p6J11j23j8K27k18J36J24j51N2J15
2008A08p4O4m3m3R8q9p6J13k02N9k3p9Q0O7j3R2j8r7J41o3M0K72k61l0R9j34j8
$$ plain form
2035 -30 68 -110 -1 -192 -159 -94 -162 -54 60 -134 -39 19 -18 0 69 -29 -39 30 16 91 58 -79 14 -67 -44 -73 -78
2062 -78 58 -47 11 54 -90 41 80 51 33 134 34 65 152 -128 69 -37 -78 35 -105 -145 26 -148 -95 23
2086 23 -37 33 154 -94 157 29 138 215 5 65 106 53 60 137 -89 -55 -50 -74 41 -120 -48 79 22 114 115 -98
2112 -98 14 226 52 101 12 -27 2 -34 -112 71 -177 -49 -15 -234 104 42 -45 81 166 -103 274 -32 22 84
2136 84 -77 84 45 -58 -78 -82 -172 37 -34 -65 10 -48 -25 72 81 60 90 -11 78 53 -9 120 -93 2 7 -79 4 -98
2164 -98 -158 -121 -10 -57 30 -11 9 93 -83 69 118 10 113 6 -113 31 88 -86 -6 -58 -152 43 51 -59 -94
2189 -94 -132 64 14 -66 132 86 4 136 -5 -14 151 -250 -54 -43 -139 63 -40 -91 63 -149 -88 170 -18 -56
2213 -56 35 80 72 71 43 96 -78 40 7 -30 -125 90 -141 -76 154 -144 51 -16 -10 109 87 57 131 44 148 85 35
$$ packed form
2035c0R8j78J09j91L3O5o8J08J14j94R5N8l7J8O9r8j0O9j4P5l3j37R3q1K3k9n
2062g8J36j05N8M3j44J31L9k9j8J01j00L1Q7k80J97j06m1J13j40m0J71j74N3J18
2086B3o0P0J21k48K51j28J09P7k10O0M1n3PP7k26L4Nk4J15j61P2J27n7R2Jk13
2112i8J12K12j74M9q9l9K9l6p8J83k48J28L4k19L38o2q7J26Q5k69L77l06N4O2
2136H4j61J61l9j03k0mr0K09p1l1P5n8K3R7Rk1L0j01Q9k5o2J29k13R5Nq6Q3j02
2164i8o0L7J11m7Q7m1K0Q4j76J52M9j08J03j07j19J44N7j74Q0n2r4J95Qj10l5
2189i4l8J96n0q0J98m6q2J32j41rJ65m01J96J1r6K02j03n1J54k12O1K58j88l8
2213e6R1M5qjk8N3j74J18l3l7r5K15k31O5K30k98J95o7OJ19k2l0P4q7J04o3n0
$$ plain form
2240 35 24 -3 -16 -43 -8 -64 -56 -83 -93 -64 -144 -34 68 -26 8 105 46 156 60 71 56 9 -15 131 -27 -40 -18 -65
2268 -65 -6 2 -37 -13 -124 41 49 11 46 154 -2 118 200 39 23 -52 -58 -44 12 -37 -38 -98 -99 -48 -32 -14 69 6 88 -47
2298 -47 -17 91 24 -38 151 -125 23 27 -117 53 -78 -89 -57 -144 -16 1 -133 54 39 112 35 -46 -35 -63 10 -20
2324 -20 32 -30 -38 -3 -58 -8 -3 -65 -39 -43 -72 5 -6 -16 128 2 -112 124 -8 47 147 -106 -35 8 -203 12 -124
2351 -124 -11 -39 -15 37 28 -5 -32 102 -20 -42 75 52 15 108 11 81 -68 31 42 -108 -48 -37 -71 -38 -79 8 123
2378 123 -30 37 83 91 -14 12 -35 61 18 -46 -135 -15 -27 194 -34 -45 93 -71 40 -8 0 45 -46 -64 73 -25
2404 -25 41 59 -56 -53 20 -91 -13 -10 -15 6 -195 83 -4 -140 -8 -13 38 71 64 -52 79 1 -70 26 2 -50 4 -93 -173
2433 -173 49 -144 4 96 -97 124 29 -18 140 42 25 28 51 67 98 -121 -47 40 -121 -99 -35 -59 -44 -55 77 45
$$ packed form
2240C5j1k7j3k7L5n6Qk7j0K9q0J10J02r4L4R7n9J10r6J1j5m7k4J46j58j3K2m7
2268f5N9Ql9K4j11J65Ql8L5J08j56J20Q2j61j6p5oJ4N6m9jo0jN1J6J8Q3o3Q2j35
2298d7L0J08o7o2J89k76J48Mj44J70j31j1L2q7J28J7j34J87j5P3p7q1J1k8P3l0
2324b0N2o2qL5n5N0No2K6mk9P7j1j0J44j26j14K36j32N5J00k53P1M3k11K15j36
2351a24J13k8K4N2rl3k7J34j22k2J17k3l7R3r7P0j49R9J1j50O0J1l4L3m1Q7J15
2378A23j53O7M6Qj05K6m7R6m3o4q9J20j2K21k28j1J38j64J11m8QM5r1j8J37r8
2404b5O6J8j15LP3j11P8LnK1k01K78q7j36J32nN1L3pj16J31p8p1R6k4n2N4r7q0
2433a73K22j93J48R2j93K21r5m7J58r8j7LK3J6L1k19P4Q7j61K2O4k4J5j1J32l2
$$ plain form
2459 45 -2 34 52 -25 8 69 11 47 131 -14 69 -80 -102 12 -70 -137 -119 -1 -33 96 -1 32 -70 74 47 119 29
2486 29 88 3 47 124 53 77 -76 -127 57 -93 -11 -81 24 85 123 -45 53 59 80 87 -32 -18 -81 62 76 38 -11 -92
2514 -92 -57 -61 -123 -47 -77 123 -62 -19 89 34 18 104 -24 -23 29 -38 -13 70 -16 -109 5 15 -35 -147 -24 -6 -60 35
2542 35 -31 -84 97 -50 21 54 35 19 41 -27 -22 -14 -80 -1 91 -42 -29 75 3 -23 -93 79 82 90 4 102 102 18 -40 30
2572 30 91 103 -24 -9 -13 72 -13 -27 57 70 46 124 29 124 83 48 34 -47 -13 16 -71 -76 -51 -29 2 22 -19 -73 -101 20
2602 20 87 38 27 -3 103 -60 -3 81 -26 19 -42 -73 -7 -8 -40 -11 -23 25 -82 -140 84 -25 -41 -32 -121 -90 -17 20
2630 20 74 -77 -66 -68 -35 -48 -11 -14 23 -21 -28 -48 -47 45 -58 156 -29 192 -12 75 66 -68 27 62 -15 52 17 37 72
2659 72 29 -90 91 3 31 29 -53 -83 9 -42 36 5 133 -1 6 -18 36 -106 -46 -138 8 59 -72 -39 -24 -16 -66 21
$$ packed form
2459D5m7L6J8p7L3O1n8L6Q4j45Q3j49k2J14q2o7J8J18l2J29r7L3j02J44k7P2r0
2486B9N9q5M4P7p1K4j53n1J84j50Q2p0J05O1L8j68R8OK1Pj19J4o3J43J4l8m9q1
2514i2L5mo2P6l0K00j85M3J08n5j6Q6j28JN2o7K5Q3q6r3J14J0n0j12J23J8n4R5
2542C5o6n3J81j47P1L3j9j6K2o8NQo6P9R2j33J3J04p2k6p0J72LQq6R8%q4n8P0
2572C0O1J2j27J5mQ5q5j4Q4J3k4P8r5R5m1l5j4q1L4K9q7nK5K2L1K0m1n4k8J21
2602B0O7m9j1l0J06j63N7Q4j07M5o1l1O6jl2K9j2M8j07n8K24j09j6Rq9L1P3L7
2630B0N4j51J1kL3j3L7lL7m4pk0JR2j03K14j85K21k04Q7rj34R5L5p7O7l5K0L5
2659G2m3j19J81q8K8kq2l0R2n1P8l1J28j34Pk4N4j42O0r2J46N1j31L3J5Qn0Q7
$$ plain form
2687 21 3 -37 -6 19 18 15 -23 47 -78 -88 76 95 -83 64 68 1 -82 -37 -79 29 -74 -17 -64 -10 -1 22 35 18 32
2716 32 -12 -6 -51 -76 53 4 -99 -20 -1 -115 5 -36 51 -26 -26 57 34 33 -6 -27 -20 104 15 50 -99 -125 51 -77
2744 -77 74 -62 11 30 -47 150 -41 -115 66 -73 -38 -49 88 -122 73 -98 -126 -388 -239 269 582 -231 107
2767 107 -384 -86 130 -186 249 -226 -18 205 68 -141 152 -6 194 -88 8 -97 7 -150 67 -58
2787 -58 326 -147 139 69 -373 -161 -116 25 65 -345 -413 138 -192 35 -13 37 463 -409 -342 -140 -289 330 -84
2810 -84 -43 90 -207 241 458 269 72 194 -38 370 394 -68 31 30 100 141 -113 160 51 -39 39 15 -27 9
2834 9 -13 36 107 18 -76 18 -17 -20 99 37 10 41 -158 68 28 40 0 41 -18 39 -9 96 72 52 -2 -50 -73 2 40
2863 40 -74 78 -62 -53 45 -40 -101 1 59 -3 3 113 165 38 70 -107 -51 -28 1 -27 -3 61 -35 0 -70 -98 -15 0
$$ packed form
2687B1j8m0L1K5jll8P0j25j0J64J9j78J47Mo7q3M5m2J08j03N7m7N4RK3J3j7J4
2716C2m4Om5k5J29m9j03P9J9j14J20m1Q7p7%Q3k3jl9k1PJ24q9L5j49k6J76j28
2744g7J51j36P3J9p7J97j91p4J81j39L5j1J37k10J95j71k8k62J49N08L13q13L38
2767A07m91K98K16l16M35m75K08K23j37k09K93j58K00k82R6j05J04j57K17j25
2787e8L84m73K86p0m42K12M5J41M0m10o8N51l30K27m8N0M26q72O7K02j49O19m14
2810h4M1J33k97M48K17j89j97J22k32M08K4m62R9jP0M1k54K73j09r0P8k4m2L6
2834Ik2M9P1q9r4R4l5lJ19o2k7L1j99K26m0J2m0M1n9N7m8J05k4k0n4m8k3P5L8
2863D0j14J52j40RR8q5o1J02N8o2OJ10N2j27L2j77N6K3K9k8K4O4r6L5p0k8Q3J5
$$ plain form
2891 0 -75 110 76 33 -32 -94 60 -57 38 -16 -32 -10 75 -113 -99 1 -109 5 56 -94 -25 38 42 15 2 -14 4
2918 4 -75 3 -27 119 -58 -3 -234 -334 -78 -38 -21 -195 -8 38 79 66 10 -22 193 69 -16 37 -60 7 -12 22
2944 22 13 -27 -13 70 1 -68 117 30 32 13 83 -88 -70 -23 -58 -50 -66 -2 -71 10 -32 13 -83 -103 53 -17 -22 -16 64 -64 -48
2975 -48 21 -59 67 79 -22 106 -41 73 -97 -39 27 -63 77 6 16 81 -14 18 -24 -39 21 -68 7 68 -2 33 29
3002 29 -17 0 1 133 26 69 -25 61 -11 74 -18 -32 25 -67 -56 -41 -61 -11 49 -50 -162 71 11 -109 80 -13 -102 51
3030 51 70 56 -21 28 44 22 1 -106 -2 8 81 -143 92 145 -10 -91 4 -15 15 -45 20 13 -23 79 77 -30 48 22
3058 22 -13 95 7 31 27 -37 113 -27 47 99 0 44 -82 44 -51 28 44 54 58 61 104 7 2 29 78 -26 31 3 -53
3087 -53 4 19 101 23 -46 -45 -67 -29 62 -117 124 -4 -77 -79 -121 -65 -27 22 18 -82 56 -20 21 61 -65 31 -4 53 28
$$ packed form
2891@p5J85l4m3o5o2J54j17R5n4j6K2Q5j88J4J00j10J14N1j50O9O3Mk7j3j6J8
2918Dp9P8l0J46j77N5k31j00K56M0J7j74J87M6M1j3n6l2K15j24q5N3r7O7j9L4
2944B2rm0J4Q3o9o9J85q7Kj9P0j71J8M7l5Qj6O4o9Q1m2M5r6k0J56p0nOQ0j28J6
2975d8O9q0J26J2j01J28j47J14j70N8O6r0J40p1J0O5r5L2m2j5O0q9P5O1p0L5m
3002B9m6J7JJ32j07M3r4Q6p2Q5r2j4N7r2J1J5k0N0O0r9j12K33o0j20J89r3q9J53
3030E1J9j4p7M9J6k2k1j07J04J0P3k24K35N3j55q1R5j9L0o0O5pl6J02kj07P8k6
3058B2l5J08q8K4mo4J50j40P4N2r9M4j26J26r5P9J6J0MLM3r7nK7M9j04N7k8n6
3087e3N7J5Q2p8o9Jk2L8R1j79K41j28p3km2N6L8M9mj00J38p6M1M0j26R6l5N7k5
$$ plain form
3116 28 20 -97 -1 106 50 -13 -44 73 -5 -9 106 -74 172 60 11 87 46 -41 -27 70 -61 17 2 -4 -123 34 -115
3143 -115 0 -46 -116 -42 0 57 115 -30 19 -72 -67 67 -84 -3 51 42 -25 -31 -69 -1 66 83 13 -89 -66 -17 47 33 89
3172 89 -11 -59 2 -63 8 84 -75 20 -66 -82 98 1 66 23 -25 -181 42 4 162 -11 -3 -68 -97 62 -55 -72
3198 -72 -42 19 -47 -13 -81 9 39 -66 50 10 -59 15 20 -144 78 -43 -45 -7 15 4 -29 89 52 -12 98 -64 14
3225 14 33 -64 48 -5 124 120 -59 -59 68 66 126 -44 -10 26 86 -35 -126 37 -22 -18 -39 -68 46 30 62 -55 -21 55
3253 55 -88 -28 -64 72 6 -71 -51 52 -41 -123 -74 -69 90 5 -29 45 -68 84 -24 4 104 -79 -45 3 -92 82
3279 82 -98 12 -6 -43 -56 -31 -50 -74 13 -27 79 -24 -23 -48 88 -62 33 21 7 -98 -33 -4 -47 21 1 71 -22
3306 -22 -5 -9 55 -57 -24 36 -4 58 30 5 -36 55 45 19 20 1 -33 104 46 -187 -34 -52 31 -38 -95 75 43 15 42
$$ packed form
3116B8qj17R6J07n6o3l1J17p8mJ15j80K46j12m9P6m1q7J4R7j31P8j5oj19J57j49
3143a15J15m6p0P4M2N7N8j45M9r1NJ34j51Q1N4ro7ol8O8O7J7p0j02K3M9O4j4N6
3172H9j00m8O1o5P1P6j59R5q6j6J80r7O5m3m8j56K23l8J58j73Qo5k9J59j17j7
3198g2L0O1o6L4o8R0L0j05J16m0o9P4Nj64K22j21kL8K2j1l3J18l7o4J10j62P8
3225A4J9r7J12n3J29mj79%J27kO0j70L4L6O0j21r1J63n9Mk1k9J14j6L2j17L4P6
3253E5j43O0l6J36o6p7K0J03r3q2M9NJ59q5l4P4j13J52j08K8J00j83L4M8r5J74
3279H2j80J10j8l7j3K5j9k4Q7m0J06j03Jk5J36j50R5j2j4j05O5K9m3O8k0P0r3
3306b2J7mO4j12L3O0m0O2k8k5m1R1j0k6Jj9l4J37n8k33J53j8Q3o9n7J70l2k8K7
$$ plain form
3335 42 13 43 1 14 -35 -102 12 -26 27 39 -35 68 -69 -46 -64 -10 -20 -14 -52 82 -5 -106 58 -21 -29 44 -104 -45
3363 -45 -71 -48 69 -14 -80 45 20 -31 17 -14 -8 16 66 -6 -2 37 169 -71 -42 -76 36 -5 83 8 -33 -21 49 72 35
3392 35 -1 38 -60 -29 -34 31 -2 -13 -3 -66 -68 -27 21 -52 185 -2 6 125 35 -35 -85 29 95 9 11 -2 -57 35 52 3
3422 3 30 45 -3 56 -10 31 -3 -55 -81 -34 -16 37 27 64 -41 -47 -80 61 -4 -15 37 15 -3 10 -13 -51 99 53 15 46
3452 46 92 -12 -58 -28 27 -20 89 58 106 -25 23 -10 -24 38 -6 -71 20 -14 -59 -77 -53 11 30 -74 22 56 -7 134
3480 134 82 -27 5 40 -51 -54 -160 -22 45 30 -12 -25 62 -116 -30 -54 34 47 4 35 51 -7 87 51 -42 103 64 6
3508 6 40 -47 -154 -119 -62 -29 -117 -39 32 105 -47 135 -149 -36 -165 59 37 36 -6 149 75 -22 49 23 2 36 -108
3535 -108 39 61 73 -54 2 -1 -195 35 -47 -81 -97 81 111 -6 7 42 28 -19 -52 8 -116 17 56 -7 40 -32
$$ packed form
3335D2k9L0m2J3m9o7J14l8N3J2p4J03j37K3j8N4j0Ol8J34q7j01J64p9qP3j48N9
3363d5k6K3J17q3o6J25k5n1M8l1OK4N0p2ML9J32k40K9l4J12m1Q8p5m1J2P0K3l7
3392C5l6L9r8L1nO5l3j1J0o3kM1M8p3K37j87QJ19r0p0n0J14O6q6Kj3n5R2J7m9
3422CK7J5m8N9o6M1l4n2k6M7J8N3j0L7j05ol3J41o5j1N2k2j8J3k3l8J50m6l8L1
3452D6M6j04m6L0N5m7J09l1M8j31M8l3j4O2m4o5R1l4m5j8K4O4J9j04R6L4o3J41
3480A34n2j09L2L5r1lj06J38O7j5m2j3Q7j78Q6k4Q8J3m3L1J6n8R4l6r3J45l9n8
3508FL4q7j07L5N7L3q8P8P1P3j52J82k84J13j29K24k2jm2J55p4r7P1k6k1L4j44
3535a08J47K2J2j27N6lj94K30q2l4j6J78L0j17J3L5j4m7l3O0j24J33L9o3M7p2
$$ plain form
3561 -32 -36 -120 -24 11 -47 -39 41 -109 -93 -21 67 -27 12 -111 61 55 30 6 -90 73 -30 36 80 -81 15 -131 52 104
3589 104 120 -91 10 -30 -140 -93 -7 -19 67 9 111 40 -6 -38 17 52 -49 -43 -7 -70 -35 -54 -37 21 68 -35 -125
3616 -125 35 -43 70 83 -127 36 -29 5 9 125 47 37 79 33 -28 -72 11 -33 -38 -38 18 -43 55 -48 -24 -64 -56 99
3644 99 -22 30 18 -30 -20 -68 8 -31 -61 -55 -146 -112 -62 -14 -85 -80 -109 -16 14 -32 -13 50 -112 31 -29 70 104 -86 71
3673 71 24 77 -32 50 -43 -18 103 50 6 48 169 9 -53 19 -45 18 -8 -11 0 4 112 33 -17 154 -32 -21 -61 -87
3701 -87 65 4 -97 -41 -49 35 -5 24 -45 -16 -26 9 -3 52 -5 65 7 48 36 51 -74 102 26 112 -43 -73 -7 84
3729 84 28 -67 6 -135 -61 -72 -13 -89 -97 -104 -116 -42 -17 46 72 -64 -9 114 65 61 69 -55 16 5 35 -49 105 -68 -72 -18
3759 -18 11 23 224 326 389 406 62 -327 -109 134 29 -319 -616 -364 -321 32 -115 49 -76 -4 -22 83 -66
$$ packed form
3561c2mq4R6L5n8QQ0j50J6P2Q8r4L9j23J72ok5k4r6J63j03O6M4j61R6j46J83N2
3589A04J6k11J01m0j10M7Q6j2Q6n8J02p1m6l2N5L5j01OL6o3L5j9J7N8M7j03r0
3616a25J60p8J13J3k10J63o5L4MJ16p8j0M2m6o1m4Q3m4n%N6o1R8j03K4m0QJ55
3644I9j21N2j2m8J0m8P6l9l0Or1L4N0M8p1Nk9R3L0m6J9O3j62J43o0R9L4j90J57
3673G1m7N3j09Q2r3K5J21n3m4M2J21j60o2P2o4O3k6lJ1MJ08p9n0J71j86J1m0k6
3701h7J52o1j01N6qQ4m0K9o9K9j0L5j2N5n7P0n8M1j2J5j25J76p6Q6j55l0O6R1
3729H4n6r5P3j41P4j1N9p6qpj2P4K5O3K6j36N5J23m9mQj24P1j1L0q4J54j73mN4
3759a8K9J2K01J02O3J7l44l89K18K43j05l48k97K52M3L53j47J64j25P2j8J05j49
$$ plain form
3782 -66 12 -56 -15 -29 -49 -48 50 -45 -48 35 -134 -44 11 28 50 5 183 -95 -33 -85 -71 82 22 -6 95 39 -128 50
3810 50 -123 75 -26 -19 40 103 -5 5 58 -88 -50 2 76 34 -58 52 -45 21 58 21 93 9 106 31 6 -53 -134 -45
3838 -45 -75 31 -12 -18 59 -87 110 25 -75 -63 7 49 -69 16 61 -63 -17 -7 -41 110 4 -246 135 115 99 94
3864 94 121 376 -182 -16 -166 77 -69 12 33 54 57 68 23 4 -95 11 -68 33 36 18 -10 38 23 31 20 104 -55
3891 -55 -53 -5 44 -13 22 29 50 -80 15 -71 -43 -36 50 -81 -74 40 12 -148 71 58 -15 89 28 0 -137 23 -19 9
3919 9 -76 26 89 -18 -35 33 54 -8 -29 -48 34 -26 -31 43 42 11 41 -8 -11 -60 7 111 -52 -40 -73 8 64 20 -40 66
3949 66 27 19 45 15 46 -55 15 -70 -43 -58 -144 -64 98 -27 -7 -105 82 25 5 -16 -7 49 -79 34 -100 45 -44
3976 -44 113 -142 -37 8 66 -59 -47 47 31 -123 123 -170 46 -73 -21 -69 -32 -12 -52 -18 -74 41 -14 47 -48
$$ packed form
3782f6P8o8M1j4k0JR8r5lQ3j69R0N5J7K2m5J78k78O2n2J4J53o0k8J01n6j67J78
3810E0j73J98j01PN9O3j08J0N3j46L8N2P4m2r2J10r7O6L7l7P2q4R7p5k5n9q1Q9
3838d5l0J06m3oP7j46J97q5j00J2P0M2j18Q5M5j24M6J0l4J51j06k50L81k0j6n
3864I4K7K55n58J66j50K43j46Q1K1K1LJ1m5j9r9J06p9J01Lj8k8M8j5Qj1Q4j59
3891e5KM8M9n7L5PK1j30R5q6K8PQ6j31PJ14k8j60K19j3p3J04o1k8j37J60m2K8
3919Iq5J02O3j07j7O8K1o2k1j9Q2o0nP4jl1L0m9lm9O7J04j63J2l3Q1N6m4o0J06
3949F6l9qK6l0L1j01P0q5K7j5q6Q0J62j25K0r8J87n7k0k1RN6j28J13j34J45q9
3976d4J57k55J05M5N8j25J2R4j6j54K46k93K16j19N2m8L7K0m0L4n6J15n5O1r5
$$ plain form
4001 -48 42 38 -28 -5 -42 0 -61 41 -9 -49 101 -46 47 26 -140 -123 -61 14 -10 116 -38 -26 65 -79 -18 101 -111
4028 -111 15 -12 -34 -158 -119 1 59 62 -61 14 41 -32 -43 -4 -33 0 -28 -1 84 -5 -53 -104 50 55 -38 22 37 -15
4056 -15 9 -25 13 15 116 -27 17 -94 -56 -5 122 104 66 -22 53 60 -39 -221 -99 -56 -222 6 -5 -47 -46 1 -33 42
4084 42 28 -90 -10 93 -19 9 20 -92 -139 -115 -64 142 84 24 37 -27 3 16 -75 14 151 73 -97 36 22 -25
4110 -25 -29 116 -13 5 117 2 24 -63 -54 -91 65 35 29 -4 -16 -68 23 -37 -15 -31 -15 -26 -48 63 -146 57 29 -64
4138 -64 -21 -13 31 -8 99 15 31 77 65 27 70 49 13 132 -62 -73 -24 -55 -90 -18 7 -38 65 -64 49 11 -17 8
4166 8 -11 -18 15 -26 -79 31 48 -33 -55 1 -43 -22 53 -30 8 74 41 43 54 -55 44 -111 -76 43 38 -92 17 -60 -92
4195 -92 4 -82 -16 -25 34 -66 43 2 -38 43 -46 28 -56 -2 30 140 -46 12 -87 -28 51 -30 23 -36 -101 0 -7 -21 -11
$$ packed form
4001d8R0mo6K3l7M2o1J02n0m0J50j47R3k1j66J7O2P5k4J26j54J2R1j44O1J19k12
4028a11J26k7k2j24L9J20N8Lj23P5K7p3j1L9k9L3k8K7Q5q9m8n1J54Nr3O0J5n2
4056a5K4l4L8KJ01j43M4j11L8N1J27j8l8q8P5Pr9j82J22M3j66K28j1m2JM7l4P5
4084D2j4j18Q0J03j12K8J1j12m7K4N1K06n8o0J3o4L0J3r1Q9J37p8j70J33j4m7
4110b5mJ45j29J8J12j15K2q7Rl7J56l0ol3j2n2R1o0K2j6J6j1k2J11k09K03k8r3
4138f4M3QM4l9J07q4J6M6j2l8M3k1l6J19j94j1M9l1l5P2K5m5J03j29J13l8k8K5
4166Hj9pL3m1n3J10J7q1k2N6m4K1P5q3L8O6l3KJ1j09R9j55L5J19nj30J09p7l2
4195i2R6q6O6rN9j00J09m1m0Q1q9P4q4N4L2J10j86N8r9N9P9q1N3n9o5J01pj4J0
$$ plain form
4224 -11 79 -64 22 -89 40 61 -55 -42 -119 11 -59 8 -49 -3 104 -12 0 -59 -107 39 -140 -23 -62 30 37 28
4250 28 20 48 -180 -41 -33 -119 -43 14 -28 35 10 -177 129 -33 97 -77 29 -36 -87 11 -91 13 39 124 -13 44
4276 44 -80 13 87 11 -125 4 8 -85 -34 -5 -118 -67 -49 -69 -91 -123 -35 4 71 -34 -3 25 10 56 -6 -54 98 69
4304 69 -16 14 -37 71 52 62 -55 20 15 17 47 39 73 -30 38 112 -83 109 98 -81 16 82 22 -60 -59 -1 -18 32 35 28
4334 28 -17 48 47 -31 -67 -83 12 111 -115 -84 166 39 -28 -43 5 90 -66 56 116 26 -47 -44 91 73 76 33 -131 92
4362 92 76 -3 56 -77 -93 -40 93 30 -81 -131 -5 87 39 -90 -57 -176 -21 102 25 -49 -97 -97 -8 10 44 122 80
4389 80 -14 84 -84 -18 7 30 -15 -45 -30 85 64 26 10 -22 -25 -85 -84 72 -50 -22 -98 29 32 65 23 46 101 -43 90
4418 90 -89 24 -73 -120 -81 8 0 -17 71 -6 109 35 -26 -33 60 13 0 -59 31 36 -44 104 5 -44 -64 -55 -18 33 -108 27
$$ packed form
4224a1R0j43Q6j11J29K1j16J3p7J30p0O7n7M6J07j16J2n9m8J46j79J17l9R2Pr
4250B8qK8k28J39Qq6P6N7m2O3k5j87L06j62J30j74J06o5n1R8j02J04K6Q5j37N7
4276D4j24R3P4p6j36J29Mr3N1K9j13N1J8k0k2l2Q8L9O7j05L1K8j5M6o2m8J52k9
4304F9q5L0n1J08j9J0j17P5nKL0qL4j03O8P4j95J92j1j79R7O6o0q2JN8j7N0Lp
4334B8m5O5jp8l6j6R5R9k26L1K50j27o7j5M8Q5j56J22O0r0p3LJ35j8Lm3j64K23
4362I2j6p9N9j33j6N3J33o3j11n0J26R2m8j29L3j19J55J23p7p4m8%Q9J8L4P8m2
4389H0r4R8j68O6K5K3m5l0J5J15k1l8j6l2lo0JJ56j22K8p6J27LL3m2K3N5j44J33
4418I0j79J13r7m7L9Q9qj7Q8p7J15p4o1pR3m7j3n9R0Nq0J48r9m9k0RL7N1j41J35
$$ plain form
4448 27 84 76 -13 -63 -6 146 46 -7 -24 -12 31 42 -53 -92 40 -34 7 -62 -45 120 62 132 11 -110 57 -25 43
4475 43 -39 -10 -22 -55 95 81 50 -181 30 -38 -34 55 2 -16 -34 -32 -15 56 -15 -13 -144 11 60 71 62 -23 -49 49 -71
4504 -71 -7 33 -124 63 -9 -1 -14 -77 -43 76 -67 3 26 -7 3 27 -103 39 -82 -68 19 9 -23 33 20 19 38 -51
4532 -51 44 27 73 -16 -7 -31 52 -33 -93 37 99 4 -81 -5 -33 76 48 -96 -72 37 46 72 14 -54 -19 -101 -44 -53 14 20
4562 20 -39 -88 -55 7 -4 31 -72 1 50 17 -82 3 -11 34 58 93 54 -34 -76 -89 -129 -136 -36 123 25 108 76 -89 -46
4591 -46 0 21 -55 -54 67 -49 -22 5 37 41 118 88 91 -13 8 -24 25 10 20 -8 121 -23 -68 -37 -29 120 -102 7
4619 7 -115 -91 15 32 -28 -40 -36 1 -16 -78 -45 12 152 9 7 -34 2 10 -14 -56 86 33 -9 89 -48 -15 17 96 -29
4648 -29 51 -19 12 38 -1 -70 70 14 8 22 39 65 -11 -162 43 32 13 82 -2 -20 2 20 -66 9 45 9 -20 25 109
$$ packed form
4448B7N7qq9n0N7J52j00n3j7J2M3J1r5l9J32p4M1o9J7J65n8P0j21j21J67q2O8
4475D3q2K9j2l3J50j4l1k31K11o8MQ9n3j8j8KJ7P1p1Kj31J55M9J1rq5k6R8j20
4504g1O4M0j57J87p2Qj3o3L4J19j43P0K3l3J0K4j30J42j21J4Q7j0l2N6j3jJ9q9
4532e1R5j7M6q9Rk4Q3q5o0J30O2r5q5P6k8J09k8j44K4J09RK6n8o8L5q2N7rO7O
4562B0n9m9L3O2j1L5j03P3M9l3r9Q5j4M5K4L5l9q8m2j3m0pJ00J59r8Q3l2j65M3
4591d6M6K1p6JJ21j16K7K7L2MP7l0Lj04K1l2M9j5J0k8J29j44m5L1QJ49k22J09
4619Gj22K4J06J7o0j2ML7j7o2L3N7J40j43km1L6Qk4m2J42n3m2R8j37L3L2P9j25
4648b9Q0p0L1K6l9o9J40n6oJ4J7K6p6j51K05j1j9O9q4j8K2J8q6P5L6l6k9M5Q4
$$ plain form
4677 109 29 -67 -171 142 -68 2 -2 15 -37 34 96 -84 -71 -84 -36 -27 135 28 -82 4 -42 -17 -36 67 2 -58 -33
4704 -33 93 109 -56 -40 2 -9 16 10 -36 57 2 38 3 30 47 55 33 -4 -43 70 91 45 7 -59 -79 10 52 26 47 -27
4734 -27 67 -3 72 -95 -14 58 -84 21 8 -13 6 48 152 -36 19 -83 -2 39 2 -83 -51 19 13 -64 -31 3 115
4761 115 25 83 -14 0 73 33 2 -40 10 -108 -91 -39 -28 -21 23 -59 -72 33 118 101 35 -88 5 -30 -15 -55 -38 -19 -84
4790 -84 38 -5 -74 -18 42 -71 -128 33 5 -68 -64 63 -45 25 4 -33 103 -82 47 8 -9 49 51 9 107 -92 46
4817 46 -30 -30 -3 31 -43 111 36 -23 36 -56 21 45 -5 99 43 62 -24 20 60 20 11 -11 -34 86 -71 1 -34 -3 -61
4846 -61 -49 -33 132 48 85 44 -70 -133 75 -83 -123 16 45 -73 -17 0 70 51 -54 -138 118 -24 54 -6 -239
4871 -239 -333 -77 169 1230 394 307 109 -45 -2 -55 85 -32 52 -54 42 6 -47 26 67 65 -43 -98 60 -66
$$ packed form
4677A09q0r6j04L13k10P0mJ7n2P1O2j80J3j3M8RJ62j07j10Q6m6K5j9J03o5o0K5
4704c3J26J6j65J6M2j1K5om6R3n5L6l5K7J7Qk2l7l9J13K1m6l8o6k0Q9M2k6K1p4
4734b7R4p0P5j67Q1P2j42J05j3k1J9M2J04j88N5j02Q1M1l7q5L2P0op7L3L4J12
4761A15r0N8r7J4P3m0l1m2N0j18J7N2J1PM4q2j3J05Q5j7o6j23R3l5J5m0J7J9o5
4790h4J22m3o9N6O0j13n7J61k8p3MJ27j08P0k1l7J36j85J29l9j7N8Km2R8j99J38
4817D6p6%K7L4p4J54p5n9N9r2P7K4n0J04n6J9q6M4M0m0rk2k3J20j57P2l5L1n8
4846f1J2J6J65q4L7m1j14o3K08j58m0J39K9j18N6J7P0j9j05q4K56j42P8o0k33
4871b39r4K56K46J061q36q7j98j54M3n3J40j17Q4j06R6l6n3P3M1kj08n5J58j26
$$ plain form
4895 -66 -64 13 -9 -36 8 9 86 34 13 -80 32 -50 72 15 73 42 31 78 2 18 -47 18 -106 16 -1 88 -121 10
4923 10 13 -27 25 -25 44 -64 3 -106 38 38 -40 -142 61 -6 48 21 -66 -40 -43 -41 -27 -24 36 55 3 100 -16 -79 -51 126
4953 126 -112 -57 43 78 -91 70 71 -12 -144 22 -111 -96 -34 10 150 41 -16 168 -54 44 -3 37 -7 -25 43
4978 43 -92 101 10 47 -12 -8 63 -72 54 44 -36 64 26 42 91 81 -34 -74 41 54 56 -45 -82 62 -3 -10 47
5005 47 -40 -47 15 98 -2 -26 46 -83 -79 76 -44 -117 -72 -73 -13 126 88 -42 23 32 -34 -28 -1 103 -78 77 11 -10
5033 -10 -31 -20 -118 0 -89 61 68 -105 -22 -23 -7 -4 58 -51 -3 26 44 -43 20 46 -91 -42 -21 12 23 19 -70 -15 -131
$$ packed form
4895f6KP7k2k7M4JP7n2k1r3J12q2J22n7N8l1j1M7p6J6o5O5j24J22j7Q9k09J31
4923A0Lm0N2n0O9j08O7j09J44%p8j02K03o7N4k7q7K6lKJ4LO0J9n2R7j16o3K8J77
4953A26k38N5J00L5j69J61Jq3j32J66j33J5O2M4J40j09n7J84k22R8m7M0m4j8O8
4978D3j35J93r1L7n9MP1j35J26j0q0J00l8J6M9j0j15m0J15J3Kj01l7J44o5pN7
5005D7q7pO2Q3j00k4P2j29MJ55j20p3M5jO0J39l8j30O5Ro6OK7J04j81J55o6k1
5033a0k1J1r8J18q9J50Pj73Q3jJ6LO2j09M8K9J8q7O3K6j37M9K1L3J1mq9N5j16
$$ [...]
8191I1
##END NTUPLES=NMR FID
##END=
