##TITLE=1H_DE-80H_X3
 200.13MHz, d2o
 8 sc
 
 19ns.26.2.2025
##JCAMPDX= 6.0         $$ Bruker NMR JCAMP-DX V2.0
##DATA TYPE= NMR FID
##DATA CLASS= NTUPLES
##ORIGIN= UXNMR, Bruker Analytische Messtechnik GmbH
##OWNER= pz
$$ XWIN-NMR		Version 3.5
$$ Tue Mar 11 12:49:19 2025 Russian Standard Time (UT+4h)  new_Human@DPX200
##.OBSERVE FREQUENCY= 200.1313
##.OBSERVE NUCLEUS= ^1H
##.DELAY= (6, 6)
##.ACQUISITION MODE= SIMULTANEOUS
##.ACQUISITION SCHEME= undefined
##.AVERAGES= 8
##.DIGITISER RES= 18
##SPECTROMETER/DATA SYSTEM= spect
##.PULSE SEQUENCE= zg30
##.SOLVENT NAME= CDCl3
##.SHIFT REFERENCE= (INTERNAL, CDCl3, 0, 14.3821)
##AUDIT TRAIL= $$ (NUMBER, WHEN, WHO, WHERE, WHAT)
$$ ##TITLE= Audit trail, XWIN-NMR		Version 3.5
$$ ##JCAMPDX= 5.01
$$ ##ORIGIN= Bruker BioSpin GmbH
$$ ##OWNER= new_Human
$$ C:/Bruker/XWIN-NMR/data/yarkov/nmr/H-C/1/audita.txt
$$ ##AUDIT TRAIL=  $$ (NUMBER, WHEN, WHO, WHERE, WHAT)
(   1,<2025-03-11 12:47:52.26 +0400>,<new_Human>,<DPX200>,
      <created by zg, POWCHK disabled, PULCHK disabled
       configuration hash MD5:
       00 E9 B6 7A A2 85 ED C7 34 08 36 98 17 FE 4E 26
       data hash MD5: 16K
       A4 D8 72 8B 0D A6 C0 CD F4 B0 26 95 4F 50 79 9E>)
$$ ##END=
$$ 
$$ hash MD5
$$ 32 CE 2F 7C CB 6F 4E 50 D9 5C D0 DE AF 02 C2 06
##$RELAX= 
##$RELAX= 
##$RELAX= 
##$RELAX= 
##$RELAX= 
##$RELAX= 
$$ Bruker specific parameters
$$ --------------------------
##$DU= <C:/Bruker/XWIN-NMR>
##$EXPNO= 1
##$NAME= <H-C>
##$PROCNO= 1
##$TYPE= <nmr>
##$USER= <yarkov>
##$AMP= (0..31)
100 100 100 100 100 100 100 100 100 100 100 100 100 100 100 100 100 100 
100 100 100 100 100 100 100 100 100 100 100 100 100 100 
##$AQSEQ= 0
##$AQ_mod= 1
##$AUNM= <au_zg>
##$AUTOPOS= <>
##$BF1= 200.13
##$BF2= 200.13
##$BF3= 200.13
##$BF4= 200.13
##$BF5= 200.13
##$BF6= 200.13
##$BF7= 200.13
##$BF8= 200.13
##$BYTORDA= 1
##$CFDGTYP= 0
##$CFRGTYP= 5
##$CHEMSTR= <none>
##$CNST= (0..31)
1 1 145 1 1 1 1 1 1 1 1 1 1 1 1 1 1 1 1 1 1 1 1 1 1 1 1 1 1 1 1 1 
##$CPDPRG= <>
##$CPDPRG1= <>
##$CPDPRG2= <>
##$CPDPRG3= <>
##$CPDPRG4= <mlev>
##$CPDPRG5= <mlev>
##$CPDPRG6= <mlev>
##$CPDPRG7= <mlev>
##$CPDPRG8= <mlev>
##$CPDPRGB= <>
##$CPDPRGT= <>
##$D= (0..31)
0 0.7 0 0 0 0 0 0 0 0 0 0.03 0 0 0 0 0 0 0 0 0 0 0 0 0 0 0 0 0 0 0 0 
##$DATE= 1741682871
##$DBL= (0..7)
120 120 120 120 120 120 120 120 
##$DBP= (0..7)
150 150 150 150 150 150 150 150 
##$DBP07= 0
##$DBPNAM0= <>
##$DBPNAM1= <>
##$DBPNAM2= <>
##$DBPNAM3= <>
##$DBPNAM4= <>
##$DBPNAM5= <>
##$DBPNAM6= <>
##$DBPNAM7= <>
##$DBPOAL= (0..7)
0.5 0.5 0.5 0.5 0.5 0.5 0.5 0.5 
##$DBPOFFS= (0..7)
0 0 0 0 0 0 0 0 
##$DE= 6
##$DECBNUC= <off>
##$DECIM= 32
##$DECNUC= <off>
##$DECSTAT= 4
##$DIGMOD= 1
##$DIGTYP= 9
##$DL= (0..7)
0 120 120 120 120 120 120 120 
##$DP= (0..7)
150 150 150 150 150 150 150 150 
##$DP07= 0
##$DPNAME0= <>
##$DPNAME1= <>
##$DPNAME2= <>
##$DPNAME3= <>
##$DPNAME4= <>
##$DPNAME5= <>
##$DPNAME6= <>
##$DPNAME7= <>
##$DPOAL= (0..7)
0.5 0.5 0.5 0.5 0.5 0.5 0.5 0.5 
##$DPOFFS= (0..7)
0 0 0 0 0 0 0 0 
##$DQDMODE= 0
##$DR= 18
$$ [...]
##$SUBNAM0= <"">
##$SUBNAM1= <"">
##$SUBNAM2= <"">
##$SUBNAM3= <"">
##$SUBNAM4= <"">
##$SUBNAM5= <"">
##$SUBNAM6= <"">
##$SUBNAM7= <"">
##$SUBNAM8= <"">
##$SUBNAM9= <"">
##$SW= 18.0517328524113
##$SWIBOX= (0..15)
0 0 2 0 0 0 0 0 0 0 0 0 0 0 0 0 
##$SW_h= 3612.71676300578
##$TD= 16384
##$TD0= 1
##$TE= 0
##$TE2= 300
##$TE3= 300
##$TEG= 300
##$TL= (0..7)
0 120 120 120 120 120 120 120 
##$TP= (0..7)
150 150 150 150 150 150 150 150 
##$TP07= 0
##$TPNAME0= <>
##$TPNAME1= <>
##$TPNAME2= <>
##$TPNAME3= <>
##$TPNAME4= <>
##$TPNAME5= <>
##$TPNAME6= <>
##$TPNAME7= <>
##$TPOAL= (0..7)
0.5 0.5 0.5 0.5 0.5 0.5 0.5 0.5 
##$TPOFFS= (0..7)
0 0 0 0 0 0 0 0 
##$TUNHIN= 0
##$TUNHOUT= 0
##$TUNXOUT= 0
##$USERA1= <user>
##$USERA2= <user>
##$USERA3= <user>
##$USERA4= <user>
##$USERA5= <user>
##$V9= 5
##$VALIST= <valist>
##$VCLIST= <CCCCCCCCCCCCCCC>
##$VD= 0
##$VDLIST= <DDDDDDDDDDDDDDD>
##$VPLIST= <PPPPPPPPPPPPPPP>
##$VTLIST= <TTTTTTTTTTTTTTT>
##$WBST= 1024
##$WBSW= 4
##$XGAIN= (0..3)
0 0 0 0 
##$XL= 0
##$YL= 0
##$YMAX_a= 642259
##$YMIN_a= -627645
##$ZGOPTNS= <>
##$ZL1= 120
##$ZL2= 120
##$ZL3= 120
##$ZL4= 120
##$ABSF1= 10
##$ABSF2= 0
##$ABSG= 5
##$ABSL= 3
##$ALPHA= 0
##$AQORDER= 0
##$ASSFAC= 0
##$ASSFACI= 0
##$ASSFACX= 0
##$ASSWID= 0
##$AUNMP= <proc_1d>
##$AZFE= 0.1
##$AZFW= 0.1
##$BCFW= 1
##$BC_mod= 2
##$BYTORDP= 1
##$COROFFS= 0
##$CY= -3
##$DATMOD= 1
##$DC= 2
##$DFILT= <>
##$DTYPP= 0
##$F1P= 0
##$F2P= 0
##$FCOR= 0.5
##$FTSIZE= 0
##$FT_mod= 4
##$GAMMA= 1
##$GB= 0.15
##$INTBC= 1
##$INTSCL= 1
##$ISEN= 128
##$LB= 0.25
##$LEV0= 0
##$LPBIN= 0
##$MAXI= 10000
##$MC2= 0
##$MEAN= 0
##$ME_mod= 0
##$MI= 1.114404
##$NCOEF= 0
##$NC_proc= 0
##$NLEV= 6
##$NOISF1= 3.799351
##$NOISF2= 2.8
##$NSP= 1
##$NTH_PI= 0
##$NZP= 0
##$OFFSET= 14.38212
##$PC= 1
##$PHC0= -1189.432
##$PHC1= 14.79222
##$PH_mod= 1
##$PKNL= yes
##$PPARMOD= 0
##$PSCAL= 0
##$PSIGN= 0
##$REVERSE= no
##$SF= 200.129724274929
##$SI= 16384
##$SIGF1= 3
##$SIGF2= 2
##$SINO= 400
##$SIOLD= 16384
##$SREGLST= <1H.CDCl3>
##$SSB= 0
##$STSI= 0
##$STSR= 0
##$SW_p= 3205.1282051282
##$SYMM= 0
##$S_DEV= 0
##$TDeff= 0
##$TDoff= 0
##$TI= <>
##$TILT= no
##$TM1= 0
##$TM2= 0
##$TOPLEV= 0
##$USERP1= <user>
##$USERP2= <user>
##$USERP3= <user>
##$USERP4= <user>
##$USERP5= <user>
##$WDW= 1
##$XDIM= 8192
##$YMAX_p= 0
##$YMIN_p= 0
$$ End of Bruker specific parameters
$$ ---------------------------------
##NTUPLES= NMR FID
##VAR_NAME=  TIME,          FID/REAL,        FID/IMAG
##SYMBOL=    X,             R,               I
##VAR_TYPE=  INDEPENDENT,   DEPENDENT,       DEPENDENT
##VAR_FORM=  AFFN,          ASDF,            ASDF
##VAR_DIM=   8192,          8192,            8192
##UNITS=     SECONDS,       ARBITRARY UNITS, ARBITRARY UNITS
##FACTOR=    0.0002768,     1,               1
##FIRST=     0,             0,               0
##LAST=      2.2672688,     0,               0
##MIN=       0,             -627645,         0
##MAX=       2.2672688,     642259,          0
$$ Real data points
##PAGE= N=1
##DATA TABLE= (X++(R..R)), XYDATA
0 0 0 0 0 0 0 0 0 0 0 0 0 -8 5 -8 8 -8 11 -11 16 -16 23 -24 28 -32 37 -44 51 -59 66 -76 84 -95 105 -119 135
35 135 -150 167 -186 208 -231 255 -282 311 -342 379 -418 456 -504 555 -612 672 -741 819 -907
54 -907 1007 -1120 1254 -1410 1601 -1830 2118 -2487 2981 -3669 4680 -6294 9172 -15275 33041
69 33041 -182112 -627645 360320 564209 -221023 143126 642259 -95852 -285504 420044
79 420044 90612 -624547 -95790 316867 -288265 -302141 287543 51602 -303650 121386
89 121386 298015 -97095 -44413 306447 72582 -264348 34348 237404 -143592 -192835
99 -192835 202807 91009 -221716 15135 120836 -288953 -246916 206313 14699 -310540
109 -310540 83798 228651 -197935 -5182 398216 5109 -173143 296465 179554 -265706
119 -265706 -27099 106362 -319031 -214609 243709 -6556 -265760 140321 213452 -113295
129 -113295 78260 270377 -46509 -60562 217867 31280 -233360 -61625 41634 -138647
139 -138647 -114372 81910 27128 -81844 34096 74711 -54358 -26628 115306 57989 -97291
150 -97291 -23114 113410 -37867 -159884 30300 60447 -97119 47794 143575 -135457 -148107
161 -148107 147994 50186 -171103 47086 171973 -73850 -19886 200576 -31761 -165847
171 -165847 145135 125478 -154713 -6767 122965 -131073 -151027 80591 6808 -125216
181 -125216 54847 129052 -53824 -30139 118470 6132 -87867 50668 77144 -46357 -44494
192 -44494 18924 -37331 -104227 -19786 59648 -30824 -52971 74082 40160 -75082 16429 82388
204 82388 -40670 -27239 124054 49204 -98817 8995 67949 -91144 -43575 113407 -27195
215 -27195 -108092 75573 47164 -120133 -9247 98976 -30193 -31764 109925 27273 -101997
226 -101997 16384 62687 -79497 -35162 89500 -9870 -73490 29362 19531 -68932 -16579
237 -16579 60391 5333 -34314 39837 37213 -61870 -32406 50690 -1307 -32389 44995 39878
249 39878 -48288 -27420 44013 -13631 -61501 44389 60974 -51779 -9639 62649 -42961
260 -42961 -60205 64817 35030 -55740 18794 60852 -54112 -61085 49572 2040 -67723 43723
272 43723 63994 -57546 -18473 61528 -24518 -49500 52941 43373 -39284 -1646 43357 -36687
284 -36687 -58701 33161 17890 -46655 17713 48977 -33531 -34615 32319 10669 -30010 20389
296 20389 53369 -13489 -30723 29636 -6032 -60758 11798 42028 -31012 -19353 38267 -7570
308 -7570 -50107 13549 39620 -23974 -3453 61368 -5775 -55383 22622 16517 -53121 3984
320 3984 55108 -12987 -29564 31899 9008 -48198 6488 49807 -19579 -20967 45961 -4252
332 -4252 -56839 8659 24392 -28157 -648 46354 2798 -34650 9555 17001 -37668 -11540
344 -11540 42912 -3563 -28975 23812 11139 -37564 -3968 35654 2134 -15361 26548 15136
356 15136 -46056 -19138 23564 -24927 -25813 41180 18726 -28247 12866 32038 -17633 -11735 42879
369 42879 15540 -33482 8333 15692 -53127 -29748 28821 -12593 -25079 35568 24931 -25852
381 -25852 -1495 29326 -8562 -16601 34517 18380 -33925 197 21334 -30795 -22990 27031
393 27031 7943 -17487 11250 15972 -27393 -26866 17504 3866 -23676 21371 32651 -19802 -6481
406 -6481 31677 -1674 -19916 21815 21888 -23948 -15879 11761 -29738 -43484 19008 17100 -24368
419 -24368 17882 39579 -13285 -10312 29641 5990 -18072 16355 21004 -25201 -18247 15377 -19487
432 -19487 -33881 21171 23962 -12163 4534 14515 -12696 -9730 14469 3647 -17638 7128 29585
445 29585 -6302 -24867 5299 2614 -12865 9043 11969 -15271 -12518 7804 -8066 -28916 3754
458 3754 29044 -3359 -4387 28117 3632 -16173 12839 3597 -20600 8282 22041 -18639 -29436
471 -29436 6864 7937 -14598 9626 22999 -3909 9226 26812 -11511 -20644 11507 6739 -9389
484 -9389 -289 1918 -13157 -16698 -3305 -1225 -4420 8555 9905 -3278 2860 7576 -4146 -9019
498 -9019 -4502 8600 13435 -4432 -11233 -5488 -10486 -4215 4149 -5252 206 15675 7244 -6890
512 -6890 -1735 10323 7396 3025 11531 8097 709 5735 -9484 -23202 3002 12643 -7025 -6087
526 -6087 -1109 -4963 3628 1368 -13975 -6093 18680 18938 -3233 -7305 -1459 -6175 2039 5312 -14895
541 -14895 -7464 10222 -10022 -19480 -3180 -4030 -2042 11156 8153 3938 14975 14284 -4737 -6201
555 -6201 13929 10321 -4381 397 -7473 -15954 1865 351 -15225 2399 18031 8353 3119 2522
569 2522 -1804 -2969 986 2510 -3672 -3832 365 -7649 -10212 -509 1298 1175 1450 1493 7796 -433
585 -433 -16116 -9085 -4438 -5809 9353 8160 -9170 1353 16720 3291 -5896 9907 13171 -3408
599 -3408 1124 6084 -18158 -14019 12343 -4954 -12540 20871 17987 -8414 831 8348 -6944 -4623
613 -4623 8791 -4400 -16574 4516 7419 -19087 -10098 13637 5094 3684 12326 -1000 -9911
626 -9911 -2010 -2593 -12014 -12695 276 5684 -4883 -1620 7836 1853 1651 12055 10994 3590 2477
641 2477 3618 -8207 -17567 -412 5559 -10670 417 14408 -3425 -3323 12294 64 -7675
654 -7675 9627 9761 -9878 -7372 5204 -8252 -14310 8657 7349 -7172 8934 10980 -11377
667 -11377 -5424 5347 -7127 -8123 4763 3279 -7062 -3951 3882 -2128 -793 12285 7246 -1579
681 -1579 5285 1990 -7777 -6335 -3141 -830 -201 1051 5734 929 -4459 4315 3489 -3040 4816 7269
697 7269 -2967 -6213 -3061 -4562 -8637 -218 8315 -831 -130 10976 -728 -7856 5533 2207
711 2207 -6042 3658 5221 -5330 -5757 37 -2610 -5419 4281 8590 -1876 437 5650 -5273 -5122
726 -5122 3862 -423 -578 4529 1647 -2247 -3683 -1851 700 -1445 1129 3625 -2015 -2862 -1199 -4001
742 -4001 -2306 510 2362 4188 993 1571 2350 -4961 -2019 5398 1316 1816 4064 -2097 -4158 -230
758 -230 501 -1081 -701 4433 3637 -2130 217 -928 -6228 1072 4711 -1179 1144 2091 -3276 -3091 -2322
775 -2322 -1565 94 403 2427 368 -3591 -1331 -2629 -3892 2119 2865 1564 2216 -1618 -2240 348
791 348 -987 2021 3507 1360 3403 2326 -1348 -532 -898 58 3739 2741 2000 -426 -4148 -1594 -817
808 -817 -1851 1898 719 -875 2400 -1319 -4132 -1171 -1304 689 2948 482 -619 -2506 -3288 -1332
824 -1332 -2854 -875 2615 -68 -159 1279 -2935 -1013 1712 -6 3290 4381 1869 858 -1595 -1015
840 -1015 1676 637 2710 3090 -509 978 448 -3488 -1021 57 -331 2156 617 -1261 -1718 -3674
856 -3674 -741 1168 -174 2809 1501 -1983 52 -1754 -4593 -1324 -344 475 828 -1268 -832 -1850
872 -1850 -1991 2785 1633 824 5312 1944 -2453 240 -489 -1370 783 1888 2328 1280 568 1022 -3128
889 -3128 -1313 4391 743 -1222 2532 -826 -3234 -883 -1787 -1290 921 2544 1577 -3283 -1494 979
905 979 -3924 -2616 2252 -781 -436 1930 -2136 -2835 610 2369 1200 -262 3526 2971 -3647 -2208
921 -2208 -198 -3858 570 4125 -1329 -882 3382 1604 -1486 -194 4366 3411 73 2473 -593 -5671
937 -5671 -44 837 -5539 -433 3981 -356 -2567 -829 -226 -1999 -417 3193 103 -1634 3878 -456
953 -456 -6123 953 3458 -1123 198 1904 -394 -2216 -1524 -1068 -3761 -588 5989 468 -3250 3639
969 3639 2308 -2244 1998 3023 348 1405 2348 -1717 -5749 -985 2633 -4317 -2687 5671 624
984 624 -2370 2236 -980 -2452 3696 3743 -2240 -2612 2799 1001 -6004 -2216 2331 -1629 1307 4520
1000 4520 -2997 -2877 3698 587 -2972 534 4273 1322 -2500 196 40 -3564 1419 2662 -3623
1015 -3623 313 4512 -1529 -4617 -560 1814 689 649 3151 672 -2112 2965 969 -5298 949
1030 949 4442 -2186 -2173 684 -2168 -3768 -486 1586 -1018 1021 5647 -141 -3627 3824 2615 -3408
1046 -3408 1574 3281 -1603 -828 -322 -4342 -4713 637 2712 -2577 -1132 4094 -92 -2293 3116 701
1062 701 -616 3894 2339 -1752 -815 421 -1050 -3728 -1227 2651 -893 -1240 1197 -2355 -2449 2889
1078 2889 1049 -1230 1881 3500 1033 -1934 -1 1759 -1578 904 3113 -3168 -2518 1956 -2593
1093 -2593 -4285 707 1650 -814 355 2551 77 -1991 2399 1767 -2659 2110 3715 -3640 -2605
1108 -2605 670 -2585 -1796 1539 760 -598 761 2385 -580 -1846 2413 1773 -1344 1835 1133 -2456
1124 -2456 -793 -828 -1730 -310 778 1745 290 -1567 639 185 -1589 1293 2055 -285 1237 720 -1197
1141 -1197 -1546 -385 787 -1086 -902 2017 -780 -2892 924 -866 -2396 2652 2630 -628 1334 1949
1157 1949 -631 -1501 807 1109 -1291 285 1311 -3457 -2892 1341 -1992 -1561 2537 542 -367 1546
1173 1546 744 -177 160 1167 1329 -303 867 692 -2448 -1525 -363 -1439 287 338 -406 353 -667
1190 -667 -399 1104 -173 1044 3057 403 -197 819 -726 -1022 -288 305 -163 -1067 365 -455 -2974
1207 -2974 -12 852 -1726 1019 2457 -1155 -220 732 -1784 -773 1580 1277 23 -338 1103 -741
1223 -741 -1362 1367 -175 -834 2228 599 -1211 540 -356 -947 1129 696 1102 1164 211 39 -775 -573
1241 -573 170 -127 141 767 -728 -214 -479 -1762 371 839 -1002 849 188 -1945 -348 -538 -1418 -62
1259 -62 823 306 212 506 586 -866 -82 2224 519 623 2056 -1351 -1508 1040 -617 -730 1129 354
1277 354 220 869 299 -219 -288 926 812 -592 740 244 -2078 -441 -279 -1819 404 644 -647 190
1295 190 -292 -1009 -642 -913 -263 494 -264 -257 -821 -1065 251 -55 761 1846 188 1098 1615 -906 203
1314 203 987 -552 725 1566 -287 -496 -282 -643 -470 445 1012 224 -294 1202 -539 -1754 716 391
1332 391 -1033 1633 313 -1154 295 -288 -1422 -635 -110 -373 -1118 -911 -389 -1996 -863 769 -816
1349 -816 452 2800 939 769 1653 387 605 1285 309 80 -605 -595 -642 -1698 -460 590 -275 824
1367 824 838 28 875 663 276 1177 220 613 664 -1753 -1193 -31 -1896 -1504 46 -559 -849 -493 -422 -1062
1387 -1062 -711 1472 740 -1053 1855 1786 -1234 603 1363 -838 959 1973 -431 -958 390 -41 -1808
1404 -1808 -661 1363 30 -243 2447 223 -834 2051 906 -836 1177 1440 -816 -1124 -1352 -1164
1420 -1164 -1550 -925 200 -973 -388 1592 -73 -807 861 622 225 149 60 -171 -1094 -745 248 -1566
1438 -1566 -665 2185 176 -977 1332 1185 -503 41 1320 304 -412 1506 509 -2390 4 2280
1454 2280 -1700 -730 2368 -661 -1364 1006 -547 -2135 315 1285 -859 -966 1989 480 -1774 1344
1470 1344 1481 -1457 826 1101 -2265 -1537 200 -919 -1855 -422 1290 585 -31 1482 868 96 1822
1487 1822 1473 -833 49 447 -713 -1762 -1195 356 -586 -926 1698 730 -1082 1463 1137 -1518 355
1504 355 1712 -655 -1036 690 140 -1739 -60 1234 -1015 -657 2424 -652 -2516 1210 387 -2074
1520 -2074 883 1505 -651 57 1577 324 -1154 1190 1508 -1273 -294 1405 -1474 -1705 262 -702
1536 -702 -435 1341 997 -15 -73 874 1025 -626 -230 918 -704 -979 -190 -1213 -1313 -335 606 30
1554 30 -444 1342 1173 -940 566 1741 -915 -139 1547 -1017 -1533 467 -235 -1891 -173 877 -849
1571 -849 -835 1201 -111 -1513 1602 1522 -1343 1105 1817 -726 -315 970 -752 -1182 -57 -59 -1105 -584
1589 -584 320 -749 -851 1161 384 309 1335 631 12 417 -197 -74 -1 -420 400 -231 -977 -373 -169 -749
1609 -749 -304 389 448 9 488 809 -279 -4 1407 -231 -638 1265 -547 -1491 597 -351 -1273 161
1627 161 609 -653 -311 949 530 -598 751 1291 -569 408 1141 -1254 -658 436 -1105 -960 545
1644 545 -44 -198 273 202 226 229 1070 534 -3 574 -324 -803 -232 -670 -668 607 -408 -258 732 -335 -285
1665 -285 632 118 50 792 300 -187 -83 15 -124 -322 491 295 -853 660 -90 -1300 172 180 -1026 334
1685 334 731 -566 428 527 -126 38 381 461 -228 -121 276 -839 -721 64 -613 -325 1024 243 -92 1108
1705 1108 224 73 590 79 -278 -17 -277 -556 -810 -95 -192 -474 846 488 -248 832 239 -485 539
1724 539 92 -635 148 -215 -951 -344 -107 -144 207 637 716 -88 497 457 -365 410 500 -466 137 732 -851
1745 -851 -308 513 -539 -26 474 -162 -191 -84 28 -577 -386 595 87 -176 941 357 -269 872 107
1764 107 -724 295 -398 -1117 -401 -609 -443 -124 247 653 465 902 1083 78 322 357 -423 -279 55 -852
1784 -852 -227 -58 -834 307 465 236 550 992 297 233 -33 -2 -425 271 310 -547 -76 746 -327 -200
1804 -200 1002 -217 -422 730 -328 -818 -119 -193 -447 -204 536 375 -227 755 347 -912 -32 209 -1060
1823 -1060 -430 81 -750 -166 77 37 504 880 859 906 395 251 -296 -1008 -219 -252 -643 191 -185 -122 422
1844 422 -117 676 844 39 487 545 -779 -341 -97 -860 -855 58 283 -581 56 379 -482 -517 685 -159 -838
1865 -838 684 136 -926 356 616 -311 265 1258 180 -445 268 199 -893 -666 328 -533 -470 784 -137
1884 -137 -92 1090 573 287 474 379 -155 -535 -260 -175 -693 -512 288 -629 -52 313 149 192 253 282 366 -223
1906 -223 -20 247 -847 -493 220 -440 -273 642 303 -485 566 439 -193 79 561 116 -521 428 300
1925 300 -886 -10 664 -403 -48 713 -385 -359 192 26 -306 48 666 -301 -470 573 332 -577 363
1944 363 284 -621 56 88 -711 -410 23 31 -119 -102 530 175 -238 632 257 -187 153 346 -7 -45 -119 106
1966 106 -720 -431 406 -203 -508 432 75 -546 438 519 -372 280 583 169 -304 186 161 -959 -227 441
1986 441 -551 -571 659 -398 -345 537 203 -327 347 612 -224 -434 77 70 -658 106 460 -548 -128 464
2006 464 -503 73 110 -155 200 70 135 -59 -528 163 144 -339 41 348 21 -29 25 -2 -131 -236 256 194
2028 194 -273 235 467 -399 393 655 -362 101 304 -423 -272 10 -12 -642 -250 343 -130 16 636 59
2048 59 -328 480 84 -437 202 -53 -402 -383 -101 -359 -451 35 277 38 -120 381 -42 35 628 183 -35
2069 -35 504 65 113 99 -150 10 -373 -252 48 8 -34 99 -201 -121 61 469 311 201 188 244 -377 -200 342
2092 342 -343 -183 357 -367 -425 47 -49 51 41 106 42 -21 293 312 -229 248 201 -526 151 308 -407 21 -34
2115 -34 -37 135 356 61 84 33 151 152 43 92 1 -270 244 -30 -518 33 -412 -90 132 -174 -145 -13 -272
2138 -272 169 170 -156 57 191 38 -98 -78 -166 -335 -224 198 -13 -176 435 143 -259 370 196 -85 329
2159 329 259 65 118 15 16 -127 191 114 -315 -161 88 -221 -100 377 -226 -171 12 62 -96 -72 7 122 26
2182 26 215 -38 -245 -9 -100 -400 -61 -126 -98 188 -74 -80 234 -21 115 171 -143 61 286 -53 -189 180
2204 180 -156 -138 244 232 -68 -164 -33 153 -224 123 -39 -468 75 69 -161 -116 63 -166 154 70 -51 31 40
2227 40 137 86 -63 43 -55 -21 169 -163 -186 -26 -93 -178 13 -97 81 -26 -107 98 94 204 186 151 33 -19 -101
2252 -101 -154 -69 -202 39 27 11 16 -91 -248 -187 -215 -246 223 -57 138 -152 291 -65 -33 -89 61 -234 -39 325
2276 325 -271 -465 -98 -147 26 115 -66 -4 61 95 132 -31 46 71 -62 -13 -74 -333 -148 35 25 257 140 161
2300 161 -20 -205 137 -62 -38 211 -82 -221 -180 87 73 204 55 33 123 -147 -29 -34 -215 297 -48 -173
2322 -173 280 248 35 156 240 -48 -168 -128 -93 -235 -128 50 -146 -179 370 169 -58 296 24 54 115 98 45
2345 45 -302 19 -109 -403 -214 112 -76 -50 113 289 87 105 14 74 -12 -62 -30 50 -71 -16 -62 -149 -2 -58
2369 -58 104 159 -105 -104 12 -118 -126 -61 183 96 12 -7 86 -199 23 195 -295 -20 148 -235 88 94 -67 126
2393 126 137 208 243 -6 320 -86 -207 -78 -31 -397 40 143 -243 -122 -59 188 -134 108 21 202 -275 -126
2415 -126 62 41 58 -178 67 -33 -81 -30 86 -2 11 -53 -83 268 74 -134 173 80 -11 18 9 -62 -67 -9 83 -352
2441 -352 -49 123 -299 -196 156 -29 14 130 19 -145 146 110 28 -147 4 -250 -158 -3 90 -124 -141 207
2463 207 125 -4 112 161 -57 60 99 102 -133 119 134 -117 -7 50 -235 4 -195 -176 -98 -204 -169 -182 -188 107
2487 107 142 -113 211 84 -147 162 109 -111 28 -29 86 5 -54 27 83 14 202 121 -103 51 11 -16 64 60 -21
2512 -21 -148 -115 19 -266 -139 444 -138 83 83 59 -102 56 160 -158 226 -34 -40 -197 26 12 27 -125 85
2535 85 153 -141 111 -44 -106 124 -70 -40 -103 -27 70 -72 -84 75 51 -37 234 -157 -56 17 171 203 59 197
2559 197 63 -49 -120 68 -6 -38 48 65 -97 108 -49 -70 188 -18 130 -79 -35 168 -63 -103 158 74 -110
2582 -110 -18 -15 28 -21 60 -154 79 -34 58 232 163 33 88 145 28 193 94 24 62 -52 124 118 96 -92 199
2607 199 -32 60 -140 68 -275 -224 24 -117 -141 185 -50 14 153 96 121 29 210 57 144 161 105 -53 3 -286
2631 -286 -80 -62 -149 -28 31 -8 -27 5 9 4 167 -35 -152 34 116 13 -78 -192 21 -187 205 66 -56 181
2655 181 48 -104 17 -197 -99 71 -35 -7 190 -210 147 35 -72 -138 -201 144 151 -179 100 -160 48 -126
2677 -126 121 -98 -188 -8 -171 56 3 10 29 -35 -75 25 27 13 -136 -155 -63 40 99 -179 -29 40 -51 99 -194
2702 -194 84 -54 -80 -58 -355 168 27 25 -23 -37 286 45 -50 -73 53 -41 240 41 -121 -64 -9 8 108 39
2726 39 -153 -21 15 93 5 0 71 -139 -74 -103 35 24 72 99 64 43 -49 36 -157 -71 150 -159 68 -34 -71 -92
2752 -92 209 -67 -2 63 226 -142 -99 127 47 73 -13 103 137 -8 161 48 81 -29 -36 -78 -40 -59 -135 -149 -301
2777 -301 -23 110 -103 49 -187 208 -107 -33 -121 -7 56 -49 -148 -190 306 -60 85 221 -154 19 -32 -127
2799 -127 -112 -134 6 -5 -23 -42 140 210 40 63 22 -71 45 -132 114 111 -22 -201 -21 94 -195 -130 -73 -32 -57
2824 -57 -12 222 -3 -186 107 -16 -144 74 -52 59 145 30 -304 -28 31 -49 -224 -91 -10 -167 100 143
2846 143 152 65 55 -135 -37 -22 -78 -196 116 101 9 -161 -85 -54 -267 -198 -287 -15 -73 10 -54 -217 -277 -183 -111 146
2872 146 -39 83 -182 39 -106 -55 -126 46 123 -329 -148 -19 71 -12 91 88 23 179 -66 -154 127 243 92
2895 92 96 85 16 -81 -21 -29 -230 43 6 -517 -123 122 -47 -287 55 87 64 12 -95 -79 66 3 23 159 8
2920 8 108 48 -20 -31 8 81 -177 -88 -238 -200 46 -265 -41 59 145 72 143 -160 -17 143 -87 35 65 77 85
2945 85 -248 -140 92 -108 -114 103 23 -23 -80 98 87 150 50 103 -237 -41 50 -3 -1 296 4 -17 68 160 54
2970 54 221 -82 -25 -24 87 22 -102 23 210 42 -63 68 -85 -1 86 -9 205 -50 126 -131 107 134 97
2993 97 -205 -75 82 26 90 -83 32 38 46 125 177 62 78 19 0 72 114 -266 -29 25 -215 24 -5 98 105 -16
3019 -16 -98 -138 -91 213 -78 -243 -31 -64 -143 3 -41 -40 5 -119 109 -182 -249 85 -86 -41 -53 10 -68 -22 -59 197
3045 197 -22 16 -12 43 198 -34 -6 -29 166 -64 29 -98 -217 -264 -11 17 59 -95 -90 204 -145 204 102 -260
3069 -260 -131 204 22 -187 77 -41 111 110 -247 23 -107 140 -23 -122 -32 34 -167 102 -14 -217 -132 -18
3091 -18 -170 -184 -78 -76 -122 -55 -66 26 96 112 -162 -319 188 -31 46 270 67 66 -57 -138 -34 -93 50 -3 -21 -192
3117 -192 -17 -101 -61 -402 -83 -60 -17 -61 148 -74 -136 42 27 133 41 -93 -70 115 47 204 -29 11 -89 121
3141 121 31 -32 -25 -256 33 53 -178 -99 30 147 264 45 -55 -150 -123 146 -252 77 210 -73 -1 150 137
3164 137 192 -56 -46 -55 -115 -80 38 -176 -76 -67 39 25 -199 -210 -105 35 102 -41 107 -61 105 -69 75 -56
3188 -56 -88 171 -131 -2 122 -111 -50 -79 87 -5 197 -134 19 -398 -128 173 -57 -24 -92 16 35 111 -89
3211 -89 155 -47 -100 111 -177 47 120 58 -18 252 36 226 170 149 136 60 -139 309 4 -120 11 -258 -13
3234 -13 112 77 -227 3 142 -39 -397 -97 132 -178 -102 109 -185 7 -48 -28 20 74 -329 81 20 -34 107
3257 107 118 -4 83 -40 -24 -1 -203 -115 12 -267 -19 -38 -44 136 64 -36 100 -21 -41 203 -278 58 -95
3280 -95 -38 -85 59 -30 51 89 193 134 -40 -66 312 -67 181 214 -152 79 -6 12 124 -63 -102 -133 31 209
3304 209 52 -5 102 -10 64 83 -173 -53 64 52 135 2 -29 -9 -38 169 64 31 186 -19 -196 102 147
3327 147 -7 161 57 71 -49 -85 -112 -186 162 -95 21 43 31 182 -104 -171 256 4 88 -157 158 -51 82
3350 82 -177 -29 -58 -5 115 78 -235 278 -23 47 110 -97 -3 -19 120 208 163 66 63 -193 78 160 165 94 93 -76
3376 -76 77 -33 -24 1 -10 -159 45 62 250 -95 -130 118 40 -76 138 -132 -125 166 42 -11 117 -112 113 -334
3400 -334 -97 275 8 -86 215 5 158 107 76 144 100 165 53 -60 22 153 -291 29 213 -139 117 150 154
3423 154 109 -130 95 -158 64 120 110 -121 68 160 -88 136 29 -7 -72 -25 5 -46 144 -18 -89 78 34 27
3447 27 -102 217 99 -134 86 41 -45 62 99 -198 143 157 10 -16 -247 202 -170 -138 75 -114 -200 2 -103
3470 -103 -148 -42 4 223 -86 -218 36 160 -87 175 -227 -97 -68 -120 -69 99 26 37 -174 50 39 -161 -148
3493 -148 50 -79 -75 172 -272 87 -45 56 102 -309 196 238 -135 -172 183 -108 -138 -5 -265 107 191 -65
3515 -65 -84 100 80 55 -154 -24 193 74 -163 225 24 -125 -3 -215 -34 94 1 35 94 -85 23 -123
3537 -123 103 -6 -183 -23 -58 -68 -145 379 13 133 -109 -17 -70 -152 -21 80 -111 33 -155 -122 73 11 -286
3560 -286 97 155 77 79 -73 -150 -208 51 132 35 19 67 148 91 -24 40 29 -149 16 -150 -125 -27 157 42 -224
3585 -224 140 -73 36 -163 -43 41 28 -27 85 -62 -56 71 82 85 23 -15 81 74 -217 20 -25 143 82 -48 36
3610 36 -26 -4 -171 108 -310 -39 126 -236 13 15 166 -19 3 -101 -78 56 28 80 78 138 -95 -84 169 36
3634 36 105 127 93 -13 -267 38 27 -29 -140 -252 165 69 98 -19 18 45 176 -58 90 -85 -31 64 156 -59
3658 -59 78 90 -36 -194 -179 -6 -100 -12 -234 -44 168 214 64 -223 48 79 173 -33 -104 144 -2 -113 -78
3681 -78 143 -190 -68 -162 -118 -103 -93 189 -7 -99 128 21 182 71 -41 5 4 -44 -1 -30 16 -297 -164 -28
3705 -28 -110 -293 33 59 -63 -170 26 -20 16 -172 -134 -68 -109 132 -79 -157 -9 -143 -144 221 14 -116 7 -63
3729 -63 0 -19 -62 86 -94 -18 18 -138 148 -38 257 -78 267 19 -84 303 -93 145 88 126 -140 -3 -27
3752 -27 102 58 132 60 65 -8 223 133 75 83 -63 107 -133 -92 -51 13 -17 178 71 48 -85 -98 114 -56 -42 201
3778 201 -42 139 58 -235 -210 -32 -29 -89 18 -163 -23 53 -4 -146 -5 -57 -75 -27 -56 101 -244 -55 -69 -170
3802 -170 159 257 -226 -45 85 163 134 143 198 -116 142 171 66 -45 30 -109 -53 -3 -215 -133 107 77 42 159
3826 159 -283 124 21 99 90 -31 -149 -50 -104 10 -36 -21 97 141 1 210 149 -61 -13 98 -73 -21 -3 41
3850 41 178 44 -6 40 -60 147 -129 -95 72 59 -13 22 48 11 -240 87 15 -11 93 31 146 -140 -49 -122 61
3875 61 61 -103 -79 156 -122 -31 -106 124 -50 139 59 -76 -55 58 -108 51 43 75 -25 0 -135 2 -145 -141 42
3900 42 91 4 266 -7 38 119 71 -16 -16 -60 -104 -78 -116 -76 -6 -149 82 13 -40 24 227 -28 -23 -181 -20 -85 88
3927 88 -114 73 101 -16 -104 -120 64 -120 -57 -41 96 179 185 160 115 -86 105 -114 169 -33 181 -29 -6 -220
3951 -220 52 17 114 111 11 183 52 -174 -69 96 52 0 -125 114 -164 -27 -70 -177 -63 -29 50 8 -325
3974 -325 129 29 -163 152 -121 -255 -28 -42 64 91 34 10 106 130 12 -112 -112 73 36 -180 135 -146 17
3997 17 120 86 34 163 -58 -102 25 54 114 75 -13 181 261 -73 35 -333 -95 -10 -18 -88 59 -88 28 -90
4021 -90 -16 7 -71 -178 92 194 151 -75 42 -49 188 21 -31 100 182 169 -71 -121 37 13 -18 -14 63 87 -97
4046 -97 -116 -67 171 -136 104 -40 32 25 203 -140 -28 61 42 71 -90 83 -100 -17 -136 8 -19 282 72 176
4070 176 -24 -25 146 97 -31 89 -321 -94 -95 17 -168 -80 -80 93 50 -38 -118 -185 -65 -162 4 62 -12 -133 -129 -51
4096 -51 -15 -117 107 -63 -105 -167 103 198 61 -78 -86 -82 174 -3 -10 34 -32 6 59 123 -168 87 73 118 -104 217
4122 217 -115 -354 -237 -58 165 68 113 28 14 -35 73 1 11 28 -39 -61 -4 -18 116 89 -46 -217 86 289
4146 289 42 -139 -91 -11 -38 36 -118 -20 8 134 28 36 -183 65 184 22 164 -9 59 29 56 205 68 -157
4170 -157 18 2 -149 42 -109 49 106 173 194 -51 -91 43 -91 -188 -106 99 148 -83 21 88 98 77 -93 58
4194 58 280 27 51 -43 137 112 114 221 57 -164 331 -5 -19 19 3 82 4 99 22 -19 -43 206 22 -46 27 -45
4220 -45 87 243 -74 -16 -4 -179 -32 -38 109 109 68 89 54 -139 8 59 78 88 -111 112 109 73 -79 117 -249
4245 -249 158 153 -199 -86 154 52 -28 34 35 155 -70 -123 -29 -124 -63 34 -77 21 -143 140 259 -87 18 70
4269 70 -17 221 148 67 -106 15 -88 77 241 -374 23 -56 -137 -112 2 -308 16 -199 61 47 -58 -42 22
4292 22 78 117 31 72 -57 -83 62 192 -232 197 84 -64 50 62 -61 -266 -135 63 -56 -62 133 34 -116
4315 -116 52 -23 3 229 287 153 -193 276 -55 98 45 -59 104 -145 -136 -89 -170 -154 -46 -155 41 -230 -89
4338 -89 26 -39 196 21 -63 47 112 19 222 -142 -100 288 -192 41 -19 96 -152 -77 -36 -104 -21 -155 -77 57
4362 57 -26 169 15 70 60 -107 -270 -125 -40 195 -177 -71 141 -63 51 235 22 -68 116 30 176 -201
4384 -201 95 60 -73 -104 -202 -37 -52 -192 81 -25 -45 73 66 79 -180 173 112 -150 30 -181 162 -70 38
4407 38 75 -168 -32 -73 -68 -173 -40 -160 -281 -85 -119 93 28 -78 116 117 -18 -100 43 222 -78 -263 -10
4430 -10 -98 113 166 -53 14 29 -62 -148 59 -17 -20 260 217 10 -116 -86 -31 82 -41 -99 -49 -112 -93 157 -1 49
4456 49 15 48 55 61 -42 -80 120 -149 -119 -58 51 -130 212 103 90 16 -112 -70 152 -117 288 -197 117 76 -158
4481 -158 65 123 113 -153 179 -155 -98 28 65 -42 -115 3 95 130 -74 211 -59 -239 -6 14 -11 107 -280
4504 -280 119 99 -55 114 -55 -133 -133 -6 48 56 116 -62 -105 -143 19 56 -17 193 207 67 148 -27 -83 -32 -76 -186
4530 -186 -43 -226 30 -177 -109 -115 80 171 -3 -57 41 123 171 -21 119 -154 -260 78 159 69 50 -38 1 -75 -57
4555 -57 -65 -146 -117 14 -199 -26 -72 59 36 -328 -61 -95 33 140 87 48 -232 163 -187 -11 -119 -101 -30 27
4579 27 82 -38 4 0 -120 -62 -118 -16 120 -67 89 -9 21 -87 -64 -69 13 38 -93 19 -76 67 87 128 74 48
4605 48 33 -11 219 -9 -155 -35 82 -206 108 79 213 96 -29 -217 -236 -45 -54 -2 145 -73 4 51 49 -25
4629 -25 -81 7 -48 76 -216 49 21 230 -229 50 -12 -52 63 -215 51 -10 -25 143 191 -25 63 56 40 -42 300
4654 300 25 -13 -6 -130 -99 160 -17 101 155 21 82 -215 -62 41 -206 -243 -108 151 26 11 46 6 19 -190
4678 -190 45 156 -40 -86 8 112 -130 47 8 102 209 72 -108 18 50 50 126 128 -100 98 255 179 96 13
4702 13 10 -53 -2 -13 -22 4 96 -153 -68 -21 14 -143 182 56 81 -123 180 52 32 -25 128 -35 94 84 -121 -105
4728 -105 175 -160 116 -121 103 -20 -98 -175 127 -34 -14 12 -140 -15 129 59 56 65 -140 12 -18 131 -103
4751 -103 -100 -177 104 -71 -63 -56 -65 -189 -34 -68 -145 203 58 108 -16 53 58 -48 54 -20 52 -93 145 -6 30 106
4777 106 -1 132 -72 89 -10 -74 -93 34 -91 96 79 -142 145 40 -40 -59 -66 -72 68 -128 -92 -231 -163 -84
4801 -84 -90 9 119 273 138 24 82 -25 149 -81 -16 58 57 -19 139 41 -133 23 -160 -30 -142 -77 -189 -10
4825 -10 106 -51 -89 -20 -120 20 -75 108 -93 -176 -48 -46 35 -50 30 -206 18 185 268 -78 23 66 120 48 40
4850 40 139 -178 63 83 -147 -8 -16 -24 30 -40 -44 20 -1 -5 4 5 95 79 -7 58 19 -82 -172 -39 157 -9 -71 -16 162
4879 162 88 5 62 -38 -112 103 56 -103 198 -43 200 -46 22 -145 2 -52 218 -92 -49 90 60 -69 -101
4902 -101 64 -77 -9 96 34 -12 -72 217 -107 -127 -247 -128 -48 -115 161 48 -134 113 47 96 143 77 -125 48
4926 48 245 19 26 -110 -8 -62 30 61 126 -108 -7 -57 100 120 -4 260 185 176 62 96 79 107 -34 67 -126
4951 -126 -158 236 -22 -294 -231 -2 -40 -225 83 10 116 100 -230 73 34 -77 70 195 40 269 21 109
4973 109 -62 158 61 -41 68 52 143 -141 61 -130 39 -130 108 66 33 -16 -32 281 -43 -122 -24 137 50
4996 50 -14 329 85 68 -80 -15 -116 244 75 -193 222 1 -62 -169 122 41 -31 -166 -47 103 -30 -115 44
5019 44 -3 -104 82 70 210 -198 -80 -19 147 -22 -7 -103 -158 86 -60 115 124 101 204 135 34 217 -25 -53
5043 -53 195 29 255 -67 52 101 120 -195 61 -89 -193 -84 -74 69 20 25 51 195 20 -59 102 -22 168
5066 168 -31 -130 -146 -66 -164 -90 -68 -230 46 -252 98 15 -59 -18 -97 -84 -110 -28 12 -13 -195 -14 -56 -83 -21 71
5092 71 -91 -77 117 -125 -9 -61 73 4 105 137 -274 104 26 10 -72 104 -71 -63 -3 135 -122 -184 21 117
5116 117 -105 -73 29 169 -37 45 -6 -194 126 69 37 84 -35 -355 25 135 -10 -48 150 -65 -121 138 14
5139 14 -40 96 152 74 170 74 -24 -2 -170 9 146 -8 -74 4 210 221 -77 -82 -140 65 139 84 36 132 -9 -11 9
5166 9 -161 -37 -60 -65 92 -91 66 31 -32 -108 -27 -33 -131 -117 -149 -93 187 53 -27 35 93 126 139 92 162 118 144 -36
5194 -36 -52 -52 45 -16 130 232 139 46 60 122 183 13 -15 -8 -17 -361 -24 -57 24 -37 -125 175 -26 -15 18 -28 -6 15
5222 15 -87 -59 169 15 -82 113 -138 77 5 28 -74 -35 82 -97 28 -36 63 83 138 -136 22 4 15 -36
5246 -36 -80 -82 76 -86 114 59 -317 72 15 106 -58 100 -70 108 158 136 73 247 17 98 123 27 38 27 182
5271 182 65 151 -39 21 132 54 47 -19 -61 -155 -20 -152 92 -158 168 116 90 250 -56 95 149 -93 -59 -85
5295 -85 90 -57 -33 -43 -88 -109 -61 209 -50 -34 -11 231 -66 203 225 68 -150 -147 -191 -31 -349 -8 -108 99
5319 99 -75 5 70 49 -322 -186 58 -189 211 193 -42 -144 -3 32 -20 -47 -114 -112 55 -120 143 68 48 164
5343 164 98 291 -5 173 101 -33 10 98 -183 240 190 -87 37 67 -78 -410 -217 78 227 -60 -170 128
5365 128 -36 182 -1 13 153 41 103 30 18 -59 -53 -85 -85 -21 -32 -65 252 -67 16 10 -1 87 -49 -74 -108 17 -196
5392 -196 34 -138 147 277 -99 87 16 -65 -3 23 -151 -261 -54 124 78 62 93 -202 14 222 -12 -60 -90
5415 -90 -112 43 127 75 29 25 -110 9 -60 -11 114 -21 -38 -112 -170 -32 -27 94 105 20 -191 -42 77 -61 -47 -82
5441 -82 -93 172 78 -88 108 8 -165 -23 52 -170 -79 105 160 -44 48 -100 -83 -107 -91 77 126 -93 -19 47
5465 47 11 -253 -25 -164 -84 138 5 -143 -41 -46 24 -71 137 -136 175 113 -16 -77 56 -96 -45 106 283
5488 283 -188 -26 -9 125 25 29 -101 -163 36 43 -9 65 -22 -5 143 195 -5 -30 -36 -225 58 -90 -116 53 -83
5513 -83 5 134 -91 -169 -63 -62 -67 -78 16 79 -67 102 -24 -172 39 -19 34 164 -24 -374 62 111 21 -113 -26
5538 -26 134 54 75 43 -10 -133 -176 -118 -279 262 240 25 259 91 1 13 19 70 -154 -235 26 101 -248 6 -202
5563 -202 -49 42 32 -53 157 135 19 -65 30 21 -70 122 42 135 -28 48 -155 -148 -149 -38 2 2 -43 -35 -97 146 32 107
5591 107 -137 39 -122 -54 253 123 -82 -18 2 -17 -133 131 -40 71 41 -15 -193 -61 -115 -17 44 69 33 5
5615 5 -44 -65 200 114 53 31 -9 -63 92 11 73 35 -7 100 202 67 25 15 32 122 124 191 24 -10 221 -92 137
5642 137 16 234 7 117 -1 -94 -84 207 28 9 87 82 -71 -138 85 -65 23 142 0 87 89 147 67 -226
5666 -226 -279 -79 -187 -88 125 -59 30 -79 14 -194 -93 -54 77 13 55 65 -112 -93 15 -53 -30 -82 -250 20
5690 20 15 -50 -79 115 21 -67 -58 -31 -91 -201 -185 72 -84 -114 18 129 92 -129 -95 -78 22 56 -96 -4 18 -143
5716 -143 131 -50 19 -99 130 -37 -225 -83 126 20 30 -61 7 55 -65 25 56 -133 -84 -225 -64 -199 -72
5739 -72 -49 -56 -23 44 -119 -13 -78 45 94 -87 246 -188 -10 66 -75 -109 -77 156 -100 -105 48 252 -59 75
5763 75 120 153 148 -24 -10 190 -117 -214 17 -73 -107 -94 99 86 -42 -264 57 55 -81 225 -95 85 153 -61 -57
5788 -57 51 87 101 -4 68 96 60 -191 -22 -32 125 196 -22 175 -34 -46 95 53 201 9 -33 -51 52 -95
5812 -95 166 119 -44 167 125 363 -62 -11 4 149 141 100 54 -92 3 258 0 105 -99 -110 -55 -154 -43 95
5836 95 152 -41 78 -136 -12 121 67 -45 66 41 51 -53 301 55 -58 79 32 -208 -25 54 103 233 -140
5859 -140 -219 225 -196 222 29 -20 -55 37 -105 -156 94 -134 107 90 72 -131 -24 92 128 -46 103 -97 96
5882 96 169 -41 -80 -20 -162 -92 154 -218 33 -252 -15 -60 -92 17 -129 -7 118 203 -147 -45 87 -19 63
5905 63 213 7 16 -159 72 -112 118 -259 124 -56 180 -52 -118 109 -204 -4 -34 225 11 -113 -49 -175
5927 -175 -95 28 99 -14 5 129 145 146 -144 -87 -57 79 -21 84 -11 33 39 1 73 127 -18 152 144 274 227 90
5953 90 97 -229 184 148 -12 -198 11 -8 -33 -119 130 -78 -30 144 -46 162 114 -27 -8 -88 187 56 230 -222
5977 -222 -29 -100 143 -33 -80 -20 -172 -90 -183 -106 16 91 53 152 22 49 -155 -90 219 71 190 -42 -114 -207
6001 -207 20 -27 -122 124 -37 34 217 17 16 76 -77 61 52 148 45 66 -206 -99 -227 -79 -70 90 -127 -20
6025 -20 89 -146 -61 -35 87 -41 57 185 -26 -196 -33 -69 -7 5 39 -19 -8 3 -17 125 -27 -92 -13 121 -12
6050 -12 -134 28 145 81 76 -3 37 -81 93 99 88 -2 80 -175 -56 -23 244 135 200 58 -22 102 -230 -114 -30
6075 -30 -81 -25 162 33 -59 23 -42 90 -81 -123 -111 53 -148 93 -109 63 -36 -53 -117 5 -149 -155 -26 93
6099 93 126 -27 152 -99 64 45 -12 128 361 73 129 10 -240 -54 19 -73 130 -3 126 -141 37 -103
6121 -103 -27 -35 53 -229 36 22 50 69 -40 -13 73 -126 228 -72 87 -137 -162 -215 181 -243 215 78 44 47 -32
6146 -32 296 357 -208 -192 26 53 38 -4 -221 49 56 -55 -23 47 -82 -123 20 140 -84 -37 225 39 113 -158
6170 -158 -17 124 -129 -69 124 -243 52 15 -114 -65 108 29 -78 -141 16 -57 -192 -6 59 -122 45 -147
6192 -147 120 -195 -138 -216 174 101 -72 42 -22 112 227 -25 78 85 -64 121 -66 -121 -96 -75 -148 93 173 -186
6216 -186 -67 125 116 45 -9 15 -7 -58 71 -178 -6 82 -11 -22 51 -390 -123 71 -7 -198 113 -31 -180 13
6240 13 -137 12 65 -9 -183 -70 18 -195 151 228 206 -58 -40 -140 -135 10 33 189 -70 -134 -91 128 37 54 -94
6265 -94 40 114 99 -87 177 -196 -57 34 -99 50 112 20 -117 77 -90 -69 -179 -48 145 123 -47 -19 -114
6288 -114 88 -14 -35 3 -165 60 27 45 -87 100 -33 -148 101 238 53 -158 27 51 12 136 104 -124
6310 -124 116 -110 32 -22 196 -125 -34 -110 -41 -124 15 47 -39 -76 -208 96 -280 -60 -70 -88 -31 39 -44 -26 80
6335 80 -130 163 -118 -192 114 -23 125 -193 -21 38 133 -42 46 -168 -184 -85 34 120 -8 -164 -35 86 -159
6358 -159 152 133 -47 197 152 -66 -50 -119 -253 105 -75 69 -53 -41 -98 233 -39 -41 30 -191 46 65 230
6381 230 48 184 -51 225 -76 49 164 -48 -11 -41 0 -2 35 -144 14 -21 406 -65 -62 210 -61 173 0
6404 0 -222 111 103 -156 -130 -75 -46 -27 -25 -85 -6 160 -36 60 12 -76 183 233 111 115 94 2 -75 -193 -54 -153 -87 -25
6432 -25 -117 -64 -77 -14 27 -162 18 46 177 15 -115 -45 30 -82 22 44 -30 -110 11 61 -26 -8 -177 58 28
6457 28 -146 145 -42 -137 184 364 155 304 -92 151 108 15 -102 40 42 112 151 -132 134 -25 -30 -111 -65 98
6481 98 78 -205 -12 39 118 -189 -74 114 13 -34 -33 143 -28 -155 -56 -61 -37 57 25 27 -204 -157 -33 -62 187 69
6507 69 -108 34 69 -102 39 226 -145 224 -217 62 103 243 -74 33 102 -193 81 133 81 -101 -90 -30 144
6530 144 -215 33 174 57 -61 19 86 -157 -55 -114 211 86 -88 65 -3 82 -102 -60 61 -199 12 -23
6552 -23 81 -12 90 155 92 141 51 65 -149 -16 -27 71 -75 -43 152 -70 -121 122 -36 94 37 149 84 -189
6576 -189 37 -36 92 121 30 -118 -100 -210 -13 -115 61 64 -57 -156 184 -69 -15 -58 -116 -92 101 -118 82 111
6600 111 -101 28 129 -146 17 104 41 28 169 -128 -87 30 -125 22 19 78 130 -48 23 41 301 149 77 -201
6624 -201 -62 95 119 -86 76 58 -16 -28 -163 59 70 -72 -12 -18 -47 63 -29 -104 -113 153 -222 -81 -63 132 -157
6649 -157 -149 167 143 -36 -172 -126 -89 -136 153 56 149 69 -219 91 -11 -57 181 -43 -193 -82 -156 -125 -12 4
6673 4 -58 -22 -313 59 32 29 116 -42 1 144 89 -250 -13 -171 142 46 64 174 -31 111 -75 11 -114 105
6697 105 -136 141 -87 79 -89 89 35 -47 92 85 29 -4 140 -108 148 -148 -17 102 -102 50 26 8 12
6720 12 237 87 -94 94 -179 -23 97 -149 -75 239 223 53 210 182 54 -34 -62 -169 126 148 3 72 -26
6743 -26 130 -111 58 -82 87 118 -214 -55 39 -123 -93 -46 101 -44 41 16 -27 -51 -12 80 -56 346 -133 78
6767 78 129 -82 31 -142 -41 -5 -23 -51 119 63 82 -16 23 259 -30 216 121 -28 49 -78 68 58 123 77 18
6792 18 107 179 70 163 -62 -93 -80 62 -30 -120 105 -66 32 10 56 -88 -62 17 -118 -83 -181 14 110 -42 -196
6817 -196 -55 -46 -66 -114 -206 65 -179 76 184 117 -36 90 -77 43 405 3 -6 -171 -185 182 27 0 -192
6840 -192 2 10 19 -149 -250 -39 227 10 93 38 4 11 -79 40 -33 45 66 64 -213 -102 -92 36 -104 80 -11 96
6866 96 -66 107 -75 -72 108 165 -16 -18 -121 -29 -33 28 75 -43 157 240 197 35 23 56 -53 14 161 31 -46 -122
6892 -122 124 -27 31 83 60 -245 -37 211 -32 67 70 71 -207 52 59 -245 92 -91 -75 -169 -193 27 -42 76 -25
6917 -25 -59 61 -28 -131 -34 122 -150 -94 -303 -44 79 -129 120 15 22 93 -106 -124 -25 -145 169 200 -26 -111
6941 -111 119 -18 -174 67 100 203 -86 -51 -41 -10 -78 48 164 22 -230 6 -133 -101 55 -112 72 238
6963 238 -5 107 -182 72 229 73 134 75 -138 -74 1 118 -70 94 -102 -230 -77 -11 146 8 -84 -162
6985 -162 -38 163 35 -23 89 -86 -74 7 17 62 -29 3 12 41 15 91 1 -283 -107 143 -248 4 70 49 -61
7010 -61 20 38 -158 227 73 -44 -30 -9 -47 -171 -56 97 49 31 26 -70 172 34 -30 21 173 128 77 59 144 87
7036 87 -99 50 -166 -6 -130 329 76 64 -97 -68 -176 31 -64 -185 85 -211 -21 17 -84 24 -29 -134
7058 -134 -54 -118 80 -141 41 -65 -50 -38 69 54 -11 289 -42 71 -205 1 21 147 -81 70 -108 -65 6
7081 6 44 172 81 153 195 105 41 25 -125 86 79 202 -54 -59 -114 -96 26 130 -5 53 -32 106 -15 118 111 101 178
7108 178 60 133 -254 180 25 -52 -202 90 34 92 92 65 -140 37 38 -242 -154 -126 49 5 -149 117 140 49 194
7133 194 48 119 242 -37 265 -86 171 -54 -111 -97 -35 243 -135 31 50 -93 130 -5 -146 -153 -249 28 -142
7156 -142 -48 49 -46 -50 23 -217 40 -139 50 4 86 -133 6 121 170 -82 -43 -28 -61 80 -45 55 93 37 83
7181 83 -106 19 -47 39 57 101 39 112 12 166 83 49 37 -110 32 -77 146 24 99 145 -68 108 -56 313
7205 313 202 54 126 9 -53 -57 244 -77 -6 212 -35 91 92 25 45 -57 -124 -142 -77 57 36 -53 -73 15 70 85
7231 85 139 132 -12 69 228 -89 -23 194 -128 67 49 -31 63 156 255 0 -85 87 32 146 119 -67 -5 327 -115
7256 -115 94 -170 131 -164 -125 9 173 -155 13 115 -275 219 99 246 -54 -113 -133 12 189 -29 10
7277 10 -3 260 -124 52 145 18 -128 180 -80 -16 -17 -58 168 -274 -49 3 104 194 333 -244 -90 -172 -62
7300 -62 -208 -73 -68 70 -47 135 86 -95 19 -9 208 14 88 -104 -13 -28 -84 -101 -13 102 77 293 55 -37
7324 -37 0 24 -83 45 -48 56 -183 -156 -193 134 193 -121 -139 24 -41 86 -54 10 117 -76 -100 -117 145 -76
7348 -76 -48 -3 27 36 25 24 -86 193 7 155 -55 -48 -4 -164 227 2 -27 -58 -121 -141 29 30 87 -131 -36 -76 -8
7375 -8 169 -120 -95 -50 -179 10 -10 60 -61 87 -149 -100 -3 113 -86 60 -7 2 -63 78 107 52 76 -47 -208
7400 -208 193 -12 -62 -35 94 129 -96 87 -44 37 -62 -10 43 15 -112 -7 198 206 37 -48 207 -36 63 -109
7424 -109 232 -93 -160 -154 -87 -8 200 -49 -39 -96 51 -125 -13 81 -111 134 58 79 -194 25 155 12 -10 -24
7448 -24 82 -68 -149 -18 -119 212 -224 -182 153 -15 114 75 256 38 -191 -9 -29 62 -71 -25 -21 4 112
7471 112 -379 33 18 67 98 -110 -248 -80 -65 160 -25 127 104 -144 -52 -10 -54 55 -62 138 223 -177 72
7494 72 -175 -47 -51 59 -103 37 69 -38 -57 -80 -134 30 166 1 248 -214 -24 134 -50 130 186 -42 -68
7517 -68 -173 10 104 117 -33 -187 -44 124 39 -274 -47 -23 138 -25 165 15 135 86 -97 -26 -26 10 -109
7540 -109 169 58 -9 14 -128 112 -118 166 -14 105 139 85 -235 -38 -115 -98 6 -27 -14 -24 62 60 16 153
7564 153 22 -112 157 82 107 -242 107 -139 9 45 37 189 -82 194 -161 133 -8 201 -15 70 -50 -80
7586 -80 236 -110 50 12 -163 224 274 68 -23 136 197 -18 -4 23 -86 12 -126 -101 81 18 -87 -97 -143 -41
7610 -41 -19 66 -27 -4 7 -70 -134 114 202 160 -125 84 -208 -156 87 -157 -131 -68 21 -168 62 14 -40 -61 -61 35 -172
7637 -172 10 -154 144 -115 36 -81 -129 -30 -181 98 -87 -99 -86 -80 79 -153 -171 115 61 40 37 86 -181 8
7661 8 211 -72 40 -136 -14 -29 99 108 67 -108 -69 -63 -59 112 85 -85 211 -6 32 143 -76 49 -228 -39
7685 -39 129 -64 -163 -102 -148 90 -11 257 88 -106 -59 -171 -177 -89 -81 -148 -27 -17 -13 10 121 24 -112 4 -97
7710 -97 -50 -57 -72 -16 192 -239 -364 -173 -92 106 42 -139 14 122 -22 49 126 -1 -28 -90 85 -118 -58 74
7734 74 -316 -38 -4 185 -125 77 36 86 79 93 123 146 140 -261 -29 23 161 131 146 -106 13 262 82 -176 15
7759 15 26 -82 -3 -83 21 -90 140 9 60 -127 13 -140 -112 -44 74 226 -51 -170 -135 73 136 -77 205
7782 205 70 -87 115 179 -3 -108 -32 -90 -102 -249 167 180 -15 10 -132 91 207 -29 -127 152 -17 3 251
7805 251 -29 -105 -144 144 -1 54 98 -75 120 -9 -183 102 181 -1 116 -73 -28 105 88 -99 -30 -105 -102 12
7829 12 120 30 176 266 -193 -11 29 -221 70 -53 -143 97 16 73 -3 -74 -73 59 -192 197 118 141 -19 59 130
7854 130 -121 -203 -51 -93 33 -111 25 64 -8 144 -118 188 117 4 -82 181 -8 -20 -94 27 0 144 -209
7877 -209 -159 -98 -18 -21 30 13 31 -49 -27 -22 4 101 -132 -7 30 268 -180 -50 65 -32 -143 -246 -3 -42 -123 -146
7903 -146 -365 -198 -28 112 -76 280 -172 -24 -51 84 221 -16 60 34 -249 72 -79 -40 154 -240 -67
7924 -67 -208 19 89 47 -154 68 -224 -208 42 58 -2 11 -93 -29 4 -84 -78 25 -33 -11 -104 254 45 -138 -51
7949 -51 11 56 -86 -41 -158 151 97 -196 -45 -110 -48 -163 113 -29 -223 62 13 128 60 305 -11 84 90 84 -383
7974 -383 -191 81 -11 -118 63 174 -191 8 133 158 156 -2 10 125 -14 79 123 69 195 -105 -234 -28 -7
7997 -7 -108 31 -70 103 -137 158 69 0 -52 -313 130 -157 -53 96 71 0 -81 -37 -56 167 178 -49 68 73
8021 73 20 -125 -86 97 44 -31 -231 95 -7 -30 -55 -2 74 36 -22 114 -13 253 -27 -16 -161 79 -23 144
8045 144 -152 -63 45 -35 34 23 -109 -53 -128 -55 -84 -175 -107 266 141 -41 19 -8 90 147 -44 -271 -276 69 -58
8070 -58 -261 47 -87 -151 178 146 -53 -11 125 28 101 44 -119 73 40 -68 -34 -162 -86 -210 86 7 -125 -106
8094 -106 -3 -47 31 180 -152 -125 40 120 11 28 -61 157 24 -21 -169 98 173 124 141 -138 6 -20 -65 59
8118 59 158 44 145 133 357 -69 158 8 -56 -246 -37 -146 -35 -147 103 -195 -289 -42 -63 -234 105 -65
8140 -65 81 61 -33 104 -52 -95 -22 -47 -202 162 82 -73 222 -3 -122 42 -31 186 37 -46 50 115 -145 49
8164 49 31 30 -47 -147 -274 73 75 -41 -131 83 136 144 92 -32 -122 146 -206 35 104 -19 96 -136 -72 63 117
8189 117 -73 -146
8191a46
$$ Imaginary data points
##PAGE= N=2
##DATA TABLE= (X++(I..I)), XYDATA
0 0 0 0 0 0 0 0 0 -8 8 -8 8 -16 24 -24 32 -40 48 -64 72 -88 109 -128 153 -182 212 -248 289 -336 385 -441
30 -441 505 -577 655 -742 838 -943 1060 -1188 1327 -1480 1648 -1832 2032 -2250 2489 -2749
46 -2749 3034 -3346 3686 -4062 4473 -4930 5432 -5992 6624 -7332 8138 -9064 10136 -11403
60 -11403 12923 -14779 17117 -20159 24298 -30280 39727 -56935 98332 -411325 -163388 434947
72 434947 -507624 -245567 459147 13805 -310412 502005 394249 -344753 30762 563584
82 563584 -114642 -378358 177500 41304 -448845 -61224 235559 -134825 -162141 244382
92 244382 100404 -238029 25011 302156 -52025 -179984 218527 195232 -168923 12261
102 12261 222877 -111440 -161778 257594 103022 -342666 -81547 145670 -284047 -242108
112 -242108 230452 -26014 -275159 229513 295901 -164567 19989 299238 -82843 -142978
122 -142978 262428 24689 -388814 -62561 117229 -236479 -123268 200161 -20419 -82493
132 -82493 252376 159977 -128951 38066 193654 -18745 -87083 75928 11212 -154667 -61767
143 -61767 29459 -72141 -50522 105432 72295 -73506 -15937 122191 1507 -142219 29204
154 29204 113644 -68261 -13696 116053 -107686 -165831 132573 87844 -184275 -26832 149188
165 149188 -92556 -128636 124109 -7792 -174724 130764 205712 -99483 -14710 184417
175 184417 -43639 -133039 103547 58272 -137803 -12664 89489 -94357 -109405 77261
185 77261 22766 -83328 63207 128105 -9707 -27053 53981 11910 -60633 175 67352
196 67352 -26600 -87654 20750 16343 -106842 -35388 67992 -32591 -51701 93229 50646
207 50646 -103260 -9003 103557 -31391 -39356 123217 17864 -117026 45162 65664 -120545
218 -120545 -44647 101360 -18992 -69308 73385 34172 -102369 5824 101451 -32438 -34049
229 -34049 100273 15925 -87721 13714 36436 -60906 -23088 62576 8655 -50920 12122
240 12122 31050 -57164 -38720 59801 19801 -38768 26078 35685 -49910 -36659 45707 9872
252 9872 -49995 32661 65531 -52509 -43727 53173 -22400 -64773 61233 56707 -54486 -1742
264 -1742 63835 -35544 -62192 54342 34777 -61230 18480 62155 -63142 -53860 53271 -8658
276 -8658 -55989 47104 55522 -38661 -15131 47366 -13873 -49129 39792 42614 -41748 -3737
288 -3737 42025 -37933 -53132 25700 17593 -31461 7614 46585 -10840 -37719 28095 20969 -38479
301 -38479 17175 58542 -21893 -35651 27067 -5389 -55015 2937 42159 -19231 -22050 45883
313 45883 1758 -58728 18224 41970 -35324 -3005 55836 -13519 -49856 15297 13885 -42009
325 -42009 1624 57244 -5525 -31237 37385 8850 -55439 5546 40484 -20295 -12721 36751
337 36751 -937 -43545 2149 28807 -18902 -9261 47085 5795 -40228 8067 11732 -39319
349 -39319 -11006 37350 7573 -18657 19286 22488 -31490 -14444 38302 -3691 -30954 25698
361 25698 9831 -51085 -16347 21433 -17825 -16505 43006 31215 -22114 10678 36959 -25680
373 -25680 -22517 39722 885 -39700 11560 10853 -44333 -21169 25988 582 -15196 31774 27385
386 27385 -29322 -6295 30236 -16060 -22247 31321 16509 -21499 2399 16001 -19865 -22620
398 -22620 21827 14548 -25893 1605 19811 -32323 -28699 23594 5018 -16841 26779 37645
410 37645 -7764 -8306 24376 -5303 -32904 16382 19479 -38442 -16340 17979 -28413 -30911 24727
423 24727 17041 -10425 20931 33545 -11496 -15614 21432 -3171 -30110 16770 24765 -23532 -14399
436 -14399 10078 -11518 -11382 16737 10532 -11953 4016 24886 -7443 -29584 6524 16753 -4752
449 -4752 9940 18406 -9358 -11348 9469 -2217 -24633 -2120 21503 -12027 -25923 10565 1626
462 1626 -21844 11436 20121 -6620 12628 28368 -12692 -29721 6337 11201 -19554 -7289 13220
475 13220 -12132 -9358 17845 -6423 -16470 24204 26094 288 4993 9359 -6639 -11772 527
488 527 3491 -5572 -425 2802 -11201 -6935 4243 -3981 -5674 5063 13716 13828 -3896 -12733 -1025
503 -1025 -1482 -1830 5416 -4622 -7796 3351 -5262 -20043 -11061 4993 4803 -662 7213 9311 349
518 349 5014 1879 -8759 13136 24340 -3081 -9356 1168 -4018 -2051 -660 -11928 -5367 16350
532 16350 12913 -10858 -13322 3162 4814 7539 14194 -1995 -2127 16290 -2232 -20110 -2952
545 -2952 -1666 -10456 -2786 -6116 -13861 -4532 494 -10061 -5927 18703 20608 1724 4282 5294
559 5294 -6552 3951 5387 -14867 -5365 11119 -2509 -10385 -3136 372 4416 10953 12190 5549
573 5549 1256 3519 -3674 -9723 -155 2538 -1279 505 1109 4893 1941 -10911 -3181 6828 -476
588 -476 1983 -511 -20103 -14217 4770 -4279 -11772 6938 16609 1849 1473 11227 -6357 -10571
602 -10571 13832 1317 -18268 8142 10815 -19132 -8886 12167 2739 2959 17702 8128 -8208
615 -8208 4927 9049 -18496 -16345 11249 3676 -6219 5929 1255 -5710 7139 10421 74 -2750
629 -2750 4059 3607 -12422 -16310 -5752 -8421 -9323 4196 7604 2121 3839 8054 2212 -4999 6916
644 6916 12577 -8334 -8679 6442 -8980 -14772 6388 2964 -5948 11770 15772 -4064 -5162 8776
658 8776 -1023 -12712 5747 8688 -11417 -726 9681 -9688 -5322 13255 3319 -3441 7641
671 7641 3860 -10411 -10158 -1377 -4822 -6815 6107 4966 -4919 3021 6009 -2958 -624 4826 3306
686 3306 781 -2324 -1667 -4502 -9781 -555 4681 -1038 5561 10550 139 -3743 1271 649 -3881
701 -3881 39 5900 -3539 -8718 2890 -2131 -10056 5152 8471 -2294 4922 8387 -4041 -6128
715 -6128 1266 -413 -4578 1894 6524 -4241 -5597 3728 -2959 -4652 6636 4122 -1012 3629 862
730 862 -3978 -2766 -153 2901 1667 1640 4048 -1508 -3814 -368 -2271 -1928 1171 381 469 -2552 -3793
747 -3793 -523 -3844 -2339 6854 3200 -814 2564 -2157 -4801 954 2181 148 312 3076 2913 -3494
763 -3494 -2341 863 -2945 2033 7285 -523 -1397 2024 -2554 -2549 923 1297 2364 1744 1374 -263 -4354
780 -4354 -2215 -496 -2308 2141 2824 -1648 -1379 -3364 -4404 -76 -199 235 2397 -967 -637 400
796 400 -3201 -1555 1280 1663 4438 3182 670 -209 -2809 227 2850 582 2552 2124 -1629 462
812 462 -630 -4068 179 2008 1638 3182 508 -1673 -1498 -1659 652 545 -319 2453 -977 -3706 -1551
829 -1551 -3843 -3584 873 -421 21 1895 -1541 -2584 -2172 -1111 2730 1832 1485 2596 -842 -812 1410
846 1410 -1531 927 4012 1772 2674 1234 -2144 -1521 -1967 73 2649 728 1244 1493 -2377 -500
862 -500 919 -1606 1485 3039 738 62 -2722 -3519 -2784 -3434 509 1074 -1911 1883 316 -4214 -614
879 -614 1399 -373 1323 1776 372 -611 -1867 -815 -1559 -651 5458 2893 -1335 2608 902 -2434
895 -2434 774 862 59 1971 2192 413 -2916 -1650 2701 -544 -1262 3952 974 -2371 104 -3102
911 -3102 -4631 -148 1321 58 -1202 1374 2374 -3062 -2173 2650 -681 35 3575 -2723 -4833 271
927 271 -935 -3640 -866 3924 3740 80 1824 2097 -2416 1808 5020 -2022 -100 4830 -823 -4377
943 -4377 -1239 -44 -617 6 2845 431 -3108 1290 235 -5944 681 5394 -617 -689 2384 -54
959 -54 -1950 -784 379 -1394 -685 4212 -1173 -7190 -185 1223 -4097 421 4212 1030 1239 3107
975 3107 284 -2653 1032 5101 -1480 -3535 4113 233 -6042 -500 -125 -2301 3460 4394 -1524 -2180
991 -2180 3212 2554 -4403 -1951 4335 -153 -1525 2094 -3606 -4873 3109 1334 -3401 643 3892
1006 3892 828 -3280 -759 1490 -1755 954 3847 -2187 -1220 4189 -1814 -5285 125 2588 447
1021 447 -1017 617 -317 -3157 1289 2572 -2920 1436 6796 -307 -2695 1778 -134 -2633 -161
1036 -161 1425 -1506 -2193 1746 -1729 -5988 2074 4124 -2725 1736 5758 91 -43 1912 -979 -1830
1052 -1830 2255 2741 -2874 -3871 1214 -1525 -5226 827 1494 -1426 2788 2610 -1695 -101 2087 932
1068 932 -1102 397 3809 -41 -2894 9 -1590 -2980 1766 986 -2626 -96 1763 -517 -2742
1083 -2742 -221 3079 418 804 3980 -778 -2043 3322 203 -3760 1263 2174 -2078 -2372 2 -1646
1099 -1646 -3330 903 2974 -1423 1755 4874 -1929 -2323 2866 -107 -1584 1816 299 -2541 -1664
1114 -1664 16 -1471 -2461 1801 2851 -1021 1197 2308 -1688 -645 1341 -507 308 1050 559 -966
1130 -966 -2603 -659 371 -1436 932 2343 -536 -21 783 -1089 -723 1167 1810 434 -453 1702
1146 1702 21 -3146 127 263 -2967 959 1865 -2542 -1206 1250 -834 -849 1834 2930 337 504
1162 504 2357 -1440 -2323 2503 -252 -2546 1215 -420 -2975 -711 -412 -1375 -147 1215 1508 252
1178 252 532 1453 -999 -278 1691 107 213 598 -1404 -1319 -1328 -1684 326 -308 -208 1758 155 -1269
1196 -1269 1127 574 89 1507 1677 1027 -141 73 228 -2271 -484 1779 -1434 -446 2020 -1644 -1807
1213 -1807 622 -1182 -565 1605 945 -865 -965 344 -190 -1583 847 941 -1048 1457 719 -2386 -270
1230 -270 -16 -1189 774 966 -70 547 -465 -318 214 83 1508 963 477 860 -521 -648 271 -875
1248 -875 580 1696 -701 185 599 -1576 -273 769 -1098 -145 469 -652 -1289 -1154 -742 -1672 -974
1265 -974 1692 528 -585 1270 -351 -1564 1874 687 -1119 1215 259 -928 -216 -443 -706 -248
1281 -248 1155 1534 149 402 1414 -1040 -167 1464 -468 514 1168 -890 -452 229 -879 67 28 191
1299 191 602 -201 -758 -1082 -1214 -179 -522 -867 200 -869 -1114 328 -894 -584 1618 389 539 1934
1317 1934 -223 -532 69 -99 299 489 945 420 -711 556 399 -1185 925 1321 -717 1161 1061
1334 1061 -1384 141 1066 -412 410 1514 632 -310 -520 -304 -1730 -1558 283 -1505 -1839 394 -1662
1351 -1662 -2242 103 -83 432 1948 1356 982 890 473 656 -638 -345 703 -367 -755 -383 -1212 -609
1369 -609 2 -194 1282 1357 967 1574 278 -29 1730 340 -456 1045 219 -1015 -557 -859 -1420 -1133
1387 -1133 333 51 -1917 -144 805 -2217 -595 1242 -780 105 2286 -90 -791 1104 516 -957
1403 -957 -371 1117 -48 -1751 410 -541 -2434 944 1329 -753 1676 2533 343 341 802 497 73 106
1421 106 523 -780 -1765 242 -1322 -1830 151 878 26 442 588 430 -140 -602 494 -476 -1009 958
1439 958 -629 -2643 97 571 -1298 -117 1447 800 -371 799 689 -1776 33 2530 -708 -1135
1455 -1135 2652 122 -1688 1061 579 -1340 743 1807 -989 -1748 611 353 -2375 214 1847 -714
1471 -714 460 2070 -956 -662 1562 50 -1170 -497 81 -967 -2275 -664 -224 -1241 976 1964
1487 1964 140 698 1855 577 -231 -203 951 66 -1512 191 68 -2326 -48 1325 -1315 211
1503 211 2388 76 -944 840 804 -1310 -199 1584 -366 -1554 1674 -57 -2388 1094 1440 -1961
1519 -1961 -114 1437 -1466 -1220 804 82 -1331 799 2190 -408 -484 2024 -226 -1533 1078 37
1535 37 -1324 211 -302 -1072 -755 287 1085 -71 530 1998 659 -154 676 -21 -942 -71 138 -727
1553 -727 -1202 -223 142 -1533 -400 1844 -130 -290 2124 174 -968 1085 694 -1002 -93 1461 -586
1570 -586 -1379 352 -154 -2262 286 1241 -1476 204 1866 -637 -691 1525 410 1 1129 1056 -412
1587 -412 -480 230 -947 -1592 99 -231 -1356 -25 47 -551 421 565 560 911 561 622 679 -663 67 166 -641
1608 -641 -207 89 -447 -551 -438 201 -426 -537 1310 370 -636 1381 545 -1030 947 985 -683 98
1626 98 540 -1053 -1124 -98 -210 -1164 207 1079 -743 71 1656 -317 -318 1321 -66 -653 697 -177
1644 -177 -1116 -437 -625 -666 -206 456 380 -215 684 398 -59 533 219 -246 483 -84 -875 228 -436 -867
1664 -867 224 -159 -320 700 245 -278 23 256 122 -177 489 505 -569 418 599 -1149 297 1092 -810
1683 -810 -273 369 -876 -631 340 -180 -71 453 769 277 107 670 -35 -428 801 -271 -715 602 -595
1702 -595 -1192 298 161 -363 509 526 119 408 247 -22 26 247 -35 -726 -187 -18 -822 38 275 -381
1722 -381 649 1074 -29 456 661 -516 -175 60 -318 -279 -307 -354 -799 -42 372 -161 250 1192 -271 -113
1742 -113 546 -553 -550 797 -185 -64 662 111 -389 -135 94 -438 -264 278 -91 -973 240 190 -592 787
1762 787 836 -124 1062 1137 -277 169 204 -543 -701 -549 -532 -592 -584 -29 -438 -275 695 198 700 994 -36
1783 -36 -177 69 -843 -364 -7 -798 -172 347 -41 328 149 93 90 55 770 -141 -320 598 -438 -721 795
1804 795 237 -253 941 335 -593 315 179 -650 -211 142 -129 -714 -47 319 -495 241 1205 -155 -71 676
1824 676 -666 -926 -444 -681 -778 -93 -86 403 281 593 867 408 612 579 86 -199 -641 -796 -430 -817 -350
1845 -350 439 -194 318 746 58 274 1012 12 -281 229 211 -415 -432 43 -457 -663 590 339 -832 419
1865 419 190 -1025 -45 495 -728 -334 289 15 -126 684 672 67 -36 1154 -232 -912 384 -489 -1142
1884 -1142 113 -24 -351 394 779 363 334 473 633 223 -3 215 -207 -572 -22 -413 -471 53 95 385
1904 385 -38 -11 648 -61 -242 472 -429 -506 418 -253 -702 101 195 -317 -325 535 280 -572 211 615 -752
1925 -752 -159 1046 -233 -325 658 20 -737 609 347 -501 -141 440 -363 -570 447 217 -463 256 761
1944 761 -337 183 537 -115 -344 229 -42 -168 -135 -150 -212 -599 252 -64 -392 267 518 -1 203 -23 218
1965 218 117 -144 541 167 -552 119 -2 -797 -72 327 -513 -183 524 74 -17 278 735 -98 105 676
1985 676 124 -501 423 -71 -1048 -24 261 -463 214 544 -97 -22 443 207 -395 217 582 -532 -320 350
2005 350 -225 -461 359 8 -66 111 88 152 -349 -172 190 -394 -138 492 -246 -117 406 85 -64 15 251
2026 251 69 -390 -29 188 -660 45 571 -226 242 775 109 -170 292 254 -270 -141 208 -463 -671 355
2046 355 -144 -625 395 694 -411 425 732 17 23 247 -38 -48 -172 -43 -353 -331 174 -227 -496 167 -93
2067 -93 -224 221 -54 -115 336 366 363 97 -232 190 58 -418 -129 88 -124 89 3 -18 -3 41 237 -23 -48
2090 -48 707 167 -469 463 138 -246 225 -110 -622 -139 -77 -228 -321 194 269 -248 194 543 -159 97 221
2111 221 -357 -58 211 -110 -235 28 -49 -200 -146 -2 243 38 393 370 -12 144 44 -77 18 -78 -67 -47
2133 -47 -77 -383 -129 -425 -159 257 -55 224 355 -42 32 173 46 180 -271 -102 -95 -347 -67 -316 -456 -13
2155 -13 58 -349 158 214 127 200 93 71 118 125 142 177 43 410 -51 -55 239 -9 -90 155 -187 -45 -56 -80 120
2180 120 164 179 294 -55 126 319 -102 20 139 -122 -22 -43 -298 -105 -23 227 227 180 -48 327 42 -111
2202 -111 95 136 -78 79 -64 28 -288 -85 315 -195 255 564 -205 82 289 -159 134 296 -36 -37 201
2223 201 -29 -124 -58 -66 -147 -145 66 135 -115 90 -54 -243 -71 90 151 187 111 44 31 -133 44 181 -52 171
2247 171 152 -257 86 -272 227 143 43 167 118 -115 176 -88 -221 -65 -79 -97 246 83 -108 -85 -114 -106 -43
2270 -43 68 224 -117 -244 252 40 -89 62 -29 -162 143 -184 -57 -106 108 212 -78 -11 328 -189 37
2291 37 131 -279 -85 156 -178 -28 59 14 -68 -44 -43 218 -197 335 59 5 79 -50 -65 -4 35 -74 -112 25 -231
2316 -231 177 -130 34 138 -101 108 88 -145 201 189 -177 1 310 81 -24 -282 70 -210 -269 33 -230
2337 -230 -235 85 12 -5 242 356 7 164 146 73 -289 -268 -142 -364 -219 -87 -81 -307 -26 -14 -116 50 83 168
2361 168 156 69 129 -214 -137 405 77 -51 -6 245 -79 111 82 37 -142 120 -220 -269 -164 87 127 122 334 -50
2385 -50 -22 42 48 -20 15 52 -129 157 -36 -99 32 87 205 0 207 124 -17 -29 -100 -182 -225 -115 -91 77 -45
2410 -45 147 93 63 335 67 -158 -9 164 80 -1 93 -111 -158 -147 104 -23 -54 175 4 -191 336 -6 -210
2433 -210 -38 -132 139 107 107 37 65 140 40 77 -121 -24 -38 -115 24 16 93 -26 127 -81 -170 -22 -10 99 -84
2458 -84 7 -56 -241 291 -155 -47 90 85 -208 126 114 101 -142 76 -49 -326 75 278 38 -24 254 33 -109
2481 -109 21 248 -276 60 24 226 -358 -141 91 -240 20 41 -78 229 192 6 -114 42 204 -28 -69
2502 -69 200 137 -89 -184 -197 -144 -66 40 -131 -2 -7 234 -7 78 228 -87 12 -9 106 89 -157 47 -185 -124
2526 -124 -68 -48 -159 -91 -69 46 -60 194 -65 74 69 150 96 -7 251 -20 -35 -84 -188 -171 -16 60 65 14 302
2551 302 93 -218 132 77 -59 -304 288 175 -50 -57 96 -53 -89 3 -73 -63 140 -227 -57 28 -39 -144 -122
2574 -122 -280 -12 131 -37 201 -74 -66 53 -86 75 201 -113 184 -142 122 -20 84 -118 -135 40 -107
2595 -107 49 -54 141 -30 65 47 33 -51 -71 -84 -68 163 -67 -172 26 67 -187 -25 105 -71 -83 -24 -207
2618 -207 210 -245 98 -37 -239 -43 -59 -5 -78 -35 -112 -59 -36 82 -186 29 96 35 1 41 43 -30 -86 122 53
2643 53 80 -74 -8 -199 141 0 -13 1 -213 -202 -59 16 -328 173 18 -122 -56 69 -100 -140 -91 25 61 115
2667 115 68 -181 -29 86 4 -62 -51 81 -81 148 -66 -81 42 22 -128 -111 -21 28 149 -248 -32 -46 87
2690 87 -215 24 62 -65 -261 -107 159 -20 -190 -71 33 172 -234 -121 -36 -136 -296 -136 -110 -130 -172 -70
2712 -70 89 -122 66 18 -43 82 111 -41 -24 -28 -148 -206 -95 -80 84 -53 -63 262 -109 145 56 131 23 -76
2736 -76 -199 -20 23 -110 163 157 117 -84 -31 -104 -26 -33 -58 46 61 -31 137 197 -43 -169 -102 16 -198 193 234
2761 234 -79 20 -15 55 -151 38 -128 14 -132 61 -66 6 277 64 -98 -20 46 152 104 -248 26 25 -104
2784 -104 -25 157 85 -148 -115 69 76 -161 85 228 -82 -16 -120 -192 -28 112 -41 -72 -35 -133 -22 97 85 258
2808 258 -28 66 -32 24 110 257 111 83 -81 -212 -4 -172 100 39 -116 -52 164 -90 -24 177 -118 173 133
2831 133 -18 -11 -34 -188 -66 93 -92 -142 25 61 -280 -107 -108 -34 36 -218 55 20 -137 -65 -56 -187 -69 -13 166
2856 166 -36 183 174 -41 83 -93 -332 26 -93 107 7 37 108 -280 14 -86 47 -4 75 212 -67 125
2878 125 -4 -63 -150 3 111 -70 -65 187 -130 43 152 -181 1 -67 57 -117 -234 -334 258 -155 85 80
2900 80 -140 123 148 -97 109 -56 -123 -101 10 12 -168 87 48 -56 -160 69 -41 -200 -14 37 95 73 17 -20
2924 -20 -18 -72 252 118 -241 -230 183 41 -4 -82 -116 -124 31 -65 1 -233 -173 140 -256 169 57 -215 48 -11 -336
2949 -336 92 122 -224 -19 94 -86 -65 78 94 112 -87 32 -1 -246 -48 -36 -275 -71 -134 -46 -157 215 -147
2972 -147 228 -144 -68 -160 -273 90 -82 -38 37 42 64 179 -152 -12 85 -299 -6 -239 129 120 51 -9 200 27
2996 27 86 1 75 -159 -107 38 -31 -61 127 162 59 -87 145 -221 -7 70 122 -219 99 43 2 39 90 -84 -164
3021 -164 145 -70 28 216 -13 -298 -213 206 136 -98 23 180 53 162 181 35 -56 218 -1 79 23 -20 52
3044 52 114 52 69 33 95 88 -95 245 203 -176 -42 -149 -143 64 226 38 -121 167 184 231 -140 3 41 -197 25
3069 25 19 -59 82 -42 58 90 122 48 37 -226 -34 307 -82 224 181 -188 -39 86 -230 -249 -57 -26 97 -182
3093 -182 174 67 94 -13 -136 -108 37 49 -197 224 -60 -24 89 136 -191 103 60 -19 -77 -252 14 375 84
3116 84 -207 111 -46 -247 -142 -33 -29 -120 72 141 25 187 -105 -140 -90 232 -344 134 299 69 287 -40
3138 -40 215 -164 -112 -11 -239 -80 59 -22 120 -87 -35 -10 -37 141 200 -214 141 -33 -66 -71 153 -83 5 91
3162 91 -19 83 240 65 38 31 168 114 -7 -13 -80 -4 -14 -7 -175 -85 -62 141 -94 148 100 -131 -53 -58 110 5
3188 5 -53 21 -123 -115 16 33 -25 -147 -16 93 -169 117 -35 -156 -38 9 -323 58 -165 -248 -5 -23 56 -1
3212 -1 -59 96 104 -32 103 104 -105 179 -113 69 -23 -82 -97 44 64 -72 87 -208 -32 -76 -246 -33 64 -187
3236 -187 207 116 -143 -14 83 -19 78 7 -73 112 -133 40 -184 -152 132 -53 -228 268 89 -114 62 80
3258 80 12 93 -135 237 -29 -110 353 -112 -17 102 -205 -30 -258 136 108 -117 -25 87 174 147 270 -61 -68 49
3282 49 -25 -197 103 73 -57 15 -124 -22 -134 7 -51 -158 179 277 -215 159 -109 47 82 98 50 63 115 98
3306 98 -235 -216 145 44 0 160 8 -154 75 -279 -215 -40 27 -2 -24 -126 -7 -263 -88 35 -162 -62
3328 -62 179 124 -130 125 -113 102 -40 147 44 6 25 138 -25 -75 49 59 -178 -35 59 86 -74 11 53
3351 53 -84 -91 -20 -105 74 103 -35 -69 -15 -254 -254 231 12 49 15 193 -16 -113 104 -22 5 268 100 -76 52
3376 52 -75 -150 162 2 -34 -51 62 141 51 31 -98 62 -89 -49 178 -93 -58 48 32 -39 108 119 -7 -112
3400 -112 177 34 -48 -173 -63 -41 3 109 188 -80 63 -26 144 -46 305 -24 -145 143 -139 92 -62 -152
3422 -152 -105 -134 -135 -205 -144 -74 86 -76 -28 180 -276 -14 -39 -86 -89 59 3 -43 -183 73 13 -44 176 47 -9 11
3448 11 12 -45 -3 179 -72 -157 202 -239 -52 -86 49 1 -116 5 105 88 94 -17 -274 18 48 -134 -14 78
3472 78 187 -191 -143 86 75 -107 -72 -139 -99 126 154 -14 25 13 -123 -69 -61 142 -76 -23 -18 -31 -128 124 -205 -126
3498 -126 5 195 55 8 79 112 -48 -14 235 -130 -50 116 61 -187 26 -53 -10 11 34 107 42 -262 92 -180
3522 -180 25 143 91 -87 41 -166 73 -82 -80 39 198 -100 36 -133 24 160 -333 -29 149 -17 22
3543 22 32 81 83 15 102 -66 70 43 5 32 39 -20 -97 18 44 -326 -55 -124 -49 -217 22 -138 20 -114 -70 -53
3569 -53 -158 52 -39 95 169 -53 18 12 -176 37 -80 -230 14 112 -139 221 -134 78 125 15 21 76 39 -72
3593 -72 -67 -73 -53 -115 -29 166 -203 1 10 -19 -130 17 85 -265 40 138 -144 -7 28 105 -113 -35 128 -131 200
3618 200 -60 -177 -57 175 40 184 208 39 177 291 -149 95 -57 181 2 -168 17 90 -67 -4 33
3639 33 136 -157 46 -221 -120 -59 131 -69 -241 78 -68 14 -179 -80 6 -125 -246 53 -88 -227 107 39
3661 39 -237 117 82 -7 4 75 -119 -139 -22 -70 -334 -166 110 -50 35 226 113 -289 124 -71 -290 -4 -140
3684 -140 -32 -18 85 -57 -48 0 -114 -139 192 50 -200 67 -33 -53 88 103 -78 -39 15 -70 100 -206 -100
3707 -100 82 136 51 -170 11 162 -43 -49 -29 -1 108 16 -167 254 -33 98 -45 152 42 -100 -44 -72 -111
3730 -111 121 236 -60 -108 7 134 -51 -85 194 -124 -44 -24 -71 -16 36 103 39 16 108 29 -83 154 43 18
3754 18 -86 140 45 -39 225 -25 -76 145 111 -83 -219 0 207 -21 -199 -275 7 101 -89 17 -132 149
3776 149 -151 172 -128 6 -162 47 -47 5 -138 156 104 -114 226 105 -2 -38 78 13 -76 124 0 -14
3798 -14 62 223 -266 -31 191 54 -10 -192 1 -101 130 29 -41 -35 127 40 -146 -40 -2 -191 -15 -96 -56
3821 -56 256 -28 -198 -3 17 47 -78 -57 30 -157 -244 -4 31 46 -39 199 21 34 -64 -18 36 195 -5 47 62
3846 62 -2 -71 -348 129 93 4 -29 -112 291 -162 162 4 -101 -71 81 58 -95 93 15 -103 -91 -32 -56 42 126
3871 126 150 -189 -48 -23 -192 -86 29 175 218 -89 -142 64 44 -131 -105 -170 -58 237 155 137 -9 -227 46
3894 46 -111 -218 26 -75 -56 152 -128 -78 141 -184 -128 -68 13 -210 50 -180 68 244 -13 -55 -60 199 21
3917 21 71 144 -83 56 18 124 317 -12 211 25 78 -236 27 -26 -85 -115 49 141 26 -242 62 -1 -7 178
3941 178 54 69 -24 -61 155 18 -28 98 -74 138 2 81 -39 54 344 295 49 35 119 64 -253 -138 164
3964 164 7 144 289 -64 40 -19 -54 207 4 231 -46 56 -356 -25 -76 17 -156 -51 -129 -85 191 87
3986 87 -56 19 -6 134 -65 -83 -75 45 132 184 44 4 -82 246 -60 50 112 -91 -66 -43 -58 167 56 -248 -73
4011 -73 -106 54 -108 147 106 105 -53 -30 -44 -30 20 185 15 -90 143 -14 52 -66 -88 -93 -286 36 -131 -186 99
4036 99 -37 -5 229 -35 112 101 228 -112 15 22 -76 136 134 253 196 -258 143 -152 61 -26 38 -32 147 43
4060 43 -153 -136 -27 -70 -133 -26 43 164 58 57 28 -117 110 5 -66 -142 43 -155 -262 163 -17 74 -55 125
4084 125 -54 -38 83 -155 -59 -142 -63 -57 -57 73 135 -125 42 -41 -185 -15 94 61 -141 31 -371 99 201 2
4108 2 -71 -100 16 201 -29 -62 28 -39 -46 37 -54 51 23 -8 117 213 -54 -50 -46 4 36 -68 129 -79 -97 55 104
4135 104 37 89 137 -35 -53 329 -131 6 -63 90 37 9 -12 26 -159 243 66 -138 133 -116 -310 76 -4
4158 -4 -76 -86 -8 119 168 -87 -410 -38 52 48 111 -45 204 -18 -118 -147 -32 -6 -236 -56 84 -253 -139 73
4182 73 41 -145 24 -128 -86 167 118 -59 -135 160 120 40 120 77 -161 35 -229 -118 -329 176 96 -74 -47 -1
4206 -1 19 -19 -76 -107 -63 -460 -27 24 -189 152 32 139 -96 118 -24 -49 -118 126 -128 92 32 -54 61 -108
4230 -108 46 318 22 -5 134 -64 -91 119 -146 177 136 -20 138 -72 -10 -76 -46 -119 -121 73 192 82 -4
4253 -4 -39 54 -55 54 -43 -224 15 60 44 29 -3 -4 34 -166 -58 -40 53 64 -153 -27 -64 -105 -5 15 68 173
4279 173 40 -38 287 -201 7 -61 -95 -73 -12 19 158 203 176 -112 50 -121 -178 -109 -15 111 -91 55 -79 39
4303 39 -103 161 147 -103 -76 249 -162 59 217 -111 -71 -55 113 -131 340 -18 -11 55 -1 50 -73 60 107 156
4327 156 42 93 94 136 -87 -268 -151 -213 -27 -143 -49 185 115 -109 62 57 -131 -118 -213 -9 -43 128 -10 13
4351 13 14 -31 -60 -4 30 32 6 -97 -94 135 -68 -114 -220 58 344 62 54 198 -21 71 54 161 141 6 49 199
4377 199 148 -144 123 -53 107 93 164 128 69 141 -143 -75 -111 25 -132 119 -60 -61 140 4 -20 193 42 -28
4401 -28 217 93 140 -74 -195 52 66 -165 35 -134 -202 -40 154 -83 -93 -94 182 -61 58 4 6 205 53
4424 53 9 -186 80 -155 -341 270 -38 63 195 -26 112 9 -12 -14 -124 -90 2 112 207 -95 -57 215 7
4447 7 -76 -17 -41 -31 83 19 -148 -323 85 -76 24 -77 -131 -104 -22 40 164 -3 1 -124 -94 -39 97 54 117 -165
4473 -165 -136 191 -103 -18 -296 -28 43 -83 -186 279 -2 17 19 -163 -159 -122 -25 74 -155 -125 -192 -68 182 -70
4497 -70 125 78 70 100 136 -31 51 -310 -170 85 -71 -187 95 199 3 111 -28 -61 -82 19 -102 191 -9
4520 -9 -160 -52 109 -21 73 54 -56 -9 3 -56 -228 91 -169 8 -156 1 48 -19 -89 -250 24 -73 0 216
4544 216 7 -31 -393 -101 28 -119 -90 -90 85 84 -59 -150 1 175 -83 0 179 47 -16 180 18 -35 8 41
4568 41 -46 -50 -35 106 -120 -229 -7 -41 -63 -21 -145 -156 117 -132 -150 -32 12 -59 -155 61 104 170 76 203 -142
4593 -142 -119 -34 -79 -81 -15 -1 154 42 -47 -1 -288 145 -95 -1 116 2 -11 -46 -40 -29 20 -85 121 87 -113 -68
4619 -68 48 -69 -104 -104 -391 -241 -31 -71 -210 -228 72 125 130 303 141 -21 17 42 78 105 144 78 62 -134 -93 61
4645 61 -64 -87 71 37 113 -44 -60 -185 49 110 159 2 -269 -17 303 -80 -31 -86 5 15 -124 -122 -5 183
4669 183 244 -210 51 -74 -53 -75 30 -53 106 49 122 39 -5 -26 -137 -58 -56 20 -90 35 -105 -73 2 5 75 100
4695 100 12 -66 51 134 91 -56 24 -157 -151 82 159 117 31 128 -17 -29 -130 13 63 -22 31 20 56 124 274 280 174
4722 174 -32 -299 14 115 -69 -13 -51 -76 93 -102 -40 -29 -62 -63 -218 4 202 120 -57 -198 -147 89 289
4745 289 -187 80 -23 58 100 47 -41 101 -154 180 11 -59 9 60 -87 55 -120 -181 -17 -10 130 26 -8 -78
4769 -78 -229 69 75 80 37 46 216 143 26 292 -36 0 227 -107 -15 -180 -79 -104 -56 -96 2 17 -19 10 41 -162
4795 -162 49 -9 75 -71 -196 43 -177 36 39 -18 -180 42 -143 -19 -23 -12 -100 92 185 3 -87 275 281 -75
4819 -75 -68 83 125 11 97 -178 -23 -61 66 -37 97 -102 18 -102 142 122 191 84 3 149 -44 47 6 -45
4843 -45 205 115 -7 -70 190 -213 -126 111 141 -3 244 29 17 -41 -220 -29 4 126 66 -83 -118 184 -15
4866 -15 243 153 -61 93 88 11 -46 -236 318 -32 -74 -78 -20 39 76 -180 -116 84 -59 38 -199 199 -125 150 -84
4891 -84 43 -112 -115 92 147 -3 -140 13 119 150 -8 35 -229 237 247 -13 -186 -62 32 132 214 28 19 116
4915 116 46 52 143 -4 169 36 -96 8 16 51 -30 -150 -35 166 -25 63 -86 -63 55 -4 59 -47 -59 23 52
4940 52 131 -73 56 244 -124 378 -47 -5 125 68 26 110 71 53 71 131 144 -129 -13 12 -26 -11 98 -140 14
4965 14 118 -92 -6 80 -140 3 39 -129 -104 33 -47 -190 2 69 11 2 -33 -41 77 -73 23 113 -70 -84 56
4990 56 139 -25 -14 -39 114 -146 -105 -175 44 -46 209 -6 -109 11 17 -127 -141 54 -145 18 -232 -21 16 180
5014 180 -109 -61 -164 -105 -134 -39 -41 -179 -137 75 -35 -47 -216 -11 -27 9 -78 150 -130 27 -42 15 29 -145 85
5039 85 -184 -41 -1 172 124 55 6 -31 -145 197 -9 -200 -107 -179 -40 184 -319 231 12 88 207 144 -9
5062 -9 146 -31 178 101 -14 46 108 95 -184 -111 84 -77 -74 403 129 -104 -88 -7 -90 167 180 -52 -112 156 -30
5087 -30 89 -71 200 214 -29 -28 108 -123 30 23 -139 58 -134 101 131 -159 -128 -71 -63 56 -200 130 -42 37
5111 37 -40 -106 -75 -106 -167 -47 41 29 -21 -21 -37 160 139 14 -207 117 -78 1 62 61 140 -128 23 99 6 33 5
5138 5 143 210 -95 14 36 89 -62 -25 134 -29 67 -149 -15 77 -62 -111 -107 15 -68 97 -75 88 44 -55 182
5163 182 13 60 -82 78 -148 -57 -129 -95 69 40 -94 265 -139 -56 -40 -69 142 63 51 1 -261 8 166 -60
5187 -60 114 -51 -27 94 -79 138 9 124 -68 39 -8 49 69 -30 -111 240 -289 -20 35 -202 130 -75 105
5210 105 -32 116 -23 -203 -189 -47 -88 -66 105 -4 -57 29 -73 118 -196 26 40 23 -105 68 180 144 21
5233 21 -89 -218 -12 40 6 124 9 26 -110 180 -24 -10 70 36 37 -96 -28 -10 80 98 -201 30 73 -191 -72
5258 -72 -8 -2 -84 -66 -50 29 50 -138 -89 -2 43 -100 -110 71 181 -115 109 -81 -239 -105 -173 4 61 -135 93
5283 93 -132 13 70 -85 174 201 -61 117 -20 -12 -130 -31 134 1 -232 -61 226 -169 46 -25 -130 182
5305 182 39 50 -18 106 39 -22 146 63 141 99 269 -60 78 -133 -86 -300 5 -159 -63 -49 -48 147 -86 9
5329 9 32 -50 101 62 -45 -265 4 -51 37 150 61 -113 -20 76 -75 86 -156 -47 -38 82 178 95 -19 -39 27
5354 27 -21 197 37 -102 137 -106 99 -97 185 171 -41 -242 176 97 54 175 -28 -17 132 -6 -12 -33 113
5377 113 108 49 155 44 -177 136 -5 54 9 54 -22 44 -10 177 -3 -134 142 -3 -41 -142 36 31 259 60
5401 60 -13 15 -66 -72 -50 -173 127 -166 -150 91 -33 56 157 -102 -45 -94 16 66 134 154 39 171 -75 83 -41
5426 -41 -107 10 63 -138 -13 55 -32 -106 -105 8 190 -31 20 -93 -108 59 105 -193 110 -224 -67 219 38 92
5450 92 75 5 -52 -130 84 11 -56 117 -38 12 179 3 -153 139 24 -213 -91 1 116 -55 -33 30 -87 -21
5474 -21 -20 32 136 70 74 70 26 -159 88 7 -88 98 -94 28 120 -1 -171 17 13 -3 50 -159 -56 -66 -50 -14 137
5501 137 -113 22 214 -6 71 87 -100 34 -60 144 -51 -92 63 58 -60 40 188 -213 -62 -101 -234 -146 -52
5524 -52 151 73 -115 318 125 41 -34 -29 -113 173 126 -5 -43 -64 149 116 55 -47 -104 70 -139 -121 0 90 89 189
5550 189 111 180 -110 105 -25 138 -84 -95 144 -144 93 136 -31 -145 -20 -137 -203 118 -66 42 -132 151
5572 151 194 -160 56 9 -231 -5 33 -35 -83 -15 11 -189 245 32 71 135 87 308 -313 14 -155 55 193
5595 193 154 -130 -110 146 -19 169 148 247 -78 -20 -95 -143 -135 27 61 -31 -124 -113 -264 -106 -186 -3 240 -53 88
5620 88 28 44 -59 35 -146 196 125 100 13 82 -108 40 157 208 -114 -83 128 -224 -80 -77 95 -48 -122 -90 121
5645 121 -62 78 -203 -48 32 77 -143 100 -127 -35 197 11 95 46 -15 -77 -227 -19 56 48 47 -83 -25 7 1
5670 1 24 -269 60 -69 203 31 -50 220 -93 88 157 -107 -58 -13 -5 -75 -24 63 224 131 85 112 234 -207 96
5695 96 298 -6 96 -62 235 64 31 51 150 129 -163 -153 -28 -160 178 -33 -108 -57 53 -7 43 -55 -89 31
5719 31 79 -27 126 -105 81 121 132 145 31 -11 147 6 14 85 -18 285 13 76 -21 -74 109 -132 -55 93
5743 93 -89 -117 -192 7 106 -8 -176 35 87 -16 204 -33 135 -72 -131 -81 3 -299 114 203 121 -5 118
5766 118 -37 3 -67 -60 47 144 64 24 -119 -39 -19 36 203 90 -135 -111 129 231 -98 -142 92 -264 89 208
5790 208 -66 -28 -136 -75 39 -15 -97 -7 -213 59 -91 113 -133 241 -82 -18 110 71 192 -232 -3 -78 14
5813 14 -43 176 -8 59 121 -343 -163 -137 -134 -87 86 19 173 -244 -27 -33 127 -13 -176 66 -84 94 -88 105
5837 105 -11 66 -23 81 113 -129 -73 -23 180 -63 199 -159 -77 152 -37 -92 -63 103 118 151 -33 -17 226 208
5861 208 -106 16 56 151 -26 1 -271 -75 10 -74 -201 -108 -139 -24 179 53 -45 -62 104 -58 41 -65 -140 11
5885 11 130 -53 103 52 43 -123 -136 -123 -140 -62 40 -57 -32 101 -85 -41 93 -169 93 -118 72 54 249 108
5909 108 224 24 -141 39 -121 49 279 10 53 30 -73 45 -30 -123 141 67 -201 70 68 -115 24 208
5931 208 69 66 -93 -152 -20 17 -234 -199 40 75 -4 73 -268 -155 68 84 -126 -77 -20 -87 51 16 27 -112 -51
5956 -51 60 270 -127 7 34 -31 -9 -74 86 88 190 -20 106 85 177 -69 -95 143 51 -142 146 -57 -107 -182
5980 -182 -138 121 68 275 215 -65 4 -49 -59 -6 103 33 51 -150 -191 48 4 179 -121 82 -81 177 -120 31
6004 31 47 50 -10 -272 -151 -11 125 429 12 -31 -130 71 -14 -47 -29 -56 -143 -287 -247 98 44 -154 -39 167 20
6029 20 97 57 108 79 -107 114 -130 -151 116 89 148 99 155 41 4 30 23 207 -21 -103 93 246 73 -120 -121 14
6055 14 31 -37 204 -190 22 113 -264 -64 -10 45 -140 -48 59 47 -20 -145 -208 -106 146 130 -207 -292 19 22 23
6080 23 -103 -49 151 -25 29 -63 111 28 19 -103 -28 -22 144 247 7 181 195 -81 18 293 -156 -79 -3 -79 153
6105 153 227 -150 91 -21 -74 -37 -147 35 212 -88 2 -74 -325 -228 -165 -84 13 -58 161 129 -123 -38 -152 -15
6129 -15 -17 -99 215 51 -22 -270 -138 103 272 -144 -9 75 -139 90 173 -43 -49 0 42 -34 -38 21 -74 190 -101
6154 -101 14 108 132 39 -227 46 199 -90 -119 -68 -117 -80 -112 -194 212 204 136 -18 -109 -39 -113 108 -110 140 -131
6179 -131 79 -146 5 -22 89 160 144 -129 -97 134 -40 148 42 -84 -137 -45 64 -37 95 168 -31 99
6201 99 31 70 -17 -46 -5 -5 -20 -193 61 88 -249 198 19 -88 -74 -7 -179 100 -158 -116 -58 -220 -78 -19 81
6226 81 -2 -1 -44 181 -135 183 101 24 -39 145 -103 203 32 -94 -99 -174 168 158 51 -73 41 4 -6 -35 6
6251 6 150 134 8 -36 -28 31 -88 4 23 -90 -10 76 -154 -82 31 49 103 167 230 -30 130 -1 -1 -23 45 -182 94
6278 94 12 83 -36 -57 -75 7 98 0 -120 -27 38 -111 -107 -149 6 -99 37 76 146 221 -41 -95 121 49 13 -125
6304 -125 -224 16 72 -41 56 78 -72 240 160 133 12 14 165 -146 53 -95 24 -23 -99 -53 -198 98 -191 3
6328 3 -209 83 50 -61 84 53 123 -51 183 29 57 -133 110 -3 -58 75 90 88 -158 181 -54 -16 -43 -279
6352 -279 12 -127 -58 179 -442 -110 80 -71 -36 -14 143 -30 -88 -169 -177 -134 46 -162 -106 -54 -8 -177 -139 97
6376 97 2 25 -218 389 91 -97 219 229 104 -60 -144 97 84 -200 -96 -136 -174 63 -61 -138 20 126 136
6399 136 -19 -34 164 -146 -30 -116 -100 -3 -48 -67 -160 195 -47 27 115 -42 -64 17 -126 210 9 -49 -76 -101 15
6424 15 -68 -41 4 15 -89 216 8 13 -129 -16 10 52 2 -51 174 -46 -47 225 99 85 105 -15 160 -8 -227
6449 -227 -226 -194 -99 -111 82 139 116 -13 23 60 1 -177 -15 -42 -164 193 198 100 -39 -43 -38 -19 142 -95 96 -67
6475 -67 200 -72 -110 66 45 99 -8 71 -212 -51 -74 77 52 102 -46 202 -17 -102 148 -247 -97 -88 -58 49
6499 49 -79 99 -179 1 147 27 16 160 -20 90 17 37 56 -184 34 104 -18 31 59 -190 121 -78 -32
6522 -32 -16 -74 7 261 -31 -61 -133 -181 -20 -80 94 -71 -173 74 -109 -47 74 77 -30 19 117 183 111 -15 -37
6547 -37 43 5 -278 43 132 -12 220 30 93 -131 -72 -35 -20 5 -265 -122 -18 163 -97 -103 104 -26 76 4
6571 4 -58 19 13 48 -68 -190 -132 -53 -145 121 230 36 18 116 -202 186 66 -112 71 59 -142 119 -37 -27 -1
6596 -1 126 -87 96 -122 -111 68 -23 -229 -34 0 -39 133 216 49 126 93 -92 -166 77 -185 23 -98 39
6619 39 150 -15 -58 66 -92 -126 180 56 28 -23 70 186 0 12 -53 -88 30 231 219 92 274 -68 -217
6642 -217 117 12 -100 87 -100 -162 -114 -48 168 -37 288 7 -19 48 33 -157 184 244 -154 13 240 86
6664 86 106 98 -134 70 -202 -229 86 -6 -13 -40 -205 94 -23 47 13 -112 18 9 -57 -7 -65 -130 -92 -8 -88 40 -91
6691 -91 177 -162 -83 -179 -105 31 53 -47 -68 113 93 -241 -2 -90 -20 -49 -88 7 -44 -169 -17 9 -50 100 -87
6716 -87 -190 -174 -49 36 -41 51 29 -76 51 59 10 -38 111 3 142 -45 -78 50 -60 150 -40 -17 165 115
6740 115 -201 135 -158 -127 159 183 44 -32 -109 -96 34 -26 -89 61 200 -136 -40 -42 103 -5 55 -19 89 -129
6764 -129 57 -95 4 -34 17 -130 -72 -3 28 8 -7 76 -72 341 -94 7 60 -5 136 -65 256 100 -20 -45
6788 -45 -140 99 -39 -102 -76 -133 19 140 5 -117 -11 -63 26 103 3 -3 303 6 139 -15 89 -55 -108 78
6812 78 134 -43 11 80 70 -8 -33 -2 22 -99 75 -192 -60 115 -111 145 203 -3 72 166 65 247 92 -4
6836 -4 -84 97 58 17 55 -129 -133 38 253 4 128 43 -49 -1 113 123 -55 52 -38 95 -64 42 -80 120
6860 120 98 19 91 95 -58 -16 -5 120 63 -101 -3 -33 104 -27 -54 -32 -43 -113 290 0 -35 -225 207 2 -105
6885 -105 -149 55 -207 -190 173 0 188 22 -84 49 33 -83 -101 -72 -141 -31 244 -134 -3 140 -28 -243
6907 -243 35 -174 -21 58 -116 -61 50 33 94 -3 -22 -141 -189 156 72 157 -118 59 -45 194 123 -61 -81 32
6931 32 29 -256 -97 152 72 138 33 -102 -86 26 152 -224 -153 -242 -4 35 -35 84 -79 148 6 16 25 74 129
6956 129 94 -4 -114 -31 -165 127 50 -122 -40 -36 180 60 102 -102 137 73 33 91 -83 217 82 104 18 -91
6980 -91 21 90 117 -96 -21 115 -126 -65 85 -127 177 146 48 30 84 -9 -73 -3 -19 228 -52 -74 127 -29 2
7005 2 21 7 4 -112 61 83 205 -9 -63 64 -70 19 67 38 -182 -208 -23 -128 -116 158 -59 68 137 -241 100
7030 100 219 18 -54 77 14 -94 -36 52 -10 132 2 186 36 87 -49 85 -37 188 54 -17 80 31 39 -51
7054 -51 101 110 79 -151 -233 -179 165 237 -82 -321 35 95 108 -2 -2 -225 -5 45 94 58 76 125 -133 35 167
7079 167 154 -10 113 -88 74 -98 -76 -26 -58 22 15 241 54 -119 106 41 -23 -86 -61 80 -19 -75 -101 -132 183
7104 183 67 -45 -44 -100 173 50 144 -75 195 159 -40 -100 -117 -140 112 -140 5 -22 143 -41 129 182 56
7127 56 151 -47 48 -62 37 0 -38 -82 39 1 118 -136 235 -20 148 -18 -12 -6 -21 -18 -51 -111 -123 -40 -65 -1 -155
7154 -155 20 -73 28 -61 195 -74 -5 -33 -65 -66 169 -3 4 150 5 126 185 77 114 65 -63 -118 73 -5 -241
7179 -241 -55 154 -12 24 -27 -35 66 -148 97 -21 18 -301 82 63 -94 129 38 150 74 156 21 154 39
7202 39 41 -166 -197 -216 255 39 -158 -59 -191 42 -24 -121 135 -5 54 -14 106 162 43 -66 -61 -62 33 -208 90
7227 90 -50 44 142 85 -46 -126 -81 -21 94 3 -48 -56 200 140 -95 21 -14 -16 20 104 -17 -139 6 -167 -20 -35
7253 -35 -206 27 32 4 46 259 -66 109 89 9 55 -12 -208 43 -41 67 -246 -118 -2 53 -98 135 -5 105
7277 105 31 -74 -93 18 -119 -166 88 -38 -17 -105 -57 -175 -11 -120 310 16 71 -67 93 131 36 20 -3 -40
7301 -40 -30 148 38 -171 73 -20 114 -30 158 -97 168 58 79 21 -177 27 -33 128 122 -2 233 52 -11
7324 -11 121 -8 -37 20 100 29 319 -87 -126 86 186 6 -73 -7 216 -177 196 -47 105 8 110 29 -3 140
7348 140 -121 -41 60 24 -186 36 182 116 -10 67 102 172 161 -98 -180 -78 -85 -97 206 36 -41 57 44 -23 103
7373 103 -82 -173 -50 -54 -171 32 -205 -159 20 58 227 95 51 22 -6 -137 65 51 -57 235 -81 22 -82
7396 -82 140 -138 -140 193 -103 126 -1 77 35 -123 101 17 23 69 113 203 -144 169 -42 20 -123 7 -16 -14 -27
7421 -27 -38 -98 -274 -144 79 147 118 211 20 111 -131 -12 27 -32 -117 133 38 57 -53 73 48 68 -1 -11 -100 -45
7447 -45 96 -79 161 155 80 30 -4 0 56 -173 11 82 -91 17 -47 4 115 -35 -1 -50 101 34 -211 -151 119
7472 119 168 -123 -132 109 -69 226 -19 -12 -4 17 -97 -57 67 166 36 74 -151 -156 165 180 -28 75 106 147 33
7497 33 -86 109 -37 -95 -24 -105 -206 -82 72 -42 -129 -40 7 33 66 -105 82 225 -75 94 147 -32 89
7520 89 64 -1 -159 -158 -39 155 36 -73 -56 -61 90 -194 -18 14 94 88 -65 -77 99 56 72 -13 -193 7 27 -25
7546 -25 7 22 81 -157 -171 -49 216 57 -111 17 -236 -81 60 78 170 -216 294 -91 116 121 -36 31 33 78
7570 78 -91 211 147 61 90 130 9 -108 159 -123 77 -137 -41 19 59 -226 161 11 168 98 -124 1 57
7593 57 -96 -68 133 -19 -63 137 -6 -121 24 81 -103 95 196 -56 26 -45 -172 27 103 -39 9 45 -98
7616 -98 -22 -26 70 -71 72 -72 82 75 309 -30 73 129 179 3 58 -193 -2 62 176 71 -51 43 -6 -14 -56
7641 -56 65 143 117 -90 85 8 -13 -72 232 98 -21 -125 154 -199 -53 178 -163 -110 83 98 -23 -110 23
7664 23 177 -43 -138 -109 28 -149 -218 -32 -186 56 16 54 -93 -145 -42 207 120 27 123 31 245 10 221 252
7688 252 -21 -66 -141 -107 10 56 -50 -29 72 -224 -87 118 -59 201 -107 -85 -40 -90 113 33 136 -58 -9
7711 -9 33 10 -92 -70 -19 -17 28 156 -82 -145 73 74 49 97 -50 21 -35 98 -17 33 177 -108 -172 155 -15 185
7737 185 150 45 172 26 -7 145 43 -93 9 108 102 -51 21 58 -39 197 -62 -57 23 -123 124 -162 -3 -142
7761 -142 -69 -13 127 114 34 -7 -77 -116 91 77 -249 -265 53 -66 -70 -207 -16 -2 0 -18 -135 81 98 -175 -116 1
7787 1 -31 -57 109 -6 84 53 25 161 184 -49 107 -107 -9 -105 -4 82 126 133 -75 -24 128 -35 1 -73 -30 191
7813 191 131 48 201 -46 -204 2 -184 -17 -65 -133 -279 -88 -95 65 18 147 127 81 -19 -128 102 -274 -260
7836 -260 36 56 58 -263 166 10 -114 -41 102 98 -115 -23 96 22 -137 -137 -84 5 112 -50 155 -6 59 -108
7860 -108 -88 122 -43 77 61 -96 -64 -49 -93 -154 -129 17 -224 -149 37 397 -167 74 -37 30 150 94 31 -17
7884 -17 -48 -50 11 -37 115 71 -24 -144 107 212 45 -174 -41 117 74 -60 -10 73 -79 109 48 19 54 -138 -74
7909 -74 52 -152 47 -24 -54 56 -95 -136 161 83 -272 -49 101 81 256 60 109 242 18 -164 -160 -9 156
7932 156 24 -19 68 -212 150 -40 55 -38 141 -42 -47 -3 -4 6 228 2 -32 -48 -2 -107 -184 182 119 -45 -179
7957 -179 -47 -147 -235 -65 110 -64 -45 41 -66 74 252 -116 -2 -2 -82 -220 74 -35 13 166 -17 142
7979 142 72 63 -52 -44 -138 232 -150 215 140 -158 -66 -96 64 121 -4 -166 32 -222 -7 19 23 41 30 179 102
8004 102 6 135 117 165 -78 214 -75 99 43 77 -161 136 57 113 -61 126 70 69 27 -3 -52 34 -53 -10 92
8029 92 -44 -141 46 68 -134 87 -22 -13 -178 139 -31 123 85 80 -66 -146 24 43 87 -250 16 215 31 57
8053 57 39 -81 -65 46 6 72 177 83 262 102 -2 -94 162 -73 -135 69 -73 -39 39 -4 69 118 -56 40 245
8078 245 47 -267 6 -162 85 147 48 105 -49 30 173 -12 15 -74 6 -25 315 110 -115 -112 -189 -59 -131 -58
8102 -58 -15 3 -14 10 50 -150 90 -93 22 -117 20 -140 82 -131 -179 12 128 104 -131 71 -2 -46 8 -70
8126 -70 127 4 -2 96 86 -125 -102 70 74 -16 -87 -86 -105 -93 -66 24 186 5 53 53 -119 212 63 -98 200 -158
8152 -158 -26 58 -172 -148 85 163 -43 -82 142 -54 114 -141 -154 -6 -31 -32 -53 -40 -136 -29 50 -22 -84 127 212
8177 212 -2 5 279 -196 -26 -73 93 46 -81 4 -15 -109 113 -43
8191d3
##END NTUPLES=NMR FID
##END=
